1. 1.48 s $ /nix/store/9ypz3flqsrl5xl495mm8h645gadjsxi1-coreutils-9.11/bin/timeout --kill-after=15s 7200s /nix/store/23zk8sgzamrbmj1fday15szf7f2279s8-nix-2.34.7/bin/nix --extra-experimental-features nix-command --extra-experimental-features flakes flake clone git+https://github.com/alphal00p/gammaloop --dest /tmp/nix-ci-worker/stable-pwd/repo/
  2. 2.50 s Cloning into '/tmp/nix-ci-worker/stable-pwd/repo'...
  3. 2.50 s remote: Enumerating objects: 65431, done.
  4. 2.50 s remote: Counting objects: 0% (1/8082) remote: Counting objects: 1% (81/8082) remote: Counting objects: 2% (162/8082) remote: Counting objects: 3% (243/8082) remote: Counting objects: 4% (324/8082) remote: Counting objects: 5% (405/8082) remote: Counting objects: 6% (485/8082) remote: Counting objects: 7% (566/8082) remote: Counting objects: 8% (647/8082) remote: Counting objects: 9% (728/8082) remote: Counting objects: 10% (809/8082) remote: Counting objects: 11% (890/8082) remote: Counting objects: 12% (970/8082) remote: Counting objects: 13% (1051/8082) remote: Counting objects: 14% (1132/8082) remote: Counting objects: 15% (1213/8082) remote: Counting objects: 16% (1294/8082) remote: Counting objects: 17% (1374/8082) remote: Counting objects: 18% (1455/8082) remote: Counting objects: 19% (1536/8082) remote: Counting objects: 20% (1617/8082) remote: Counting objects: 21% (1698/8082) remote: Counting objects: 22% (1779/8082) remote: Counting objects: 23% (1859/8082) remote: Counting objects: 24% (1940/8082) remote: Counting objects: 25% (2021/8082) remote: Counting objects: 26% (2102/8082) remote: Counting objects: 27% (2183/8082) remote: Counting objects: 28% (2263/8082) remote: Counting objects: 29% (2344/8082) remote: Counting objects: 30% (2425/8082) remote: Counting objects: 31% (2506/8082) remote: Counting objects: 32% (2587/8082) remote: Counting objects: 33% (2668/8082) remote: Counting objects: 34% (2748/8082) remote: Counting objects: 35% (2829/8082) remote: Counting objects: 36% (2910/8082) remote: Counting objects: 37% (2991/8082) remote: Counting objects: 38% (3072/8082) remote: Counting objects: 39% (3152/8082) remote: Counting objects: 40% (3233/8082) remote: Counting objects: 41% (3314/8082) remote: Counting objects: 42% (3395/8082) remote: Counting objects: 43% (3476/8082) remote: Counting objects: 44% (3557/8082) remote: Counting objects: 45% (3637/8082) remote: Counting objects: 46% (3718/8082) remote: Counting objects: 47% (3799/8082) remote: Counting objects: 48% (3880/8082) remote: Counting objects: 49% (3961/8082) remote: Counting objects: 50% (4041/8082) remote: Counting objects: 51% (4122/8082) remote: Counting objects: 52% (4203/8082) remote: Counting objects: 53% (4284/8082) remote: Counting objects: 54% (4365/8082) remote: Counting objects: 55% (4446/8082) remote: Counting objects: 56% (4526/8082) remote: Counting objects: 57% (4607/8082) remote: Counting objects: 58% (4688/8082) remote: Counting objects: 59% (4769/8082) remote: Counting objects: 60% (4850/8082) remote: Counting objects: 61% (4931/8082) remote: Counting objects: 62% (5011/8082) remote: Counting objects: 63% (5092/8082) remote: Counting objects: 64% (5173/8082) remote: Counting objects: 65% (5254/8082) remote: Counting objects: 66% (5335/8082) remote: Counting objects: 67% (5415/8082) remote: Counting objects: 68% (5496/8082) remote: Counting objects: 69% (5577/8082) remote: Counting objects: 70% (5658/8082) remote: Counting objects: 71% (5739/8082) remote: Counting objects: 72% (5820/8082) remote: Counting objects: 73% (5900/8082) remote: Counting objects: 74% (5981/8082) remote: Counting objects: 75% (6062/8082) remote: Counting objects: 76% (6143/8082) remote: Counting objects: 77% (6224/8082) remote: Counting objects: 78% (6304/8082) remote: Counting objects: 79% (6385/8082) remote: Counting objects: 80% (6466/8082) remote: Counting objects: 81% (6547/8082) remote: Counting objects: 82% (6628/8082) remote: Counting objects: 83% (6709/8082) remote: Counting objects: 84% (6789/8082) remote: Counting objects: 85% (6870/8082) remote: Counting objects: 86% (6951/8082) remote: Counting objects: 87% (7032/8082) remote: Counting objects: 88% (7113/8082) remote: Counting objects: 89% (7193/8082) remote: Counting objects: 90% (7274/8082) remote: Counting objects: 91% (7355/8082) remote: Counting objects: 92% (7436/8082) remote: Counting objects: 93% (7517/8082) remote: Counting objects: 94% (7598/8082) remote: Counting objects: 95% (7678/8082) remote: Counting objects: 96% (7759/8082) remote: Counting objects: 97% (7840/8082) remote: Counting objects: 98% (7921/8082) remote: Counting objects: 99% (8002/8082) remote: Counting objects: 100% (8082/8082) remote: Counting objects: 100% (8082/8082), done.
  5. 2.50 s remote: Compressing objects: 0% (1/1721) remote: Compressing objects: 1% (18/1721) remote: Compressing objects: 2% (35/1721) remote: Compressing objects: 3% (52/1721) remote: Compressing objects: 4% (69/1721) remote: Compressing objects: 5% (87/1721) remote: Compressing objects: 6% (104/1721) remote: Compressing objects: 7% (121/1721) remote: Compressing objects: 8% (138/1721) remote: Compressing objects: 9% (155/1721) remote: Compressing objects: 10% (173/1721) remote: Compressing objects: 11% (190/1721) remote: Compressing objects: 12% (207/1721) remote: Compressing objects: 13% (224/1721) remote: Compressing objects: 14% (241/1721) remote: Compressing objects: 15% (259/1721) remote: Compressing objects: 16% (276/1721) remote: Compressing objects: 17% (293/1721) remote: Compressing objects: 18% (310/1721) remote: Compressing objects: 18% (311/1721) remote: Compressing objects: 19% (327/1721) remote: Compressing objects: 20% (345/1721) remote: Compressing objects: 21% (362/1721) remote: Compressing objects: 22% (379/1721) remote: Compressing objects: 23% (396/1721) remote: Compressing objects: 24% (414/1721) remote: Compressing objects: 25% (431/1721) remote: Compressing objects: 26% (448/1721) remote: Compressing objects: 27% (465/1721) remote: Compressing objects: 28% (482/1721) remote: Compressing objects: 29% (500/1721) remote: Compressing objects: 30% (517/1721) remote: Compressing objects: 31% (534/1721) remote: Compressing objects: 32% (551/1721) remote: Compressing objects: 33% (568/1721) remote: Compressing objects: 34% (586/1721) remote: Compressing objects: 35% (603/1721) remote: Compressing objects: 36% (620/1721) remote: Compressing objects: 37% (637/1721) remote: Compressing objects: 38% (654/1721) remote: Compressing objects: 39% (672/1721) remote: Compressing objects: 40% (689/1721) remote: Compressing objects: 41% (706/1721) remote: Compressing objects: 42% (723/1721) remote: Compressing objects: 43% (741/1721) remote: Compressing objects: 44% (758/1721) remote: Compressing objects: 45% (775/1721) remote: Compressing objects: 46% (792/1721) remote: Compressing objects: 47% (809/1721) remote: Compressing objects: 48% (827/1721) remote: Compressing objects: 49% (844/1721) remote: Compressing objects: 50% (861/1721) remote: Compressing objects: 51% (878/1721) remote: Compressing objects: 52% (895/1721) remote: Compressing objects: 53% (913/1721) remote: Compressing objects: 54% (930/1721) remote: Compressing objects: 55% (947/1721) remote: Compressing objects: 56% (964/1721) remote: Compressing objects: 57% (981/1721) remote: Compressing objects: 58% (999/1721) remote: Compressing objects: 59% (1016/1721) remote: Compressing objects: 60% (1033/1721) remote: Compressing objects: 61% (1050/1721) remote: Compressing objects: 62% (1068/1721) remote: Compressing objects: 63% (1085/1721) remote: Compressing objects: 64% (1102/1721) remote: Compressing objects: 65% (1119/1721) remote: Compressing objects: 66% (1136/1721) remote: Compressing objects: 67% (1154/1721) remote: Compressing objects: 68% (1171/1721) remote: Compressing objects: 69% (1188/1721) remote: Compressing objects: 70% (1205/1721) remote: Compressing objects: 71% (1222/1721) remote: Compressing objects: 72% (1240/1721) remote: Compressing objects: 73% (1257/1721) remote: Compressing objects: 74% (1274/1721) remote: Compressing objects: 75% (1291/1721) remote: Compressing objects: 76% (1308/1721) remote: Compressing objects: 77% (1326/1721) remote: Compressing objects: 78% (1343/1721) remote: Compressing objects: 79% (1360/1721) remote: Compressing objects: 80% (1377/1721) remote: Compressing objects: 81% (1395/1721) remote: Compressing objects: 82% (1412/1721) remote: Compressing objects: 83% (1429/1721) remote: Compressing objects: 84% (1446/1721) remote: Compressing objects: 85% (1463/1721) remote: Compressing objects: 86% (1481/1721) remote: Compressing objects: 87% (1498/1721) remote: Compressing objects: 88% (1515/1721) remote: Compressing objects: 89% (1532/1721) remote: Compressing objects: 90% (1549/1721) remote: Compressing objects: 91% (1567/1721) remote: Compressing objects: 92% (1584/1721) remote: Compressing objects: 93% (1601/1721) remote: Compressing objects: 94% (1618/1721) remote: Compressing objects: 95% (1635/1721) remote: Compressing objects: 96% (1653/1721) remote: Compressing objects: 97% (1670/1721) remote: Compressing objects: 98% (1687/1721) remote: Compressing objects: 99% (1704/1721) remote: Compressing objects: 100% (1721/1721) remote: Compressing objects: 100% (1721/1721), done.
  6. 5.09 s Receiving objects: 0% (1/65431) Receiving objects: 1% (655/65431) Receiving objects: 2% (1309/65431) Receiving objects: 3% (1963/65431) Receiving objects: 4% (2618/65431) Receiving objects: 5% (3272/65431) Receiving objects: 6% (3926/65431) Receiving objects: 7% (4581/65431) Receiving objects: 8% (5235/65431) Receiving objects: 9% (5889/65431) Receiving objects: 10% (6544/65431) Receiving objects: 11% (7198/65431) Receiving objects: 12% (7852/65431), 17.12 MiB | 34.22 MiB/s Receiving objects: 13% (8507/65431), 17.12 MiB | 34.22 MiB/s Receiving objects: 14% (9161/65431), 17.12 MiB | 34.22 MiB/s Receiving objects: 15% (9815/65431), 17.12 MiB | 34.22 MiB/s Receiving objects: 16% (10469/65431), 17.12 MiB | 34.22 MiB/s Receiving objects: 17% (11124/65431), 17.12 MiB | 34.22 MiB/s Receiving objects: 18% (11778/65431), 17.12 MiB | 34.22 MiB/s Receiving objects: 19% (12432/65431), 17.12 MiB | 34.22 MiB/s Receiving objects: 20% (13087/65431), 17.12 MiB | 34.22 MiB/s Receiving objects: 21% (13741/65431), 17.12 MiB | 34.22 MiB/s Receiving objects: 22% (14395/65431), 17.12 MiB | 34.22 MiB/s Receiving objects: 23% (15050/65431), 17.12 MiB | 34.22 MiB/s Receiving objects: 24% (15704/65431), 17.12 MiB | 34.22 MiB/s Receiving objects: 25% (16358/65431), 17.12 MiB | 34.22 MiB/s Receiving objects: 26% (17013/65431), 17.12 MiB | 34.22 MiB/s Receiving objects: 27% (17667/65431), 17.12 MiB | 34.22 MiB/s Receiving objects: 28% (18321/65431), 17.12 MiB | 34.22 MiB/s Receiving objects: 29% (18975/65431), 17.12 MiB | 34.22 MiB/s Receiving objects: 30% (19630/65431), 17.12 MiB | 34.22 MiB/s Receiving objects: 31% (20284/65431), 17.12 MiB | 34.22 MiB/s Receiving objects: 32% (20938/65431), 17.12 MiB | 34.22 MiB/s Receiving objects: 33% (21593/65431), 17.12 MiB | 34.22 MiB/s Receiving objects: 34% (22247/65431), 17.12 MiB | 34.22 MiB/s Receiving objects: 35% (22901/65431), 17.12 MiB | 34.22 MiB/s Receiving objects: 36% (23556/65431), 17.12 MiB | 34.22 MiB/s Receiving objects: 37% (24210/65431), 17.12 MiB | 34.22 MiB/s Receiving objects: 38% (24864/65431), 17.12 MiB | 34.22 MiB/s Receiving objects: 39% (25519/65431), 17.12 MiB | 34.22 MiB/s Receiving objects: 40% (26173/65431), 17.12 MiB | 34.22 MiB/s Receiving objects: 41% (26827/65431), 17.12 MiB | 34.22 MiB/s Receiving objects: 42% (27482/65431), 17.12 MiB | 34.22 MiB/s Receiving objects: 43% (28136/65431), 17.12 MiB | 34.22 MiB/s Receiving objects: 44% (28790/65431), 17.12 MiB | 34.22 MiB/s Receiving objects: 45% (29444/65431), 17.12 MiB | 34.22 MiB/s Receiving objects: 46% (30099/65431), 17.12 MiB | 34.22 MiB/s Receiving objects: 47% (30753/65431), 17.12 MiB | 34.22 MiB/s Receiving objects: 48% (31407/65431), 17.12 MiB | 34.22 MiB/s Receiving objects: 49% (32062/65431), 17.12 MiB | 34.22 MiB/s Receiving objects: 50% (32716/65431), 17.12 MiB | 34.22 MiB/s Receiving objects: 51% (33370/65431), 17.12 MiB | 34.22 MiB/s Receiving objects: 52% (34025/65431), 17.12 MiB | 34.22 MiB/s Receiving objects: 53% (34679/65431), 17.12 MiB | 34.22 MiB/s Receiving objects: 53% (35027/65431), 17.12 MiB | 34.22 MiB/s Receiving objects: 54% (35333/65431), 34.82 MiB | 34.81 MiB/s Receiving objects: 55% (35988/65431), 34.82 MiB | 34.81 MiB/s Receiving objects: 56% (36642/65431), 34.82 MiB | 34.81 MiB/s Receiving objects: 57% (37296/65431), 34.82 MiB | 34.81 MiB/s Receiving objects: 58% (37950/65431), 34.82 MiB | 34.81 MiB/s Receiving objects: 59% (38605/65431), 34.82 MiB | 34.81 MiB/s Receiving objects: 60% (39259/65431), 34.82 MiB | 34.81 MiB/s Receiving objects: 61% (39913/65431), 34.82 MiB | 34.81 MiB/s Receiving objects: 62% (40568/65431), 34.82 MiB | 34.81 MiB/s Receiving objects: 63% (41222/65431), 34.82 MiB | 34.81 MiB/s Receiving objects: 64% (41876/65431), 34.82 MiB | 34.81 MiB/s Receiving objects: 65% (42531/65431), 34.82 MiB | 34.81 MiB/s Receiving objects: 66% (43185/65431), 34.82 MiB | 34.81 MiB/s Receiving objects: 67% (43839/65431), 34.82 MiB | 34.81 MiB/s Receiving objects: 68% (44494/65431), 52.96 MiB | 35.30 MiB/s Receiving objects: 69% (45148/65431), 52.96 MiB | 35.30 MiB/s Receiving objects: 70% (45802/65431), 52.96 MiB | 35.30 MiB/s Receiving objects: 71% (46457/65431), 52.96 MiB | 35.30 MiB/s Receiving objects: 72% (47111/65431), 52.96 MiB | 35.30 MiB/s Receiving objects: 73% (47765/65431), 52.96 MiB | 35.30 MiB/s Receiving objects: 74% (48419/65431), 52.96 MiB | 35.30 MiB/s Receiving objects: 75% (49074/65431), 52.96 MiB | 35.30 MiB/s Receiving objects: 76% (49728/65431), 52.96 MiB | 35.30 MiB/s Receiving objects: 77% (50382/65431), 52.96 MiB | 35.30 MiB/s Receiving objects: 77% (50427/65431), 70.07 MiB | 35.03 MiB/s Receiving objects: 78% (51037/65431), 70.07 MiB | 35.03 MiB/s Receiving objects: 79% (51691/65431), 70.07 MiB | 35.03 MiB/s Receiving objects: 80% (52345/65431), 70.07 MiB | 35.03 MiB/s Receiving objects: 81% (53000/65431), 70.07 MiB | 35.03 MiB/s Receiving objects: 82% (53654/65431), 70.07 MiB | 35.03 MiB/s Receiving objects: 83% (54308/65431), 70.07 MiB | 35.03 MiB/s Receiving objects: 84% (54963/65431), 70.07 MiB | 35.03 MiB/s Receiving objects: 85% (55617/65431), 70.07 MiB | 35.03 MiB/s Receiving objects: 86% (56271/65431), 70.07 MiB | 35.03 MiB/s Receiving objects: 87% (56925/65431), 70.07 MiB | 35.03 MiB/s Receiving objects: 88% (57580/65431), 70.07 MiB | 35.03 MiB/s Receiving objects: 89% (58234/65431), 70.07 MiB | 35.03 MiB/s Receiving objects: 90% (58888/65431), 70.07 MiB | 35.03 MiB/s Receiving objects: 91% (59543/65431), 70.07 MiB | 35.03 MiB/s Receiving objects: 92% (60197/65431), 70.07 MiB | 35.03 MiB/s Receiving objects: 93% (60851/65431), 70.07 MiB | 35.03 MiB/s Receiving objects: 94% (61506/65431), 70.07 MiB | 35.03 MiB/s Receiving objects: 95% (62160/65431), 70.07 MiB | 35.03 MiB/s Receiving objects: 96% (62814/65431), 70.07 MiB | 35.03 MiB/s Receiving objects: 97% (63469/65431), 85.46 MiB | 33.94 MiB/s Receiving objects: 98% (64123/65431), 85.46 MiB | 33.94 MiB/s Receiving objects: 99% (64777/65431), 85.46 MiB | 33.94 MiB/s remote: Total 65431 (delta 6911), reused 6518 (delta 6342), pack-reused 57349 (from 1)
  7. 5.10 s Receiving objects: 100% (65431/65431), 85.46 MiB | 33.94 MiB/s Receiving objects: 100% (65431/65431), 88.67 MiB | 33.78 MiB/s, done.
  8. 5.75 s Resolving deltas: 0% (0/46029) Resolving deltas: 1% (461/46029) Resolving deltas: 2% (921/46029) Resolving deltas: 3% (1381/46029) Resolving deltas: 4% (1843/46029) Resolving deltas: 5% (2302/46029) Resolving deltas: 6% (2762/46029) Resolving deltas: 7% (3223/46029) Resolving deltas: 8% (3683/46029) Resolving deltas: 9% (4143/46029) Resolving deltas: 10% (4603/46029) Resolving deltas: 11% (5064/46029) Resolving deltas: 12% (5525/46029) Resolving deltas: 13% (5985/46029) Resolving deltas: 14% (6445/46029) Resolving deltas: 15% (6910/46029) Resolving deltas: 16% (7365/46029) Resolving deltas: 17% (7826/46029) Resolving deltas: 18% (8286/46029) Resolving deltas: 19% (8746/46029) Resolving deltas: 20% (9207/46029) Resolving deltas: 21% (9667/46029) Resolving deltas: 22% (10127/46029) Resolving deltas: 23% (10587/46029) Resolving deltas: 24% (11047/46029) Resolving deltas: 25% (11508/46029) Resolving deltas: 26% (11968/46029) Resolving deltas: 27% (12428/46029) Resolving deltas: 28% (12889/46029) Resolving deltas: 29% (13349/46029) Resolving deltas: 30% (13809/46029) Resolving deltas: 31% (14269/46029) Resolving deltas: 32% (14730/46029) Resolving deltas: 33% (15190/46029) Resolving deltas: 34% (15650/46029) Resolving deltas: 35% (16111/46029) Resolving deltas: 36% (16571/46029) Resolving deltas: 37% (17031/46029) Resolving deltas: 38% (17492/46029) Resolving deltas: 39% (17952/46029) Resolving deltas: 40% (18412/46029) Resolving deltas: 41% (18872/46029) Resolving deltas: 42% (19333/46029) Resolving deltas: 43% (19793/46029) Resolving deltas: 44% (20253/46029) Resolving deltas: 45% (20714/46029) Resolving deltas: 46% (21176/46029) Resolving deltas: 47% (21634/46029) Resolving deltas: 48% (22094/46029) Resolving deltas: 49% (22555/46029) Resolving deltas: 50% (23016/46029) Resolving deltas: 51% (23475/46029) Resolving deltas: 52% (23936/46029) Resolving deltas: 53% (24396/46029) Resolving deltas: 54% (24856/46029) Resolving deltas: 55% (25316/46029) Resolving deltas: 56% (25777/46029) Resolving deltas: 57% (26237/46029) Resolving deltas: 58% (26697/46029) Resolving deltas: 59% (27158/46029) Resolving deltas: 60% (27619/46029) Resolving deltas: 61% (28078/46029) Resolving deltas: 62% (28540/46029) Resolving deltas: 63% (29002/46029) Resolving deltas: 64% (29459/46029) Resolving deltas: 65% (29919/46029) Resolving deltas: 66% (30380/46029) Resolving deltas: 67% (30840/46029) Resolving deltas: 68% (31300/46029) Resolving deltas: 69% (31761/46029) Resolving deltas: 70% (32221/46029) Resolving deltas: 71% (32681/46029) Resolving deltas: 72% (33141/46029) Resolving deltas: 73% (33602/46029) Resolving deltas: 74% (34062/46029) Resolving deltas: 75% (34523/46029) Resolving deltas: 76% (34983/46029) Resolving deltas: 77% (35443/46029) Resolving deltas: 78% (35903/46029) Resolving deltas: 79% (36363/46029) Resolving deltas: 80% (36824/46029) Resolving deltas: 81% (37284/46029) Resolving deltas: 82% (37744/46029) Resolving deltas: 83% (38205/46029) Resolving deltas: 84% (38667/46029) Resolving deltas: 85% (39125/46029) Resolving deltas: 86% (39585/46029) Resolving deltas: 87% (40046/46029) Resolving deltas: 88% (40506/46029) Resolving deltas: 89% (40966/46029) Resolving deltas: 90% (41427/46029) Resolving deltas: 91% (41887/46029) Resolving deltas: 92% (42347/46029) Resolving deltas: 93% (42807/46029) Resolving deltas: 94% (43268/46029) Resolving deltas: 95% (43729/46029) Resolving deltas: 96% (44188/46029) Resolving deltas: 97% (44650/46029) Resolving deltas: 98% (45109/46029) Resolving deltas: 99% (45569/46029) Resolving deltas: 100% (46029/46029) Resolving deltas: 100% (46029/46029), done.
  9. 6.05 s Fetching commit 300fe4656edc32971c94203965703aa5d19e5b73 for push-vrpyqyylypmw ...
  10. 6.05 s $ /nix/store/bcnisk3ydfgv26v2gw3zlky24g00yww2-git-2.54.0/bin/git fetch origin 300fe4656edc32971c94203965703aa5d19e5b73
  11. 6.45 s From https://github.com/alphal00p/gammaloop
  12. 6.45 s * branch 300fe4656edc32971c94203965703aa5d19e5b73 -> FETCH_HEAD
  13. 6.46 s $ /nix/store/9ypz3flqsrl5xl495mm8h645gadjsxi1-coreutils-9.11/bin/timeout --kill-after=15s 7200s /nix/store/bcnisk3ydfgv26v2gw3zlky24g00yww2-git-2.54.0/bin/git -c advice.detachedHead=false checkout 300fe4656edc32971c94203965703aa5d19e5b73
  14. 6.67 s HEAD is now at 300fe465 bundle standalone Linnest rendering in linnet-py
  15. 6.68 s $ /nix/store/9ypz3flqsrl5xl495mm8h645gadjsxi1-coreutils-9.11/bin/timeout --kill-after=15s 7200s /nix/store/23zk8sgzamrbmj1fday15szf7f2279s8-nix-2.34.7/bin/nix --extra-experimental-features nix-command --extra-experimental-features flakes --log-format internal-json run .#packages.x86_64-linux.nix-ci-check-gammaloop-nextest-python-api --print-build-logs
  16. 14.36 s
  17. 14.46 s Downloading cached gammaloop-nextest-binaries-python-api-gammaloop-integration-tests from https://cache.nix-ci.com
  18. 15.33 s Downloading cached gammaloop-python-module from https://cache.nix-ci.com
  19. 15.35 s Downloaded cached gammaloop-nextest-binaries-python-api-gammaloop-integration-tests (8.5 MiB) in 898ms
  20. 15.35 s Progress: 0 of 1 built, 1 of 4 downloaded from cache (1 downloading)
  21. 15.35 s Downloading cached gammaloop-nextest-binaries-python-api from https://cache.nix-ci.com
  22. 15.36 s Downloaded cached gammaloop-nextest-binaries-python-api (520 B) in 2ms
  23. 15.36 s Progress: 0 of 1 built, 2 of 4 downloaded from cache (1 downloading)
  24. 15.43 s Downloaded cached gammaloop-python-module (133.9 MiB) in 97ms
  25. 15.43 s Progress: 0 of 1 built, 3 of 4 downloaded from cache
  26. 15.43 s Downloading cached nix-ci-check-gammaloop-nextest-python-api from https://cache.nix-ci.com
  27. 15.43 s Downloaded cached nix-ci-check-gammaloop-nextest-python-api (1104 B) in 3ms
  28. 15.43 s Progress: 0 of 1 built, 4 of 4 downloaded from cache
  29. 23.05 s evaluating derivation 'g copying '/nix/store/gi4f evaluating derivation 'g copying '/nix/store/gi4f evaluating derivation 'g copying '/nix/store/gi4f evaluating derivation 'g copying '/nix/store/gi4f evaluating derivation 'g copying '/nix/store/gi4f evaluating derivation 'g copying '/nix/store/gi4f evaluating derivation 'g copying '/nix/store/gi4f evaluating derivation 'g copying '/nix/store/gi4f evaluating derivation 'g copying '/nix/store/gi4f evaluating derivation 'g copying '/nix/store/gi4f evaluating derivation 'g copying '/nix/store/gi4f evaluating derivation 'g copying '/nix/store/gi4f evaluating derivation 'g copying '/nix/store/gi4f evaluating derivation 'g querying gammaloop-nexte querying info about miss querying gammaloop-nexte [1.1 KiB DL] querying in [0/7 built, 5/0/12 copie [1/0/5 built, 2/5/12 copbuilder.pl> Running phase: patchPhase
  30. 25.07 s builder.pl> Running phase: updateAutotoolsGnuConfigScriptsPhase
  31. 25.07 s builder.pl> Running phase: configurePhase
  32. 25.07 s builder.pl> no configure script, doing nothing
  33. 25.07 s builder.pl> Running phase: buildPhase
  34. 25.07 s builder.pl> Running phase: checkPhase
  35. 25.07 s builder.pl> Running phase: installPhase
  36. 25.07 s builder.pl> no Makefile or custom installPhase, doing nothing
  37. 25.07 s builder.pl> Running phase: fixupPhase
  38. 25.07 s builder.pl> shrinking RPATHs of ELF executables and libraries in /nix/store/n17p4y03iknmyjpnfk30rj7i0klr448n-builder.pl
  39. 25.07 s builder.pl> checking for references to /build/ in /nix/store/n17p4y03iknmyjpnfk30rj7i0klr448n-builder.pl...
  40. 25.07 s builder.pl> patching script interpreter paths in /nix/store/n17p4y03iknmyjpnfk30rj7i0klr448n-builder.pl
  41. 25.07 s builder.pl (post)> Uploading to the NixCI cache: /nix/store/n17p4y03iknmyjpnfk30rj7i0klr448n-builder.pl
  42. 25.07 s builder.pl (post)> warning: 'warn-short-path-literals' is deprecated, use 'lint-short-path-literals = ignore' instead
  43. 25.07 s builder.pl (post)> copying 0 paths...
  44. 25.07 s builder.pl (post)> warning: 'warn-short-path-literals' is deprecated, use 'lint-short-path-literals = ignore' instead
  45. 25.07 s builder.pl (post)> copying 0 paths...
  46. 25.07 s [1/4 built, 2/7/12 copie [1/4 built, 2/8/12 copie [1/4 built, 1/9/12 copie [1/4 built, 1/11/12 copi [1/1/3 built, 12 copied python3> structuredAttrs is enabled
  47. 25.07 s python3> created 227 symlinks in user environment
  48. 25.07 s python3 (post)> Uploading to the NixCI cache: /nix/store/3gi2x25n327sf3xma8b08jd57aqv69x5-python3-3.13.14-env
  49. 25.07 s python3 (post)> warning: 'warn-short-path-literals' is deprecated, use 'lint-short-path-literals = ignore' instead
  50. 25.07 s python3 (post)> copying 0 paths...
  51. 25.07 s python3 (post)> warning: 'warn-short-path-literals' is deprecated, use 'lint-short-path-literals = ignore' instead
  52. 25.07 s python3 (post)> copying 0 paths...
  53. 25.29 s [2/4 built, 12 copied (2 [1/2/3 built, 12 copied gammaloop-nextest-python-api> Extracting 1 binary, 1 build script output directory, and 3 linked paths to /build/source
  54. 25.35 s gammaloop-nextest-python-api> Extracted 18 files to /build/source in 0.06s
  55. 25.36 s gammaloop-nextest-python-api> ------------
  56. 25.36 s gammaloop-nextest-python-api> Nextest run ID c5d6ee22-b173-4e37-8fef-e81ba10b532a with nextest profile: ci_gammaloop
  57. 25.36 s gammaloop-nextest-python-api> Starting 5 tests across 1 binary
  58. 25.47 s gammaloop-nextest-python-api> FAIL [ 0.112s] (1/5) gammaloop-integration-tests::test_python_api python_evaluate_sample_honors_generate_events_and_observable_snapshots
  59. 25.47 s gammaloop-nextest-python-api> stdout ---
  60. 25.47 s gammaloop-nextest-python-api>
  61. 25.47 s gammaloop-nextest-python-api> running 1 test
  62. 25.47 s gammaloop-nextest-python-api> test python_evaluate_sample_honors_generate_events_and_observable_snapshots ... FAILED
  63. 25.47 s gammaloop-nextest-python-api>
  64. 25.47 s gammaloop-nextest-python-api> failures:
  65. 25.47 s gammaloop-nextest-python-api>
  66. 25.47 s gammaloop-nextest-python-api> failures:
  67. 25.47 s gammaloop-nextest-python-api> python_evaluate_sample_honors_generate_events_and_observable_snapshots
  68. 25.47 s gammaloop-nextest-python-api>
  69. 25.47 s gammaloop-nextest-python-api> test result: FAILED. 0 passed; 1 failed; 0 ignored; 0 measured; 4 filtered out; finished in 0.11s
  70. 25.47 s gammaloop-nextest-python-api>
  71. 25.47 s gammaloop-nextest-python-api> stderr ---
  72. 25.47 s gammaloop-nextest-python-api> Error: Python API test subprocess failed.
  73. 25.47 s gammaloop-nextest-python-api> stdout:
  74. 25.47 s gammaloop-nextest-python-api> ┌────────────────────────────────────────────────────────┐
  75. 25.47 s gammaloop-nextest-python-api> │ You are running a restricted Symbolica instance. │
  76. 25.47 s gammaloop-nextest-python-api> │ │
  77. 25.47 s gammaloop-nextest-python-api> │ This mode is only permitted for non-commercial use and │
  78. 25.47 s gammaloop-nextest-python-api> │ is limited to one instance and core per machine. │
  79. 25.47 s gammaloop-nextest-python-api> │ │
  80. 25.47 s gammaloop-nextest-python-api> │ Hobbyists can easily acquire a free license key │
  81. 25.47 s gammaloop-nextest-python-api> │ that unlocks all cores and removes this banner: │
  82. 25.47 s gammaloop-nextest-python-api> │ │
  83. 25.47 s gammaloop-nextest-python-api> │ from symbolica import * │
  84. 25.47 s gammaloop-nextest-python-api> │ request_hobbyist_license('YOUR_NAME', 'YOUR_EMAIL') │
  85. 25.47 s gammaloop-nextest-python-api> │ │
  86. 25.47 s gammaloop-nextest-python-api> │ All other users can obtain a free 30-day trial key: │
  87. 25.47 s gammaloop-nextest-python-api> │ │
  88. 25.47 s gammaloop-nextest-python-api> │ from symbolica import * │
  89. 25.47 s gammaloop-nextest-python-api> │ request_trial_license('NAME', 'EMAIL', 'EMPLOYER') │
  90. 25.47 s gammaloop-nextest-python-api> │ │
  91. 25.47 s gammaloop-nextest-python-api> │ See https://symbolica.io/docs/get_started.html#license │
  92. 25.47 s gammaloop-nextest-python-api> └────────────────────────────────────────────────────────┘
  93. 25.47 s gammaloop-nextest-python-api> ┌───────────────────────────────────────────────────────────────────────────────────────────────────────────┐
  94. 25.47 s gammaloop-nextest-python-api> │ Cannot start new unlicensed Symbolica instance since there is already another one running on the machine. │
  95. 25.47 s gammaloop-nextest-python-api> └───────────────────────────────────────────────────────────────────────────────────────────────────────────┘
  96. 25.47 s gammaloop-nextest-python-api>
  97. 25.47 s gammaloop-nextest-python-api> stderr:
  98. 25.47 s gammaloop-nextest-python-api> ┌───────────────────────────────────┐
  99. 25.47 s gammaloop-nextest-python-api> │ The Symbolica license has expired │
  100. 25.47 s gammaloop-nextest-python-api> └───────────────────────────────────┘
  101. 25.47 s gammaloop-nextest-python-api>
  102. 25.47 s gammaloop-nextest-python-api>
  103. 25.47 s gammaloop-nextest-python-api> Location:
  104. 25.47 s gammaloop-nextest-python-api> tests/tests/test_python_api.rs:156:20
  105. 25.47 s gammaloop-nextest-python-api>
  106. 25.47 s gammaloop-nextest-python-api> FAIL [ 0.112s] (2/5) gammaloop-integration-tests::test_python_api python_session_getters_return_live_toml_and_command_blocks
  107. 25.47 s gammaloop-nextest-python-api> stdout ---
  108. 25.47 s gammaloop-nextest-python-api>
  109. 25.47 s gammaloop-nextest-python-api> running 1 test
  110. 25.47 s gammaloop-nextest-python-api> test python_session_getters_return_live_toml_and_command_blocks ... FAILED
  111. 25.47 s gammaloop-nextest-python-api>
  112. 25.47 s gammaloop-nextest-python-api> failures:
  113. 25.47 s gammaloop-nextest-python-api>
  114. 25.47 s gammaloop-nextest-python-api> failures:
  115. 25.47 s gammaloop-nextest-python-api> python_session_getters_return_live_toml_and_command_blocks
  116. 25.47 s gammaloop-nextest-python-api>
  117. 25.47 s gammaloop-nextest-python-api> test result: FAILED. 0 passed; 1 failed; 0 ignored; 0 measured; 4 filtered out; finished in 0.11s
  118. 25.47 s gammaloop-nextest-python-api>
  119. 25.47 s gammaloop-nextest-python-api> stderr ---
  120. 25.47 s gammaloop-nextest-python-api> Error: Python API test subprocess failed.
  121. 25.47 s gammaloop-nextest-python-api> stdout:
  122. 25.47 s gammaloop-nextest-python-api> ┌────────────────────────────────────────────────────────┐
  123. 25.47 s gammaloop-nextest-python-api> │ You are running a restricted Symbolica instance. │
  124. 25.47 s gammaloop-nextest-python-api> │ │
  125. 25.47 s gammaloop-nextest-python-api> │ This mode is only permitted for non-commercial use and │
  126. 25.47 s gammaloop-nextest-python-api> │ is limited to one instance and core per machine. │
  127. 25.47 s gammaloop-nextest-python-api> │ │
  128. 25.47 s gammaloop-nextest-python-api> │ Hobbyists can easily acquire a free license key │
  129. 25.47 s gammaloop-nextest-python-api> │ that unlocks all cores and removes this banner: │
  130. 25.47 s gammaloop-nextest-python-api> │ │
  131. 25.47 s gammaloop-nextest-python-api> │ from symbolica import * │
  132. 25.47 s gammaloop-nextest-python-api> │ request_hobbyist_license('YOUR_NAME', 'YOUR_EMAIL') │
  133. 25.47 s gammaloop-nextest-python-api> │ │
  134. 25.47 s gammaloop-nextest-python-api> │ All other users can obtain a free 30-day trial key: │
  135. 25.47 s gammaloop-nextest-python-api> │ │
  136. 25.47 s gammaloop-nextest-python-api> │ from symbolica import * │
  137. 25.47 s gammaloop-nextest-python-api> │ request_trial_license('NAME', 'EMAIL', 'EMPLOYER') │
  138. 25.47 s gammaloop-nextest-python-api> │ │
  139. 25.47 s gammaloop-nextest-python-api> │ See https://symbolica.io/docs/get_started.html#license │
  140. 25.47 s gammaloop-nextest-python-api> └────────────────────────────────────────────────────────┘
  141. 25.47 s gammaloop-nextest-python-api> ┌───────────────────────────────────────────────────────────────────────────────────────────────────────────┐
  142. 25.47 s gammaloop-nextest-python-api> │ Cannot start new unlicensed Symbolica instance since there is already another one running on the machine. │
  143. 25.47 s gammaloop-nextest-python-api> └───────────────────────────────────────────────────────────────────────────────────────────────────────────┘
  144. 25.47 s gammaloop-nextest-python-api>
  145. 25.47 s gammaloop-nextest-python-api> stderr:
  146. 25.47 s gammaloop-nextest-python-api> ┌───────────────────────────────────┐
  147. 25.47 s gammaloop-nextest-python-api> │ The Symbolica license has expired │
  148. 25.47 s gammaloop-nextest-python-api> └───────────────────────────────────┘
  149. 25.47 s gammaloop-nextest-python-api>
  150. 25.47 s gammaloop-nextest-python-api>
  151. 25.47 s gammaloop-nextest-python-api> Location:
  152. 25.47 s gammaloop-nextest-python-api> tests/tests/test_python_api.rs:156:20
  153. 25.47 s gammaloop-nextest-python-api>
  154. 25.47 s gammaloop-nextest-python-api> FAIL [ 0.112s] (3/5) gammaloop-integration-tests::test_python_api python_evaluate_samples_batch_and_momentum_space_have_expected_shape
  155. 25.47 s gammaloop-nextest-python-api> stdout ---
  156. 25.47 s gammaloop-nextest-python-api>
  157. 25.47 s gammaloop-nextest-python-api> running 1 test
  158. 25.47 s gammaloop-nextest-python-api> test python_evaluate_samples_batch_and_momentum_space_have_expected_shape ... FAILED
  159. 25.47 s gammaloop-nextest-python-api>
  160. 25.47 s gammaloop-nextest-python-api> failures:
  161. 25.47 s gammaloop-nextest-python-api>
  162. 25.47 s gammaloop-nextest-python-api> failures:
  163. 25.47 s gammaloop-nextest-python-api> python_evaluate_samples_batch_and_momentum_space_have_expected_shape
  164. 25.47 s gammaloop-nextest-python-api>
  165. 25.47 s gammaloop-nextest-python-api> test result: FAILED. 0 passed; 1 failed; 0 ignored; 0 measured; 4 filtered out; finished in 0.11s
  166. 25.47 s gammaloop-nextest-python-api>
  167. 25.47 s gammaloop-nextest-python-api> stderr ---
  168. 25.47 s gammaloop-nextest-python-api> Error: Python API test subprocess failed.
  169. 25.47 s gammaloop-nextest-python-api> stdout:
  170. 25.47 s gammaloop-nextest-python-api> ┌────────────────────────────────────────────────────────┐
  171. 25.47 s gammaloop-nextest-python-api> │ You are running a restricted Symbolica instance. │
  172. 25.47 s gammaloop-nextest-python-api> │ │
  173. 25.47 s gammaloop-nextest-python-api> │ This mode is only permitted for non-commercial use and │
  174. 25.47 s gammaloop-nextest-python-api> │ is limited to one instance and core per machine. │
  175. 25.47 s gammaloop-nextest-python-api> │ │
  176. 25.47 s gammaloop-nextest-python-api> │ Hobbyists can easily acquire a free license key │
  177. 25.47 s gammaloop-nextest-python-api> │ that unlocks all cores and removes this banner: │
  178. 25.47 s gammaloop-nextest-python-api> │ │
  179. 25.47 s gammaloop-nextest-python-api> │ from symbolica import * │
  180. 25.47 s gammaloop-nextest-python-api> │ request_hobbyist_license('YOUR_NAME', 'YOUR_EMAIL') │
  181. 25.47 s gammaloop-nextest-python-api> │ │
  182. 25.47 s gammaloop-nextest-python-api> │ All other users can obtain a free 30-day trial key: │
  183. 25.47 s gammaloop-nextest-python-api> │ │
  184. 25.47 s gammaloop-nextest-python-api> │ from symbolica import * │
  185. 25.47 s gammaloop-nextest-python-api> │ request_trial_license('NAME', 'EMAIL', 'EMPLOYER') │
  186. 25.47 s gammaloop-nextest-python-api> │ │
  187. 25.47 s gammaloop-nextest-python-api> │ See https://symbolica.io/docs/get_started.html#license │
  188. 25.47 s gammaloop-nextest-python-api> └────────────────────────────────────────────────────────┘
  189. 25.47 s gammaloop-nextest-python-api> ┌───────────────────────────────────────────────────────────────────────────────────────────────────────────┐
  190. 25.47 s gammaloop-nextest-python-api> │ Cannot start new unlicensed Symbolica instance since there is already another one running on the machine. │
  191. 25.47 s gammaloop-nextest-python-api> └───────────────────────────────────────────────────────────────────────────────────────────────────────────┘
  192. 25.47 s gammaloop-nextest-python-api>
  193. 25.47 s gammaloop-nextest-python-api> stderr:
  194. 25.47 s gammaloop-nextest-python-api> ┌───────────────────────────────────┐
  195. 25.47 s gammaloop-nextest-python-api> │ The Symbolica license has expired │
  196. 25.47 s gammaloop-nextest-python-api> └───────────────────────────────────┘
  197. 25.47 s gammaloop-nextest-python-api>
  198. 25.47 s gammaloop-nextest-python-api>
  199. 25.47 s gammaloop-nextest-python-api> Location:
  200. 25.47 s gammaloop-nextest-python-api> tests/tests/test_python_api.rs:156:20
  201. 25.47 s gammaloop-nextest-python-api>
  202. 25.48 s gammaloop-nextest-python-api> FAIL [ 0.120s] (4/5) gammaloop-integration-tests::test_python_api python_evaluate_sample_preserves_graph_grouping_and_incoming_pdgs
  203. 25.48 s gammaloop-nextest-python-api> stdout ---
  204. 25.48 s gammaloop-nextest-python-api>
  205. 25.48 s gammaloop-nextest-python-api> running 1 test
  206. 25.48 s gammaloop-nextest-python-api> test python_evaluate_sample_preserves_graph_grouping_and_incoming_pdgs ... FAILED
  207. 25.48 s gammaloop-nextest-python-api>
  208. 25.48 s gammaloop-nextest-python-api> failures:
  209. 25.48 s gammaloop-nextest-python-api>
  210. 25.48 s gammaloop-nextest-python-api> failures:
  211. 25.48 s gammaloop-nextest-python-api> python_evaluate_sample_preserves_graph_grouping_and_incoming_pdgs
  212. 25.48 s gammaloop-nextest-python-api>
  213. 25.48 s gammaloop-nextest-python-api> test result: FAILED. 0 passed; 1 failed; 0 ignored; 0 measured; 4 filtered out; finished in 0.12s
  214. 25.48 s gammaloop-nextest-python-api>
  215. 25.48 s gammaloop-nextest-python-api> stderr ---
  216. 25.48 s gammaloop-nextest-python-api> Error: Python API test subprocess failed.
  217. 25.48 s gammaloop-nextest-python-api> stdout:
  218. 25.48 s gammaloop-nextest-python-api> ┌────────────────────────────────────────────────────────┐
  219. 25.48 s gammaloop-nextest-python-api> │ You are running a restricted Symbolica instance. │
  220. 25.48 s gammaloop-nextest-python-api> │ │
  221. 25.48 s gammaloop-nextest-python-api> │ This mode is only permitted for non-commercial use and │
  222. 25.48 s gammaloop-nextest-python-api> │ is limited to one instance and core per machine. │
  223. 25.48 s gammaloop-nextest-python-api> │ │
  224. 25.48 s gammaloop-nextest-python-api> │ Hobbyists can easily acquire a free license key │
  225. 25.48 s gammaloop-nextest-python-api> │ that unlocks all cores and removes this banner: │
  226. 25.48 s gammaloop-nextest-python-api> │ │
  227. 25.48 s gammaloop-nextest-python-api> │ from symbolica import * │
  228. 25.48 s gammaloop-nextest-python-api> │ request_hobbyist_license('YOUR_NAME', 'YOUR_EMAIL') │
  229. 25.48 s gammaloop-nextest-python-api> │ │
  230. 25.48 s gammaloop-nextest-python-api> │ All other users can obtain a free 30-day trial key: │
  231. 25.48 s gammaloop-nextest-python-api> │ │
  232. 25.48 s gammaloop-nextest-python-api> │ from symbolica import * │
  233. 25.48 s gammaloop-nextest-python-api> │ request_trial_license('NAME', 'EMAIL', 'EMPLOYER') │
  234. 25.48 s gammaloop-nextest-python-api> │ │
  235. 25.48 s gammaloop-nextest-python-api> │ See https://symbolica.io/docs/get_started.html#license │
  236. 25.48 s gammaloop-nextest-python-api> └────────────────────────────────────────────────────────┘
  237. 25.48 s gammaloop-nextest-python-api> ┌───────────────────────────────────────────────────────────────────────────────────────────────────────────┐
  238. 25.48 s gammaloop-nextest-python-api> │ Cannot start new unlicensed Symbolica instance since there is already another one running on the machine. │
  239. 25.48 s gammaloop-nextest-python-api> └───────────────────────────────────────────────────────────────────────────────────────────────────────────┘
  240. 25.48 s gammaloop-nextest-python-api>
  241. 25.48 s gammaloop-nextest-python-api> stderr:
  242. 25.48 s gammaloop-nextest-python-api> ┌───────────────────────────────────┐
  243. 25.48 s gammaloop-nextest-python-api> │ The Symbolica license has expired │
  244. 25.48 s gammaloop-nextest-python-api> └───────────────────────────────────┘
  245. 25.48 s gammaloop-nextest-python-api>
  246. 25.48 s gammaloop-nextest-python-api>
  247. 25.48 s gammaloop-nextest-python-api> Location:
  248. 25.48 s gammaloop-nextest-python-api> tests/tests/test_python_api.rs:156:20
  249. 25.48 s gammaloop-nextest-python-api>
  250. 25.64 s gammaloop-nextest-python-api> ------------
  251. 25.64 s gammaloop-nextest-python-api> Summary [ 0.282s] 5 tests run: 1 passed, 4 failed, 0 skipped
  252. 25.64 s gammaloop-nextest-python-api> FAIL [ 0.112s] (1/5) gammaloop-integration-tests::test_python_api python_evaluate_sample_honors_generate_events_and_observable_snapshots
  253. 25.64 s gammaloop-nextest-python-api> stdout ---
  254. 25.64 s gammaloop-nextest-python-api>
  255. 25.64 s gammaloop-nextest-python-api> running 1 test
  256. 25.64 s gammaloop-nextest-python-api> test python_evaluate_sample_honors_generate_events_and_observable_snapshots ... FAILED
  257. 25.64 s gammaloop-nextest-python-api>
  258. 25.64 s gammaloop-nextest-python-api> failures:
  259. 25.64 s gammaloop-nextest-python-api>
  260. 25.64 s gammaloop-nextest-python-api> failures:
  261. 25.64 s gammaloop-nextest-python-api> python_evaluate_sample_honors_generate_events_and_observable_snapshots
  262. 25.64 s gammaloop-nextest-python-api>
  263. 25.64 s gammaloop-nextest-python-api> test result: FAILED. 0 passed; 1 failed; 0 ignored; 0 measured; 4 filtered out; finished in 0.11s
  264. 25.64 s gammaloop-nextest-python-api>
  265. 25.64 s gammaloop-nextest-python-api> stderr ---
  266. 25.64 s gammaloop-nextest-python-api> Error: Python API test subprocess failed.
  267. 25.64 s gammaloop-nextest-python-api> stdout:
  268. 25.64 s gammaloop-nextest-python-api> ┌────────────────────────────────────────────────────────┐
  269. 25.64 s gammaloop-nextest-python-api> │ You are running a restricted Symbolica instance. │
  270. 25.64 s gammaloop-nextest-python-api> │ │
  271. 25.64 s gammaloop-nextest-python-api> │ This mode is only permitted for non-commercial use and │
  272. 25.64 s gammaloop-nextest-python-api> │ is limited to one instance and core per machine. │
  273. 25.64 s gammaloop-nextest-python-api> │ │
  274. 25.64 s gammaloop-nextest-python-api> │ Hobbyists can easily acquire a free license key │
  275. 25.64 s gammaloop-nextest-python-api> │ that unlocks all cores and removes this banner: │
  276. 25.64 s gammaloop-nextest-python-api> │ │
  277. 25.64 s gammaloop-nextest-python-api> │ from symbolica import * │
  278. 25.64 s gammaloop-nextest-python-api> │ request_hobbyist_license('YOUR_NAME', 'YOUR_EMAIL') │
  279. 25.64 s gammaloop-nextest-python-api> │ │
  280. 25.64 s gammaloop-nextest-python-api> │ All other users can obtain a free 30-day trial key: │
  281. 25.64 s gammaloop-nextest-python-api> │ │
  282. 25.64 s gammaloop-nextest-python-api> │ from symbolica import * │
  283. 25.64 s gammaloop-nextest-python-api> │ request_trial_license('NAME', 'EMAIL', 'EMPLOYER') │
  284. 25.64 s gammaloop-nextest-python-api> │ │
  285. 25.64 s gammaloop-nextest-python-api> │ See https://symbolica.io/docs/get_started.html#license │
  286. 25.64 s gammaloop-nextest-python-api> └────────────────────────────────────────────────────────┘
  287. 25.64 s gammaloop-nextest-python-api> ┌───────────────────────────────────────────────────────────────────────────────────────────────────────────┐
  288. 25.64 s gammaloop-nextest-python-api> │ Cannot start new unlicensed Symbolica instance since there is already another one running on the machine. │
  289. 25.64 s gammaloop-nextest-python-api> └───────────────────────────────────────────────────────────────────────────────────────────────────────────┘
  290. 25.64 s gammaloop-nextest-python-api>
  291. 25.64 s gammaloop-nextest-python-api> stderr:
  292. 25.64 s gammaloop-nextest-python-api> ┌───────────────────────────────────┐
  293. 25.64 s gammaloop-nextest-python-api> │ The Symbolica license has expired │
  294. 25.64 s gammaloop-nextest-python-api> └───────────────────────────────────┘
  295. 25.64 s gammaloop-nextest-python-api>
  296. 25.64 s gammaloop-nextest-python-api>
  297. 25.64 s gammaloop-nextest-python-api> Location:
  298. 25.64 s gammaloop-nextest-python-api> tests/tests/test_python_api.rs:156:20
  299. 25.64 s gammaloop-nextest-python-api>
  300. 25.64 s gammaloop-nextest-python-api> FAIL [ 0.112s] (2/5) gammaloop-integration-tests::test_python_api python_session_getters_return_live_toml_and_command_blocks
  301. 25.64 s gammaloop-nextest-python-api> stdout ---
  302. 25.64 s gammaloop-nextest-python-api>
  303. 25.64 s gammaloop-nextest-python-api> running 1 test
  304. 25.64 s gammaloop-nextest-python-api> test python_session_getters_return_live_toml_and_command_blocks ... FAILED
  305. 25.64 s gammaloop-nextest-python-api>
  306. 25.64 s gammaloop-nextest-python-api> failures:
  307. 25.64 s gammaloop-nextest-python-api>
  308. 25.64 s gammaloop-nextest-python-api> failures:
  309. 25.64 s gammaloop-nextest-python-api> python_session_getters_return_live_toml_and_command_blocks
  310. 25.64 s gammaloop-nextest-python-api>
  311. 25.64 s gammaloop-nextest-python-api> test result: FAILED. 0 passed; 1 failed; 0 ignored; 0 measured; 4 filtered out; finished in 0.11s
  312. 25.64 s gammaloop-nextest-python-api>
  313. 25.64 s gammaloop-nextest-python-api> stderr ---
  314. 25.64 s gammaloop-nextest-python-api> Error: Python API test subprocess failed.
  315. 25.64 s gammaloop-nextest-python-api> stdout:
  316. 25.64 s gammaloop-nextest-python-api> ┌────────────────────────────────────────────────────────┐
  317. 25.64 s gammaloop-nextest-python-api> │ You are running a restricted Symbolica instance. │
  318. 25.64 s gammaloop-nextest-python-api> │ │
  319. 25.64 s gammaloop-nextest-python-api> │ This mode is only permitted for non-commercial use and │
  320. 25.64 s gammaloop-nextest-python-api> │ is limited to one instance and core per machine. │
  321. 25.64 s gammaloop-nextest-python-api> │ │
  322. 25.64 s gammaloop-nextest-python-api> │ Hobbyists can easily acquire a free license key │
  323. 25.64 s gammaloop-nextest-python-api> │ that unlocks all cores and removes this banner: │
  324. 25.64 s gammaloop-nextest-python-api> │ │
  325. 25.64 s gammaloop-nextest-python-api> │ from symbolica import * │
  326. 25.64 s gammaloop-nextest-python-api> │ request_hobbyist_license('YOUR_NAME', 'YOUR_EMAIL') │
  327. 25.64 s gammaloop-nextest-python-api> │ │
  328. 25.64 s gammaloop-nextest-python-api> │ All other users can obtain a free 30-day trial key: │
  329. 25.64 s gammaloop-nextest-python-api> │ │
  330. 25.64 s gammaloop-nextest-python-api> │ from symbolica import * │
  331. 25.64 s gammaloop-nextest-python-api> │ request_trial_license('NAME', 'EMAIL', 'EMPLOYER') │
  332. 25.64 s gammaloop-nextest-python-api> │ │
  333. 25.64 s gammaloop-nextest-python-api> │ See https://symbolica.io/docs/get_started.html#license │
  334. 25.64 s gammaloop-nextest-python-api> └────────────────────────────────────────────────────────┘
  335. 25.64 s gammaloop-nextest-python-api> ┌───────────────────────────────────────────────────────────────────────────────────────────────────────────┐
  336. 25.64 s gammaloop-nextest-python-api> │ Cannot start new unlicensed Symbolica instance since there is already another one running on the machine. │
  337. 25.64 s gammaloop-nextest-python-api> └───────────────────────────────────────────────────────────────────────────────────────────────────────────┘
  338. 25.64 s gammaloop-nextest-python-api>
  339. 25.64 s gammaloop-nextest-python-api> stderr:
  340. 25.64 s gammaloop-nextest-python-api> ┌───────────────────────────────────┐
  341. 25.64 s gammaloop-nextest-python-api> │ The Symbolica license has expired │
  342. 25.64 s gammaloop-nextest-python-api> └───────────────────────────────────┘
  343. 25.64 s gammaloop-nextest-python-api>
  344. 25.64 s gammaloop-nextest-python-api>
  345. 25.64 s gammaloop-nextest-python-api> Location:
  346. 25.64 s gammaloop-nextest-python-api> tests/tests/test_python_api.rs:156:20
  347. 25.64 s gammaloop-nextest-python-api>
  348. 25.64 s gammaloop-nextest-python-api> FAIL [ 0.112s] (3/5) gammaloop-integration-tests::test_python_api python_evaluate_samples_batch_and_momentum_space_have_expected_shape
  349. 25.64 s gammaloop-nextest-python-api> stdout ---
  350. 25.64 s gammaloop-nextest-python-api>
  351. 25.64 s gammaloop-nextest-python-api> running 1 test
  352. 25.64 s gammaloop-nextest-python-api> test python_evaluate_samples_batch_and_momentum_space_have_expected_shape ... FAILED
  353. 25.64 s gammaloop-nextest-python-api>
  354. 25.64 s gammaloop-nextest-python-api> failures:
  355. 25.64 s gammaloop-nextest-python-api>
  356. 25.64 s gammaloop-nextest-python-api> failures:
  357. 25.64 s gammaloop-nextest-python-api> python_evaluate_samples_batch_and_momentum_space_have_expected_shape
  358. 25.64 s gammaloop-nextest-python-api>
  359. 25.64 s gammaloop-nextest-python-api> test result: FAILED. 0 passed; 1 failed; 0 ignored; 0 measured; 4 filtered out; finished in 0.11s
  360. 25.64 s gammaloop-nextest-python-api>
  361. 25.64 s gammaloop-nextest-python-api> stderr ---
  362. 25.64 s gammaloop-nextest-python-api> Error: Python API test subprocess failed.
  363. 25.64 s gammaloop-nextest-python-api> stdout:
  364. 25.64 s gammaloop-nextest-python-api> ┌────────────────────────────────────────────────────────┐
  365. 25.64 s gammaloop-nextest-python-api> │ You are running a restricted Symbolica instance. │
  366. 25.64 s gammaloop-nextest-python-api> │ │
  367. 25.64 s gammaloop-nextest-python-api> │ This mode is only permitted for non-commercial use and │
  368. 25.64 s gammaloop-nextest-python-api> │ is limited to one instance and core per machine. │
  369. 25.64 s gammaloop-nextest-python-api> │ │
  370. 25.64 s gammaloop-nextest-python-api> │ Hobbyists can easily acquire a free license key │
  371. 25.64 s gammaloop-nextest-python-api> │ that unlocks all cores and removes this banner: │
  372. 25.64 s gammaloop-nextest-python-api> │ │
  373. 25.64 s gammaloop-nextest-python-api> │ from symbolica import * │
  374. 25.64 s gammaloop-nextest-python-api> │ request_hobbyist_license('YOUR_NAME', 'YOUR_EMAIL') │
  375. 25.64 s gammaloop-nextest-python-api> │ │
  376. 25.64 s gammaloop-nextest-python-api> │ All other users can obtain a free 30-day trial key: │
  377. 25.64 s gammaloop-nextest-python-api> │ │
  378. 25.64 s gammaloop-nextest-python-api> │ from symbolica import * │
  379. 25.64 s gammaloop-nextest-python-api> │ request_trial_license('NAME', 'EMAIL', 'EMPLOYER') │
  380. 25.64 s gammaloop-nextest-python-api> │ │
  381. 25.64 s gammaloop-nextest-python-api> │ See https://symbolica.io/docs/get_started.html#license │
  382. 25.64 s gammaloop-nextest-python-api> └────────────────────────────────────────────────────────┘
  383. 25.64 s gammaloop-nextest-python-api> ┌───────────────────────────────────────────────────────────────────────────────────────────────────────────┐
  384. 25.64 s gammaloop-nextest-python-api> │ Cannot start new unlicensed Symbolica instance since there is already another one running on the machine. │
  385. 25.64 s gammaloop-nextest-python-api> └───────────────────────────────────────────────────────────────────────────────────────────────────────────┘
  386. 25.64 s gammaloop-nextest-python-api>
  387. 25.64 s gammaloop-nextest-python-api> stderr:
  388. 25.64 s gammaloop-nextest-python-api> ┌───────────────────────────────────┐
  389. 25.64 s gammaloop-nextest-python-api> │ The Symbolica license has expired │
  390. 25.64 s gammaloop-nextest-python-api> └───────────────────────────────────┘
  391. 25.64 s gammaloop-nextest-python-api>
  392. 25.64 s gammaloop-nextest-python-api>
  393. 25.64 s gammaloop-nextest-python-api> Location:
  394. 25.64 s gammaloop-nextest-python-api> tests/tests/test_python_api.rs:156:20
  395. 25.64 s gammaloop-nextest-python-api>
  396. 25.64 s gammaloop-nextest-python-api> FAIL [ 0.120s] (4/5) gammaloop-integration-tests::test_python_api python_evaluate_sample_preserves_graph_grouping_and_incoming_pdgs
  397. 25.64 s gammaloop-nextest-python-api> stdout ---
  398. 25.64 s gammaloop-nextest-python-api>
  399. 25.64 s gammaloop-nextest-python-api> running 1 test
  400. 25.64 s gammaloop-nextest-python-api> test python_evaluate_sample_preserves_graph_grouping_and_incoming_pdgs ... FAILED
  401. 25.64 s gammaloop-nextest-python-api>
  402. 25.64 s gammaloop-nextest-python-api> failures:
  403. 25.64 s gammaloop-nextest-python-api>
  404. 25.64 s gammaloop-nextest-python-api> failures:
  405. 25.64 s gammaloop-nextest-python-api> python_evaluate_sample_preserves_graph_grouping_and_incoming_pdgs
  406. 25.64 s gammaloop-nextest-python-api>
  407. 25.64 s gammaloop-nextest-python-api> test result: FAILED. 0 passed; 1 failed; 0 ignored; 0 measured; 4 filtered out; finished in 0.12s
  408. 25.64 s gammaloop-nextest-python-api>
  409. 25.64 s gammaloop-nextest-python-api> stderr ---
  410. 25.64 s gammaloop-nextest-python-api> Error: Python API test subprocess failed.
  411. 25.64 s gammaloop-nextest-python-api> stdout:
  412. 25.64 s gammaloop-nextest-python-api> ┌────────────────────────────────────────────────────────┐
  413. 25.64 s gammaloop-nextest-python-api> │ You are running a restricted Symbolica instance. │
  414. 25.64 s gammaloop-nextest-python-api> │ │
  415. 25.64 s gammaloop-nextest-python-api> │ This mode is only permitted for non-commercial use and │
  416. 25.64 s gammaloop-nextest-python-api> │ is limited to one instance and core per machine. │
  417. 25.64 s gammaloop-nextest-python-api> │ │
  418. 25.64 s gammaloop-nextest-python-api> │ Hobbyists can easily acquire a free license key │
  419. 25.64 s gammaloop-nextest-python-api> │ that unlocks all cores and removes this banner: │
  420. 25.64 s gammaloop-nextest-python-api> │ │
  421. 25.64 s gammaloop-nextest-python-api> │ from symbolica import * │
  422. 25.64 s gammaloop-nextest-python-api> │ request_hobbyist_license('YOUR_NAME', 'YOUR_EMAIL') │
  423. 25.64 s gammaloop-nextest-python-api> │ │
  424. 25.64 s gammaloop-nextest-python-api> │ All other users can obtain a free 30-day trial key: │
  425. 25.64 s gammaloop-nextest-python-api> │ │
  426. 25.64 s gammaloop-nextest-python-api> │ from symbolica import * │
  427. 25.64 s gammaloop-nextest-python-api> │ request_trial_license('NAME', 'EMAIL', 'EMPLOYER') │
  428. 25.64 s gammaloop-nextest-python-api> │ │
  429. 25.64 s gammaloop-nextest-python-api> │ See https://symbolica.io/docs/get_started.html#license │
  430. 25.64 s gammaloop-nextest-python-api> └────────────────────────────────────────────────────────┘
  431. 25.64 s gammaloop-nextest-python-api> ┌───────────────────────────────────────────────────────────────────────────────────────────────────────────┐
  432. 25.64 s gammaloop-nextest-python-api> │ Cannot start new unlicensed Symbolica instance since there is already another one running on the machine. │
  433. 25.64 s gammaloop-nextest-python-api> └───────────────────────────────────────────────────────────────────────────────────────────────────────────┘
  434. 25.64 s gammaloop-nextest-python-api>
  435. 25.64 s gammaloop-nextest-python-api> stderr:
  436. 25.64 s gammaloop-nextest-python-api> ┌───────────────────────────────────┐
  437. 25.64 s gammaloop-nextest-python-api> │ The Symbolica license has expired │
  438. 25.64 s gammaloop-nextest-python-api> └───────────────────────────────────┘
  439. 25.64 s gammaloop-nextest-python-api>
  440. 25.64 s gammaloop-nextest-python-api>
  441. 25.64 s gammaloop-nextest-python-api> Location:
  442. 25.64 s gammaloop-nextest-python-api> tests/tests/test_python_api.rs:156:20
  443. 25.64 s gammaloop-nextest-python-api>
  444. 25.64 s gammaloop-nextest-python-api> error: test run failed
  445. 25.67 s gammaloop-nextest-python-api>
  446. 25.67 s gammaloop-nextest-python-api> ========== nextest test summary ==========
  447. 25.67 s gammaloop-nextest-python-api> report: target/nextest/ci_gammaloop/junit.xml
  448. 25.67 s gammaloop-nextest-python-api> tests: 5, failures: 4, errors: 0
  449. 25.67 s gammaloop-nextest-python-api>
  450. 25.67 s gammaloop-nextest-python-api> 1. gammaloop-integration-tests::test_python_api::python_evaluate_sample_honors_generate_events_and_observable_snapshots
  451. 25.67 s gammaloop-nextest-python-api> failure: test failure with exit code 101
  452. 25.67 s gammaloop-nextest-python-api> Error: Python API test subprocess failed.
  453. 25.67 s gammaloop-nextest-python-api> stdout:
  454. 25.67 s gammaloop-nextest-python-api> ┌────────────────────────────────────────────────────────┐
  455. 25.67 s gammaloop-nextest-python-api> │ You are running a restricted Symbolica instance. │
  456. 25.67 s gammaloop-nextest-python-api> │ │
  457. 25.67 s gammaloop-nextest-python-api> │ This mode is only permitted for non-commercial use and │
  458. 25.67 s gammaloop-nextest-python-api> │ is limited to one instance and core per machine. │
  459. 25.67 s gammaloop-nextest-python-api> │ │
  460. 25.67 s gammaloop-nextest-python-api> │ Hobbyists can easily acquire a free license key │
  461. 25.67 s gammaloop-nextest-python-api> │ that unlocks all cores and removes this banner: │
  462. 25.67 s gammaloop-nextest-python-api> │ │
  463. 25.67 s gammaloop-nextest-python-api> │ from symbolica import * │
  464. 25.67 s gammaloop-nextest-python-api> │ request_hobbyist_license('YOUR_NAME', 'YOUR_EMAIL') │
  465. 25.67 s gammaloop-nextest-python-api> │ │
  466. 25.67 s gammaloop-nextest-python-api> │ All other users can obtain a free 30-day trial key: │
  467. 25.67 s gammaloop-nextest-python-api> │ │
  468. 25.67 s gammaloop-nextest-python-api> │ from symbolica import * │
  469. 25.67 s gammaloop-nextest-python-api> │ request_trial_license('NAME', 'EMAIL', 'EMPLOYER') │
  470. 25.67 s gammaloop-nextest-python-api> │ │
  471. 25.67 s gammaloop-nextest-python-api> │ See https://symbolica.io/docs/get_started.html#license │
  472. 25.67 s gammaloop-nextest-python-api> └────────────────────────────────────────────────────────┘
  473. 25.67 s gammaloop-nextest-python-api> ┌───────────────────────────────────────────────────────────────────────────────────────────────────────────┐
  474. 25.67 s gammaloop-nextest-python-api> │ Cannot start new unlicensed Symbolica instance since there is already another one running on the machine. │
  475. 25.67 s gammaloop-nextest-python-api> └───────────────────────────────────────────────────────────────────────────────────────────────────────────┘
  476. 25.67 s gammaloop-nextest-python-api>
  477. 25.67 s gammaloop-nextest-python-api> stderr:
  478. 25.67 s gammaloop-nextest-python-api> ┌───────────────────────────────────┐
  479. 25.67 s gammaloop-nextest-python-api> │ The Symbolica license has expired │
  480. 25.67 s gammaloop-nextest-python-api> └───────────────────────────────────┘
  481. 25.67 s gammaloop-nextest-python-api>
  482. 25.67 s gammaloop-nextest-python-api>
  483. 25.67 s gammaloop-nextest-python-api> Location:
  484. 25.67 s gammaloop-nextest-python-api> tests/tests/test_python_api.rs:156:20
  485. 25.67 s gammaloop-nextest-python-api> system-out
  486. 25.67 s gammaloop-nextest-python-api> running 1 test
  487. 25.67 s gammaloop-nextest-python-api> test python_evaluate_sample_honors_generate_events_and_observable_snapshots ... FAILED
  488. 25.67 s gammaloop-nextest-python-api>
  489. 25.67 s gammaloop-nextest-python-api> failures:
  490. 25.67 s gammaloop-nextest-python-api>
  491. 25.67 s gammaloop-nextest-python-api> failures:
  492. 25.67 s gammaloop-nextest-python-api> python_evaluate_sample_honors_generate_events_and_observable_snapshots
  493. 25.67 s gammaloop-nextest-python-api>
  494. 25.67 s gammaloop-nextest-python-api> test result: FAILED. 0 passed; 1 failed; 0 ignored; 0 measured; 4 filtered out; finished in 0.11s
  495. 25.67 s gammaloop-nextest-python-api> system-err
  496. 25.67 s gammaloop-nextest-python-api> Error: Python API test subprocess failed.
  497. 25.67 s gammaloop-nextest-python-api> stdout:
  498. 25.67 s gammaloop-nextest-python-api> ┌────────────────────────────────────────────────────────┐
  499. 25.67 s gammaloop-nextest-python-api> │ You are running a restricted Symbolica instance. │
  500. 25.67 s gammaloop-nextest-python-api> │ │
  501. 25.67 s gammaloop-nextest-python-api> │ This mode is only permitted for non-commercial use and │
  502. 25.67 s gammaloop-nextest-python-api> │ is limited to one instance and core per machine. │
  503. 25.67 s gammaloop-nextest-python-api> │ │
  504. 25.67 s gammaloop-nextest-python-api> │ Hobbyists can easily acquire a free license key │
  505. 25.67 s gammaloop-nextest-python-api> │ that unlocks all cores and removes this banner: │
  506. 25.67 s gammaloop-nextest-python-api> │ │
  507. 25.67 s gammaloop-nextest-python-api> │ from symbolica import * │
  508. 25.67 s gammaloop-nextest-python-api> │ request_hobbyist_license('YOUR_NAME', 'YOUR_EMAIL') │
  509. 25.67 s gammaloop-nextest-python-api> │ │
  510. 25.67 s gammaloop-nextest-python-api> │ All other users can obtain a free 30-day trial key: │
  511. 25.67 s gammaloop-nextest-python-api> │ │
  512. 25.67 s gammaloop-nextest-python-api> │ from symbolica import * │
  513. 25.67 s gammaloop-nextest-python-api> │ request_trial_license('NAME', 'EMAIL', 'EMPLOYER') │
  514. 25.67 s gammaloop-nextest-python-api> │ │
  515. 25.67 s gammaloop-nextest-python-api> │ See https://symbolica.io/docs/get_started.html#license │
  516. 25.67 s gammaloop-nextest-python-api> └────────────────────────────────────────────────────────┘
  517. 25.67 s gammaloop-nextest-python-api> ┌───────────────────────────────────────────────────────────────────────────────────────────────────────────┐
  518. 25.67 s gammaloop-nextest-python-api> │ Cannot start new unlicensed Symbolica instance since there is already another one running on the machine. │
  519. 25.67 s gammaloop-nextest-python-api> └───────────────────────────────────────────────────────────────────────────────────────────────────────────┘
  520. 25.67 s gammaloop-nextest-python-api>
  521. 25.67 s gammaloop-nextest-python-api> stderr:
  522. 25.67 s gammaloop-nextest-python-api> ┌───────────────────────────────────┐
  523. 25.67 s gammaloop-nextest-python-api> │ The Symbolica license has expired │
  524. 25.67 s gammaloop-nextest-python-api> └───────────────────────────────────┘
  525. 25.67 s gammaloop-nextest-python-api>
  526. 25.67 s gammaloop-nextest-python-api>
  527. 25.67 s gammaloop-nextest-python-api> Location:
  528. 25.67 s gammaloop-nextest-python-api> tests/tests/test_python_api.rs:156:20
  529. 25.67 s gammaloop-nextest-python-api>
  530. 25.67 s gammaloop-nextest-python-api> 2. gammaloop-integration-tests::test_python_api::python_session_getters_return_live_toml_and_command_blocks
  531. 25.67 s gammaloop-nextest-python-api> failure: test failure with exit code 101
  532. 25.67 s gammaloop-nextest-python-api> Error: Python API test subprocess failed.
  533. 25.67 s gammaloop-nextest-python-api> stdout:
  534. 25.67 s gammaloop-nextest-python-api> ┌────────────────────────────────────────────────────────┐
  535. 25.67 s gammaloop-nextest-python-api> │ You are running a restricted Symbolica instance. │
  536. 25.67 s gammaloop-nextest-python-api> │ │
  537. 25.67 s gammaloop-nextest-python-api> │ This mode is only permitted for non-commercial use and │
  538. 25.67 s gammaloop-nextest-python-api> │ is limited to one instance and core per machine. │
  539. 25.67 s gammaloop-nextest-python-api> │ │
  540. 25.67 s gammaloop-nextest-python-api> │ Hobbyists can easily acquire a free license key │
  541. 25.67 s gammaloop-nextest-python-api> │ that unlocks all cores and removes this banner: │
  542. 25.67 s gammaloop-nextest-python-api> │ │
  543. 25.67 s gammaloop-nextest-python-api> │ from symbolica import * │
  544. 25.67 s gammaloop-nextest-python-api> │ request_hobbyist_license('YOUR_NAME', 'YOUR_EMAIL') │
  545. 25.67 s gammaloop-nextest-python-api> │ │
  546. 25.67 s gammaloop-nextest-python-api> │ All other users can obtain a free 30-day trial key: │
  547. 25.67 s gammaloop-nextest-python-api> │ │
  548. 25.67 s gammaloop-nextest-python-api> │ from symbolica import * │
  549. 25.67 s gammaloop-nextest-python-api> │ request_trial_license('NAME', 'EMAIL', 'EMPLOYER') │
  550. 25.67 s gammaloop-nextest-python-api> │ │
  551. 25.67 s gammaloop-nextest-python-api> │ See https://symbolica.io/docs/get_started.html#license │
  552. 25.67 s gammaloop-nextest-python-api> └────────────────────────────────────────────────────────┘
  553. 25.67 s gammaloop-nextest-python-api> ┌───────────────────────────────────────────────────────────────────────────────────────────────────────────┐
  554. 25.67 s gammaloop-nextest-python-api> │ Cannot start new unlicensed Symbolica instance since there is already another one running on the machine. │
  555. 25.67 s gammaloop-nextest-python-api> └───────────────────────────────────────────────────────────────────────────────────────────────────────────┘
  556. 25.67 s gammaloop-nextest-python-api>
  557. 25.67 s gammaloop-nextest-python-api> stderr:
  558. 25.67 s gammaloop-nextest-python-api> ┌───────────────────────────────────┐
  559. 25.67 s gammaloop-nextest-python-api> │ The Symbolica license has expired │
  560. 25.67 s gammaloop-nextest-python-api> └───────────────────────────────────┘
  561. 25.67 s gammaloop-nextest-python-api>
  562. 25.67 s gammaloop-nextest-python-api>
  563. 25.67 s gammaloop-nextest-python-api> Location:
  564. 25.67 s gammaloop-nextest-python-api> tests/tests/test_python_api.rs:156:20
  565. 25.67 s gammaloop-nextest-python-api> system-out
  566. 25.67 s gammaloop-nextest-python-api> running 1 test
  567. 25.67 s gammaloop-nextest-python-api> test python_session_getters_return_live_toml_and_command_blocks ... FAILED
  568. 25.67 s gammaloop-nextest-python-api>
  569. 25.67 s gammaloop-nextest-python-api> failures:
  570. 25.67 s gammaloop-nextest-python-api>
  571. 25.67 s gammaloop-nextest-python-api> failures:
  572. 25.67 s gammaloop-nextest-python-api> python_session_getters_return_live_toml_and_command_blocks
  573. 25.67 s gammaloop-nextest-python-api>
  574. 25.67 s gammaloop-nextest-python-api> test result: FAILED. 0 passed; 1 failed; 0 ignored; 0 measured; 4 filtered out; finished in 0.11s
  575. 25.67 s gammaloop-nextest-python-api> system-err
  576. 25.67 s gammaloop-nextest-python-api> Error: Python API test subprocess failed.
  577. 25.67 s gammaloop-nextest-python-api> stdout:
  578. 25.67 s gammaloop-nextest-python-api> ┌────────────────────────────────────────────────────────┐
  579. 25.67 s gammaloop-nextest-python-api> │ You are running a restricted Symbolica instance. │
  580. 25.67 s gammaloop-nextest-python-api> │ │
  581. 25.67 s gammaloop-nextest-python-api> │ This mode is only permitted for non-commercial use and │
  582. 25.67 s gammaloop-nextest-python-api> │ is limited to one instance and core per machine. │
  583. 25.67 s gammaloop-nextest-python-api> │ │
  584. 25.67 s gammaloop-nextest-python-api> │ Hobbyists can easily acquire a free license key │
  585. 25.67 s gammaloop-nextest-python-api> │ that unlocks all cores and removes this banner: │
  586. 25.67 s gammaloop-nextest-python-api> │ │
  587. 25.67 s gammaloop-nextest-python-api> │ from symbolica import * │
  588. 25.67 s gammaloop-nextest-python-api> │ request_hobbyist_license('YOUR_NAME', 'YOUR_EMAIL') │
  589. 25.67 s gammaloop-nextest-python-api> │ │
  590. 25.67 s gammaloop-nextest-python-api> │ All other users can obtain a free 30-day trial key: │
  591. 25.67 s gammaloop-nextest-python-api> │ │
  592. 25.67 s gammaloop-nextest-python-api> │ from symbolica import * │
  593. 25.67 s gammaloop-nextest-python-api> │ request_trial_license('NAME', 'EMAIL', 'EMPLOYER') │
  594. 25.67 s gammaloop-nextest-python-api> │ │
  595. 25.67 s gammaloop-nextest-python-api> │ See https://symbolica.io/docs/get_started.html#license │
  596. 25.67 s gammaloop-nextest-python-api> └────────────────────────────────────────────────────────┘
  597. 25.67 s gammaloop-nextest-python-api> ┌───────────────────────────────────────────────────────────────────────────────────────────────────────────┐
  598. 25.67 s gammaloop-nextest-python-api> │ Cannot start new unlicensed Symbolica instance since there is already another one running on the machine. │
  599. 25.67 s gammaloop-nextest-python-api> └───────────────────────────────────────────────────────────────────────────────────────────────────────────┘
  600. 25.67 s gammaloop-nextest-python-api>
  601. 25.67 s gammaloop-nextest-python-api> stderr:
  602. 25.67 s gammaloop-nextest-python-api> ┌───────────────────────────────────┐
  603. 25.67 s gammaloop-nextest-python-api> │ The Symbolica license has expired │
  604. 25.67 s gammaloop-nextest-python-api> └───────────────────────────────────┘
  605. 25.67 s gammaloop-nextest-python-api>
  606. 25.67 s gammaloop-nextest-python-api>
  607. 25.67 s gammaloop-nextest-python-api> Location:
  608. 25.67 s gammaloop-nextest-python-api> tests/tests/test_python_api.rs:156:20
  609. 25.67 s gammaloop-nextest-python-api>
  610. 25.67 s gammaloop-nextest-python-api> 3. gammaloop-integration-tests::test_python_api::python_evaluate_samples_batch_and_momentum_space_have_expected_shape
  611. 25.67 s gammaloop-nextest-python-api> failure: test failure with exit code 101
  612. 25.67 s gammaloop-nextest-python-api> Error: Python API test subprocess failed.
  613. 25.67 s gammaloop-nextest-python-api> stdout:
  614. 25.67 s gammaloop-nextest-python-api> ┌────────────────────────────────────────────────────────┐
  615. 25.67 s gammaloop-nextest-python-api> │ You are running a restricted Symbolica instance. │
  616. 25.67 s gammaloop-nextest-python-api> │ │
  617. 25.67 s gammaloop-nextest-python-api> │ This mode is only permitted for non-commercial use and │
  618. 25.67 s gammaloop-nextest-python-api> │ is limited to one instance and core per machine. │
  619. 25.67 s gammaloop-nextest-python-api> │ │
  620. 25.67 s gammaloop-nextest-python-api> │ Hobbyists can easily acquire a free license key │
  621. 25.67 s gammaloop-nextest-python-api> │ that unlocks all cores and removes this banner: │
  622. 25.67 s gammaloop-nextest-python-api> │ │
  623. 25.67 s gammaloop-nextest-python-api> │ from symbolica import * │
  624. 25.67 s gammaloop-nextest-python-api> │ request_hobbyist_license('YOUR_NAME', 'YOUR_EMAIL') │
  625. 25.67 s gammaloop-nextest-python-api> │ │
  626. 25.67 s gammaloop-nextest-python-api> │ All other users can obtain a free 30-day trial key: │
  627. 25.67 s gammaloop-nextest-python-api> │ │
  628. 25.67 s gammaloop-nextest-python-api> │ from symbolica import * │
  629. 25.67 s gammaloop-nextest-python-api> │ request_trial_license('NAME', 'EMAIL', 'EMPLOYER') │
  630. 25.67 s gammaloop-nextest-python-api> │ │
  631. 25.67 s gammaloop-nextest-python-api> │ See https://symbolica.io/docs/get_started.html#license │
  632. 25.67 s gammaloop-nextest-python-api> └────────────────────────────────────────────────────────┘
  633. 25.67 s gammaloop-nextest-python-api> ┌───────────────────────────────────────────────────────────────────────────────────────────────────────────┐
  634. 25.68 s gammaloop-nextest-python-api> │ Cannot start new unlicensed Symbolica instance since there is already another one running on the machine. │
  635. 25.68 s gammaloop-nextest-python-api> └───────────────────────────────────────────────────────────────────────────────────────────────────────────┘
  636. 25.68 s gammaloop-nextest-python-api>
  637. 25.68 s gammaloop-nextest-python-api> stderr:
  638. 25.68 s gammaloop-nextest-python-api> ┌───────────────────────────────────┐
  639. 25.68 s gammaloop-nextest-python-api> │ The Symbolica license has expired │
  640. 25.68 s gammaloop-nextest-python-api> └───────────────────────────────────┘
  641. 25.68 s gammaloop-nextest-python-api>
  642. 25.68 s gammaloop-nextest-python-api>
  643. 25.68 s gammaloop-nextest-python-api> Location:
  644. 25.68 s gammaloop-nextest-python-api> tests/tests/test_python_api.rs:156:20
  645. 25.68 s gammaloop-nextest-python-api> system-out
  646. 25.68 s gammaloop-nextest-python-api> running 1 test
  647. 25.68 s gammaloop-nextest-python-api> test python_evaluate_samples_batch_and_momentum_space_have_expected_shape ... FAILED
  648. 25.68 s gammaloop-nextest-python-api>
  649. 25.68 s gammaloop-nextest-python-api> failures:
  650. 25.68 s gammaloop-nextest-python-api>
  651. 25.68 s gammaloop-nextest-python-api> failures:
  652. 25.68 s gammaloop-nextest-python-api> python_evaluate_samples_batch_and_momentum_space_have_expected_shape
  653. 25.68 s gammaloop-nextest-python-api>
  654. 25.68 s gammaloop-nextest-python-api> test result: FAILED. 0 passed; 1 failed; 0 ignored; 0 measured; 4 filtered out; finished in 0.11s
  655. 25.68 s gammaloop-nextest-python-api> system-err
  656. 25.68 s gammaloop-nextest-python-api> Error: Python API test subprocess failed.
  657. 25.68 s gammaloop-nextest-python-api> stdout:
  658. 25.68 s gammaloop-nextest-python-api> ┌────────────────────────────────────────────────────────┐
  659. 25.68 s gammaloop-nextest-python-api> │ You are running a restricted Symbolica instance. │
  660. 25.68 s gammaloop-nextest-python-api> │ │
  661. 25.68 s gammaloop-nextest-python-api> │ This mode is only permitted for non-commercial use and │
  662. 25.68 s gammaloop-nextest-python-api> │ is limited to one instance and core per machine. │
  663. 25.68 s gammaloop-nextest-python-api> │ │
  664. 25.68 s gammaloop-nextest-python-api> │ Hobbyists can easily acquire a free license key │
  665. 25.68 s gammaloop-nextest-python-api> │ that unlocks all cores and removes this banner: │
  666. 25.68 s gammaloop-nextest-python-api> │ │
  667. 25.68 s gammaloop-nextest-python-api> │ from symbolica import * │
  668. 25.68 s gammaloop-nextest-python-api> │ request_hobbyist_license('YOUR_NAME', 'YOUR_EMAIL') │
  669. 25.68 s gammaloop-nextest-python-api> │ │
  670. 25.68 s gammaloop-nextest-python-api> │ All other users can obtain a free 30-day trial key: │
  671. 25.68 s gammaloop-nextest-python-api> │ │
  672. 25.68 s gammaloop-nextest-python-api> │ from symbolica import * │
  673. 25.68 s gammaloop-nextest-python-api> │ request_trial_license('NAME', 'EMAIL', 'EMPLOYER') │
  674. 25.68 s gammaloop-nextest-python-api> │ │
  675. 25.68 s gammaloop-nextest-python-api> │ See https://symbolica.io/docs/get_started.html#license │
  676. 25.68 s gammaloop-nextest-python-api> └────────────────────────────────────────────────────────┘
  677. 25.68 s gammaloop-nextest-python-api> ┌───────────────────────────────────────────────────────────────────────────────────────────────────────────┐
  678. 25.68 s gammaloop-nextest-python-api> │ Cannot start new unlicensed Symbolica instance since there is already another one running on the machine. │
  679. 25.68 s gammaloop-nextest-python-api> └───────────────────────────────────────────────────────────────────────────────────────────────────────────┘
  680. 25.68 s gammaloop-nextest-python-api>
  681. 25.68 s gammaloop-nextest-python-api> stderr:
  682. 25.68 s gammaloop-nextest-python-api> ┌───────────────────────────────────┐
  683. 25.68 s gammaloop-nextest-python-api> │ The Symbolica license has expired │
  684. 25.68 s gammaloop-nextest-python-api> └───────────────────────────────────┘
  685. 25.68 s gammaloop-nextest-python-api>
  686. 25.68 s gammaloop-nextest-python-api>
  687. 25.68 s gammaloop-nextest-python-api> Location:
  688. 25.68 s gammaloop-nextest-python-api> tests/tests/test_python_api.rs:156:20
  689. 25.68 s gammaloop-nextest-python-api>
  690. 25.68 s gammaloop-nextest-python-api> 4. gammaloop-integration-tests::test_python_api::python_evaluate_sample_preserves_graph_grouping_and_incoming_pdgs
  691. 25.68 s gammaloop-nextest-python-api> failure: test failure with exit code 101
  692. 25.68 s gammaloop-nextest-python-api> Error: Python API test subprocess failed.
  693. 25.68 s gammaloop-nextest-python-api> stdout:
  694. 25.68 s gammaloop-nextest-python-api> ┌────────────────────────────────────────────────────────┐
  695. 25.68 s gammaloop-nextest-python-api> │ You are running a restricted Symbolica instance. │
  696. 25.68 s gammaloop-nextest-python-api> │ │
  697. 25.68 s gammaloop-nextest-python-api> │ This mode is only permitted for non-commercial use and │
  698. 25.68 s gammaloop-nextest-python-api> │ is limited to one instance and core per machine. │
  699. 25.68 s gammaloop-nextest-python-api> │ │
  700. 25.68 s gammaloop-nextest-python-api> │ Hobbyists can easily acquire a free license key │
  701. 25.68 s gammaloop-nextest-python-api> │ that unlocks all cores and removes this banner: │
  702. 25.68 s gammaloop-nextest-python-api> │ │
  703. 25.68 s gammaloop-nextest-python-api> │ from symbolica import * │
  704. 25.68 s gammaloop-nextest-python-api> │ request_hobbyist_license('YOUR_NAME', 'YOUR_EMAIL') │
  705. 25.68 s gammaloop-nextest-python-api> │ │
  706. 25.68 s gammaloop-nextest-python-api> │ All other users can obtain a free 30-day trial key: │
  707. 25.68 s gammaloop-nextest-python-api> │ │
  708. 25.68 s gammaloop-nextest-python-api> │ from symbolica import * │
  709. 25.68 s gammaloop-nextest-python-api> │ request_trial_license('NAME', 'EMAIL', 'EMPLOYER') │
  710. 25.68 s gammaloop-nextest-python-api> │ │
  711. 25.68 s gammaloop-nextest-python-api> │ See https://symbolica.io/docs/get_started.html#license │
  712. 25.68 s gammaloop-nextest-python-api> └────────────────────────────────────────────────────────┘
  713. 25.68 s gammaloop-nextest-python-api> ┌───────────────────────────────────────────────────────────────────────────────────────────────────────────┐
  714. 25.68 s gammaloop-nextest-python-api> │ Cannot start new unlicensed Symbolica instance since there is already another one running on the machine. │
  715. 25.68 s gammaloop-nextest-python-api> └───────────────────────────────────────────────────────────────────────────────────────────────────────────┘
  716. 25.68 s gammaloop-nextest-python-api>
  717. 25.68 s gammaloop-nextest-python-api> stderr:
  718. 25.68 s gammaloop-nextest-python-api> ┌───────────────────────────────────┐
  719. 25.68 s gammaloop-nextest-python-api> │ The Symbolica license has expired │
  720. 25.68 s gammaloop-nextest-python-api> └───────────────────────────────────┘
  721. 25.68 s gammaloop-nextest-python-api>
  722. 25.68 s gammaloop-nextest-python-api>
  723. 25.68 s gammaloop-nextest-python-api> Location:
  724. 25.68 s gammaloop-nextest-python-api> tests/tests/test_python_api.rs:156:20
  725. 25.68 s gammaloop-nextest-python-api> system-out
  726. 25.68 s gammaloop-nextest-python-api> running 1 test
  727. 25.68 s gammaloop-nextest-python-api> test python_evaluate_sample_preserves_graph_grouping_and_incoming_pdgs ... FAILED
  728. 25.68 s gammaloop-nextest-python-api>
  729. 25.68 s gammaloop-nextest-python-api> failures:
  730. 25.68 s gammaloop-nextest-python-api>
  731. 25.68 s gammaloop-nextest-python-api> failures:
  732. 25.68 s gammaloop-nextest-python-api> python_evaluate_sample_preserves_graph_grouping_and_incoming_pdgs
  733. 25.68 s gammaloop-nextest-python-api>
  734. 25.68 s gammaloop-nextest-python-api> test result: FAILED. 0 passed; 1 failed; 0 ignored; 0 measured; 4 filtered out; finished in 0.12s
  735. 25.68 s gammaloop-nextest-python-api> system-err
  736. 25.68 s gammaloop-nextest-python-api> Error: Python API test subprocess failed.
  737. 25.68 s gammaloop-nextest-python-api> stdout:
  738. 25.68 s gammaloop-nextest-python-api> ┌────────────────────────────────────────────────────────┐
  739. 25.68 s gammaloop-nextest-python-api> │ You are running a restricted Symbolica instance. │
  740. 25.68 s gammaloop-nextest-python-api> │ │
  741. 25.68 s gammaloop-nextest-python-api> │ This mode is only permitted for non-commercial use and │
  742. 25.68 s gammaloop-nextest-python-api> │ is limited to one instance and core per machine. │
  743. 25.68 s gammaloop-nextest-python-api> │ │
  744. 25.68 s gammaloop-nextest-python-api> │ Hobbyists can easily acquire a free license key │
  745. 25.68 s gammaloop-nextest-python-api> │ that unlocks all cores and removes this banner: │
  746. 25.68 s gammaloop-nextest-python-api> │ │
  747. 25.68 s gammaloop-nextest-python-api> │ from symbolica import * │
  748. 25.68 s gammaloop-nextest-python-api> │ request_hobbyist_license('YOUR_NAME', 'YOUR_EMAIL') │
  749. 25.68 s gammaloop-nextest-python-api> │ │
  750. 25.68 s gammaloop-nextest-python-api> │ All other users can obtain a free 30-day trial key: │
  751. 25.68 s gammaloop-nextest-python-api> │ │
  752. 25.68 s gammaloop-nextest-python-api> │ from symbolica import * │
  753. 25.68 s gammaloop-nextest-python-api> │ request_trial_license('NAME', 'EMAIL', 'EMPLOYER') │
  754. 25.68 s gammaloop-nextest-python-api> │ │
  755. 25.68 s gammaloop-nextest-python-api> │ See https://symbolica.io/docs/get_started.html#license │
  756. 25.68 s gammaloop-nextest-python-api> └────────────────────────────────────────────────────────┘
  757. 25.68 s gammaloop-nextest-python-api> ┌───────────────────────────────────────────────────────────────────────────────────────────────────────────┐
  758. 25.68 s gammaloop-nextest-python-api> │ Cannot start new unlicensed Symbolica instance since there is already another one running on the machine. │
  759. 25.68 s gammaloop-nextest-python-api> └───────────────────────────────────────────────────────────────────────────────────────────────────────────┘
  760. 25.68 s gammaloop-nextest-python-api>
  761. 25.68 s gammaloop-nextest-python-api> stderr:
  762. 25.68 s gammaloop-nextest-python-api> ┌───────────────────────────────────┐
  763. 25.68 s gammaloop-nextest-python-api> │ The Symbolica license has expired │
  764. 25.68 s gammaloop-nextest-python-api> └───────────────────────────────────┘
  765. 25.68 s gammaloop-nextest-python-api>
  766. 25.68 s gammaloop-nextest-python-api>
  767. 25.68 s gammaloop-nextest-python-api> Location:
  768. 25.68 s gammaloop-nextest-python-api> tests/tests/test_python_api.rs:156:20
  769. 25.68 s gammaloop-nextest-python-api> =========================================
  770. 25.74 s error: Cannot build '/nix/store/4kzj98b1f7qqfwnhzqhxbvk8wv98rki0-gammaloop-nextest-python-api.drv'.
  771. 25.74 s Reason: builder failed with exit code 100.
  772. 25.74 s Output paths:
  773. 25.74 s /nix/store/zfhrsd28wys0w08nx237s3nizrjwhwhz-gammaloop-nextest-python-api
  774. 25.74 s Last 717 log lines:
  775. 25.74 s > Extracting 1 binary, 1 build script output directory, and 3 linked paths to /build/source
  776. 25.74 s > Extracted 18 files to /build/source in 0.06s
  777. 25.74 s > ------------
  778. 25.74 s > Nextest run ID c5d6ee22-b173-4e37-8fef-e81ba10b532a with nextest profile: ci_gammaloop
  779. 25.74 s > Starting 5 tests across 1 binary
  780. 25.74 s > FAIL [ 0.112s] (1/5) gammaloop-integration-tests::test_python_api python_evaluate_sample_honors_generate_events_and_observable_snapshots
  781. 25.74 s > stdout ---
  782. 25.74 s >
  783. 25.74 s > running 1 test
  784. 25.74 s > test python_evaluate_sample_honors_generate_events_and_observable_snapshots ... FAILED
  785. 25.74 s >
  786. 25.74 s > failures:
  787. 25.74 s >
  788. 25.74 s > failures:
  789. 25.74 s > python_evaluate_sample_honors_generate_events_and_observable_snapshots
  790. 25.74 s >
  791. 25.74 s > test result: FAILED. 0 passed; 1 failed; 0 ignored; 0 measured; 4 filtered out; finished in 0.11s
  792. 25.74 s >
  793. 25.74 s > stderr ---
  794. 25.74 s > Error: Python API test subprocess failed.
  795. 25.74 s > stdout:
  796. 25.74 s > ┌────────────────────────────────────────────────────────┐
  797. 25.74 s > │ You are running a restricted Symbolica instance. │
  798. 25.74 s > │ │
  799. 25.74 s > │ This mode is only permitted for non-commercial use and │
  800. 25.74 s > │ is limited to one instance and core per machine. │
  801. 25.74 s > │ │
  802. 25.74 s > │ Hobbyists can easily acquire a free license key │
  803. 25.74 s > │ that unlocks all cores and removes this banner: │
  804. 25.74 s > │ │
  805. 25.74 s > │ from symbolica import * │
  806. 25.74 s > │ request_hobbyist_license('YOUR_NAME', 'YOUR_EMAIL') │
  807. 25.74 s > │ │
  808. 25.74 s > │ All other users can obtain a free 30-day trial key: │
  809. 25.74 s > │ │
  810. 25.74 s > │ from symbolica import * │
  811. 25.74 s > │ request_trial_license('NAME', 'EMAIL', 'EMPLOYER') │
  812. 25.74 s > │ │
  813. 25.74 s > │ See https://symbolica.io/docs/get_started.html#license │
  814. 25.74 s > └────────────────────────────────────────────────────────┘
  815. 25.74 s > ┌───────────────────────────────────────────────────────────────────────────────────────────────────────────┐
  816. 25.74 s > │ Cannot start new unlicensed Symbolica instance since there is already another one running on the machine. │
  817. 25.74 s > └───────────────────────────────────────────────────────────────────────────────────────────────────────────┘
  818. 25.74 s >
  819. 25.74 s > stderr:
  820. 25.74 s > ┌───────────────────────────────────┐
  821. 25.74 s > │ The Symbolica license has expired │
  822. 25.74 s > └───────────────────────────────────┘
  823. 25.74 s >
  824. 25.74 s >
  825. 25.74 s > Location:
  826. 25.74 s > tests/tests/test_python_api.rs:156:20
  827. 25.74 s >
  828. 25.74 s > FAIL [ 0.112s] (2/5) gammaloop-integration-tests::test_python_api python_session_getters_return_live_toml_and_command_blocks
  829. 25.74 s > stdout ---
  830. 25.74 s >
  831. 25.74 s > running 1 test
  832. 25.74 s > test python_session_getters_return_live_toml_and_command_blocks ... FAILED
  833. 25.74 s >
  834. 25.74 s > failures:
  835. 25.74 s >
  836. 25.74 s > failures:
  837. 25.74 s > python_session_getters_return_live_toml_and_command_blocks
  838. 25.74 s >
  839. 25.74 s > test result: FAILED. 0 passed; 1 failed; 0 ignored; 0 measured; 4 filtered out; finished in 0.11s
  840. 25.74 s >
  841. 25.74 s > stderr ---
  842. 25.74 s > Error: Python API test subprocess failed.
  843. 25.74 s > stdout:
  844. 25.74 s > ┌────────────────────────────────────────────────────────┐
  845. 25.74 s > │ You are running a restricted Symbolica instance. │
  846. 25.74 s > │ │
  847. 25.74 s > │ This mode is only permitted for non-commercial use and │
  848. 25.74 s > │ is limited to one instance and core per machine. │
  849. 25.74 s > │ │
  850. 25.74 s > │ Hobbyists can easily acquire a free license key │
  851. 25.74 s > │ that unlocks all cores and removes this banner: │
  852. 25.74 s > │ │
  853. 25.74 s > │ from symbolica import * │
  854. 25.74 s > │ request_hobbyist_license('YOUR_NAME', 'YOUR_EMAIL') │
  855. 25.74 s > │ │
  856. 25.74 s > │ All other users can obtain a free 30-day trial key: │
  857. 25.74 s > │ │
  858. 25.74 s > │ from symbolica import * │
  859. 25.74 s > │ request_trial_license('NAME', 'EMAIL', 'EMPLOYER') │
  860. 25.74 s > │ │
  861. 25.74 s > │ See https://symbolica.io/docs/get_started.html#license │
  862. 25.74 s > └────────────────────────────────────────────────────────┘
  863. 25.74 s > ┌───────────────────────────────────────────────────────────────────────────────────────────────────────────┐
  864. 25.74 s > │ Cannot start new unlicensed Symbolica instance since there is already another one running on the machine. │
  865. 25.74 s > └───────────────────────────────────────────────────────────────────────────────────────────────────────────┘
  866. 25.74 s >
  867. 25.74 s > stderr:
  868. 25.74 s > ┌───────────────────────────────────┐
  869. 25.74 s > │ The Symbolica license has expired │
  870. 25.74 s > └───────────────────────────────────┘
  871. 25.74 s >
  872. 25.74 s >
  873. 25.74 s > Location:
  874. 25.74 s > tests/tests/test_python_api.rs:156:20
  875. 25.74 s >
  876. 25.74 s > FAIL [ 0.112s] (3/5) gammaloop-integration-tests::test_python_api python_evaluate_samples_batch_and_momentum_space_have_expected_shape
  877. 25.74 s > stdout ---
  878. 25.74 s >
  879. 25.74 s > running 1 test
  880. 25.74 s > test python_evaluate_samples_batch_and_momentum_space_have_expected_shape ... FAILED
  881. 25.74 s >
  882. 25.74 s > failures:
  883. 25.74 s >
  884. 25.74 s > failures:
  885. 25.74 s > python_evaluate_samples_batch_and_momentum_space_have_expected_shape
  886. 25.74 s >
  887. 25.74 s > test result: FAILED. 0 passed; 1 failed; 0 ignored; 0 measured; 4 filtered out; finished in 0.11s
  888. 25.74 s >
  889. 25.74 s > stderr ---
  890. 25.74 s > Error: Python API test subprocess failed.
  891. 25.74 s > stdout:
  892. 25.74 s > ┌────────────────────────────────────────────────────────┐
  893. 25.74 s > │ You are running a restricted Symbolica instance. │
  894. 25.74 s > │ │
  895. 25.74 s > │ This mode is only permitted for non-commercial use and │
  896. 25.74 s > │ is limited to one instance and core per machine. │
  897. 25.74 s > │ │
  898. 25.74 s > │ Hobbyists can easily acquire a free license key │
  899. 25.74 s > │ that unlocks all cores and removes this banner: │
  900. 25.74 s > │ │
  901. 25.74 s > │ from symbolica import * │
  902. 25.74 s > │ request_hobbyist_license('YOUR_NAME', 'YOUR_EMAIL') │
  903. 25.74 s > │ │
  904. 25.74 s > │ All other users can obtain a free 30-day trial key: │
  905. 25.74 s > │ │
  906. 25.74 s > │ from symbolica import * │
  907. 25.74 s > │ request_trial_license('NAME', 'EMAIL', 'EMPLOYER') │
  908. 25.74 s > │ │
  909. 25.74 s > │ See https://symbolica.io/docs/get_started.html#license │
  910. 25.74 s > └────────────────────────────────────────────────────────┘
  911. 25.74 s > ┌───────────────────────────────────────────────────────────────────────────────────────────────────────────┐
  912. 25.74 s > │ Cannot start new unlicensed Symbolica instance since there is already another one running on the machine. │
  913. 25.74 s > └───────────────────────────────────────────────────────────────────────────────────────────────────────────┘
  914. 25.74 s >
  915. 25.74 s > stderr:
  916. 25.74 s > ┌───────────────────────────────────┐
  917. 25.74 s > │ The Symbolica license has expired │
  918. 25.74 s > └───────────────────────────────────┘
  919. 25.74 s >
  920. 25.74 s >
  921. 25.74 s > Location:
  922. 25.74 s > tests/tests/test_python_api.rs:156:20
  923. 25.74 s >
  924. 25.74 s > FAIL [ 0.120s] (4/5) gammaloop-integration-tests::test_python_api python_evaluate_sample_preserves_graph_grouping_and_incoming_pdgs
  925. 25.74 s > stdout ---
  926. 25.74 s >
  927. 25.74 s > running 1 test
  928. 25.74 s > test python_evaluate_sample_preserves_graph_grouping_and_incoming_pdgs ... FAILED
  929. 25.74 s >
  930. 25.74 s > failures:
  931. 25.74 s >
  932. 25.74 s > failures:
  933. 25.74 s > python_evaluate_sample_preserves_graph_grouping_and_incoming_pdgs
  934. 25.74 s >
  935. 25.74 s > test result: FAILED. 0 passed; 1 failed; 0 ignored; 0 measured; 4 filtered out; finished in 0.12s
  936. 25.74 s >
  937. 25.74 s > stderr ---
  938. 25.74 s > Error: Python API test subprocess failed.
  939. 25.74 s > stdout:
  940. 25.74 s > ┌────────────────────────────────────────────────────────┐
  941. 25.74 s > │ You are running a restricted Symbolica instance. │
  942. 25.74 s > │ │
  943. 25.74 s > │ This mode is only permitted for non-commercial use and │
  944. 25.74 s > │ is limited to one instance and core per machine. │
  945. 25.74 s > │ │
  946. 25.74 s > │ Hobbyists can easily acquire a free license key │
  947. 25.74 s > │ that unlocks all cores and removes this banner: │
  948. 25.74 s > │ │
  949. 25.74 s > │ from symbolica import * │
  950. 25.74 s > │ request_hobbyist_license('YOUR_NAME', 'YOUR_EMAIL') │
  951. 25.74 s > │ │
  952. 25.74 s > │ All other users can obtain a free 30-day trial key: │
  953. 25.74 s > │ │
  954. 25.74 s > │ from symbolica import * │
  955. 25.74 s > │ request_trial_license('NAME', 'EMAIL', 'EMPLOYER') │
  956. 25.74 s > │ │
  957. 25.74 s > │ See https://symbolica.io/docs/get_started.html#license │
  958. 25.74 s > └────────────────────────────────────────────────────────┘
  959. 25.74 s > ┌───────────────────────────────────────────────────────────────────────────────────────────────────────────┐
  960. 25.74 s > │ Cannot start new unlicensed Symbolica instance since there is already another one running on the machine. │
  961. 25.74 s > └───────────────────────────────────────────────────────────────────────────────────────────────────────────┘
  962. 25.74 s >
  963. 25.74 s > stderr:
  964. 25.74 s > ┌───────────────────────────────────┐
  965. 25.74 s > │ The Symbolica license has expired │
  966. 25.74 s > └───────────────────────────────────┘
  967. 25.74 s >
  968. 25.74 s >
  969. 25.74 s > Location:
  970. 25.74 s > tests/tests/test_python_api.rs:156:20
  971. 25.74 s >
  972. 25.74 s > ------------
  973. 25.74 s > Summary [ 0.282s] 5 tests run: 1 passed, 4 failed, 0 skipped
  974. 25.74 s > FAIL [ 0.112s] (1/5) gammaloop-integration-tests::test_python_api python_evaluate_sample_honors_generate_events_and_observable_snapshots
  975. 25.74 s > stdout ---
  976. 25.74 s >
  977. 25.74 s > running 1 test
  978. 25.74 s > test python_evaluate_sample_honors_generate_events_and_observable_snapshots ... FAILED
  979. 25.74 s >
  980. 25.74 s > failures:
  981. 25.74 s >
  982. 25.74 s > failures:
  983. 25.74 s > python_evaluate_sample_honors_generate_events_and_observable_snapshots
  984. 25.74 s >
  985. 25.74 s > test result: FAILED. 0 passed; 1 failed; 0 ignored; 0 measured; 4 filtered out; finished in 0.11s
  986. 25.74 s >
  987. 25.74 s > stderr ---
  988. 25.74 s > Error: Python API test subprocess failed.
  989. 25.74 s > stdout:
  990. 25.74 s > ┌────────────────────────────────────────────────────────┐
  991. 25.74 s > │ You are running a restricted Symbolica instance. │
  992. 25.74 s > │ │
  993. 25.74 s > │ This mode is only permitted for non-commercial use and │
  994. 25.74 s > │ is limited to one instance and core per machine. │
  995. 25.74 s > │ │
  996. 25.74 s > │ Hobbyists can easily acquire a free license key │
  997. 25.74 s > │ that unlocks all cores and removes this banner: │
  998. 25.74 s > │ │
  999. 25.74 s > │ from symbolica import * │
  1000. 25.74 s > │ request_hobbyist_license('YOUR_NAME', 'YOUR_EMAIL') │
  1001. 25.74 s > │ │
  1002. 25.74 s > │ All other users can obtain a free 30-day trial key: │
  1003. 25.74 s > │ │
  1004. 25.74 s > │ from symbolica import * │
  1005. 25.74 s > │ request_trial_license('NAME', 'EMAIL', 'EMPLOYER') │
  1006. 25.74 s > │ │
  1007. 25.74 s > │ See https://symbolica.io/docs/get_started.html#license │
  1008. 25.74 s > └────────────────────────────────────────────────────────┘
  1009. 25.74 s > ┌───────────────────────────────────────────────────────────────────────────────────────────────────────────┐
  1010. 25.74 s > │ Cannot start new unlicensed Symbolica instance since there is already another one running on the machine. │
  1011. 25.74 s > └───────────────────────────────────────────────────────────────────────────────────────────────────────────┘
  1012. 25.74 s >
  1013. 25.74 s > stderr:
  1014. 25.74 s > ┌───────────────────────────────────┐
  1015. 25.74 s > │ The Symbolica license has expired │
  1016. 25.74 s > └───────────────────────────────────┘
  1017. 25.74 s >
  1018. 25.74 s >
  1019. 25.74 s > Location:
  1020. 25.74 s > tests/tests/test_python_api.rs:156:20
  1021. 25.74 s >
  1022. 25.74 s > FAIL [ 0.112s] (2/5) gammaloop-integration-tests::test_python_api python_session_getters_return_live_toml_and_command_blocks
  1023. 25.74 s > stdout ---
  1024. 25.74 s >
  1025. 25.74 s > running 1 test
  1026. 25.74 s > test python_session_getters_return_live_toml_and_command_blocks ... FAILED
  1027. 25.74 s >
  1028. 25.74 s > failures:
  1029. 25.74 s >
  1030. 25.74 s > failures:
  1031. 25.74 s > python_session_getters_return_live_toml_and_command_blocks
  1032. 25.74 s >
  1033. 25.74 s > test result: FAILED. 0 passed; 1 failed; 0 ignored; 0 measured; 4 filtered out; finished in 0.11s
  1034. 25.74 s >
  1035. 25.74 s > stderr ---
  1036. 25.74 s > Error: Python API test subprocess failed.
  1037. 25.74 s > stdout:
  1038. 25.74 s > ┌────────────────────────────────────────────────────────┐
  1039. 25.74 s > │ You are running a restricted Symbolica instance. │
  1040. 25.74 s > │ │
  1041. 25.74 s > │ This mode is only permitted for non-commercial use and │
  1042. 25.74 s > │ is limited to one instance and core per machine. │
  1043. 25.74 s > │ │
  1044. 25.74 s > │ Hobbyists can easily acquire a free license key │
  1045. 25.74 s > │ that unlocks all cores and removes this banner: │
  1046. 25.74 s > │ │
  1047. 25.74 s > │ from symbolica import * │
  1048. 25.74 s > │ request_hobbyist_license('YOUR_NAME', 'YOUR_EMAIL') │
  1049. 25.74 s > │ │
  1050. 25.74 s > │ All other users can obtain a free 30-day trial key: │
  1051. 25.74 s > │ │
  1052. 25.74 s > │ from symbolica import * │
  1053. 25.74 s > │ request_trial_license('NAME', 'EMAIL', 'EMPLOYER') │
  1054. 25.74 s > │ │
  1055. 25.74 s > │ See https://symbolica.io/docs/get_started.html#license │
  1056. 25.74 s > └────────────────────────────────────────────────────────┘
  1057. 25.74 s > ┌───────────────────────────────────────────────────────────────────────────────────────────────────────────┐
  1058. 25.74 s > │ Cannot start new unlicensed Symbolica instance since there is already another one running on the machine. │
  1059. 25.74 s > └───────────────────────────────────────────────────────────────────────────────────────────────────────────┘
  1060. 25.74 s >
  1061. 25.74 s > stderr:
  1062. 25.74 s > ┌───────────────────────────────────┐
  1063. 25.74 s > │ The Symbolica license has expired │
  1064. 25.74 s > └───────────────────────────────────┘
  1065. 25.74 s >
  1066. 25.74 s >
  1067. 25.74 s > Location:
  1068. 25.74 s > tests/tests/test_python_api.rs:156:20
  1069. 25.74 s >
  1070. 25.74 s > FAIL [ 0.112s] (3/5) gammaloop-integration-tests::test_python_api python_evaluate_samples_batch_and_momentum_space_have_expected_shape
  1071. 25.74 s > stdout ---
  1072. 25.74 s >
  1073. 25.74 s > running 1 test
  1074. 25.74 s > test python_evaluate_samples_batch_and_momentum_space_have_expected_shape ... FAILED
  1075. 25.74 s >
  1076. 25.74 s > failures:
  1077. 25.74 s >
  1078. 25.74 s > failures:
  1079. 25.74 s > python_evaluate_samples_batch_and_momentum_space_have_expected_shape
  1080. 25.74 s >
  1081. 25.74 s > test result: FAILED. 0 passed; 1 failed; 0 ignored; 0 measured; 4 filtered out; finished in 0.11s
  1082. 25.74 s >
  1083. 25.74 s > stderr ---
  1084. 25.74 s > Error: Python API test subprocess failed.
  1085. 25.74 s > stdout:
  1086. 25.74 s > ┌────────────────────────────────────────────────────────┐
  1087. 25.74 s > │ You are running a restricted Symbolica instance. │
  1088. 25.74 s > │ │
  1089. 25.74 s > │ This mode is only permitted for non-commercial use and │
  1090. 25.74 s > │ is limited to one instance and core per machine. │
  1091. 25.74 s > │ │
  1092. 25.74 s > │ Hobbyists can easily acquire a free license key │
  1093. 25.74 s > │ that unlocks all cores and removes this banner: │
  1094. 25.74 s > │ │
  1095. 25.74 s > │ from symbolica import * │
  1096. 25.74 s > │ request_hobbyist_license('YOUR_NAME', 'YOUR_EMAIL') │
  1097. 25.74 s > │ │
  1098. 25.74 s > │ All other users can obtain a free 30-day trial key: │
  1099. 25.74 s > │ │
  1100. 25.74 s > │ from symbolica import * │
  1101. 25.74 s > │ request_trial_license('NAME', 'EMAIL', 'EMPLOYER') │
  1102. 25.74 s > │ │
  1103. 25.74 s > │ See https://symbolica.io/docs/get_started.html#license │
  1104. 25.74 s > └────────────────────────────────────────────────────────┘
  1105. 25.74 s > ┌───────────────────────────────────────────────────────────────────────────────────────────────────────────┐
  1106. 25.74 s > │ Cannot start new unlicensed Symbolica instance since there is already another one running on the machine. │
  1107. 25.74 s > └───────────────────────────────────────────────────────────────────────────────────────────────────────────┘
  1108. 25.74 s >
  1109. 25.74 s > stderr:
  1110. 25.74 s > ┌───────────────────────────────────┐
  1111. 25.74 s > │ The Symbolica license has expired │
  1112. 25.74 s > └───────────────────────────────────┘
  1113. 25.74 s >
  1114. 25.74 s >
  1115. 25.74 s > Location:
  1116. 25.74 s > tests/tests/test_python_api.rs:156:20
  1117. 25.74 s >
  1118. 25.74 s > FAIL [ 0.120s] (4/5) gammaloop-integration-tests::test_python_api python_evaluate_sample_preserves_graph_grouping_and_incoming_pdgs
  1119. 25.74 s > stdout ---
  1120. 25.74 s >
  1121. 25.74 s > running 1 test
  1122. 25.74 s > test python_evaluate_sample_preserves_graph_grouping_and_incoming_pdgs ... FAILED
  1123. 25.74 s >
  1124. 25.74 s > failures:
  1125. 25.74 s >
  1126. 25.74 s > failures:
  1127. 25.74 s > python_evaluate_sample_preserves_graph_grouping_and_incoming_pdgs
  1128. 25.74 s >
  1129. 25.74 s > test result: FAILED. 0 passed; 1 failed; 0 ignored; 0 measured; 4 filtered out; finished in 0.12s
  1130. 25.74 s >
  1131. 25.74 s > stderr ---
  1132. 25.74 s > Error: Python API test subprocess failed.
  1133. 25.74 s > stdout:
  1134. 25.74 s > ┌────────────────────────────────────────────────────────┐
  1135. 25.74 s > │ You are running a restricted Symbolica instance. │
  1136. 25.74 s > │ │
  1137. 25.74 s > │ This mode is only permitted for non-commercial use and │
  1138. 25.74 s > │ is limited to one instance and core per machine. │
  1139. 25.74 s > │ │
  1140. 25.74 s > │ Hobbyists can easily acquire a free license key │
  1141. 25.74 s > │ that unlocks all cores and removes this banner: │
  1142. 25.74 s > │ │
  1143. 25.74 s > │ from symbolica import * │
  1144. 25.74 s > │ request_hobbyist_license('YOUR_NAME', 'YOUR_EMAIL') │
  1145. 25.74 s > │ │
  1146. 25.74 s > │ All other users can obtain a free 30-day trial key: │
  1147. 25.74 s > │ │
  1148. 25.74 s > │ from symbolica import * │
  1149. 25.74 s > │ request_trial_license('NAME', 'EMAIL', 'EMPLOYER') │
  1150. 25.74 s > │ │
  1151. 25.74 s > │ See https://symbolica.io/docs/get_started.html#license │
  1152. 25.74 s > └────────────────────────────────────────────────────────┘
  1153. 25.74 s > ┌───────────────────────────────────────────────────────────────────────────────────────────────────────────┐
  1154. 25.74 s > │ Cannot start new unlicensed Symbolica instance since there is already another one running on the machine. │
  1155. 25.74 s > └───────────────────────────────────────────────────────────────────────────────────────────────────────────┘
  1156. 25.74 s >
  1157. 25.74 s > stderr:
  1158. 25.74 s > ┌───────────────────────────────────┐
  1159. 25.74 s > │ The Symbolica license has expired │
  1160. 25.74 s > └───────────────────────────────────┘
  1161. 25.74 s >
  1162. 25.74 s >
  1163. 25.74 s > Location:
  1164. 25.74 s > tests/tests/test_python_api.rs:156:20
  1165. 25.74 s >
  1166. 25.74 s > error: test run failed
  1167. 25.74 s >
  1168. 25.74 s > ========== nextest test summary ==========
  1169. 25.74 s > report: target/nextest/ci_gammaloop/junit.xml
  1170. 25.74 s > tests: 5, failures: 4, errors: 0
  1171. 25.74 s >
  1172. 25.74 s > 1. gammaloop-integration-tests::test_python_api::python_evaluate_sample_honors_generate_events_and_observable_snapshots
  1173. 25.74 s > failure: test failure with exit code 101
  1174. 25.74 s > Error: Python API test subprocess failed.
  1175. 25.74 s > stdout:
  1176. 25.74 s > ┌────────────────────────────────────────────────────────┐
  1177. 25.74 s > │ You are running a restricted Symbolica instance. │
  1178. 25.74 s > │ │
  1179. 25.74 s > │ This mode is only permitted for non-commercial use and │
  1180. 25.74 s > │ is limited to one instance and core per machine. │
  1181. 25.74 s > │ │
  1182. 25.74 s > │ Hobbyists can easily acquire a free license key │
  1183. 25.74 s > │ that unlocks all cores and removes this banner: │
  1184. 25.74 s > │ │
  1185. 25.74 s > │ from symbolica import * │
  1186. 25.74 s > │ request_hobbyist_license('YOUR_NAME', 'YOUR_EMAIL') │
  1187. 25.74 s > │ │
  1188. 25.74 s > │ All other users can obtain a free 30-day trial key: │
  1189. 25.74 s > │ │
  1190. 25.74 s > │ from symbolica import * │
  1191. 25.74 s > │ request_trial_license('NAME', 'EMAIL', 'EMPLOYER') │
  1192. 25.74 s > │ │
  1193. 25.74 s > │ See https://symbolica.io/docs/get_started.html#license │
  1194. 25.74 s > └────────────────────────────────────────────────────────┘
  1195. 25.74 s > ┌───────────────────────────────────────────────────────────────────────────────────────────────────────────┐
  1196. 25.74 s > │ Cannot start new unlicensed Symbolica instance since there is already another one running on the machine. │
  1197. 25.74 s > └───────────────────────────────────────────────────────────────────────────────────────────────────────────┘
  1198. 25.74 s >
  1199. 25.74 s > stderr:
  1200. 25.74 s > ┌───────────────────────────────────┐
  1201. 25.74 s > │ The Symbolica license has expired │
  1202. 25.74 s > └───────────────────────────────────┘
  1203. 25.74 s >
  1204. 25.74 s >
  1205. 25.74 s > Location:
  1206. 25.74 s > tests/tests/test_python_api.rs:156:20
  1207. 25.74 s > system-out
  1208. 25.74 s > running 1 test
  1209. 25.74 s > test python_evaluate_sample_honors_generate_events_and_observable_snapshots ... FAILED
  1210. 25.74 s >
  1211. 25.74 s > failures:
  1212. 25.74 s >
  1213. 25.74 s > failures:
  1214. 25.74 s > python_evaluate_sample_honors_generate_events_and_observable_snapshots
  1215. 25.74 s >
  1216. 25.74 s > test result: FAILED. 0 passed; 1 failed; 0 ignored; 0 measured; 4 filtered out; finished in 0.11s
  1217. 25.74 s > system-err
  1218. 25.74 s > Error: Python API test subprocess failed.
  1219. 25.74 s > stdout:
  1220. 25.74 s > ┌────────────────────────────────────────────────────────┐
  1221. 25.74 s > │ You are running a restricted Symbolica instance. │
  1222. 25.74 s > │ │
  1223. 25.74 s > │ This mode is only permitted for non-commercial use and │
  1224. 25.74 s > │ is limited to one instance and core per machine. │
  1225. 25.74 s > │ │
  1226. 25.74 s > │ Hobbyists can easily acquire a free license key │
  1227. 25.74 s > │ that unlocks all cores and removes this banner: │
  1228. 25.74 s > │ │
  1229. 25.74 s > │ from symbolica import * │
  1230. 25.74 s > │ request_hobbyist_license('YOUR_NAME', 'YOUR_EMAIL') │
  1231. 25.74 s > │ │
  1232. 25.74 s > │ All other users can obtain a free 30-day trial key: │
  1233. 25.74 s > │ │
  1234. 25.74 s > │ from symbolica import * │
  1235. 25.74 s > │ request_trial_license('NAME', 'EMAIL', 'EMPLOYER') │
  1236. 25.74 s > │ │
  1237. 25.74 s > │ See https://symbolica.io/docs/get_started.html#license │
  1238. 25.74 s > └────────────────────────────────────────────────────────┘
  1239. 25.74 s > ┌───────────────────────────────────────────────────────────────────────────────────────────────────────────┐
  1240. 25.74 s > │ Cannot start new unlicensed Symbolica instance since there is already another one running on the machine. │
  1241. 25.74 s > └───────────────────────────────────────────────────────────────────────────────────────────────────────────┘
  1242. 25.74 s >
  1243. 25.74 s > stderr:
  1244. 25.74 s > ┌───────────────────────────────────┐
  1245. 25.74 s > │ The Symbolica license has expired │
  1246. 25.74 s > └───────────────────────────────────┘
  1247. 25.74 s >
  1248. 25.74 s >
  1249. 25.74 s > Location:
  1250. 25.74 s > tests/tests/test_python_api.rs:156:20
  1251. 25.74 s >
  1252. 25.74 s > 2. gammaloop-integration-tests::test_python_api::python_session_getters_return_live_toml_and_command_blocks
  1253. 25.74 s > failure: test failure with exit code 101
  1254. 25.74 s > Error: Python API test subprocess failed.
  1255. 25.74 s > stdout:
  1256. 25.74 s > ┌────────────────────────────────────────────────────────┐
  1257. 25.74 s > │ You are running a restricted Symbolica instance. │
  1258. 25.74 s > │ │
  1259. 25.74 s > │ This mode is only permitted for non-commercial use and │
  1260. 25.74 s > │ is limited to one instance and core per machine. │
  1261. 25.74 s > │ │
  1262. 25.74 s > │ Hobbyists can easily acquire a free license key │
  1263. 25.74 s > │ that unlocks all cores and removes this banner: │
  1264. 25.74 s > │ │
  1265. 25.74 s > │ from symbolica import * │
  1266. 25.74 s > │ request_hobbyist_license('YOUR_NAME', 'YOUR_EMAIL') │
  1267. 25.74 s > │ │
  1268. 25.74 s > │ All other users can obtain a free 30-day trial key: │
  1269. 25.74 s > │ │
  1270. 25.74 s > │ from symbolica import * │
  1271. 25.74 s > │ request_trial_license('NAME', 'EMAIL', 'EMPLOYER') │
  1272. 25.74 s > │ │
  1273. 25.74 s > │ See https://symbolica.io/docs/get_started.html#license │
  1274. 25.74 s > └────────────────────────────────────────────────────────┘
  1275. 25.74 s > ┌───────────────────────────────────────────────────────────────────────────────────────────────────────────┐
  1276. 25.74 s > │ Cannot start new unlicensed Symbolica instance since there is already another one running on the machine. │
  1277. 25.74 s > └───────────────────────────────────────────────────────────────────────────────────────────────────────────┘
  1278. 25.74 s >
  1279. 25.74 s > stderr:
  1280. 25.74 s > ┌───────────────────────────────────┐
  1281. 25.74 s > │ The Symbolica license has expired │
  1282. 25.74 s > └───────────────────────────────────┘
  1283. 25.74 s >
  1284. 25.74 s >
  1285. 25.74 s > Location:
  1286. 25.74 s > tests/tests/test_python_api.rs:156:20
  1287. 25.74 s > system-out
  1288. 25.74 s > running 1 test
  1289. 25.74 s > test python_session_getters_return_live_toml_and_command_blocks ... FAILED
  1290. 25.74 s >
  1291. 25.74 s > failures:
  1292. 25.74 s >
  1293. 25.74 s > failures:
  1294. 25.74 s > python_session_getters_return_live_toml_and_command_blocks
  1295. 25.74 s >
  1296. 25.74 s > test result: FAILED. 0 passed; 1 failed; 0 ignored; 0 measured; 4 filtered out; finished in 0.11s
  1297. 25.74 s > system-err
  1298. 25.74 s > Error: Python API test subprocess failed.
  1299. 25.74 s > stdout:
  1300. 25.74 s > ┌────────────────────────────────────────────────────────┐
  1301. 25.74 s > │ You are running a restricted Symbolica instance. │
  1302. 25.74 s > │ │
  1303. 25.74 s > │ This mode is only permitted for non-commercial use and │
  1304. 25.74 s > │ is limited to one instance and core per machine. │
  1305. 25.74 s > │ │
  1306. 25.74 s > │ Hobbyists can easily acquire a free license key │
  1307. 25.74 s > │ that unlocks all cores and removes this banner: │
  1308. 25.74 s > │ │
  1309. 25.74 s > │ from symbolica import * │
  1310. 25.74 s > │ request_hobbyist_license('YOUR_NAME', 'YOUR_EMAIL') │
  1311. 25.74 s > │ │
  1312. 25.74 s > │ All other users can obtain a free 30-day trial key: │
  1313. 25.74 s > │ │
  1314. 25.74 s > │ from symbolica import * │
  1315. 25.74 s > │ request_trial_license('NAME', 'EMAIL', 'EMPLOYER') │
  1316. 25.74 s > │ │
  1317. 25.74 s > │ See https://symbolica.io/docs/get_started.html#license │
  1318. 25.74 s > └────────────────────────────────────────────────────────┘
  1319. 25.74 s > ┌───────────────────────────────────────────────────────────────────────────────────────────────────────────┐
  1320. 25.74 s > │ Cannot start new unlicensed Symbolica instance since there is already another one running on the machine. │
  1321. 25.74 s > └───────────────────────────────────────────────────────────────────────────────────────────────────────────┘
  1322. 25.74 s >
  1323. 25.74 s > stderr:
  1324. 25.74 s > ┌───────────────────────────────────┐
  1325. 25.74 s > │ The Symbolica license has expired │
  1326. 25.74 s > └───────────────────────────────────┘
  1327. 25.74 s >
  1328. 25.74 s >
  1329. 25.74 s > Location:
  1330. 25.74 s > tests/tests/test_python_api.rs:156:20
  1331. 25.74 s >
  1332. 25.74 s > 3. gammaloop-integration-tests::test_python_api::python_evaluate_samples_batch_and_momentum_space_have_expected_shape
  1333. 25.74 s > failure: test failure with exit code 101
  1334. 25.74 s > Error: Python API test subprocess failed.
  1335. 25.74 s > stdout:
  1336. 25.74 s > ┌────────────────────────────────────────────────────────┐
  1337. 25.74 s > │ You are running a restricted Symbolica instance. │
  1338. 25.74 s > │ │
  1339. 25.74 s > │ This mode is only permitted for non-commercial use and │
  1340. 25.74 s > │ is limited to one instance and core per machine. │
  1341. 25.74 s > │ │
  1342. 25.74 s > │ Hobbyists can easily acquire a free license key │
  1343. 25.74 s > │ that unlocks all cores and removes this banner: │
  1344. 25.74 s > │ │
  1345. 25.74 s > │ from symbolica import * │
  1346. 25.74 s > │ request_hobbyist_license('YOUR_NAME', 'YOUR_EMAIL') │
  1347. 25.74 s > │ │
  1348. 25.74 s > │ All other users can obtain a free 30-day trial key: │
  1349. 25.74 s > │ │
  1350. 25.74 s > │ from symbolica import * │
  1351. 25.74 s > │ request_trial_license('NAME', 'EMAIL', 'EMPLOYER') │
  1352. 25.74 s > │ │
  1353. 25.74 s > │ See https://symbolica.io/docs/get_started.html#license │
  1354. 25.74 s > └────────────────────────────────────────────────────────┘
  1355. 25.74 s > ┌───────────────────────────────────────────────────────────────────────────────────────────────────────────┐
  1356. 25.74 s > │ Cannot start new unlicensed Symbolica instance since there is already another one running on the machine. │
  1357. 25.74 s > └───────────────────────────────────────────────────────────────────────────────────────────────────────────┘
  1358. 25.74 s >
  1359. 25.74 s > stderr:
  1360. 25.74 s > ┌───────────────────────────────────┐
  1361. 25.74 s > │ The Symbolica license has expired │
  1362. 25.74 s > └───────────────────────────────────┘
  1363. 25.74 s >
  1364. 25.74 s >
  1365. 25.74 s > Location:
  1366. 25.74 s > tests/tests/test_python_api.rs:156:20
  1367. 25.74 s > system-out
  1368. 25.74 s > running 1 test
  1369. 25.74 s > test python_evaluate_samples_batch_and_momentum_space_have_expected_shape ... FAILED
  1370. 25.74 s >
  1371. 25.74 s > failures:
  1372. 25.74 s >
  1373. 25.74 s > failures:
  1374. 25.74 s > python_evaluate_samples_batch_and_momentum_space_have_expected_shape
  1375. 25.74 s >
  1376. 25.74 s > test result: FAILED. 0 passed; 1 failed; 0 ignored; 0 measured; 4 filtered out; finished in 0.11s
  1377. 25.74 s > system-err
  1378. 25.74 s > Error: Python API test subprocess failed.
  1379. 25.74 s > stdout:
  1380. 25.74 s > ┌────────────────────────────────────────────────────────┐
  1381. 25.74 s > │ You are running a restricted Symbolica instance. │
  1382. 25.74 s > │ │
  1383. 25.74 s > │ This mode is only permitted for non-commercial use and │
  1384. 25.74 s > │ is limited to one instance and core per machine. │
  1385. 25.74 s > │ │
  1386. 25.74 s > │ Hobbyists can easily acquire a free license key │
  1387. 25.74 s > │ that unlocks all cores and removes this banner: │
  1388. 25.74 s > │ │
  1389. 25.74 s > │ from symbolica import * │
  1390. 25.74 s > │ request_hobbyist_license('YOUR_NAME', 'YOUR_EMAIL') │
  1391. 25.74 s > │ │
  1392. 25.74 s > │ All other users can obtain a free 30-day trial key: │
  1393. 25.74 s > │ │
  1394. 25.74 s > │ from symbolica import * │
  1395. 25.74 s > │ request_trial_license('NAME', 'EMAIL', 'EMPLOYER') │
  1396. 25.74 s > │ │
  1397. 25.74 s > │ See https://symbolica.io/docs/get_started.html#license │
  1398. 25.74 s > └────────────────────────────────────────────────────────┘
  1399. 25.74 s > ┌───────────────────────────────────────────────────────────────────────────────────────────────────────────┐
  1400. 25.74 s > │ Cannot start new unlicensed Symbolica instance since there is already another one running on the machine. │
  1401. 25.74 s > └───────────────────────────────────────────────────────────────────────────────────────────────────────────┘
  1402. 25.74 s >
  1403. 25.74 s > stderr:
  1404. 25.74 s > ┌───────────────────────────────────┐
  1405. 25.74 s > │ The Symbolica license has expired │
  1406. 25.74 s > └───────────────────────────────────┘
  1407. 25.74 s >
  1408. 25.74 s >
  1409. 25.74 s > Location:
  1410. 25.74 s > tests/tests/test_python_api.rs:156:20
  1411. 25.74 s >
  1412. 25.74 s > 4. gammaloop-integration-tests::test_python_api::python_evaluate_sample_preserves_graph_grouping_and_incoming_pdgs
  1413. 25.74 s > failure: test failure with exit code 101
  1414. 25.74 s > Error: Python API test subprocess failed.
  1415. 25.74 s > stdout:
  1416. 25.74 s > ┌────────────────────────────────────────────────────────┐
  1417. 25.74 s > │ You are running a restricted Symbolica instance. │
  1418. 25.74 s > │ │
  1419. 25.74 s > │ This mode is only permitted for non-commercial use and │
  1420. 25.74 s > │ is limited to one instance and core per machine. │
  1421. 25.74 s > │ │
  1422. 25.74 s > │ Hobbyists can easily acquire a free license key │
  1423. 25.74 s > │ that unlocks all cores and removes this banner: │
  1424. 25.74 s > │ │
  1425. 25.74 s > │ from symbolica import * │
  1426. 25.74 s > │ request_hobbyist_license('YOUR_NAME', 'YOUR_EMAIL') │
  1427. 25.74 s > │ │
  1428. 25.74 s > │ All other users can obtain a free 30-day trial key: │
  1429. 25.74 s > │ │
  1430. 25.74 s > │ from symbolica import * │
  1431. 25.74 s > │ request_trial_license('NAME', 'EMAIL', 'EMPLOYER') │
  1432. 25.74 s > │ │
  1433. 25.74 s > │ See https://symbolica.io/docs/get_started.html#license │
  1434. 25.74 s > └────────────────────────────────────────────────────────┘
  1435. 25.74 s > ┌───────────────────────────────────────────────────────────────────────────────────────────────────────────┐
  1436. 25.74 s > │ Cannot start new unlicensed Symbolica instance since there is already another one running on the machine. │
  1437. 25.74 s > └───────────────────────────────────────────────────────────────────────────────────────────────────────────┘
  1438. 25.74 s >
  1439. 25.74 s > stderr:
  1440. 25.74 s > ┌───────────────────────────────────┐
  1441. 25.74 s > │ The Symbolica license has expired │
  1442. 25.74 s > └───────────────────────────────────┘
  1443. 25.74 s >
  1444. 25.74 s >
  1445. 25.74 s > Location:
  1446. 25.74 s > tests/tests/test_python_api.rs:156:20
  1447. 25.74 s > system-out
  1448. 25.74 s > running 1 test
  1449. 25.74 s > test python_evaluate_sample_preserves_graph_grouping_and_incoming_pdgs ... FAILED
  1450. 25.74 s >
  1451. 25.74 s > failures:
  1452. 25.74 s >
  1453. 25.74 s > failures:
  1454. 25.74 s > python_evaluate_sample_preserves_graph_grouping_and_incoming_pdgs
  1455. 25.74 s >
  1456. 25.74 s > test result: FAILED. 0 passed; 1 failed; 0 ignored; 0 measured; 4 filtered out; finished in 0.12s
  1457. 25.74 s > system-err
  1458. 25.74 s > Error: Python API test subprocess failed.
  1459. 25.74 s > stdout:
  1460. 25.74 s > ┌────────────────────────────────────────────────────────┐
  1461. 25.74 s > │ You are running a restricted Symbolica instance. │
  1462. 25.74 s > │ │
  1463. 25.74 s > │ This mode is only permitted for non-commercial use and │
  1464. 25.74 s > │ is limited to one instance and core per machine. │
  1465. 25.74 s > │ │
  1466. 25.74 s > │ Hobbyists can easily acquire a free license key │
  1467. 25.74 s > │ that unlocks all cores and removes this banner: │
  1468. 25.74 s > │ │
  1469. 25.74 s > │ from symbolica import * │
  1470. 25.74 s > │ request_hobbyist_license('YOUR_NAME', 'YOUR_EMAIL') │
  1471. 25.74 s > │ │
  1472. 25.74 s > │ All other users can obtain a free 30-day trial key: │
  1473. 25.74 s > │ │
  1474. 25.74 s > │ from symbolica import * │
  1475. 25.74 s > │ request_trial_license('NAME', 'EMAIL', 'EMPLOYER') │
  1476. 25.74 s > │ │
  1477. 25.74 s > │ See https://symbolica.io/docs/get_started.html#license │
  1478. 25.74 s > └────────────────────────────────────────────────────────┘
  1479. 25.74 s > ┌───────────────────────────────────────────────────────────────────────────────────────────────────────────┐
  1480. 25.74 s > │ Cannot start new unlicensed Symbolica instance since there is already another one running on the machine. │
  1481. 25.74 s > └───────────────────────────────────────────────────────────────────────────────────────────────────────────┘
  1482. 25.74 s >
  1483. 25.74 s > stderr:
  1484. 25.74 s > ┌───────────────────────────────────┐
  1485. 25.74 s > │ The Symbolica license has expired │
  1486. 25.74 s > └───────────────────────────────────┘
  1487. 25.74 s >
  1488. 25.74 s >
  1489. 25.74 s > Location:
  1490. 25.74 s > tests/tests/test_python_api.rs:156:20
  1491. 25.74 s > =========================================
  1492. 25.74 s For full logs, run:
  1493. 25.74 s nix log /nix/store/4kzj98b1f7qqfwnhzqhxbvk8wv98rki0-gammaloop-nextest-python-api.drv
  1494. 25.85 s [2 built (1 failed), 12 Run failed.