1. 0.46 s $ /nix/store/9ypz3flqsrl5xl495mm8h645gadjsxi1-coreutils-9.11/bin/timeout --kill-after=15s 7200s /nix/store/23zk8sgzamrbmj1fday15szf7f2279s8-nix-2.34.7/bin/nix --extra-experimental-features nix-command --extra-experimental-features flakes flake clone git+https://github.com/alphal00p/gammaloop --dest /tmp/nix-ci-worker/stable-pwd/repo/
  2. 0.80 s Cloning into '/tmp/nix-ci-worker/stable-pwd/repo'...
  3. 0.80 s remote: Enumerating objects: 62149, done.
  4. 0.94 s remote: Counting objects: 0% (1/7163) remote: Counting objects: 1% (72/7163) remote: Counting objects: 2% (144/7163) remote: Counting objects: 3% (215/7163) remote: Counting objects: 4% (287/7163) remote: Counting objects: 5% (359/7163) remote: Counting objects: 6% (430/7163) remote: Counting objects: 7% (502/7163) remote: Counting objects: 8% (574/7163) remote: Counting objects: 9% (645/7163) remote: Counting objects: 10% (717/7163) remote: Counting objects: 11% (788/7163) remote: Counting objects: 12% (860/7163) remote: Counting objects: 13% (932/7163) remote: Counting objects: 14% (1003/7163) remote: Counting objects: 15% (1075/7163) remote: Counting objects: 16% (1147/7163) remote: Counting objects: 17% (1218/7163) remote: Counting objects: 18% (1290/7163) remote: Counting objects: 19% (1361/7163) remote: Counting objects: 20% (1433/7163) remote: Counting objects: 21% (1505/7163) remote: Counting objects: 22% (1576/7163) remote: Counting objects: 23% (1648/7163) remote: Counting objects: 24% (1720/7163) remote: Counting objects: 25% (1791/7163) remote: Counting objects: 26% (1863/7163) remote: Counting objects: 27% (1935/7163) remote: Counting objects: 28% (2006/7163) remote: Counting objects: 29% (2078/7163) remote: Counting objects: 30% (2149/7163) remote: Counting objects: 31% (2221/7163) remote: Counting objects: 32% (2293/7163) remote: Counting objects: 33% (2364/7163) remote: Counting objects: 34% (2436/7163) remote: Counting objects: 35% (2508/7163) remote: Counting objects: 36% (2579/7163) remote: Counting objects: 37% (2651/7163) remote: Counting objects: 38% (2722/7163) remote: Counting objects: 39% (2794/7163) remote: Counting objects: 40% (2866/7163) remote: Counting objects: 41% (2937/7163) remote: Counting objects: 42% (3009/7163) remote: Counting objects: 43% (3081/7163) remote: Counting objects: 44% (3152/7163) remote: Counting objects: 45% (3224/7163) remote: Counting objects: 46% (3295/7163) remote: Counting objects: 47% (3367/7163) remote: Counting objects: 48% (3439/7163) remote: Counting objects: 49% (3510/7163) remote: Counting objects: 50% (3582/7163) remote: Counting objects: 51% (3654/7163) remote: Counting objects: 52% (3725/7163) remote: Counting objects: 53% (3797/7163) remote: Counting objects: 54% (3869/7163) remote: Counting objects: 55% (3940/7163) remote: Counting objects: 56% (4012/7163) remote: Counting objects: 57% (4083/7163) remote: Counting objects: 58% (4155/7163) remote: Counting objects: 59% (4227/7163) remote: Counting objects: 60% (4298/7163) remote: Counting objects: 61% (4370/7163) remote: Counting objects: 62% (4442/7163) remote: Counting objects: 63% (4513/7163) remote: Counting objects: 64% (4585/7163) remote: Counting objects: 65% (4656/7163) remote: Counting objects: 66% (4728/7163) remote: Counting objects: 67% (4800/7163) remote: Counting objects: 68% (4871/7163) remote: Counting objects: 69% (4943/7163) remote: Counting objects: 70% (5015/7163) remote: Counting objects: 71% (5086/7163) remote: Counting objects: 72% (5158/7163) remote: Counting objects: 73% (5229/7163) remote: Counting objects: 74% (5301/7163) remote: Counting objects: 75% (5373/7163) remote: Counting objects: 76% (5444/7163) remote: Counting objects: 77% (5516/7163) remote: Counting objects: 78% (5588/7163) remote: Counting objects: 79% (5659/7163) remote: Counting objects: 80% (5731/7163) remote: Counting objects: 81% (5803/7163) remote: Counting objects: 82% (5874/7163) remote: Counting objects: 83% (5946/7163) remote: Counting objects: 84% (6017/7163) remote: Counting objects: 85% (6089/7163) remote: Counting objects: 86% (6161/7163) remote: Counting objects: 87% (6232/7163) remote: Counting objects: 88% (6304/7163) remote: Counting objects: 89% (6376/7163) remote: Counting objects: 90% (6447/7163) remote: Counting objects: 91% (6519/7163) remote: Counting objects: 92% (6590/7163) remote: Counting objects: 93% (6662/7163) remote: Counting objects: 94% (6734/7163) remote: Counting objects: 95% (6805/7163) remote: Counting objects: 96% (6877/7163) remote: Counting objects: 97% (6949/7163) remote: Counting objects: 98% (7020/7163) remote: Counting objects: 99% (7092/7163) remote: Counting objects: 100% (7163/7163) remote: Counting objects: 100% (7163/7163), done.
  5. 2.16 s remote: Compressing objects: 0% (1/1381) remote: Compressing objects: 1% (14/1381) remote: Compressing objects: 2% (28/1381) remote: Compressing objects: 3% (42/1381) remote: Compressing objects: 4% (56/1381) remote: Compressing objects: 5% (70/1381) remote: Compressing objects: 6% (83/1381) remote: Compressing objects: 7% (97/1381) remote: Compressing objects: 8% (111/1381) remote: Compressing objects: 9% (125/1381) remote: Compressing objects: 10% (139/1381) remote: Compressing objects: 11% (152/1381) remote: Compressing objects: 12% (166/1381) remote: Compressing objects: 13% (180/1381) remote: Compressing objects: 14% (194/1381) remote: Compressing objects: 15% (208/1381) remote: Compressing objects: 16% (221/1381) remote: Compressing objects: 16% (234/1381) remote: Compressing objects: 17% (235/1381) remote: Compressing objects: 18% (249/1381) remote: Compressing objects: 19% (263/1381) remote: Compressing objects: 20% (277/1381) remote: Compressing objects: 21% (291/1381) remote: Compressing objects: 22% (304/1381) remote: Compressing objects: 23% (318/1381) remote: Compressing objects: 24% (332/1381) remote: Compressing objects: 25% (346/1381) remote: Compressing objects: 26% (360/1381) remote: Compressing objects: 27% (373/1381) remote: Compressing objects: 28% (387/1381) remote: Compressing objects: 29% (401/1381) remote: Compressing objects: 30% (415/1381) remote: Compressing objects: 31% (429/1381) remote: Compressing objects: 32% (442/1381) remote: Compressing objects: 33% (456/1381) remote: Compressing objects: 34% (470/1381) remote: Compressing objects: 35% (484/1381) remote: Compressing objects: 36% (498/1381) remote: Compressing objects: 37% (511/1381) remote: Compressing objects: 38% (525/1381) remote: Compressing objects: 39% (539/1381) remote: Compressing objects: 40% (553/1381) remote: Compressing objects: 41% (567/1381) remote: Compressing objects: 42% (581/1381) remote: Compressing objects: 43% (594/1381) remote: Compressing objects: 44% (608/1381) remote: Compressing objects: 45% (622/1381) remote: Compressing objects: 46% (636/1381) remote: Compressing objects: 47% (650/1381) remote: Compressing objects: 48% (663/1381) remote: Compressing objects: 49% (677/1381) remote: Compressing objects: 50% (691/1381) remote: Compressing objects: 51% (705/1381) remote: Compressing objects: 52% (719/1381) remote: Compressing objects: 53% (732/1381) remote: Compressing objects: 54% (746/1381) remote: Compressing objects: 55% (760/1381) remote: Compressing objects: 56% (774/1381) remote: Compressing objects: 57% (788/1381) remote: Compressing objects: 58% (801/1381) remote: Compressing objects: 59% (815/1381) remote: Compressing objects: 60% (829/1381) remote: Compressing objects: 61% (843/1381) remote: Compressing objects: 62% (857/1381) remote: Compressing objects: 63% (871/1381) remote: Compressing objects: 64% (884/1381) remote: Compressing objects: 65% (898/1381) remote: Compressing objects: 66% (912/1381) remote: Compressing objects: 67% (926/1381) remote: Compressing objects: 68% (940/1381) remote: Compressing objects: 69% (953/1381) remote: Compressing objects: 70% (967/1381) remote: Compressing objects: 71% (981/1381) remote: Compressing objects: 72% (995/1381) remote: Compressing objects: 73% (1009/1381) remote: Compressing objects: 74% (1022/1381) remote: Compressing objects: 75% (1036/1381) remote: Compressing objects: 76% (1050/1381) remote: Compressing objects: 77% (1064/1381) remote: Compressing objects: 78% (1078/1381) remote: Compressing objects: 79% (1091/1381) remote: Compressing objects: 80% (1105/1381) remote: Compressing objects: 81% (1119/1381) remote: Compressing objects: 82% (1133/1381) remote: Compressing objects: 83% (1147/1381) remote: Compressing objects: 84% (1161/1381) remote: Compressing objects: 85% (1174/1381) remote: Compressing objects: 86% (1188/1381) remote: Compressing objects: 87% (1202/1381) remote: Compressing objects: 88% (1216/1381) remote: Compressing objects: 89% (1230/1381) remote: Compressing objects: 90% (1243/1381) remote: Compressing objects: 91% (1257/1381) remote: Compressing objects: 92% (1271/1381) remote: Compressing objects: 93% (1285/1381) remote: Compressing objects: 94% (1299/1381) remote: Compressing objects: 95% (1312/1381) remote: Compressing objects: 96% (1326/1381) remote: Compressing objects: 97% (1340/1381) remote: Compressing objects: 98% (1354/1381) remote: Compressing objects: 99% (1368/1381) remote: Compressing objects: 100% (1381/1381) remote: Compressing objects: 100% (1381/1381), done.
  6. 4.68 s Receiving objects: 0% (1/62149) Receiving objects: 1% (622/62149) Receiving objects: 2% (1243/62149) Receiving objects: 3% (1865/62149) Receiving objects: 4% (2486/62149) Receiving objects: 5% (3108/62149) Receiving objects: 6% (3729/62149) Receiving objects: 7% (4351/62149) Receiving objects: 8% (4972/62149) Receiving objects: 9% (5594/62149) Receiving objects: 10% (6215/62149) Receiving objects: 11% (6837/62149) Receiving objects: 12% (7458/62149) Receiving objects: 13% (8080/62149) Receiving objects: 14% (8701/62149) Receiving objects: 15% (9323/62149) Receiving objects: 16% (9944/62149) Receiving objects: 17% (10566/62149) Receiving objects: 18% (11187/62149) Receiving objects: 19% (11809/62149) Receiving objects: 20% (12430/62149), 15.87 MiB | 31.73 MiB/s Receiving objects: 21% (13052/62149), 15.87 MiB | 31.73 MiB/s Receiving objects: 22% (13673/62149), 15.87 MiB | 31.73 MiB/s Receiving objects: 23% (14295/62149), 15.87 MiB | 31.73 MiB/s Receiving objects: 24% (14916/62149), 15.87 MiB | 31.73 MiB/s Receiving objects: 25% (15538/62149), 15.87 MiB | 31.73 MiB/s Receiving objects: 26% (16159/62149), 15.87 MiB | 31.73 MiB/s Receiving objects: 27% (16781/62149), 15.87 MiB | 31.73 MiB/s Receiving objects: 28% (17402/62149), 15.87 MiB | 31.73 MiB/s Receiving objects: 29% (18024/62149), 15.87 MiB | 31.73 MiB/s Receiving objects: 30% (18645/62149), 15.87 MiB | 31.73 MiB/s Receiving objects: 31% (19267/62149), 15.87 MiB | 31.73 MiB/s Receiving objects: 32% (19888/62149), 15.87 MiB | 31.73 MiB/s Receiving objects: 33% (20510/62149), 15.87 MiB | 31.73 MiB/s Receiving objects: 34% (21131/62149), 15.87 MiB | 31.73 MiB/s Receiving objects: 35% (21753/62149), 15.87 MiB | 31.73 MiB/s Receiving objects: 36% (22374/62149), 15.87 MiB | 31.73 MiB/s Receiving objects: 37% (22996/62149), 15.87 MiB | 31.73 MiB/s Receiving objects: 38% (23617/62149), 15.87 MiB | 31.73 MiB/s Receiving objects: 39% (24239/62149), 15.87 MiB | 31.73 MiB/s Receiving objects: 40% (24860/62149), 15.87 MiB | 31.73 MiB/s Receiving objects: 41% (25482/62149), 15.87 MiB | 31.73 MiB/s Receiving objects: 42% (26103/62149), 15.87 MiB | 31.73 MiB/s Receiving objects: 43% (26725/62149), 15.87 MiB | 31.73 MiB/s Receiving objects: 44% (27346/62149), 15.87 MiB | 31.73 MiB/s Receiving objects: 45% (27968/62149), 15.87 MiB | 31.73 MiB/s Receiving objects: 46% (28589/62149), 15.87 MiB | 31.73 MiB/s Receiving objects: 47% (29211/62149), 15.87 MiB | 31.73 MiB/s Receiving objects: 48% (29832/62149), 15.87 MiB | 31.73 MiB/s Receiving objects: 49% (30454/62149), 15.87 MiB | 31.73 MiB/s Receiving objects: 50% (31075/62149), 15.87 MiB | 31.73 MiB/s Receiving objects: 51% (31696/62149), 15.87 MiB | 31.73 MiB/s Receiving objects: 52% (32318/62149), 15.87 MiB | 31.73 MiB/s Receiving objects: 53% (32939/62149), 15.87 MiB | 31.73 MiB/s Receiving objects: 54% (33561/62149), 15.87 MiB | 31.73 MiB/s Receiving objects: 55% (34182/62149), 15.87 MiB | 31.73 MiB/s Receiving objects: 56% (34804/62149), 15.87 MiB | 31.73 MiB/s Receiving objects: 57% (35425/62149), 15.87 MiB | 31.73 MiB/s Receiving objects: 58% (36047/62149), 15.87 MiB | 31.73 MiB/s Receiving objects: 58% (36089/62149), 37.34 MiB | 36.65 MiB/s Receiving objects: 59% (36668/62149), 37.34 MiB | 36.65 MiB/s Receiving objects: 60% (37290/62149), 37.34 MiB | 36.65 MiB/s Receiving objects: 61% (37911/62149), 37.34 MiB | 36.65 MiB/s Receiving objects: 62% (38533/62149), 37.34 MiB | 36.65 MiB/s Receiving objects: 63% (39154/62149), 37.34 MiB | 36.65 MiB/s Receiving objects: 64% (39776/62149), 37.34 MiB | 36.65 MiB/s Receiving objects: 65% (40397/62149), 37.34 MiB | 36.65 MiB/s Receiving objects: 66% (41019/62149), 37.34 MiB | 36.65 MiB/s Receiving objects: 67% (41640/62149), 37.34 MiB | 36.65 MiB/s Receiving objects: 68% (42262/62149), 37.34 MiB | 36.65 MiB/s Receiving objects: 69% (42883/62149), 37.34 MiB | 36.65 MiB/s Receiving objects: 70% (43505/62149), 37.34 MiB | 36.65 MiB/s Receiving objects: 71% (44126/62149), 37.34 MiB | 36.65 MiB/s Receiving objects: 72% (44748/62149), 37.34 MiB | 36.65 MiB/s Receiving objects: 73% (45369/62149), 37.34 MiB | 36.65 MiB/s Receiving objects: 74% (45991/62149), 56.33 MiB | 36.57 MiB/s Receiving objects: 75% (46612/62149), 56.33 MiB | 36.57 MiB/s Receiving objects: 76% (47234/62149), 56.33 MiB | 36.57 MiB/s Receiving objects: 77% (47855/62149), 56.33 MiB | 36.57 MiB/s Receiving objects: 78% (48477/62149), 56.33 MiB | 36.57 MiB/s Receiving objects: 79% (49098/62149), 56.33 MiB | 36.57 MiB/s Receiving objects: 80% (49720/62149), 56.33 MiB | 36.57 MiB/s Receiving objects: 81% (50341/62149), 56.33 MiB | 36.57 MiB/s Receiving objects: 81% (50661/62149), 56.33 MiB | 36.57 MiB/s Receiving objects: 82% (50963/62149), 56.33 MiB | 36.57 MiB/s Receiving objects: 83% (51584/62149), 75.57 MiB | 36.65 MiB/s Receiving objects: 84% (52206/62149), 75.57 MiB | 36.65 MiB/s Receiving objects: 85% (52827/62149), 75.57 MiB | 36.65 MiB/s Receiving objects: 86% (53449/62149), 75.57 MiB | 36.65 MiB/s Receiving objects: 87% (54070/62149), 75.57 MiB | 36.65 MiB/s Receiving objects: 88% (54692/62149), 75.57 MiB | 36.65 MiB/s Receiving objects: 89% (55313/62149), 75.57 MiB | 36.65 MiB/s Receiving objects: 90% (55935/62149), 75.57 MiB | 36.65 MiB/s Receiving objects: 91% (56556/62149), 75.57 MiB | 36.65 MiB/s Receiving objects: 92% (57178/62149), 75.57 MiB | 36.65 MiB/s Receiving objects: 93% (57799/62149), 75.57 MiB | 36.65 MiB/s Receiving objects: 94% (58421/62149), 75.57 MiB | 36.65 MiB/s Receiving objects: 95% (59042/62149), 75.57 MiB | 36.65 MiB/s Receiving objects: 96% (59664/62149), 75.57 MiB | 36.65 MiB/s Receiving objects: 97% (60285/62149), 75.57 MiB | 36.65 MiB/s Receiving objects: 98% (60907/62149), 75.57 MiB | 36.65 MiB/s Receiving objects: 99% (61528/62149), 75.57 MiB | 36.65 MiB/s remote: Total 62149 (delta 6241), reused 5855 (delta 5778), pack-reused 54986 (from 3)
  7. 4.68 s Receiving objects: 100% (62149/62149), 75.57 MiB | 36.65 MiB/s Receiving objects: 100% (62149/62149), 92.18 MiB | 36.64 MiB/s, done.
  8. 5.33 s Resolving deltas: 0% (0/43438) Resolving deltas: 1% (435/43438) Resolving deltas: 2% (869/43438) Resolving deltas: 3% (1307/43438) Resolving deltas: 4% (1740/43438) Resolving deltas: 5% (2172/43438) Resolving deltas: 6% (2607/43438) Resolving deltas: 7% (3041/43438) Resolving deltas: 8% (3478/43438) Resolving deltas: 9% (3910/43438) Resolving deltas: 10% (4344/43438) Resolving deltas: 11% (4780/43438) Resolving deltas: 12% (5213/43438) Resolving deltas: 13% (5647/43438) Resolving deltas: 14% (6082/43438) Resolving deltas: 15% (6518/43438) Resolving deltas: 16% (6951/43438) Resolving deltas: 17% (7385/43438) Resolving deltas: 18% (7819/43438) Resolving deltas: 19% (8254/43438) Resolving deltas: 20% (8688/43438) Resolving deltas: 21% (9122/43438) Resolving deltas: 22% (9557/43438) Resolving deltas: 23% (9991/43438) Resolving deltas: 24% (10426/43438) Resolving deltas: 25% (10860/43438) Resolving deltas: 26% (11294/43438) Resolving deltas: 27% (11729/43438) Resolving deltas: 28% (12163/43438) Resolving deltas: 29% (12598/43438) Resolving deltas: 30% (13032/43438) Resolving deltas: 31% (13466/43438) Resolving deltas: 32% (13901/43438) Resolving deltas: 33% (14335/43438) Resolving deltas: 34% (14769/43438) Resolving deltas: 35% (15204/43438) Resolving deltas: 36% (15638/43438) Resolving deltas: 37% (16073/43438) Resolving deltas: 38% (16507/43438) Resolving deltas: 39% (16941/43438) Resolving deltas: 40% (17377/43438) Resolving deltas: 41% (17810/43438) Resolving deltas: 42% (18244/43438) Resolving deltas: 43% (18680/43438) Resolving deltas: 44% (19113/43438) Resolving deltas: 45% (19549/43438) Resolving deltas: 46% (19986/43438) Resolving deltas: 47% (20419/43438) Resolving deltas: 48% (20851/43438) Resolving deltas: 49% (21285/43438) Resolving deltas: 50% (21719/43438) Resolving deltas: 51% (22154/43438) Resolving deltas: 52% (22589/43438) Resolving deltas: 53% (23023/43438) Resolving deltas: 54% (23457/43438) Resolving deltas: 55% (23894/43438) Resolving deltas: 56% (24327/43438) Resolving deltas: 57% (24760/43438) Resolving deltas: 58% (25196/43438) Resolving deltas: 59% (25629/43438) Resolving deltas: 60% (26063/43438) Resolving deltas: 61% (26498/43438) Resolving deltas: 62% (26932/43438) Resolving deltas: 63% (27366/43438) Resolving deltas: 64% (27801/43438) Resolving deltas: 65% (28235/43438) Resolving deltas: 66% (28673/43438) Resolving deltas: 67% (29104/43438) Resolving deltas: 68% (29538/43438) Resolving deltas: 69% (29974/43438) Resolving deltas: 70% (30407/43438) Resolving deltas: 71% (30841/43438) Resolving deltas: 72% (31276/43438) Resolving deltas: 73% (31710/43438) Resolving deltas: 74% (32145/43438) Resolving deltas: 75% (32579/43438) Resolving deltas: 76% (33015/43438) Resolving deltas: 77% (33448/43438) Resolving deltas: 78% (33882/43438) Resolving deltas: 79% (34317/43438) Resolving deltas: 80% (34751/43438) Resolving deltas: 81% (35185/43438) Resolving deltas: 82% (35620/43438) Resolving deltas: 83% (36054/43438) Resolving deltas: 84% (36489/43438) Resolving deltas: 85% (36924/43438) Resolving deltas: 86% (37357/43438) Resolving deltas: 87% (37792/43438) Resolving deltas: 88% (38226/43438) Resolving deltas: 89% (38660/43438) Resolving deltas: 90% (39095/43438) Resolving deltas: 91% (39529/43438) Resolving deltas: 92% (39963/43438) Resolving deltas: 93% (40400/43438) Resolving deltas: 94% (40832/43438) Resolving deltas: 95% (41267/43438) Resolving deltas: 96% (41701/43438) Resolving deltas: 97% (42136/43438) Resolving deltas: 98% (42570/43438) Resolving deltas: 99% (43004/43438) Resolving deltas: 100% (43438/43438) Resolving deltas: 100% (43438/43438), done.
  9. 5.62 s Fetching commit 306aa3b35933dd96091d6370d5037e9adacabca8 for push-vrpyqyylypmw ...
  10. 5.64 s $ /nix/store/bcnisk3ydfgv26v2gw3zlky24g00yww2-git-2.54.0/bin/git fetch origin 306aa3b35933dd96091d6370d5037e9adacabca8
  11. 6.03 s From https://github.com/alphal00p/gammaloop
  12. 6.03 s * branch 306aa3b35933dd96091d6370d5037e9adacabca8 -> FETCH_HEAD
  13. 6.04 s $ /nix/store/9ypz3flqsrl5xl495mm8h645gadjsxi1-coreutils-9.11/bin/timeout --kill-after=15s 7200s /nix/store/bcnisk3ydfgv26v2gw3zlky24g00yww2-git-2.54.0/bin/git -c advice.detachedHead=false checkout 306aa3b35933dd96091d6370d5037e9adacabca8
  14. 6.15 s HEAD is now at 306aa3b3 replace linnet python api with typed drawing model
  15. 6.16 s $ /nix/store/9ypz3flqsrl5xl495mm8h645gadjsxi1-coreutils-9.11/bin/timeout --kill-after=15s 7200s /nix/store/23zk8sgzamrbmj1fday15szf7f2279s8-nix-2.34.7/bin/nix --extra-experimental-features nix-command --extra-experimental-features flakes --log-format internal-json run .#packages.x86_64-linux.nix-ci-check-gammaloop-nextest-core --print-build-logs
  16. 10.04 s
  17. 14.95 s evaluating derivation 'g copying '/nix/store/rmgz evaluating derivation 'g copying '/nix/store/rmgz evaluating derivation 'g copying '/nix/store/rmgz evaluating derivation 'g copying '/nix/store/rmgz evaluating derivation 'g copying '/nix/store/rmgz evaluating derivation 'g copying '/nix/store/rmgz evaluating derivation 'g querying info about miss querying gammaloop-nexte [0/1 built, 0.0 KiB DL] [1/0/1 built, 0.0 KiB DLgammaloop-nextest-core> Extracting 3 binaries (including 1 non-test binary), 1 build script output directory, and 2 linked paths to /build/nextest-archive-WDA7hg
  18. 15.40 s gammaloop-nextest-core> Extracted 18 files to /build/nextest-archive-WDA7hg in 0.45s
  19. 15.41 s gammaloop-nextest-core> ------------
  20. 15.41 s gammaloop-nextest-core> Nextest run ID 2e14c2d0-1500-4958-b1fc-7164816a24fc with nextest profile: ci_gammaloop
  21. 15.41 s gammaloop-nextest-core> Starting 339 tests across 2 binaries
  22. 15.75 s gammaloop-nextest-core> FAIL [ 0.021s] (246/339) gammaloop-api repl::tests::completion_shows_type_hint_for_non_boolean_settings_leaf
  23. 15.75 s gammaloop-nextest-core> stdout ---
  24. 15.75 s gammaloop-nextest-core>
  25. 15.75 s gammaloop-nextest-core> running 1 test
  26. 15.75 s gammaloop-nextest-core> test repl::tests::completion_shows_type_hint_for_non_boolean_settings_leaf ... FAILED
  27. 15.75 s gammaloop-nextest-core>
  28. 15.75 s gammaloop-nextest-core> failures:
  29. 15.75 s gammaloop-nextest-core>
  30. 15.75 s gammaloop-nextest-core> failures:
  31. 15.75 s gammaloop-nextest-core> repl::tests::completion_shows_type_hint_for_non_boolean_settings_leaf
  32. 15.75 s gammaloop-nextest-core>
  33. 15.75 s gammaloop-nextest-core> test result: FAILED. 0 passed; 1 failed; 0 ignored; 0 measured; 338 filtered out; finished in 0.01s
  34. 15.75 s gammaloop-nextest-core>
  35. 15.75 s gammaloop-nextest-core> stderr ---
  36. 15.75 s gammaloop-nextest-core>
  37. 15.75 s gammaloop-nextest-core> thread 'repl::tests::completion_shows_type_hint_for_non_boolean_settings_leaf' (772) panicked at crates/gammaloop-api/src/repl.rs:5778:9:
  38. 15.75 s gammaloop-nextest-core> [Suggestion { value: "", description: Some("Number of samples in the first Monte Carlo iteration."), style: None, extra: None, span: Span { start: 42, end: 42 }, append_whitespace: false }]
  39. 15.75 s gammaloop-nextest-core> stack backtrace:
  40. 15.75 s gammaloop-nextest-core> 0: __rustc::rust_begin_unwind
  41. 15.75 s gammaloop-nextest-core> 1: core::panicking::panic_fmt
  42. 15.75 s gammaloop-nextest-core> 2: gammaloop_api::repl::tests::completion_shows_type_hint_for_non_boolean_settings_leaf
  43. 15.75 s gammaloop-nextest-core> 3: <gammaloop_api::repl::tests::completion_shows_type_hint_for_non_boolean_settings_leaf::{closure#0} as core::ops::function::FnOnce<()>>::call_once
  44. 15.75 s gammaloop-nextest-core> note: Some details are omitted, run with `RUST_BACKTRACE=full` for a verbose backtrace.
  45. 15.75 s gammaloop-nextest-core>
  46. 15.80 s gammaloop-nextest-core> FAIL [ 0.026s] (275/339) gammaloop-api templates::tests::extract_templates_uses_canonical_package_layout
  47. 15.80 s gammaloop-nextest-core> stdout ---
  48. 15.80 s gammaloop-nextest-core>
  49. 15.80 s gammaloop-nextest-core> running 1 test
  50. 15.80 s gammaloop-nextest-core> test templates::tests::extract_templates_uses_canonical_package_layout ... FAILED
  51. 15.80 s gammaloop-nextest-core>
  52. 15.80 s gammaloop-nextest-core> failures:
  53. 15.80 s gammaloop-nextest-core>
  54. 15.80 s gammaloop-nextest-core> failures:
  55. 15.80 s gammaloop-nextest-core> templates::tests::extract_templates_uses_canonical_package_layout
  56. 15.80 s gammaloop-nextest-core>
  57. 15.80 s gammaloop-nextest-core> test result: FAILED. 0 passed; 1 failed; 0 ignored; 0 measured; 338 filtered out; finished in 0.02s
  58. 15.80 s gammaloop-nextest-core>
  59. 15.80 s gammaloop-nextest-core> stderr ---
  60. 15.80 s gammaloop-nextest-core>
  61. 15.80 s gammaloop-nextest-core> thread 'templates::tests::extract_templates_uses_canonical_package_layout' (866) panicked at crates/gammaloop-api/src/templates.rs:99:9:
  62. 15.80 s gammaloop-nextest-core> assertion failed: figure.contains("amplitude-mode")
  63. 15.80 s gammaloop-nextest-core> stack backtrace:
  64. 15.80 s gammaloop-nextest-core> 0: __rustc::rust_begin_unwind
  65. 15.80 s gammaloop-nextest-core> 1: core::panicking::panic_fmt
  66. 15.80 s gammaloop-nextest-core> 2: core::panicking::panic
  67. 15.80 s gammaloop-nextest-core> 3: gammaloop_api::templates::tests::extract_templates_uses_canonical_package_layout
  68. 15.80 s gammaloop-nextest-core> 4: <gammaloop_api::templates::tests::extract_templates_uses_canonical_package_layout::{closure#0} as core::ops::function::FnOnce<()>>::call_once
  69. 15.80 s gammaloop-nextest-core> note: Some details are omitted, run with `RUST_BACKTRACE=full` for a verbose backtrace.
  70. 15.80 s gammaloop-nextest-core>
  71. 16.03 s gammaloop-nextest-core> ------------
  72. 16.03 s gammaloop-nextest-core> Summary [ 0.616s] 339 tests run: 337 passed, 2 failed, 0 skipped
  73. 16.03 s gammaloop-nextest-core> FAIL [ 0.021s] (246/339) gammaloop-api repl::tests::completion_shows_type_hint_for_non_boolean_settings_leaf
  74. 16.03 s gammaloop-nextest-core> stdout ---
  75. 16.03 s gammaloop-nextest-core>
  76. 16.03 s gammaloop-nextest-core> running 1 test
  77. 16.03 s gammaloop-nextest-core> test repl::tests::completion_shows_type_hint_for_non_boolean_settings_leaf ... FAILED
  78. 16.03 s gammaloop-nextest-core>
  79. 16.03 s gammaloop-nextest-core> failures:
  80. 16.03 s gammaloop-nextest-core>
  81. 16.03 s gammaloop-nextest-core> failures:
  82. 16.03 s gammaloop-nextest-core> repl::tests::completion_shows_type_hint_for_non_boolean_settings_leaf
  83. 16.03 s gammaloop-nextest-core>
  84. 16.03 s gammaloop-nextest-core> test result: FAILED. 0 passed; 1 failed; 0 ignored; 0 measured; 338 filtered out; finished in 0.01s
  85. 16.03 s gammaloop-nextest-core>
  86. 16.03 s gammaloop-nextest-core> stderr ---
  87. 16.03 s gammaloop-nextest-core>
  88. 16.03 s gammaloop-nextest-core> thread 'repl::tests::completion_shows_type_hint_for_non_boolean_settings_leaf' (772) panicked at crates/gammaloop-api/src/repl.rs:5778:9:
  89. 16.03 s gammaloop-nextest-core> [Suggestion { value: "", description: Some("Number of samples in the first Monte Carlo iteration."), style: None, extra: None, span: Span { start: 42, end: 42 }, append_whitespace: false }]
  90. 16.03 s gammaloop-nextest-core> stack backtrace:
  91. 16.03 s gammaloop-nextest-core> 0: __rustc::rust_begin_unwind
  92. 16.03 s gammaloop-nextest-core> 1: core::panicking::panic_fmt
  93. 16.03 s gammaloop-nextest-core> 2: gammaloop_api::repl::tests::completion_shows_type_hint_for_non_boolean_settings_leaf
  94. 16.03 s gammaloop-nextest-core> 3: <gammaloop_api::repl::tests::completion_shows_type_hint_for_non_boolean_settings_leaf::{closure#0} as core::ops::function::FnOnce<()>>::call_once
  95. 16.03 s gammaloop-nextest-core> note: Some details are omitted, run with `RUST_BACKTRACE=full` for a verbose backtrace.
  96. 16.03 s gammaloop-nextest-core>
  97. 16.03 s gammaloop-nextest-core> FAIL [ 0.026s] (275/339) gammaloop-api templates::tests::extract_templates_uses_canonical_package_layout
  98. 16.03 s gammaloop-nextest-core> stdout ---
  99. 16.03 s gammaloop-nextest-core>
  100. 16.03 s gammaloop-nextest-core> running 1 test
  101. 16.03 s gammaloop-nextest-core> test templates::tests::extract_templates_uses_canonical_package_layout ... FAILED
  102. 16.03 s gammaloop-nextest-core>
  103. 16.03 s gammaloop-nextest-core> failures:
  104. 16.03 s gammaloop-nextest-core>
  105. 16.03 s gammaloop-nextest-core> failures:
  106. 16.03 s gammaloop-nextest-core> templates::tests::extract_templates_uses_canonical_package_layout
  107. 16.03 s gammaloop-nextest-core>
  108. 16.03 s gammaloop-nextest-core> test result: FAILED. 0 passed; 1 failed; 0 ignored; 0 measured; 338 filtered out; finished in 0.02s
  109. 16.03 s gammaloop-nextest-core>
  110. 16.03 s gammaloop-nextest-core> stderr ---
  111. 16.03 s gammaloop-nextest-core>
  112. 16.03 s gammaloop-nextest-core> thread 'templates::tests::extract_templates_uses_canonical_package_layout' (866) panicked at crates/gammaloop-api/src/templates.rs:99:9:
  113. 16.03 s gammaloop-nextest-core> assertion failed: figure.contains("amplitude-mode")
  114. 16.03 s gammaloop-nextest-core> stack backtrace:
  115. 16.03 s gammaloop-nextest-core> 0: __rustc::rust_begin_unwind
  116. 16.03 s gammaloop-nextest-core> 1: core::panicking::panic_fmt
  117. 16.03 s gammaloop-nextest-core> 2: core::panicking::panic
  118. 16.03 s gammaloop-nextest-core> 3: gammaloop_api::templates::tests::extract_templates_uses_canonical_package_layout
  119. 16.03 s gammaloop-nextest-core> 4: <gammaloop_api::templates::tests::extract_templates_uses_canonical_package_layout::{closure#0} as core::ops::function::FnOnce<()>>::call_once
  120. 16.03 s gammaloop-nextest-core> note: Some details are omitted, run with `RUST_BACKTRACE=full` for a verbose backtrace.
  121. 16.03 s gammaloop-nextest-core>
  122. 16.10 s gammaloop-nextest-core> error: test run failed
  123. 16.13 s gammaloop-nextest-core>
  124. 16.13 s gammaloop-nextest-core> ========== nextest test summary ==========
  125. 16.13 s gammaloop-nextest-core> report: target/nextest/ci_gammaloop/junit.xml
  126. 16.13 s gammaloop-nextest-core> tests: 339, failures: 2, errors: 0
  127. 16.13 s gammaloop-nextest-core>
  128. 16.13 s gammaloop-nextest-core> 1. gammaloop-api::repl::tests::completion_shows_type_hint_for_non_boolean_settings_leaf
  129. 16.13 s gammaloop-nextest-core> failure: test failure with exit code 101
  130. 16.13 s gammaloop-nextest-core> thread 'repl::tests::completion_shows_type_hint_for_non_boolean_settings_leaf' (772) panicked at crates/gammaloop-api/src/repl.rs:5778:9:
  131. 16.13 s gammaloop-nextest-core> [Suggestion { value: "", description: Some("Number of samples in the first Monte Carlo iteration."), style: None, extra: None, span: Span { start: 42, end: 42 }, append_whitespace: false }]
  132. 16.13 s gammaloop-nextest-core> stack backtrace:
  133. 16.13 s gammaloop-nextest-core> 0: __rustc::rust_begin_unwind
  134. 16.13 s gammaloop-nextest-core> 1: core::panicking::panic_fmt
  135. 16.13 s gammaloop-nextest-core> 2: gammaloop_api::repl::tests::completion_shows_type_hint_for_non_boolean_settings_leaf
  136. 16.13 s gammaloop-nextest-core> 3: <gammaloop_api::repl::tests::completion_shows_type_hint_for_non_boolean_settings_leaf::{closure#0} as core::ops::function::FnOnce<()>>::call_once
  137. 16.13 s gammaloop-nextest-core> note: Some details are omitted, run with `RUST_BACKTRACE=full` for a verbose backtrace.
  138. 16.13 s gammaloop-nextest-core> system-out
  139. 16.13 s gammaloop-nextest-core> running 1 test
  140. 16.13 s gammaloop-nextest-core> test repl::tests::completion_shows_type_hint_for_non_boolean_settings_leaf ... FAILED
  141. 16.13 s gammaloop-nextest-core>
  142. 16.13 s gammaloop-nextest-core> failures:
  143. 16.13 s gammaloop-nextest-core>
  144. 16.13 s gammaloop-nextest-core> failures:
  145. 16.13 s gammaloop-nextest-core> repl::tests::completion_shows_type_hint_for_non_boolean_settings_leaf
  146. 16.13 s gammaloop-nextest-core>
  147. 16.13 s gammaloop-nextest-core> test result: FAILED. 0 passed; 1 failed; 0 ignored; 0 measured; 338 filtered out; finished in 0.01s
  148. 16.13 s gammaloop-nextest-core> system-err
  149. 16.13 s gammaloop-nextest-core> thread 'repl::tests::completion_shows_type_hint_for_non_boolean_settings_leaf' (772) panicked at crates/gammaloop-api/src/repl.rs:5778:9:
  150. 16.13 s gammaloop-nextest-core> [Suggestion { value: "", description: Some("Number of samples in the first Monte Carlo iteration."), style: None, extra: None, span: Span { start: 42, end: 42 }, append_whitespace: false }]
  151. 16.13 s gammaloop-nextest-core> stack backtrace:
  152. 16.13 s gammaloop-nextest-core> 0: __rustc::rust_begin_unwind
  153. 16.13 s gammaloop-nextest-core> 1: core::panicking::panic_fmt
  154. 16.13 s gammaloop-nextest-core> 2: gammaloop_api::repl::tests::completion_shows_type_hint_for_non_boolean_settings_leaf
  155. 16.13 s gammaloop-nextest-core> 3: <gammaloop_api::repl::tests::completion_shows_type_hint_for_non_boolean_settings_leaf::{closure#0} as core::ops::function::FnOnce<()>>::call_once
  156. 16.13 s gammaloop-nextest-core> note: Some details are omitted, run with `RUST_BACKTRACE=full` for a verbose backtrace.
  157. 16.13 s gammaloop-nextest-core>
  158. 16.13 s gammaloop-nextest-core> 2. gammaloop-api::templates::tests::extract_templates_uses_canonical_package_layout
  159. 16.13 s gammaloop-nextest-core> failure: test failure with exit code 101
  160. 16.13 s gammaloop-nextest-core> thread 'templates::tests::extract_templates_uses_canonical_package_layout' (866) panicked at crates/gammaloop-api/src/templates.rs:99:9:
  161. 16.13 s gammaloop-nextest-core> assertion failed: figure.contains("amplitude-mode")
  162. 16.13 s gammaloop-nextest-core> stack backtrace:
  163. 16.13 s gammaloop-nextest-core> 0: __rustc::rust_begin_unwind
  164. 16.13 s gammaloop-nextest-core> 1: core::panicking::panic_fmt
  165. 16.13 s gammaloop-nextest-core> 2: core::panicking::panic
  166. 16.13 s gammaloop-nextest-core> 3: gammaloop_api::templates::tests::extract_templates_uses_canonical_package_layout
  167. 16.13 s gammaloop-nextest-core> 4: <gammaloop_api::templates::tests::extract_templates_uses_canonical_package_layout::{closure#0} as core::ops::function::FnOnce<()>>::call_once
  168. 16.13 s gammaloop-nextest-core> note: Some details are omitted, run with `RUST_BACKTRACE=full` for a verbose backtrace.
  169. 16.13 s gammaloop-nextest-core> system-out
  170. 16.13 s gammaloop-nextest-core> running 1 test
  171. 16.13 s gammaloop-nextest-core> test templates::tests::extract_templates_uses_canonical_package_layout ... FAILED
  172. 16.13 s gammaloop-nextest-core>
  173. 16.13 s gammaloop-nextest-core> failures:
  174. 16.13 s gammaloop-nextest-core>
  175. 16.13 s gammaloop-nextest-core> failures:
  176. 16.13 s gammaloop-nextest-core> templates::tests::extract_templates_uses_canonical_package_layout
  177. 16.13 s gammaloop-nextest-core>
  178. 16.13 s gammaloop-nextest-core> test result: FAILED. 0 passed; 1 failed; 0 ignored; 0 measured; 338 filtered out; finished in 0.02s
  179. 16.13 s gammaloop-nextest-core> system-err
  180. 16.13 s gammaloop-nextest-core> thread 'templates::tests::extract_templates_uses_canonical_package_layout' (866) panicked at crates/gammaloop-api/src/templates.rs:99:9:
  181. 16.13 s gammaloop-nextest-core> assertion failed: figure.contains("amplitude-mode")
  182. 16.13 s gammaloop-nextest-core> stack backtrace:
  183. 16.13 s gammaloop-nextest-core> 0: __rustc::rust_begin_unwind
  184. 16.13 s gammaloop-nextest-core> 1: core::panicking::panic_fmt
  185. 16.13 s gammaloop-nextest-core> 2: core::panicking::panic
  186. 16.13 s gammaloop-nextest-core> 3: gammaloop_api::templates::tests::extract_templates_uses_canonical_package_layout
  187. 16.13 s gammaloop-nextest-core> 4: <gammaloop_api::templates::tests::extract_templates_uses_canonical_package_layout::{closure#0} as core::ops::function::FnOnce<()>>::call_once
  188. 16.13 s gammaloop-nextest-core> note: Some details are omitted, run with `RUST_BACKTRACE=full` for a verbose backtrace.
  189. 16.13 s gammaloop-nextest-core> =========================================
  190. 16.14 s gammaloop-nextest-core> Extracting 1 binary and 1 linked path to /build/nextest-archive-2I0li2
  191. 16.22 s gammaloop-nextest-core> Extracted 7 files to /build/nextest-archive-2I0li2 in 0.08s
  192. 16.24 s gammaloop-nextest-core> ------------
  193. 16.24 s gammaloop-nextest-core> Nextest run ID bb1fa411-686d-467f-bc45-1edf589e7f10 with nextest profile: ci_gammaloop
  194. 16.24 s gammaloop-nextest-core> Starting 19 tests across 1 binary
  195. 16.25 s gammaloop-nextest-core> ------------
  196. 16.25 s gammaloop-nextest-core> Summary [ 0.014s] 19 tests run: 19 passed, 0 skipped
  197. 16.29 s gammaloop-nextest-core>
  198. 16.29 s gammaloop-nextest-core> ========== nextest test summary ==========
  199. 16.29 s gammaloop-nextest-core> report: target/nextest/ci_gammaloop/junit.xml
  200. 16.29 s gammaloop-nextest-core> tests: 19, failures: 0, errors: 0
  201. 16.29 s gammaloop-nextest-core> No failing testcases found.
  202. 16.29 s gammaloop-nextest-core> =========================================
  203. 16.30 s gammaloop-nextest-core> Extracting 1 binary to /build/nextest-archive-A3h96q
  204. 16.34 s gammaloop-nextest-core> Extracted 4 files to /build/nextest-archive-A3h96q in 0.03s
  205. 16.35 s gammaloop-nextest-core> ------------
  206. 16.35 s gammaloop-nextest-core> Nextest run ID 34ca2ab5-363d-458b-a8e3-406e68f323b4 with nextest profile: ci_gammaloop
  207. 16.35 s gammaloop-nextest-core> Starting 0 tests across 1 binary
  208. 16.35 s gammaloop-nextest-core> ------------
  209. 16.35 s gammaloop-nextest-core> Summary [ 0.000s] 0 tests run: 0 passed, 0 skipped
  210. 16.38 s gammaloop-nextest-core>
  211. 16.38 s gammaloop-nextest-core> ========== nextest test summary ==========
  212. 16.38 s gammaloop-nextest-core> report: target/nextest/ci_gammaloop/junit.xml
  213. 16.38 s gammaloop-nextest-core> tests: 0, failures: 0, errors: 0
  214. 16.38 s gammaloop-nextest-core> No failing testcases found.
  215. 16.38 s gammaloop-nextest-core> =========================================
  216. 16.39 s gammaloop-nextest-core> Extracting 4 binaries, 1 build script output directory, and 2 linked paths to /build/nextest-archive-MDu9aG
  217. 16.86 s gammaloop-nextest-core> Extracted 18 files to /build/nextest-archive-MDu9aG in 0.47s
  218. 16.87 s gammaloop-nextest-core> ------------
  219. 16.87 s gammaloop-nextest-core> Nextest run ID 7dd86df6-9b93-4cef-8dae-9c33b82892e6 with nextest profile: ci_gammaloop
  220. 16.87 s gammaloop-nextest-core> Starting 456 tests across 4 binaries (61 tests skipped, including 60 tests via profile.ci_gammaloop.default-filter)
  221. 17.26 s gammaloop-nextest-core> FAIL [ 0.253s] (159/456) gammalooprs graph::parse::tests::parse_lmbsetting_crossection
  222. 17.26 s gammaloop-nextest-core> stdout ---
  223. 17.26 s gammaloop-nextest-core>
  224. 17.26 s gammaloop-nextest-core> running 1 test
  225. 17.26 s gammaloop-nextest-core> ━━━━━━━━━━━━━━━━━━━━━━━━━━━━━━━ Snapshot Summary ━━━━━━━━━━━━━━━━━━━━━━━━━━━━━━━
  226. 17.26 s gammaloop-nextest-core> Snapshot: parse_lmbsetting_crossection
  227. 17.26 s gammaloop-nextest-core> Source: crates/gammalooprs/src/graph/parse/tests.rs:252
  228. 17.26 s gammaloop-nextest-core> ────────────────────────────────────────────────────────────────────────────────
  229. 17.26 s gammaloop-nextest-core> Expression: g.debug_dot()
  230. 17.26 s gammaloop-nextest-core> ────────────────────────────────────────────────────────────────────────────────
  231. 17.26 s gammaloop-nextest-core> -old snapshot
  232. 17.26 s gammaloop-nextest-core> +new results
  233. 17.26 s gammaloop-nextest-core> ────────────┬───────────────────────────────────────────────────────────────────
  234. 17.26 s gammaloop-nextest-core> 1 │-digraph G{
  235. 17.26 s gammaloop-nextest-core> 1 │+digraph G {
  236. 17.26 s gammaloop-nextest-core> 2 2 │ num = "1/2";
  237. 17.26 s gammaloop-nextest-core> 3 3 │ overall_factor = "2*x";
  238. 17.26 s gammaloop-nextest-core> 4 4 │ overall_factor_evaluated = "2*x";
  239. 17.26 s gammaloop-nextest-core> 5 5 │ projector = "spenso::t";
  240. 17.26 s gammaloop-nextest-core> ────────────┴───────────────────────────────────────────────────────────────────
  241. 17.26 s gammaloop-nextest-core> To update snapshots run `cargo insta review`
  242. 17.26 s gammaloop-nextest-core> Stopped on the first failure. Run `cargo insta test` to run all snapshots.
  243. 17.26 s gammaloop-nextest-core> test graph::parse::tests::parse_lmbsetting_crossection ... FAILED
  244. 17.26 s gammaloop-nextest-core>
  245. 17.26 s gammaloop-nextest-core> failures:
  246. 17.26 s gammaloop-nextest-core>
  247. 17.26 s gammaloop-nextest-core> failures:
  248. 17.26 s gammaloop-nextest-core> graph::parse::tests::parse_lmbsetting_crossection
  249. 17.26 s gammaloop-nextest-core>
  250. 17.26 s gammaloop-nextest-core> test result: FAILED. 0 passed; 1 failed; 0 ignored; 0 measured; 508 filtered out; finished in 0.24s
  251. 17.26 s gammaloop-nextest-core>
  252. 17.26 s gammaloop-nextest-core> stderr ---
  253. 17.26 s gammaloop-nextest-core> [07:32:39.507] @gammalooprs::graph::attribute_warnings WARNING : Unknown node attribute 'color_num' on graph 'G', node 'A'; did you mean 'num'?
  254. 17.26 s gammaloop-nextest-core> at crates/gammalooprs/src/graph/attribute_warnings.rs:198
  255. 17.26 s gammaloop-nextest-core> The application panicked (crashed).
  256. 17.26 s gammaloop-nextest-core> Message: snapshot assertion for 'parse_lmbsetting_crossection' failed in line 252
  257. 17.26 s gammaloop-nextest-core> Location: /nix/store/xdy1vvhll2bijdplvl9fcc2b9plkxhaa-vendor-cargo-deps/c19b7c6f923b580ac259164a89f2577984ad5ab09ee9d583b888f934adbbe8d0/insta-1.47.2/src/runtime.rs:719
  258. 17.26 s gammaloop-nextest-core>
  259. 17.26 s gammaloop-nextest-core> ━━━━━━━━━━━━━━━━━━━━━━━━━━━━━━━━━━ BACKTRACE ━━━━━━━━━━━━━━━━━━━━━━━━━━━━━━━━━━━
  260. 17.26 s gammaloop-nextest-core> 1: <color_eyre[b0c9e66060e883b2]::config::PanicHook>::panic_report<unknown>
  261. 17.26 s gammaloop-nextest-core> at <unknown source file>:<unknown line>
  262. 17.26 s gammaloop-nextest-core> 2: <color_eyre[b0c9e66060e883b2]::config::PanicHook>::into_panic_hook::{closure#0}<unknown>
  263. 17.26 s gammaloop-nextest-core> at <unknown source file>:<unknown line>
  264. 17.26 s gammaloop-nextest-core> 3: std[bcb96dfbba0ab899]::panicking::panic_with_hook<unknown>
  265. 17.26 s gammaloop-nextest-core> at <unknown source file>:<unknown line>
  266. 17.26 s gammaloop-nextest-core> 4: std[bcb96dfbba0ab899]::panicking::panic_handler::{closure#0}<unknown>
  267. 17.26 s gammaloop-nextest-core> at <unknown source file>:<unknown line>
  268. 17.26 s gammaloop-nextest-core> 5: std[bcb96dfbba0ab899]::sys::backtrace::__rust_end_short_backtrace::<std[bcb96dfbba0ab899]::panicking::panic_handler::{closure#0}, !><unknown>
  269. 17.26 s gammaloop-nextest-core> at <unknown source file>:<unknown line>
  270. 17.26 s gammaloop-nextest-core> 6: __rustc[6c289b9f9c454d21]::rust_begin_unwind<unknown>
  271. 17.26 s gammaloop-nextest-core> at <unknown source file>:<unknown line>
  272. 17.26 s gammaloop-nextest-core> 7: core[940e698046960fd5]::panicking::panic_fmt<unknown>
  273. 17.26 s gammaloop-nextest-core> at <unknown source file>:<unknown line>
  274. 17.26 s gammaloop-nextest-core> 8: insta[307a548ac79ef4d9]::runtime::assert_snapshot<unknown>
  275. 17.26 s gammaloop-nextest-core> at <unknown source file>:<unknown line>
  276. 17.26 s gammaloop-nextest-core> 9: gammalooprs[5490727360442cce]::graph::parse::tests::parse_lmbsetting_crossection<unknown>
  277. 17.26 s gammaloop-nextest-core> at <unknown source file>:<unknown line>
  278. 17.26 s gammaloop-nextest-core> 10: <gammalooprs[5490727360442cce]::graph::parse::tests::parse_lmbsetting_crossection::{closure#0} as core[940e698046960fd5]::ops::function::FnOnce<()>>::call_once<unknown>
  279. 17.26 s gammaloop-nextest-core> at <unknown source file>:<unknown line>
  280. 17.26 s gammaloop-nextest-core> 11: test[75d6903177b1d7e9]::__rust_begin_short_backtrace::<core[940e698046960fd5]::result::Result<(), alloc[2ea6bcb46fca0c42]::string::String>, fn() -> core[940e698046960fd5]::result::Result<(), alloc[2ea6bcb46fca0c42]::string::String>><unknown>
  281. 17.26 s gammaloop-nextest-core> at <unknown source file>:<unknown line>
  282. 17.26 s gammaloop-nextest-core> 12: test[75d6903177b1d7e9]::run_test::{closure#0}<unknown>
  283. 17.26 s gammaloop-nextest-core> at <unknown source file>:<unknown line>
  284. 17.26 s gammaloop-nextest-core> 13: std[bcb96dfbba0ab899]::sys::backtrace::__rust_begin_short_backtrace::<test[75d6903177b1d7e9]::run_test::{closure#1}, ()><unknown>
  285. 17.26 s gammaloop-nextest-core> at <unknown source file>:<unknown line>
  286. 17.26 s gammaloop-nextest-core> 14: <std[bcb96dfbba0ab899]::thread::lifecycle::spawn_unchecked<test[75d6903177b1d7e9]::run_test::{closure#1}, ()>::{closure#1} as core[940e698046960fd5]::ops::function::FnOnce<()>>::call_once::{shim:vtable#0}<unknown>
  287. 17.26 s gammaloop-nextest-core> at <unknown source file>:<unknown line>
  288. 17.26 s gammaloop-nextest-core> 15: <std[bcb96dfbba0ab899]::sys::thread::unix::Thread>::new::thread_start<unknown>
  289. 17.26 s gammaloop-nextest-core> at <unknown source file>:<unknown line>
  290. 17.26 s gammaloop-nextest-core> 16: start_thread<unknown>
  291. 17.26 s gammaloop-nextest-core> at <unknown source file>:<unknown line>
  292. 17.26 s gammaloop-nextest-core> 17: __clone3<unknown>
  293. 17.26 s gammaloop-nextest-core> at <unknown source file>:<unknown line>
  294. 17.26 s gammaloop-nextest-core>
  295. 17.26 s gammaloop-nextest-core> Run with COLORBT_SHOW_HIDDEN=1 environment variable to disable frame filtering.
  296. 17.26 s gammaloop-nextest-core> Run with RUST_BACKTRACE=full to include source snippets.
  297. 17.26 s gammaloop-nextest-core>
  298. 17.69 s gammaloop-nextest-core> FAIL [ 0.093s] (407/456) gammalooprs uv::export::tests::computed_node_full_numerator_is_a_spenso_aware_typst_fragment
  299. 17.69 s gammaloop-nextest-core> stdout ---
  300. 17.69 s gammaloop-nextest-core>
  301. 17.69 s gammaloop-nextest-core> running 1 test
  302. 17.69 s gammaloop-nextest-core> test uv::export::tests::computed_node_full_numerator_is_a_spenso_aware_typst_fragment ... FAILED
  303. 17.69 s gammaloop-nextest-core>
  304. 17.69 s gammaloop-nextest-core> failures:
  305. 17.69 s gammaloop-nextest-core>
  306. 17.69 s gammaloop-nextest-core> failures:
  307. 17.69 s gammaloop-nextest-core> uv::export::tests::computed_node_full_numerator_is_a_spenso_aware_typst_fragment
  308. 17.69 s gammaloop-nextest-core>
  309. 17.69 s gammaloop-nextest-core> test result: FAILED. 0 passed; 1 failed; 0 ignored; 0 measured; 508 filtered out; finished in 0.08s
  310. 17.69 s gammaloop-nextest-core>
  311. 17.69 s gammaloop-nextest-core> stderr ---
  312. 17.69 s gammaloop-nextest-core> The application panicked (crashed).
  313. 17.69 s gammaloop-nextest-core> Message: assertion failed: exported.dot.contains(r#"full_num = "op(\"Tr\")(1)";"#)
  314. 17.69 s gammaloop-nextest-core> Location: crates/gammalooprs/src/uv/export.rs:483
  315. 17.69 s gammaloop-nextest-core>
  316. 17.69 s gammaloop-nextest-core> ━━━━━━━━━━━━━━━━━━━━━━━━━━━━━━━━━━ BACKTRACE ━━━━━━━━━━━━━━━━━━━━━━━━━━━━━━━━━━━
  317. 17.69 s gammaloop-nextest-core> 1: <color_eyre[b0c9e66060e883b2]::config::PanicHook>::panic_report<unknown>
  318. 17.69 s gammaloop-nextest-core> at <unknown source file>:<unknown line>
  319. 17.69 s gammaloop-nextest-core> 2: <color_eyre[b0c9e66060e883b2]::config::PanicHook>::into_panic_hook::{closure#0}<unknown>
  320. 17.69 s gammaloop-nextest-core> at <unknown source file>:<unknown line>
  321. 17.69 s gammaloop-nextest-core> 3: std[bcb96dfbba0ab899]::panicking::panic_with_hook<unknown>
  322. 17.69 s gammaloop-nextest-core> at <unknown source file>:<unknown line>
  323. 17.69 s gammaloop-nextest-core> 4: std[bcb96dfbba0ab899]::panicking::panic_handler::{closure#0}<unknown>
  324. 17.69 s gammaloop-nextest-core> at <unknown source file>:<unknown line>
  325. 17.69 s gammaloop-nextest-core> 5: std[bcb96dfbba0ab899]::sys::backtrace::__rust_end_short_backtrace::<std[bcb96dfbba0ab899]::panicking::panic_handler::{closure#0}, !><unknown>
  326. 17.69 s gammaloop-nextest-core> at <unknown source file>:<unknown line>
  327. 17.69 s gammaloop-nextest-core> 6: __rustc[6c289b9f9c454d21]::rust_begin_unwind<unknown>
  328. 17.69 s gammaloop-nextest-core> at <unknown source file>:<unknown line>
  329. 17.69 s gammaloop-nextest-core> 7: core[940e698046960fd5]::panicking::panic_fmt<unknown>
  330. 17.69 s gammaloop-nextest-core> at <unknown source file>:<unknown line>
  331. 17.69 s gammaloop-nextest-core> 8: core[940e698046960fd5]::panicking::panic<unknown>
  332. 17.69 s gammaloop-nextest-core> at <unknown source file>:<unknown line>
  333. 17.69 s gammaloop-nextest-core> 9: gammalooprs[5490727360442cce]::uv::export::tests::computed_node_full_numerator_is_a_spenso_aware_typst_fragment<unknown>
  334. 17.69 s gammaloop-nextest-core> at <unknown source file>:<unknown line>
  335. 17.69 s gammaloop-nextest-core> 10: <gammalooprs[5490727360442cce]::uv::export::tests::computed_node_full_numerator_is_a_spenso_aware_typst_fragment::{closure#0} as core[940e698046960fd5]::ops::function::FnOnce<()>>::call_once<unknown>
  336. 17.69 s gammaloop-nextest-core> at <unknown source file>:<unknown line>
  337. 17.69 s gammaloop-nextest-core> 11: test[75d6903177b1d7e9]::__rust_begin_short_backtrace::<core[940e698046960fd5]::result::Result<(), alloc[2ea6bcb46fca0c42]::string::String>, fn() -> core[940e698046960fd5]::result::Result<(), alloc[2ea6bcb46fca0c42]::string::String>><unknown>
  338. 17.69 s gammaloop-nextest-core> at <unknown source file>:<unknown line>
  339. 17.70 s gammaloop-nextest-core> 12: test[75d6903177b1d7e9]::run_test::{closure#0}<unknown>
  340. 17.70 s gammaloop-nextest-core> at <unknown source file>:<unknown line>
  341. 17.70 s gammaloop-nextest-core> 13: std[bcb96dfbba0ab899]::sys::backtrace::__rust_begin_short_backtrace::<test[75d6903177b1d7e9]::run_test::{closure#1}, ()><unknown>
  342. 17.70 s gammaloop-nextest-core> at <unknown source file>:<unknown line>
  343. 17.70 s gammaloop-nextest-core> 14: <std[bcb96dfbba0ab899]::thread::lifecycle::spawn_unchecked<test[75d6903177b1d7e9]::run_test::{closure#1}, ()>::{closure#1} as core[940e698046960fd5]::ops::function::FnOnce<()>>::call_once::{shim:vtable#0}<unknown>
  344. 17.70 s gammaloop-nextest-core> at <unknown source file>:<unknown line>
  345. 17.70 s gammaloop-nextest-core> 15: <std[bcb96dfbba0ab899]::sys::thread::unix::Thread>::new::thread_start<unknown>
  346. 17.70 s gammaloop-nextest-core> at <unknown source file>:<unknown line>
  347. 17.70 s gammaloop-nextest-core> 16: start_thread<unknown>
  348. 17.70 s gammaloop-nextest-core> at <unknown source file>:<unknown line>
  349. 17.70 s gammaloop-nextest-core> 17: __clone3<unknown>
  350. 17.70 s gammaloop-nextest-core> at <unknown source file>:<unknown line>
  351. 17.70 s gammaloop-nextest-core>
  352. 17.70 s gammaloop-nextest-core> Run with COLORBT_SHOW_HIDDEN=1 environment variable to disable frame filtering.
  353. 17.70 s gammaloop-nextest-core> Run with RUST_BACKTRACE=full to include source snippets.
  354. 17.70 s gammaloop-nextest-core>
  355. 25.48 s gammaloop-nextest-core> ------------
  356. 25.49 s gammaloop-nextest-core> Summary [ 8.606s] 456 tests run: 454 passed, 2 failed, 61 skipped
  357. 25.49 s gammaloop-nextest-core> FAIL [ 0.253s] (159/456) gammalooprs graph::parse::tests::parse_lmbsetting_crossection
  358. 25.49 s gammaloop-nextest-core> stdout ---
  359. 25.49 s gammaloop-nextest-core>
  360. 25.49 s gammaloop-nextest-core> running 1 test
  361. 25.49 s gammaloop-nextest-core> ━━━━━━━━━━━━━━━━━━━━━━━━━━━━━━━ Snapshot Summary ━━━━━━━━━━━━━━━━━━━━━━━━━━━━━━━
  362. 25.49 s gammaloop-nextest-core> Snapshot: parse_lmbsetting_crossection
  363. 25.49 s gammaloop-nextest-core> Source: crates/gammalooprs/src/graph/parse/tests.rs:252
  364. 25.49 s gammaloop-nextest-core> ────────────────────────────────────────────────────────────────────────────────
  365. 25.49 s gammaloop-nextest-core> Expression: g.debug_dot()
  366. 25.49 s gammaloop-nextest-core> ────────────────────────────────────────────────────────────────────────────────
  367. 25.49 s gammaloop-nextest-core> -old snapshot
  368. 25.49 s gammaloop-nextest-core> +new results
  369. 25.49 s gammaloop-nextest-core> ────────────┬───────────────────────────────────────────────────────────────────
  370. 25.49 s gammaloop-nextest-core> 1 │-digraph G{
  371. 25.49 s gammaloop-nextest-core> 1 │+digraph G {
  372. 25.49 s gammaloop-nextest-core> 2 2 │ num = "1/2";
  373. 25.49 s gammaloop-nextest-core> 3 3 │ overall_factor = "2*x";
  374. 25.49 s gammaloop-nextest-core> 4 4 │ overall_factor_evaluated = "2*x";
  375. 25.49 s gammaloop-nextest-core> 5 5 │ projector = "spenso::t";
  376. 25.49 s gammaloop-nextest-core> ────────────┴───────────────────────────────────────────────────────────────────
  377. 25.49 s gammaloop-nextest-core> To update snapshots run `cargo insta review`
  378. 25.49 s gammaloop-nextest-core> Stopped on the first failure. Run `cargo insta test` to run all snapshots.
  379. 25.49 s gammaloop-nextest-core> test graph::parse::tests::parse_lmbsetting_crossection ... FAILED
  380. 25.49 s gammaloop-nextest-core>
  381. 25.49 s gammaloop-nextest-core> failures:
  382. 25.49 s gammaloop-nextest-core>
  383. 25.49 s gammaloop-nextest-core> failures:
  384. 25.49 s gammaloop-nextest-core> graph::parse::tests::parse_lmbsetting_crossection
  385. 25.49 s gammaloop-nextest-core>
  386. 25.49 s gammaloop-nextest-core> test result: FAILED. 0 passed; 1 failed; 0 ignored; 0 measured; 508 filtered out; finished in 0.24s
  387. 25.49 s gammaloop-nextest-core>
  388. 25.49 s gammaloop-nextest-core> stderr ---
  389. 25.49 s gammaloop-nextest-core> [07:32:39.507] @gammalooprs::graph::attribute_warnings WARNING : Unknown node attribute 'color_num' on graph 'G', node 'A'; did you mean 'num'?
  390. 25.49 s gammaloop-nextest-core> at crates/gammalooprs/src/graph/attribute_warnings.rs:198
  391. 25.49 s gammaloop-nextest-core> The application panicked (crashed).
  392. 25.49 s gammaloop-nextest-core> Message: snapshot assertion for 'parse_lmbsetting_crossection' failed in line 252
  393. 25.49 s gammaloop-nextest-core> Location: /nix/store/xdy1vvhll2bijdplvl9fcc2b9plkxhaa-vendor-cargo-deps/c19b7c6f923b580ac259164a89f2577984ad5ab09ee9d583b888f934adbbe8d0/insta-1.47.2/src/runtime.rs:719
  394. 25.49 s gammaloop-nextest-core>
  395. 25.49 s gammaloop-nextest-core> ━━━━━━━━━━━━━━━━━━━━━━━━━━━━━━━━━━ BACKTRACE ━━━━━━━━━━━━━━━━━━━━━━━━━━━━━━━━━━━
  396. 25.49 s gammaloop-nextest-core> 1: <color_eyre[b0c9e66060e883b2]::config::PanicHook>::panic_report<unknown>
  397. 25.49 s gammaloop-nextest-core> at <unknown source file>:<unknown line>
  398. 25.49 s gammaloop-nextest-core> 2: <color_eyre[b0c9e66060e883b2]::config::PanicHook>::into_panic_hook::{closure#0}<unknown>
  399. 25.49 s gammaloop-nextest-core> at <unknown source file>:<unknown line>
  400. 25.49 s gammaloop-nextest-core> 3: std[bcb96dfbba0ab899]::panicking::panic_with_hook<unknown>
  401. 25.49 s gammaloop-nextest-core> at <unknown source file>:<unknown line>
  402. 25.49 s gammaloop-nextest-core> 4: std[bcb96dfbba0ab899]::panicking::panic_handler::{closure#0}<unknown>
  403. 25.49 s gammaloop-nextest-core> at <unknown source file>:<unknown line>
  404. 25.49 s gammaloop-nextest-core> 5: std[bcb96dfbba0ab899]::sys::backtrace::__rust_end_short_backtrace::<std[bcb96dfbba0ab899]::panicking::panic_handler::{closure#0}, !><unknown>
  405. 25.49 s gammaloop-nextest-core> at <unknown source file>:<unknown line>
  406. 25.49 s gammaloop-nextest-core> 6: __rustc[6c289b9f9c454d21]::rust_begin_unwind<unknown>
  407. 25.49 s gammaloop-nextest-core> at <unknown source file>:<unknown line>
  408. 25.49 s gammaloop-nextest-core> 7: core[940e698046960fd5]::panicking::panic_fmt<unknown>
  409. 25.49 s gammaloop-nextest-core> at <unknown source file>:<unknown line>
  410. 25.49 s gammaloop-nextest-core> 8: insta[307a548ac79ef4d9]::runtime::assert_snapshot<unknown>
  411. 25.49 s gammaloop-nextest-core> at <unknown source file>:<unknown line>
  412. 25.49 s gammaloop-nextest-core> 9: gammalooprs[5490727360442cce]::graph::parse::tests::parse_lmbsetting_crossection<unknown>
  413. 25.49 s gammaloop-nextest-core> at <unknown source file>:<unknown line>
  414. 25.49 s gammaloop-nextest-core> 10: <gammalooprs[5490727360442cce]::graph::parse::tests::parse_lmbsetting_crossection::{closure#0} as core[940e698046960fd5]::ops::function::FnOnce<()>>::call_once<unknown>
  415. 25.49 s gammaloop-nextest-core> at <unknown source file>:<unknown line>
  416. 25.49 s gammaloop-nextest-core> 11: test[75d6903177b1d7e9]::__rust_begin_short_backtrace::<core[940e698046960fd5]::result::Result<(), alloc[2ea6bcb46fca0c42]::string::String>, fn() -> core[940e698046960fd5]::result::Result<(), alloc[2ea6bcb46fca0c42]::string::String>><unknown>
  417. 25.49 s gammaloop-nextest-core> at <unknown source file>:<unknown line>
  418. 25.49 s gammaloop-nextest-core> 12: test[75d6903177b1d7e9]::run_test::{closure#0}<unknown>
  419. 25.49 s gammaloop-nextest-core> at <unknown source file>:<unknown line>
  420. 25.49 s gammaloop-nextest-core> 13: std[bcb96dfbba0ab899]::sys::backtrace::__rust_begin_short_backtrace::<test[75d6903177b1d7e9]::run_test::{closure#1}, ()><unknown>
  421. 25.49 s gammaloop-nextest-core> at <unknown source file>:<unknown line>
  422. 25.49 s gammaloop-nextest-core> 14: <std[bcb96dfbba0ab899]::thread::lifecycle::spawn_unchecked<test[75d6903177b1d7e9]::run_test::{closure#1}, ()>::{closure#1} as core[940e698046960fd5]::ops::function::FnOnce<()>>::call_once::{shim:vtable#0}<unknown>
  423. 25.49 s gammaloop-nextest-core> at <unknown source file>:<unknown line>
  424. 25.49 s gammaloop-nextest-core> 15: <std[bcb96dfbba0ab899]::sys::thread::unix::Thread>::new::thread_start<unknown>
  425. 25.49 s gammaloop-nextest-core> at <unknown source file>:<unknown line>
  426. 25.49 s gammaloop-nextest-core> 16: start_thread<unknown>
  427. 25.49 s gammaloop-nextest-core> at <unknown source file>:<unknown line>
  428. 25.49 s gammaloop-nextest-core> 17: __clone3<unknown>
  429. 25.49 s gammaloop-nextest-core> at <unknown source file>:<unknown line>
  430. 25.49 s gammaloop-nextest-core>
  431. 25.49 s gammaloop-nextest-core> Run with COLORBT_SHOW_HIDDEN=1 environment variable to disable frame filtering.
  432. 25.49 s gammaloop-nextest-core> Run with RUST_BACKTRACE=full to include source snippets.
  433. 25.49 s gammaloop-nextest-core>
  434. 25.49 s gammaloop-nextest-core> FAIL [ 0.093s] (407/456) gammalooprs uv::export::tests::computed_node_full_numerator_is_a_spenso_aware_typst_fragment
  435. 25.49 s gammaloop-nextest-core> stdout ---
  436. 25.49 s gammaloop-nextest-core>
  437. 25.49 s gammaloop-nextest-core> running 1 test
  438. 25.49 s gammaloop-nextest-core> test uv::export::tests::computed_node_full_numerator_is_a_spenso_aware_typst_fragment ... FAILED
  439. 25.49 s gammaloop-nextest-core>
  440. 25.49 s gammaloop-nextest-core> failures:
  441. 25.49 s gammaloop-nextest-core>
  442. 25.49 s gammaloop-nextest-core> failures:
  443. 25.49 s gammaloop-nextest-core> uv::export::tests::computed_node_full_numerator_is_a_spenso_aware_typst_fragment
  444. 25.49 s gammaloop-nextest-core>
  445. 25.49 s gammaloop-nextest-core> test result: FAILED. 0 passed; 1 failed; 0 ignored; 0 measured; 508 filtered out; finished in 0.08s
  446. 25.49 s gammaloop-nextest-core>
  447. 25.49 s gammaloop-nextest-core> stderr ---
  448. 25.49 s gammaloop-nextest-core> The application panicked (crashed).
  449. 25.49 s gammaloop-nextest-core> Message: assertion failed: exported.dot.contains(r#"full_num = "op(\"Tr\")(1)";"#)
  450. 25.49 s gammaloop-nextest-core> Location: crates/gammalooprs/src/uv/export.rs:483
  451. 25.49 s gammaloop-nextest-core>
  452. 25.49 s gammaloop-nextest-core> ━━━━━━━━━━━━━━━━━━━━━━━━━━━━━━━━━━ BACKTRACE ━━━━━━━━━━━━━━━━━━━━━━━━━━━━━━━━━━━
  453. 25.49 s gammaloop-nextest-core> 1: <color_eyre[b0c9e66060e883b2]::config::PanicHook>::panic_report<unknown>
  454. 25.49 s gammaloop-nextest-core> at <unknown source file>:<unknown line>
  455. 25.49 s gammaloop-nextest-core> 2: <color_eyre[b0c9e66060e883b2]::config::PanicHook>::into_panic_hook::{closure#0}<unknown>
  456. 25.49 s gammaloop-nextest-core> at <unknown source file>:<unknown line>
  457. 25.49 s gammaloop-nextest-core> 3: std[bcb96dfbba0ab899]::panicking::panic_with_hook<unknown>
  458. 25.49 s gammaloop-nextest-core> at <unknown source file>:<unknown line>
  459. 25.49 s gammaloop-nextest-core> 4: std[bcb96dfbba0ab899]::panicking::panic_handler::{closure#0}<unknown>
  460. 25.49 s gammaloop-nextest-core> at <unknown source file>:<unknown line>
  461. 25.49 s gammaloop-nextest-core> 5: std[bcb96dfbba0ab899]::sys::backtrace::__rust_end_short_backtrace::<std[bcb96dfbba0ab899]::panicking::panic_handler::{closure#0}, !><unknown>
  462. 25.49 s gammaloop-nextest-core> at <unknown source file>:<unknown line>
  463. 25.49 s gammaloop-nextest-core> 6: __rustc[6c289b9f9c454d21]::rust_begin_unwind<unknown>
  464. 25.49 s gammaloop-nextest-core> at <unknown source file>:<unknown line>
  465. 25.49 s gammaloop-nextest-core> 7: core[940e698046960fd5]::panicking::panic_fmt<unknown>
  466. 25.49 s gammaloop-nextest-core> at <unknown source file>:<unknown line>
  467. 25.49 s gammaloop-nextest-core> 8: core[940e698046960fd5]::panicking::panic<unknown>
  468. 25.49 s gammaloop-nextest-core> at <unknown source file>:<unknown line>
  469. 25.49 s gammaloop-nextest-core> 9: gammalooprs[5490727360442cce]::uv::export::tests::computed_node_full_numerator_is_a_spenso_aware_typst_fragment<unknown>
  470. 25.49 s gammaloop-nextest-core> at <unknown source file>:<unknown line>
  471. 25.49 s gammaloop-nextest-core> 10: <gammalooprs[5490727360442cce]::uv::export::tests::computed_node_full_numerator_is_a_spenso_aware_typst_fragment::{closure#0} as core[940e698046960fd5]::ops::function::FnOnce<()>>::call_once<unknown>
  472. 25.49 s gammaloop-nextest-core> at <unknown source file>:<unknown line>
  473. 25.49 s gammaloop-nextest-core> 11: test[75d6903177b1d7e9]::__rust_begin_short_backtrace::<core[940e698046960fd5]::result::Result<(), alloc[2ea6bcb46fca0c42]::string::String>, fn() -> core[940e698046960fd5]::result::Result<(), alloc[2ea6bcb46fca0c42]::string::String>><unknown>
  474. 25.49 s gammaloop-nextest-core> at <unknown source file>:<unknown line>
  475. 25.49 s gammaloop-nextest-core> 12: test[75d6903177b1d7e9]::run_test::{closure#0}<unknown>
  476. 25.49 s gammaloop-nextest-core> at <unknown source file>:<unknown line>
  477. 25.49 s gammaloop-nextest-core> 13: std[bcb96dfbba0ab899]::sys::backtrace::__rust_begin_short_backtrace::<test[75d6903177b1d7e9]::run_test::{closure#1}, ()><unknown>
  478. 25.49 s gammaloop-nextest-core> at <unknown source file>:<unknown line>
  479. 25.49 s gammaloop-nextest-core> 14: <std[bcb96dfbba0ab899]::thread::lifecycle::spawn_unchecked<test[75d6903177b1d7e9]::run_test::{closure#1}, ()>::{closure#1} as core[940e698046960fd5]::ops::function::FnOnce<()>>::call_once::{shim:vtable#0}<unknown>
  480. 25.49 s gammaloop-nextest-core> at <unknown source file>:<unknown line>
  481. 25.49 s gammaloop-nextest-core> 15: <std[bcb96dfbba0ab899]::sys::thread::unix::Thread>::new::thread_start<unknown>
  482. 25.49 s gammaloop-nextest-core> at <unknown source file>:<unknown line>
  483. 25.49 s gammaloop-nextest-core> 16: start_thread<unknown>
  484. 25.49 s gammaloop-nextest-core> at <unknown source file>:<unknown line>
  485. 25.49 s gammaloop-nextest-core> 17: __clone3<unknown>
  486. 25.49 s gammaloop-nextest-core> at <unknown source file>:<unknown line>
  487. 25.49 s gammaloop-nextest-core>
  488. 25.49 s gammaloop-nextest-core> Run with COLORBT_SHOW_HIDDEN=1 environment variable to disable frame filtering.
  489. 25.49 s gammaloop-nextest-core> Run with RUST_BACKTRACE=full to include source snippets.
  490. 25.49 s gammaloop-nextest-core>
  491. 25.55 s gammaloop-nextest-core> error: test run failed
  492. 25.58 s gammaloop-nextest-core>
  493. 25.58 s gammaloop-nextest-core> ========== nextest test summary ==========
  494. 25.58 s gammaloop-nextest-core> report: target/nextest/ci_gammaloop/junit.xml
  495. 25.58 s gammaloop-nextest-core> tests: 456, failures: 2, errors: 0
  496. 25.58 s gammaloop-nextest-core>
  497. 25.58 s gammaloop-nextest-core> 1. gammalooprs::graph::parse::tests::parse_lmbsetting_crossection
  498. 25.58 s gammaloop-nextest-core> failure: test failure with exit code 101
  499. 25.58 s gammaloop-nextest-core> system-out
  500. 25.58 s gammaloop-nextest-core> running 1 test
  501. 25.58 s gammaloop-nextest-core> ━━━━━━━━━━━━━━━━━━━━━━━━━━━━━━━ Snapshot Summary ━━━━━━━━━━━━━━━━━━━━━━━━━━━━━━━
  502. 25.58 s gammaloop-nextest-core> Snapshot: parse_lmbsetting_crossection
  503. 25.58 s gammaloop-nextest-core> Source: crates/gammalooprs/src/graph/parse/tests.rs:252
  504. 25.58 s gammaloop-nextest-core> ────────────────────────────────────────────────────────────────────────────────
  505. 25.58 s gammaloop-nextest-core> Expression: g.debug_dot()
  506. 25.58 s gammaloop-nextest-core> ────────────────────────────────────────────────────────────────────────────────
  507. 25.58 s gammaloop-nextest-core> -old snapshot
  508. 25.58 s gammaloop-nextest-core> +new results
  509. 25.58 s gammaloop-nextest-core> ────────────┬───────────────────────────────────────────────────────────────────
  510. 25.58 s gammaloop-nextest-core> 1 │-digraph G{
  511. 25.58 s gammaloop-nextest-core> 1 │+digraph G {
  512. 25.58 s gammaloop-nextest-core> 2 2 │ num = "1/2";
  513. 25.58 s gammaloop-nextest-core> 3 3 │ overall_factor = "2*x";
  514. 25.58 s gammaloop-nextest-core> 4 4 │ overall_factor_evaluated = "2*x";
  515. 25.58 s gammaloop-nextest-core> 5 5 │ projector = "spenso::t";
  516. 25.58 s gammaloop-nextest-core> ────────────┴───────────────────────────────────────────────────────────────────
  517. 25.58 s gammaloop-nextest-core> To update snapshots run `cargo insta review`
  518. 25.58 s gammaloop-nextest-core> Stopped on the first failure. Run `cargo insta test` to run all snapshots.
  519. 25.58 s gammaloop-nextest-core> test graph::parse::tests::parse_lmbsetting_crossection ... FAILED
  520. 25.58 s gammaloop-nextest-core>
  521. 25.58 s gammaloop-nextest-core> failures:
  522. 25.58 s gammaloop-nextest-core>
  523. 25.58 s gammaloop-nextest-core> failures:
  524. 25.58 s gammaloop-nextest-core> graph::parse::tests::parse_lmbsetting_crossection
  525. 25.58 s gammaloop-nextest-core>
  526. 25.58 s gammaloop-nextest-core> test result: FAILED. 0 passed; 1 failed; 0 ignored; 0 measured; 508 filtered out; finished in 0.24s
  527. 25.58 s gammaloop-nextest-core> system-err
  528. 25.58 s gammaloop-nextest-core> [07:32:39.507] @gammalooprs::graph::attribute_warnings WARNING : Unknown node attribute 'color_num' on graph 'G', node 'A'; did you mean 'num'?
  529. 25.58 s gammaloop-nextest-core> at crates/gammalooprs/src/graph/attribute_warnings.rs:198
  530. 25.58 s gammaloop-nextest-core> The application panicked (crashed).
  531. 25.58 s gammaloop-nextest-core> Message: snapshot assertion for 'parse_lmbsetting_crossection' failed in line 252
  532. 25.58 s gammaloop-nextest-core> Location: /nix/store/xdy1vvhll2bijdplvl9fcc2b9plkxhaa-vendor-cargo-deps/c19b7c6f923b580ac259164a89f2577984ad5ab09ee9d583b888f934adbbe8d0/insta-1.47.2/src/runtime.rs:719
  533. 25.58 s gammaloop-nextest-core>
  534. 25.58 s gammaloop-nextest-core> ━━━━━━━━━━━━━━━━━━━━━━━━━━━━━━━━━━ BACKTRACE ━━━━━━━━━━━━━━━━━━━━━━━━━━━━━━━━━━━
  535. 25.58 s gammaloop-nextest-core> 1: <color_eyre[b0c9e66060e883b2]::config::PanicHook>::panic_report<unknown>
  536. 25.58 s gammaloop-nextest-core> at <unknown source file>:<unknown line>
  537. 25.58 s gammaloop-nextest-core> 2: <color_eyre[b0c9e66060e883b2]::config::PanicHook>::into_panic_hook::{closure#0}<unknown>
  538. 25.58 s gammaloop-nextest-core> at <unknown source file>:<unknown line>
  539. 25.58 s gammaloop-nextest-core> 3: std[bcb96dfbba0ab899]::panicking::panic_with_hook<unknown>
  540. 25.58 s gammaloop-nextest-core> at <unknown source file>:<unknown line>
  541. 25.58 s gammaloop-nextest-core> 4: std[bcb96dfbba0ab899]::panicking::panic_handler::{closure#0}<unknown>
  542. 25.58 s gammaloop-nextest-core> at <unknown source file>:<unknown line>
  543. 25.58 s gammaloop-nextest-core> 5: std[bcb96dfbba0ab899]::sys::backtrace::__rust_end_short_backtrace::<std[bcb96dfbba0ab899]::panicking::panic_handler::{closure#0}, !><unknown>
  544. 25.58 s gammaloop-nextest-core> at <unknown source file>:<unknown line>
  545. 25.58 s gammaloop-nextest-core> 6: __rustc[6c289b9f9c454d21]::rust_begin_unwind<unknown>
  546. 25.58 s gammaloop-nextest-core> at <unknown source file>:<unknown line>
  547. 25.58 s gammaloop-nextest-core> 7: core[940e698046960fd5]::panicking::panic_fmt<unknown>
  548. 25.58 s gammaloop-nextest-core> at <unknown source file>:<unknown line>
  549. 25.58 s gammaloop-nextest-core> 8: insta[307a548ac79ef4d9]::runtime::assert_snapshot<unknown>
  550. 25.58 s gammaloop-nextest-core> at <unknown source file>:<unknown line>
  551. 25.58 s gammaloop-nextest-core> 9: gammalooprs[5490727360442cce]::graph::parse::tests::parse_lmbsetting_crossection<unknown>
  552. 25.58 s gammaloop-nextest-core> at <unknown source file>:<unknown line>
  553. 25.58 s gammaloop-nextest-core> 10: <gammalooprs[5490727360442cce]::graph::parse::tests::parse_lmbsetting_crossection::{closure#0} as core[940e698046960fd5]::ops::function::FnOnce<()>>::call_once<unknown>
  554. 25.58 s gammaloop-nextest-core> at <unknown source file>:<unknown line>
  555. 25.58 s gammaloop-nextest-core> 11: test[75d6903177b1d7e9]::__rust_begin_short_backtrace::<core[940e698046960fd5]::result::Result<(), alloc[2ea6bcb46fca0c42]::string::String>, fn() -> core[940e698046960fd5]::result::Result<(), alloc[2ea6bcb46fca0c42]::string::String>><unknown>
  556. 25.58 s gammaloop-nextest-core> at <unknown source file>:<unknown line>
  557. 25.58 s gammaloop-nextest-core> 12: test[75d6903177b1d7e9]::run_test::{closure#0}<unknown>
  558. 25.58 s gammaloop-nextest-core> at <unknown source file>:<unknown line>
  559. 25.58 s gammaloop-nextest-core> 13: std[bcb96dfbba0ab899]::sys::backtrace::__rust_begin_short_backtrace::<test[75d6903177b1d7e9]::run_test::{closure#1}, ()><unknown>
  560. 25.58 s gammaloop-nextest-core> at <unknown source file>:<unknown line>
  561. 25.58 s gammaloop-nextest-core> 14: <std[bcb96dfbba0ab899]::thread::lifecycle::spawn_unchecked<test[75d6903177b1d7e9]::run_test::{closure#1}, ()>::{closure#1} as core[940e698046960fd5]::ops::function::FnOnce<()>>::call_once::{shim:vtable#0}<unknown>
  562. 25.58 s gammaloop-nextest-core> at <unknown source file>:<unknown line>
  563. 25.58 s gammaloop-nextest-core> 15: <std[bcb96dfbba0ab899]::sys::thread::unix::Thread>::new::thread_start<unknown>
  564. 25.58 s gammaloop-nextest-core> at <unknown source file>:<unknown line>
  565. 25.58 s gammaloop-nextest-core> 16: start_thread<unknown>
  566. 25.58 s gammaloop-nextest-core> at <unknown source file>:<unknown line>
  567. 25.58 s gammaloop-nextest-core> 17: __clone3<unknown>
  568. 25.58 s gammaloop-nextest-core> at <unknown source file>:<unknown line>
  569. 25.58 s gammaloop-nextest-core>
  570. 25.58 s gammaloop-nextest-core> Run with COLORBT_SHOW_HIDDEN=1 environment variable to disable frame filtering.
  571. 25.58 s gammaloop-nextest-core> Run with RUST_BACKTRACE=full to include source snippets.
  572. 25.58 s gammaloop-nextest-core>
  573. 25.58 s gammaloop-nextest-core> 2. gammalooprs::uv::export::tests::computed_node_full_numerator_is_a_spenso_aware_typst_fragment
  574. 25.58 s gammaloop-nextest-core> failure: test failure with exit code 101
  575. 25.58 s gammaloop-nextest-core> system-out
  576. 25.58 s gammaloop-nextest-core> running 1 test
  577. 25.58 s gammaloop-nextest-core> test uv::export::tests::computed_node_full_numerator_is_a_spenso_aware_typst_fragment ... FAILED
  578. 25.58 s gammaloop-nextest-core>
  579. 25.58 s gammaloop-nextest-core> failures:
  580. 25.58 s gammaloop-nextest-core>
  581. 25.58 s gammaloop-nextest-core> failures:
  582. 25.58 s gammaloop-nextest-core> uv::export::tests::computed_node_full_numerator_is_a_spenso_aware_typst_fragment
  583. 25.58 s gammaloop-nextest-core>
  584. 25.58 s gammaloop-nextest-core> test result: FAILED. 0 passed; 1 failed; 0 ignored; 0 measured; 508 filtered out; finished in 0.08s
  585. 25.58 s gammaloop-nextest-core> system-err
  586. 25.58 s gammaloop-nextest-core> The application panicked (crashed).
  587. 25.58 s gammaloop-nextest-core> Message: assertion failed: exported.dot.contains(r#"full_num = "op(\"Tr\")(1)";"#)
  588. 25.58 s gammaloop-nextest-core> Location: crates/gammalooprs/src/uv/export.rs:483
  589. 25.58 s gammaloop-nextest-core>
  590. 25.58 s gammaloop-nextest-core> ━━━━━━━━━━━━━━━━━━━━━━━━━━━━━━━━━━ BACKTRACE ━━━━━━━━━━━━━━━━━━━━━━━━━━━━━━━━━━━
  591. 25.58 s gammaloop-nextest-core> 1: <color_eyre[b0c9e66060e883b2]::config::PanicHook>::panic_report<unknown>
  592. 25.58 s gammaloop-nextest-core> at <unknown source file>:<unknown line>
  593. 25.58 s gammaloop-nextest-core> 2: <color_eyre[b0c9e66060e883b2]::config::PanicHook>::into_panic_hook::{closure#0}<unknown>
  594. 25.58 s gammaloop-nextest-core> at <unknown source file>:<unknown line>
  595. 25.58 s gammaloop-nextest-core> 3: std[bcb96dfbba0ab899]::panicking::panic_with_hook<unknown>
  596. 25.58 s gammaloop-nextest-core> at <unknown source file>:<unknown line>
  597. 25.58 s gammaloop-nextest-core> 4: std[bcb96dfbba0ab899]::panicking::panic_handler::{closure#0}<unknown>
  598. 25.58 s gammaloop-nextest-core> at <unknown source file>:<unknown line>
  599. 25.58 s gammaloop-nextest-core> 5: std[bcb96dfbba0ab899]::sys::backtrace::__rust_end_short_backtrace::<std[bcb96dfbba0ab899]::panicking::panic_handler::{closure#0}, !><unknown>
  600. 25.58 s gammaloop-nextest-core> at <unknown source file>:<unknown line>
  601. 25.58 s gammaloop-nextest-core> 6: __rustc[6c289b9f9c454d21]::rust_begin_unwind<unknown>
  602. 25.58 s gammaloop-nextest-core> at <unknown source file>:<unknown line>
  603. 25.58 s gammaloop-nextest-core> 7: core[940e698046960fd5]::panicking::panic_fmt<unknown>
  604. 25.58 s gammaloop-nextest-core> at <unknown source file>:<unknown line>
  605. 25.58 s gammaloop-nextest-core> 8: core[940e698046960fd5]::panicking::panic<unknown>
  606. 25.58 s gammaloop-nextest-core> at <unknown source file>:<unknown line>
  607. 25.58 s gammaloop-nextest-core> 9: gammalooprs[5490727360442cce]::uv::export::tests::computed_node_full_numerator_is_a_spenso_aware_typst_fragment<unknown>
  608. 25.58 s gammaloop-nextest-core> at <unknown source file>:<unknown line>
  609. 25.58 s gammaloop-nextest-core> 10: <gammalooprs[5490727360442cce]::uv::export::tests::computed_node_full_numerator_is_a_spenso_aware_typst_fragment::{closure#0} as core[940e698046960fd5]::ops::function::FnOnce<()>>::call_once<unknown>
  610. 25.58 s gammaloop-nextest-core> at <unknown source file>:<unknown line>
  611. 25.58 s gammaloop-nextest-core> 11: test[75d6903177b1d7e9]::__rust_begin_short_backtrace::<core[940e698046960fd5]::result::Result<(), alloc[2ea6bcb46fca0c42]::string::String>, fn() -> core[940e698046960fd5]::result::Result<(), alloc[2ea6bcb46fca0c42]::string::String>><unknown>
  612. 25.58 s gammaloop-nextest-core> at <unknown source file>:<unknown line>
  613. 25.58 s gammaloop-nextest-core> 12: test[75d6903177b1d7e9]::run_test::{closure#0}<unknown>
  614. 25.58 s gammaloop-nextest-core> at <unknown source file>:<unknown line>
  615. 25.58 s gammaloop-nextest-core> 13: std[bcb96dfbba0ab899]::sys::backtrace::__rust_begin_short_backtrace::<test[75d6903177b1d7e9]::run_test::{closure#1}, ()><unknown>
  616. 25.58 s gammaloop-nextest-core> at <unknown source file>:<unknown line>
  617. 25.58 s gammaloop-nextest-core> 14: <std[bcb96dfbba0ab899]::thread::lifecycle::spawn_unchecked<test[75d6903177b1d7e9]::run_test::{closure#1}, ()>::{closure#1} as core[940e698046960fd5]::ops::function::FnOnce<()>>::call_once::{shim:vtable#0}<unknown>
  618. 25.58 s gammaloop-nextest-core> at <unknown source file>:<unknown line>
  619. 25.58 s gammaloop-nextest-core> 15: <std[bcb96dfbba0ab899]::sys::thread::unix::Thread>::new::thread_start<unknown>
  620. 25.58 s gammaloop-nextest-core> at <unknown source file>:<unknown line>
  621. 25.58 s gammaloop-nextest-core> 16: start_thread<unknown>
  622. 25.58 s gammaloop-nextest-core> at <unknown source file>:<unknown line>
  623. 25.58 s gammaloop-nextest-core> 17: __clone3<unknown>
  624. 25.58 s gammaloop-nextest-core> at <unknown source file>:<unknown line>
  625. 25.58 s gammaloop-nextest-core>
  626. 25.58 s gammaloop-nextest-core> Run with COLORBT_SHOW_HIDDEN=1 environment variable to disable frame filtering.
  627. 25.58 s gammaloop-nextest-core> Run with RUST_BACKTRACE=full to include source snippets.
  628. 25.58 s gammaloop-nextest-core> =========================================
  629. 25.62 s error: Cannot build '/nix/store/hm35l98s8jf76hp5gsphwyhqjj06gcak-gammaloop-nextest-core.drv'.
  630. 25.62 s Reason: builder failed with exit code 100.
  631. 25.62 s Output paths:
  632. 25.62 s /nix/store/80jd605dh1wzcz3n78a4ml152ndysq85-gammaloop-nextest-core
  633. 25.62 s Last 612 log lines:
  634. 25.62 s > Extracting 3 binaries (including 1 non-test binary), 1 build script output directory, and 2 linked paths to /build/nextest-archive-WDA7hg
  635. 25.62 s > Extracted 18 files to /build/nextest-archive-WDA7hg in 0.45s
  636. 25.62 s > ------------
  637. 25.62 s > Nextest run ID 2e14c2d0-1500-4958-b1fc-7164816a24fc with nextest profile: ci_gammaloop
  638. 25.62 s > Starting 339 tests across 2 binaries
  639. 25.62 s > FAIL [ 0.021s] (246/339) gammaloop-api repl::tests::completion_shows_type_hint_for_non_boolean_settings_leaf
  640. 25.62 s > stdout ---
  641. 25.62 s >
  642. 25.62 s > running 1 test
  643. 25.62 s > test repl::tests::completion_shows_type_hint_for_non_boolean_settings_leaf ... FAILED
  644. 25.62 s >
  645. 25.62 s > failures:
  646. 25.62 s >
  647. 25.62 s > failures:
  648. 25.62 s > repl::tests::completion_shows_type_hint_for_non_boolean_settings_leaf
  649. 25.62 s >
  650. 25.62 s > test result: FAILED. 0 passed; 1 failed; 0 ignored; 0 measured; 338 filtered out; finished in 0.01s
  651. 25.62 s >
  652. 25.62 s > stderr ---
  653. 25.62 s >
  654. 25.62 s > thread 'repl::tests::completion_shows_type_hint_for_non_boolean_settings_leaf' (772) panicked at crates/gammaloop-api/src/repl.rs:5778:9:
  655. 25.62 s > [Suggestion { value: "", description: Some("Number of samples in the first Monte Carlo iteration."), style: None, extra: None, span: Span { start: 42, end: 42 }, append_whitespace: false }]
  656. 25.62 s > stack backtrace:
  657. 25.62 s > 0: __rustc::rust_begin_unwind
  658. 25.62 s > 1: core::panicking::panic_fmt
  659. 25.62 s > 2: gammaloop_api::repl::tests::completion_shows_type_hint_for_non_boolean_settings_leaf
  660. 25.62 s > 3: <gammaloop_api::repl::tests::completion_shows_type_hint_for_non_boolean_settings_leaf::{closure#0} as core::ops::function::FnOnce<()>>::call_once
  661. 25.62 s > note: Some details are omitted, run with `RUST_BACKTRACE=full` for a verbose backtrace.
  662. 25.62 s >
  663. 25.62 s > FAIL [ 0.026s] (275/339) gammaloop-api templates::tests::extract_templates_uses_canonical_package_layout
  664. 25.62 s > stdout ---
  665. 25.62 s >
  666. 25.62 s > running 1 test
  667. 25.62 s > test templates::tests::extract_templates_uses_canonical_package_layout ... FAILED
  668. 25.62 s >
  669. 25.62 s > failures:
  670. 25.62 s >
  671. 25.62 s > failures:
  672. 25.62 s > templates::tests::extract_templates_uses_canonical_package_layout
  673. 25.62 s >
  674. 25.62 s > test result: FAILED. 0 passed; 1 failed; 0 ignored; 0 measured; 338 filtered out; finished in 0.02s
  675. 25.62 s >
  676. 25.62 s > stderr ---
  677. 25.62 s >
  678. 25.62 s > thread 'templates::tests::extract_templates_uses_canonical_package_layout' (866) panicked at crates/gammaloop-api/src/templates.rs:99:9:
  679. 25.62 s > assertion failed: figure.contains("amplitude-mode")
  680. 25.62 s > stack backtrace:
  681. 25.62 s > 0: __rustc::rust_begin_unwind
  682. 25.62 s > 1: core::panicking::panic_fmt
  683. 25.62 s > 2: core::panicking::panic
  684. 25.62 s > 3: gammaloop_api::templates::tests::extract_templates_uses_canonical_package_layout
  685. 25.62 s > 4: <gammaloop_api::templates::tests::extract_templates_uses_canonical_package_layout::{closure#0} as core::ops::function::FnOnce<()>>::call_once
  686. 25.62 s > note: Some details are omitted, run with `RUST_BACKTRACE=full` for a verbose backtrace.
  687. 25.62 s >
  688. 25.62 s > ------------
  689. 25.62 s > Summary [ 0.616s] 339 tests run: 337 passed, 2 failed, 0 skipped
  690. 25.62 s > FAIL [ 0.021s] (246/339) gammaloop-api repl::tests::completion_shows_type_hint_for_non_boolean_settings_leaf
  691. 25.62 s > stdout ---
  692. 25.62 s >
  693. 25.62 s > running 1 test
  694. 25.62 s > test repl::tests::completion_shows_type_hint_for_non_boolean_settings_leaf ... FAILED
  695. 25.62 s >
  696. 25.62 s > failures:
  697. 25.62 s >
  698. 25.62 s > failures:
  699. 25.62 s > repl::tests::completion_shows_type_hint_for_non_boolean_settings_leaf
  700. 25.62 s >
  701. 25.62 s > test result: FAILED. 0 passed; 1 failed; 0 ignored; 0 measured; 338 filtered out; finished in 0.01s
  702. 25.62 s >
  703. 25.62 s > stderr ---
  704. 25.62 s >
  705. 25.62 s > thread 'repl::tests::completion_shows_type_hint_for_non_boolean_settings_leaf' (772) panicked at crates/gammaloop-api/src/repl.rs:5778:9:
  706. 25.62 s > [Suggestion { value: "", description: Some("Number of samples in the first Monte Carlo iteration."), style: None, extra: None, span: Span { start: 42, end: 42 }, append_whitespace: false }]
  707. 25.62 s > stack backtrace:
  708. 25.62 s > 0: __rustc::rust_begin_unwind
  709. 25.62 s > 1: core::panicking::panic_fmt
  710. 25.62 s > 2: gammaloop_api::repl::tests::completion_shows_type_hint_for_non_boolean_settings_leaf
  711. 25.62 s > 3: <gammaloop_api::repl::tests::completion_shows_type_hint_for_non_boolean_settings_leaf::{closure#0} as core::ops::function::FnOnce<()>>::call_once
  712. 25.62 s > note: Some details are omitted, run with `RUST_BACKTRACE=full` for a verbose backtrace.
  713. 25.62 s >
  714. 25.62 s > FAIL [ 0.026s] (275/339) gammaloop-api templates::tests::extract_templates_uses_canonical_package_layout
  715. 25.62 s > stdout ---
  716. 25.62 s >
  717. 25.62 s > running 1 test
  718. 25.62 s > test templates::tests::extract_templates_uses_canonical_package_layout ... FAILED
  719. 25.62 s >
  720. 25.62 s > failures:
  721. 25.62 s >
  722. 25.62 s > failures:
  723. 25.62 s > templates::tests::extract_templates_uses_canonical_package_layout
  724. 25.62 s >
  725. 25.62 s > test result: FAILED. 0 passed; 1 failed; 0 ignored; 0 measured; 338 filtered out; finished in 0.02s
  726. 25.62 s >
  727. 25.62 s > stderr ---
  728. 25.62 s >
  729. 25.62 s > thread 'templates::tests::extract_templates_uses_canonical_package_layout' (866) panicked at crates/gammaloop-api/src/templates.rs:99:9:
  730. 25.62 s > assertion failed: figure.contains("amplitude-mode")
  731. 25.62 s > stack backtrace:
  732. 25.62 s > 0: __rustc::rust_begin_unwind
  733. 25.62 s > 1: core::panicking::panic_fmt
  734. 25.62 s > 2: core::panicking::panic
  735. 25.62 s > 3: gammaloop_api::templates::tests::extract_templates_uses_canonical_package_layout
  736. 25.62 s > 4: <gammaloop_api::templates::tests::extract_templates_uses_canonical_package_layout::{closure#0} as core::ops::function::FnOnce<()>>::call_once
  737. 25.62 s > note: Some details are omitted, run with `RUST_BACKTRACE=full` for a verbose backtrace.
  738. 25.62 s >
  739. 25.62 s > error: test run failed
  740. 25.62 s >
  741. 25.62 s > ========== nextest test summary ==========
  742. 25.62 s > report: target/nextest/ci_gammaloop/junit.xml
  743. 25.62 s > tests: 339, failures: 2, errors: 0
  744. 25.62 s >
  745. 25.62 s > 1. gammaloop-api::repl::tests::completion_shows_type_hint_for_non_boolean_settings_leaf
  746. 25.62 s > failure: test failure with exit code 101
  747. 25.62 s > thread 'repl::tests::completion_shows_type_hint_for_non_boolean_settings_leaf' (772) panicked at crates/gammaloop-api/src/repl.rs:5778:9:
  748. 25.62 s > [Suggestion { value: "", description: Some("Number of samples in the first Monte Carlo iteration."), style: None, extra: None, span: Span { start: 42, end: 42 }, append_whitespace: false }]
  749. 25.62 s > stack backtrace:
  750. 25.62 s > 0: __rustc::rust_begin_unwind
  751. 25.62 s > 1: core::panicking::panic_fmt
  752. 25.62 s > 2: gammaloop_api::repl::tests::completion_shows_type_hint_for_non_boolean_settings_leaf
  753. 25.62 s > 3: <gammaloop_api::repl::tests::completion_shows_type_hint_for_non_boolean_settings_leaf::{closure#0} as core::ops::function::FnOnce<()>>::call_once
  754. 25.62 s > note: Some details are omitted, run with `RUST_BACKTRACE=full` for a verbose backtrace.
  755. 25.62 s > system-out
  756. 25.62 s > running 1 test
  757. 25.62 s > test repl::tests::completion_shows_type_hint_for_non_boolean_settings_leaf ... FAILED
  758. 25.62 s >
  759. 25.62 s > failures:
  760. 25.62 s >
  761. 25.62 s > failures:
  762. 25.62 s > repl::tests::completion_shows_type_hint_for_non_boolean_settings_leaf
  763. 25.62 s >
  764. 25.62 s > test result: FAILED. 0 passed; 1 failed; 0 ignored; 0 measured; 338 filtered out; finished in 0.01s
  765. 25.62 s > system-err
  766. 25.62 s > thread 'repl::tests::completion_shows_type_hint_for_non_boolean_settings_leaf' (772) panicked at crates/gammaloop-api/src/repl.rs:5778:9:
  767. 25.62 s > [Suggestion { value: "", description: Some("Number of samples in the first Monte Carlo iteration."), style: None, extra: None, span: Span { start: 42, end: 42 }, append_whitespace: false }]
  768. 25.62 s > stack backtrace:
  769. 25.62 s > 0: __rustc::rust_begin_unwind
  770. 25.62 s > 1: core::panicking::panic_fmt
  771. 25.62 s > 2: gammaloop_api::repl::tests::completion_shows_type_hint_for_non_boolean_settings_leaf
  772. 25.62 s > 3: <gammaloop_api::repl::tests::completion_shows_type_hint_for_non_boolean_settings_leaf::{closure#0} as core::ops::function::FnOnce<()>>::call_once
  773. 25.62 s > note: Some details are omitted, run with `RUST_BACKTRACE=full` for a verbose backtrace.
  774. 25.62 s >
  775. 25.62 s > 2. gammaloop-api::templates::tests::extract_templates_uses_canonical_package_layout
  776. 25.62 s > failure: test failure with exit code 101
  777. 25.62 s > thread 'templates::tests::extract_templates_uses_canonical_package_layout' (866) panicked at crates/gammaloop-api/src/templates.rs:99:9:
  778. 25.62 s > assertion failed: figure.contains("amplitude-mode")
  779. 25.62 s > stack backtrace:
  780. 25.62 s > 0: __rustc::rust_begin_unwind
  781. 25.62 s > 1: core::panicking::panic_fmt
  782. 25.62 s > 2: core::panicking::panic
  783. 25.62 s > 3: gammaloop_api::templates::tests::extract_templates_uses_canonical_package_layout
  784. 25.62 s > 4: <gammaloop_api::templates::tests::extract_templates_uses_canonical_package_layout::{closure#0} as core::ops::function::FnOnce<()>>::call_once
  785. 25.62 s > note: Some details are omitted, run with `RUST_BACKTRACE=full` for a verbose backtrace.
  786. 25.62 s > system-out
  787. 25.62 s > running 1 test
  788. 25.62 s > test templates::tests::extract_templates_uses_canonical_package_layout ... FAILED
  789. 25.62 s >
  790. 25.62 s > failures:
  791. 25.62 s >
  792. 25.62 s > failures:
  793. 25.62 s > templates::tests::extract_templates_uses_canonical_package_layout
  794. 25.62 s >
  795. 25.62 s > test result: FAILED. 0 passed; 1 failed; 0 ignored; 0 measured; 338 filtered out; finished in 0.02s
  796. 25.62 s > system-err
  797. 25.62 s > thread 'templates::tests::extract_templates_uses_canonical_package_layout' (866) panicked at crates/gammaloop-api/src/templates.rs:99:9:
  798. 25.62 s > assertion failed: figure.contains("amplitude-mode")
  799. 25.62 s > stack backtrace:
  800. 25.62 s > 0: __rustc::rust_begin_unwind
  801. 25.62 s > 1: core::panicking::panic_fmt
  802. 25.62 s > 2: core::panicking::panic
  803. 25.62 s > 3: gammaloop_api::templates::tests::extract_templates_uses_canonical_package_layout
  804. 25.62 s > 4: <gammaloop_api::templates::tests::extract_templates_uses_canonical_package_layout::{closure#0} as core::ops::function::FnOnce<()>>::call_once
  805. 25.62 s > note: Some details are omitted, run with `RUST_BACKTRACE=full` for a verbose backtrace.
  806. 25.62 s > =========================================
  807. 25.62 s > Extracting 1 binary and 1 linked path to /build/nextest-archive-2I0li2
  808. 25.62 s > Extracted 7 files to /build/nextest-archive-2I0li2 in 0.08s
  809. 25.62 s > ------------
  810. 25.62 s > Nextest run ID bb1fa411-686d-467f-bc45-1edf589e7f10 with nextest profile: ci_gammaloop
  811. 25.62 s > Starting 19 tests across 1 binary
  812. 25.62 s > ------------
  813. 25.62 s > Summary [ 0.014s] 19 tests run: 19 passed, 0 skipped
  814. 25.62 s >
  815. 25.62 s > ========== nextest test summary ==========
  816. 25.62 s > report: target/nextest/ci_gammaloop/junit.xml
  817. 25.62 s > tests: 19, failures: 0, errors: 0
  818. 25.62 s > No failing testcases found.
  819. 25.62 s > =========================================
  820. 25.62 s > Extracting 1 binary to /build/nextest-archive-A3h96q
  821. 25.62 s > Extracted 4 files to /build/nextest-archive-A3h96q in 0.03s
  822. 25.62 s > ------------
  823. 25.62 s > Nextest run ID 34ca2ab5-363d-458b-a8e3-406e68f323b4 with nextest profile: ci_gammaloop
  824. 25.62 s > Starting 0 tests across 1 binary
  825. 25.62 s > ------------
  826. 25.62 s > Summary [ 0.000s] 0 tests run: 0 passed, 0 skipped
  827. 25.62 s >
  828. 25.62 s > ========== nextest test summary ==========
  829. 25.62 s > report: target/nextest/ci_gammaloop/junit.xml
  830. 25.62 s > tests: 0, failures: 0, errors: 0
  831. 25.62 s > No failing testcases found.
  832. 25.62 s > =========================================
  833. 25.62 s > Extracting 4 binaries, 1 build script output directory, and 2 linked paths to /build/nextest-archive-MDu9aG
  834. 25.62 s > Extracted 18 files to /build/nextest-archive-MDu9aG in 0.47s
  835. 25.62 s > ------------
  836. 25.62 s > Nextest run ID 7dd86df6-9b93-4cef-8dae-9c33b82892e6 with nextest profile: ci_gammaloop
  837. 25.62 s > Starting 456 tests across 4 binaries (61 tests skipped, including 60 tests via profile.ci_gammaloop.default-filter)
  838. 25.62 s > FAIL [ 0.253s] (159/456) gammalooprs graph::parse::tests::parse_lmbsetting_crossection
  839. 25.62 s > stdout ---
  840. 25.62 s >
  841. 25.62 s > running 1 test
  842. 25.62 s > ━━━━━━━━━━━━━━━━━━━━━━━━━━━━━━━ Snapshot Summary ━━━━━━━━━━━━━━━━━━━━━━━━━━━━━━━
  843. 25.62 s > Snapshot: parse_lmbsetting_crossection
  844. 25.62 s > Source: crates/gammalooprs/src/graph/parse/tests.rs:252
  845. 25.62 s > ────────────────────────────────────────────────────────────────────────────────
  846. 25.62 s > Expression: g.debug_dot()
  847. 25.62 s > ────────────────────────────────────────────────────────────────────────────────
  848. 25.62 s > -old snapshot
  849. 25.62 s > +new results
  850. 25.62 s > ────────────┬───────────────────────────────────────────────────────────────────
  851. 25.62 s > 1 │-digraph G{
  852. 25.62 s > 1 │+digraph G {
  853. 25.62 s > 2 2 │ num = "1/2";
  854. 25.62 s > 3 3 │ overall_factor = "2*x";
  855. 25.62 s > 4 4 │ overall_factor_evaluated = "2*x";
  856. 25.62 s > 5 5 │ projector = "spenso::t";
  857. 25.62 s > ────────────┴───────────────────────────────────────────────────────────────────
  858. 25.62 s > To update snapshots run `cargo insta review`
  859. 25.62 s > Stopped on the first failure. Run `cargo insta test` to run all snapshots.
  860. 25.62 s > test graph::parse::tests::parse_lmbsetting_crossection ... FAILED
  861. 25.62 s >
  862. 25.62 s > failures:
  863. 25.62 s >
  864. 25.62 s > failures:
  865. 25.62 s > graph::parse::tests::parse_lmbsetting_crossection
  866. 25.62 s >
  867. 25.62 s > test result: FAILED. 0 passed; 1 failed; 0 ignored; 0 measured; 508 filtered out; finished in 0.24s
  868. 25.62 s >
  869. 25.62 s > stderr ---
  870. 25.62 s > [07:32:39.507] @gammalooprs::graph::attribute_warnings WARNING : Unknown node attribute 'color_num' on graph 'G', node 'A'; did you mean 'num'?
  871. 25.62 s > at crates/gammalooprs/src/graph/attribute_warnings.rs:198
  872. 25.62 s > The application panicked (crashed).
  873. 25.62 s > Message: snapshot assertion for 'parse_lmbsetting_crossection' failed in line 252
  874. 25.62 s > Location: /nix/store/xdy1vvhll2bijdplvl9fcc2b9plkxhaa-vendor-cargo-deps/c19b7c6f923b580ac259164a89f2577984ad5ab09ee9d583b888f934adbbe8d0/insta-1.47.2/src/runtime.rs:719
  875. 25.62 s >
  876. 25.62 s > ━━━━━━━━━━━━━━━━━━━━━━━━━━━━━━━━━━ BACKTRACE ━━━━━━━━━━━━━━━━━━━━━━━━━━━━━━━━━━━
  877. 25.62 s > 1: <color_eyre[b0c9e66060e883b2]::config::PanicHook>::panic_report<unknown>
  878. 25.62 s > at <unknown source file>:<unknown line>
  879. 25.62 s > 2: <color_eyre[b0c9e66060e883b2]::config::PanicHook>::into_panic_hook::{closure#0}<unknown>
  880. 25.62 s > at <unknown source file>:<unknown line>
  881. 25.62 s > 3: std[bcb96dfbba0ab899]::panicking::panic_with_hook<unknown>
  882. 25.62 s > at <unknown source file>:<unknown line>
  883. 25.62 s > 4: std[bcb96dfbba0ab899]::panicking::panic_handler::{closure#0}<unknown>
  884. 25.62 s > at <unknown source file>:<unknown line>
  885. 25.62 s > 5: std[bcb96dfbba0ab899]::sys::backtrace::__rust_end_short_backtrace::<std[bcb96dfbba0ab899]::panicking::panic_handler::{closure#0}, !><unknown>
  886. 25.62 s > at <unknown source file>:<unknown line>
  887. 25.62 s > 6: __rustc[6c289b9f9c454d21]::rust_begin_unwind<unknown>
  888. 25.62 s > at <unknown source file>:<unknown line>
  889. 25.62 s > 7: core[940e698046960fd5]::panicking::panic_fmt<unknown>
  890. 25.62 s > at <unknown source file>:<unknown line>
  891. 25.62 s > 8: insta[307a548ac79ef4d9]::runtime::assert_snapshot<unknown>
  892. 25.62 s > at <unknown source file>:<unknown line>
  893. 25.62 s > 9: gammalooprs[5490727360442cce]::graph::parse::tests::parse_lmbsetting_crossection<unknown>
  894. 25.62 s > at <unknown source file>:<unknown line>
  895. 25.62 s > 10: <gammalooprs[5490727360442cce]::graph::parse::tests::parse_lmbsetting_crossection::{closure#0} as core[940e698046960fd5]::ops::function::FnOnce<()>>::call_once<unknown>
  896. 25.62 s > at <unknown source file>:<unknown line>
  897. 25.62 s > 11: test[75d6903177b1d7e9]::__rust_begin_short_backtrace::<core[940e698046960fd5]::result::Result<(), alloc[2ea6bcb46fca0c42]::string::String>, fn() -> core[940e698046960fd5]::result::Result<(), alloc[2ea6bcb46fca0c42]::string::String>><unknown>
  898. 25.62 s > at <unknown source file>:<unknown line>
  899. 25.62 s > 12: test[75d6903177b1d7e9]::run_test::{closure#0}<unknown>
  900. 25.62 s > at <unknown source file>:<unknown line>
  901. 25.62 s > 13: std[bcb96dfbba0ab899]::sys::backtrace::__rust_begin_short_backtrace::<test[75d6903177b1d7e9]::run_test::{closure#1}, ()><unknown>
  902. 25.62 s > at <unknown source file>:<unknown line>
  903. 25.62 s > 14: <std[bcb96dfbba0ab899]::thread::lifecycle::spawn_unchecked<test[75d6903177b1d7e9]::run_test::{closure#1}, ()>::{closure#1} as core[940e698046960fd5]::ops::function::FnOnce<()>>::call_once::{shim:vtable#0}<unknown>
  904. 25.62 s > at <unknown source file>:<unknown line>
  905. 25.62 s > 15: <std[bcb96dfbba0ab899]::sys::thread::unix::Thread>::new::thread_start<unknown>
  906. 25.62 s > at <unknown source file>:<unknown line>
  907. 25.62 s > 16: start_thread<unknown>
  908. 25.62 s > at <unknown source file>:<unknown line>
  909. 25.62 s > 17: __clone3<unknown>
  910. 25.62 s > at <unknown source file>:<unknown line>
  911. 25.62 s >
  912. 25.62 s > Run with COLORBT_SHOW_HIDDEN=1 environment variable to disable frame filtering.
  913. 25.62 s > Run with RUST_BACKTRACE=full to include source snippets.
  914. 25.62 s >
  915. 25.62 s > FAIL [ 0.093s] (407/456) gammalooprs uv::export::tests::computed_node_full_numerator_is_a_spenso_aware_typst_fragment
  916. 25.62 s > stdout ---
  917. 25.62 s >
  918. 25.62 s > running 1 test
  919. 25.62 s > test uv::export::tests::computed_node_full_numerator_is_a_spenso_aware_typst_fragment ... FAILED
  920. 25.62 s >
  921. 25.62 s > failures:
  922. 25.62 s >
  923. 25.62 s > failures:
  924. 25.62 s > uv::export::tests::computed_node_full_numerator_is_a_spenso_aware_typst_fragment
  925. 25.62 s >
  926. 25.62 s > test result: FAILED. 0 passed; 1 failed; 0 ignored; 0 measured; 508 filtered out; finished in 0.08s
  927. 25.62 s >
  928. 25.62 s > stderr ---
  929. 25.62 s > The application panicked (crashed).
  930. 25.62 s > Message: assertion failed: exported.dot.contains(r#"full_num = "op(\"Tr\")(1)";"#)
  931. 25.62 s > Location: crates/gammalooprs/src/uv/export.rs:483
  932. 25.62 s >
  933. 25.62 s > ━━━━━━━━━━━━━━━━━━━━━━━━━━━━━━━━━━ BACKTRACE ━━━━━━━━━━━━━━━━━━━━━━━━━━━━━━━━━━━
  934. 25.62 s > 1: <color_eyre[b0c9e66060e883b2]::config::PanicHook>::panic_report<unknown>
  935. 25.62 s > at <unknown source file>:<unknown line>
  936. 25.62 s > 2: <color_eyre[b0c9e66060e883b2]::config::PanicHook>::into_panic_hook::{closure#0}<unknown>
  937. 25.62 s > at <unknown source file>:<unknown line>
  938. 25.62 s > 3: std[bcb96dfbba0ab899]::panicking::panic_with_hook<unknown>
  939. 25.62 s > at <unknown source file>:<unknown line>
  940. 25.62 s > 4: std[bcb96dfbba0ab899]::panicking::panic_handler::{closure#0}<unknown>
  941. 25.62 s > at <unknown source file>:<unknown line>
  942. 25.62 s > 5: std[bcb96dfbba0ab899]::sys::backtrace::__rust_end_short_backtrace::<std[bcb96dfbba0ab899]::panicking::panic_handler::{closure#0}, !><unknown>
  943. 25.62 s > at <unknown source file>:<unknown line>
  944. 25.62 s > 6: __rustc[6c289b9f9c454d21]::rust_begin_unwind<unknown>
  945. 25.62 s > at <unknown source file>:<unknown line>
  946. 25.62 s > 7: core[940e698046960fd5]::panicking::panic_fmt<unknown>
  947. 25.62 s > at <unknown source file>:<unknown line>
  948. 25.62 s > 8: core[940e698046960fd5]::panicking::panic<unknown>
  949. 25.62 s > at <unknown source file>:<unknown line>
  950. 25.62 s > 9: gammalooprs[5490727360442cce]::uv::export::tests::computed_node_full_numerator_is_a_spenso_aware_typst_fragment<unknown>
  951. 25.62 s > at <unknown source file>:<unknown line>
  952. 25.62 s > 10: <gammalooprs[5490727360442cce]::uv::export::tests::computed_node_full_numerator_is_a_spenso_aware_typst_fragment::{closure#0} as core[940e698046960fd5]::ops::function::FnOnce<()>>::call_once<unknown>
  953. 25.62 s > at <unknown source file>:<unknown line>
  954. 25.62 s > 11: test[75d6903177b1d7e9]::__rust_begin_short_backtrace::<core[940e698046960fd5]::result::Result<(), alloc[2ea6bcb46fca0c42]::string::String>, fn() -> core[940e698046960fd5]::result::Result<(), alloc[2ea6bcb46fca0c42]::string::String>><unknown>
  955. 25.62 s > at <unknown source file>:<unknown line>
  956. 25.62 s > 12: test[75d6903177b1d7e9]::run_test::{closure#0}<unknown>
  957. 25.62 s > at <unknown source file>:<unknown line>
  958. 25.62 s > 13: std[bcb96dfbba0ab899]::sys::backtrace::__rust_begin_short_backtrace::<test[75d6903177b1d7e9]::run_test::{closure#1}, ()><unknown>
  959. 25.62 s > at <unknown source file>:<unknown line>
  960. 25.62 s > 14: <std[bcb96dfbba0ab899]::thread::lifecycle::spawn_unchecked<test[75d6903177b1d7e9]::run_test::{closure#1}, ()>::{closure#1} as core[940e698046960fd5]::ops::function::FnOnce<()>>::call_once::{shim:vtable#0}<unknown>
  961. 25.62 s > at <unknown source file>:<unknown line>
  962. 25.62 s > 15: <std[bcb96dfbba0ab899]::sys::thread::unix::Thread>::new::thread_start<unknown>
  963. 25.62 s > at <unknown source file>:<unknown line>
  964. 25.62 s > 16: start_thread<unknown>
  965. 25.62 s > at <unknown source file>:<unknown line>
  966. 25.62 s > 17: __clone3<unknown>
  967. 25.62 s > at <unknown source file>:<unknown line>
  968. 25.62 s >
  969. 25.62 s > Run with COLORBT_SHOW_HIDDEN=1 environment variable to disable frame filtering.
  970. 25.62 s > Run with RUST_BACKTRACE=full to include source snippets.
  971. 25.62 s >
  972. 25.62 s > ------------
  973. 25.62 s > Summary [ 8.606s] 456 tests run: 454 passed, 2 failed, 61 skipped
  974. 25.62 s > FAIL [ 0.253s] (159/456) gammalooprs graph::parse::tests::parse_lmbsetting_crossection
  975. 25.62 s > stdout ---
  976. 25.62 s >
  977. 25.62 s > running 1 test
  978. 25.62 s > ━━━━━━━━━━━━━━━━━━━━━━━━━━━━━━━ Snapshot Summary ━━━━━━━━━━━━━━━━━━━━━━━━━━━━━━━
  979. 25.62 s > Snapshot: parse_lmbsetting_crossection
  980. 25.62 s > Source: crates/gammalooprs/src/graph/parse/tests.rs:252
  981. 25.62 s > ────────────────────────────────────────────────────────────────────────────────
  982. 25.62 s > Expression: g.debug_dot()
  983. 25.62 s > ────────────────────────────────────────────────────────────────────────────────
  984. 25.62 s > -old snapshot
  985. 25.62 s > +new results
  986. 25.62 s > ────────────┬───────────────────────────────────────────────────────────────────
  987. 25.62 s > 1 │-digraph G{
  988. 25.62 s > 1 │+digraph G {
  989. 25.62 s > 2 2 │ num = "1/2";
  990. 25.62 s > 3 3 │ overall_factor = "2*x";
  991. 25.62 s > 4 4 │ overall_factor_evaluated = "2*x";
  992. 25.62 s > 5 5 │ projector = "spenso::t";
  993. 25.62 s > ────────────┴───────────────────────────────────────────────────────────────────
  994. 25.62 s > To update snapshots run `cargo insta review`
  995. 25.62 s > Stopped on the first failure. Run `cargo insta test` to run all snapshots.
  996. 25.62 s > test graph::parse::tests::parse_lmbsetting_crossection ... FAILED
  997. 25.62 s >
  998. 25.62 s > failures:
  999. 25.62 s >
  1000. 25.62 s > failures:
  1001. 25.62 s > graph::parse::tests::parse_lmbsetting_crossection
  1002. 25.62 s >
  1003. 25.62 s > test result: FAILED. 0 passed; 1 failed; 0 ignored; 0 measured; 508 filtered out; finished in 0.24s
  1004. 25.62 s >
  1005. 25.62 s > stderr ---
  1006. 25.62 s > [07:32:39.507] @gammalooprs::graph::attribute_warnings WARNING : Unknown node attribute 'color_num' on graph 'G', node 'A'; did you mean 'num'?
  1007. 25.62 s > at crates/gammalooprs/src/graph/attribute_warnings.rs:198
  1008. 25.62 s > The application panicked (crashed).
  1009. 25.62 s > Message: snapshot assertion for 'parse_lmbsetting_crossection' failed in line 252
  1010. 25.62 s > Location: /nix/store/xdy1vvhll2bijdplvl9fcc2b9plkxhaa-vendor-cargo-deps/c19b7c6f923b580ac259164a89f2577984ad5ab09ee9d583b888f934adbbe8d0/insta-1.47.2/src/runtime.rs:719
  1011. 25.62 s >
  1012. 25.62 s > ━━━━━━━━━━━━━━━━━━━━━━━━━━━━━━━━━━ BACKTRACE ━━━━━━━━━━━━━━━━━━━━━━━━━━━━━━━━━━━
  1013. 25.62 s > 1: <color_eyre[b0c9e66060e883b2]::config::PanicHook>::panic_report<unknown>
  1014. 25.62 s > at <unknown source file>:<unknown line>
  1015. 25.62 s > 2: <color_eyre[b0c9e66060e883b2]::config::PanicHook>::into_panic_hook::{closure#0}<unknown>
  1016. 25.62 s > at <unknown source file>:<unknown line>
  1017. 25.62 s > 3: std[bcb96dfbba0ab899]::panicking::panic_with_hook<unknown>
  1018. 25.62 s > at <unknown source file>:<unknown line>
  1019. 25.62 s > 4: std[bcb96dfbba0ab899]::panicking::panic_handler::{closure#0}<unknown>
  1020. 25.62 s > at <unknown source file>:<unknown line>
  1021. 25.62 s > 5: std[bcb96dfbba0ab899]::sys::backtrace::__rust_end_short_backtrace::<std[bcb96dfbba0ab899]::panicking::panic_handler::{closure#0}, !><unknown>
  1022. 25.62 s > at <unknown source file>:<unknown line>
  1023. 25.62 s > 6: __rustc[6c289b9f9c454d21]::rust_begin_unwind<unknown>
  1024. 25.62 s > at <unknown source file>:<unknown line>
  1025. 25.62 s > 7: core[940e698046960fd5]::panicking::panic_fmt<unknown>
  1026. 25.62 s > at <unknown source file>:<unknown line>
  1027. 25.62 s > 8: insta[307a548ac79ef4d9]::runtime::assert_snapshot<unknown>
  1028. 25.62 s > at <unknown source file>:<unknown line>
  1029. 25.62 s > 9: gammalooprs[5490727360442cce]::graph::parse::tests::parse_lmbsetting_crossection<unknown>
  1030. 25.62 s > at <unknown source file>:<unknown line>
  1031. 25.62 s > 10: <gammalooprs[5490727360442cce]::graph::parse::tests::parse_lmbsetting_crossection::{closure#0} as core[940e698046960fd5]::ops::function::FnOnce<()>>::call_once<unknown>
  1032. 25.62 s > at <unknown source file>:<unknown line>
  1033. 25.62 s > 11: test[75d6903177b1d7e9]::__rust_begin_short_backtrace::<core[940e698046960fd5]::result::Result<(), alloc[2ea6bcb46fca0c42]::string::String>, fn() -> core[940e698046960fd5]::result::Result<(), alloc[2ea6bcb46fca0c42]::string::String>><unknown>
  1034. 25.62 s > at <unknown source file>:<unknown line>
  1035. 25.62 s > 12: test[75d6903177b1d7e9]::run_test::{closure#0}<unknown>
  1036. 25.62 s > at <unknown source file>:<unknown line>
  1037. 25.62 s > 13: std[bcb96dfbba0ab899]::sys::backtrace::__rust_begin_short_backtrace::<test[75d6903177b1d7e9]::run_test::{closure#1}, ()><unknown>
  1038. 25.62 s > at <unknown source file>:<unknown line>
  1039. 25.62 s > 14: <std[bcb96dfbba0ab899]::thread::lifecycle::spawn_unchecked<test[75d6903177b1d7e9]::run_test::{closure#1}, ()>::{closure#1} as core[940e698046960fd5]::ops::function::FnOnce<()>>::call_once::{shim:vtable#0}<unknown>
  1040. 25.62 s > at <unknown source file>:<unknown line>
  1041. 25.62 s > 15: <std[bcb96dfbba0ab899]::sys::thread::unix::Thread>::new::thread_start<unknown>
  1042. 25.62 s > at <unknown source file>:<unknown line>
  1043. 25.62 s > 16: start_thread<unknown>
  1044. 25.62 s > at <unknown source file>:<unknown line>
  1045. 25.62 s > 17: __clone3<unknown>
  1046. 25.62 s > at <unknown source file>:<unknown line>
  1047. 25.62 s >
  1048. 25.62 s > Run with COLORBT_SHOW_HIDDEN=1 environment variable to disable frame filtering.
  1049. 25.62 s > Run with RUST_BACKTRACE=full to include source snippets.
  1050. 25.62 s >
  1051. 25.62 s > FAIL [ 0.093s] (407/456) gammalooprs uv::export::tests::computed_node_full_numerator_is_a_spenso_aware_typst_fragment
  1052. 25.62 s > stdout ---
  1053. 25.62 s >
  1054. 25.62 s > running 1 test
  1055. 25.62 s > test uv::export::tests::computed_node_full_numerator_is_a_spenso_aware_typst_fragment ... FAILED
  1056. 25.62 s >
  1057. 25.62 s > failures:
  1058. 25.62 s >
  1059. 25.62 s > failures:
  1060. 25.62 s > uv::export::tests::computed_node_full_numerator_is_a_spenso_aware_typst_fragment
  1061. 25.62 s >
  1062. 25.62 s > test result: FAILED. 0 passed; 1 failed; 0 ignored; 0 measured; 508 filtered out; finished in 0.08s
  1063. 25.62 s >
  1064. 25.62 s > stderr ---
  1065. 25.62 s > The application panicked (crashed).
  1066. 25.62 s > Message: assertion failed: exported.dot.contains(r#"full_num = "op(\"Tr\")(1)";"#)
  1067. 25.62 s > Location: crates/gammalooprs/src/uv/export.rs:483
  1068. 25.62 s >
  1069. 25.62 s > ━━━━━━━━━━━━━━━━━━━━━━━━━━━━━━━━━━ BACKTRACE ━━━━━━━━━━━━━━━━━━━━━━━━━━━━━━━━━━━
  1070. 25.62 s > 1: <color_eyre[b0c9e66060e883b2]::config::PanicHook>::panic_report<unknown>
  1071. 25.62 s > at <unknown source file>:<unknown line>
  1072. 25.62 s > 2: <color_eyre[b0c9e66060e883b2]::config::PanicHook>::into_panic_hook::{closure#0}<unknown>
  1073. 25.62 s > at <unknown source file>:<unknown line>
  1074. 25.62 s > 3: std[bcb96dfbba0ab899]::panicking::panic_with_hook<unknown>
  1075. 25.62 s > at <unknown source file>:<unknown line>
  1076. 25.62 s > 4: std[bcb96dfbba0ab899]::panicking::panic_handler::{closure#0}<unknown>
  1077. 25.62 s > at <unknown source file>:<unknown line>
  1078. 25.62 s > 5: std[bcb96dfbba0ab899]::sys::backtrace::__rust_end_short_backtrace::<std[bcb96dfbba0ab899]::panicking::panic_handler::{closure#0}, !><unknown>
  1079. 25.62 s > at <unknown source file>:<unknown line>
  1080. 25.62 s > 6: __rustc[6c289b9f9c454d21]::rust_begin_unwind<unknown>
  1081. 25.62 s > at <unknown source file>:<unknown line>
  1082. 25.62 s > 7: core[940e698046960fd5]::panicking::panic_fmt<unknown>
  1083. 25.62 s > at <unknown source file>:<unknown line>
  1084. 25.62 s > 8: core[940e698046960fd5]::panicking::panic<unknown>
  1085. 25.62 s > at <unknown source file>:<unknown line>
  1086. 25.62 s > 9: gammalooprs[5490727360442cce]::uv::export::tests::computed_node_full_numerator_is_a_spenso_aware_typst_fragment<unknown>
  1087. 25.62 s > at <unknown source file>:<unknown line>
  1088. 25.62 s > 10: <gammalooprs[5490727360442cce]::uv::export::tests::computed_node_full_numerator_is_a_spenso_aware_typst_fragment::{closure#0} as core[940e698046960fd5]::ops::function::FnOnce<()>>::call_once<unknown>
  1089. 25.62 s > at <unknown source file>:<unknown line>
  1090. 25.62 s > 11: test[75d6903177b1d7e9]::__rust_begin_short_backtrace::<core[940e698046960fd5]::result::Result<(), alloc[2ea6bcb46fca0c42]::string::String>, fn() -> core[940e698046960fd5]::result::Result<(), alloc[2ea6bcb46fca0c42]::string::String>><unknown>
  1091. 25.62 s > at <unknown source file>:<unknown line>
  1092. 25.62 s > 12: test[75d6903177b1d7e9]::run_test::{closure#0}<unknown>
  1093. 25.62 s > at <unknown source file>:<unknown line>
  1094. 25.62 s > 13: std[bcb96dfbba0ab899]::sys::backtrace::__rust_begin_short_backtrace::<test[75d6903177b1d7e9]::run_test::{closure#1}, ()><unknown>
  1095. 25.62 s > at <unknown source file>:<unknown line>
  1096. 25.62 s > 14: <std[bcb96dfbba0ab899]::thread::lifecycle::spawn_unchecked<test[75d6903177b1d7e9]::run_test::{closure#1}, ()>::{closure#1} as core[940e698046960fd5]::ops::function::FnOnce<()>>::call_once::{shim:vtable#0}<unknown>
  1097. 25.62 s > at <unknown source file>:<unknown line>
  1098. 25.62 s > 15: <std[bcb96dfbba0ab899]::sys::thread::unix::Thread>::new::thread_start<unknown>
  1099. 25.62 s > at <unknown source file>:<unknown line>
  1100. 25.62 s > 16: start_thread<unknown>
  1101. 25.62 s > at <unknown source file>:<unknown line>
  1102. 25.62 s > 17: __clone3<unknown>
  1103. 25.62 s > at <unknown source file>:<unknown line>
  1104. 25.62 s >
  1105. 25.62 s > Run with COLORBT_SHOW_HIDDEN=1 environment variable to disable frame filtering.
  1106. 25.62 s > Run with RUST_BACKTRACE=full to include source snippets.
  1107. 25.62 s >
  1108. 25.62 s > error: test run failed
  1109. 25.62 s >
  1110. 25.62 s > ========== nextest test summary ==========
  1111. 25.62 s > report: target/nextest/ci_gammaloop/junit.xml
  1112. 25.62 s > tests: 456, failures: 2, errors: 0
  1113. 25.62 s >
  1114. 25.62 s > 1. gammalooprs::graph::parse::tests::parse_lmbsetting_crossection
  1115. 25.62 s > failure: test failure with exit code 101
  1116. 25.62 s > system-out
  1117. 25.62 s > running 1 test
  1118. 25.62 s > ━━━━━━━━━━━━━━━━━━━━━━━━━━━━━━━ Snapshot Summary ━━━━━━━━━━━━━━━━━━━━━━━━━━━━━━━
  1119. 25.62 s > Snapshot: parse_lmbsetting_crossection
  1120. 25.62 s > Source: crates/gammalooprs/src/graph/parse/tests.rs:252
  1121. 25.62 s > ────────────────────────────────────────────────────────────────────────────────
  1122. 25.62 s > Expression: g.debug_dot()
  1123. 25.62 s > ────────────────────────────────────────────────────────────────────────────────
  1124. 25.62 s > -old snapshot
  1125. 25.62 s > +new results
  1126. 25.62 s > ────────────┬───────────────────────────────────────────────────────────────────
  1127. 25.62 s > 1 │-digraph G{
  1128. 25.62 s > 1 │+digraph G {
  1129. 25.62 s > 2 2 │ num = "1/2";
  1130. 25.62 s > 3 3 │ overall_factor = "2*x";
  1131. 25.62 s > 4 4 │ overall_factor_evaluated = "2*x";
  1132. 25.62 s > 5 5 │ projector = "spenso::t";
  1133. 25.62 s > ────────────┴───────────────────────────────────────────────────────────────────
  1134. 25.62 s > To update snapshots run `cargo insta review`
  1135. 25.62 s > Stopped on the first failure. Run `cargo insta test` to run all snapshots.
  1136. 25.62 s > test graph::parse::tests::parse_lmbsetting_crossection ... FAILED
  1137. 25.62 s >
  1138. 25.62 s > failures:
  1139. 25.62 s >
  1140. 25.62 s > failures:
  1141. 25.62 s > graph::parse::tests::parse_lmbsetting_crossection
  1142. 25.62 s >
  1143. 25.62 s > test result: FAILED. 0 passed; 1 failed; 0 ignored; 0 measured; 508 filtered out; finished in 0.24s
  1144. 25.62 s > system-err
  1145. 25.62 s > [07:32:39.507] @gammalooprs::graph::attribute_warnings WARNING : Unknown node attribute 'color_num' on graph 'G', node 'A'; did you mean 'num'?
  1146. 25.62 s > at crates/gammalooprs/src/graph/attribute_warnings.rs:198
  1147. 25.62 s > The application panicked (crashed).
  1148. 25.62 s > Message: snapshot assertion for 'parse_lmbsetting_crossection' failed in line 252
  1149. 25.62 s > Location: /nix/store/xdy1vvhll2bijdplvl9fcc2b9plkxhaa-vendor-cargo-deps/c19b7c6f923b580ac259164a89f2577984ad5ab09ee9d583b888f934adbbe8d0/insta-1.47.2/src/runtime.rs:719
  1150. 25.62 s >
  1151. 25.62 s > ━━━━━━━━━━━━━━━━━━━━━━━━━━━━━━━━━━ BACKTRACE ━━━━━━━━━━━━━━━━━━━━━━━━━━━━━━━━━━━
  1152. 25.62 s > 1: <color_eyre[b0c9e66060e883b2]::config::PanicHook>::panic_report<unknown>
  1153. 25.62 s > at <unknown source file>:<unknown line>
  1154. 25.62 s > 2: <color_eyre[b0c9e66060e883b2]::config::PanicHook>::into_panic_hook::{closure#0}<unknown>
  1155. 25.62 s > at <unknown source file>:<unknown line>
  1156. 25.62 s > 3: std[bcb96dfbba0ab899]::panicking::panic_with_hook<unknown>
  1157. 25.62 s > at <unknown source file>:<unknown line>
  1158. 25.62 s > 4: std[bcb96dfbba0ab899]::panicking::panic_handler::{closure#0}<unknown>
  1159. 25.62 s > at <unknown source file>:<unknown line>
  1160. 25.62 s > 5: std[bcb96dfbba0ab899]::sys::backtrace::__rust_end_short_backtrace::<std[bcb96dfbba0ab899]::panicking::panic_handler::{closure#0}, !><unknown>
  1161. 25.62 s > at <unknown source file>:<unknown line>
  1162. 25.62 s > 6: __rustc[6c289b9f9c454d21]::rust_begin_unwind<unknown>
  1163. 25.62 s > at <unknown source file>:<unknown line>
  1164. 25.62 s > 7: core[940e698046960fd5]::panicking::panic_fmt<unknown>
  1165. 25.62 s > at <unknown source file>:<unknown line>
  1166. 25.62 s > 8: insta[307a548ac79ef4d9]::runtime::assert_snapshot<unknown>
  1167. 25.62 s > at <unknown source file>:<unknown line>
  1168. 25.62 s > 9: gammalooprs[5490727360442cce]::graph::parse::tests::parse_lmbsetting_crossection<unknown>
  1169. 25.62 s > at <unknown source file>:<unknown line>
  1170. 25.62 s > 10: <gammalooprs[5490727360442cce]::graph::parse::tests::parse_lmbsetting_crossection::{closure#0} as core[940e698046960fd5]::ops::function::FnOnce<()>>::call_once<unknown>
  1171. 25.62 s > at <unknown source file>:<unknown line>
  1172. 25.62 s > 11: test[75d6903177b1d7e9]::__rust_begin_short_backtrace::<core[940e698046960fd5]::result::Result<(), alloc[2ea6bcb46fca0c42]::string::String>, fn() -> core[940e698046960fd5]::result::Result<(), alloc[2ea6bcb46fca0c42]::string::String>><unknown>
  1173. 25.62 s > at <unknown source file>:<unknown line>
  1174. 25.62 s > 12: test[75d6903177b1d7e9]::run_test::{closure#0}<unknown>
  1175. 25.62 s > at <unknown source file>:<unknown line>
  1176. 25.62 s > 13: std[bcb96dfbba0ab899]::sys::backtrace::__rust_begin_short_backtrace::<test[75d6903177b1d7e9]::run_test::{closure#1}, ()><unknown>
  1177. 25.62 s > at <unknown source file>:<unknown line>
  1178. 25.62 s > 14: <std[bcb96dfbba0ab899]::thread::lifecycle::spawn_unchecked<test[75d6903177b1d7e9]::run_test::{closure#1}, ()>::{closure#1} as core[940e698046960fd5]::ops::function::FnOnce<()>>::call_once::{shim:vtable#0}<unknown>
  1179. 25.62 s > at <unknown source file>:<unknown line>
  1180. 25.62 s > 15: <std[bcb96dfbba0ab899]::sys::thread::unix::Thread>::new::thread_start<unknown>
  1181. 25.62 s > at <unknown source file>:<unknown line>
  1182. 25.62 s > 16: start_thread<unknown>
  1183. 25.62 s > at <unknown source file>:<unknown line>
  1184. 25.62 s > 17: __clone3<unknown>
  1185. 25.62 s > at <unknown source file>:<unknown line>
  1186. 25.62 s >
  1187. 25.62 s > Run with COLORBT_SHOW_HIDDEN=1 environment variable to disable frame filtering.
  1188. 25.62 s > Run with RUST_BACKTRACE=full to include source snippets.
  1189. 25.62 s >
  1190. 25.62 s > 2. gammalooprs::uv::export::tests::computed_node_full_numerator_is_a_spenso_aware_typst_fragment
  1191. 25.62 s > failure: test failure with exit code 101
  1192. 25.62 s > system-out
  1193. 25.62 s > running 1 test
  1194. 25.62 s > test uv::export::tests::computed_node_full_numerator_is_a_spenso_aware_typst_fragment ... FAILED
  1195. 25.62 s >
  1196. 25.62 s > failures:
  1197. 25.62 s >
  1198. 25.62 s > failures:
  1199. 25.62 s > uv::export::tests::computed_node_full_numerator_is_a_spenso_aware_typst_fragment
  1200. 25.62 s >
  1201. 25.62 s > test result: FAILED. 0 passed; 1 failed; 0 ignored; 0 measured; 508 filtered out; finished in 0.08s
  1202. 25.62 s > system-err
  1203. 25.62 s > The application panicked (crashed).
  1204. 25.62 s > Message: assertion failed: exported.dot.contains(r#"full_num = "op(\"Tr\")(1)";"#)
  1205. 25.62 s > Location: crates/gammalooprs/src/uv/export.rs:483
  1206. 25.62 s >
  1207. 25.62 s > ━━━━━━━━━━━━━━━━━━━━━━━━━━━━━━━━━━ BACKTRACE ━━━━━━━━━━━━━━━━━━━━━━━━━━━━━━━━━━━
  1208. 25.62 s > 1: <color_eyre[b0c9e66060e883b2]::config::PanicHook>::panic_report<unknown>
  1209. 25.62 s > at <unknown source file>:<unknown line>
  1210. 25.62 s > 2: <color_eyre[b0c9e66060e883b2]::config::PanicHook>::into_panic_hook::{closure#0}<unknown>
  1211. 25.62 s > at <unknown source file>:<unknown line>
  1212. 25.62 s > 3: std[bcb96dfbba0ab899]::panicking::panic_with_hook<unknown>
  1213. 25.62 s > at <unknown source file>:<unknown line>
  1214. 25.62 s > 4: std[bcb96dfbba0ab899]::panicking::panic_handler::{closure#0}<unknown>
  1215. 25.62 s > at <unknown source file>:<unknown line>
  1216. 25.62 s > 5: std[bcb96dfbba0ab899]::sys::backtrace::__rust_end_short_backtrace::<std[bcb96dfbba0ab899]::panicking::panic_handler::{closure#0}, !><unknown>
  1217. 25.62 s > at <unknown source file>:<unknown line>
  1218. 25.62 s > 6: __rustc[6c289b9f9c454d21]::rust_begin_unwind<unknown>
  1219. 25.62 s > at <unknown source file>:<unknown line>
  1220. 25.62 s > 7: core[940e698046960fd5]::panicking::panic_fmt<unknown>
  1221. 25.62 s > at <unknown source file>:<unknown line>
  1222. 25.62 s > 8: core[940e698046960fd5]::panicking::panic<unknown>
  1223. 25.62 s > at <unknown source file>:<unknown line>
  1224. 25.62 s > 9: gammalooprs[5490727360442cce]::uv::export::tests::computed_node_full_numerator_is_a_spenso_aware_typst_fragment<unknown>
  1225. 25.62 s > at <unknown source file>:<unknown line>
  1226. 25.62 s > 10: <gammalooprs[5490727360442cce]::uv::export::tests::computed_node_full_numerator_is_a_spenso_aware_typst_fragment::{closure#0} as core[940e698046960fd5]::ops::function::FnOnce<()>>::call_once<unknown>
  1227. 25.62 s > at <unknown source file>:<unknown line>
  1228. 25.62 s > 11: test[75d6903177b1d7e9]::__rust_begin_short_backtrace::<core[940e698046960fd5]::result::Result<(), alloc[2ea6bcb46fca0c42]::string::String>, fn() -> core[940e698046960fd5]::result::Result<(), alloc[2ea6bcb46fca0c42]::string::String>><unknown>
  1229. 25.62 s > at <unknown source file>:<unknown line>
  1230. 25.62 s > 12: test[75d6903177b1d7e9]::run_test::{closure#0}<unknown>
  1231. 25.62 s > at <unknown source file>:<unknown line>
  1232. 25.62 s > 13: std[bcb96dfbba0ab899]::sys::backtrace::__rust_begin_short_backtrace::<test[75d6903177b1d7e9]::run_test::{closure#1}, ()><unknown>
  1233. 25.62 s > at <unknown source file>:<unknown line>
  1234. 25.62 s > 14: <std[bcb96dfbba0ab899]::thread::lifecycle::spawn_unchecked<test[75d6903177b1d7e9]::run_test::{closure#1}, ()>::{closure#1} as core[940e698046960fd5]::ops::function::FnOnce<()>>::call_once::{shim:vtable#0}<unknown>
  1235. 25.62 s > at <unknown source file>:<unknown line>
  1236. 25.62 s > 15: <std[bcb96dfbba0ab899]::sys::thread::unix::Thread>::new::thread_start<unknown>
  1237. 25.62 s > at <unknown source file>:<unknown line>
  1238. 25.62 s > 16: start_thread<unknown>
  1239. 25.62 s > at <unknown source file>:<unknown line>
  1240. 25.62 s > 17: __clone3<unknown>
  1241. 25.62 s > at <unknown source file>:<unknown line>
  1242. 25.62 s >
  1243. 25.62 s > Run with COLORBT_SHOW_HIDDEN=1 environment variable to disable frame filtering.
  1244. 25.62 s > Run with RUST_BACKTRACE=full to include source snippets.
  1245. 25.62 s > =========================================
  1246. 25.62 s For full logs, run:
  1247. 25.62 s nix log /nix/store/hm35l98s8jf76hp5gsphwyhqjj06gcak-gammaloop-nextest-core.drv
  1248. 25.74 s [0 built (1 failed), 0.0Run failed.