test packages.x86_64-linux.nix-ci-check-gammaloop-nextest-core
0.46 s
$ /nix/store/9ypz3flqsrl5xl495mm8h645gadjsxi1-coreutils-9.11/bin/timeout --kill-after=15s 7200s /nix/store/23zk8sgzamrbmj1fday15szf7f2279s8-nix-2.34.7/bin/nix --extra-experimental-features nix-command --extra-experimental-features flakes flake clone git+https://github.com/alphal00p/gammaloop --dest /tmp/nix-ci-worker/stable-pwd/repo/
0.80 s
Cloning into '/tmp/nix-ci-worker/stable-pwd/repo'...
0.80 s
remote: Enumerating objects: 62149, done.
0.94 s
remote: Counting objects: 0% (1/7163)
remote: Counting objects: 1% (72/7163)
remote: Counting objects: 2% (144/7163)
remote: Counting objects: 3% (215/7163)
remote: Counting objects: 4% (287/7163)
remote: Counting objects: 5% (359/7163)
remote: Counting objects: 6% (430/7163)
remote: Counting objects: 7% (502/7163)
remote: Counting objects: 8% (574/7163)
remote: Counting objects: 9% (645/7163)
remote: Counting objects: 10% (717/7163)
remote: Counting objects: 11% (788/7163)
remote: Counting objects: 12% (860/7163)
remote: Counting objects: 13% (932/7163)
remote: Counting objects: 14% (1003/7163)
remote: Counting objects: 15% (1075/7163)
remote: Counting objects: 16% (1147/7163)
remote: Counting objects: 17% (1218/7163)
remote: Counting objects: 18% (1290/7163)
remote: Counting objects: 19% (1361/7163)
remote: Counting objects: 20% (1433/7163)
remote: Counting objects: 21% (1505/7163)
remote: Counting objects: 22% (1576/7163)
remote: Counting objects: 23% (1648/7163)
remote: Counting objects: 24% (1720/7163)
remote: Counting objects: 25% (1791/7163)
remote: Counting objects: 26% (1863/7163)
remote: Counting objects: 27% (1935/7163)
remote: Counting objects: 28% (2006/7163)
remote: Counting objects: 29% (2078/7163)
remote: Counting objects: 30% (2149/7163)
remote: Counting objects: 31% (2221/7163)
remote: Counting objects: 32% (2293/7163)
remote: Counting objects: 33% (2364/7163)
remote: Counting objects: 34% (2436/7163)
remote: Counting objects: 35% (2508/7163)
remote: Counting objects: 36% (2579/7163)
remote: Counting objects: 37% (2651/7163)
remote: Counting objects: 38% (2722/7163)
remote: Counting objects: 39% (2794/7163)
remote: Counting objects: 40% (2866/7163)
remote: Counting objects: 41% (2937/7163)
remote: Counting objects: 42% (3009/7163)
remote: Counting objects: 43% (3081/7163)
remote: Counting objects: 44% (3152/7163)
remote: Counting objects: 45% (3224/7163)
remote: Counting objects: 46% (3295/7163)
remote: Counting objects: 47% (3367/7163)
remote: Counting objects: 48% (3439/7163)
remote: Counting objects: 49% (3510/7163)
remote: Counting objects: 50% (3582/7163)
remote: Counting objects: 51% (3654/7163)
remote: Counting objects: 52% (3725/7163)
remote: Counting objects: 53% (3797/7163)
remote: Counting objects: 54% (3869/7163)
remote: Counting objects: 55% (3940/7163)
remote: Counting objects: 56% (4012/7163)
remote: Counting objects: 57% (4083/7163)
remote: Counting objects: 58% (4155/7163)
remote: Counting objects: 59% (4227/7163)
remote: Counting objects: 60% (4298/7163)
remote: Counting objects: 61% (4370/7163)
remote: Counting objects: 62% (4442/7163)
remote: Counting objects: 63% (4513/7163)
remote: Counting objects: 64% (4585/7163)
remote: Counting objects: 65% (4656/7163)
remote: Counting objects: 66% (4728/7163)
remote: Counting objects: 67% (4800/7163)
remote: Counting objects: 68% (4871/7163)
remote: Counting objects: 69% (4943/7163)
remote: Counting objects: 70% (5015/7163)
remote: Counting objects: 71% (5086/7163)
remote: Counting objects: 72% (5158/7163)
remote: Counting objects: 73% (5229/7163)
remote: Counting objects: 74% (5301/7163)
remote: Counting objects: 75% (5373/7163)
remote: Counting objects: 76% (5444/7163)
remote: Counting objects: 77% (5516/7163)
remote: Counting objects: 78% (5588/7163)
remote: Counting objects: 79% (5659/7163)
remote: Counting objects: 80% (5731/7163)
remote: Counting objects: 81% (5803/7163)
remote: Counting objects: 82% (5874/7163)
remote: Counting objects: 83% (5946/7163)
remote: Counting objects: 84% (6017/7163)
remote: Counting objects: 85% (6089/7163)
remote: Counting objects: 86% (6161/7163)
remote: Counting objects: 87% (6232/7163)
remote: Counting objects: 88% (6304/7163)
remote: Counting objects: 89% (6376/7163)
remote: Counting objects: 90% (6447/7163)
remote: Counting objects: 91% (6519/7163)
remote: Counting objects: 92% (6590/7163)
remote: Counting objects: 93% (6662/7163)
remote: Counting objects: 94% (6734/7163)
remote: Counting objects: 95% (6805/7163)
remote: Counting objects: 96% (6877/7163)
remote: Counting objects: 97% (6949/7163)
remote: Counting objects: 98% (7020/7163)
remote: Counting objects: 99% (7092/7163)
remote: Counting objects: 100% (7163/7163)
remote: Counting objects: 100% (7163/7163), done.
2.16 s
remote: Compressing objects: 0% (1/1381)
remote: Compressing objects: 1% (14/1381)
remote: Compressing objects: 2% (28/1381)
remote: Compressing objects: 3% (42/1381)
remote: Compressing objects: 4% (56/1381)
remote: Compressing objects: 5% (70/1381)
remote: Compressing objects: 6% (83/1381)
remote: Compressing objects: 7% (97/1381)
remote: Compressing objects: 8% (111/1381)
remote: Compressing objects: 9% (125/1381)
remote: Compressing objects: 10% (139/1381)
remote: Compressing objects: 11% (152/1381)
remote: Compressing objects: 12% (166/1381)
remote: Compressing objects: 13% (180/1381)
remote: Compressing objects: 14% (194/1381)
remote: Compressing objects: 15% (208/1381)
remote: Compressing objects: 16% (221/1381)
remote: Compressing objects: 16% (234/1381)
remote: Compressing objects: 17% (235/1381)
remote: Compressing objects: 18% (249/1381)
remote: Compressing objects: 19% (263/1381)
remote: Compressing objects: 20% (277/1381)
remote: Compressing objects: 21% (291/1381)
remote: Compressing objects: 22% (304/1381)
remote: Compressing objects: 23% (318/1381)
remote: Compressing objects: 24% (332/1381)
remote: Compressing objects: 25% (346/1381)
remote: Compressing objects: 26% (360/1381)
remote: Compressing objects: 27% (373/1381)
remote: Compressing objects: 28% (387/1381)
remote: Compressing objects: 29% (401/1381)
remote: Compressing objects: 30% (415/1381)
remote: Compressing objects: 31% (429/1381)
remote: Compressing objects: 32% (442/1381)
remote: Compressing objects: 33% (456/1381)
remote: Compressing objects: 34% (470/1381)
remote: Compressing objects: 35% (484/1381)
remote: Compressing objects: 36% (498/1381)
remote: Compressing objects: 37% (511/1381)
remote: Compressing objects: 38% (525/1381)
remote: Compressing objects: 39% (539/1381)
remote: Compressing objects: 40% (553/1381)
remote: Compressing objects: 41% (567/1381)
remote: Compressing objects: 42% (581/1381)
remote: Compressing objects: 43% (594/1381)
remote: Compressing objects: 44% (608/1381)
remote: Compressing objects: 45% (622/1381)
remote: Compressing objects: 46% (636/1381)
remote: Compressing objects: 47% (650/1381)
remote: Compressing objects: 48% (663/1381)
remote: Compressing objects: 49% (677/1381)
remote: Compressing objects: 50% (691/1381)
remote: Compressing objects: 51% (705/1381)
remote: Compressing objects: 52% (719/1381)
remote: Compressing objects: 53% (732/1381)
remote: Compressing objects: 54% (746/1381)
remote: Compressing objects: 55% (760/1381)
remote: Compressing objects: 56% (774/1381)
remote: Compressing objects: 57% (788/1381)
remote: Compressing objects: 58% (801/1381)
remote: Compressing objects: 59% (815/1381)
remote: Compressing objects: 60% (829/1381)
remote: Compressing objects: 61% (843/1381)
remote: Compressing objects: 62% (857/1381)
remote: Compressing objects: 63% (871/1381)
remote: Compressing objects: 64% (884/1381)
remote: Compressing objects: 65% (898/1381)
remote: Compressing objects: 66% (912/1381)
remote: Compressing objects: 67% (926/1381)
remote: Compressing objects: 68% (940/1381)
remote: Compressing objects: 69% (953/1381)
remote: Compressing objects: 70% (967/1381)
remote: Compressing objects: 71% (981/1381)
remote: Compressing objects: 72% (995/1381)
remote: Compressing objects: 73% (1009/1381)
remote: Compressing objects: 74% (1022/1381)
remote: Compressing objects: 75% (1036/1381)
remote: Compressing objects: 76% (1050/1381)
remote: Compressing objects: 77% (1064/1381)
remote: Compressing objects: 78% (1078/1381)
remote: Compressing objects: 79% (1091/1381)
remote: Compressing objects: 80% (1105/1381)
remote: Compressing objects: 81% (1119/1381)
remote: Compressing objects: 82% (1133/1381)
remote: Compressing objects: 83% (1147/1381)
remote: Compressing objects: 84% (1161/1381)
remote: Compressing objects: 85% (1174/1381)
remote: Compressing objects: 86% (1188/1381)
remote: Compressing objects: 87% (1202/1381)
remote: Compressing objects: 88% (1216/1381)
remote: Compressing objects: 89% (1230/1381)
remote: Compressing objects: 90% (1243/1381)
remote: Compressing objects: 91% (1257/1381)
remote: Compressing objects: 92% (1271/1381)
remote: Compressing objects: 93% (1285/1381)
remote: Compressing objects: 94% (1299/1381)
remote: Compressing objects: 95% (1312/1381)
remote: Compressing objects: 96% (1326/1381)
remote: Compressing objects: 97% (1340/1381)
remote: Compressing objects: 98% (1354/1381)
remote: Compressing objects: 99% (1368/1381)
remote: Compressing objects: 100% (1381/1381)
remote: Compressing objects: 100% (1381/1381), done.
4.68 s
Receiving objects: 0% (1/62149)
Receiving objects: 1% (622/62149)
Receiving objects: 2% (1243/62149)
Receiving objects: 3% (1865/62149)
Receiving objects: 4% (2486/62149)
Receiving objects: 5% (3108/62149)
Receiving objects: 6% (3729/62149)
Receiving objects: 7% (4351/62149)
Receiving objects: 8% (4972/62149)
Receiving objects: 9% (5594/62149)
Receiving objects: 10% (6215/62149)
Receiving objects: 11% (6837/62149)
Receiving objects: 12% (7458/62149)
Receiving objects: 13% (8080/62149)
Receiving objects: 14% (8701/62149)
Receiving objects: 15% (9323/62149)
Receiving objects: 16% (9944/62149)
Receiving objects: 17% (10566/62149)
Receiving objects: 18% (11187/62149)
Receiving objects: 19% (11809/62149)
Receiving objects: 20% (12430/62149), 15.87 MiB | 31.73 MiB/s
Receiving objects: 21% (13052/62149), 15.87 MiB | 31.73 MiB/s
Receiving objects: 22% (13673/62149), 15.87 MiB | 31.73 MiB/s
Receiving objects: 23% (14295/62149), 15.87 MiB | 31.73 MiB/s
Receiving objects: 24% (14916/62149), 15.87 MiB | 31.73 MiB/s
Receiving objects: 25% (15538/62149), 15.87 MiB | 31.73 MiB/s
Receiving objects: 26% (16159/62149), 15.87 MiB | 31.73 MiB/s
Receiving objects: 27% (16781/62149), 15.87 MiB | 31.73 MiB/s
Receiving objects: 28% (17402/62149), 15.87 MiB | 31.73 MiB/s
Receiving objects: 29% (18024/62149), 15.87 MiB | 31.73 MiB/s
Receiving objects: 30% (18645/62149), 15.87 MiB | 31.73 MiB/s
Receiving objects: 31% (19267/62149), 15.87 MiB | 31.73 MiB/s
Receiving objects: 32% (19888/62149), 15.87 MiB | 31.73 MiB/s
Receiving objects: 33% (20510/62149), 15.87 MiB | 31.73 MiB/s
Receiving objects: 34% (21131/62149), 15.87 MiB | 31.73 MiB/s
Receiving objects: 35% (21753/62149), 15.87 MiB | 31.73 MiB/s
Receiving objects: 36% (22374/62149), 15.87 MiB | 31.73 MiB/s
Receiving objects: 37% (22996/62149), 15.87 MiB | 31.73 MiB/s
Receiving objects: 38% (23617/62149), 15.87 MiB | 31.73 MiB/s
Receiving objects: 39% (24239/62149), 15.87 MiB | 31.73 MiB/s
Receiving objects: 40% (24860/62149), 15.87 MiB | 31.73 MiB/s
Receiving objects: 41% (25482/62149), 15.87 MiB | 31.73 MiB/s
Receiving objects: 42% (26103/62149), 15.87 MiB | 31.73 MiB/s
Receiving objects: 43% (26725/62149), 15.87 MiB | 31.73 MiB/s
Receiving objects: 44% (27346/62149), 15.87 MiB | 31.73 MiB/s
Receiving objects: 45% (27968/62149), 15.87 MiB | 31.73 MiB/s
Receiving objects: 46% (28589/62149), 15.87 MiB | 31.73 MiB/s
Receiving objects: 47% (29211/62149), 15.87 MiB | 31.73 MiB/s
Receiving objects: 48% (29832/62149), 15.87 MiB | 31.73 MiB/s
Receiving objects: 49% (30454/62149), 15.87 MiB | 31.73 MiB/s
Receiving objects: 50% (31075/62149), 15.87 MiB | 31.73 MiB/s
Receiving objects: 51% (31696/62149), 15.87 MiB | 31.73 MiB/s
Receiving objects: 52% (32318/62149), 15.87 MiB | 31.73 MiB/s
Receiving objects: 53% (32939/62149), 15.87 MiB | 31.73 MiB/s
Receiving objects: 54% (33561/62149), 15.87 MiB | 31.73 MiB/s
Receiving objects: 55% (34182/62149), 15.87 MiB | 31.73 MiB/s
Receiving objects: 56% (34804/62149), 15.87 MiB | 31.73 MiB/s
Receiving objects: 57% (35425/62149), 15.87 MiB | 31.73 MiB/s
Receiving objects: 58% (36047/62149), 15.87 MiB | 31.73 MiB/s
Receiving objects: 58% (36089/62149), 37.34 MiB | 36.65 MiB/s
Receiving objects: 59% (36668/62149), 37.34 MiB | 36.65 MiB/s
Receiving objects: 60% (37290/62149), 37.34 MiB | 36.65 MiB/s
Receiving objects: 61% (37911/62149), 37.34 MiB | 36.65 MiB/s
Receiving objects: 62% (38533/62149), 37.34 MiB | 36.65 MiB/s
Receiving objects: 63% (39154/62149), 37.34 MiB | 36.65 MiB/s
Receiving objects: 64% (39776/62149), 37.34 MiB | 36.65 MiB/s
Receiving objects: 65% (40397/62149), 37.34 MiB | 36.65 MiB/s
Receiving objects: 66% (41019/62149), 37.34 MiB | 36.65 MiB/s
Receiving objects: 67% (41640/62149), 37.34 MiB | 36.65 MiB/s
Receiving objects: 68% (42262/62149), 37.34 MiB | 36.65 MiB/s
Receiving objects: 69% (42883/62149), 37.34 MiB | 36.65 MiB/s
Receiving objects: 70% (43505/62149), 37.34 MiB | 36.65 MiB/s
Receiving objects: 71% (44126/62149), 37.34 MiB | 36.65 MiB/s
Receiving objects: 72% (44748/62149), 37.34 MiB | 36.65 MiB/s
Receiving objects: 73% (45369/62149), 37.34 MiB | 36.65 MiB/s
Receiving objects: 74% (45991/62149), 56.33 MiB | 36.57 MiB/s
Receiving objects: 75% (46612/62149), 56.33 MiB | 36.57 MiB/s
Receiving objects: 76% (47234/62149), 56.33 MiB | 36.57 MiB/s
Receiving objects: 77% (47855/62149), 56.33 MiB | 36.57 MiB/s
Receiving objects: 78% (48477/62149), 56.33 MiB | 36.57 MiB/s
Receiving objects: 79% (49098/62149), 56.33 MiB | 36.57 MiB/s
Receiving objects: 80% (49720/62149), 56.33 MiB | 36.57 MiB/s
Receiving objects: 81% (50341/62149), 56.33 MiB | 36.57 MiB/s
Receiving objects: 81% (50661/62149), 56.33 MiB | 36.57 MiB/s
Receiving objects: 82% (50963/62149), 56.33 MiB | 36.57 MiB/s
Receiving objects: 83% (51584/62149), 75.57 MiB | 36.65 MiB/s
Receiving objects: 84% (52206/62149), 75.57 MiB | 36.65 MiB/s
Receiving objects: 85% (52827/62149), 75.57 MiB | 36.65 MiB/s
Receiving objects: 86% (53449/62149), 75.57 MiB | 36.65 MiB/s
Receiving objects: 87% (54070/62149), 75.57 MiB | 36.65 MiB/s
Receiving objects: 88% (54692/62149), 75.57 MiB | 36.65 MiB/s
Receiving objects: 89% (55313/62149), 75.57 MiB | 36.65 MiB/s
Receiving objects: 90% (55935/62149), 75.57 MiB | 36.65 MiB/s
Receiving objects: 91% (56556/62149), 75.57 MiB | 36.65 MiB/s
Receiving objects: 92% (57178/62149), 75.57 MiB | 36.65 MiB/s
Receiving objects: 93% (57799/62149), 75.57 MiB | 36.65 MiB/s
Receiving objects: 94% (58421/62149), 75.57 MiB | 36.65 MiB/s
Receiving objects: 95% (59042/62149), 75.57 MiB | 36.65 MiB/s
Receiving objects: 96% (59664/62149), 75.57 MiB | 36.65 MiB/s
Receiving objects: 97% (60285/62149), 75.57 MiB | 36.65 MiB/s
Receiving objects: 98% (60907/62149), 75.57 MiB | 36.65 MiB/s
Receiving objects: 99% (61528/62149), 75.57 MiB | 36.65 MiB/s
remote: Total 62149 (delta 6241), reused 5855 (delta 5778), pack-reused 54986 (from 3)
4.68 s
Receiving objects: 100% (62149/62149), 75.57 MiB | 36.65 MiB/s
Receiving objects: 100% (62149/62149), 92.18 MiB | 36.64 MiB/s, done.
5.33 s
Resolving deltas: 0% (0/43438)
Resolving deltas: 1% (435/43438)
Resolving deltas: 2% (869/43438)
Resolving deltas: 3% (1307/43438)
Resolving deltas: 4% (1740/43438)
Resolving deltas: 5% (2172/43438)
Resolving deltas: 6% (2607/43438)
Resolving deltas: 7% (3041/43438)
Resolving deltas: 8% (3478/43438)
Resolving deltas: 9% (3910/43438)
Resolving deltas: 10% (4344/43438)
Resolving deltas: 11% (4780/43438)
Resolving deltas: 12% (5213/43438)
Resolving deltas: 13% (5647/43438)
Resolving deltas: 14% (6082/43438)
Resolving deltas: 15% (6518/43438)
Resolving deltas: 16% (6951/43438)
Resolving deltas: 17% (7385/43438)
Resolving deltas: 18% (7819/43438)
Resolving deltas: 19% (8254/43438)
Resolving deltas: 20% (8688/43438)
Resolving deltas: 21% (9122/43438)
Resolving deltas: 22% (9557/43438)
Resolving deltas: 23% (9991/43438)
Resolving deltas: 24% (10426/43438)
Resolving deltas: 25% (10860/43438)
Resolving deltas: 26% (11294/43438)
Resolving deltas: 27% (11729/43438)
Resolving deltas: 28% (12163/43438)
Resolving deltas: 29% (12598/43438)
Resolving deltas: 30% (13032/43438)
Resolving deltas: 31% (13466/43438)
Resolving deltas: 32% (13901/43438)
Resolving deltas: 33% (14335/43438)
Resolving deltas: 34% (14769/43438)
Resolving deltas: 35% (15204/43438)
Resolving deltas: 36% (15638/43438)
Resolving deltas: 37% (16073/43438)
Resolving deltas: 38% (16507/43438)
Resolving deltas: 39% (16941/43438)
Resolving deltas: 40% (17377/43438)
Resolving deltas: 41% (17810/43438)
Resolving deltas: 42% (18244/43438)
Resolving deltas: 43% (18680/43438)
Resolving deltas: 44% (19113/43438)
Resolving deltas: 45% (19549/43438)
Resolving deltas: 46% (19986/43438)
Resolving deltas: 47% (20419/43438)
Resolving deltas: 48% (20851/43438)
Resolving deltas: 49% (21285/43438)
Resolving deltas: 50% (21719/43438)
Resolving deltas: 51% (22154/43438)
Resolving deltas: 52% (22589/43438)
Resolving deltas: 53% (23023/43438)
Resolving deltas: 54% (23457/43438)
Resolving deltas: 55% (23894/43438)
Resolving deltas: 56% (24327/43438)
Resolving deltas: 57% (24760/43438)
Resolving deltas: 58% (25196/43438)
Resolving deltas: 59% (25629/43438)
Resolving deltas: 60% (26063/43438)
Resolving deltas: 61% (26498/43438)
Resolving deltas: 62% (26932/43438)
Resolving deltas: 63% (27366/43438)
Resolving deltas: 64% (27801/43438)
Resolving deltas: 65% (28235/43438)
Resolving deltas: 66% (28673/43438)
Resolving deltas: 67% (29104/43438)
Resolving deltas: 68% (29538/43438)
Resolving deltas: 69% (29974/43438)
Resolving deltas: 70% (30407/43438)
Resolving deltas: 71% (30841/43438)
Resolving deltas: 72% (31276/43438)
Resolving deltas: 73% (31710/43438)
Resolving deltas: 74% (32145/43438)
Resolving deltas: 75% (32579/43438)
Resolving deltas: 76% (33015/43438)
Resolving deltas: 77% (33448/43438)
Resolving deltas: 78% (33882/43438)
Resolving deltas: 79% (34317/43438)
Resolving deltas: 80% (34751/43438)
Resolving deltas: 81% (35185/43438)
Resolving deltas: 82% (35620/43438)
Resolving deltas: 83% (36054/43438)
Resolving deltas: 84% (36489/43438)
Resolving deltas: 85% (36924/43438)
Resolving deltas: 86% (37357/43438)
Resolving deltas: 87% (37792/43438)
Resolving deltas: 88% (38226/43438)
Resolving deltas: 89% (38660/43438)
Resolving deltas: 90% (39095/43438)
Resolving deltas: 91% (39529/43438)
Resolving deltas: 92% (39963/43438)
Resolving deltas: 93% (40400/43438)
Resolving deltas: 94% (40832/43438)
Resolving deltas: 95% (41267/43438)
Resolving deltas: 96% (41701/43438)
Resolving deltas: 97% (42136/43438)
Resolving deltas: 98% (42570/43438)
Resolving deltas: 99% (43004/43438)
Resolving deltas: 100% (43438/43438)
Resolving deltas: 100% (43438/43438), done.
5.62 s
Fetching commit 306aa3b35933dd96091d6370d5037e9adacabca8 for push-vrpyqyylypmw ...
5.64 s
$ /nix/store/bcnisk3ydfgv26v2gw3zlky24g00yww2-git-2.54.0/bin/git fetch origin 306aa3b35933dd96091d6370d5037e9adacabca8
6.03 s
From https://github.com/alphal00p/gammaloop
6.03 s
* branch 306aa3b35933dd96091d6370d5037e9adacabca8 -> FETCH_HEAD
6.04 s
$ /nix/store/9ypz3flqsrl5xl495mm8h645gadjsxi1-coreutils-9.11/bin/timeout --kill-after=15s 7200s /nix/store/bcnisk3ydfgv26v2gw3zlky24g00yww2-git-2.54.0/bin/git -c advice.detachedHead=false checkout 306aa3b35933dd96091d6370d5037e9adacabca8
6.15 s
HEAD is now at 306aa3b3 replace linnet python api with typed drawing model
6.16 s
$ /nix/store/9ypz3flqsrl5xl495mm8h645gadjsxi1-coreutils-9.11/bin/timeout --kill-after=15s 7200s /nix/store/23zk8sgzamrbmj1fday15szf7f2279s8-nix-2.34.7/bin/nix --extra-experimental-features nix-command --extra-experimental-features flakes --log-format internal-json run .#packages.x86_64-linux.nix-ci-check-gammaloop-nextest-core --print-build-logs
10.04 s
14.95 s
evaluating derivation 'g
copying '/nix/store/rmgz
evaluating derivation 'g
copying '/nix/store/rmgz
evaluating derivation 'g
copying '/nix/store/rmgz
evaluating derivation 'g
copying '/nix/store/rmgz
evaluating derivation 'g
copying '/nix/store/rmgz
evaluating derivation 'g
copying '/nix/store/rmgz
evaluating derivation 'g
querying info about miss
querying gammaloop-nexte
[0 /1 built, 0.0 KiB DL]
[1 /0 /1 built, 0.0 KiB DLgammaloop-nextest-core> Extracting 3 binaries (including 1 non-test binary), 1 build script output directory, and 2 linked paths to /build/nextest-archive-WDA7hg
15.40 s
gammaloop-nextest-core> Extracted 18 files to /build/nextest-archive-WDA7hg in 0.45s
15.41 s
gammaloop-nextest-core> ------------
15.41 s
gammaloop-nextest-core> Nextest run ID 2e14c2d0-1500-4958-b1fc-7164816a24fc with nextest profile: ci_gammaloop
15.41 s
gammaloop-nextest-core> Starting 339 tests across 2 binaries
15.75 s
gammaloop-nextest-core> FAIL [ 0.021s] (246/339) gammaloop-api repl::tests :: completion_shows_type_hint_for_non_boolean_settings_leaf
15.75 s
gammaloop-nextest-core> stdout ---
15.75 s
gammaloop-nextest-core>
15.75 s
gammaloop-nextest-core> running 1 test
15.75 s
gammaloop-nextest-core> test repl::tests::completion_shows_type_hint_for_non_boolean_settings_leaf ... FAILED
15.75 s
gammaloop-nextest-core>
15.75 s
gammaloop-nextest-core> failures:
15.75 s
gammaloop-nextest-core>
15.75 s
gammaloop-nextest-core> failures:
15.75 s
gammaloop-nextest-core> repl::tests::completion_shows_type_hint_for_non_boolean_settings_leaf
15.75 s
gammaloop-nextest-core>
15.75 s
gammaloop-nextest-core> test result: FAILED. 0 passed; 1 failed; 0 ignored; 0 measured; 338 filtered out; finished in 0.01s
15.75 s
gammaloop-nextest-core>
15.75 s
gammaloop-nextest-core> stderr ---
15.75 s
gammaloop-nextest-core>
15.75 s
gammaloop-nextest-core> thread 'repl::tests::completion_shows_type_hint_for_non_boolean_settings_leaf' (772) panicked at crates/gammaloop-api/src/repl.rs:5778:9:
15.75 s
gammaloop-nextest-core> [Suggestion { value: "", description: Some("Number of samples in the first Monte Carlo iteration."), style: None, extra: None, span: Span { start: 42, end: 42 }, append_whitespace: false }]
15.75 s
gammaloop-nextest-core> stack backtrace:
15.75 s
gammaloop-nextest-core> 0: __rustc::rust_begin_unwind
15.75 s
gammaloop-nextest-core> 1: core::panicking::panic_fmt
15.75 s
gammaloop-nextest-core> 2: gammaloop_api::repl::tests::completion_shows_type_hint_for_non_boolean_settings_leaf
15.75 s
gammaloop-nextest-core> 3: <gammaloop_api::repl::tests::completion_shows_type_hint_for_non_boolean_settings_leaf::{closure#0} as core::ops::function::FnOnce<()>>::call_once
15.75 s
gammaloop-nextest-core> note: Some details are omitted, run with `RUST_BACKTRACE=full` for a verbose backtrace.
15.75 s
gammaloop-nextest-core>
15.80 s
gammaloop-nextest-core> FAIL [ 0.026s] (275/339) gammaloop-api templates::tests :: extract_templates_uses_canonical_package_layout
15.80 s
gammaloop-nextest-core> stdout ---
15.80 s
gammaloop-nextest-core>
15.80 s
gammaloop-nextest-core> running 1 test
15.80 s
gammaloop-nextest-core> test templates::tests::extract_templates_uses_canonical_package_layout ... FAILED
15.80 s
gammaloop-nextest-core>
15.80 s
gammaloop-nextest-core> failures:
15.80 s
gammaloop-nextest-core>
15.80 s
gammaloop-nextest-core> failures:
15.80 s
gammaloop-nextest-core> templates::tests::extract_templates_uses_canonical_package_layout
15.80 s
gammaloop-nextest-core>
15.80 s
gammaloop-nextest-core> test result: FAILED. 0 passed; 1 failed; 0 ignored; 0 measured; 338 filtered out; finished in 0.02s
15.80 s
gammaloop-nextest-core>
15.80 s
gammaloop-nextest-core> stderr ---
15.80 s
gammaloop-nextest-core>
15.80 s
gammaloop-nextest-core> thread 'templates::tests::extract_templates_uses_canonical_package_layout' (866) panicked at crates/gammaloop-api/src/templates.rs:99:9:
15.80 s
gammaloop-nextest-core> assertion failed: figure.contains("amplitude-mode")
15.80 s
gammaloop-nextest-core> stack backtrace:
15.80 s
gammaloop-nextest-core> 0: __rustc::rust_begin_unwind
15.80 s
gammaloop-nextest-core> 1: core::panicking::panic_fmt
15.80 s
gammaloop-nextest-core> 2: core::panicking::panic
15.80 s
gammaloop-nextest-core> 3: gammaloop_api::templates::tests::extract_templates_uses_canonical_package_layout
15.80 s
gammaloop-nextest-core> 4: <gammaloop_api::templates::tests::extract_templates_uses_canonical_package_layout::{closure#0} as core::ops::function::FnOnce<()>>::call_once
15.80 s
gammaloop-nextest-core> note: Some details are omitted, run with `RUST_BACKTRACE=full` for a verbose backtrace.
15.80 s
gammaloop-nextest-core>
16.03 s
gammaloop-nextest-core> ------------
16.03 s
gammaloop-nextest-core> Summary [ 0.616s] 339 tests run: 337 passed , 2 failed , 0 skipped
16.03 s
gammaloop-nextest-core> FAIL [ 0.021s] (246/339) gammaloop-api repl::tests :: completion_shows_type_hint_for_non_boolean_settings_leaf
16.03 s
gammaloop-nextest-core> stdout ---
16.03 s
gammaloop-nextest-core>
16.03 s
gammaloop-nextest-core> running 1 test
16.03 s
gammaloop-nextest-core> test repl::tests::completion_shows_type_hint_for_non_boolean_settings_leaf ... FAILED
16.03 s
gammaloop-nextest-core>
16.03 s
gammaloop-nextest-core> failures:
16.03 s
gammaloop-nextest-core>
16.03 s
gammaloop-nextest-core> failures:
16.03 s
gammaloop-nextest-core> repl::tests::completion_shows_type_hint_for_non_boolean_settings_leaf
16.03 s
gammaloop-nextest-core>
16.03 s
gammaloop-nextest-core> test result: FAILED. 0 passed; 1 failed; 0 ignored; 0 measured; 338 filtered out; finished in 0.01s
16.03 s
gammaloop-nextest-core>
16.03 s
gammaloop-nextest-core> stderr ---
16.03 s
gammaloop-nextest-core>
16.03 s
gammaloop-nextest-core> thread 'repl::tests::completion_shows_type_hint_for_non_boolean_settings_leaf' (772) panicked at crates/gammaloop-api/src/repl.rs:5778:9:
16.03 s
gammaloop-nextest-core> [Suggestion { value: "", description: Some("Number of samples in the first Monte Carlo iteration."), style: None, extra: None, span: Span { start: 42, end: 42 }, append_whitespace: false }]
16.03 s
gammaloop-nextest-core> stack backtrace:
16.03 s
gammaloop-nextest-core> 0: __rustc::rust_begin_unwind
16.03 s
gammaloop-nextest-core> 1: core::panicking::panic_fmt
16.03 s
gammaloop-nextest-core> 2: gammaloop_api::repl::tests::completion_shows_type_hint_for_non_boolean_settings_leaf
16.03 s
gammaloop-nextest-core> 3: <gammaloop_api::repl::tests::completion_shows_type_hint_for_non_boolean_settings_leaf::{closure#0} as core::ops::function::FnOnce<()>>::call_once
16.03 s
gammaloop-nextest-core> note: Some details are omitted, run with `RUST_BACKTRACE=full` for a verbose backtrace.
16.03 s
gammaloop-nextest-core>
16.03 s
gammaloop-nextest-core> FAIL [ 0.026s] (275/339) gammaloop-api templates::tests :: extract_templates_uses_canonical_package_layout
16.03 s
gammaloop-nextest-core> stdout ---
16.03 s
gammaloop-nextest-core>
16.03 s
gammaloop-nextest-core> running 1 test
16.03 s
gammaloop-nextest-core> test templates::tests::extract_templates_uses_canonical_package_layout ... FAILED
16.03 s
gammaloop-nextest-core>
16.03 s
gammaloop-nextest-core> failures:
16.03 s
gammaloop-nextest-core>
16.03 s
gammaloop-nextest-core> failures:
16.03 s
gammaloop-nextest-core> templates::tests::extract_templates_uses_canonical_package_layout
16.03 s
gammaloop-nextest-core>
16.03 s
gammaloop-nextest-core> test result: FAILED. 0 passed; 1 failed; 0 ignored; 0 measured; 338 filtered out; finished in 0.02s
16.03 s
gammaloop-nextest-core>
16.03 s
gammaloop-nextest-core> stderr ---
16.03 s
gammaloop-nextest-core>
16.03 s
gammaloop-nextest-core> thread 'templates::tests::extract_templates_uses_canonical_package_layout' (866) panicked at crates/gammaloop-api/src/templates.rs:99:9:
16.03 s
gammaloop-nextest-core> assertion failed: figure.contains("amplitude-mode")
16.03 s
gammaloop-nextest-core> stack backtrace:
16.03 s
gammaloop-nextest-core> 0: __rustc::rust_begin_unwind
16.03 s
gammaloop-nextest-core> 1: core::panicking::panic_fmt
16.03 s
gammaloop-nextest-core> 2: core::panicking::panic
16.03 s
gammaloop-nextest-core> 3: gammaloop_api::templates::tests::extract_templates_uses_canonical_package_layout
16.03 s
gammaloop-nextest-core> 4: <gammaloop_api::templates::tests::extract_templates_uses_canonical_package_layout::{closure#0} as core::ops::function::FnOnce<()>>::call_once
16.03 s
gammaloop-nextest-core> note: Some details are omitted, run with `RUST_BACKTRACE=full` for a verbose backtrace.
16.03 s
gammaloop-nextest-core>
16.10 s
gammaloop-nextest-core> error : test run failed
16.13 s
gammaloop-nextest-core>
16.13 s
gammaloop-nextest-core> ========== nextest test summary ==========
16.13 s
gammaloop-nextest-core> report: target/nextest/ci_gammaloop/junit.xml
16.13 s
gammaloop-nextest-core> tests: 339, failures: 2, errors: 0
16.13 s
gammaloop-nextest-core>
16.13 s
gammaloop-nextest-core> 1. gammaloop-api::repl::tests::completion_shows_type_hint_for_non_boolean_settings_leaf
16.13 s
gammaloop-nextest-core> failure: test failure with exit code 101
16.13 s
gammaloop-nextest-core> thread 'repl::tests::completion_shows_type_hint_for_non_boolean_settings_leaf' (772) panicked at crates/gammaloop-api/src/repl.rs:5778:9:
16.13 s
gammaloop-nextest-core> [Suggestion { value: "", description: Some("Number of samples in the first Monte Carlo iteration."), style: None, extra: None, span: Span { start: 42, end: 42 }, append_whitespace: false }]
16.13 s
gammaloop-nextest-core> stack backtrace:
16.13 s
gammaloop-nextest-core> 0: __rustc::rust_begin_unwind
16.13 s
gammaloop-nextest-core> 1: core::panicking::panic_fmt
16.13 s
gammaloop-nextest-core> 2: gammaloop_api::repl::tests::completion_shows_type_hint_for_non_boolean_settings_leaf
16.13 s
gammaloop-nextest-core> 3: <gammaloop_api::repl::tests::completion_shows_type_hint_for_non_boolean_settings_leaf::{closure#0} as core::ops::function::FnOnce<()>>::call_once
16.13 s
gammaloop-nextest-core> note: Some details are omitted, run with `RUST_BACKTRACE=full` for a verbose backtrace.
16.13 s
gammaloop-nextest-core> system-out
16.13 s
gammaloop-nextest-core> running 1 test
16.13 s
gammaloop-nextest-core> test repl::tests::completion_shows_type_hint_for_non_boolean_settings_leaf ... FAILED
16.13 s
gammaloop-nextest-core>
16.13 s
gammaloop-nextest-core> failures:
16.13 s
gammaloop-nextest-core>
16.13 s
gammaloop-nextest-core> failures:
16.13 s
gammaloop-nextest-core> repl::tests::completion_shows_type_hint_for_non_boolean_settings_leaf
16.13 s
gammaloop-nextest-core>
16.13 s
gammaloop-nextest-core> test result: FAILED. 0 passed; 1 failed; 0 ignored; 0 measured; 338 filtered out; finished in 0.01s
16.13 s
gammaloop-nextest-core> system-err
16.13 s
gammaloop-nextest-core> thread 'repl::tests::completion_shows_type_hint_for_non_boolean_settings_leaf' (772) panicked at crates/gammaloop-api/src/repl.rs:5778:9:
16.13 s
gammaloop-nextest-core> [Suggestion { value: "", description: Some("Number of samples in the first Monte Carlo iteration."), style: None, extra: None, span: Span { start: 42, end: 42 }, append_whitespace: false }]
16.13 s
gammaloop-nextest-core> stack backtrace:
16.13 s
gammaloop-nextest-core> 0: __rustc::rust_begin_unwind
16.13 s
gammaloop-nextest-core> 1: core::panicking::panic_fmt
16.13 s
gammaloop-nextest-core> 2: gammaloop_api::repl::tests::completion_shows_type_hint_for_non_boolean_settings_leaf
16.13 s
gammaloop-nextest-core> 3: <gammaloop_api::repl::tests::completion_shows_type_hint_for_non_boolean_settings_leaf::{closure#0} as core::ops::function::FnOnce<()>>::call_once
16.13 s
gammaloop-nextest-core> note: Some details are omitted, run with `RUST_BACKTRACE=full` for a verbose backtrace.
16.13 s
gammaloop-nextest-core>
16.13 s
gammaloop-nextest-core> 2. gammaloop-api::templates::tests::extract_templates_uses_canonical_package_layout
16.13 s
gammaloop-nextest-core> failure: test failure with exit code 101
16.13 s
gammaloop-nextest-core> thread 'templates::tests::extract_templates_uses_canonical_package_layout' (866) panicked at crates/gammaloop-api/src/templates.rs:99:9:
16.13 s
gammaloop-nextest-core> assertion failed: figure.contains("amplitude-mode")
16.13 s
gammaloop-nextest-core> stack backtrace:
16.13 s
gammaloop-nextest-core> 0: __rustc::rust_begin_unwind
16.13 s
gammaloop-nextest-core> 1: core::panicking::panic_fmt
16.13 s
gammaloop-nextest-core> 2: core::panicking::panic
16.13 s
gammaloop-nextest-core> 3: gammaloop_api::templates::tests::extract_templates_uses_canonical_package_layout
16.13 s
gammaloop-nextest-core> 4: <gammaloop_api::templates::tests::extract_templates_uses_canonical_package_layout::{closure#0} as core::ops::function::FnOnce<()>>::call_once
16.13 s
gammaloop-nextest-core> note: Some details are omitted, run with `RUST_BACKTRACE=full` for a verbose backtrace.
16.13 s
gammaloop-nextest-core> system-out
16.13 s
gammaloop-nextest-core> running 1 test
16.13 s
gammaloop-nextest-core> test templates::tests::extract_templates_uses_canonical_package_layout ... FAILED
16.13 s
gammaloop-nextest-core>
16.13 s
gammaloop-nextest-core> failures:
16.13 s
gammaloop-nextest-core>
16.13 s
gammaloop-nextest-core> failures:
16.13 s
gammaloop-nextest-core> templates::tests::extract_templates_uses_canonical_package_layout
16.13 s
gammaloop-nextest-core>
16.13 s
gammaloop-nextest-core> test result: FAILED. 0 passed; 1 failed; 0 ignored; 0 measured; 338 filtered out; finished in 0.02s
16.13 s
gammaloop-nextest-core> system-err
16.13 s
gammaloop-nextest-core> thread 'templates::tests::extract_templates_uses_canonical_package_layout' (866) panicked at crates/gammaloop-api/src/templates.rs:99:9:
16.13 s
gammaloop-nextest-core> assertion failed: figure.contains("amplitude-mode")
16.13 s
gammaloop-nextest-core> stack backtrace:
16.13 s
gammaloop-nextest-core> 0: __rustc::rust_begin_unwind
16.13 s
gammaloop-nextest-core> 1: core::panicking::panic_fmt
16.13 s
gammaloop-nextest-core> 2: core::panicking::panic
16.13 s
gammaloop-nextest-core> 3: gammaloop_api::templates::tests::extract_templates_uses_canonical_package_layout
16.13 s
gammaloop-nextest-core> 4: <gammaloop_api::templates::tests::extract_templates_uses_canonical_package_layout::{closure#0} as core::ops::function::FnOnce<()>>::call_once
16.13 s
gammaloop-nextest-core> note: Some details are omitted, run with `RUST_BACKTRACE=full` for a verbose backtrace.
16.13 s
gammaloop-nextest-core> =========================================
16.14 s
gammaloop-nextest-core> Extracting 1 binary and 1 linked path to /build/nextest-archive-2I0li2
16.22 s
gammaloop-nextest-core> Extracted 7 files to /build/nextest-archive-2I0li2 in 0.08s
16.24 s
gammaloop-nextest-core> ------------
16.24 s
gammaloop-nextest-core> Nextest run ID bb1fa411-686d-467f-bc45-1edf589e7f10 with nextest profile: ci_gammaloop
16.24 s
gammaloop-nextest-core> Starting 19 tests across 1 binary
16.25 s
gammaloop-nextest-core> ------------
16.25 s
gammaloop-nextest-core> Summary [ 0.014s] 19 tests run: 19 passed , 0 skipped
16.29 s
gammaloop-nextest-core>
16.29 s
gammaloop-nextest-core> ========== nextest test summary ==========
16.29 s
gammaloop-nextest-core> report: target/nextest/ci_gammaloop/junit.xml
16.29 s
gammaloop-nextest-core> tests: 19, failures: 0, errors: 0
16.29 s
gammaloop-nextest-core> No failing testcases found.
16.29 s
gammaloop-nextest-core> =========================================
16.30 s
gammaloop-nextest-core> Extracting 1 binary to /build/nextest-archive-A3h96q
16.34 s
gammaloop-nextest-core> Extracted 4 files to /build/nextest-archive-A3h96q in 0.03s
16.35 s
gammaloop-nextest-core> ------------
16.35 s
gammaloop-nextest-core> Nextest run ID 34ca2ab5-363d-458b-a8e3-406e68f323b4 with nextest profile: ci_gammaloop
16.35 s
gammaloop-nextest-core> Starting 0 tests across 1 binary
16.35 s
gammaloop-nextest-core> ------------
16.35 s
gammaloop-nextest-core> Summary [ 0.000s] 0 tests run: 0 passed , 0 skipped
16.38 s
gammaloop-nextest-core>
16.38 s
gammaloop-nextest-core> ========== nextest test summary ==========
16.38 s
gammaloop-nextest-core> report: target/nextest/ci_gammaloop/junit.xml
16.38 s
gammaloop-nextest-core> tests: 0, failures: 0, errors: 0
16.38 s
gammaloop-nextest-core> No failing testcases found.
16.38 s
gammaloop-nextest-core> =========================================
16.39 s
gammaloop-nextest-core> Extracting 4 binaries, 1 build script output directory, and 2 linked paths to /build/nextest-archive-MDu9aG
16.86 s
gammaloop-nextest-core> Extracted 18 files to /build/nextest-archive-MDu9aG in 0.47s
16.87 s
gammaloop-nextest-core> ------------
16.87 s
gammaloop-nextest-core> Nextest run ID 7dd86df6-9b93-4cef-8dae-9c33b82892e6 with nextest profile: ci_gammaloop
16.87 s
gammaloop-nextest-core> Starting 456 tests across 4 binaries (61 tests skipped , including 60 tests via profile.ci_gammaloop.default-filter )
17.26 s
gammaloop-nextest-core> FAIL [ 0.253s] (159/456) gammalooprs graph::parse::tests :: parse_lmbsetting_crossection
17.26 s
gammaloop-nextest-core> stdout ---
17.26 s
gammaloop-nextest-core>
17.26 s
gammaloop-nextest-core> running 1 test
17.26 s
gammaloop-nextest-core> ━━━━━━━━━━━━━━━━━━━━━━━━━━━━━━━ Snapshot Summary ━━━━━━━━━━━━━━━━━━━━━━━━━━━━━━━
17.26 s
gammaloop-nextest-core> Snapshot: parse_lmbsetting_crossection
17.26 s
gammaloop-nextest-core> Source: crates/gammalooprs/src/graph/parse/tests.rs:252
17.26 s
gammaloop-nextest-core> ────────────────────────────────────────────────────────────────────────────────
17.26 s
gammaloop-nextest-core> Expression: g.debug_dot()
17.26 s
gammaloop-nextest-core> ────────────────────────────────────────────────────────────────────────────────
17.26 s
gammaloop-nextest-core> -old snapshot
17.26 s
gammaloop-nextest-core> +new results
17.26 s
gammaloop-nextest-core> ────────────┬───────────────────────────────────────────────────────────────────
17.26 s
gammaloop-nextest-core> 1 │-digraph G{
17.26 s
gammaloop-nextest-core> 1 │+digraph G {
17.26 s
gammaloop-nextest-core> 2 2 │ num = "1/2";
17.26 s
gammaloop-nextest-core> 3 3 │ overall_factor = "2*x";
17.26 s
gammaloop-nextest-core> 4 4 │ overall_factor_evaluated = "2*x";
17.26 s
gammaloop-nextest-core> 5 5 │ projector = "spenso::t";
17.26 s
gammaloop-nextest-core> ────────────┴───────────────────────────────────────────────────────────────────
17.26 s
gammaloop-nextest-core> To update snapshots run `cargo insta review`
17.26 s
gammaloop-nextest-core> Stopped on the first failure. Run `cargo insta test` to run all snapshots.
17.26 s
gammaloop-nextest-core> test graph::parse::tests::parse_lmbsetting_crossection ... FAILED
17.26 s
gammaloop-nextest-core>
17.26 s
gammaloop-nextest-core> failures:
17.26 s
gammaloop-nextest-core>
17.26 s
gammaloop-nextest-core> failures:
17.26 s
gammaloop-nextest-core> graph::parse::tests::parse_lmbsetting_crossection
17.26 s
gammaloop-nextest-core>
17.26 s
gammaloop-nextest-core> test result: FAILED. 0 passed; 1 failed; 0 ignored; 0 measured; 508 filtered out; finished in 0.24s
17.26 s
gammaloop-nextest-core>
17.26 s
gammaloop-nextest-core> stderr ---
17.26 s
gammaloop-nextest-core> [07:32:39.507] @gammalooprs::graph::attribute_warnings WARNING : Unknown node attribute 'color_num' on graph 'G', node 'A'; did you mean 'num'?
17.26 s
gammaloop-nextest-core> at crates/gammalooprs/src/graph/attribute_warnings.rs:198
17.26 s
gammaloop-nextest-core> The application panicked (crashed).
17.26 s
gammaloop-nextest-core> Message: snapshot assertion for 'parse_lmbsetting_crossection' failed in line 252
17.26 s
gammaloop-nextest-core> Location: /nix/store/xdy1vvhll2bijdplvl9fcc2b9plkxhaa-vendor-cargo-deps/c19b7c6f923b580ac259164a89f2577984ad5ab09ee9d583b888f934adbbe8d0/insta-1.47.2/src/runtime.rs :719
17.26 s
gammaloop-nextest-core>
17.26 s
gammaloop-nextest-core> ━━━━━━━━━━━━━━━━━━━━━━━━━━━━━━━━━━ BACKTRACE ━━━━━━━━━━━━━━━━━━━━━━━━━━━━━━━━━━━
17.26 s
gammaloop-nextest-core> 1: <color_eyre[b0c9e66060e883b2]::config::PanicHook>::panic_report <unknown>
17.26 s
gammaloop-nextest-core> at <unknown source file> :<unknown line>
17.26 s
gammaloop-nextest-core> 2: <color_eyre[b0c9e66060e883b2]::config::PanicHook>::into_panic_hook::{closure#0} <unknown>
17.26 s
gammaloop-nextest-core> at <unknown source file> :<unknown line>
17.26 s
gammaloop-nextest-core> 3: std[bcb96dfbba0ab899]::panicking::panic_with_hook <unknown>
17.26 s
gammaloop-nextest-core> at <unknown source file> :<unknown line>
17.26 s
gammaloop-nextest-core> 4: std[bcb96dfbba0ab899]::panicking::panic_handler::{closure#0} <unknown>
17.26 s
gammaloop-nextest-core> at <unknown source file> :<unknown line>
17.26 s
gammaloop-nextest-core> 5: std[bcb96dfbba0ab899]::sys::backtrace::__rust_end_short_backtrace::<std[bcb96dfbba0ab899]::panicking::panic_handler::{closure#0}, !> <unknown>
17.26 s
gammaloop-nextest-core> at <unknown source file> :<unknown line>
17.26 s
gammaloop-nextest-core> 6: __rustc[6c289b9f9c454d21]::rust_begin_unwind <unknown>
17.26 s
gammaloop-nextest-core> at <unknown source file> :<unknown line>
17.26 s
gammaloop-nextest-core> 7: core[940e698046960fd5]::panicking::panic_fmt <unknown>
17.26 s
gammaloop-nextest-core> at <unknown source file> :<unknown line>
17.26 s
gammaloop-nextest-core> 8: insta[307a548ac79ef4d9]::runtime::assert_snapshot <unknown>
17.26 s
gammaloop-nextest-core> at <unknown source file> :<unknown line>
17.26 s
gammaloop-nextest-core> 9: gammalooprs[5490727360442cce]::graph::parse::tests::parse_lmbsetting_crossection <unknown>
17.26 s
gammaloop-nextest-core> at <unknown source file> :<unknown line>
17.26 s
gammaloop-nextest-core> 10: <gammalooprs[5490727360442cce]::graph::parse::tests::parse_lmbsetting_crossection::{closure#0} as core[940e698046960fd5]::ops::function::FnOnce<()>>::call_once <unknown>
17.26 s
gammaloop-nextest-core> at <unknown source file> :<unknown line>
17.26 s
gammaloop-nextest-core> 11: test[75d6903177b1d7e9]::__rust_begin_short_backtrace::<core[940e698046960fd5]::result::Result<(), alloc[2ea6bcb46fca0c42]::string::String>, fn() -> core[940e698046960fd5]::result::Result<(), alloc[2ea6bcb46fca0c42]::string::String>> <unknown>
17.26 s
gammaloop-nextest-core> at <unknown source file> :<unknown line>
17.26 s
gammaloop-nextest-core> 12: test[75d6903177b1d7e9]::run_test::{closure#0} <unknown>
17.26 s
gammaloop-nextest-core> at <unknown source file> :<unknown line>
17.26 s
gammaloop-nextest-core> 13: std[bcb96dfbba0ab899]::sys::backtrace::__rust_begin_short_backtrace::<test[75d6903177b1d7e9]::run_test::{closure#1}, ()> <unknown>
17.26 s
gammaloop-nextest-core> at <unknown source file> :<unknown line>
17.26 s
gammaloop-nextest-core> 14: <std[bcb96dfbba0ab899]::thread::lifecycle::spawn_unchecked<test[75d6903177b1d7e9]::run_test::{closure#1}, ()>::{closure#1} as core[940e698046960fd5]::ops::function::FnOnce<()>>::call_once::{shim:vtable#0} <unknown>
17.26 s
gammaloop-nextest-core> at <unknown source file> :<unknown line>
17.26 s
gammaloop-nextest-core> 15: <std[bcb96dfbba0ab899]::sys::thread::unix::Thread>::new::thread_start <unknown>
17.26 s
gammaloop-nextest-core> at <unknown source file> :<unknown line>
17.26 s
gammaloop-nextest-core> 16: start_thread <unknown>
17.26 s
gammaloop-nextest-core> at <unknown source file> :<unknown line>
17.26 s
gammaloop-nextest-core> 17: __clone3 <unknown>
17.26 s
gammaloop-nextest-core> at <unknown source file> :<unknown line>
17.26 s
gammaloop-nextest-core>
17.26 s
gammaloop-nextest-core> Run with COLORBT_SHOW_HIDDEN=1 environment variable to disable frame filtering.
17.26 s
gammaloop-nextest-core> Run with RUST_BACKTRACE=full to include source snippets.
17.26 s
gammaloop-nextest-core>
17.69 s
gammaloop-nextest-core> FAIL [ 0.093s] (407/456) gammalooprs uv::export::tests :: computed_node_full_numerator_is_a_spenso_aware_typst_fragment
17.69 s
gammaloop-nextest-core> stdout ---
17.69 s
gammaloop-nextest-core>
17.69 s
gammaloop-nextest-core> running 1 test
17.69 s
gammaloop-nextest-core> test uv::export::tests::computed_node_full_numerator_is_a_spenso_aware_typst_fragment ... FAILED
17.69 s
gammaloop-nextest-core>
17.69 s
gammaloop-nextest-core> failures:
17.69 s
gammaloop-nextest-core>
17.69 s
gammaloop-nextest-core> failures:
17.69 s
gammaloop-nextest-core> uv::export::tests::computed_node_full_numerator_is_a_spenso_aware_typst_fragment
17.69 s
gammaloop-nextest-core>
17.69 s
gammaloop-nextest-core> test result: FAILED. 0 passed; 1 failed; 0 ignored; 0 measured; 508 filtered out; finished in 0.08s
17.69 s
gammaloop-nextest-core>
17.69 s
gammaloop-nextest-core> stderr ---
17.69 s
gammaloop-nextest-core> The application panicked (crashed).
17.69 s
gammaloop-nextest-core> Message: assertion failed: exported.dot.contains(r#"full_num = "op(\"Tr\")(1)";"#)
17.69 s
gammaloop-nextest-core> Location: crates/gammalooprs/src/uv/export.rs :483
17.69 s
gammaloop-nextest-core>
17.69 s
gammaloop-nextest-core> ━━━━━━━━━━━━━━━━━━━━━━━━━━━━━━━━━━ BACKTRACE ━━━━━━━━━━━━━━━━━━━━━━━━━━━━━━━━━━━
17.69 s
gammaloop-nextest-core> 1: <color_eyre[b0c9e66060e883b2]::config::PanicHook>::panic_report <unknown>
17.69 s
gammaloop-nextest-core> at <unknown source file> :<unknown line>
17.69 s
gammaloop-nextest-core> 2: <color_eyre[b0c9e66060e883b2]::config::PanicHook>::into_panic_hook::{closure#0} <unknown>
17.69 s
gammaloop-nextest-core> at <unknown source file> :<unknown line>
17.69 s
gammaloop-nextest-core> 3: std[bcb96dfbba0ab899]::panicking::panic_with_hook <unknown>
17.69 s
gammaloop-nextest-core> at <unknown source file> :<unknown line>
17.69 s
gammaloop-nextest-core> 4: std[bcb96dfbba0ab899]::panicking::panic_handler::{closure#0} <unknown>
17.69 s
gammaloop-nextest-core> at <unknown source file> :<unknown line>
17.69 s
gammaloop-nextest-core> 5: std[bcb96dfbba0ab899]::sys::backtrace::__rust_end_short_backtrace::<std[bcb96dfbba0ab899]::panicking::panic_handler::{closure#0}, !> <unknown>
17.69 s
gammaloop-nextest-core> at <unknown source file> :<unknown line>
17.69 s
gammaloop-nextest-core> 6: __rustc[6c289b9f9c454d21]::rust_begin_unwind <unknown>
17.69 s
gammaloop-nextest-core> at <unknown source file> :<unknown line>
17.69 s
gammaloop-nextest-core> 7: core[940e698046960fd5]::panicking::panic_fmt <unknown>
17.69 s
gammaloop-nextest-core> at <unknown source file> :<unknown line>
17.69 s
gammaloop-nextest-core> 8: core[940e698046960fd5]::panicking::panic <unknown>
17.69 s
gammaloop-nextest-core> at <unknown source file> :<unknown line>
17.69 s
gammaloop-nextest-core> 9: gammalooprs[5490727360442cce]::uv::export::tests::computed_node_full_numerator_is_a_spenso_aware_typst_fragment <unknown>
17.69 s
gammaloop-nextest-core> at <unknown source file> :<unknown line>
17.69 s
gammaloop-nextest-core> 10: <gammalooprs[5490727360442cce]::uv::export::tests::computed_node_full_numerator_is_a_spenso_aware_typst_fragment::{closure#0} as core[940e698046960fd5]::ops::function::FnOnce<()>>::call_once <unknown>
17.69 s
gammaloop-nextest-core> at <unknown source file> :<unknown line>
17.69 s
gammaloop-nextest-core> 11: test[75d6903177b1d7e9]::__rust_begin_short_backtrace::<core[940e698046960fd5]::result::Result<(), alloc[2ea6bcb46fca0c42]::string::String>, fn() -> core[940e698046960fd5]::result::Result<(), alloc[2ea6bcb46fca0c42]::string::String>> <unknown>
17.69 s
gammaloop-nextest-core> at <unknown source file> :<unknown line>
17.70 s
gammaloop-nextest-core> 12: test[75d6903177b1d7e9]::run_test::{closure#0} <unknown>
17.70 s
gammaloop-nextest-core> at <unknown source file> :<unknown line>
17.70 s
gammaloop-nextest-core> 13: std[bcb96dfbba0ab899]::sys::backtrace::__rust_begin_short_backtrace::<test[75d6903177b1d7e9]::run_test::{closure#1}, ()> <unknown>
17.70 s
gammaloop-nextest-core> at <unknown source file> :<unknown line>
17.70 s
gammaloop-nextest-core> 14: <std[bcb96dfbba0ab899]::thread::lifecycle::spawn_unchecked<test[75d6903177b1d7e9]::run_test::{closure#1}, ()>::{closure#1} as core[940e698046960fd5]::ops::function::FnOnce<()>>::call_once::{shim:vtable#0} <unknown>
17.70 s
gammaloop-nextest-core> at <unknown source file> :<unknown line>
17.70 s
gammaloop-nextest-core> 15: <std[bcb96dfbba0ab899]::sys::thread::unix::Thread>::new::thread_start <unknown>
17.70 s
gammaloop-nextest-core> at <unknown source file> :<unknown line>
17.70 s
gammaloop-nextest-core> 16: start_thread <unknown>
17.70 s
gammaloop-nextest-core> at <unknown source file> :<unknown line>
17.70 s
gammaloop-nextest-core> 17: __clone3 <unknown>
17.70 s
gammaloop-nextest-core> at <unknown source file> :<unknown line>
17.70 s
gammaloop-nextest-core>
17.70 s
gammaloop-nextest-core> Run with COLORBT_SHOW_HIDDEN=1 environment variable to disable frame filtering.
17.70 s
gammaloop-nextest-core> Run with RUST_BACKTRACE=full to include source snippets.
17.70 s
gammaloop-nextest-core>
25.48 s
gammaloop-nextest-core> ------------
25.49 s
gammaloop-nextest-core> Summary [ 8.606s] 456 tests run: 454 passed , 2 failed , 61 skipped
25.49 s
gammaloop-nextest-core> FAIL [ 0.253s] (159/456) gammalooprs graph::parse::tests :: parse_lmbsetting_crossection
25.49 s
gammaloop-nextest-core> stdout ---
25.49 s
gammaloop-nextest-core>
25.49 s
gammaloop-nextest-core> running 1 test
25.49 s
gammaloop-nextest-core> ━━━━━━━━━━━━━━━━━━━━━━━━━━━━━━━ Snapshot Summary ━━━━━━━━━━━━━━━━━━━━━━━━━━━━━━━
25.49 s
gammaloop-nextest-core> Snapshot: parse_lmbsetting_crossection
25.49 s
gammaloop-nextest-core> Source: crates/gammalooprs/src/graph/parse/tests.rs:252
25.49 s
gammaloop-nextest-core> ────────────────────────────────────────────────────────────────────────────────
25.49 s
gammaloop-nextest-core> Expression: g.debug_dot()
25.49 s
gammaloop-nextest-core> ────────────────────────────────────────────────────────────────────────────────
25.49 s
gammaloop-nextest-core> -old snapshot
25.49 s
gammaloop-nextest-core> +new results
25.49 s
gammaloop-nextest-core> ────────────┬───────────────────────────────────────────────────────────────────
25.49 s
gammaloop-nextest-core> 1 │-digraph G{
25.49 s
gammaloop-nextest-core> 1 │+digraph G {
25.49 s
gammaloop-nextest-core> 2 2 │ num = "1/2";
25.49 s
gammaloop-nextest-core> 3 3 │ overall_factor = "2*x";
25.49 s
gammaloop-nextest-core> 4 4 │ overall_factor_evaluated = "2*x";
25.49 s
gammaloop-nextest-core> 5 5 │ projector = "spenso::t";
25.49 s
gammaloop-nextest-core> ────────────┴───────────────────────────────────────────────────────────────────
25.49 s
gammaloop-nextest-core> To update snapshots run `cargo insta review`
25.49 s
gammaloop-nextest-core> Stopped on the first failure. Run `cargo insta test` to run all snapshots.
25.49 s
gammaloop-nextest-core> test graph::parse::tests::parse_lmbsetting_crossection ... FAILED
25.49 s
gammaloop-nextest-core>
25.49 s
gammaloop-nextest-core> failures:
25.49 s
gammaloop-nextest-core>
25.49 s
gammaloop-nextest-core> failures:
25.49 s
gammaloop-nextest-core> graph::parse::tests::parse_lmbsetting_crossection
25.49 s
gammaloop-nextest-core>
25.49 s
gammaloop-nextest-core> test result: FAILED. 0 passed; 1 failed; 0 ignored; 0 measured; 508 filtered out; finished in 0.24s
25.49 s
gammaloop-nextest-core>
25.49 s
gammaloop-nextest-core> stderr ---
25.49 s
gammaloop-nextest-core> [07:32:39.507] @gammalooprs::graph::attribute_warnings WARNING : Unknown node attribute 'color_num' on graph 'G', node 'A'; did you mean 'num'?
25.49 s
gammaloop-nextest-core> at crates/gammalooprs/src/graph/attribute_warnings.rs:198
25.49 s
gammaloop-nextest-core> The application panicked (crashed).
25.49 s
gammaloop-nextest-core> Message: snapshot assertion for 'parse_lmbsetting_crossection' failed in line 252
25.49 s
gammaloop-nextest-core> Location: /nix/store/xdy1vvhll2bijdplvl9fcc2b9plkxhaa-vendor-cargo-deps/c19b7c6f923b580ac259164a89f2577984ad5ab09ee9d583b888f934adbbe8d0/insta-1.47.2/src/runtime.rs :719
25.49 s
gammaloop-nextest-core>
25.49 s
gammaloop-nextest-core> ━━━━━━━━━━━━━━━━━━━━━━━━━━━━━━━━━━ BACKTRACE ━━━━━━━━━━━━━━━━━━━━━━━━━━━━━━━━━━━
25.49 s
gammaloop-nextest-core> 1: <color_eyre[b0c9e66060e883b2]::config::PanicHook>::panic_report <unknown>
25.49 s
gammaloop-nextest-core> at <unknown source file> :<unknown line>
25.49 s
gammaloop-nextest-core> 2: <color_eyre[b0c9e66060e883b2]::config::PanicHook>::into_panic_hook::{closure#0} <unknown>
25.49 s
gammaloop-nextest-core> at <unknown source file> :<unknown line>
25.49 s
gammaloop-nextest-core> 3: std[bcb96dfbba0ab899]::panicking::panic_with_hook <unknown>
25.49 s
gammaloop-nextest-core> at <unknown source file> :<unknown line>
25.49 s
gammaloop-nextest-core> 4: std[bcb96dfbba0ab899]::panicking::panic_handler::{closure#0} <unknown>
25.49 s
gammaloop-nextest-core> at <unknown source file> :<unknown line>
25.49 s
gammaloop-nextest-core> 5: std[bcb96dfbba0ab899]::sys::backtrace::__rust_end_short_backtrace::<std[bcb96dfbba0ab899]::panicking::panic_handler::{closure#0}, !> <unknown>
25.49 s
gammaloop-nextest-core> at <unknown source file> :<unknown line>
25.49 s
gammaloop-nextest-core> 6: __rustc[6c289b9f9c454d21]::rust_begin_unwind <unknown>
25.49 s
gammaloop-nextest-core> at <unknown source file> :<unknown line>
25.49 s
gammaloop-nextest-core> 7: core[940e698046960fd5]::panicking::panic_fmt <unknown>
25.49 s
gammaloop-nextest-core> at <unknown source file> :<unknown line>
25.49 s
gammaloop-nextest-core> 8: insta[307a548ac79ef4d9]::runtime::assert_snapshot <unknown>
25.49 s
gammaloop-nextest-core> at <unknown source file> :<unknown line>
25.49 s
gammaloop-nextest-core> 9: gammalooprs[5490727360442cce]::graph::parse::tests::parse_lmbsetting_crossection <unknown>
25.49 s
gammaloop-nextest-core> at <unknown source file> :<unknown line>
25.49 s
gammaloop-nextest-core> 10: <gammalooprs[5490727360442cce]::graph::parse::tests::parse_lmbsetting_crossection::{closure#0} as core[940e698046960fd5]::ops::function::FnOnce<()>>::call_once <unknown>
25.49 s
gammaloop-nextest-core> at <unknown source file> :<unknown line>
25.49 s
gammaloop-nextest-core> 11: test[75d6903177b1d7e9]::__rust_begin_short_backtrace::<core[940e698046960fd5]::result::Result<(), alloc[2ea6bcb46fca0c42]::string::String>, fn() -> core[940e698046960fd5]::result::Result<(), alloc[2ea6bcb46fca0c42]::string::String>> <unknown>
25.49 s
gammaloop-nextest-core> at <unknown source file> :<unknown line>
25.49 s
gammaloop-nextest-core> 12: test[75d6903177b1d7e9]::run_test::{closure#0} <unknown>
25.49 s
gammaloop-nextest-core> at <unknown source file> :<unknown line>
25.49 s
gammaloop-nextest-core> 13: std[bcb96dfbba0ab899]::sys::backtrace::__rust_begin_short_backtrace::<test[75d6903177b1d7e9]::run_test::{closure#1}, ()> <unknown>
25.49 s
gammaloop-nextest-core> at <unknown source file> :<unknown line>
25.49 s
gammaloop-nextest-core> 14: <std[bcb96dfbba0ab899]::thread::lifecycle::spawn_unchecked<test[75d6903177b1d7e9]::run_test::{closure#1}, ()>::{closure#1} as core[940e698046960fd5]::ops::function::FnOnce<()>>::call_once::{shim:vtable#0} <unknown>
25.49 s
gammaloop-nextest-core> at <unknown source file> :<unknown line>
25.49 s
gammaloop-nextest-core> 15: <std[bcb96dfbba0ab899]::sys::thread::unix::Thread>::new::thread_start <unknown>
25.49 s
gammaloop-nextest-core> at <unknown source file> :<unknown line>
25.49 s
gammaloop-nextest-core> 16: start_thread <unknown>
25.49 s
gammaloop-nextest-core> at <unknown source file> :<unknown line>
25.49 s
gammaloop-nextest-core> 17: __clone3 <unknown>
25.49 s
gammaloop-nextest-core> at <unknown source file> :<unknown line>
25.49 s
gammaloop-nextest-core>
25.49 s
gammaloop-nextest-core> Run with COLORBT_SHOW_HIDDEN=1 environment variable to disable frame filtering.
25.49 s
gammaloop-nextest-core> Run with RUST_BACKTRACE=full to include source snippets.
25.49 s
gammaloop-nextest-core>
25.49 s
gammaloop-nextest-core> FAIL [ 0.093s] (407/456) gammalooprs uv::export::tests :: computed_node_full_numerator_is_a_spenso_aware_typst_fragment
25.49 s
gammaloop-nextest-core> stdout ---
25.49 s
gammaloop-nextest-core>
25.49 s
gammaloop-nextest-core> running 1 test
25.49 s
gammaloop-nextest-core> test uv::export::tests::computed_node_full_numerator_is_a_spenso_aware_typst_fragment ... FAILED
25.49 s
gammaloop-nextest-core>
25.49 s
gammaloop-nextest-core> failures:
25.49 s
gammaloop-nextest-core>
25.49 s
gammaloop-nextest-core> failures:
25.49 s
gammaloop-nextest-core> uv::export::tests::computed_node_full_numerator_is_a_spenso_aware_typst_fragment
25.49 s
gammaloop-nextest-core>
25.49 s
gammaloop-nextest-core> test result: FAILED. 0 passed; 1 failed; 0 ignored; 0 measured; 508 filtered out; finished in 0.08s
25.49 s
gammaloop-nextest-core>
25.49 s
gammaloop-nextest-core> stderr ---
25.49 s
gammaloop-nextest-core> The application panicked (crashed).
25.49 s
gammaloop-nextest-core> Message: assertion failed: exported.dot.contains(r#"full_num = "op(\"Tr\")(1)";"#)
25.49 s
gammaloop-nextest-core> Location: crates/gammalooprs/src/uv/export.rs :483
25.49 s
gammaloop-nextest-core>
25.49 s
gammaloop-nextest-core> ━━━━━━━━━━━━━━━━━━━━━━━━━━━━━━━━━━ BACKTRACE ━━━━━━━━━━━━━━━━━━━━━━━━━━━━━━━━━━━
25.49 s
gammaloop-nextest-core> 1: <color_eyre[b0c9e66060e883b2]::config::PanicHook>::panic_report <unknown>
25.49 s
gammaloop-nextest-core> at <unknown source file> :<unknown line>
25.49 s
gammaloop-nextest-core> 2: <color_eyre[b0c9e66060e883b2]::config::PanicHook>::into_panic_hook::{closure#0} <unknown>
25.49 s
gammaloop-nextest-core> at <unknown source file> :<unknown line>
25.49 s
gammaloop-nextest-core> 3: std[bcb96dfbba0ab899]::panicking::panic_with_hook <unknown>
25.49 s
gammaloop-nextest-core> at <unknown source file> :<unknown line>
25.49 s
gammaloop-nextest-core> 4: std[bcb96dfbba0ab899]::panicking::panic_handler::{closure#0} <unknown>
25.49 s
gammaloop-nextest-core> at <unknown source file> :<unknown line>
25.49 s
gammaloop-nextest-core> 5: std[bcb96dfbba0ab899]::sys::backtrace::__rust_end_short_backtrace::<std[bcb96dfbba0ab899]::panicking::panic_handler::{closure#0}, !> <unknown>
25.49 s
gammaloop-nextest-core> at <unknown source file> :<unknown line>
25.49 s
gammaloop-nextest-core> 6: __rustc[6c289b9f9c454d21]::rust_begin_unwind <unknown>
25.49 s
gammaloop-nextest-core> at <unknown source file> :<unknown line>
25.49 s
gammaloop-nextest-core> 7: core[940e698046960fd5]::panicking::panic_fmt <unknown>
25.49 s
gammaloop-nextest-core> at <unknown source file> :<unknown line>
25.49 s
gammaloop-nextest-core> 8: core[940e698046960fd5]::panicking::panic <unknown>
25.49 s
gammaloop-nextest-core> at <unknown source file> :<unknown line>
25.49 s
gammaloop-nextest-core> 9: gammalooprs[5490727360442cce]::uv::export::tests::computed_node_full_numerator_is_a_spenso_aware_typst_fragment <unknown>
25.49 s
gammaloop-nextest-core> at <unknown source file> :<unknown line>
25.49 s
gammaloop-nextest-core> 10: <gammalooprs[5490727360442cce]::uv::export::tests::computed_node_full_numerator_is_a_spenso_aware_typst_fragment::{closure#0} as core[940e698046960fd5]::ops::function::FnOnce<()>>::call_once <unknown>
25.49 s
gammaloop-nextest-core> at <unknown source file> :<unknown line>
25.49 s
gammaloop-nextest-core> 11: test[75d6903177b1d7e9]::__rust_begin_short_backtrace::<core[940e698046960fd5]::result::Result<(), alloc[2ea6bcb46fca0c42]::string::String>, fn() -> core[940e698046960fd5]::result::Result<(), alloc[2ea6bcb46fca0c42]::string::String>> <unknown>
25.49 s
gammaloop-nextest-core> at <unknown source file> :<unknown line>
25.49 s
gammaloop-nextest-core> 12: test[75d6903177b1d7e9]::run_test::{closure#0} <unknown>
25.49 s
gammaloop-nextest-core> at <unknown source file> :<unknown line>
25.49 s
gammaloop-nextest-core> 13: std[bcb96dfbba0ab899]::sys::backtrace::__rust_begin_short_backtrace::<test[75d6903177b1d7e9]::run_test::{closure#1}, ()> <unknown>
25.49 s
gammaloop-nextest-core> at <unknown source file> :<unknown line>
25.49 s
gammaloop-nextest-core> 14: <std[bcb96dfbba0ab899]::thread::lifecycle::spawn_unchecked<test[75d6903177b1d7e9]::run_test::{closure#1}, ()>::{closure#1} as core[940e698046960fd5]::ops::function::FnOnce<()>>::call_once::{shim:vtable#0} <unknown>
25.49 s
gammaloop-nextest-core> at <unknown source file> :<unknown line>
25.49 s
gammaloop-nextest-core> 15: <std[bcb96dfbba0ab899]::sys::thread::unix::Thread>::new::thread_start <unknown>
25.49 s
gammaloop-nextest-core> at <unknown source file> :<unknown line>
25.49 s
gammaloop-nextest-core> 16: start_thread <unknown>
25.49 s
gammaloop-nextest-core> at <unknown source file> :<unknown line>
25.49 s
gammaloop-nextest-core> 17: __clone3 <unknown>
25.49 s
gammaloop-nextest-core> at <unknown source file> :<unknown line>
25.49 s
gammaloop-nextest-core>
25.49 s
gammaloop-nextest-core> Run with COLORBT_SHOW_HIDDEN=1 environment variable to disable frame filtering.
25.49 s
gammaloop-nextest-core> Run with RUST_BACKTRACE=full to include source snippets.
25.49 s
gammaloop-nextest-core>
25.55 s
gammaloop-nextest-core> error : test run failed
25.58 s
gammaloop-nextest-core>
25.58 s
gammaloop-nextest-core> ========== nextest test summary ==========
25.58 s
gammaloop-nextest-core> report: target/nextest/ci_gammaloop/junit.xml
25.58 s
gammaloop-nextest-core> tests: 456, failures: 2, errors: 0
25.58 s
gammaloop-nextest-core>
25.58 s
gammaloop-nextest-core> 1. gammalooprs::graph::parse::tests::parse_lmbsetting_crossection
25.58 s
gammaloop-nextest-core> failure: test failure with exit code 101
25.58 s
gammaloop-nextest-core> system-out
25.58 s
gammaloop-nextest-core> running 1 test
25.58 s
gammaloop-nextest-core> ━━━━━━━━━━━━━━━━━━━━━━━━━━━━━━━ Snapshot Summary ━━━━━━━━━━━━━━━━━━━━━━━━━━━━━━━
25.58 s
gammaloop-nextest-core> Snapshot: parse_lmbsetting_crossection
25.58 s
gammaloop-nextest-core> Source: crates/gammalooprs/src/graph/parse/tests.rs:252
25.58 s
gammaloop-nextest-core> ────────────────────────────────────────────────────────────────────────────────
25.58 s
gammaloop-nextest-core> Expression: g.debug_dot()
25.58 s
gammaloop-nextest-core> ────────────────────────────────────────────────────────────────────────────────
25.58 s
gammaloop-nextest-core> -old snapshot
25.58 s
gammaloop-nextest-core> +new results
25.58 s
gammaloop-nextest-core> ────────────┬───────────────────────────────────────────────────────────────────
25.58 s
gammaloop-nextest-core> 1 │-digraph G{
25.58 s
gammaloop-nextest-core> 1 │+digraph G {
25.58 s
gammaloop-nextest-core> 2 2 │ num = "1/2";
25.58 s
gammaloop-nextest-core> 3 3 │ overall_factor = "2*x";
25.58 s
gammaloop-nextest-core> 4 4 │ overall_factor_evaluated = "2*x";
25.58 s
gammaloop-nextest-core> 5 5 │ projector = "spenso::t";
25.58 s
gammaloop-nextest-core> ────────────┴───────────────────────────────────────────────────────────────────
25.58 s
gammaloop-nextest-core> To update snapshots run `cargo insta review`
25.58 s
gammaloop-nextest-core> Stopped on the first failure. Run `cargo insta test` to run all snapshots.
25.58 s
gammaloop-nextest-core> test graph::parse::tests::parse_lmbsetting_crossection ... FAILED
25.58 s
gammaloop-nextest-core>
25.58 s
gammaloop-nextest-core> failures:
25.58 s
gammaloop-nextest-core>
25.58 s
gammaloop-nextest-core> failures:
25.58 s
gammaloop-nextest-core> graph::parse::tests::parse_lmbsetting_crossection
25.58 s
gammaloop-nextest-core>
25.58 s
gammaloop-nextest-core> test result: FAILED. 0 passed; 1 failed; 0 ignored; 0 measured; 508 filtered out; finished in 0.24s
25.58 s
gammaloop-nextest-core> system-err
25.58 s
gammaloop-nextest-core> [07:32:39.507] @gammalooprs::graph::attribute_warnings WARNING : Unknown node attribute 'color_num' on graph 'G', node 'A'; did you mean 'num'?
25.58 s
gammaloop-nextest-core> at crates/gammalooprs/src/graph/attribute_warnings.rs:198
25.58 s
gammaloop-nextest-core> The application panicked (crashed).
25.58 s
gammaloop-nextest-core> Message: snapshot assertion for 'parse_lmbsetting_crossection' failed in line 252
25.58 s
gammaloop-nextest-core> Location: /nix/store/xdy1vvhll2bijdplvl9fcc2b9plkxhaa-vendor-cargo-deps/c19b7c6f923b580ac259164a89f2577984ad5ab09ee9d583b888f934adbbe8d0/insta-1.47.2/src/runtime.rs:719
25.58 s
gammaloop-nextest-core>
25.58 s
gammaloop-nextest-core> ━━━━━━━━━━━━━━━━━━━━━━━━━━━━━━━━━━ BACKTRACE ━━━━━━━━━━━━━━━━━━━━━━━━━━━━━━━━━━━
25.58 s
gammaloop-nextest-core> 1: <color_eyre[b0c9e66060e883b2]::config::PanicHook>::panic_report<unknown>
25.58 s
gammaloop-nextest-core> at <unknown source file>:<unknown line>
25.58 s
gammaloop-nextest-core> 2: <color_eyre[b0c9e66060e883b2]::config::PanicHook>::into_panic_hook::{closure#0}<unknown>
25.58 s
gammaloop-nextest-core> at <unknown source file>:<unknown line>
25.58 s
gammaloop-nextest-core> 3: std[bcb96dfbba0ab899]::panicking::panic_with_hook<unknown>
25.58 s
gammaloop-nextest-core> at <unknown source file>:<unknown line>
25.58 s
gammaloop-nextest-core> 4: std[bcb96dfbba0ab899]::panicking::panic_handler::{closure#0}<unknown>
25.58 s
gammaloop-nextest-core> at <unknown source file>:<unknown line>
25.58 s
gammaloop-nextest-core> 5: std[bcb96dfbba0ab899]::sys::backtrace::__rust_end_short_backtrace::<std[bcb96dfbba0ab899]::panicking::panic_handler::{closure#0}, !><unknown>
25.58 s
gammaloop-nextest-core> at <unknown source file>:<unknown line>
25.58 s
gammaloop-nextest-core> 6: __rustc[6c289b9f9c454d21]::rust_begin_unwind<unknown>
25.58 s
gammaloop-nextest-core> at <unknown source file>:<unknown line>
25.58 s
gammaloop-nextest-core> 7: core[940e698046960fd5]::panicking::panic_fmt<unknown>
25.58 s
gammaloop-nextest-core> at <unknown source file>:<unknown line>
25.58 s
gammaloop-nextest-core> 8: insta[307a548ac79ef4d9]::runtime::assert_snapshot<unknown>
25.58 s
gammaloop-nextest-core> at <unknown source file>:<unknown line>
25.58 s
gammaloop-nextest-core> 9: gammalooprs[5490727360442cce]::graph::parse::tests::parse_lmbsetting_crossection<unknown>
25.58 s
gammaloop-nextest-core> at <unknown source file>:<unknown line>
25.58 s
gammaloop-nextest-core> 10: <gammalooprs[5490727360442cce]::graph::parse::tests::parse_lmbsetting_crossection::{closure#0} as core[940e698046960fd5]::ops::function::FnOnce<()>>::call_once<unknown>
25.58 s
gammaloop-nextest-core> at <unknown source file>:<unknown line>
25.58 s
gammaloop-nextest-core> 11: test[75d6903177b1d7e9]::__rust_begin_short_backtrace::<core[940e698046960fd5]::result::Result<(), alloc[2ea6bcb46fca0c42]::string::String>, fn() -> core[940e698046960fd5]::result::Result<(), alloc[2ea6bcb46fca0c42]::string::String>><unknown>
25.58 s
gammaloop-nextest-core> at <unknown source file>:<unknown line>
25.58 s
gammaloop-nextest-core> 12: test[75d6903177b1d7e9]::run_test::{closure#0}<unknown>
25.58 s
gammaloop-nextest-core> at <unknown source file>:<unknown line>
25.58 s
gammaloop-nextest-core> 13: std[bcb96dfbba0ab899]::sys::backtrace::__rust_begin_short_backtrace::<test[75d6903177b1d7e9]::run_test::{closure#1}, ()><unknown>
25.58 s
gammaloop-nextest-core> at <unknown source file>:<unknown line>
25.58 s
gammaloop-nextest-core> 14: <std[bcb96dfbba0ab899]::thread::lifecycle::spawn_unchecked<test[75d6903177b1d7e9]::run_test::{closure#1}, ()>::{closure#1} as core[940e698046960fd5]::ops::function::FnOnce<()>>::call_once::{shim:vtable#0}<unknown>
25.58 s
gammaloop-nextest-core> at <unknown source file>:<unknown line>
25.58 s
gammaloop-nextest-core> 15: <std[bcb96dfbba0ab899]::sys::thread::unix::Thread>::new::thread_start<unknown>
25.58 s
gammaloop-nextest-core> at <unknown source file>:<unknown line>
25.58 s
gammaloop-nextest-core> 16: start_thread<unknown>
25.58 s
gammaloop-nextest-core> at <unknown source file>:<unknown line>
25.58 s
gammaloop-nextest-core> 17: __clone3<unknown>
25.58 s
gammaloop-nextest-core> at <unknown source file>:<unknown line>
25.58 s
gammaloop-nextest-core>
25.58 s
gammaloop-nextest-core> Run with COLORBT_SHOW_HIDDEN=1 environment variable to disable frame filtering.
25.58 s
gammaloop-nextest-core> Run with RUST_BACKTRACE=full to include source snippets.
25.58 s
gammaloop-nextest-core>
25.58 s
gammaloop-nextest-core> 2. gammalooprs::uv::export::tests::computed_node_full_numerator_is_a_spenso_aware_typst_fragment
25.58 s
gammaloop-nextest-core> failure: test failure with exit code 101
25.58 s
gammaloop-nextest-core> system-out
25.58 s
gammaloop-nextest-core> running 1 test
25.58 s
gammaloop-nextest-core> test uv::export::tests::computed_node_full_numerator_is_a_spenso_aware_typst_fragment ... FAILED
25.58 s
gammaloop-nextest-core>
25.58 s
gammaloop-nextest-core> failures:
25.58 s
gammaloop-nextest-core>
25.58 s
gammaloop-nextest-core> failures:
25.58 s
gammaloop-nextest-core> uv::export::tests::computed_node_full_numerator_is_a_spenso_aware_typst_fragment
25.58 s
gammaloop-nextest-core>
25.58 s
gammaloop-nextest-core> test result: FAILED. 0 passed; 1 failed; 0 ignored; 0 measured; 508 filtered out; finished in 0.08s
25.58 s
gammaloop-nextest-core> system-err
25.58 s
gammaloop-nextest-core> The application panicked (crashed).
25.58 s
gammaloop-nextest-core> Message: assertion failed: exported.dot.contains(r#"full_num = "op(\"Tr\")(1)";"#)
25.58 s
gammaloop-nextest-core> Location: crates/gammalooprs/src/uv/export.rs:483
25.58 s
gammaloop-nextest-core>
25.58 s
gammaloop-nextest-core> ━━━━━━━━━━━━━━━━━━━━━━━━━━━━━━━━━━ BACKTRACE ━━━━━━━━━━━━━━━━━━━━━━━━━━━━━━━━━━━
25.58 s
gammaloop-nextest-core> 1: <color_eyre[b0c9e66060e883b2]::config::PanicHook>::panic_report<unknown>
25.58 s
gammaloop-nextest-core> at <unknown source file>:<unknown line>
25.58 s
gammaloop-nextest-core> 2: <color_eyre[b0c9e66060e883b2]::config::PanicHook>::into_panic_hook::{closure#0}<unknown>
25.58 s
gammaloop-nextest-core> at <unknown source file>:<unknown line>
25.58 s
gammaloop-nextest-core> 3: std[bcb96dfbba0ab899]::panicking::panic_with_hook<unknown>
25.58 s
gammaloop-nextest-core> at <unknown source file>:<unknown line>
25.58 s
gammaloop-nextest-core> 4: std[bcb96dfbba0ab899]::panicking::panic_handler::{closure#0}<unknown>
25.58 s
gammaloop-nextest-core> at <unknown source file>:<unknown line>
25.58 s
gammaloop-nextest-core> 5: std[bcb96dfbba0ab899]::sys::backtrace::__rust_end_short_backtrace::<std[bcb96dfbba0ab899]::panicking::panic_handler::{closure#0}, !><unknown>
25.58 s
gammaloop-nextest-core> at <unknown source file>:<unknown line>
25.58 s
gammaloop-nextest-core> 6: __rustc[6c289b9f9c454d21]::rust_begin_unwind<unknown>
25.58 s
gammaloop-nextest-core> at <unknown source file>:<unknown line>
25.58 s
gammaloop-nextest-core> 7: core[940e698046960fd5]::panicking::panic_fmt<unknown>
25.58 s
gammaloop-nextest-core> at <unknown source file>:<unknown line>
25.58 s
gammaloop-nextest-core> 8: core[940e698046960fd5]::panicking::panic<unknown>
25.58 s
gammaloop-nextest-core> at <unknown source file>:<unknown line>
25.58 s
gammaloop-nextest-core> 9: gammalooprs[5490727360442cce]::uv::export::tests::computed_node_full_numerator_is_a_spenso_aware_typst_fragment<unknown>
25.58 s
gammaloop-nextest-core> at <unknown source file>:<unknown line>
25.58 s
gammaloop-nextest-core> 10: <gammalooprs[5490727360442cce]::uv::export::tests::computed_node_full_numerator_is_a_spenso_aware_typst_fragment::{closure#0} as core[940e698046960fd5]::ops::function::FnOnce<()>>::call_once<unknown>
25.58 s
gammaloop-nextest-core> at <unknown source file>:<unknown line>
25.58 s
gammaloop-nextest-core> 11: test[75d6903177b1d7e9]::__rust_begin_short_backtrace::<core[940e698046960fd5]::result::Result<(), alloc[2ea6bcb46fca0c42]::string::String>, fn() -> core[940e698046960fd5]::result::Result<(), alloc[2ea6bcb46fca0c42]::string::String>><unknown>
25.58 s
gammaloop-nextest-core> at <unknown source file>:<unknown line>
25.58 s
gammaloop-nextest-core> 12: test[75d6903177b1d7e9]::run_test::{closure#0}<unknown>
25.58 s
gammaloop-nextest-core> at <unknown source file>:<unknown line>
25.58 s
gammaloop-nextest-core> 13: std[bcb96dfbba0ab899]::sys::backtrace::__rust_begin_short_backtrace::<test[75d6903177b1d7e9]::run_test::{closure#1}, ()><unknown>
25.58 s
gammaloop-nextest-core> at <unknown source file>:<unknown line>
25.58 s
gammaloop-nextest-core> 14: <std[bcb96dfbba0ab899]::thread::lifecycle::spawn_unchecked<test[75d6903177b1d7e9]::run_test::{closure#1}, ()>::{closure#1} as core[940e698046960fd5]::ops::function::FnOnce<()>>::call_once::{shim:vtable#0}<unknown>
25.58 s
gammaloop-nextest-core> at <unknown source file>:<unknown line>
25.58 s
gammaloop-nextest-core> 15: <std[bcb96dfbba0ab899]::sys::thread::unix::Thread>::new::thread_start<unknown>
25.58 s
gammaloop-nextest-core> at <unknown source file>:<unknown line>
25.58 s
gammaloop-nextest-core> 16: start_thread<unknown>
25.58 s
gammaloop-nextest-core> at <unknown source file>:<unknown line>
25.58 s
gammaloop-nextest-core> 17: __clone3<unknown>
25.58 s
gammaloop-nextest-core> at <unknown source file>:<unknown line>
25.58 s
gammaloop-nextest-core>
25.58 s
gammaloop-nextest-core> Run with COLORBT_SHOW_HIDDEN=1 environment variable to disable frame filtering.
25.58 s
gammaloop-nextest-core> Run with RUST_BACKTRACE=full to include source snippets.
25.58 s
gammaloop-nextest-core> =========================================
25.62 s
error: Cannot build '/nix/store/hm35l98s8jf76hp5gsphwyhqjj06gcak-gammaloop-nextest-core.drv '.
25.62 s
Reason: builder failed with exit code 100 .
25.62 s
Output paths:
25.62 s
/nix/store/80jd605dh1wzcz3n78a4ml152ndysq85-gammaloop-nextest-core
25.62 s
Last 612 log lines:
25.62 s
> Extracting 3 binaries (including 1 non-test binary), 1 build script output directory, and 2 linked paths to /build/nextest-archive-WDA7hg
25.62 s
> Extracted 18 files to /build/nextest-archive-WDA7hg in 0.45s
25.62 s
> ------------
25.62 s
> Nextest run ID 2e14c2d0-1500-4958-b1fc-7164816a24fc with nextest profile: ci_gammaloop
25.62 s
> Starting 339 tests across 2 binaries
25.62 s
> FAIL [ 0.021s] (246/339) gammaloop-api repl::tests :: completion_shows_type_hint_for_non_boolean_settings_leaf
25.62 s
> stdout ---
25.62 s
>
25.62 s
> running 1 test
25.62 s
> test repl::tests::completion_shows_type_hint_for_non_boolean_settings_leaf ... FAILED
25.62 s
>
25.62 s
> failures:
25.62 s
>
25.62 s
> failures:
25.62 s
> repl::tests::completion_shows_type_hint_for_non_boolean_settings_leaf
25.62 s
>
25.62 s
> test result: FAILED. 0 passed; 1 failed; 0 ignored; 0 measured; 338 filtered out; finished in 0.01s
25.62 s
>
25.62 s
> stderr ---
25.62 s
>
25.62 s
> thread 'repl::tests::completion_shows_type_hint_for_non_boolean_settings_leaf' (772) panicked at crates/gammaloop-api/src/repl.rs:5778:9:
25.62 s
> [Suggestion { value: "", description: Some("Number of samples in the first Monte Carlo iteration."), style: None, extra: None, span: Span { start: 42, end: 42 }, append_whitespace: false }]
25.62 s
> stack backtrace:
25.62 s
> 0: __rustc::rust_begin_unwind
25.62 s
> 1: core::panicking::panic_fmt
25.62 s
> 2: gammaloop_api::repl::tests::completion_shows_type_hint_for_non_boolean_settings_leaf
25.62 s
> 3: <gammaloop_api::repl::tests::completion_shows_type_hint_for_non_boolean_settings_leaf::{closure#0} as core::ops::function::FnOnce<()>>::call_once
25.62 s
> note: Some details are omitted, run with `RUST_BACKTRACE=full` for a verbose backtrace.
25.62 s
>
25.62 s
> FAIL [ 0.026s] (275/339) gammaloop-api templates::tests :: extract_templates_uses_canonical_package_layout
25.62 s
> stdout ---
25.62 s
>
25.62 s
> running 1 test
25.62 s
> test templates::tests::extract_templates_uses_canonical_package_layout ... FAILED
25.62 s
>
25.62 s
> failures:
25.62 s
>
25.62 s
> failures:
25.62 s
> templates::tests::extract_templates_uses_canonical_package_layout
25.62 s
>
25.62 s
> test result: FAILED. 0 passed; 1 failed; 0 ignored; 0 measured; 338 filtered out; finished in 0.02s
25.62 s
>
25.62 s
> stderr ---
25.62 s
>
25.62 s
> thread 'templates::tests::extract_templates_uses_canonical_package_layout' (866) panicked at crates/gammaloop-api/src/templates.rs:99:9:
25.62 s
> assertion failed: figure.contains("amplitude-mode")
25.62 s
> stack backtrace:
25.62 s
> 0: __rustc::rust_begin_unwind
25.62 s
> 1: core::panicking::panic_fmt
25.62 s
> 2: core::panicking::panic
25.62 s
> 3: gammaloop_api::templates::tests::extract_templates_uses_canonical_package_layout
25.62 s
> 4: <gammaloop_api::templates::tests::extract_templates_uses_canonical_package_layout::{closure#0} as core::ops::function::FnOnce<()>>::call_once
25.62 s
> note: Some details are omitted, run with `RUST_BACKTRACE=full` for a verbose backtrace.
25.62 s
>
25.62 s
> ------------
25.62 s
> Summary [ 0.616s] 339 tests run: 337 passed , 2 failed , 0 skipped
25.62 s
> FAIL [ 0.021s] (246/339) gammaloop-api repl::tests :: completion_shows_type_hint_for_non_boolean_settings_leaf
25.62 s
> stdout ---
25.62 s
>
25.62 s
> running 1 test
25.62 s
> test repl::tests::completion_shows_type_hint_for_non_boolean_settings_leaf ... FAILED
25.62 s
>
25.62 s
> failures:
25.62 s
>
25.62 s
> failures:
25.62 s
> repl::tests::completion_shows_type_hint_for_non_boolean_settings_leaf
25.62 s
>
25.62 s
> test result: FAILED. 0 passed; 1 failed; 0 ignored; 0 measured; 338 filtered out; finished in 0.01s
25.62 s
>
25.62 s
> stderr ---
25.62 s
>
25.62 s
> thread 'repl::tests::completion_shows_type_hint_for_non_boolean_settings_leaf' (772) panicked at crates/gammaloop-api/src/repl.rs:5778:9:
25.62 s
> [Suggestion { value: "", description: Some("Number of samples in the first Monte Carlo iteration."), style: None, extra: None, span: Span { start: 42, end: 42 }, append_whitespace: false }]
25.62 s
> stack backtrace:
25.62 s
> 0: __rustc::rust_begin_unwind
25.62 s
> 1: core::panicking::panic_fmt
25.62 s
> 2: gammaloop_api::repl::tests::completion_shows_type_hint_for_non_boolean_settings_leaf
25.62 s
> 3: <gammaloop_api::repl::tests::completion_shows_type_hint_for_non_boolean_settings_leaf::{closure#0} as core::ops::function::FnOnce<()>>::call_once
25.62 s
> note: Some details are omitted, run with `RUST_BACKTRACE=full` for a verbose backtrace.
25.62 s
>
25.62 s
> FAIL [ 0.026s] (275/339) gammaloop-api templates::tests :: extract_templates_uses_canonical_package_layout
25.62 s
> stdout ---
25.62 s
>
25.62 s
> running 1 test
25.62 s
> test templates::tests::extract_templates_uses_canonical_package_layout ... FAILED
25.62 s
>
25.62 s
> failures:
25.62 s
>
25.62 s
> failures:
25.62 s
> templates::tests::extract_templates_uses_canonical_package_layout
25.62 s
>
25.62 s
> test result: FAILED. 0 passed; 1 failed; 0 ignored; 0 measured; 338 filtered out; finished in 0.02s
25.62 s
>
25.62 s
> stderr ---
25.62 s
>
25.62 s
> thread 'templates::tests::extract_templates_uses_canonical_package_layout' (866) panicked at crates/gammaloop-api/src/templates.rs:99:9:
25.62 s
> assertion failed: figure.contains("amplitude-mode")
25.62 s
> stack backtrace:
25.62 s
> 0: __rustc::rust_begin_unwind
25.62 s
> 1: core::panicking::panic_fmt
25.62 s
> 2: core::panicking::panic
25.62 s
> 3: gammaloop_api::templates::tests::extract_templates_uses_canonical_package_layout
25.62 s
> 4: <gammaloop_api::templates::tests::extract_templates_uses_canonical_package_layout::{closure#0} as core::ops::function::FnOnce<()>>::call_once
25.62 s
> note: Some details are omitted, run with `RUST_BACKTRACE=full` for a verbose backtrace.
25.62 s
>
25.62 s
> error : test run failed
25.62 s
>
25.62 s
> ========== nextest test summary ==========
25.62 s
> report: target/nextest/ci_gammaloop/junit.xml
25.62 s
> tests: 339, failures: 2, errors: 0
25.62 s
>
25.62 s
> 1. gammaloop-api::repl::tests::completion_shows_type_hint_for_non_boolean_settings_leaf
25.62 s
> failure: test failure with exit code 101
25.62 s
> thread 'repl::tests::completion_shows_type_hint_for_non_boolean_settings_leaf' (772) panicked at crates/gammaloop-api/src/repl.rs:5778:9:
25.62 s
> [Suggestion { value: "", description: Some("Number of samples in the first Monte Carlo iteration."), style: None, extra: None, span: Span { start: 42, end: 42 }, append_whitespace: false }]
25.62 s
> stack backtrace:
25.62 s
> 0: __rustc::rust_begin_unwind
25.62 s
> 1: core::panicking::panic_fmt
25.62 s
> 2: gammaloop_api::repl::tests::completion_shows_type_hint_for_non_boolean_settings_leaf
25.62 s
> 3: <gammaloop_api::repl::tests::completion_shows_type_hint_for_non_boolean_settings_leaf::{closure#0} as core::ops::function::FnOnce<()>>::call_once
25.62 s
> note: Some details are omitted, run with `RUST_BACKTRACE=full` for a verbose backtrace.
25.62 s
> system-out
25.62 s
> running 1 test
25.62 s
> test repl::tests::completion_shows_type_hint_for_non_boolean_settings_leaf ... FAILED
25.62 s
>
25.62 s
> failures:
25.62 s
>
25.62 s
> failures:
25.62 s
> repl::tests::completion_shows_type_hint_for_non_boolean_settings_leaf
25.62 s
>
25.62 s
> test result: FAILED. 0 passed; 1 failed; 0 ignored; 0 measured; 338 filtered out; finished in 0.01s
25.62 s
> system-err
25.62 s
> thread 'repl::tests::completion_shows_type_hint_for_non_boolean_settings_leaf' (772) panicked at crates/gammaloop-api/src/repl.rs:5778:9:
25.62 s
> [Suggestion { value: "", description: Some("Number of samples in the first Monte Carlo iteration."), style: None, extra: None, span: Span { start: 42, end: 42 }, append_whitespace: false }]
25.62 s
> stack backtrace:
25.62 s
> 0: __rustc::rust_begin_unwind
25.62 s
> 1: core::panicking::panic_fmt
25.62 s
> 2: gammaloop_api::repl::tests::completion_shows_type_hint_for_non_boolean_settings_leaf
25.62 s
> 3: <gammaloop_api::repl::tests::completion_shows_type_hint_for_non_boolean_settings_leaf::{closure#0} as core::ops::function::FnOnce<()>>::call_once
25.62 s
> note: Some details are omitted, run with `RUST_BACKTRACE=full` for a verbose backtrace.
25.62 s
>
25.62 s
> 2. gammaloop-api::templates::tests::extract_templates_uses_canonical_package_layout
25.62 s
> failure: test failure with exit code 101
25.62 s
> thread 'templates::tests::extract_templates_uses_canonical_package_layout' (866) panicked at crates/gammaloop-api/src/templates.rs:99:9:
25.62 s
> assertion failed: figure.contains("amplitude-mode")
25.62 s
> stack backtrace:
25.62 s
> 0: __rustc::rust_begin_unwind
25.62 s
> 1: core::panicking::panic_fmt
25.62 s
> 2: core::panicking::panic
25.62 s
> 3: gammaloop_api::templates::tests::extract_templates_uses_canonical_package_layout
25.62 s
> 4: <gammaloop_api::templates::tests::extract_templates_uses_canonical_package_layout::{closure#0} as core::ops::function::FnOnce<()>>::call_once
25.62 s
> note: Some details are omitted, run with `RUST_BACKTRACE=full` for a verbose backtrace.
25.62 s
> system-out
25.62 s
> running 1 test
25.62 s
> test templates::tests::extract_templates_uses_canonical_package_layout ... FAILED
25.62 s
>
25.62 s
> failures:
25.62 s
>
25.62 s
> failures:
25.62 s
> templates::tests::extract_templates_uses_canonical_package_layout
25.62 s
>
25.62 s
> test result: FAILED. 0 passed; 1 failed; 0 ignored; 0 measured; 338 filtered out; finished in 0.02s
25.62 s
> system-err
25.62 s
> thread 'templates::tests::extract_templates_uses_canonical_package_layout' (866) panicked at crates/gammaloop-api/src/templates.rs:99:9:
25.62 s
> assertion failed: figure.contains("amplitude-mode")
25.62 s
> stack backtrace:
25.62 s
> 0: __rustc::rust_begin_unwind
25.62 s
> 1: core::panicking::panic_fmt
25.62 s
> 2: core::panicking::panic
25.62 s
> 3: gammaloop_api::templates::tests::extract_templates_uses_canonical_package_layout
25.62 s
> 4: <gammaloop_api::templates::tests::extract_templates_uses_canonical_package_layout::{closure#0} as core::ops::function::FnOnce<()>>::call_once
25.62 s
> note: Some details are omitted, run with `RUST_BACKTRACE=full` for a verbose backtrace.
25.62 s
> =========================================
25.62 s
> Extracting 1 binary and 1 linked path to /build/nextest-archive-2I0li2
25.62 s
> Extracted 7 files to /build/nextest-archive-2I0li2 in 0.08s
25.62 s
> ------------
25.62 s
> Nextest run ID bb1fa411-686d-467f-bc45-1edf589e7f10 with nextest profile: ci_gammaloop
25.62 s
> Starting 19 tests across 1 binary
25.62 s
> ------------
25.62 s
> Summary [ 0.014s] 19 tests run: 19 passed , 0 skipped
25.62 s
>
25.62 s
> ========== nextest test summary ==========
25.62 s
> report: target/nextest/ci_gammaloop/junit.xml
25.62 s
> tests: 19, failures: 0, errors: 0
25.62 s
> No failing testcases found.
25.62 s
> =========================================
25.62 s
> Extracting 1 binary to /build/nextest-archive-A3h96q
25.62 s
> Extracted 4 files to /build/nextest-archive-A3h96q in 0.03s
25.62 s
> ------------
25.62 s
> Nextest run ID 34ca2ab5-363d-458b-a8e3-406e68f323b4 with nextest profile: ci_gammaloop
25.62 s
> Starting 0 tests across 1 binary
25.62 s
> ------------
25.62 s
> Summary [ 0.000s] 0 tests run: 0 passed , 0 skipped
25.62 s
>
25.62 s
> ========== nextest test summary ==========
25.62 s
> report: target/nextest/ci_gammaloop/junit.xml
25.62 s
> tests: 0, failures: 0, errors: 0
25.62 s
> No failing testcases found.
25.62 s
> =========================================
25.62 s
> Extracting 4 binaries, 1 build script output directory, and 2 linked paths to /build/nextest-archive-MDu9aG
25.62 s
> Extracted 18 files to /build/nextest-archive-MDu9aG in 0.47s
25.62 s
> ------------
25.62 s
> Nextest run ID 7dd86df6-9b93-4cef-8dae-9c33b82892e6 with nextest profile: ci_gammaloop
25.62 s
> Starting 456 tests across 4 binaries (61 tests skipped , including 60 tests via profile.ci_gammaloop.default-filter )
25.62 s
> FAIL [ 0.253s] (159/456) gammalooprs graph::parse::tests :: parse_lmbsetting_crossection
25.62 s
> stdout ---
25.62 s
>
25.62 s
> running 1 test
25.62 s
> ━━━━━━━━━━━━━━━━━━━━━━━━━━━━━━━ Snapshot Summary ━━━━━━━━━━━━━━━━━━━━━━━━━━━━━━━
25.62 s
> Snapshot: parse_lmbsetting_crossection
25.62 s
> Source: crates/gammalooprs/src/graph/parse/tests.rs:252
25.62 s
> ────────────────────────────────────────────────────────────────────────────────
25.62 s
> Expression: g.debug_dot()
25.62 s
> ────────────────────────────────────────────────────────────────────────────────
25.62 s
> -old snapshot
25.62 s
> +new results
25.62 s
> ────────────┬───────────────────────────────────────────────────────────────────
25.62 s
> 1 │-digraph G{
25.62 s
> 1 │+digraph G {
25.62 s
> 2 2 │ num = "1/2";
25.62 s
> 3 3 │ overall_factor = "2*x";
25.62 s
> 4 4 │ overall_factor_evaluated = "2*x";
25.62 s
> 5 5 │ projector = "spenso::t";
25.62 s
> ────────────┴───────────────────────────────────────────────────────────────────
25.62 s
> To update snapshots run `cargo insta review`
25.62 s
> Stopped on the first failure. Run `cargo insta test` to run all snapshots.
25.62 s
> test graph::parse::tests::parse_lmbsetting_crossection ... FAILED
25.62 s
>
25.62 s
> failures:
25.62 s
>
25.62 s
> failures:
25.62 s
> graph::parse::tests::parse_lmbsetting_crossection
25.62 s
>
25.62 s
> test result: FAILED. 0 passed; 1 failed; 0 ignored; 0 measured; 508 filtered out; finished in 0.24s
25.62 s
>
25.62 s
> stderr ---
25.62 s
> [07:32:39.507] @gammalooprs::graph::attribute_warnings WARNING : Unknown node attribute 'color_num' on graph 'G', node 'A'; did you mean 'num'?
25.62 s
> at crates/gammalooprs/src/graph/attribute_warnings.rs:198
25.62 s
> The application panicked (crashed).
25.62 s
> Message: snapshot assertion for 'parse_lmbsetting_crossection' failed in line 252
25.62 s
> Location: /nix/store/xdy1vvhll2bijdplvl9fcc2b9plkxhaa-vendor-cargo-deps/c19b7c6f923b580ac259164a89f2577984ad5ab09ee9d583b888f934adbbe8d0/insta-1.47.2/src/runtime.rs :719
25.62 s
>
25.62 s
> ━━━━━━━━━━━━━━━━━━━━━━━━━━━━━━━━━━ BACKTRACE ━━━━━━━━━━━━━━━━━━━━━━━━━━━━━━━━━━━
25.62 s
> 1: <color_eyre[b0c9e66060e883b2]::config::PanicHook>::panic_report <unknown>
25.62 s
> at <unknown source file> :<unknown line>
25.62 s
> 2: <color_eyre[b0c9e66060e883b2]::config::PanicHook>::into_panic_hook::{closure#0} <unknown>
25.62 s
> at <unknown source file> :<unknown line>
25.62 s
> 3: std[bcb96dfbba0ab899]::panicking::panic_with_hook <unknown>
25.62 s
> at <unknown source file> :<unknown line>
25.62 s
> 4: std[bcb96dfbba0ab899]::panicking::panic_handler::{closure#0} <unknown>
25.62 s
> at <unknown source file> :<unknown line>
25.62 s
> 5: std[bcb96dfbba0ab899]::sys::backtrace::__rust_end_short_backtrace::<std[bcb96dfbba0ab899]::panicking::panic_handler::{closure#0}, !> <unknown>
25.62 s
> at <unknown source file> :<unknown line>
25.62 s
> 6: __rustc[6c289b9f9c454d21]::rust_begin_unwind <unknown>
25.62 s
> at <unknown source file> :<unknown line>
25.62 s
> 7: core[940e698046960fd5]::panicking::panic_fmt <unknown>
25.62 s
> at <unknown source file> :<unknown line>
25.62 s
> 8: insta[307a548ac79ef4d9]::runtime::assert_snapshot <unknown>
25.62 s
> at <unknown source file> :<unknown line>
25.62 s
> 9: gammalooprs[5490727360442cce]::graph::parse::tests::parse_lmbsetting_crossection <unknown>
25.62 s
> at <unknown source file> :<unknown line>
25.62 s
> 10: <gammalooprs[5490727360442cce]::graph::parse::tests::parse_lmbsetting_crossection::{closure#0} as core[940e698046960fd5]::ops::function::FnOnce<()>>::call_once <unknown>
25.62 s
> at <unknown source file> :<unknown line>
25.62 s
> 11: test[75d6903177b1d7e9]::__rust_begin_short_backtrace::<core[940e698046960fd5]::result::Result<(), alloc[2ea6bcb46fca0c42]::string::String>, fn() -> core[940e698046960fd5]::result::Result<(), alloc[2ea6bcb46fca0c42]::string::String>> <unknown>
25.62 s
> at <unknown source file> :<unknown line>
25.62 s
> 12: test[75d6903177b1d7e9]::run_test::{closure#0} <unknown>
25.62 s
> at <unknown source file> :<unknown line>
25.62 s
> 13: std[bcb96dfbba0ab899]::sys::backtrace::__rust_begin_short_backtrace::<test[75d6903177b1d7e9]::run_test::{closure#1}, ()> <unknown>
25.62 s
> at <unknown source file> :<unknown line>
25.62 s
> 14: <std[bcb96dfbba0ab899]::thread::lifecycle::spawn_unchecked<test[75d6903177b1d7e9]::run_test::{closure#1}, ()>::{closure#1} as core[940e698046960fd5]::ops::function::FnOnce<()>>::call_once::{shim:vtable#0} <unknown>
25.62 s
> at <unknown source file> :<unknown line>
25.62 s
> 15: <std[bcb96dfbba0ab899]::sys::thread::unix::Thread>::new::thread_start <unknown>
25.62 s
> at <unknown source file> :<unknown line>
25.62 s
> 16: start_thread <unknown>
25.62 s
> at <unknown source file> :<unknown line>
25.62 s
> 17: __clone3 <unknown>
25.62 s
> at <unknown source file> :<unknown line>
25.62 s
>
25.62 s
> Run with COLORBT_SHOW_HIDDEN=1 environment variable to disable frame filtering.
25.62 s
> Run with RUST_BACKTRACE=full to include source snippets.
25.62 s
>
25.62 s
> FAIL [ 0.093s] (407/456) gammalooprs uv::export::tests :: computed_node_full_numerator_is_a_spenso_aware_typst_fragment
25.62 s
> stdout ---
25.62 s
>
25.62 s
> running 1 test
25.62 s
> test uv::export::tests::computed_node_full_numerator_is_a_spenso_aware_typst_fragment ... FAILED
25.62 s
>
25.62 s
> failures:
25.62 s
>
25.62 s
> failures:
25.62 s
> uv::export::tests::computed_node_full_numerator_is_a_spenso_aware_typst_fragment
25.62 s
>
25.62 s
> test result: FAILED. 0 passed; 1 failed; 0 ignored; 0 measured; 508 filtered out; finished in 0.08s
25.62 s
>
25.62 s
> stderr ---
25.62 s
> The application panicked (crashed).
25.62 s
> Message: assertion failed: exported.dot.contains(r#"full_num = "op(\"Tr\")(1)";"#)
25.62 s
> Location: crates/gammalooprs/src/uv/export.rs :483
25.62 s
>
25.62 s
> ━━━━━━━━━━━━━━━━━━━━━━━━━━━━━━━━━━ BACKTRACE ━━━━━━━━━━━━━━━━━━━━━━━━━━━━━━━━━━━
25.62 s
> 1: <color_eyre[b0c9e66060e883b2]::config::PanicHook>::panic_report <unknown>
25.62 s
> at <unknown source file> :<unknown line>
25.62 s
> 2: <color_eyre[b0c9e66060e883b2]::config::PanicHook>::into_panic_hook::{closure#0} <unknown>
25.62 s
> at <unknown source file> :<unknown line>
25.62 s
> 3: std[bcb96dfbba0ab899]::panicking::panic_with_hook <unknown>
25.62 s
> at <unknown source file> :<unknown line>
25.62 s
> 4: std[bcb96dfbba0ab899]::panicking::panic_handler::{closure#0} <unknown>
25.62 s
> at <unknown source file> :<unknown line>
25.62 s
> 5: std[bcb96dfbba0ab899]::sys::backtrace::__rust_end_short_backtrace::<std[bcb96dfbba0ab899]::panicking::panic_handler::{closure#0}, !> <unknown>
25.62 s
> at <unknown source file> :<unknown line>
25.62 s
> 6: __rustc[6c289b9f9c454d21]::rust_begin_unwind <unknown>
25.62 s
> at <unknown source file> :<unknown line>
25.62 s
> 7: core[940e698046960fd5]::panicking::panic_fmt <unknown>
25.62 s
> at <unknown source file> :<unknown line>
25.62 s
> 8: core[940e698046960fd5]::panicking::panic <unknown>
25.62 s
> at <unknown source file> :<unknown line>
25.62 s
> 9: gammalooprs[5490727360442cce]::uv::export::tests::computed_node_full_numerator_is_a_spenso_aware_typst_fragment <unknown>
25.62 s
> at <unknown source file> :<unknown line>
25.62 s
> 10: <gammalooprs[5490727360442cce]::uv::export::tests::computed_node_full_numerator_is_a_spenso_aware_typst_fragment::{closure#0} as core[940e698046960fd5]::ops::function::FnOnce<()>>::call_once <unknown>
25.62 s
> at <unknown source file> :<unknown line>
25.62 s
> 11: test[75d6903177b1d7e9]::__rust_begin_short_backtrace::<core[940e698046960fd5]::result::Result<(), alloc[2ea6bcb46fca0c42]::string::String>, fn() -> core[940e698046960fd5]::result::Result<(), alloc[2ea6bcb46fca0c42]::string::String>> <unknown>
25.62 s
> at <unknown source file> :<unknown line>
25.62 s
> 12: test[75d6903177b1d7e9]::run_test::{closure#0} <unknown>
25.62 s
> at <unknown source file> :<unknown line>
25.62 s
> 13: std[bcb96dfbba0ab899]::sys::backtrace::__rust_begin_short_backtrace::<test[75d6903177b1d7e9]::run_test::{closure#1}, ()> <unknown>
25.62 s
> at <unknown source file> :<unknown line>
25.62 s
> 14: <std[bcb96dfbba0ab899]::thread::lifecycle::spawn_unchecked<test[75d6903177b1d7e9]::run_test::{closure#1}, ()>::{closure#1} as core[940e698046960fd5]::ops::function::FnOnce<()>>::call_once::{shim:vtable#0} <unknown>
25.62 s
> at <unknown source file> :<unknown line>
25.62 s
> 15: <std[bcb96dfbba0ab899]::sys::thread::unix::Thread>::new::thread_start <unknown>
25.62 s
> at <unknown source file> :<unknown line>
25.62 s
> 16: start_thread <unknown>
25.62 s
> at <unknown source file> :<unknown line>
25.62 s
> 17: __clone3 <unknown>
25.62 s
> at <unknown source file> :<unknown line>
25.62 s
>
25.62 s
> Run with COLORBT_SHOW_HIDDEN=1 environment variable to disable frame filtering.
25.62 s
> Run with RUST_BACKTRACE=full to include source snippets.
25.62 s
>
25.62 s
> ------------
25.62 s
> Summary [ 8.606s] 456 tests run: 454 passed , 2 failed , 61 skipped
25.62 s
> FAIL [ 0.253s] (159/456) gammalooprs graph::parse::tests :: parse_lmbsetting_crossection
25.62 s
> stdout ---
25.62 s
>
25.62 s
> running 1 test
25.62 s
> ━━━━━━━━━━━━━━━━━━━━━━━━━━━━━━━ Snapshot Summary ━━━━━━━━━━━━━━━━━━━━━━━━━━━━━━━
25.62 s
> Snapshot: parse_lmbsetting_crossection
25.62 s
> Source: crates/gammalooprs/src/graph/parse/tests.rs:252
25.62 s
> ────────────────────────────────────────────────────────────────────────────────
25.62 s
> Expression: g.debug_dot()
25.62 s
> ────────────────────────────────────────────────────────────────────────────────
25.62 s
> -old snapshot
25.62 s
> +new results
25.62 s
> ────────────┬───────────────────────────────────────────────────────────────────
25.62 s
> 1 │-digraph G{
25.62 s
> 1 │+digraph G {
25.62 s
> 2 2 │ num = "1/2";
25.62 s
> 3 3 │ overall_factor = "2*x";
25.62 s
> 4 4 │ overall_factor_evaluated = "2*x";
25.62 s
> 5 5 │ projector = "spenso::t";
25.62 s
> ────────────┴───────────────────────────────────────────────────────────────────
25.62 s
> To update snapshots run `cargo insta review`
25.62 s
> Stopped on the first failure. Run `cargo insta test` to run all snapshots.
25.62 s
> test graph::parse::tests::parse_lmbsetting_crossection ... FAILED
25.62 s
>
25.62 s
> failures:
25.62 s
>
25.62 s
> failures:
25.62 s
> graph::parse::tests::parse_lmbsetting_crossection
25.62 s
>
25.62 s
> test result: FAILED. 0 passed; 1 failed; 0 ignored; 0 measured; 508 filtered out; finished in 0.24s
25.62 s
>
25.62 s
> stderr ---
25.62 s
> [07:32:39.507] @gammalooprs::graph::attribute_warnings WARNING : Unknown node attribute 'color_num' on graph 'G', node 'A'; did you mean 'num'?
25.62 s
> at crates/gammalooprs/src/graph/attribute_warnings.rs:198
25.62 s
> The application panicked (crashed).
25.62 s
> Message: snapshot assertion for 'parse_lmbsetting_crossection' failed in line 252
25.62 s
> Location: /nix/store/xdy1vvhll2bijdplvl9fcc2b9plkxhaa-vendor-cargo-deps/c19b7c6f923b580ac259164a89f2577984ad5ab09ee9d583b888f934adbbe8d0/insta-1.47.2/src/runtime.rs :719
25.62 s
>
25.62 s
> ━━━━━━━━━━━━━━━━━━━━━━━━━━━━━━━━━━ BACKTRACE ━━━━━━━━━━━━━━━━━━━━━━━━━━━━━━━━━━━
25.62 s
> 1: <color_eyre[b0c9e66060e883b2]::config::PanicHook>::panic_report <unknown>
25.62 s
> at <unknown source file> :<unknown line>
25.62 s
> 2: <color_eyre[b0c9e66060e883b2]::config::PanicHook>::into_panic_hook::{closure#0} <unknown>
25.62 s
> at <unknown source file> :<unknown line>
25.62 s
> 3: std[bcb96dfbba0ab899]::panicking::panic_with_hook <unknown>
25.62 s
> at <unknown source file> :<unknown line>
25.62 s
> 4: std[bcb96dfbba0ab899]::panicking::panic_handler::{closure#0} <unknown>
25.62 s
> at <unknown source file> :<unknown line>
25.62 s
> 5: std[bcb96dfbba0ab899]::sys::backtrace::__rust_end_short_backtrace::<std[bcb96dfbba0ab899]::panicking::panic_handler::{closure#0}, !> <unknown>
25.62 s
> at <unknown source file> :<unknown line>
25.62 s
> 6: __rustc[6c289b9f9c454d21]::rust_begin_unwind <unknown>
25.62 s
> at <unknown source file> :<unknown line>
25.62 s
> 7: core[940e698046960fd5]::panicking::panic_fmt <unknown>
25.62 s
> at <unknown source file> :<unknown line>
25.62 s
> 8: insta[307a548ac79ef4d9]::runtime::assert_snapshot <unknown>
25.62 s
> at <unknown source file> :<unknown line>
25.62 s
> 9: gammalooprs[5490727360442cce]::graph::parse::tests::parse_lmbsetting_crossection <unknown>
25.62 s
> at <unknown source file> :<unknown line>
25.62 s
> 10: <gammalooprs[5490727360442cce]::graph::parse::tests::parse_lmbsetting_crossection::{closure#0} as core[940e698046960fd5]::ops::function::FnOnce<()>>::call_once <unknown>
25.62 s
> at <unknown source file> :<unknown line>
25.62 s
> 11: test[75d6903177b1d7e9]::__rust_begin_short_backtrace::<core[940e698046960fd5]::result::Result<(), alloc[2ea6bcb46fca0c42]::string::String>, fn() -> core[940e698046960fd5]::result::Result<(), alloc[2ea6bcb46fca0c42]::string::String>> <unknown>
25.62 s
> at <unknown source file> :<unknown line>
25.62 s
> 12: test[75d6903177b1d7e9]::run_test::{closure#0} <unknown>
25.62 s
> at <unknown source file> :<unknown line>
25.62 s
> 13: std[bcb96dfbba0ab899]::sys::backtrace::__rust_begin_short_backtrace::<test[75d6903177b1d7e9]::run_test::{closure#1}, ()> <unknown>
25.62 s
> at <unknown source file> :<unknown line>
25.62 s
> 14: <std[bcb96dfbba0ab899]::thread::lifecycle::spawn_unchecked<test[75d6903177b1d7e9]::run_test::{closure#1}, ()>::{closure#1} as core[940e698046960fd5]::ops::function::FnOnce<()>>::call_once::{shim:vtable#0} <unknown>
25.62 s
> at <unknown source file> :<unknown line>
25.62 s
> 15: <std[bcb96dfbba0ab899]::sys::thread::unix::Thread>::new::thread_start <unknown>
25.62 s
> at <unknown source file> :<unknown line>
25.62 s
> 16: start_thread <unknown>
25.62 s
> at <unknown source file> :<unknown line>
25.62 s
> 17: __clone3 <unknown>
25.62 s
> at <unknown source file> :<unknown line>
25.62 s
>
25.62 s
> Run with COLORBT_SHOW_HIDDEN=1 environment variable to disable frame filtering.
25.62 s
> Run with RUST_BACKTRACE=full to include source snippets.
25.62 s
>
25.62 s
> FAIL [ 0.093s] (407/456) gammalooprs uv::export::tests :: computed_node_full_numerator_is_a_spenso_aware_typst_fragment
25.62 s
> stdout ---
25.62 s
>
25.62 s
> running 1 test
25.62 s
> test uv::export::tests::computed_node_full_numerator_is_a_spenso_aware_typst_fragment ... FAILED
25.62 s
>
25.62 s
> failures:
25.62 s
>
25.62 s
> failures:
25.62 s
> uv::export::tests::computed_node_full_numerator_is_a_spenso_aware_typst_fragment
25.62 s
>
25.62 s
> test result: FAILED. 0 passed; 1 failed; 0 ignored; 0 measured; 508 filtered out; finished in 0.08s
25.62 s
>
25.62 s
> stderr ---
25.62 s
> The application panicked (crashed).
25.62 s
> Message: assertion failed: exported.dot.contains(r#"full_num = "op(\"Tr\")(1)";"#)
25.62 s
> Location: crates/gammalooprs/src/uv/export.rs :483
25.62 s
>
25.62 s
> ━━━━━━━━━━━━━━━━━━━━━━━━━━━━━━━━━━ BACKTRACE ━━━━━━━━━━━━━━━━━━━━━━━━━━━━━━━━━━━
25.62 s
> 1: <color_eyre[b0c9e66060e883b2]::config::PanicHook>::panic_report <unknown>
25.62 s
> at <unknown source file> :<unknown line>
25.62 s
> 2: <color_eyre[b0c9e66060e883b2]::config::PanicHook>::into_panic_hook::{closure#0} <unknown>
25.62 s
> at <unknown source file> :<unknown line>
25.62 s
> 3: std[bcb96dfbba0ab899]::panicking::panic_with_hook <unknown>
25.62 s
> at <unknown source file> :<unknown line>
25.62 s
> 4: std[bcb96dfbba0ab899]::panicking::panic_handler::{closure#0} <unknown>
25.62 s
> at <unknown source file> :<unknown line>
25.62 s
> 5: std[bcb96dfbba0ab899]::sys::backtrace::__rust_end_short_backtrace::<std[bcb96dfbba0ab899]::panicking::panic_handler::{closure#0}, !> <unknown>
25.62 s
> at <unknown source file> :<unknown line>
25.62 s
> 6: __rustc[6c289b9f9c454d21]::rust_begin_unwind <unknown>
25.62 s
> at <unknown source file> :<unknown line>
25.62 s
> 7: core[940e698046960fd5]::panicking::panic_fmt <unknown>
25.62 s
> at <unknown source file> :<unknown line>
25.62 s
> 8: core[940e698046960fd5]::panicking::panic <unknown>
25.62 s
> at <unknown source file> :<unknown line>
25.62 s
> 9: gammalooprs[5490727360442cce]::uv::export::tests::computed_node_full_numerator_is_a_spenso_aware_typst_fragment <unknown>
25.62 s
> at <unknown source file> :<unknown line>
25.62 s
> 10: <gammalooprs[5490727360442cce]::uv::export::tests::computed_node_full_numerator_is_a_spenso_aware_typst_fragment::{closure#0} as core[940e698046960fd5]::ops::function::FnOnce<()>>::call_once <unknown>
25.62 s
> at <unknown source file> :<unknown line>
25.62 s
> 11: test[75d6903177b1d7e9]::__rust_begin_short_backtrace::<core[940e698046960fd5]::result::Result<(), alloc[2ea6bcb46fca0c42]::string::String>, fn() -> core[940e698046960fd5]::result::Result<(), alloc[2ea6bcb46fca0c42]::string::String>> <unknown>
25.62 s
> at <unknown source file> :<unknown line>
25.62 s
> 12: test[75d6903177b1d7e9]::run_test::{closure#0} <unknown>
25.62 s
> at <unknown source file> :<unknown line>
25.62 s
> 13: std[bcb96dfbba0ab899]::sys::backtrace::__rust_begin_short_backtrace::<test[75d6903177b1d7e9]::run_test::{closure#1}, ()> <unknown>
25.62 s
> at <unknown source file> :<unknown line>
25.62 s
> 14: <std[bcb96dfbba0ab899]::thread::lifecycle::spawn_unchecked<test[75d6903177b1d7e9]::run_test::{closure#1}, ()>::{closure#1} as core[940e698046960fd5]::ops::function::FnOnce<()>>::call_once::{shim:vtable#0} <unknown>
25.62 s
> at <unknown source file> :<unknown line>
25.62 s
> 15: <std[bcb96dfbba0ab899]::sys::thread::unix::Thread>::new::thread_start <unknown>
25.62 s
> at <unknown source file> :<unknown line>
25.62 s
> 16: start_thread <unknown>
25.62 s
> at <unknown source file> :<unknown line>
25.62 s
> 17: __clone3 <unknown>
25.62 s
> at <unknown source file> :<unknown line>
25.62 s
>
25.62 s
> Run with COLORBT_SHOW_HIDDEN=1 environment variable to disable frame filtering.
25.62 s
> Run with RUST_BACKTRACE=full to include source snippets.
25.62 s
>
25.62 s
> error : test run failed
25.62 s
>
25.62 s
> ========== nextest test summary ==========
25.62 s
> report: target/nextest/ci_gammaloop/junit.xml
25.62 s
> tests: 456, failures: 2, errors: 0
25.62 s
>
25.62 s
> 1. gammalooprs::graph::parse::tests::parse_lmbsetting_crossection
25.62 s
> failure: test failure with exit code 101
25.62 s
> system-out
25.62 s
> running 1 test
25.62 s
> ━━━━━━━━━━━━━━━━━━━━━━━━━━━━━━━ Snapshot Summary ━━━━━━━━━━━━━━━━━━━━━━━━━━━━━━━
25.62 s
> Snapshot: parse_lmbsetting_crossection
25.62 s
> Source: crates/gammalooprs/src/graph/parse/tests.rs:252
25.62 s
> ────────────────────────────────────────────────────────────────────────────────
25.62 s
> Expression: g.debug_dot()
25.62 s
> ────────────────────────────────────────────────────────────────────────────────
25.62 s
> -old snapshot
25.62 s
> +new results
25.62 s
> ────────────┬───────────────────────────────────────────────────────────────────
25.62 s
> 1 │-digraph G{
25.62 s
> 1 │+digraph G {
25.62 s
> 2 2 │ num = "1/2";
25.62 s
> 3 3 │ overall_factor = "2*x";
25.62 s
> 4 4 │ overall_factor_evaluated = "2*x";
25.62 s
> 5 5 │ projector = "spenso::t";
25.62 s
> ────────────┴───────────────────────────────────────────────────────────────────
25.62 s
> To update snapshots run `cargo insta review`
25.62 s
> Stopped on the first failure. Run `cargo insta test` to run all snapshots.
25.62 s
> test graph::parse::tests::parse_lmbsetting_crossection ... FAILED
25.62 s
>
25.62 s
> failures:
25.62 s
>
25.62 s
> failures:
25.62 s
> graph::parse::tests::parse_lmbsetting_crossection
25.62 s
>
25.62 s
> test result: FAILED. 0 passed; 1 failed; 0 ignored; 0 measured; 508 filtered out; finished in 0.24s
25.62 s
> system-err
25.62 s
> [07:32:39.507] @gammalooprs::graph::attribute_warnings WARNING : Unknown node attribute 'color_num' on graph 'G', node 'A'; did you mean 'num'?
25.62 s
> at crates/gammalooprs/src/graph/attribute_warnings.rs:198
25.62 s
> The application panicked (crashed).
25.62 s
> Message: snapshot assertion for 'parse_lmbsetting_crossection' failed in line 252
25.62 s
> Location: /nix/store/xdy1vvhll2bijdplvl9fcc2b9plkxhaa-vendor-cargo-deps/c19b7c6f923b580ac259164a89f2577984ad5ab09ee9d583b888f934adbbe8d0/insta-1.47.2/src/runtime.rs:719
25.62 s
>
25.62 s
> ━━━━━━━━━━━━━━━━━━━━━━━━━━━━━━━━━━ BACKTRACE ━━━━━━━━━━━━━━━━━━━━━━━━━━━━━━━━━━━
25.62 s
> 1: <color_eyre[b0c9e66060e883b2]::config::PanicHook>::panic_report<unknown>
25.62 s
> at <unknown source file>:<unknown line>
25.62 s
> 2: <color_eyre[b0c9e66060e883b2]::config::PanicHook>::into_panic_hook::{closure#0}<unknown>
25.62 s
> at <unknown source file>:<unknown line>
25.62 s
> 3: std[bcb96dfbba0ab899]::panicking::panic_with_hook<unknown>
25.62 s
> at <unknown source file>:<unknown line>
25.62 s
> 4: std[bcb96dfbba0ab899]::panicking::panic_handler::{closure#0}<unknown>
25.62 s
> at <unknown source file>:<unknown line>
25.62 s
> 5: std[bcb96dfbba0ab899]::sys::backtrace::__rust_end_short_backtrace::<std[bcb96dfbba0ab899]::panicking::panic_handler::{closure#0}, !><unknown>
25.62 s
> at <unknown source file>:<unknown line>
25.62 s
> 6: __rustc[6c289b9f9c454d21]::rust_begin_unwind<unknown>
25.62 s
> at <unknown source file>:<unknown line>
25.62 s
> 7: core[940e698046960fd5]::panicking::panic_fmt<unknown>
25.62 s
> at <unknown source file>:<unknown line>
25.62 s
> 8: insta[307a548ac79ef4d9]::runtime::assert_snapshot<unknown>
25.62 s
> at <unknown source file>:<unknown line>
25.62 s
> 9: gammalooprs[5490727360442cce]::graph::parse::tests::parse_lmbsetting_crossection<unknown>
25.62 s
> at <unknown source file>:<unknown line>
25.62 s
> 10: <gammalooprs[5490727360442cce]::graph::parse::tests::parse_lmbsetting_crossection::{closure#0} as core[940e698046960fd5]::ops::function::FnOnce<()>>::call_once<unknown>
25.62 s
> at <unknown source file>:<unknown line>
25.62 s
> 11: test[75d6903177b1d7e9]::__rust_begin_short_backtrace::<core[940e698046960fd5]::result::Result<(), alloc[2ea6bcb46fca0c42]::string::String>, fn() -> core[940e698046960fd5]::result::Result<(), alloc[2ea6bcb46fca0c42]::string::String>><unknown>
25.62 s
> at <unknown source file>:<unknown line>
25.62 s
> 12: test[75d6903177b1d7e9]::run_test::{closure#0}<unknown>
25.62 s
> at <unknown source file>:<unknown line>
25.62 s
> 13: std[bcb96dfbba0ab899]::sys::backtrace::__rust_begin_short_backtrace::<test[75d6903177b1d7e9]::run_test::{closure#1}, ()><unknown>
25.62 s
> at <unknown source file>:<unknown line>
25.62 s
> 14: <std[bcb96dfbba0ab899]::thread::lifecycle::spawn_unchecked<test[75d6903177b1d7e9]::run_test::{closure#1}, ()>::{closure#1} as core[940e698046960fd5]::ops::function::FnOnce<()>>::call_once::{shim:vtable#0}<unknown>
25.62 s
> at <unknown source file>:<unknown line>
25.62 s
> 15: <std[bcb96dfbba0ab899]::sys::thread::unix::Thread>::new::thread_start<unknown>
25.62 s
> at <unknown source file>:<unknown line>
25.62 s
> 16: start_thread<unknown>
25.62 s
> at <unknown source file>:<unknown line>
25.62 s
> 17: __clone3<unknown>
25.62 s
> at <unknown source file>:<unknown line>
25.62 s
>
25.62 s
> Run with COLORBT_SHOW_HIDDEN=1 environment variable to disable frame filtering.
25.62 s
> Run with RUST_BACKTRACE=full to include source snippets.
25.62 s
>
25.62 s
> 2. gammalooprs::uv::export::tests::computed_node_full_numerator_is_a_spenso_aware_typst_fragment
25.62 s
> failure: test failure with exit code 101
25.62 s
> system-out
25.62 s
> running 1 test
25.62 s
> test uv::export::tests::computed_node_full_numerator_is_a_spenso_aware_typst_fragment ... FAILED
25.62 s
>
25.62 s
> failures:
25.62 s
>
25.62 s
> failures:
25.62 s
> uv::export::tests::computed_node_full_numerator_is_a_spenso_aware_typst_fragment
25.62 s
>
25.62 s
> test result: FAILED. 0 passed; 1 failed; 0 ignored; 0 measured; 508 filtered out; finished in 0.08s
25.62 s
> system-err
25.62 s
> The application panicked (crashed).
25.62 s
> Message: assertion failed: exported.dot.contains(r#"full_num = "op(\"Tr\")(1)";"#)
25.62 s
> Location: crates/gammalooprs/src/uv/export.rs:483
25.62 s
>
25.62 s
> ━━━━━━━━━━━━━━━━━━━━━━━━━━━━━━━━━━ BACKTRACE ━━━━━━━━━━━━━━━━━━━━━━━━━━━━━━━━━━━
25.62 s
> 1: <color_eyre[b0c9e66060e883b2]::config::PanicHook>::panic_report<unknown>
25.62 s
> at <unknown source file>:<unknown line>
25.62 s
> 2: <color_eyre[b0c9e66060e883b2]::config::PanicHook>::into_panic_hook::{closure#0}<unknown>
25.62 s
> at <unknown source file>:<unknown line>
25.62 s
> 3: std[bcb96dfbba0ab899]::panicking::panic_with_hook<unknown>
25.62 s
> at <unknown source file>:<unknown line>
25.62 s
> 4: std[bcb96dfbba0ab899]::panicking::panic_handler::{closure#0}<unknown>
25.62 s
> at <unknown source file>:<unknown line>
25.62 s
> 5: std[bcb96dfbba0ab899]::sys::backtrace::__rust_end_short_backtrace::<std[bcb96dfbba0ab899]::panicking::panic_handler::{closure#0}, !><unknown>
25.62 s
> at <unknown source file>:<unknown line>
25.62 s
> 6: __rustc[6c289b9f9c454d21]::rust_begin_unwind<unknown>
25.62 s
> at <unknown source file>:<unknown line>
25.62 s
> 7: core[940e698046960fd5]::panicking::panic_fmt<unknown>
25.62 s
> at <unknown source file>:<unknown line>
25.62 s
> 8: core[940e698046960fd5]::panicking::panic<unknown>
25.62 s
> at <unknown source file>:<unknown line>
25.62 s
> 9: gammalooprs[5490727360442cce]::uv::export::tests::computed_node_full_numerator_is_a_spenso_aware_typst_fragment<unknown>
25.62 s
> at <unknown source file>:<unknown line>
25.62 s
> 10: <gammalooprs[5490727360442cce]::uv::export::tests::computed_node_full_numerator_is_a_spenso_aware_typst_fragment::{closure#0} as core[940e698046960fd5]::ops::function::FnOnce<()>>::call_once<unknown>
25.62 s
> at <unknown source file>:<unknown line>
25.62 s
> 11: test[75d6903177b1d7e9]::__rust_begin_short_backtrace::<core[940e698046960fd5]::result::Result<(), alloc[2ea6bcb46fca0c42]::string::String>, fn() -> core[940e698046960fd5]::result::Result<(), alloc[2ea6bcb46fca0c42]::string::String>><unknown>
25.62 s
> at <unknown source file>:<unknown line>
25.62 s
> 12: test[75d6903177b1d7e9]::run_test::{closure#0}<unknown>
25.62 s
> at <unknown source file>:<unknown line>
25.62 s
> 13: std[bcb96dfbba0ab899]::sys::backtrace::__rust_begin_short_backtrace::<test[75d6903177b1d7e9]::run_test::{closure#1}, ()><unknown>
25.62 s
> at <unknown source file>:<unknown line>
25.62 s
> 14: <std[bcb96dfbba0ab899]::thread::lifecycle::spawn_unchecked<test[75d6903177b1d7e9]::run_test::{closure#1}, ()>::{closure#1} as core[940e698046960fd5]::ops::function::FnOnce<()>>::call_once::{shim:vtable#0}<unknown>
25.62 s
> at <unknown source file>:<unknown line>
25.62 s
> 15: <std[bcb96dfbba0ab899]::sys::thread::unix::Thread>::new::thread_start<unknown>
25.62 s
> at <unknown source file>:<unknown line>
25.62 s
> 16: start_thread<unknown>
25.62 s
> at <unknown source file>:<unknown line>
25.62 s
> 17: __clone3<unknown>
25.62 s
> at <unknown source file>:<unknown line>
25.62 s
>
25.62 s
> Run with COLORBT_SHOW_HIDDEN=1 environment variable to disable frame filtering.
25.62 s
> Run with RUST_BACKTRACE=full to include source snippets.
25.62 s
> =========================================
25.62 s
For full logs, run:
25.62 s
nix log /nix/store/hm35l98s8jf76hp5gsphwyhqjj06gcak-gammaloop-nextest-core.drv
25.74 s
[0 built (1 failed ), 0.0 Run failed.