test packages.x86_64-linux.nix-ci-check-gammaloop-nextest-core

Reproduce this run
Retry Run
  1. 0.69 s $ /nix/store/9ypz3flqsrl5xl495mm8h645gadjsxi1-coreutils-9.11/bin/timeout --kill-after=15s 7200s /nix/store/23zk8sgzamrbmj1fday15szf7f2279s8-nix-2.34.7/bin/nix --extra-experimental-features nix-command --extra-experimental-features flakes flake clone git+https://github.com/alphal00p/gammaloop --dest /tmp/nix-ci-worker/stable-pwd/repo/
  2. 0.74 s Cloning into '/tmp/nix-ci-worker/stable-pwd/repo'...
  3. 0.88 s remote: Enumerating objects: 62149, done.
  4. 0.99 s remote: Counting objects: 0% (1/7151) remote: Counting objects: 1% (72/7151) remote: Counting objects: 2% (144/7151) remote: Counting objects: 3% (215/7151) remote: Counting objects: 4% (287/7151) remote: Counting objects: 5% (358/7151) remote: Counting objects: 6% (430/7151) remote: Counting objects: 7% (501/7151) remote: Counting objects: 8% (573/7151) remote: Counting objects: 9% (644/7151) remote: Counting objects: 10% (716/7151) remote: Counting objects: 11% (787/7151) remote: Counting objects: 12% (859/7151) remote: Counting objects: 13% (930/7151) remote: Counting objects: 14% (1002/7151) remote: Counting objects: 15% (1073/7151) remote: Counting objects: 16% (1145/7151) remote: Counting objects: 17% (1216/7151) remote: Counting objects: 18% (1288/7151) remote: Counting objects: 19% (1359/7151) remote: Counting objects: 20% (1431/7151) remote: Counting objects: 21% (1502/7151) remote: Counting objects: 22% (1574/7151) remote: Counting objects: 23% (1645/7151) remote: Counting objects: 24% (1717/7151) remote: Counting objects: 25% (1788/7151) remote: Counting objects: 26% (1860/7151) remote: Counting objects: 27% (1931/7151) remote: Counting objects: 28% (2003/7151) remote: Counting objects: 29% (2074/7151) remote: Counting objects: 30% (2146/7151) remote: Counting objects: 31% (2217/7151) remote: Counting objects: 32% (2289/7151) remote: Counting objects: 33% (2360/7151) remote: Counting objects: 34% (2432/7151) remote: Counting objects: 35% (2503/7151) remote: Counting objects: 36% (2575/7151) remote: Counting objects: 37% (2646/7151) remote: Counting objects: 38% (2718/7151) remote: Counting objects: 39% (2789/7151) remote: Counting objects: 40% (2861/7151) remote: Counting objects: 41% (2932/7151) remote: Counting objects: 42% (3004/7151) remote: Counting objects: 43% (3075/7151) remote: Counting objects: 44% (3147/7151) remote: Counting objects: 45% (3218/7151) remote: Counting objects: 46% (3290/7151) remote: Counting objects: 47% (3361/7151) remote: Counting objects: 48% (3433/7151) remote: Counting objects: 49% (3504/7151) remote: Counting objects: 50% (3576/7151) remote: Counting objects: 51% (3648/7151) remote: Counting objects: 52% (3719/7151) remote: Counting objects: 53% (3791/7151) remote: Counting objects: 54% (3862/7151) remote: Counting objects: 55% (3934/7151) remote: Counting objects: 56% (4005/7151) remote: Counting objects: 57% (4077/7151) remote: Counting objects: 58% (4148/7151) remote: Counting objects: 59% (4220/7151) remote: Counting objects: 60% (4291/7151) remote: Counting objects: 61% (4363/7151) remote: Counting objects: 62% (4434/7151) remote: Counting objects: 63% (4506/7151) remote: Counting objects: 64% (4577/7151) remote: Counting objects: 65% (4649/7151) remote: Counting objects: 66% (4720/7151) remote: Counting objects: 67% (4792/7151) remote: Counting objects: 68% (4863/7151) remote: Counting objects: 69% (4935/7151) remote: Counting objects: 70% (5006/7151) remote: Counting objects: 71% (5078/7151) remote: Counting objects: 72% (5149/7151) remote: Counting objects: 73% (5221/7151) remote: Counting objects: 74% (5292/7151) remote: Counting objects: 75% (5364/7151) remote: Counting objects: 76% (5435/7151) remote: Counting objects: 77% (5507/7151) remote: Counting objects: 78% (5578/7151) remote: Counting objects: 79% (5650/7151) remote: Counting objects: 80% (5721/7151) remote: Counting objects: 81% (5793/7151) remote: Counting objects: 82% (5864/7151) remote: Counting objects: 83% (5936/7151) remote: Counting objects: 84% (6007/7151) remote: Counting objects: 85% (6079/7151) remote: Counting objects: 86% (6150/7151) remote: Counting objects: 87% (6222/7151) remote: Counting objects: 88% (6293/7151) remote: Counting objects: 89% (6365/7151) remote: Counting objects: 90% (6436/7151) remote: Counting objects: 91% (6508/7151) remote: Counting objects: 92% (6579/7151) remote: Counting objects: 93% (6651/7151) remote: Counting objects: 94% (6722/7151) remote: Counting objects: 95% (6794/7151) remote: Counting objects: 96% (6865/7151) remote: Counting objects: 97% (6937/7151) remote: Counting objects: 98% (7008/7151) remote: Counting objects: 99% (7080/7151) remote: Counting objects: 100% (7151/7151) remote: Counting objects: 100% (7151/7151), done.
  5. 2.26 s remote: Compressing objects: 0% (1/1380) remote: Compressing objects: 1% (14/1380) remote: Compressing objects: 2% (28/1380) remote: Compressing objects: 3% (42/1380) remote: Compressing objects: 4% (56/1380) remote: Compressing objects: 5% (69/1380) remote: Compressing objects: 6% (83/1380) remote: Compressing objects: 7% (97/1380) remote: Compressing objects: 8% (111/1380) remote: Compressing objects: 9% (125/1380) remote: Compressing objects: 10% (138/1380) remote: Compressing objects: 11% (152/1380) remote: Compressing objects: 12% (166/1380) remote: Compressing objects: 13% (180/1380) remote: Compressing objects: 14% (194/1380) remote: Compressing objects: 15% (207/1380) remote: Compressing objects: 16% (221/1380) remote: Compressing objects: 17% (235/1380) remote: Compressing objects: 17% (247/1380) remote: Compressing objects: 18% (249/1380) remote: Compressing objects: 19% (263/1380) remote: Compressing objects: 20% (276/1380) remote: Compressing objects: 21% (290/1380) remote: Compressing objects: 22% (304/1380) remote: Compressing objects: 23% (318/1380) remote: Compressing objects: 24% (332/1380) remote: Compressing objects: 25% (345/1380) remote: Compressing objects: 26% (359/1380) remote: Compressing objects: 27% (373/1380) remote: Compressing objects: 28% (387/1380) remote: Compressing objects: 29% (401/1380) remote: Compressing objects: 30% (414/1380) remote: Compressing objects: 31% (428/1380) remote: Compressing objects: 32% (442/1380) remote: Compressing objects: 33% (456/1380) remote: Compressing objects: 34% (470/1380) remote: Compressing objects: 35% (483/1380) remote: Compressing objects: 36% (497/1380) remote: Compressing objects: 37% (511/1380) remote: Compressing objects: 38% (525/1380) remote: Compressing objects: 39% (539/1380) remote: Compressing objects: 40% (552/1380) remote: Compressing objects: 41% (566/1380) remote: Compressing objects: 42% (580/1380) remote: Compressing objects: 43% (594/1380) remote: Compressing objects: 44% (608/1380) remote: Compressing objects: 45% (621/1380) remote: Compressing objects: 46% (635/1380) remote: Compressing objects: 47% (649/1380) remote: Compressing objects: 48% (663/1380) remote: Compressing objects: 49% (677/1380) remote: Compressing objects: 50% (690/1380) remote: Compressing objects: 51% (704/1380) remote: Compressing objects: 52% (718/1380) remote: Compressing objects: 53% (732/1380) remote: Compressing objects: 54% (746/1380) remote: Compressing objects: 55% (759/1380) remote: Compressing objects: 56% (773/1380) remote: Compressing objects: 57% (787/1380) remote: Compressing objects: 58% (801/1380) remote: Compressing objects: 59% (815/1380) remote: Compressing objects: 60% (828/1380) remote: Compressing objects: 61% (842/1380) remote: Compressing objects: 62% (856/1380) remote: Compressing objects: 63% (870/1380) remote: Compressing objects: 64% (884/1380) remote: Compressing objects: 65% (897/1380) remote: Compressing objects: 66% (911/1380) remote: Compressing objects: 67% (925/1380) remote: Compressing objects: 68% (939/1380) remote: Compressing objects: 69% (953/1380) remote: Compressing objects: 70% (966/1380) remote: Compressing objects: 71% (980/1380) remote: Compressing objects: 72% (994/1380) remote: Compressing objects: 73% (1008/1380) remote: Compressing objects: 74% (1022/1380) remote: Compressing objects: 75% (1035/1380) remote: Compressing objects: 76% (1049/1380) remote: Compressing objects: 77% (1063/1380) remote: Compressing objects: 78% (1077/1380) remote: Compressing objects: 79% (1091/1380) remote: Compressing objects: 80% (1104/1380) remote: Compressing objects: 81% (1118/1380) remote: Compressing objects: 82% (1132/1380) remote: Compressing objects: 83% (1146/1380) remote: Compressing objects: 84% (1160/1380) remote: Compressing objects: 85% (1173/1380) remote: Compressing objects: 86% (1187/1380) remote: Compressing objects: 87% (1201/1380) remote: Compressing objects: 88% (1215/1380) remote: Compressing objects: 89% (1229/1380) remote: Compressing objects: 90% (1242/1380) remote: Compressing objects: 91% (1256/1380) remote: Compressing objects: 92% (1270/1380) remote: Compressing objects: 93% (1284/1380) remote: Compressing objects: 94% (1298/1380) remote: Compressing objects: 95% (1311/1380) remote: Compressing objects: 96% (1325/1380) remote: Compressing objects: 97% (1339/1380) remote: Compressing objects: 98% (1353/1380) remote: Compressing objects: 99% (1367/1380) remote: Compressing objects: 100% (1380/1380) remote: Compressing objects: 100% (1380/1380), done.
  6. 5.13 s Receiving objects: 0% (1/62149) Receiving objects: 1% (622/62149) Receiving objects: 2% (1243/62149) Receiving objects: 3% (1865/62149) Receiving objects: 4% (2486/62149) Receiving objects: 5% (3108/62149) Receiving objects: 6% (3729/62149) Receiving objects: 7% (4351/62149) Receiving objects: 8% (4972/62149) Receiving objects: 9% (5594/62149) Receiving objects: 10% (6215/62149), 10.79 MiB | 21.55 MiB/s Receiving objects: 11% (6837/62149), 10.79 MiB | 21.55 MiB/s Receiving objects: 12% (7458/62149), 10.79 MiB | 21.55 MiB/s Receiving objects: 13% (8080/62149), 10.79 MiB | 21.55 MiB/s Receiving objects: 14% (8701/62149), 10.79 MiB | 21.55 MiB/s Receiving objects: 15% (9323/62149), 10.79 MiB | 21.55 MiB/s Receiving objects: 16% (9944/62149), 10.79 MiB | 21.55 MiB/s Receiving objects: 17% (10566/62149), 10.79 MiB | 21.55 MiB/s Receiving objects: 18% (11187/62149), 10.79 MiB | 21.55 MiB/s Receiving objects: 19% (11809/62149), 10.79 MiB | 21.55 MiB/s Receiving objects: 20% (12430/62149), 10.79 MiB | 21.55 MiB/s Receiving objects: 21% (13052/62149), 10.79 MiB | 21.55 MiB/s Receiving objects: 22% (13673/62149), 10.79 MiB | 21.55 MiB/s Receiving objects: 23% (14295/62149), 10.79 MiB | 21.55 MiB/s Receiving objects: 24% (14916/62149), 10.79 MiB | 21.55 MiB/s Receiving objects: 25% (15538/62149), 10.79 MiB | 21.55 MiB/s Receiving objects: 26% (16159/62149), 10.79 MiB | 21.55 MiB/s Receiving objects: 27% (16781/62149), 10.79 MiB | 21.55 MiB/s Receiving objects: 28% (17402/62149), 10.79 MiB | 21.55 MiB/s Receiving objects: 29% (18024/62149), 10.79 MiB | 21.55 MiB/s Receiving objects: 30% (18645/62149), 10.79 MiB | 21.55 MiB/s Receiving objects: 31% (19267/62149), 10.79 MiB | 21.55 MiB/s Receiving objects: 32% (19888/62149), 10.79 MiB | 21.55 MiB/s Receiving objects: 33% (20510/62149), 10.79 MiB | 21.55 MiB/s Receiving objects: 34% (21131/62149), 10.79 MiB | 21.55 MiB/s Receiving objects: 35% (21753/62149), 10.79 MiB | 21.55 MiB/s Receiving objects: 36% (22374/62149), 10.79 MiB | 21.55 MiB/s Receiving objects: 37% (22996/62149), 10.79 MiB | 21.55 MiB/s Receiving objects: 38% (23617/62149), 10.79 MiB | 21.55 MiB/s Receiving objects: 39% (24239/62149), 10.79 MiB | 21.55 MiB/s Receiving objects: 40% (24860/62149), 10.79 MiB | 21.55 MiB/s Receiving objects: 41% (25482/62149), 10.79 MiB | 21.55 MiB/s Receiving objects: 42% (26103/62149), 10.79 MiB | 21.55 MiB/s Receiving objects: 43% (26725/62149), 10.79 MiB | 21.55 MiB/s Receiving objects: 44% (27346/62149), 10.79 MiB | 21.55 MiB/s Receiving objects: 45% (27968/62149), 10.79 MiB | 21.55 MiB/s Receiving objects: 46% (28589/62149), 10.79 MiB | 21.55 MiB/s Receiving objects: 47% (29211/62149), 10.79 MiB | 21.55 MiB/s Receiving objects: 48% (29832/62149), 10.79 MiB | 21.55 MiB/s Receiving objects: 49% (30454/62149), 10.79 MiB | 21.55 MiB/s Receiving objects: 50% (31075/62149), 10.79 MiB | 21.55 MiB/s Receiving objects: 51% (31696/62149), 10.79 MiB | 21.55 MiB/s Receiving objects: 52% (32318/62149), 10.79 MiB | 21.55 MiB/s Receiving objects: 52% (32900/62149), 10.79 MiB | 21.55 MiB/s Receiving objects: 53% (32939/62149), 10.79 MiB | 21.55 MiB/s Receiving objects: 54% (33561/62149), 30.14 MiB | 30.13 MiB/s Receiving objects: 55% (34182/62149), 30.14 MiB | 30.13 MiB/s Receiving objects: 56% (34804/62149), 30.14 MiB | 30.13 MiB/s Receiving objects: 57% (35425/62149), 30.14 MiB | 30.13 MiB/s Receiving objects: 58% (36047/62149), 30.14 MiB | 30.13 MiB/s Receiving objects: 59% (36668/62149), 30.14 MiB | 30.13 MiB/s Receiving objects: 60% (37290/62149), 30.14 MiB | 30.13 MiB/s Receiving objects: 61% (37911/62149), 30.14 MiB | 30.13 MiB/s Receiving objects: 62% (38533/62149), 46.86 MiB | 31.23 MiB/s Receiving objects: 63% (39154/62149), 46.86 MiB | 31.23 MiB/s Receiving objects: 64% (39776/62149), 46.86 MiB | 31.23 MiB/s Receiving objects: 65% (40397/62149), 46.86 MiB | 31.23 MiB/s Receiving objects: 66% (41019/62149), 46.86 MiB | 31.23 MiB/s Receiving objects: 67% (41640/62149), 46.86 MiB | 31.23 MiB/s Receiving objects: 68% (42262/62149), 46.86 MiB | 31.23 MiB/s Receiving objects: 69% (42883/62149), 46.86 MiB | 31.23 MiB/s Receiving objects: 70% (43505/62149), 46.86 MiB | 31.23 MiB/s Receiving objects: 71% (44126/62149), 46.86 MiB | 31.23 MiB/s Receiving objects: 72% (44748/62149), 46.86 MiB | 31.23 MiB/s Receiving objects: 72% (44883/62149), 63.68 MiB | 31.76 MiB/s Receiving objects: 73% (45369/62149), 63.68 MiB | 31.76 MiB/s Receiving objects: 74% (45991/62149), 63.68 MiB | 31.76 MiB/s Receiving objects: 75% (46612/62149), 63.68 MiB | 31.76 MiB/s Receiving objects: 76% (47234/62149), 63.68 MiB | 31.76 MiB/s Receiving objects: 77% (47855/62149), 63.68 MiB | 31.76 MiB/s Receiving objects: 78% (48477/62149), 63.68 MiB | 31.76 MiB/s Receiving objects: 79% (49098/62149), 63.68 MiB | 31.76 MiB/s Receiving objects: 80% (49720/62149), 63.68 MiB | 31.76 MiB/s Receiving objects: 81% (50341/62149), 63.68 MiB | 31.76 MiB/s Receiving objects: 82% (50963/62149), 63.68 MiB | 31.76 MiB/s Receiving objects: 83% (51584/62149), 63.68 MiB | 31.76 MiB/s Receiving objects: 84% (52206/62149), 63.68 MiB | 31.76 MiB/s Receiving objects: 85% (52827/62149), 63.68 MiB | 31.76 MiB/s Receiving objects: 86% (53449/62149), 63.68 MiB | 31.76 MiB/s Receiving objects: 87% (54070/62149), 63.68 MiB | 31.76 MiB/s Receiving objects: 88% (54692/62149), 80.80 MiB | 32.25 MiB/s Receiving objects: 89% (55313/62149), 80.80 MiB | 32.25 MiB/s Receiving objects: 90% (55935/62149), 80.80 MiB | 32.25 MiB/s Receiving objects: 91% (56556/62149), 80.80 MiB | 32.25 MiB/s Receiving objects: 92% (57178/62149), 80.80 MiB | 32.25 MiB/s Receiving objects: 93% (57799/62149), 80.80 MiB | 32.25 MiB/s Receiving objects: 94% (58421/62149), 80.80 MiB | 32.25 MiB/s Receiving objects: 95% (59042/62149), 80.80 MiB | 32.25 MiB/s Receiving objects: 96% (59664/62149), 80.80 MiB | 32.25 MiB/s Receiving objects: 97% (60285/62149), 80.80 MiB | 32.25 MiB/s Receiving objects: 98% (60907/62149), 80.80 MiB | 32.25 MiB/s Receiving objects: 99% (61528/62149), 80.80 MiB | 32.25 MiB/s remote: Total 62149 (delta 6229), reused 5844 (delta 5767), pack-reused 54998 (from 3)
  7. 5.13 s Receiving objects: 100% (62149/62149), 80.80 MiB | 32.25 MiB/s Receiving objects: 100% (62149/62149), 92.17 MiB | 32.38 MiB/s, done.
  8. 6.45 s Resolving deltas: 0% (0/43437) Resolving deltas: 1% (435/43437) Resolving deltas: 2% (869/43437) Resolving deltas: 3% (1305/43437) Resolving deltas: 4% (1738/43437) Resolving deltas: 5% (2172/43437) Resolving deltas: 6% (2607/43437) Resolving deltas: 7% (3041/43437) Resolving deltas: 8% (3475/43437) Resolving deltas: 9% (3910/43437) Resolving deltas: 10% (4344/43437) Resolving deltas: 11% (4779/43437) Resolving deltas: 12% (5214/43437) Resolving deltas: 13% (5647/43437) Resolving deltas: 14% (6082/43437) Resolving deltas: 15% (6516/43437) Resolving deltas: 16% (6950/43437) Resolving deltas: 17% (7385/43437) Resolving deltas: 18% (7819/43437) Resolving deltas: 19% (8254/43437) Resolving deltas: 20% (8688/43437) Resolving deltas: 21% (9122/43437) Resolving deltas: 22% (9557/43437) Resolving deltas: 23% (9992/43437) Resolving deltas: 24% (10425/43437) Resolving deltas: 25% (10860/43437) Resolving deltas: 26% (11294/43437) Resolving deltas: 27% (11728/43437) Resolving deltas: 28% (12163/43437) Resolving deltas: 29% (12598/43437) Resolving deltas: 30% (13032/43437) Resolving deltas: 31% (13466/43437) Resolving deltas: 32% (13900/43437) Resolving deltas: 33% (14335/43437) Resolving deltas: 34% (14769/43437) Resolving deltas: 35% (15203/43437) Resolving deltas: 36% (15638/43437) Resolving deltas: 37% (16072/43437) Resolving deltas: 38% (16508/43437) Resolving deltas: 39% (16941/43437) Resolving deltas: 40% (17375/43437) Resolving deltas: 41% (17811/43437) Resolving deltas: 42% (18244/43437) Resolving deltas: 43% (18679/43437) Resolving deltas: 44% (19113/43437) Resolving deltas: 45% (19547/43437) Resolving deltas: 46% (19983/43437) Resolving deltas: 47% (20416/43437) Resolving deltas: 48% (20850/43437) Resolving deltas: 49% (21285/43437) Resolving deltas: 50% (21719/43437) Resolving deltas: 51% (22153/43437) Resolving deltas: 52% (22588/43437) Resolving deltas: 53% (23022/43437) Resolving deltas: 54% (23456/43437) Resolving deltas: 55% (23891/43437) Resolving deltas: 56% (24325/43437) Resolving deltas: 57% (24760/43437) Resolving deltas: 58% (25194/43437) Resolving deltas: 59% (25628/43437) Resolving deltas: 60% (26063/43437) Resolving deltas: 61% (26497/43437) Resolving deltas: 62% (26931/43437) Resolving deltas: 63% (27366/43437) Resolving deltas: 64% (27800/43437) Resolving deltas: 65% (28235/43437) Resolving deltas: 66% (28669/43437) Resolving deltas: 67% (29103/43437) Resolving deltas: 68% (29539/43437) Resolving deltas: 69% (29972/43437) Resolving deltas: 70% (30406/43437) Resolving deltas: 71% (30842/43437) Resolving deltas: 72% (31275/43437) Resolving deltas: 73% (31710/43437) Resolving deltas: 74% (32144/43437) Resolving deltas: 75% (32578/43437) Resolving deltas: 76% (33013/43437) Resolving deltas: 77% (33447/43437) Resolving deltas: 77% (33684/43437) Resolving deltas: 78% (33881/43437) Resolving deltas: 79% (34316/43437) Resolving deltas: 80% (34750/43437) Resolving deltas: 81% (35184/43437) Resolving deltas: 82% (35621/43437) Resolving deltas: 83% (36054/43437) Resolving deltas: 84% (36488/43437) Resolving deltas: 85% (36922/43437) Resolving deltas: 86% (37356/43437) Resolving deltas: 87% (37791/43437) Resolving deltas: 88% (38225/43437) Resolving deltas: 89% (38659/43437) Resolving deltas: 90% (39094/43437) Resolving deltas: 91% (39528/43437) Resolving deltas: 92% (39963/43437) Resolving deltas: 93% (40397/43437) Resolving deltas: 94% (40831/43437) Resolving deltas: 95% (41266/43437) Resolving deltas: 96% (41700/43437) Resolving deltas: 97% (42134/43437) Resolving deltas: 98% (42569/43437) Resolving deltas: 99% (43003/43437) Resolving deltas: 100% (43437/43437) Resolving deltas: 100% (43437/43437), done.
  9. 6.86 s Fetching commit 306aa3b35933dd96091d6370d5037e9adacabca8 for push-vrpyqyylypmw ...
  10. 6.86 s $ /nix/store/bcnisk3ydfgv26v2gw3zlky24g00yww2-git-2.54.0/bin/git fetch origin 306aa3b35933dd96091d6370d5037e9adacabca8
  11. 7.47 s From https://github.com/alphal00p/gammaloop
  12. 7.47 s * branch 306aa3b35933dd96091d6370d5037e9adacabca8 -> FETCH_HEAD
  13. 7.53 s $ /nix/store/9ypz3flqsrl5xl495mm8h645gadjsxi1-coreutils-9.11/bin/timeout --kill-after=15s 7200s /nix/store/bcnisk3ydfgv26v2gw3zlky24g00yww2-git-2.54.0/bin/git -c advice.detachedHead=false checkout 306aa3b35933dd96091d6370d5037e9adacabca8
  14. 7.80 s HEAD is now at 306aa3b3 replace linnet python api with typed drawing model
  15. 7.81 s $ /nix/store/9ypz3flqsrl5xl495mm8h645gadjsxi1-coreutils-9.11/bin/timeout --kill-after=15s 7200s /nix/store/23zk8sgzamrbmj1fday15szf7f2279s8-nix-2.34.7/bin/nix --extra-experimental-features nix-command --extra-experimental-features flakes --log-format internal-json run .#packages.x86_64-linux.nix-ci-check-gammaloop-nextest-core --print-build-logs
  16. 13.88 s
  17. 14.52 s Downloading cached gammaloop-nextest-binaries-core-gammaloop-api from https://cache.nix-ci.com
  18. 14.57 s Downloading cached gammaloop-nextest-binaries-core-gammaloop-tracing-filter from https://cache.nix-ci.com
  19. 14.57 s Downloading cached gammaloop-nextest-binaries-core-gammaloop-tracing-filter-macros from https://cache.nix-ci.com
  20. 14.57 s Downloading cached gammaloop-nextest-binaries-core-gammalooprs from https://cache.nix-ci.com
  21. 14.57 s Downloading cached boehm-gc from https://cache.nix-ci.com
  22. 14.57 s Downloading cached busybox from https://cache.nix-ci.com
  23. 14.57 s Downloading cached aws-c-common from https://cache.nix-ci.com
  24. 14.57 s Downloading cached brotli-1.2.0-lib from https://cache.nix-ci.com
  25. 14.57 s Downloading cached editline-1.17.1-unstable-2025-05 from https://cache.nix-ci.com
  26. 14.57 s Downloading cached libcpuid from https://cache.nix-ci.com
  27. 14.57 s Downloading cached libseccomp-2.6.0-lib from https://cache.nix-ci.com
  28. 14.57 s Downloading cached libsodium-1.0.22-unstable-2026-04 from https://cache.nix-ci.com
  29. 14.57 s Downloading cached lowdown-3.0.1-lib from https://cache.nix-ci.com
  30. 14.57 s Downloading cached publicsuffix-list-0-unstable-2026-05 from https://cache.nix-ci.com
  31. 14.57 s Downloading cached icu4c from https://cache.nix-ci.com
  32. 14.57 s Downloading cached libssh2 from https://cache.nix-ci.com
  33. 14.71 s Downloaded cached editline-1.17.1-unstable-2025-05 (58 KiB) in 144ms
  34. 14.71 s Progress: 0 of 1 built, 1 of 55 downloaded from cache (15 downloading)
  35. 14.71 s Downloading cached hwloc-2.14.0-lib from https://cache.nix-ci.com
  36. 14.73 s Downloaded cached busybox (230 KiB) in 166ms
  37. 14.73 s Progress: 0 of 1 built, 2 of 55 downloaded from cache (15 downloading)
  38. 14.73 s Downloading cached keyutils-1.6.3-lib from https://cache.nix-ci.com
  39. 14.74 s Downloaded cached boehm-gc (312 KiB) in 168ms
  40. 14.74 s Progress: 0 of 1 built, 3 of 55 downloaded from cache (15 downloading)
  41. 14.74 s Downloading cached libxml2 from https://cache.nix-ci.com
  42. 14.74 s Downloaded cached brotli-1.2.0-lib (961 KiB) in 171ms
  43. 14.74 s Progress: 0 of 1 built, 4 of 55 downloaded from cache (15 downloading)
  44. 14.74 s Downloading cached llhttp from https://cache.nix-ci.com
  45. 14.76 s Downloaded cached libcpuid (326 KiB) in 189ms
  46. 14.76 s Progress: 0 of 1 built, 5 of 55 downloaded from cache (15 downloading)
  47. 14.76 s Downloading cached nghttp2-1.69.0-lib from https://cache.nix-ci.com
  48. 14.76 s Downloaded cached libseccomp-2.6.0-lib (193 KiB) in 191ms
  49. 14.76 s Progress: 0 of 1 built, 6 of 55 downloaded from cache (15 downloading)
  50. 14.76 s Downloading cached nghttp3 from https://cache.nix-ci.com
  51. 14.76 s Downloaded cached libssh2 (330 KiB) in 192ms
  52. 14.76 s Progress: 0 of 1 built, 7 of 55 downloaded from cache (15 downloading)
  53. 14.76 s Downloading cached ngtcp2 from https://cache.nix-ci.com
  54. 14.76 s Downloaded cached lowdown-3.0.1-lib (341 KiB) in 193ms
  55. 14.76 s Progress: 0 of 1 built, 8 of 55 downloaded from cache (15 downloading)
  56. 14.76 s Downloading cached s2n-tls from https://cache.nix-ci.com
  57. 14.76 s Downloaded cached libsodium-1.0.22-unstable-2026-04 (666 KiB) in 193ms
  58. 14.76 s Progress: 0 of 1 built, 9 of 55 downloaded from cache (15 downloading)
  59. 14.79 s Downloaded cached gammaloop-nextest-binaries-core-gammaloop-tracing-filter-macros (1.7 MiB) in 221ms
  60. 14.79 s Progress: 0 of 1 built, 10 of 55 downloaded from cache (14 downloading)
  61. 14.80 s Downloaded cached publicsuffix-list-0-unstable-2026-05 (329 KiB) in 231ms
  62. 14.80 s Progress: 0 of 1 built, 11 of 55 downloaded from cache (13 downloading)
  63. 14.80 s Downloading cached libpsl from https://cache.nix-ci.com
  64. 14.88 s Downloaded cached aws-c-common (1.1 MiB) in 314ms
  65. 14.88 s Progress: 0 of 1 built, 12 of 55 downloaded from cache (13 downloading)
  66. 14.88 s Downloading cached aws-c-cal from https://cache.nix-ci.com
  67. 14.88 s Downloading cached aws-c-compression from https://cache.nix-ci.com
  68. 14.88 s Downloading cached aws-c-sdkutils from https://cache.nix-ci.com
  69. 14.90 s Downloaded cached hwloc-2.14.0-lib (459 KiB) in 191ms
  70. 14.90 s Progress: 0 of 1 built, 13 of 55 downloaded from cache (15 downloading)
  71. 14.90 s Downloading cached aws-checksums from https://cache.nix-ci.com
  72. 14.94 s Downloaded cached keyutils-1.6.3-lib (41 KiB) in 203ms
  73. 14.94 s Progress: 0 of 1 built, 14 of 55 downloaded from cache (15 downloading)
  74. 14.94 s Downloading cached onetbb from https://cache.nix-ci.com
  75. 14.94 s Downloaded cached llhttp (89 KiB) in 203ms
  76. 14.94 s Progress: 0 of 1 built, 15 of 55 downloaded from cache (15 downloading)
  77. 14.94 s Downloading cached krb5-1.22.2-lib from https://cache.nix-ci.com
  78. 14.96 s Downloaded cached nghttp2-1.69.0-lib (225 KiB) in 200ms
  79. 14.96 s Progress: 0 of 1 built, 16 of 55 downloaded from cache (15 downloading)
  80. 14.96 s Downloading cached libgit2-1.9.4-lib from https://cache.nix-ci.com
  81. 14.96 s Downloaded cached ngtcp2 (515 KiB) in 203ms
  82. 14.96 s Progress: 0 of 1 built, 17 of 55 downloaded from cache (15 downloading)
  83. 14.97 s Downloaded cached s2n-tls (1.3 MiB) in 208ms
  84. 14.97 s Progress: 0 of 1 built, 18 of 55 downloaded from cache (14 downloading)
  85. 14.98 s Downloaded cached libxml2 (1.4 MiB) in 239ms
  86. 14.98 s Progress: 0 of 1 built, 19 of 55 downloaded from cache (13 downloading)
  87. 14.98 s Downloading cached libarchive-3.8.8-lib from https://cache.nix-ci.com
  88. 14.99 s Downloaded cached libpsl (114 KiB) in 189ms
  89. 14.99 s Progress: 0 of 1 built, 20 of 55 downloaded from cache (13 downloading)
  90. 15.03 s Downloaded cached aws-c-compression (31 KiB) in 147ms
  91. 15.03 s Progress: 0 of 1 built, 21 of 55 downloaded from cache (12 downloading)
  92. 15.03 s Downloaded cached aws-c-sdkutils (155 KiB) in 148ms
  93. 15.03 s Progress: 0 of 1 built, 22 of 55 downloaded from cache (11 downloading)
  94. 15.03 s Downloaded cached aws-c-cal (158 KiB) in 148ms
  95. 15.03 s Progress: 0 of 1 built, 23 of 55 downloaded from cache (10 downloading)
  96. 15.03 s Downloading cached aws-c-io from https://cache.nix-ci.com
  97. 15.04 s Downloaded cached nghttp3 (228 KiB) in 278ms
  98. 15.04 s Progress: 0 of 1 built, 24 of 55 downloaded from cache (10 downloading)
  99. 15.07 s Downloaded cached aws-checksums (86 KiB) in 167ms
  100. 15.07 s Progress: 0 of 1 built, 25 of 55 downloaded from cache (9 downloading)
  101. 15.09 s Downloaded cached icu4c (38.2 MiB) in 520ms
  102. 15.09 s Progress: 0 of 1 built, 26 of 55 downloaded from cache (8 downloading)
  103. 15.09 s Downloading cached boost from https://cache.nix-ci.com
  104. 15.10 s Downloaded cached onetbb (626 KiB) in 159ms
  105. 15.10 s Progress: 0 of 1 built, 27 of 55 downloaded from cache (8 downloading)
  106. 15.10 s Downloading cached libblake3 from https://cache.nix-ci.com
  107. 15.11 s Downloaded cached krb5-1.22.2-lib (2.7 MiB) in 166ms
  108. 15.11 s Progress: 0 of 1 built, 28 of 55 downloaded from cache (8 downloading)
  109. 15.11 s Downloading cached curl from https://cache.nix-ci.com
  110. 15.12 s Downloaded cached libarchive-3.8.8-lib (953 KiB) in 144ms
  111. 15.12 s Progress: 0 of 1 built, 29 of 55 downloaded from cache (8 downloading)
  112. 15.13 s Downloaded cached libgit2-1.9.4-lib (1.6 MiB) in 166ms
  113. 15.13 s Progress: 0 of 1 built, 30 of 55 downloaded from cache (7 downloading)
  114. 15.14 s Downloaded cached aws-c-io (648 KiB) in 108ms
  115. 15.14 s Progress: 0 of 1 built, 31 of 55 downloaded from cache (6 downloading)
  116. 15.14 s Downloading cached aws-c-event-stream from https://cache.nix-ci.com
  117. 15.14 s Downloading cached aws-c-http from https://cache.nix-ci.com
  118. 15.23 s Downloaded cached libblake3 (117 KiB) in 135ms
  119. 15.23 s Progress: 0 of 1 built, 32 of 55 downloaded from cache (7 downloading)
  120. 15.26 s Downloaded cached curl (1.2 MiB) in 147ms
  121. 15.26 s Progress: 0 of 1 built, 33 of 55 downloaded from cache (6 downloading)
  122. 15.30 s Downloaded cached boost (14.5 MiB) in 211ms
  123. 15.30 s Progress: 0 of 1 built, 34 of 55 downloaded from cache (5 downloading)
  124. 15.30 s Downloaded cached aws-c-event-stream (176 KiB) in 161ms
  125. 15.30 s Downloading cached nix-util from https://cache.nix-ci.com
  126. 15.30 s Progress: 0 of 1 built, 35 of 55 downloaded from cache (5 downloading)
  127. 15.30 s Downloaded cached aws-c-http (641 KiB) in 163ms
  128. 15.30 s Progress: 0 of 1 built, 36 of 55 downloaded from cache (4 downloading)
  129. 15.30 s Downloading cached aws-c-auth from https://cache.nix-ci.com
  130. 15.30 s Downloading cached aws-c-mqtt from https://cache.nix-ci.com
  131. 15.43 s Downloaded cached aws-c-auth (387 KiB) in 123ms
  132. 15.43 s Progress: 0 of 1 built, 37 of 55 downloaded from cache (5 downloading)
  133. 15.43 s Downloading cached aws-c-s3 from https://cache.nix-ci.com
  134. 15.43 s Downloaded cached aws-c-mqtt (557 KiB) in 128ms
  135. 15.43 s Progress: 0 of 1 built, 38 of 55 downloaded from cache (5 downloading)
  136. 15.44 s Downloaded cached nix-util (2.4 MiB) in 135ms
  137. 15.44 s Progress: 0 of 1 built, 39 of 55 downloaded from cache (4 downloading)
  138. 15.44 s Downloading cached nix-nswrapper from https://cache.nix-ci.com
  139. 15.57 s Downloaded cached nix-nswrapper (131 KiB) in 136ms
  140. 15.57 s Progress: 0 of 1 built, 40 of 55 downloaded from cache (4 downloading)
  141. 15.64 s Downloaded cached aws-c-s3 (384 KiB) in 217ms
  142. 15.65 s Progress: 0 of 1 built, 41 of 55 downloaded from cache (3 downloading)
  143. 15.65 s Downloading cached aws-crt-cpp from https://cache.nix-ci.com
  144. 15.76 s Downloaded cached aws-crt-cpp (979 KiB) in 115ms
  145. 15.76 s Progress: 0 of 1 built, 42 of 55 downloaded from cache (3 downloading)
  146. 15.76 s Downloading cached nix-store from https://cache.nix-ci.com
  147. 15.89 s Downloaded cached nix-store (5.8 MiB) in 132ms
  148. 15.89 s Progress: 0 of 1 built, 43 of 55 downloaded from cache (3 downloading)
  149. 15.89 s Downloading cached nix-fetchers from https://cache.nix-ci.com
  150. 15.89 s Downloading cached nix-main from https://cache.nix-ci.com
  151. 16.02 s Downloaded cached nix-fetchers (1.5 MiB) in 123ms
  152. 16.02 s Progress: 0 of 1 built, 44 of 55 downloaded from cache (4 downloading)
  153. 16.02 s Downloading cached nix-expr from https://cache.nix-ci.com
  154. 16.02 s Downloaded cached nix-main (393 KiB) in 124ms
  155. 16.02 s Progress: 0 of 1 built, 45 of 55 downloaded from cache (4 downloading)
  156. 16.17 s Downloaded cached nix-expr (3.3 MiB) in 150ms
  157. 16.17 s Progress: 0 of 1 built, 46 of 55 downloaded from cache (3 downloading)
  158. 16.17 s Downloading cached nix-flake from https://cache.nix-ci.com
  159. 16.30 s Downloaded cached nix-flake (956 KiB) in 134ms
  160. 16.30 s Progress: 0 of 1 built, 47 of 55 downloaded from cache (3 downloading)
  161. 16.30 s Downloading cached nix-cmd from https://cache.nix-ci.com
  162. 16.41 s Downloaded cached nix-cmd (1 MiB) in 108ms
  163. 16.41 s Progress: 0 of 1 built, 48 of 55 downloaded from cache (3 downloading)
  164. 16.41 s Downloading cached nix from https://cache.nix-ci.com
  165. 16.54 s Downloaded cached nix (3.9 MiB) in 122ms
  166. 16.54 s Progress: 0 of 1 built, 49 of 55 downloaded from cache (3 downloading)
  167. 16.54 s Downloading cached nix from https://cache.nix-ci.com
  168. 16.66 s Downloaded cached nix (8848 B) in 125ms
  169. 16.66 s Progress: 0 of 1 built, 50 of 55 downloaded from cache (3 downloading)
  170. 16.93 s Downloaded cached gammaloop-nextest-binaries-core-gammaloop-tracing-filter (8.1 MiB) in 2.3s
  171. 16.93 s Progress: 0 of 1 built, 51 of 55 downloaded from cache (2 downloading)
  172. 17.14 s Downloaded cached gammaloop-nextest-binaries-core-gammalooprs (79.4 MiB) in 2.5s
  173. 17.14 s Progress: 0 of 1 built, 52 of 55 downloaded from cache (1 downloading)
  174. 18.69 s Downloaded cached gammaloop-nextest-binaries-core-gammaloop-api (68.4 MiB) in 4.1s
  175. 18.69 s Progress: 0 of 1 built, 53 of 55 downloaded from cache
  176. 18.69 s Downloading cached gammaloop-nextest-binaries-core from https://cache.nix-ci.com
  177. 18.73 s Downloaded cached gammaloop-nextest-binaries-core (1640 B) in 40ms
  178. 18.73 s Progress: 0 of 1 built, 54 of 55 downloaded from cache
  179. 18.73 s Downloading cached nix-ci-check-gammaloop-nextest-core from https://cache.nix-ci.com
  180. 18.77 s Downloaded cached nix-ci-check-gammaloop-nextest-core (1016 B) in 39ms
  181. 18.77 s Progress: 0 of 1 built, 55 of 55 downloaded from cache
  182. 24.37 s evaluating derivation 'g copying '/nix/store/rmgz evaluating derivation 'g copying '/nix/store/rmgz evaluating derivation 'g copying '/nix/store/rmgz evaluating derivation 'g copying '/nix/store/rmgz evaluating derivation 'g copying '/nix/store/rmgz evaluating derivation 'g querying gammaloop-nexte querying info about miss querying gammaloop-nexte [0.0 KiB DL] [0/4 built, 4/0/9 copied [0/3 built, 3/1/9 copied [0/3 built, 3/3/9 copied [0/2 built, 1/6/9 copied [0/2 built, 1/7/9 copied [0/2 built, 1/8/9 copied [0/1 built, 9 copied (10 [1/0/1 built, 9 copied (gammaloop-nextest-core> Extracting 3 binaries (including 1 non-test binary), 1 build script output directory, and 2 linked paths to /build/nextest-archive-yp7jMb
  183. 24.80 s gammaloop-nextest-core> Extracted 18 files to /build/nextest-archive-yp7jMb in 0.43s
  184. 24.81 s gammaloop-nextest-core> ------------
  185. 24.81 s gammaloop-nextest-core> Nextest run ID 4d4d1084-0eca-49fa-9887-08096d900686 with nextest profile: ci_gammaloop
  186. 24.81 s gammaloop-nextest-core> Starting 339 tests across 2 binaries
  187. 25.14 s gammaloop-nextest-core> FAIL [ 0.023s] (245/339) gammaloop-api repl::tests::completion_shows_type_hint_for_non_boolean_settings_leaf
  188. 25.14 s gammaloop-nextest-core> stdout ---
  189. 25.14 s gammaloop-nextest-core>
  190. 25.14 s gammaloop-nextest-core> running 1 test
  191. 25.14 s gammaloop-nextest-core> test repl::tests::completion_shows_type_hint_for_non_boolean_settings_leaf ... FAILED
  192. 25.14 s gammaloop-nextest-core>
  193. 25.14 s gammaloop-nextest-core> failures:
  194. 25.14 s gammaloop-nextest-core>
  195. 25.14 s gammaloop-nextest-core> failures:
  196. 25.14 s gammaloop-nextest-core> repl::tests::completion_shows_type_hint_for_non_boolean_settings_leaf
  197. 25.14 s gammaloop-nextest-core>
  198. 25.14 s gammaloop-nextest-core> test result: FAILED. 0 passed; 1 failed; 0 ignored; 0 measured; 338 filtered out; finished in 0.01s
  199. 25.14 s gammaloop-nextest-core>
  200. 25.14 s gammaloop-nextest-core> stderr ---
  201. 25.14 s gammaloop-nextest-core>
  202. 25.14 s gammaloop-nextest-core> thread 'repl::tests::completion_shows_type_hint_for_non_boolean_settings_leaf' (767) panicked at crates/gammaloop-api/src/repl.rs:5778:9:
  203. 25.14 s gammaloop-nextest-core> [Suggestion { value: "", description: Some("Number of samples in the first Monte Carlo iteration."), style: None, extra: None, span: Span { start: 42, end: 42 }, append_whitespace: false }]
  204. 25.14 s gammaloop-nextest-core> stack backtrace:
  205. 25.14 s gammaloop-nextest-core> 0: __rustc::rust_begin_unwind
  206. 25.14 s gammaloop-nextest-core> 1: core::panicking::panic_fmt
  207. 25.14 s gammaloop-nextest-core> 2: gammaloop_api::repl::tests::completion_shows_type_hint_for_non_boolean_settings_leaf
  208. 25.14 s gammaloop-nextest-core> 3: <gammaloop_api::repl::tests::completion_shows_type_hint_for_non_boolean_settings_leaf::{closure#0} as core::ops::function::FnOnce<()>>::call_once
  209. 25.14 s gammaloop-nextest-core> note: Some details are omitted, run with `RUST_BACKTRACE=full` for a verbose backtrace.
  210. 25.14 s gammaloop-nextest-core>
  211. 25.20 s gammaloop-nextest-core> FAIL [ 0.028s] (278/339) gammaloop-api templates::tests::extract_templates_uses_canonical_package_layout
  212. 25.20 s gammaloop-nextest-core> stdout ---
  213. 25.20 s gammaloop-nextest-core>
  214. 25.20 s gammaloop-nextest-core> running 1 test
  215. 25.20 s gammaloop-nextest-core> test templates::tests::extract_templates_uses_canonical_package_layout ... FAILED
  216. 25.20 s gammaloop-nextest-core>
  217. 25.20 s gammaloop-nextest-core> failures:
  218. 25.20 s gammaloop-nextest-core>
  219. 25.20 s gammaloop-nextest-core> failures:
  220. 25.20 s gammaloop-nextest-core> templates::tests::extract_templates_uses_canonical_package_layout
  221. 25.20 s gammaloop-nextest-core>
  222. 25.20 s gammaloop-nextest-core> test result: FAILED. 0 passed; 1 failed; 0 ignored; 0 measured; 338 filtered out; finished in 0.02s
  223. 25.20 s gammaloop-nextest-core>
  224. 25.20 s gammaloop-nextest-core> stderr ---
  225. 25.20 s gammaloop-nextest-core>
  226. 25.20 s gammaloop-nextest-core> thread 'templates::tests::extract_templates_uses_canonical_package_layout' (891) panicked at crates/gammaloop-api/src/templates.rs:99:9:
  227. 25.20 s gammaloop-nextest-core> assertion failed: figure.contains("amplitude-mode")
  228. 25.20 s gammaloop-nextest-core> stack backtrace:
  229. 25.20 s gammaloop-nextest-core> 0: __rustc::rust_begin_unwind
  230. 25.20 s gammaloop-nextest-core> 1: core::panicking::panic_fmt
  231. 25.20 s gammaloop-nextest-core> 2: core::panicking::panic
  232. 25.20 s gammaloop-nextest-core> 3: gammaloop_api::templates::tests::extract_templates_uses_canonical_package_layout
  233. 25.20 s gammaloop-nextest-core> 4: <gammaloop_api::templates::tests::extract_templates_uses_canonical_package_layout::{closure#0} as core::ops::function::FnOnce<()>>::call_once
  234. 25.20 s gammaloop-nextest-core> note: Some details are omitted, run with `RUST_BACKTRACE=full` for a verbose backtrace.
  235. 25.20 s gammaloop-nextest-core>
  236. 25.31 s gammaloop-nextest-core> ------------
  237. 25.31 s gammaloop-nextest-core> Summary [ 0.498s] 339 tests run: 337 passed, 2 failed, 0 skipped
  238. 25.31 s gammaloop-nextest-core> FAIL [ 0.023s] (245/339) gammaloop-api repl::tests::completion_shows_type_hint_for_non_boolean_settings_leaf
  239. 25.31 s gammaloop-nextest-core> stdout ---
  240. 25.31 s gammaloop-nextest-core>
  241. 25.31 s gammaloop-nextest-core> running 1 test
  242. 25.31 s gammaloop-nextest-core> test repl::tests::completion_shows_type_hint_for_non_boolean_settings_leaf ... FAILED
  243. 25.31 s gammaloop-nextest-core>
  244. 25.31 s gammaloop-nextest-core> failures:
  245. 25.31 s gammaloop-nextest-core>
  246. 25.31 s gammaloop-nextest-core> failures:
  247. 25.31 s gammaloop-nextest-core> repl::tests::completion_shows_type_hint_for_non_boolean_settings_leaf
  248. 25.31 s gammaloop-nextest-core>
  249. 25.31 s gammaloop-nextest-core> test result: FAILED. 0 passed; 1 failed; 0 ignored; 0 measured; 338 filtered out; finished in 0.01s
  250. 25.31 s gammaloop-nextest-core>
  251. 25.31 s gammaloop-nextest-core> stderr ---
  252. 25.31 s gammaloop-nextest-core>
  253. 25.31 s gammaloop-nextest-core> thread 'repl::tests::completion_shows_type_hint_for_non_boolean_settings_leaf' (767) panicked at crates/gammaloop-api/src/repl.rs:5778:9:
  254. 25.31 s gammaloop-nextest-core> [Suggestion { value: "", description: Some("Number of samples in the first Monte Carlo iteration."), style: None, extra: None, span: Span { start: 42, end: 42 }, append_whitespace: false }]
  255. 25.31 s gammaloop-nextest-core> stack backtrace:
  256. 25.31 s gammaloop-nextest-core> 0: __rustc::rust_begin_unwind
  257. 25.31 s gammaloop-nextest-core> 1: core::panicking::panic_fmt
  258. 25.31 s gammaloop-nextest-core> 2: gammaloop_api::repl::tests::completion_shows_type_hint_for_non_boolean_settings_leaf
  259. 25.31 s gammaloop-nextest-core> 3: <gammaloop_api::repl::tests::completion_shows_type_hint_for_non_boolean_settings_leaf::{closure#0} as core::ops::function::FnOnce<()>>::call_once
  260. 25.31 s gammaloop-nextest-core> note: Some details are omitted, run with `RUST_BACKTRACE=full` for a verbose backtrace.
  261. 25.31 s gammaloop-nextest-core>
  262. 25.31 s gammaloop-nextest-core> FAIL [ 0.028s] (278/339) gammaloop-api templates::tests::extract_templates_uses_canonical_package_layout
  263. 25.31 s gammaloop-nextest-core> stdout ---
  264. 25.31 s gammaloop-nextest-core>
  265. 25.31 s gammaloop-nextest-core> running 1 test
  266. 25.31 s gammaloop-nextest-core> test templates::tests::extract_templates_uses_canonical_package_layout ... FAILED
  267. 25.31 s gammaloop-nextest-core>
  268. 25.31 s gammaloop-nextest-core> failures:
  269. 25.31 s gammaloop-nextest-core>
  270. 25.31 s gammaloop-nextest-core> failures:
  271. 25.31 s gammaloop-nextest-core> templates::tests::extract_templates_uses_canonical_package_layout
  272. 25.31 s gammaloop-nextest-core>
  273. 25.31 s gammaloop-nextest-core> test result: FAILED. 0 passed; 1 failed; 0 ignored; 0 measured; 338 filtered out; finished in 0.02s
  274. 25.31 s gammaloop-nextest-core>
  275. 25.31 s gammaloop-nextest-core> stderr ---
  276. 25.31 s gammaloop-nextest-core>
  277. 25.31 s gammaloop-nextest-core> thread 'templates::tests::extract_templates_uses_canonical_package_layout' (891) panicked at crates/gammaloop-api/src/templates.rs:99:9:
  278. 25.31 s gammaloop-nextest-core> assertion failed: figure.contains("amplitude-mode")
  279. 25.31 s gammaloop-nextest-core> stack backtrace:
  280. 25.31 s gammaloop-nextest-core> 0: __rustc::rust_begin_unwind
  281. 25.31 s gammaloop-nextest-core> 1: core::panicking::panic_fmt
  282. 25.31 s gammaloop-nextest-core> 2: core::panicking::panic
  283. 25.31 s gammaloop-nextest-core> 3: gammaloop_api::templates::tests::extract_templates_uses_canonical_package_layout
  284. 25.31 s gammaloop-nextest-core> 4: <gammaloop_api::templates::tests::extract_templates_uses_canonical_package_layout::{closure#0} as core::ops::function::FnOnce<()>>::call_once
  285. 25.31 s gammaloop-nextest-core> note: Some details are omitted, run with `RUST_BACKTRACE=full` for a verbose backtrace.
  286. 25.31 s gammaloop-nextest-core>
  287. 25.38 s gammaloop-nextest-core> error: test run failed
  288. 25.42 s gammaloop-nextest-core>
  289. 25.42 s gammaloop-nextest-core> ========== nextest test summary ==========
  290. 25.42 s gammaloop-nextest-core> report: target/nextest/ci_gammaloop/junit.xml
  291. 25.42 s gammaloop-nextest-core> tests: 339, failures: 2, errors: 0
  292. 25.42 s gammaloop-nextest-core>
  293. 25.42 s gammaloop-nextest-core> 1. gammaloop-api::repl::tests::completion_shows_type_hint_for_non_boolean_settings_leaf
  294. 25.42 s gammaloop-nextest-core> failure: test failure with exit code 101
  295. 25.42 s gammaloop-nextest-core> thread 'repl::tests::completion_shows_type_hint_for_non_boolean_settings_leaf' (767) panicked at crates/gammaloop-api/src/repl.rs:5778:9:
  296. 25.42 s gammaloop-nextest-core> [Suggestion { value: "", description: Some("Number of samples in the first Monte Carlo iteration."), style: None, extra: None, span: Span { start: 42, end: 42 }, append_whitespace: false }]
  297. 25.42 s gammaloop-nextest-core> stack backtrace:
  298. 25.42 s gammaloop-nextest-core> 0: __rustc::rust_begin_unwind
  299. 25.42 s gammaloop-nextest-core> 1: core::panicking::panic_fmt
  300. 25.42 s gammaloop-nextest-core> 2: gammaloop_api::repl::tests::completion_shows_type_hint_for_non_boolean_settings_leaf
  301. 25.42 s gammaloop-nextest-core> 3: <gammaloop_api::repl::tests::completion_shows_type_hint_for_non_boolean_settings_leaf::{closure#0} as core::ops::function::FnOnce<()>>::call_once
  302. 25.42 s gammaloop-nextest-core> note: Some details are omitted, run with `RUST_BACKTRACE=full` for a verbose backtrace.
  303. 25.42 s gammaloop-nextest-core> system-out
  304. 25.42 s gammaloop-nextest-core> running 1 test
  305. 25.42 s gammaloop-nextest-core> test repl::tests::completion_shows_type_hint_for_non_boolean_settings_leaf ... FAILED
  306. 25.42 s gammaloop-nextest-core>
  307. 25.42 s gammaloop-nextest-core> failures:
  308. 25.42 s gammaloop-nextest-core>
  309. 25.42 s gammaloop-nextest-core> failures:
  310. 25.42 s gammaloop-nextest-core> repl::tests::completion_shows_type_hint_for_non_boolean_settings_leaf
  311. 25.42 s gammaloop-nextest-core>
  312. 25.42 s gammaloop-nextest-core> test result: FAILED. 0 passed; 1 failed; 0 ignored; 0 measured; 338 filtered out; finished in 0.01s
  313. 25.42 s gammaloop-nextest-core> system-err
  314. 25.42 s gammaloop-nextest-core> thread 'repl::tests::completion_shows_type_hint_for_non_boolean_settings_leaf' (767) panicked at crates/gammaloop-api/src/repl.rs:5778:9:
  315. 25.42 s gammaloop-nextest-core> [Suggestion { value: "", description: Some("Number of samples in the first Monte Carlo iteration."), style: None, extra: None, span: Span { start: 42, end: 42 }, append_whitespace: false }]
  316. 25.42 s gammaloop-nextest-core> stack backtrace:
  317. 25.42 s gammaloop-nextest-core> 0: __rustc::rust_begin_unwind
  318. 25.42 s gammaloop-nextest-core> 1: core::panicking::panic_fmt
  319. 25.42 s gammaloop-nextest-core> 2: gammaloop_api::repl::tests::completion_shows_type_hint_for_non_boolean_settings_leaf
  320. 25.42 s gammaloop-nextest-core> 3: <gammaloop_api::repl::tests::completion_shows_type_hint_for_non_boolean_settings_leaf::{closure#0} as core::ops::function::FnOnce<()>>::call_once
  321. 25.42 s gammaloop-nextest-core> note: Some details are omitted, run with `RUST_BACKTRACE=full` for a verbose backtrace.
  322. 25.42 s gammaloop-nextest-core>
  323. 25.42 s gammaloop-nextest-core> 2. gammaloop-api::templates::tests::extract_templates_uses_canonical_package_layout
  324. 25.42 s gammaloop-nextest-core> failure: test failure with exit code 101
  325. 25.42 s gammaloop-nextest-core> thread 'templates::tests::extract_templates_uses_canonical_package_layout' (891) panicked at crates/gammaloop-api/src/templates.rs:99:9:
  326. 25.42 s gammaloop-nextest-core> assertion failed: figure.contains("amplitude-mode")
  327. 25.42 s gammaloop-nextest-core> stack backtrace:
  328. 25.42 s gammaloop-nextest-core> 0: __rustc::rust_begin_unwind
  329. 25.42 s gammaloop-nextest-core> 1: core::panicking::panic_fmt
  330. 25.42 s gammaloop-nextest-core> 2: core::panicking::panic
  331. 25.42 s gammaloop-nextest-core> 3: gammaloop_api::templates::tests::extract_templates_uses_canonical_package_layout
  332. 25.42 s gammaloop-nextest-core> 4: <gammaloop_api::templates::tests::extract_templates_uses_canonical_package_layout::{closure#0} as core::ops::function::FnOnce<()>>::call_once
  333. 25.42 s gammaloop-nextest-core> note: Some details are omitted, run with `RUST_BACKTRACE=full` for a verbose backtrace.
  334. 25.42 s gammaloop-nextest-core> system-out
  335. 25.42 s gammaloop-nextest-core> running 1 test
  336. 25.42 s gammaloop-nextest-core> test templates::tests::extract_templates_uses_canonical_package_layout ... FAILED
  337. 25.42 s gammaloop-nextest-core>
  338. 25.42 s gammaloop-nextest-core> failures:
  339. 25.42 s gammaloop-nextest-core>
  340. 25.42 s gammaloop-nextest-core> failures:
  341. 25.42 s gammaloop-nextest-core> templates::tests::extract_templates_uses_canonical_package_layout
  342. 25.42 s gammaloop-nextest-core>
  343. 25.42 s gammaloop-nextest-core> test result: FAILED. 0 passed; 1 failed; 0 ignored; 0 measured; 338 filtered out; finished in 0.02s
  344. 25.42 s gammaloop-nextest-core> system-err
  345. 25.42 s gammaloop-nextest-core> thread 'templates::tests::extract_templates_uses_canonical_package_layout' (891) panicked at crates/gammaloop-api/src/templates.rs:99:9:
  346. 25.42 s gammaloop-nextest-core> assertion failed: figure.contains("amplitude-mode")
  347. 25.42 s gammaloop-nextest-core> stack backtrace:
  348. 25.42 s gammaloop-nextest-core> 0: __rustc::rust_begin_unwind
  349. 25.42 s gammaloop-nextest-core> 1: core::panicking::panic_fmt
  350. 25.42 s gammaloop-nextest-core> 2: core::panicking::panic
  351. 25.42 s gammaloop-nextest-core> 3: gammaloop_api::templates::tests::extract_templates_uses_canonical_package_layout
  352. 25.42 s gammaloop-nextest-core> 4: <gammaloop_api::templates::tests::extract_templates_uses_canonical_package_layout::{closure#0} as core::ops::function::FnOnce<()>>::call_once
  353. 25.42 s gammaloop-nextest-core> note: Some details are omitted, run with `RUST_BACKTRACE=full` for a verbose backtrace.
  354. 25.42 s gammaloop-nextest-core> =========================================
  355. 25.44 s gammaloop-nextest-core> Extracting 1 binary and 1 linked path to /build/nextest-archive-ucqFRu
  356. 25.50 s gammaloop-nextest-core> Extracted 7 files to /build/nextest-archive-ucqFRu in 0.07s
  357. 25.51 s gammaloop-nextest-core> ------------
  358. 25.51 s gammaloop-nextest-core> Nextest run ID 2a4c5a12-a758-4d4a-b8f0-723911062402 with nextest profile: ci_gammaloop
  359. 25.51 s gammaloop-nextest-core> Starting 19 tests across 1 binary
  360. 25.53 s gammaloop-nextest-core> ------------
  361. 25.53 s gammaloop-nextest-core> Summary [ 0.014s] 19 tests run: 19 passed, 0 skipped
  362. 25.56 s gammaloop-nextest-core>
  363. 25.56 s gammaloop-nextest-core> ========== nextest test summary ==========
  364. 25.56 s gammaloop-nextest-core> report: target/nextest/ci_gammaloop/junit.xml
  365. 25.56 s gammaloop-nextest-core> tests: 19, failures: 0, errors: 0
  366. 25.56 s gammaloop-nextest-core> No failing testcases found.
  367. 25.56 s gammaloop-nextest-core> =========================================
  368. 25.58 s gammaloop-nextest-core> Extracting 1 binary to /build/nextest-archive-fasVmZ
  369. 25.61 s gammaloop-nextest-core> Extracted 4 files to /build/nextest-archive-fasVmZ in 0.03s
  370. 25.62 s gammaloop-nextest-core> ------------
  371. 25.62 s gammaloop-nextest-core> Nextest run ID bd742c47-d029-4c5f-980c-70a16e764425 with nextest profile: ci_gammaloop
  372. 25.62 s gammaloop-nextest-core> Starting 0 tests across 1 binary
  373. 25.62 s gammaloop-nextest-core> ------------
  374. 25.62 s gammaloop-nextest-core> Summary [ 0.000s] 0 tests run: 0 passed, 0 skipped
  375. 25.65 s gammaloop-nextest-core>
  376. 25.65 s gammaloop-nextest-core> ========== nextest test summary ==========
  377. 25.65 s gammaloop-nextest-core> report: target/nextest/ci_gammaloop/junit.xml
  378. 25.65 s gammaloop-nextest-core> tests: 0, failures: 0, errors: 0
  379. 25.65 s gammaloop-nextest-core> No failing testcases found.
  380. 25.65 s gammaloop-nextest-core> =========================================
  381. 25.67 s gammaloop-nextest-core> Extracting 4 binaries, 1 build script output directory, and 2 linked paths to /build/nextest-archive-CCPM1H
  382. 26.10 s gammaloop-nextest-core> Extracted 18 files to /build/nextest-archive-CCPM1H in 0.44s
  383. 26.12 s gammaloop-nextest-core> ------------
  384. 26.12 s gammaloop-nextest-core> Nextest run ID 5c0f9190-ddd4-4c44-9444-e5cf52c3eb49 with nextest profile: ci_gammaloop
  385. 26.12 s gammaloop-nextest-core> Starting 456 tests across 4 binaries (61 tests skipped, including 60 tests via profile.ci_gammaloop.default-filter)
  386. 26.40 s gammaloop-nextest-core> FAIL [ 0.155s] (108/456) gammalooprs graph::parse::tests::parse_lmbsetting_crossection
  387. 26.40 s gammaloop-nextest-core> stdout ---
  388. 26.40 s gammaloop-nextest-core>
  389. 26.40 s gammaloop-nextest-core> running 1 test
  390. 26.40 s gammaloop-nextest-core> ━━━━━━━━━━━━━━━━━━━━━━━━━━━━━━━ Snapshot Summary ━━━━━━━━━━━━━━━━━━━━━━━━━━━━━━━
  391. 26.40 s gammaloop-nextest-core> Snapshot: parse_lmbsetting_crossection
  392. 26.40 s gammaloop-nextest-core> Source: crates/gammalooprs/src/graph/parse/tests.rs:252
  393. 26.40 s gammaloop-nextest-core> ────────────────────────────────────────────────────────────────────────────────
  394. 26.40 s gammaloop-nextest-core> Expression: g.debug_dot()
  395. 26.40 s gammaloop-nextest-core> ────────────────────────────────────────────────────────────────────────────────
  396. 26.40 s gammaloop-nextest-core> -old snapshot
  397. 26.40 s gammaloop-nextest-core> +new results
  398. 26.40 s gammaloop-nextest-core> ────────────┬───────────────────────────────────────────────────────────────────
  399. 26.40 s gammaloop-nextest-core> 1 │-digraph G{
  400. 26.40 s gammaloop-nextest-core> 1 │+digraph G {
  401. 26.40 s gammaloop-nextest-core> 2 2 │ num = "1/2";
  402. 26.40 s gammaloop-nextest-core> 3 3 │ overall_factor = "2*x";
  403. 26.40 s gammaloop-nextest-core> 4 4 │ overall_factor_evaluated = "2*x";
  404. 26.40 s gammaloop-nextest-core> 5 5 │ projector = "spenso::t";
  405. 26.40 s gammaloop-nextest-core> ────────────┴───────────────────────────────────────────────────────────────────
  406. 26.40 s gammaloop-nextest-core> To update snapshots run `cargo insta review`
  407. 26.40 s gammaloop-nextest-core> Stopped on the first failure. Run `cargo insta test` to run all snapshots.
  408. 26.40 s gammaloop-nextest-core> test graph::parse::tests::parse_lmbsetting_crossection ... FAILED
  409. 26.40 s gammaloop-nextest-core>
  410. 26.40 s gammaloop-nextest-core> failures:
  411. 26.40 s gammaloop-nextest-core>
  412. 26.40 s gammaloop-nextest-core> failures:
  413. 26.40 s gammaloop-nextest-core> graph::parse::tests::parse_lmbsetting_crossection
  414. 26.40 s gammaloop-nextest-core>
  415. 26.40 s gammaloop-nextest-core> test result: FAILED. 0 passed; 1 failed; 0 ignored; 0 measured; 508 filtered out; finished in 0.14s
  416. 26.40 s gammaloop-nextest-core>
  417. 26.40 s gammaloop-nextest-core> stderr ---
  418. 26.40 s gammaloop-nextest-core> [07:32:08.712] @gammalooprs::graph::attribute_warnings WARNING : Unknown node attribute 'color_num' on graph 'G', node 'A'; did you mean 'num'?
  419. 26.40 s gammaloop-nextest-core> at crates/gammalooprs/src/graph/attribute_warnings.rs:198
  420. 26.40 s gammaloop-nextest-core> The application panicked (crashed).
  421. 26.40 s gammaloop-nextest-core> Message: snapshot assertion for 'parse_lmbsetting_crossection' failed in line 252
  422. 26.40 s gammaloop-nextest-core> Location: /nix/store/xdy1vvhll2bijdplvl9fcc2b9plkxhaa-vendor-cargo-deps/c19b7c6f923b580ac259164a89f2577984ad5ab09ee9d583b888f934adbbe8d0/insta-1.47.2/src/runtime.rs:719
  423. 26.40 s gammaloop-nextest-core>
  424. 26.40 s gammaloop-nextest-core> ━━━━━━━━━━━━━━━━━━━━━━━━━━━━━━━━━━ BACKTRACE ━━━━━━━━━━━━━━━━━━━━━━━━━━━━━━━━━━━
  425. 26.40 s gammaloop-nextest-core> 1: <color_eyre[b0c9e66060e883b2]::config::PanicHook>::panic_report<unknown>
  426. 26.40 s gammaloop-nextest-core> at <unknown source file>:<unknown line>
  427. 26.40 s gammaloop-nextest-core> 2: <color_eyre[b0c9e66060e883b2]::config::PanicHook>::into_panic_hook::{closure#0}<unknown>
  428. 26.40 s gammaloop-nextest-core> at <unknown source file>:<unknown line>
  429. 26.40 s gammaloop-nextest-core> 3: std[bcb96dfbba0ab899]::panicking::panic_with_hook<unknown>
  430. 26.40 s gammaloop-nextest-core> at <unknown source file>:<unknown line>
  431. 26.40 s gammaloop-nextest-core> 4: std[bcb96dfbba0ab899]::panicking::panic_handler::{closure#0}<unknown>
  432. 26.40 s gammaloop-nextest-core> at <unknown source file>:<unknown line>
  433. 26.40 s gammaloop-nextest-core> 5: std[bcb96dfbba0ab899]::sys::backtrace::__rust_end_short_backtrace::<std[bcb96dfbba0ab899]::panicking::panic_handler::{closure#0}, !><unknown>
  434. 26.40 s gammaloop-nextest-core> at <unknown source file>:<unknown line>
  435. 26.40 s gammaloop-nextest-core> 6: __rustc[6c289b9f9c454d21]::rust_begin_unwind<unknown>
  436. 26.40 s gammaloop-nextest-core> at <unknown source file>:<unknown line>
  437. 26.40 s gammaloop-nextest-core> 7: core[940e698046960fd5]::panicking::panic_fmt<unknown>
  438. 26.40 s gammaloop-nextest-core> at <unknown source file>:<unknown line>
  439. 26.40 s gammaloop-nextest-core> 8: insta[307a548ac79ef4d9]::runtime::assert_snapshot<unknown>
  440. 26.40 s gammaloop-nextest-core> at <unknown source file>:<unknown line>
  441. 26.40 s gammaloop-nextest-core> 9: gammalooprs[5490727360442cce]::graph::parse::tests::parse_lmbsetting_crossection<unknown>
  442. 26.40 s gammaloop-nextest-core> at <unknown source file>:<unknown line>
  443. 26.40 s gammaloop-nextest-core> 10: <gammalooprs[5490727360442cce]::graph::parse::tests::parse_lmbsetting_crossection::{closure#0} as core[940e698046960fd5]::ops::function::FnOnce<()>>::call_once<unknown>
  444. 26.40 s gammaloop-nextest-core> at <unknown source file>:<unknown line>
  445. 26.40 s gammaloop-nextest-core> 11: test[75d6903177b1d7e9]::__rust_begin_short_backtrace::<core[940e698046960fd5]::result::Result<(), alloc[2ea6bcb46fca0c42]::string::String>, fn() -> core[940e698046960fd5]::result::Result<(), alloc[2ea6bcb46fca0c42]::string::String>><unknown>
  446. 26.40 s gammaloop-nextest-core> at <unknown source file>:<unknown line>
  447. 26.40 s gammaloop-nextest-core> 12: test[75d6903177b1d7e9]::run_test::{closure#0}<unknown>
  448. 26.40 s gammaloop-nextest-core> at <unknown source file>:<unknown line>
  449. 26.40 s gammaloop-nextest-core> 13: std[bcb96dfbba0ab899]::sys::backtrace::__rust_begin_short_backtrace::<test[75d6903177b1d7e9]::run_test::{closure#1}, ()><unknown>
  450. 26.40 s gammaloop-nextest-core> at <unknown source file>:<unknown line>
  451. 26.40 s gammaloop-nextest-core> 14: <std[bcb96dfbba0ab899]::thread::lifecycle::spawn_unchecked<test[75d6903177b1d7e9]::run_test::{closure#1}, ()>::{closure#1} as core[940e698046960fd5]::ops::function::FnOnce<()>>::call_once::{shim:vtable#0}<unknown>
  452. 26.40 s gammaloop-nextest-core> at <unknown source file>:<unknown line>
  453. 26.40 s gammaloop-nextest-core> 15: <std[bcb96dfbba0ab899]::sys::thread::unix::Thread>::new::thread_start<unknown>
  454. 26.40 s gammaloop-nextest-core> at <unknown source file>:<unknown line>
  455. 26.40 s gammaloop-nextest-core> 16: start_thread<unknown>
  456. 26.40 s gammaloop-nextest-core> at <unknown source file>:<unknown line>
  457. 26.40 s gammaloop-nextest-core> 17: __clone3<unknown>
  458. 26.40 s gammaloop-nextest-core> at <unknown source file>:<unknown line>
  459. 26.40 s gammaloop-nextest-core>
  460. 26.40 s gammaloop-nextest-core> Run with COLORBT_SHOW_HIDDEN=1 environment variable to disable frame filtering.
  461. 26.40 s gammaloop-nextest-core> Run with RUST_BACKTRACE=full to include source snippets.
  462. 26.40 s gammaloop-nextest-core>
  463. 26.93 s gammaloop-nextest-core> FAIL [ 0.118s] (407/456) gammalooprs uv::export::tests::computed_node_full_numerator_is_a_spenso_aware_typst_fragment
  464. 26.93 s gammaloop-nextest-core> stdout ---
  465. 26.93 s gammaloop-nextest-core>
  466. 26.93 s gammaloop-nextest-core> running 1 test
  467. 26.93 s gammaloop-nextest-core> test uv::export::tests::computed_node_full_numerator_is_a_spenso_aware_typst_fragment ... FAILED
  468. 26.93 s gammaloop-nextest-core>
  469. 26.93 s gammaloop-nextest-core> failures:
  470. 26.93 s gammaloop-nextest-core>
  471. 26.93 s gammaloop-nextest-core> failures:
  472. 26.93 s gammaloop-nextest-core> uv::export::tests::computed_node_full_numerator_is_a_spenso_aware_typst_fragment
  473. 26.93 s gammaloop-nextest-core>
  474. 26.93 s gammaloop-nextest-core> test result: FAILED. 0 passed; 1 failed; 0 ignored; 0 measured; 508 filtered out; finished in 0.10s
  475. 26.93 s gammaloop-nextest-core>
  476. 26.93 s gammaloop-nextest-core> stderr ---
  477. 26.93 s gammaloop-nextest-core> The application panicked (crashed).
  478. 26.93 s gammaloop-nextest-core> Message: assertion failed: exported.dot.contains(r#"full_num = "op(\"Tr\")(1)";"#)
  479. 26.93 s gammaloop-nextest-core> Location: crates/gammalooprs/src/uv/export.rs:483
  480. 26.93 s gammaloop-nextest-core>
  481. 26.93 s gammaloop-nextest-core> ━━━━━━━━━━━━━━━━━━━━━━━━━━━━━━━━━━ BACKTRACE ━━━━━━━━━━━━━━━━━━━━━━━━━━━━━━━━━━━
  482. 26.93 s gammaloop-nextest-core> 1: <color_eyre[b0c9e66060e883b2]::config::PanicHook>::panic_report<unknown>
  483. 26.93 s gammaloop-nextest-core> at <unknown source file>:<unknown line>
  484. 26.93 s gammaloop-nextest-core> 2: <color_eyre[b0c9e66060e883b2]::config::PanicHook>::into_panic_hook::{closure#0}<unknown>
  485. 26.93 s gammaloop-nextest-core> at <unknown source file>:<unknown line>
  486. 26.93 s gammaloop-nextest-core> 3: std[bcb96dfbba0ab899]::panicking::panic_with_hook<unknown>
  487. 26.93 s gammaloop-nextest-core> at <unknown source file>:<unknown line>
  488. 26.93 s gammaloop-nextest-core> 4: std[bcb96dfbba0ab899]::panicking::panic_handler::{closure#0}<unknown>
  489. 26.93 s gammaloop-nextest-core> at <unknown source file>:<unknown line>
  490. 26.93 s gammaloop-nextest-core> 5: std[bcb96dfbba0ab899]::sys::backtrace::__rust_end_short_backtrace::<std[bcb96dfbba0ab899]::panicking::panic_handler::{closure#0}, !><unknown>
  491. 26.93 s gammaloop-nextest-core> at <unknown source file>:<unknown line>
  492. 26.93 s gammaloop-nextest-core> 6: __rustc[6c289b9f9c454d21]::rust_begin_unwind<unknown>
  493. 26.93 s gammaloop-nextest-core> at <unknown source file>:<unknown line>
  494. 26.93 s gammaloop-nextest-core> 7: core[940e698046960fd5]::panicking::panic_fmt<unknown>
  495. 26.93 s gammaloop-nextest-core> at <unknown source file>:<unknown line>
  496. 26.93 s gammaloop-nextest-core> 8: core[940e698046960fd5]::panicking::panic<unknown>
  497. 26.93 s gammaloop-nextest-core> at <unknown source file>:<unknown line>
  498. 26.93 s gammaloop-nextest-core> 9: gammalooprs[5490727360442cce]::uv::export::tests::computed_node_full_numerator_is_a_spenso_aware_typst_fragment<unknown>
  499. 26.93 s gammaloop-nextest-core> at <unknown source file>:<unknown line>
  500. 26.93 s gammaloop-nextest-core> 10: <gammalooprs[5490727360442cce]::uv::export::tests::computed_node_full_numerator_is_a_spenso_aware_typst_fragment::{closure#0} as core[940e698046960fd5]::ops::function::FnOnce<()>>::call_once<unknown>
  501. 26.93 s gammaloop-nextest-core> at <unknown source file>:<unknown line>
  502. 26.93 s gammaloop-nextest-core> 11: test[75d6903177b1d7e9]::__rust_begin_short_backtrace::<core[940e698046960fd5]::result::Result<(), alloc[2ea6bcb46fca0c42]::string::String>, fn() -> core[940e698046960fd5]::result::Result<(), alloc[2ea6bcb46fca0c42]::string::String>><unknown>
  503. 26.93 s gammaloop-nextest-core> at <unknown source file>:<unknown line>
  504. 26.93 s gammaloop-nextest-core> 12: test[75d6903177b1d7e9]::run_test::{closure#0}<unknown>
  505. 26.93 s gammaloop-nextest-core> at <unknown source file>:<unknown line>
  506. 26.93 s gammaloop-nextest-core> 13: std[bcb96dfbba0ab899]::sys::backtrace::__rust_begin_short_backtrace::<test[75d6903177b1d7e9]::run_test::{closure#1}, ()><unknown>
  507. 26.93 s gammaloop-nextest-core> at <unknown source file>:<unknown line>
  508. 26.93 s gammaloop-nextest-core> 14: <std[bcb96dfbba0ab899]::thread::lifecycle::spawn_unchecked<test[75d6903177b1d7e9]::run_test::{closure#1}, ()>::{closure#1} as core[940e698046960fd5]::ops::function::FnOnce<()>>::call_once::{shim:vtable#0}<unknown>
  509. 26.93 s gammaloop-nextest-core> at <unknown source file>:<unknown line>
  510. 26.93 s gammaloop-nextest-core> 15: <std[bcb96dfbba0ab899]::sys::thread::unix::Thread>::new::thread_start<unknown>
  511. 26.93 s gammaloop-nextest-core> at <unknown source file>:<unknown line>
  512. 26.93 s gammaloop-nextest-core> 16: start_thread<unknown>
  513. 26.93 s gammaloop-nextest-core> at <unknown source file>:<unknown line>
  514. 26.93 s gammaloop-nextest-core> 17: __clone3<unknown>
  515. 26.93 s gammaloop-nextest-core> at <unknown source file>:<unknown line>
  516. 26.93 s gammaloop-nextest-core>
  517. 26.93 s gammaloop-nextest-core> Run with COLORBT_SHOW_HIDDEN=1 environment variable to disable frame filtering.
  518. 26.93 s gammaloop-nextest-core> Run with RUST_BACKTRACE=full to include source snippets.
  519. 26.93 s gammaloop-nextest-core>
  520. 34.55 s gammaloop-nextest-core> ------------
  521. 34.60 s gammaloop-nextest-core> Summary [ 8.434s] 456 tests run: 454 passed, 2 failed, 61 skipped
  522. 34.60 s gammaloop-nextest-core> FAIL [ 0.155s] (108/456) gammalooprs graph::parse::tests::parse_lmbsetting_crossection
  523. 34.60 s gammaloop-nextest-core> stdout ---
  524. 34.60 s gammaloop-nextest-core>
  525. 34.60 s gammaloop-nextest-core> running 1 test
  526. 34.60 s gammaloop-nextest-core> ━━━━━━━━━━━━━━━━━━━━━━━━━━━━━━━ Snapshot Summary ━━━━━━━━━━━━━━━━━━━━━━━━━━━━━━━
  527. 34.60 s gammaloop-nextest-core> Snapshot: parse_lmbsetting_crossection
  528. 34.60 s gammaloop-nextest-core> Source: crates/gammalooprs/src/graph/parse/tests.rs:252
  529. 34.60 s gammaloop-nextest-core> ────────────────────────────────────────────────────────────────────────────────
  530. 34.60 s gammaloop-nextest-core> Expression: g.debug_dot()
  531. 34.60 s gammaloop-nextest-core> ────────────────────────────────────────────────────────────────────────────────
  532. 34.60 s gammaloop-nextest-core> -old snapshot
  533. 34.60 s gammaloop-nextest-core> +new results
  534. 34.60 s gammaloop-nextest-core> ────────────┬───────────────────────────────────────────────────────────────────
  535. 34.60 s gammaloop-nextest-core> 1 │-digraph G{
  536. 34.60 s gammaloop-nextest-core> 1 │+digraph G {
  537. 34.60 s gammaloop-nextest-core> 2 2 │ num = "1/2";
  538. 34.60 s gammaloop-nextest-core> 3 3 │ overall_factor = "2*x";
  539. 34.60 s gammaloop-nextest-core> 4 4 │ overall_factor_evaluated = "2*x";
  540. 34.60 s gammaloop-nextest-core> 5 5 │ projector = "spenso::t";
  541. 34.60 s gammaloop-nextest-core> ────────────┴───────────────────────────────────────────────────────────────────
  542. 34.60 s gammaloop-nextest-core> To update snapshots run `cargo insta review`
  543. 34.60 s gammaloop-nextest-core> Stopped on the first failure. Run `cargo insta test` to run all snapshots.
  544. 34.60 s gammaloop-nextest-core> test graph::parse::tests::parse_lmbsetting_crossection ... FAILED
  545. 34.60 s gammaloop-nextest-core>
  546. 34.60 s gammaloop-nextest-core> failures:
  547. 34.60 s gammaloop-nextest-core>
  548. 34.60 s gammaloop-nextest-core> failures:
  549. 34.60 s gammaloop-nextest-core> graph::parse::tests::parse_lmbsetting_crossection
  550. 34.60 s gammaloop-nextest-core>
  551. 34.60 s gammaloop-nextest-core> test result: FAILED. 0 passed; 1 failed; 0 ignored; 0 measured; 508 filtered out; finished in 0.14s
  552. 34.60 s gammaloop-nextest-core>
  553. 34.60 s gammaloop-nextest-core> stderr ---
  554. 34.60 s gammaloop-nextest-core> [07:32:08.712] @gammalooprs::graph::attribute_warnings WARNING : Unknown node attribute 'color_num' on graph 'G', node 'A'; did you mean 'num'?
  555. 34.60 s gammaloop-nextest-core> at crates/gammalooprs/src/graph/attribute_warnings.rs:198
  556. 34.60 s gammaloop-nextest-core> The application panicked (crashed).
  557. 34.60 s gammaloop-nextest-core> Message: snapshot assertion for 'parse_lmbsetting_crossection' failed in line 252
  558. 34.60 s gammaloop-nextest-core> Location: /nix/store/xdy1vvhll2bijdplvl9fcc2b9plkxhaa-vendor-cargo-deps/c19b7c6f923b580ac259164a89f2577984ad5ab09ee9d583b888f934adbbe8d0/insta-1.47.2/src/runtime.rs:719
  559. 34.60 s gammaloop-nextest-core>
  560. 34.60 s gammaloop-nextest-core> ━━━━━━━━━━━━━━━━━━━━━━━━━━━━━━━━━━ BACKTRACE ━━━━━━━━━━━━━━━━━━━━━━━━━━━━━━━━━━━
  561. 34.60 s gammaloop-nextest-core> 1: <color_eyre[b0c9e66060e883b2]::config::PanicHook>::panic_report<unknown>
  562. 34.60 s gammaloop-nextest-core> at <unknown source file>:<unknown line>
  563. 34.60 s gammaloop-nextest-core> 2: <color_eyre[b0c9e66060e883b2]::config::PanicHook>::into_panic_hook::{closure#0}<unknown>
  564. 34.60 s gammaloop-nextest-core> at <unknown source file>:<unknown line>
  565. 34.60 s gammaloop-nextest-core> 3: std[bcb96dfbba0ab899]::panicking::panic_with_hook<unknown>
  566. 34.60 s gammaloop-nextest-core> at <unknown source file>:<unknown line>
  567. 34.60 s gammaloop-nextest-core> 4: std[bcb96dfbba0ab899]::panicking::panic_handler::{closure#0}<unknown>
  568. 34.60 s gammaloop-nextest-core> at <unknown source file>:<unknown line>
  569. 34.60 s gammaloop-nextest-core> 5: std[bcb96dfbba0ab899]::sys::backtrace::__rust_end_short_backtrace::<std[bcb96dfbba0ab899]::panicking::panic_handler::{closure#0}, !><unknown>
  570. 34.60 s gammaloop-nextest-core> at <unknown source file>:<unknown line>
  571. 34.60 s gammaloop-nextest-core> 6: __rustc[6c289b9f9c454d21]::rust_begin_unwind<unknown>
  572. 34.60 s gammaloop-nextest-core> at <unknown source file>:<unknown line>
  573. 34.60 s gammaloop-nextest-core> 7: core[940e698046960fd5]::panicking::panic_fmt<unknown>
  574. 34.60 s gammaloop-nextest-core> at <unknown source file>:<unknown line>
  575. 34.60 s gammaloop-nextest-core> 8: insta[307a548ac79ef4d9]::runtime::assert_snapshot<unknown>
  576. 34.60 s gammaloop-nextest-core> at <unknown source file>:<unknown line>
  577. 34.60 s gammaloop-nextest-core> 9: gammalooprs[5490727360442cce]::graph::parse::tests::parse_lmbsetting_crossection<unknown>
  578. 34.60 s gammaloop-nextest-core> at <unknown source file>:<unknown line>
  579. 34.60 s gammaloop-nextest-core> 10: <gammalooprs[5490727360442cce]::graph::parse::tests::parse_lmbsetting_crossection::{closure#0} as core[940e698046960fd5]::ops::function::FnOnce<()>>::call_once<unknown>
  580. 34.60 s gammaloop-nextest-core> at <unknown source file>:<unknown line>
  581. 34.60 s gammaloop-nextest-core> 11: test[75d6903177b1d7e9]::__rust_begin_short_backtrace::<core[940e698046960fd5]::result::Result<(), alloc[2ea6bcb46fca0c42]::string::String>, fn() -> core[940e698046960fd5]::result::Result<(), alloc[2ea6bcb46fca0c42]::string::String>><unknown>
  582. 34.60 s gammaloop-nextest-core> at <unknown source file>:<unknown line>
  583. 34.60 s gammaloop-nextest-core> 12: test[75d6903177b1d7e9]::run_test::{closure#0}<unknown>
  584. 34.60 s gammaloop-nextest-core> at <unknown source file>:<unknown line>
  585. 34.60 s gammaloop-nextest-core> 13: std[bcb96dfbba0ab899]::sys::backtrace::__rust_begin_short_backtrace::<test[75d6903177b1d7e9]::run_test::{closure#1}, ()><unknown>
  586. 34.60 s gammaloop-nextest-core> at <unknown source file>:<unknown line>
  587. 34.60 s gammaloop-nextest-core> 14: <std[bcb96dfbba0ab899]::thread::lifecycle::spawn_unchecked<test[75d6903177b1d7e9]::run_test::{closure#1}, ()>::{closure#1} as core[940e698046960fd5]::ops::function::FnOnce<()>>::call_once::{shim:vtable#0}<unknown>
  588. 34.60 s gammaloop-nextest-core> at <unknown source file>:<unknown line>
  589. 34.60 s gammaloop-nextest-core> 15: <std[bcb96dfbba0ab899]::sys::thread::unix::Thread>::new::thread_start<unknown>
  590. 34.60 s gammaloop-nextest-core> at <unknown source file>:<unknown line>
  591. 34.60 s gammaloop-nextest-core> 16: start_thread<unknown>
  592. 34.60 s gammaloop-nextest-core> at <unknown source file>:<unknown line>
  593. 34.60 s gammaloop-nextest-core> 17: __clone3<unknown>
  594. 34.60 s gammaloop-nextest-core> at <unknown source file>:<unknown line>
  595. 34.60 s gammaloop-nextest-core>
  596. 34.60 s gammaloop-nextest-core> Run with COLORBT_SHOW_HIDDEN=1 environment variable to disable frame filtering.
  597. 34.60 s gammaloop-nextest-core> Run with RUST_BACKTRACE=full to include source snippets.
  598. 34.60 s gammaloop-nextest-core>
  599. 34.60 s gammaloop-nextest-core> FAIL [ 0.118s] (407/456) gammalooprs uv::export::tests::computed_node_full_numerator_is_a_spenso_aware_typst_fragment
  600. 34.60 s gammaloop-nextest-core> stdout ---
  601. 34.60 s gammaloop-nextest-core>
  602. 34.60 s gammaloop-nextest-core> running 1 test
  603. 34.60 s gammaloop-nextest-core> test uv::export::tests::computed_node_full_numerator_is_a_spenso_aware_typst_fragment ... FAILED
  604. 34.60 s gammaloop-nextest-core>
  605. 34.60 s gammaloop-nextest-core> failures:
  606. 34.60 s gammaloop-nextest-core>
  607. 34.60 s gammaloop-nextest-core> failures:
  608. 34.60 s gammaloop-nextest-core> uv::export::tests::computed_node_full_numerator_is_a_spenso_aware_typst_fragment
  609. 34.60 s gammaloop-nextest-core>
  610. 34.60 s gammaloop-nextest-core> test result: FAILED. 0 passed; 1 failed; 0 ignored; 0 measured; 508 filtered out; finished in 0.10s
  611. 34.60 s gammaloop-nextest-core>
  612. 34.60 s gammaloop-nextest-core> stderr ---
  613. 34.60 s gammaloop-nextest-core> The application panicked (crashed).
  614. 34.60 s gammaloop-nextest-core> Message: assertion failed: exported.dot.contains(r#"full_num = "op(\"Tr\")(1)";"#)
  615. 34.60 s gammaloop-nextest-core> Location: crates/gammalooprs/src/uv/export.rs:483
  616. 34.60 s gammaloop-nextest-core>
  617. 34.60 s gammaloop-nextest-core> ━━━━━━━━━━━━━━━━━━━━━━━━━━━━━━━━━━ BACKTRACE ━━━━━━━━━━━━━━━━━━━━━━━━━━━━━━━━━━━
  618. 34.60 s gammaloop-nextest-core> 1: <color_eyre[b0c9e66060e883b2]::config::PanicHook>::panic_report<unknown>
  619. 34.60 s gammaloop-nextest-core> at <unknown source file>:<unknown line>
  620. 34.60 s gammaloop-nextest-core> 2: <color_eyre[b0c9e66060e883b2]::config::PanicHook>::into_panic_hook::{closure#0}<unknown>
  621. 34.60 s gammaloop-nextest-core> at <unknown source file>:<unknown line>
  622. 34.60 s gammaloop-nextest-core> 3: std[bcb96dfbba0ab899]::panicking::panic_with_hook<unknown>
  623. 34.60 s gammaloop-nextest-core> at <unknown source file>:<unknown line>
  624. 34.60 s gammaloop-nextest-core> 4: std[bcb96dfbba0ab899]::panicking::panic_handler::{closure#0}<unknown>
  625. 34.60 s gammaloop-nextest-core> at <unknown source file>:<unknown line>
  626. 34.60 s gammaloop-nextest-core> 5: std[bcb96dfbba0ab899]::sys::backtrace::__rust_end_short_backtrace::<std[bcb96dfbba0ab899]::panicking::panic_handler::{closure#0}, !><unknown>
  627. 34.60 s gammaloop-nextest-core> at <unknown source file>:<unknown line>
  628. 34.60 s gammaloop-nextest-core> 6: __rustc[6c289b9f9c454d21]::rust_begin_unwind<unknown>
  629. 34.60 s gammaloop-nextest-core> at <unknown source file>:<unknown line>
  630. 34.60 s gammaloop-nextest-core> 7: core[940e698046960fd5]::panicking::panic_fmt<unknown>
  631. 34.60 s gammaloop-nextest-core> at <unknown source file>:<unknown line>
  632. 34.60 s gammaloop-nextest-core> 8: core[940e698046960fd5]::panicking::panic<unknown>
  633. 34.60 s gammaloop-nextest-core> at <unknown source file>:<unknown line>
  634. 34.60 s gammaloop-nextest-core> 9: gammalooprs[5490727360442cce]::uv::export::tests::computed_node_full_numerator_is_a_spenso_aware_typst_fragment<unknown>
  635. 34.60 s gammaloop-nextest-core> at <unknown source file>:<unknown line>
  636. 34.60 s gammaloop-nextest-core> 10: <gammalooprs[5490727360442cce]::uv::export::tests::computed_node_full_numerator_is_a_spenso_aware_typst_fragment::{closure#0} as core[940e698046960fd5]::ops::function::FnOnce<()>>::call_once<unknown>
  637. 34.60 s gammaloop-nextest-core> at <unknown source file>:<unknown line>
  638. 34.60 s gammaloop-nextest-core> 11: test[75d6903177b1d7e9]::__rust_begin_short_backtrace::<core[940e698046960fd5]::result::Result<(), alloc[2ea6bcb46fca0c42]::string::String>, fn() -> core[940e698046960fd5]::result::Result<(), alloc[2ea6bcb46fca0c42]::string::String>><unknown>
  639. 34.60 s gammaloop-nextest-core> at <unknown source file>:<unknown line>
  640. 34.60 s gammaloop-nextest-core> 12: test[75d6903177b1d7e9]::run_test::{closure#0}<unknown>
  641. 34.60 s gammaloop-nextest-core> at <unknown source file>:<unknown line>
  642. 34.60 s gammaloop-nextest-core> 13: std[bcb96dfbba0ab899]::sys::backtrace::__rust_begin_short_backtrace::<test[75d6903177b1d7e9]::run_test::{closure#1}, ()><unknown>
  643. 34.60 s gammaloop-nextest-core> at <unknown source file>:<unknown line>
  644. 34.60 s gammaloop-nextest-core> 14: <std[bcb96dfbba0ab899]::thread::lifecycle::spawn_unchecked<test[75d6903177b1d7e9]::run_test::{closure#1}, ()>::{closure#1} as core[940e698046960fd5]::ops::function::FnOnce<()>>::call_once::{shim:vtable#0}<unknown>
  645. 34.60 s gammaloop-nextest-core> at <unknown source file>:<unknown line>
  646. 34.60 s gammaloop-nextest-core> 15: <std[bcb96dfbba0ab899]::sys::thread::unix::Thread>::new::thread_start<unknown>
  647. 34.60 s gammaloop-nextest-core> at <unknown source file>:<unknown line>
  648. 34.60 s gammaloop-nextest-core> 16: start_thread<unknown>
  649. 34.60 s gammaloop-nextest-core> at <unknown source file>:<unknown line>
  650. 34.60 s gammaloop-nextest-core> 17: __clone3<unknown>
  651. 34.60 s gammaloop-nextest-core> at <unknown source file>:<unknown line>
  652. 34.60 s gammaloop-nextest-core>
  653. 34.60 s gammaloop-nextest-core> Run with COLORBT_SHOW_HIDDEN=1 environment variable to disable frame filtering.
  654. 34.60 s gammaloop-nextest-core> Run with RUST_BACKTRACE=full to include source snippets.
  655. 34.60 s gammaloop-nextest-core>
  656. 34.62 s gammaloop-nextest-core> error: test run failed
  657. 34.65 s gammaloop-nextest-core>
  658. 34.65 s gammaloop-nextest-core> ========== nextest test summary ==========
  659. 34.65 s gammaloop-nextest-core> report: target/nextest/ci_gammaloop/junit.xml
  660. 34.65 s gammaloop-nextest-core> tests: 456, failures: 2, errors: 0
  661. 34.65 s gammaloop-nextest-core>
  662. 34.65 s gammaloop-nextest-core> 1. gammalooprs::graph::parse::tests::parse_lmbsetting_crossection
  663. 34.65 s gammaloop-nextest-core> failure: test failure with exit code 101
  664. 34.65 s gammaloop-nextest-core> system-out
  665. 34.65 s gammaloop-nextest-core> running 1 test
  666. 34.65 s gammaloop-nextest-core> ━━━━━━━━━━━━━━━━━━━━━━━━━━━━━━━ Snapshot Summary ━━━━━━━━━━━━━━━━━━━━━━━━━━━━━━━
  667. 34.65 s gammaloop-nextest-core> Snapshot: parse_lmbsetting_crossection
  668. 34.65 s gammaloop-nextest-core> Source: crates/gammalooprs/src/graph/parse/tests.rs:252
  669. 34.65 s gammaloop-nextest-core> ────────────────────────────────────────────────────────────────────────────────
  670. 34.65 s gammaloop-nextest-core> Expression: g.debug_dot()
  671. 34.65 s gammaloop-nextest-core> ────────────────────────────────────────────────────────────────────────────────
  672. 34.65 s gammaloop-nextest-core> -old snapshot
  673. 34.65 s gammaloop-nextest-core> +new results
  674. 34.65 s gammaloop-nextest-core> ────────────┬───────────────────────────────────────────────────────────────────
  675. 34.65 s gammaloop-nextest-core> 1 │-digraph G{
  676. 34.65 s gammaloop-nextest-core> 1 │+digraph G {
  677. 34.65 s gammaloop-nextest-core> 2 2 │ num = "1/2";
  678. 34.65 s gammaloop-nextest-core> 3 3 │ overall_factor = "2*x";
  679. 34.65 s gammaloop-nextest-core> 4 4 │ overall_factor_evaluated = "2*x";
  680. 34.65 s gammaloop-nextest-core> 5 5 │ projector = "spenso::t";
  681. 34.65 s gammaloop-nextest-core> ────────────┴───────────────────────────────────────────────────────────────────
  682. 34.65 s gammaloop-nextest-core> To update snapshots run `cargo insta review`
  683. 34.65 s gammaloop-nextest-core> Stopped on the first failure. Run `cargo insta test` to run all snapshots.
  684. 34.65 s gammaloop-nextest-core> test graph::parse::tests::parse_lmbsetting_crossection ... FAILED
  685. 34.65 s gammaloop-nextest-core>
  686. 34.65 s gammaloop-nextest-core> failures:
  687. 34.65 s gammaloop-nextest-core>
  688. 34.65 s gammaloop-nextest-core> failures:
  689. 34.65 s gammaloop-nextest-core> graph::parse::tests::parse_lmbsetting_crossection
  690. 34.65 s gammaloop-nextest-core>
  691. 34.65 s gammaloop-nextest-core> test result: FAILED. 0 passed; 1 failed; 0 ignored; 0 measured; 508 filtered out; finished in 0.14s
  692. 34.65 s gammaloop-nextest-core> system-err
  693. 34.65 s gammaloop-nextest-core> [07:32:08.712] @gammalooprs::graph::attribute_warnings WARNING : Unknown node attribute 'color_num' on graph 'G', node 'A'; did you mean 'num'?
  694. 34.65 s gammaloop-nextest-core> at crates/gammalooprs/src/graph/attribute_warnings.rs:198
  695. 34.65 s gammaloop-nextest-core> The application panicked (crashed).
  696. 34.65 s gammaloop-nextest-core> Message: snapshot assertion for 'parse_lmbsetting_crossection' failed in line 252
  697. 34.65 s gammaloop-nextest-core> Location: /nix/store/xdy1vvhll2bijdplvl9fcc2b9plkxhaa-vendor-cargo-deps/c19b7c6f923b580ac259164a89f2577984ad5ab09ee9d583b888f934adbbe8d0/insta-1.47.2/src/runtime.rs:719
  698. 34.65 s gammaloop-nextest-core>
  699. 34.65 s gammaloop-nextest-core> ━━━━━━━━━━━━━━━━━━━━━━━━━━━━━━━━━━ BACKTRACE ━━━━━━━━━━━━━━━━━━━━━━━━━━━━━━━━━━━
  700. 34.65 s gammaloop-nextest-core> 1: <color_eyre[b0c9e66060e883b2]::config::PanicHook>::panic_report<unknown>
  701. 34.65 s gammaloop-nextest-core> at <unknown source file>:<unknown line>
  702. 34.65 s gammaloop-nextest-core> 2: <color_eyre[b0c9e66060e883b2]::config::PanicHook>::into_panic_hook::{closure#0}<unknown>
  703. 34.65 s gammaloop-nextest-core> at <unknown source file>:<unknown line>
  704. 34.65 s gammaloop-nextest-core> 3: std[bcb96dfbba0ab899]::panicking::panic_with_hook<unknown>
  705. 34.65 s gammaloop-nextest-core> at <unknown source file>:<unknown line>
  706. 34.65 s gammaloop-nextest-core> 4: std[bcb96dfbba0ab899]::panicking::panic_handler::{closure#0}<unknown>
  707. 34.65 s gammaloop-nextest-core> at <unknown source file>:<unknown line>
  708. 34.65 s gammaloop-nextest-core> 5: std[bcb96dfbba0ab899]::sys::backtrace::__rust_end_short_backtrace::<std[bcb96dfbba0ab899]::panicking::panic_handler::{closure#0}, !><unknown>
  709. 34.65 s gammaloop-nextest-core> at <unknown source file>:<unknown line>
  710. 34.65 s gammaloop-nextest-core> 6: __rustc[6c289b9f9c454d21]::rust_begin_unwind<unknown>
  711. 34.65 s gammaloop-nextest-core> at <unknown source file>:<unknown line>
  712. 34.65 s gammaloop-nextest-core> 7: core[940e698046960fd5]::panicking::panic_fmt<unknown>
  713. 34.65 s gammaloop-nextest-core> at <unknown source file>:<unknown line>
  714. 34.65 s gammaloop-nextest-core> 8: insta[307a548ac79ef4d9]::runtime::assert_snapshot<unknown>
  715. 34.65 s gammaloop-nextest-core> at <unknown source file>:<unknown line>
  716. 34.65 s gammaloop-nextest-core> 9: gammalooprs[5490727360442cce]::graph::parse::tests::parse_lmbsetting_crossection<unknown>
  717. 34.65 s gammaloop-nextest-core> at <unknown source file>:<unknown line>
  718. 34.65 s gammaloop-nextest-core> 10: <gammalooprs[5490727360442cce]::graph::parse::tests::parse_lmbsetting_crossection::{closure#0} as core[940e698046960fd5]::ops::function::FnOnce<()>>::call_once<unknown>
  719. 34.65 s gammaloop-nextest-core> at <unknown source file>:<unknown line>
  720. 34.65 s gammaloop-nextest-core> 11: test[75d6903177b1d7e9]::__rust_begin_short_backtrace::<core[940e698046960fd5]::result::Result<(), alloc[2ea6bcb46fca0c42]::string::String>, fn() -> core[940e698046960fd5]::result::Result<(), alloc[2ea6bcb46fca0c42]::string::String>><unknown>
  721. 34.65 s gammaloop-nextest-core> at <unknown source file>:<unknown line>
  722. 34.65 s gammaloop-nextest-core> 12: test[75d6903177b1d7e9]::run_test::{closure#0}<unknown>
  723. 34.65 s gammaloop-nextest-core> at <unknown source file>:<unknown line>
  724. 34.65 s gammaloop-nextest-core> 13: std[bcb96dfbba0ab899]::sys::backtrace::__rust_begin_short_backtrace::<test[75d6903177b1d7e9]::run_test::{closure#1}, ()><unknown>
  725. 34.65 s gammaloop-nextest-core> at <unknown source file>:<unknown line>
  726. 34.65 s gammaloop-nextest-core> 14: <std[bcb96dfbba0ab899]::thread::lifecycle::spawn_unchecked<test[75d6903177b1d7e9]::run_test::{closure#1}, ()>::{closure#1} as core[940e698046960fd5]::ops::function::FnOnce<()>>::call_once::{shim:vtable#0}<unknown>
  727. 34.65 s gammaloop-nextest-core> at <unknown source file>:<unknown line>
  728. 34.65 s gammaloop-nextest-core> 15: <std[bcb96dfbba0ab899]::sys::thread::unix::Thread>::new::thread_start<unknown>
  729. 34.65 s gammaloop-nextest-core> at <unknown source file>:<unknown line>
  730. 34.65 s gammaloop-nextest-core> 16: start_thread<unknown>
  731. 34.65 s gammaloop-nextest-core> at <unknown source file>:<unknown line>
  732. 34.65 s gammaloop-nextest-core> 17: __clone3<unknown>
  733. 34.65 s gammaloop-nextest-core> at <unknown source file>:<unknown line>
  734. 34.65 s gammaloop-nextest-core>
  735. 34.65 s gammaloop-nextest-core> Run with COLORBT_SHOW_HIDDEN=1 environment variable to disable frame filtering.
  736. 34.65 s gammaloop-nextest-core> Run with RUST_BACKTRACE=full to include source snippets.
  737. 34.65 s gammaloop-nextest-core>
  738. 34.65 s gammaloop-nextest-core> 2. gammalooprs::uv::export::tests::computed_node_full_numerator_is_a_spenso_aware_typst_fragment
  739. 34.65 s gammaloop-nextest-core> failure: test failure with exit code 101
  740. 34.65 s gammaloop-nextest-core> system-out
  741. 34.65 s gammaloop-nextest-core> running 1 test
  742. 34.65 s gammaloop-nextest-core> test uv::export::tests::computed_node_full_numerator_is_a_spenso_aware_typst_fragment ... FAILED
  743. 34.65 s gammaloop-nextest-core>
  744. 34.65 s gammaloop-nextest-core> failures:
  745. 34.65 s gammaloop-nextest-core>
  746. 34.65 s gammaloop-nextest-core> failures:
  747. 34.65 s gammaloop-nextest-core> uv::export::tests::computed_node_full_numerator_is_a_spenso_aware_typst_fragment
  748. 34.65 s gammaloop-nextest-core>
  749. 34.65 s gammaloop-nextest-core> test result: FAILED. 0 passed; 1 failed; 0 ignored; 0 measured; 508 filtered out; finished in 0.10s
  750. 34.65 s gammaloop-nextest-core> system-err
  751. 34.65 s gammaloop-nextest-core> The application panicked (crashed).
  752. 34.65 s gammaloop-nextest-core> Message: assertion failed: exported.dot.contains(r#"full_num = "op(\"Tr\")(1)";"#)
  753. 34.65 s gammaloop-nextest-core> Location: crates/gammalooprs/src/uv/export.rs:483
  754. 34.65 s gammaloop-nextest-core>
  755. 34.65 s gammaloop-nextest-core> ━━━━━━━━━━━━━━━━━━━━━━━━━━━━━━━━━━ BACKTRACE ━━━━━━━━━━━━━━━━━━━━━━━━━━━━━━━━━━━
  756. 34.65 s gammaloop-nextest-core> 1: <color_eyre[b0c9e66060e883b2]::config::PanicHook>::panic_report<unknown>
  757. 34.65 s gammaloop-nextest-core> at <unknown source file>:<unknown line>
  758. 34.65 s gammaloop-nextest-core> 2: <color_eyre[b0c9e66060e883b2]::config::PanicHook>::into_panic_hook::{closure#0}<unknown>
  759. 34.65 s gammaloop-nextest-core> at <unknown source file>:<unknown line>
  760. 34.65 s gammaloop-nextest-core> 3: std[bcb96dfbba0ab899]::panicking::panic_with_hook<unknown>
  761. 34.65 s gammaloop-nextest-core> at <unknown source file>:<unknown line>
  762. 34.65 s gammaloop-nextest-core> 4: std[bcb96dfbba0ab899]::panicking::panic_handler::{closure#0}<unknown>
  763. 34.65 s gammaloop-nextest-core> at <unknown source file>:<unknown line>
  764. 34.65 s gammaloop-nextest-core> 5: std[bcb96dfbba0ab899]::sys::backtrace::__rust_end_short_backtrace::<std[bcb96dfbba0ab899]::panicking::panic_handler::{closure#0}, !><unknown>
  765. 34.65 s gammaloop-nextest-core> at <unknown source file>:<unknown line>
  766. 34.65 s gammaloop-nextest-core> 6: __rustc[6c289b9f9c454d21]::rust_begin_unwind<unknown>
  767. 34.65 s gammaloop-nextest-core> at <unknown source file>:<unknown line>
  768. 34.65 s gammaloop-nextest-core> 7: core[940e698046960fd5]::panicking::panic_fmt<unknown>
  769. 34.65 s gammaloop-nextest-core> at <unknown source file>:<unknown line>
  770. 34.65 s gammaloop-nextest-core> 8: core[940e698046960fd5]::panicking::panic<unknown>
  771. 34.65 s gammaloop-nextest-core> at <unknown source file>:<unknown line>
  772. 34.65 s gammaloop-nextest-core> 9: gammalooprs[5490727360442cce]::uv::export::tests::computed_node_full_numerator_is_a_spenso_aware_typst_fragment<unknown>
  773. 34.65 s gammaloop-nextest-core> at <unknown source file>:<unknown line>
  774. 34.65 s gammaloop-nextest-core> 10: <gammalooprs[5490727360442cce]::uv::export::tests::computed_node_full_numerator_is_a_spenso_aware_typst_fragment::{closure#0} as core[940e698046960fd5]::ops::function::FnOnce<()>>::call_once<unknown>
  775. 34.65 s gammaloop-nextest-core> at <unknown source file>:<unknown line>
  776. 34.65 s gammaloop-nextest-core> 11: test[75d6903177b1d7e9]::__rust_begin_short_backtrace::<core[940e698046960fd5]::result::Result<(), alloc[2ea6bcb46fca0c42]::string::String>, fn() -> core[940e698046960fd5]::result::Result<(), alloc[2ea6bcb46fca0c42]::string::String>><unknown>
  777. 34.65 s gammaloop-nextest-core> at <unknown source file>:<unknown line>
  778. 34.65 s gammaloop-nextest-core> 12: test[75d6903177b1d7e9]::run_test::{closure#0}<unknown>
  779. 34.65 s gammaloop-nextest-core> at <unknown source file>:<unknown line>
  780. 34.65 s gammaloop-nextest-core> 13: std[bcb96dfbba0ab899]::sys::backtrace::__rust_begin_short_backtrace::<test[75d6903177b1d7e9]::run_test::{closure#1}, ()><unknown>
  781. 34.65 s gammaloop-nextest-core> at <unknown source file>:<unknown line>
  782. 34.65 s gammaloop-nextest-core> 14: <std[bcb96dfbba0ab899]::thread::lifecycle::spawn_unchecked<test[75d6903177b1d7e9]::run_test::{closure#1}, ()>::{closure#1} as core[940e698046960fd5]::ops::function::FnOnce<()>>::call_once::{shim:vtable#0}<unknown>
  783. 34.65 s gammaloop-nextest-core> at <unknown source file>:<unknown line>
  784. 34.65 s gammaloop-nextest-core> 15: <std[bcb96dfbba0ab899]::sys::thread::unix::Thread>::new::thread_start<unknown>
  785. 34.65 s gammaloop-nextest-core> at <unknown source file>:<unknown line>
  786. 34.65 s gammaloop-nextest-core> 16: start_thread<unknown>
  787. 34.65 s gammaloop-nextest-core> at <unknown source file>:<unknown line>
  788. 34.65 s gammaloop-nextest-core> 17: __clone3<unknown>
  789. 34.65 s gammaloop-nextest-core> at <unknown source file>:<unknown line>
  790. 34.65 s gammaloop-nextest-core>
  791. 34.65 s gammaloop-nextest-core> Run with COLORBT_SHOW_HIDDEN=1 environment variable to disable frame filtering.
  792. 34.65 s gammaloop-nextest-core> Run with RUST_BACKTRACE=full to include source snippets.
  793. 34.65 s gammaloop-nextest-core> =========================================
  794. 34.70 s error: Cannot build '/nix/store/hm35l98s8jf76hp5gsphwyhqjj06gcak-gammaloop-nextest-core.drv'.
  795. 34.70 s Reason: builder failed with exit code 100.
  796. 34.70 s Output paths:
  797. 34.70 s /nix/store/80jd605dh1wzcz3n78a4ml152ndysq85-gammaloop-nextest-core
  798. 34.70 s Last 612 log lines:
  799. 34.70 s > Extracting 3 binaries (including 1 non-test binary), 1 build script output directory, and 2 linked paths to /build/nextest-archive-yp7jMb
  800. 34.70 s > Extracted 18 files to /build/nextest-archive-yp7jMb in 0.43s
  801. 34.70 s > ------------
  802. 34.70 s > Nextest run ID 4d4d1084-0eca-49fa-9887-08096d900686 with nextest profile: ci_gammaloop
  803. 34.70 s > Starting 339 tests across 2 binaries
  804. 34.70 s > FAIL [ 0.023s] (245/339) gammaloop-api repl::tests::completion_shows_type_hint_for_non_boolean_settings_leaf
  805. 34.70 s > stdout ---
  806. 34.70 s >
  807. 34.70 s > running 1 test
  808. 34.70 s > test repl::tests::completion_shows_type_hint_for_non_boolean_settings_leaf ... FAILED
  809. 34.70 s >
  810. 34.70 s > failures:
  811. 34.70 s >
  812. 34.70 s > failures:
  813. 34.70 s > repl::tests::completion_shows_type_hint_for_non_boolean_settings_leaf
  814. 34.70 s >
  815. 34.70 s > test result: FAILED. 0 passed; 1 failed; 0 ignored; 0 measured; 338 filtered out; finished in 0.01s
  816. 34.70 s >
  817. 34.70 s > stderr ---
  818. 34.70 s >
  819. 34.70 s > thread 'repl::tests::completion_shows_type_hint_for_non_boolean_settings_leaf' (767) panicked at crates/gammaloop-api/src/repl.rs:5778:9:
  820. 34.70 s > [Suggestion { value: "", description: Some("Number of samples in the first Monte Carlo iteration."), style: None, extra: None, span: Span { start: 42, end: 42 }, append_whitespace: false }]
  821. 34.70 s > stack backtrace:
  822. 34.70 s > 0: __rustc::rust_begin_unwind
  823. 34.70 s > 1: core::panicking::panic_fmt
  824. 34.70 s > 2: gammaloop_api::repl::tests::completion_shows_type_hint_for_non_boolean_settings_leaf
  825. 34.70 s > 3: <gammaloop_api::repl::tests::completion_shows_type_hint_for_non_boolean_settings_leaf::{closure#0} as core::ops::function::FnOnce<()>>::call_once
  826. 34.70 s > note: Some details are omitted, run with `RUST_BACKTRACE=full` for a verbose backtrace.
  827. 34.70 s >
  828. 34.70 s > FAIL [ 0.028s] (278/339) gammaloop-api templates::tests::extract_templates_uses_canonical_package_layout
  829. 34.70 s > stdout ---
  830. 34.70 s >
  831. 34.70 s > running 1 test
  832. 34.70 s > test templates::tests::extract_templates_uses_canonical_package_layout ... FAILED
  833. 34.70 s >
  834. 34.70 s > failures:
  835. 34.70 s >
  836. 34.70 s > failures:
  837. 34.70 s > templates::tests::extract_templates_uses_canonical_package_layout
  838. 34.70 s >
  839. 34.70 s > test result: FAILED. 0 passed; 1 failed; 0 ignored; 0 measured; 338 filtered out; finished in 0.02s
  840. 34.70 s >
  841. 34.70 s > stderr ---
  842. 34.70 s >
  843. 34.70 s > thread 'templates::tests::extract_templates_uses_canonical_package_layout' (891) panicked at crates/gammaloop-api/src/templates.rs:99:9:
  844. 34.70 s > assertion failed: figure.contains("amplitude-mode")
  845. 34.70 s > stack backtrace:
  846. 34.70 s > 0: __rustc::rust_begin_unwind
  847. 34.70 s > 1: core::panicking::panic_fmt
  848. 34.70 s > 2: core::panicking::panic
  849. 34.70 s > 3: gammaloop_api::templates::tests::extract_templates_uses_canonical_package_layout
  850. 34.70 s > 4: <gammaloop_api::templates::tests::extract_templates_uses_canonical_package_layout::{closure#0} as core::ops::function::FnOnce<()>>::call_once
  851. 34.70 s > note: Some details are omitted, run with `RUST_BACKTRACE=full` for a verbose backtrace.
  852. 34.70 s >
  853. 34.70 s > ------------
  854. 34.70 s > Summary [ 0.498s] 339 tests run: 337 passed, 2 failed, 0 skipped
  855. 34.70 s > FAIL [ 0.023s] (245/339) gammaloop-api repl::tests::completion_shows_type_hint_for_non_boolean_settings_leaf
  856. 34.70 s > stdout ---
  857. 34.70 s >
  858. 34.70 s > running 1 test
  859. 34.70 s > test repl::tests::completion_shows_type_hint_for_non_boolean_settings_leaf ... FAILED
  860. 34.70 s >
  861. 34.70 s > failures:
  862. 34.70 s >
  863. 34.70 s > failures:
  864. 34.70 s > repl::tests::completion_shows_type_hint_for_non_boolean_settings_leaf
  865. 34.70 s >
  866. 34.70 s > test result: FAILED. 0 passed; 1 failed; 0 ignored; 0 measured; 338 filtered out; finished in 0.01s
  867. 34.70 s >
  868. 34.70 s > stderr ---
  869. 34.70 s >
  870. 34.70 s > thread 'repl::tests::completion_shows_type_hint_for_non_boolean_settings_leaf' (767) panicked at crates/gammaloop-api/src/repl.rs:5778:9:
  871. 34.70 s > [Suggestion { value: "", description: Some("Number of samples in the first Monte Carlo iteration."), style: None, extra: None, span: Span { start: 42, end: 42 }, append_whitespace: false }]
  872. 34.70 s > stack backtrace:
  873. 34.70 s > 0: __rustc::rust_begin_unwind
  874. 34.70 s > 1: core::panicking::panic_fmt
  875. 34.70 s > 2: gammaloop_api::repl::tests::completion_shows_type_hint_for_non_boolean_settings_leaf
  876. 34.70 s > 3: <gammaloop_api::repl::tests::completion_shows_type_hint_for_non_boolean_settings_leaf::{closure#0} as core::ops::function::FnOnce<()>>::call_once
  877. 34.70 s > note: Some details are omitted, run with `RUST_BACKTRACE=full` for a verbose backtrace.
  878. 34.70 s >
  879. 34.70 s > FAIL [ 0.028s] (278/339) gammaloop-api templates::tests::extract_templates_uses_canonical_package_layout
  880. 34.70 s > stdout ---
  881. 34.70 s >
  882. 34.70 s > running 1 test
  883. 34.70 s > test templates::tests::extract_templates_uses_canonical_package_layout ... FAILED
  884. 34.70 s >
  885. 34.70 s > failures:
  886. 34.70 s >
  887. 34.70 s > failures:
  888. 34.70 s > templates::tests::extract_templates_uses_canonical_package_layout
  889. 34.70 s >
  890. 34.70 s > test result: FAILED. 0 passed; 1 failed; 0 ignored; 0 measured; 338 filtered out; finished in 0.02s
  891. 34.70 s >
  892. 34.70 s > stderr ---
  893. 34.70 s >
  894. 34.70 s > thread 'templates::tests::extract_templates_uses_canonical_package_layout' (891) panicked at crates/gammaloop-api/src/templates.rs:99:9:
  895. 34.70 s > assertion failed: figure.contains("amplitude-mode")
  896. 34.70 s > stack backtrace:
  897. 34.70 s > 0: __rustc::rust_begin_unwind
  898. 34.70 s > 1: core::panicking::panic_fmt
  899. 34.70 s > 2: core::panicking::panic
  900. 34.70 s > 3: gammaloop_api::templates::tests::extract_templates_uses_canonical_package_layout
  901. 34.70 s > 4: <gammaloop_api::templates::tests::extract_templates_uses_canonical_package_layout::{closure#0} as core::ops::function::FnOnce<()>>::call_once
  902. 34.70 s > note: Some details are omitted, run with `RUST_BACKTRACE=full` for a verbose backtrace.
  903. 34.70 s >
  904. 34.70 s > error: test run failed
  905. 34.70 s >
  906. 34.70 s > ========== nextest test summary ==========
  907. 34.70 s > report: target/nextest/ci_gammaloop/junit.xml
  908. 34.70 s > tests: 339, failures: 2, errors: 0
  909. 34.70 s >
  910. 34.70 s > 1. gammaloop-api::repl::tests::completion_shows_type_hint_for_non_boolean_settings_leaf
  911. 34.70 s > failure: test failure with exit code 101
  912. 34.70 s > thread 'repl::tests::completion_shows_type_hint_for_non_boolean_settings_leaf' (767) panicked at crates/gammaloop-api/src/repl.rs:5778:9:
  913. 34.70 s > [Suggestion { value: "", description: Some("Number of samples in the first Monte Carlo iteration."), style: None, extra: None, span: Span { start: 42, end: 42 }, append_whitespace: false }]
  914. 34.70 s > stack backtrace:
  915. 34.70 s > 0: __rustc::rust_begin_unwind
  916. 34.70 s > 1: core::panicking::panic_fmt
  917. 34.70 s > 2: gammaloop_api::repl::tests::completion_shows_type_hint_for_non_boolean_settings_leaf
  918. 34.70 s > 3: <gammaloop_api::repl::tests::completion_shows_type_hint_for_non_boolean_settings_leaf::{closure#0} as core::ops::function::FnOnce<()>>::call_once
  919. 34.70 s > note: Some details are omitted, run with `RUST_BACKTRACE=full` for a verbose backtrace.
  920. 34.70 s > system-out
  921. 34.70 s > running 1 test
  922. 34.70 s > test repl::tests::completion_shows_type_hint_for_non_boolean_settings_leaf ... FAILED
  923. 34.70 s >
  924. 34.70 s > failures:
  925. 34.70 s >
  926. 34.70 s > failures:
  927. 34.70 s > repl::tests::completion_shows_type_hint_for_non_boolean_settings_leaf
  928. 34.70 s >
  929. 34.70 s > test result: FAILED. 0 passed; 1 failed; 0 ignored; 0 measured; 338 filtered out; finished in 0.01s
  930. 34.70 s > system-err
  931. 34.70 s > thread 'repl::tests::completion_shows_type_hint_for_non_boolean_settings_leaf' (767) panicked at crates/gammaloop-api/src/repl.rs:5778:9:
  932. 34.70 s > [Suggestion { value: "", description: Some("Number of samples in the first Monte Carlo iteration."), style: None, extra: None, span: Span { start: 42, end: 42 }, append_whitespace: false }]
  933. 34.70 s > stack backtrace:
  934. 34.70 s > 0: __rustc::rust_begin_unwind
  935. 34.70 s > 1: core::panicking::panic_fmt
  936. 34.70 s > 2: gammaloop_api::repl::tests::completion_shows_type_hint_for_non_boolean_settings_leaf
  937. 34.70 s > 3: <gammaloop_api::repl::tests::completion_shows_type_hint_for_non_boolean_settings_leaf::{closure#0} as core::ops::function::FnOnce<()>>::call_once
  938. 34.70 s > note: Some details are omitted, run with `RUST_BACKTRACE=full` for a verbose backtrace.
  939. 34.70 s >
  940. 34.70 s > 2. gammaloop-api::templates::tests::extract_templates_uses_canonical_package_layout
  941. 34.70 s > failure: test failure with exit code 101
  942. 34.70 s > thread 'templates::tests::extract_templates_uses_canonical_package_layout' (891) panicked at crates/gammaloop-api/src/templates.rs:99:9:
  943. 34.70 s > assertion failed: figure.contains("amplitude-mode")
  944. 34.70 s > stack backtrace:
  945. 34.70 s > 0: __rustc::rust_begin_unwind
  946. 34.70 s > 1: core::panicking::panic_fmt
  947. 34.70 s > 2: core::panicking::panic
  948. 34.70 s > 3: gammaloop_api::templates::tests::extract_templates_uses_canonical_package_layout
  949. 34.70 s > 4: <gammaloop_api::templates::tests::extract_templates_uses_canonical_package_layout::{closure#0} as core::ops::function::FnOnce<()>>::call_once
  950. 34.70 s > note: Some details are omitted, run with `RUST_BACKTRACE=full` for a verbose backtrace.
  951. 34.70 s > system-out
  952. 34.70 s > running 1 test
  953. 34.70 s > test templates::tests::extract_templates_uses_canonical_package_layout ... FAILED
  954. 34.70 s >
  955. 34.70 s > failures:
  956. 34.70 s >
  957. 34.70 s > failures:
  958. 34.70 s > templates::tests::extract_templates_uses_canonical_package_layout
  959. 34.70 s >
  960. 34.70 s > test result: FAILED. 0 passed; 1 failed; 0 ignored; 0 measured; 338 filtered out; finished in 0.02s
  961. 34.70 s > system-err
  962. 34.70 s > thread 'templates::tests::extract_templates_uses_canonical_package_layout' (891) panicked at crates/gammaloop-api/src/templates.rs:99:9:
  963. 34.70 s > assertion failed: figure.contains("amplitude-mode")
  964. 34.70 s > stack backtrace:
  965. 34.70 s > 0: __rustc::rust_begin_unwind
  966. 34.70 s > 1: core::panicking::panic_fmt
  967. 34.70 s > 2: core::panicking::panic
  968. 34.70 s > 3: gammaloop_api::templates::tests::extract_templates_uses_canonical_package_layout
  969. 34.70 s > 4: <gammaloop_api::templates::tests::extract_templates_uses_canonical_package_layout::{closure#0} as core::ops::function::FnOnce<()>>::call_once
  970. 34.70 s > note: Some details are omitted, run with `RUST_BACKTRACE=full` for a verbose backtrace.
  971. 34.70 s > =========================================
  972. 34.70 s > Extracting 1 binary and 1 linked path to /build/nextest-archive-ucqFRu
  973. 34.70 s > Extracted 7 files to /build/nextest-archive-ucqFRu in 0.07s
  974. 34.70 s > ------------
  975. 34.70 s > Nextest run ID 2a4c5a12-a758-4d4a-b8f0-723911062402 with nextest profile: ci_gammaloop
  976. 34.70 s > Starting 19 tests across 1 binary
  977. 34.70 s > ------------
  978. 34.70 s > Summary [ 0.014s] 19 tests run: 19 passed, 0 skipped
  979. 34.70 s >
  980. 34.70 s > ========== nextest test summary ==========
  981. 34.70 s > report: target/nextest/ci_gammaloop/junit.xml
  982. 34.70 s > tests: 19, failures: 0, errors: 0
  983. 34.70 s > No failing testcases found.
  984. 34.70 s > =========================================
  985. 34.70 s > Extracting 1 binary to /build/nextest-archive-fasVmZ
  986. 34.70 s > Extracted 4 files to /build/nextest-archive-fasVmZ in 0.03s
  987. 34.70 s > ------------
  988. 34.70 s > Nextest run ID bd742c47-d029-4c5f-980c-70a16e764425 with nextest profile: ci_gammaloop
  989. 34.70 s > Starting 0 tests across 1 binary
  990. 34.70 s > ------------
  991. 34.70 s > Summary [ 0.000s] 0 tests run: 0 passed, 0 skipped
  992. 34.70 s >
  993. 34.70 s > ========== nextest test summary ==========
  994. 34.70 s > report: target/nextest/ci_gammaloop/junit.xml
  995. 34.70 s > tests: 0, failures: 0, errors: 0
  996. 34.70 s > No failing testcases found.
  997. 34.70 s > =========================================
  998. 34.70 s > Extracting 4 binaries, 1 build script output directory, and 2 linked paths to /build/nextest-archive-CCPM1H
  999. 34.70 s > Extracted 18 files to /build/nextest-archive-CCPM1H in 0.44s
  1000. 34.70 s > ------------
  1001. 34.70 s > Nextest run ID 5c0f9190-ddd4-4c44-9444-e5cf52c3eb49 with nextest profile: ci_gammaloop
  1002. 34.70 s > Starting 456 tests across 4 binaries (61 tests skipped, including 60 tests via profile.ci_gammaloop.default-filter)
  1003. 34.70 s > FAIL [ 0.155s] (108/456) gammalooprs graph::parse::tests::parse_lmbsetting_crossection
  1004. 34.70 s > stdout ---
  1005. 34.70 s >
  1006. 34.70 s > running 1 test
  1007. 34.70 s > ━━━━━━━━━━━━━━━━━━━━━━━━━━━━━━━ Snapshot Summary ━━━━━━━━━━━━━━━━━━━━━━━━━━━━━━━
  1008. 34.70 s > Snapshot: parse_lmbsetting_crossection
  1009. 34.70 s > Source: crates/gammalooprs/src/graph/parse/tests.rs:252
  1010. 34.70 s > ────────────────────────────────────────────────────────────────────────────────
  1011. 34.70 s > Expression: g.debug_dot()
  1012. 34.70 s > ────────────────────────────────────────────────────────────────────────────────
  1013. 34.70 s > -old snapshot
  1014. 34.70 s > +new results
  1015. 34.70 s > ────────────┬───────────────────────────────────────────────────────────────────
  1016. 34.70 s > 1 │-digraph G{
  1017. 34.70 s > 1 │+digraph G {
  1018. 34.70 s > 2 2 │ num = "1/2";
  1019. 34.70 s > 3 3 │ overall_factor = "2*x";
  1020. 34.70 s > 4 4 │ overall_factor_evaluated = "2*x";
  1021. 34.70 s > 5 5 │ projector = "spenso::t";
  1022. 34.70 s > ────────────┴───────────────────────────────────────────────────────────────────
  1023. 34.70 s > To update snapshots run `cargo insta review`
  1024. 34.70 s > Stopped on the first failure. Run `cargo insta test` to run all snapshots.
  1025. 34.70 s > test graph::parse::tests::parse_lmbsetting_crossection ... FAILED
  1026. 34.70 s >
  1027. 34.70 s > failures:
  1028. 34.70 s >
  1029. 34.70 s > failures:
  1030. 34.70 s > graph::parse::tests::parse_lmbsetting_crossection
  1031. 34.70 s >
  1032. 34.70 s > test result: FAILED. 0 passed; 1 failed; 0 ignored; 0 measured; 508 filtered out; finished in 0.14s
  1033. 34.70 s >
  1034. 34.70 s > stderr ---
  1035. 34.70 s > [07:32:08.712] @gammalooprs::graph::attribute_warnings WARNING : Unknown node attribute 'color_num' on graph 'G', node 'A'; did you mean 'num'?
  1036. 34.70 s > at crates/gammalooprs/src/graph/attribute_warnings.rs:198
  1037. 34.70 s > The application panicked (crashed).
  1038. 34.70 s > Message: snapshot assertion for 'parse_lmbsetting_crossection' failed in line 252
  1039. 34.70 s > Location: /nix/store/xdy1vvhll2bijdplvl9fcc2b9plkxhaa-vendor-cargo-deps/c19b7c6f923b580ac259164a89f2577984ad5ab09ee9d583b888f934adbbe8d0/insta-1.47.2/src/runtime.rs:719
  1040. 34.70 s >
  1041. 34.70 s > ━━━━━━━━━━━━━━━━━━━━━━━━━━━━━━━━━━ BACKTRACE ━━━━━━━━━━━━━━━━━━━━━━━━━━━━━━━━━━━
  1042. 34.70 s > 1: <color_eyre[b0c9e66060e883b2]::config::PanicHook>::panic_report<unknown>
  1043. 34.70 s > at <unknown source file>:<unknown line>
  1044. 34.70 s > 2: <color_eyre[b0c9e66060e883b2]::config::PanicHook>::into_panic_hook::{closure#0}<unknown>
  1045. 34.70 s > at <unknown source file>:<unknown line>
  1046. 34.70 s > 3: std[bcb96dfbba0ab899]::panicking::panic_with_hook<unknown>
  1047. 34.70 s > at <unknown source file>:<unknown line>
  1048. 34.70 s > 4: std[bcb96dfbba0ab899]::panicking::panic_handler::{closure#0}<unknown>
  1049. 34.70 s > at <unknown source file>:<unknown line>
  1050. 34.70 s > 5: std[bcb96dfbba0ab899]::sys::backtrace::__rust_end_short_backtrace::<std[bcb96dfbba0ab899]::panicking::panic_handler::{closure#0}, !><unknown>
  1051. 34.70 s > at <unknown source file>:<unknown line>
  1052. 34.70 s > 6: __rustc[6c289b9f9c454d21]::rust_begin_unwind<unknown>
  1053. 34.70 s > at <unknown source file>:<unknown line>
  1054. 34.70 s > 7: core[940e698046960fd5]::panicking::panic_fmt<unknown>
  1055. 34.70 s > at <unknown source file>:<unknown line>
  1056. 34.70 s > 8: insta[307a548ac79ef4d9]::runtime::assert_snapshot<unknown>
  1057. 34.70 s > at <unknown source file>:<unknown line>
  1058. 34.70 s > 9: gammalooprs[5490727360442cce]::graph::parse::tests::parse_lmbsetting_crossection<unknown>
  1059. 34.70 s > at <unknown source file>:<unknown line>
  1060. 34.70 s > 10: <gammalooprs[5490727360442cce]::graph::parse::tests::parse_lmbsetting_crossection::{closure#0} as core[940e698046960fd5]::ops::function::FnOnce<()>>::call_once<unknown>
  1061. 34.70 s > at <unknown source file>:<unknown line>
  1062. 34.70 s > 11: test[75d6903177b1d7e9]::__rust_begin_short_backtrace::<core[940e698046960fd5]::result::Result<(), alloc[2ea6bcb46fca0c42]::string::String>, fn() -> core[940e698046960fd5]::result::Result<(), alloc[2ea6bcb46fca0c42]::string::String>><unknown>
  1063. 34.70 s > at <unknown source file>:<unknown line>
  1064. 34.70 s > 12: test[75d6903177b1d7e9]::run_test::{closure#0}<unknown>
  1065. 34.70 s > at <unknown source file>:<unknown line>
  1066. 34.70 s > 13: std[bcb96dfbba0ab899]::sys::backtrace::__rust_begin_short_backtrace::<test[75d6903177b1d7e9]::run_test::{closure#1}, ()><unknown>
  1067. 34.70 s > at <unknown source file>:<unknown line>
  1068. 34.70 s > 14: <std[bcb96dfbba0ab899]::thread::lifecycle::spawn_unchecked<test[75d6903177b1d7e9]::run_test::{closure#1}, ()>::{closure#1} as core[940e698046960fd5]::ops::function::FnOnce<()>>::call_once::{shim:vtable#0}<unknown>
  1069. 34.70 s > at <unknown source file>:<unknown line>
  1070. 34.70 s > 15: <std[bcb96dfbba0ab899]::sys::thread::unix::Thread>::new::thread_start<unknown>
  1071. 34.70 s > at <unknown source file>:<unknown line>
  1072. 34.70 s > 16: start_thread<unknown>
  1073. 34.70 s > at <unknown source file>:<unknown line>
  1074. 34.70 s > 17: __clone3<unknown>
  1075. 34.70 s > at <unknown source file>:<unknown line>
  1076. 34.70 s >
  1077. 34.70 s > Run with COLORBT_SHOW_HIDDEN=1 environment variable to disable frame filtering.
  1078. 34.70 s > Run with RUST_BACKTRACE=full to include source snippets.
  1079. 34.70 s >
  1080. 34.70 s > FAIL [ 0.118s] (407/456) gammalooprs uv::export::tests::computed_node_full_numerator_is_a_spenso_aware_typst_fragment
  1081. 34.70 s > stdout ---
  1082. 34.70 s >
  1083. 34.70 s > running 1 test
  1084. 34.70 s > test uv::export::tests::computed_node_full_numerator_is_a_spenso_aware_typst_fragment ... FAILED
  1085. 34.70 s >
  1086. 34.70 s > failures:
  1087. 34.70 s >
  1088. 34.70 s > failures:
  1089. 34.70 s > uv::export::tests::computed_node_full_numerator_is_a_spenso_aware_typst_fragment
  1090. 34.70 s >
  1091. 34.70 s > test result: FAILED. 0 passed; 1 failed; 0 ignored; 0 measured; 508 filtered out; finished in 0.10s
  1092. 34.70 s >
  1093. 34.70 s > stderr ---
  1094. 34.70 s > The application panicked (crashed).
  1095. 34.70 s > Message: assertion failed: exported.dot.contains(r#"full_num = "op(\"Tr\")(1)";"#)
  1096. 34.70 s > Location: crates/gammalooprs/src/uv/export.rs:483
  1097. 34.70 s >
  1098. 34.70 s > ━━━━━━━━━━━━━━━━━━━━━━━━━━━━━━━━━━ BACKTRACE ━━━━━━━━━━━━━━━━━━━━━━━━━━━━━━━━━━━
  1099. 34.70 s > 1: <color_eyre[b0c9e66060e883b2]::config::PanicHook>::panic_report<unknown>
  1100. 34.70 s > at <unknown source file>:<unknown line>
  1101. 34.70 s > 2: <color_eyre[b0c9e66060e883b2]::config::PanicHook>::into_panic_hook::{closure#0}<unknown>
  1102. 34.70 s > at <unknown source file>:<unknown line>
  1103. 34.70 s > 3: std[bcb96dfbba0ab899]::panicking::panic_with_hook<unknown>
  1104. 34.70 s > at <unknown source file>:<unknown line>
  1105. 34.70 s > 4: std[bcb96dfbba0ab899]::panicking::panic_handler::{closure#0}<unknown>
  1106. 34.70 s > at <unknown source file>:<unknown line>
  1107. 34.70 s > 5: std[bcb96dfbba0ab899]::sys::backtrace::__rust_end_short_backtrace::<std[bcb96dfbba0ab899]::panicking::panic_handler::{closure#0}, !><unknown>
  1108. 34.70 s > at <unknown source file>:<unknown line>
  1109. 34.70 s > 6: __rustc[6c289b9f9c454d21]::rust_begin_unwind<unknown>
  1110. 34.70 s > at <unknown source file>:<unknown line>
  1111. 34.70 s > 7: core[940e698046960fd5]::panicking::panic_fmt<unknown>
  1112. 34.70 s > at <unknown source file>:<unknown line>
  1113. 34.70 s > 8: core[940e698046960fd5]::panicking::panic<unknown>
  1114. 34.70 s > at <unknown source file>:<unknown line>
  1115. 34.70 s > 9: gammalooprs[5490727360442cce]::uv::export::tests::computed_node_full_numerator_is_a_spenso_aware_typst_fragment<unknown>
  1116. 34.70 s > at <unknown source file>:<unknown line>
  1117. 34.70 s > 10: <gammalooprs[5490727360442cce]::uv::export::tests::computed_node_full_numerator_is_a_spenso_aware_typst_fragment::{closure#0} as core[940e698046960fd5]::ops::function::FnOnce<()>>::call_once<unknown>
  1118. 34.70 s > at <unknown source file>:<unknown line>
  1119. 34.70 s > 11: test[75d6903177b1d7e9]::__rust_begin_short_backtrace::<core[940e698046960fd5]::result::Result<(), alloc[2ea6bcb46fca0c42]::string::String>, fn() -> core[940e698046960fd5]::result::Result<(), alloc[2ea6bcb46fca0c42]::string::String>><unknown>
  1120. 34.70 s > at <unknown source file>:<unknown line>
  1121. 34.70 s > 12: test[75d6903177b1d7e9]::run_test::{closure#0}<unknown>
  1122. 34.70 s > at <unknown source file>:<unknown line>
  1123. 34.70 s > 13: std[bcb96dfbba0ab899]::sys::backtrace::__rust_begin_short_backtrace::<test[75d6903177b1d7e9]::run_test::{closure#1}, ()><unknown>
  1124. 34.70 s > at <unknown source file>:<unknown line>
  1125. 34.70 s > 14: <std[bcb96dfbba0ab899]::thread::lifecycle::spawn_unchecked<test[75d6903177b1d7e9]::run_test::{closure#1}, ()>::{closure#1} as core[940e698046960fd5]::ops::function::FnOnce<()>>::call_once::{shim:vtable#0}<unknown>
  1126. 34.70 s > at <unknown source file>:<unknown line>
  1127. 34.70 s > 15: <std[bcb96dfbba0ab899]::sys::thread::unix::Thread>::new::thread_start<unknown>
  1128. 34.70 s > at <unknown source file>:<unknown line>
  1129. 34.70 s > 16: start_thread<unknown>
  1130. 34.70 s > at <unknown source file>:<unknown line>
  1131. 34.70 s > 17: __clone3<unknown>
  1132. 34.70 s > at <unknown source file>:<unknown line>
  1133. 34.70 s >
  1134. 34.70 s > Run with COLORBT_SHOW_HIDDEN=1 environment variable to disable frame filtering.
  1135. 34.70 s > Run with RUST_BACKTRACE=full to include source snippets.
  1136. 34.70 s >
  1137. 34.70 s > ------------
  1138. 34.70 s > Summary [ 8.434s] 456 tests run: 454 passed, 2 failed, 61 skipped
  1139. 34.70 s > FAIL [ 0.155s] (108/456) gammalooprs graph::parse::tests::parse_lmbsetting_crossection
  1140. 34.70 s > stdout ---
  1141. 34.70 s >
  1142. 34.70 s > running 1 test
  1143. 34.70 s > ━━━━━━━━━━━━━━━━━━━━━━━━━━━━━━━ Snapshot Summary ━━━━━━━━━━━━━━━━━━━━━━━━━━━━━━━
  1144. 34.70 s > Snapshot: parse_lmbsetting_crossection
  1145. 34.70 s > Source: crates/gammalooprs/src/graph/parse/tests.rs:252
  1146. 34.70 s > ────────────────────────────────────────────────────────────────────────────────
  1147. 34.70 s > Expression: g.debug_dot()
  1148. 34.70 s > ────────────────────────────────────────────────────────────────────────────────
  1149. 34.70 s > -old snapshot
  1150. 34.70 s > +new results
  1151. 34.70 s > ────────────┬───────────────────────────────────────────────────────────────────
  1152. 34.70 s > 1 │-digraph G{
  1153. 34.70 s > 1 │+digraph G {
  1154. 34.70 s > 2 2 │ num = "1/2";
  1155. 34.70 s > 3 3 │ overall_factor = "2*x";
  1156. 34.70 s > 4 4 │ overall_factor_evaluated = "2*x";
  1157. 34.70 s > 5 5 │ projector = "spenso::t";
  1158. 34.70 s > ────────────┴───────────────────────────────────────────────────────────────────
  1159. 34.70 s > To update snapshots run `cargo insta review`
  1160. 34.70 s > Stopped on the first failure. Run `cargo insta test` to run all snapshots.
  1161. 34.70 s > test graph::parse::tests::parse_lmbsetting_crossection ... FAILED
  1162. 34.70 s >
  1163. 34.70 s > failures:
  1164. 34.70 s >
  1165. 34.70 s > failures:
  1166. 34.70 s > graph::parse::tests::parse_lmbsetting_crossection
  1167. 34.70 s >
  1168. 34.70 s > test result: FAILED. 0 passed; 1 failed; 0 ignored; 0 measured; 508 filtered out; finished in 0.14s
  1169. 34.70 s >
  1170. 34.70 s > stderr ---
  1171. 34.70 s > [07:32:08.712] @gammalooprs::graph::attribute_warnings WARNING : Unknown node attribute 'color_num' on graph 'G', node 'A'; did you mean 'num'?
  1172. 34.70 s > at crates/gammalooprs/src/graph/attribute_warnings.rs:198
  1173. 34.70 s > The application panicked (crashed).
  1174. 34.70 s > Message: snapshot assertion for 'parse_lmbsetting_crossection' failed in line 252
  1175. 34.70 s > Location: /nix/store/xdy1vvhll2bijdplvl9fcc2b9plkxhaa-vendor-cargo-deps/c19b7c6f923b580ac259164a89f2577984ad5ab09ee9d583b888f934adbbe8d0/insta-1.47.2/src/runtime.rs:719
  1176. 34.70 s >
  1177. 34.70 s > ━━━━━━━━━━━━━━━━━━━━━━━━━━━━━━━━━━ BACKTRACE ━━━━━━━━━━━━━━━━━━━━━━━━━━━━━━━━━━━
  1178. 34.70 s > 1: <color_eyre[b0c9e66060e883b2]::config::PanicHook>::panic_report<unknown>
  1179. 34.70 s > at <unknown source file>:<unknown line>
  1180. 34.70 s > 2: <color_eyre[b0c9e66060e883b2]::config::PanicHook>::into_panic_hook::{closure#0}<unknown>
  1181. 34.70 s > at <unknown source file>:<unknown line>
  1182. 34.70 s > 3: std[bcb96dfbba0ab899]::panicking::panic_with_hook<unknown>
  1183. 34.70 s > at <unknown source file>:<unknown line>
  1184. 34.70 s > 4: std[bcb96dfbba0ab899]::panicking::panic_handler::{closure#0}<unknown>
  1185. 34.70 s > at <unknown source file>:<unknown line>
  1186. 34.70 s > 5: std[bcb96dfbba0ab899]::sys::backtrace::__rust_end_short_backtrace::<std[bcb96dfbba0ab899]::panicking::panic_handler::{closure#0}, !><unknown>
  1187. 34.70 s > at <unknown source file>:<unknown line>
  1188. 34.70 s > 6: __rustc[6c289b9f9c454d21]::rust_begin_unwind<unknown>
  1189. 34.70 s > at <unknown source file>:<unknown line>
  1190. 34.70 s > 7: core[940e698046960fd5]::panicking::panic_fmt<unknown>
  1191. 34.70 s > at <unknown source file>:<unknown line>
  1192. 34.70 s > 8: insta[307a548ac79ef4d9]::runtime::assert_snapshot<unknown>
  1193. 34.70 s > at <unknown source file>:<unknown line>
  1194. 34.70 s > 9: gammalooprs[5490727360442cce]::graph::parse::tests::parse_lmbsetting_crossection<unknown>
  1195. 34.70 s > at <unknown source file>:<unknown line>
  1196. 34.70 s > 10: <gammalooprs[5490727360442cce]::graph::parse::tests::parse_lmbsetting_crossection::{closure#0} as core[940e698046960fd5]::ops::function::FnOnce<()>>::call_once<unknown>
  1197. 34.70 s > at <unknown source file>:<unknown line>
  1198. 34.70 s > 11: test[75d6903177b1d7e9]::__rust_begin_short_backtrace::<core[940e698046960fd5]::result::Result<(), alloc[2ea6bcb46fca0c42]::string::String>, fn() -> core[940e698046960fd5]::result::Result<(), alloc[2ea6bcb46fca0c42]::string::String>><unknown>
  1199. 34.70 s > at <unknown source file>:<unknown line>
  1200. 34.70 s > 12: test[75d6903177b1d7e9]::run_test::{closure#0}<unknown>
  1201. 34.70 s > at <unknown source file>:<unknown line>
  1202. 34.70 s > 13: std[bcb96dfbba0ab899]::sys::backtrace::__rust_begin_short_backtrace::<test[75d6903177b1d7e9]::run_test::{closure#1}, ()><unknown>
  1203. 34.70 s > at <unknown source file>:<unknown line>
  1204. 34.70 s > 14: <std[bcb96dfbba0ab899]::thread::lifecycle::spawn_unchecked<test[75d6903177b1d7e9]::run_test::{closure#1}, ()>::{closure#1} as core[940e698046960fd5]::ops::function::FnOnce<()>>::call_once::{shim:vtable#0}<unknown>
  1205. 34.70 s > at <unknown source file>:<unknown line>
  1206. 34.70 s > 15: <std[bcb96dfbba0ab899]::sys::thread::unix::Thread>::new::thread_start<unknown>
  1207. 34.70 s > at <unknown source file>:<unknown line>
  1208. 34.70 s > 16: start_thread<unknown>
  1209. 34.70 s > at <unknown source file>:<unknown line>
  1210. 34.70 s > 17: __clone3<unknown>
  1211. 34.70 s > at <unknown source file>:<unknown line>
  1212. 34.70 s >
  1213. 34.70 s > Run with COLORBT_SHOW_HIDDEN=1 environment variable to disable frame filtering.
  1214. 34.70 s > Run with RUST_BACKTRACE=full to include source snippets.
  1215. 34.70 s >
  1216. 34.70 s > FAIL [ 0.118s] (407/456) gammalooprs uv::export::tests::computed_node_full_numerator_is_a_spenso_aware_typst_fragment
  1217. 34.70 s > stdout ---
  1218. 34.70 s >
  1219. 34.70 s > running 1 test
  1220. 34.70 s > test uv::export::tests::computed_node_full_numerator_is_a_spenso_aware_typst_fragment ... FAILED
  1221. 34.70 s >
  1222. 34.70 s > failures:
  1223. 34.70 s >
  1224. 34.70 s > failures:
  1225. 34.70 s > uv::export::tests::computed_node_full_numerator_is_a_spenso_aware_typst_fragment
  1226. 34.70 s >
  1227. 34.70 s > test result: FAILED. 0 passed; 1 failed; 0 ignored; 0 measured; 508 filtered out; finished in 0.10s
  1228. 34.70 s >
  1229. 34.70 s > stderr ---
  1230. 34.70 s > The application panicked (crashed).
  1231. 34.70 s > Message: assertion failed: exported.dot.contains(r#"full_num = "op(\"Tr\")(1)";"#)
  1232. 34.70 s > Location: crates/gammalooprs/src/uv/export.rs:483
  1233. 34.70 s >
  1234. 34.70 s > ━━━━━━━━━━━━━━━━━━━━━━━━━━━━━━━━━━ BACKTRACE ━━━━━━━━━━━━━━━━━━━━━━━━━━━━━━━━━━━
  1235. 34.70 s > 1: <color_eyre[b0c9e66060e883b2]::config::PanicHook>::panic_report<unknown>
  1236. 34.70 s > at <unknown source file>:<unknown line>
  1237. 34.70 s > 2: <color_eyre[b0c9e66060e883b2]::config::PanicHook>::into_panic_hook::{closure#0}<unknown>
  1238. 34.70 s > at <unknown source file>:<unknown line>
  1239. 34.70 s > 3: std[bcb96dfbba0ab899]::panicking::panic_with_hook<unknown>
  1240. 34.70 s > at <unknown source file>:<unknown line>
  1241. 34.70 s > 4: std[bcb96dfbba0ab899]::panicking::panic_handler::{closure#0}<unknown>
  1242. 34.70 s > at <unknown source file>:<unknown line>
  1243. 34.70 s > 5: std[bcb96dfbba0ab899]::sys::backtrace::__rust_end_short_backtrace::<std[bcb96dfbba0ab899]::panicking::panic_handler::{closure#0}, !><unknown>
  1244. 34.70 s > at <unknown source file>:<unknown line>
  1245. 34.70 s > 6: __rustc[6c289b9f9c454d21]::rust_begin_unwind<unknown>
  1246. 34.70 s > at <unknown source file>:<unknown line>
  1247. 34.70 s > 7: core[940e698046960fd5]::panicking::panic_fmt<unknown>
  1248. 34.70 s > at <unknown source file>:<unknown line>
  1249. 34.70 s > 8: core[940e698046960fd5]::panicking::panic<unknown>
  1250. 34.70 s > at <unknown source file>:<unknown line>
  1251. 34.70 s > 9: gammalooprs[5490727360442cce]::uv::export::tests::computed_node_full_numerator_is_a_spenso_aware_typst_fragment<unknown>
  1252. 34.70 s > at <unknown source file>:<unknown line>
  1253. 34.70 s > 10: <gammalooprs[5490727360442cce]::uv::export::tests::computed_node_full_numerator_is_a_spenso_aware_typst_fragment::{closure#0} as core[940e698046960fd5]::ops::function::FnOnce<()>>::call_once<unknown>
  1254. 34.70 s > at <unknown source file>:<unknown line>
  1255. 34.70 s > 11: test[75d6903177b1d7e9]::__rust_begin_short_backtrace::<core[940e698046960fd5]::result::Result<(), alloc[2ea6bcb46fca0c42]::string::String>, fn() -> core[940e698046960fd5]::result::Result<(), alloc[2ea6bcb46fca0c42]::string::String>><unknown>
  1256. 34.70 s > at <unknown source file>:<unknown line>
  1257. 34.70 s > 12: test[75d6903177b1d7e9]::run_test::{closure#0}<unknown>
  1258. 34.70 s > at <unknown source file>:<unknown line>
  1259. 34.70 s > 13: std[bcb96dfbba0ab899]::sys::backtrace::__rust_begin_short_backtrace::<test[75d6903177b1d7e9]::run_test::{closure#1}, ()><unknown>
  1260. 34.70 s > at <unknown source file>:<unknown line>
  1261. 34.70 s > 14: <std[bcb96dfbba0ab899]::thread::lifecycle::spawn_unchecked<test[75d6903177b1d7e9]::run_test::{closure#1}, ()>::{closure#1} as core[940e698046960fd5]::ops::function::FnOnce<()>>::call_once::{shim:vtable#0}<unknown>
  1262. 34.70 s > at <unknown source file>:<unknown line>
  1263. 34.70 s > 15: <std[bcb96dfbba0ab899]::sys::thread::unix::Thread>::new::thread_start<unknown>
  1264. 34.70 s > at <unknown source file>:<unknown line>
  1265. 34.70 s > 16: start_thread<unknown>
  1266. 34.70 s > at <unknown source file>:<unknown line>
  1267. 34.70 s > 17: __clone3<unknown>
  1268. 34.70 s > at <unknown source file>:<unknown line>
  1269. 34.70 s >
  1270. 34.70 s > Run with COLORBT_SHOW_HIDDEN=1 environment variable to disable frame filtering.
  1271. 34.70 s > Run with RUST_BACKTRACE=full to include source snippets.
  1272. 34.70 s >
  1273. 34.70 s > error: test run failed
  1274. 34.70 s >
  1275. 34.70 s > ========== nextest test summary ==========
  1276. 34.70 s > report: target/nextest/ci_gammaloop/junit.xml
  1277. 34.70 s > tests: 456, failures: 2, errors: 0
  1278. 34.70 s >
  1279. 34.70 s > 1. gammalooprs::graph::parse::tests::parse_lmbsetting_crossection
  1280. 34.70 s > failure: test failure with exit code 101
  1281. 34.70 s > system-out
  1282. 34.70 s > running 1 test
  1283. 34.70 s > ━━━━━━━━━━━━━━━━━━━━━━━━━━━━━━━ Snapshot Summary ━━━━━━━━━━━━━━━━━━━━━━━━━━━━━━━
  1284. 34.70 s > Snapshot: parse_lmbsetting_crossection
  1285. 34.70 s > Source: crates/gammalooprs/src/graph/parse/tests.rs:252
  1286. 34.70 s > ────────────────────────────────────────────────────────────────────────────────
  1287. 34.70 s > Expression: g.debug_dot()
  1288. 34.70 s > ────────────────────────────────────────────────────────────────────────────────
  1289. 34.70 s > -old snapshot
  1290. 34.70 s > +new results
  1291. 34.70 s > ────────────┬───────────────────────────────────────────────────────────────────
  1292. 34.70 s > 1 │-digraph G{
  1293. 34.70 s > 1 │+digraph G {
  1294. 34.70 s > 2 2 │ num = "1/2";
  1295. 34.70 s > 3 3 │ overall_factor = "2*x";
  1296. 34.70 s > 4 4 │ overall_factor_evaluated = "2*x";
  1297. 34.70 s > 5 5 │ projector = "spenso::t";
  1298. 34.70 s > ────────────┴───────────────────────────────────────────────────────────────────
  1299. 34.70 s > To update snapshots run `cargo insta review`
  1300. 34.70 s > Stopped on the first failure. Run `cargo insta test` to run all snapshots.
  1301. 34.70 s > test graph::parse::tests::parse_lmbsetting_crossection ... FAILED
  1302. 34.70 s >
  1303. 34.70 s > failures:
  1304. 34.70 s >
  1305. 34.70 s > failures:
  1306. 34.70 s > graph::parse::tests::parse_lmbsetting_crossection
  1307. 34.70 s >
  1308. 34.70 s > test result: FAILED. 0 passed; 1 failed; 0 ignored; 0 measured; 508 filtered out; finished in 0.14s
  1309. 34.70 s > system-err
  1310. 34.70 s > [07:32:08.712] @gammalooprs::graph::attribute_warnings WARNING : Unknown node attribute 'color_num' on graph 'G', node 'A'; did you mean 'num'?
  1311. 34.70 s > at crates/gammalooprs/src/graph/attribute_warnings.rs:198
  1312. 34.70 s > The application panicked (crashed).
  1313. 34.70 s > Message: snapshot assertion for 'parse_lmbsetting_crossection' failed in line 252
  1314. 34.70 s > Location: /nix/store/xdy1vvhll2bijdplvl9fcc2b9plkxhaa-vendor-cargo-deps/c19b7c6f923b580ac259164a89f2577984ad5ab09ee9d583b888f934adbbe8d0/insta-1.47.2/src/runtime.rs:719
  1315. 34.70 s >
  1316. 34.70 s > ━━━━━━━━━━━━━━━━━━━━━━━━━━━━━━━━━━ BACKTRACE ━━━━━━━━━━━━━━━━━━━━━━━━━━━━━━━━━━━
  1317. 34.70 s > 1: <color_eyre[b0c9e66060e883b2]::config::PanicHook>::panic_report<unknown>
  1318. 34.70 s > at <unknown source file>:<unknown line>
  1319. 34.70 s > 2: <color_eyre[b0c9e66060e883b2]::config::PanicHook>::into_panic_hook::{closure#0}<unknown>
  1320. 34.70 s > at <unknown source file>:<unknown line>
  1321. 34.70 s > 3: std[bcb96dfbba0ab899]::panicking::panic_with_hook<unknown>
  1322. 34.70 s > at <unknown source file>:<unknown line>
  1323. 34.70 s > 4: std[bcb96dfbba0ab899]::panicking::panic_handler::{closure#0}<unknown>
  1324. 34.70 s > at <unknown source file>:<unknown line>
  1325. 34.70 s > 5: std[bcb96dfbba0ab899]::sys::backtrace::__rust_end_short_backtrace::<std[bcb96dfbba0ab899]::panicking::panic_handler::{closure#0}, !><unknown>
  1326. 34.70 s > at <unknown source file>:<unknown line>
  1327. 34.70 s > 6: __rustc[6c289b9f9c454d21]::rust_begin_unwind<unknown>
  1328. 34.70 s > at <unknown source file>:<unknown line>
  1329. 34.70 s > 7: core[940e698046960fd5]::panicking::panic_fmt<unknown>
  1330. 34.70 s > at <unknown source file>:<unknown line>
  1331. 34.70 s > 8: insta[307a548ac79ef4d9]::runtime::assert_snapshot<unknown>
  1332. 34.70 s > at <unknown source file>:<unknown line>
  1333. 34.70 s > 9: gammalooprs[5490727360442cce]::graph::parse::tests::parse_lmbsetting_crossection<unknown>
  1334. 34.70 s > at <unknown source file>:<unknown line>
  1335. 34.70 s > 10: <gammalooprs[5490727360442cce]::graph::parse::tests::parse_lmbsetting_crossection::{closure#0} as core[940e698046960fd5]::ops::function::FnOnce<()>>::call_once<unknown>
  1336. 34.70 s > at <unknown source file>:<unknown line>
  1337. 34.70 s > 11: test[75d6903177b1d7e9]::__rust_begin_short_backtrace::<core[940e698046960fd5]::result::Result<(), alloc[2ea6bcb46fca0c42]::string::String>, fn() -> core[940e698046960fd5]::result::Result<(), alloc[2ea6bcb46fca0c42]::string::String>><unknown>
  1338. 34.70 s > at <unknown source file>:<unknown line>
  1339. 34.70 s > 12: test[75d6903177b1d7e9]::run_test::{closure#0}<unknown>
  1340. 34.70 s > at <unknown source file>:<unknown line>
  1341. 34.70 s > 13: std[bcb96dfbba0ab899]::sys::backtrace::__rust_begin_short_backtrace::<test[75d6903177b1d7e9]::run_test::{closure#1}, ()><unknown>
  1342. 34.70 s > at <unknown source file>:<unknown line>
  1343. 34.70 s > 14: <std[bcb96dfbba0ab899]::thread::lifecycle::spawn_unchecked<test[75d6903177b1d7e9]::run_test::{closure#1}, ()>::{closure#1} as core[940e698046960fd5]::ops::function::FnOnce<()>>::call_once::{shim:vtable#0}<unknown>
  1344. 34.70 s > at <unknown source file>:<unknown line>
  1345. 34.70 s > 15: <std[bcb96dfbba0ab899]::sys::thread::unix::Thread>::new::thread_start<unknown>
  1346. 34.70 s > at <unknown source file>:<unknown line>
  1347. 34.70 s > 16: start_thread<unknown>
  1348. 34.70 s > at <unknown source file>:<unknown line>
  1349. 34.70 s > 17: __clone3<unknown>
  1350. 34.70 s > at <unknown source file>:<unknown line>
  1351. 34.70 s >
  1352. 34.70 s > Run with COLORBT_SHOW_HIDDEN=1 environment variable to disable frame filtering.
  1353. 34.70 s > Run with RUST_BACKTRACE=full to include source snippets.
  1354. 34.70 s >
  1355. 34.70 s > 2. gammalooprs::uv::export::tests::computed_node_full_numerator_is_a_spenso_aware_typst_fragment
  1356. 34.70 s > failure: test failure with exit code 101
  1357. 34.70 s > system-out
  1358. 34.70 s > running 1 test
  1359. 34.70 s > test uv::export::tests::computed_node_full_numerator_is_a_spenso_aware_typst_fragment ... FAILED
  1360. 34.70 s >
  1361. 34.70 s > failures:
  1362. 34.70 s >
  1363. 34.70 s > failures:
  1364. 34.70 s > uv::export::tests::computed_node_full_numerator_is_a_spenso_aware_typst_fragment
  1365. 34.70 s >
  1366. 34.70 s > test result: FAILED. 0 passed; 1 failed; 0 ignored; 0 measured; 508 filtered out; finished in 0.10s
  1367. 34.70 s > system-err
  1368. 34.70 s > The application panicked (crashed).
  1369. 34.70 s > Message: assertion failed: exported.dot.contains(r#"full_num = "op(\"Tr\")(1)";"#)
  1370. 34.70 s > Location: crates/gammalooprs/src/uv/export.rs:483
  1371. 34.70 s >
  1372. 34.70 s > ━━━━━━━━━━━━━━━━━━━━━━━━━━━━━━━━━━ BACKTRACE ━━━━━━━━━━━━━━━━━━━━━━━━━━━━━━━━━━━
  1373. 34.70 s > 1: <color_eyre[b0c9e66060e883b2]::config::PanicHook>::panic_report<unknown>
  1374. 34.70 s > at <unknown source file>:<unknown line>
  1375. 34.70 s > 2: <color_eyre[b0c9e66060e883b2]::config::PanicHook>::into_panic_hook::{closure#0}<unknown>
  1376. 34.70 s > at <unknown source file>:<unknown line>
  1377. 34.70 s > 3: std[bcb96dfbba0ab899]::panicking::panic_with_hook<unknown>
  1378. 34.70 s > at <unknown source file>:<unknown line>
  1379. 34.70 s > 4: std[bcb96dfbba0ab899]::panicking::panic_handler::{closure#0}<unknown>
  1380. 34.70 s > at <unknown source file>:<unknown line>
  1381. 34.70 s > 5: std[bcb96dfbba0ab899]::sys::backtrace::__rust_end_short_backtrace::<std[bcb96dfbba0ab899]::panicking::panic_handler::{closure#0}, !><unknown>
  1382. 34.70 s > at <unknown source file>:<unknown line>
  1383. 34.70 s > 6: __rustc[6c289b9f9c454d21]::rust_begin_unwind<unknown>
  1384. 34.70 s > at <unknown source file>:<unknown line>
  1385. 34.70 s > 7: core[940e698046960fd5]::panicking::panic_fmt<unknown>
  1386. 34.70 s > at <unknown source file>:<unknown line>
  1387. 34.70 s > 8: core[940e698046960fd5]::panicking::panic<unknown>
  1388. 34.70 s > at <unknown source file>:<unknown line>
  1389. 34.70 s > 9: gammalooprs[5490727360442cce]::uv::export::tests::computed_node_full_numerator_is_a_spenso_aware_typst_fragment<unknown>
  1390. 34.70 s > at <unknown source file>:<unknown line>
  1391. 34.70 s > 10: <gammalooprs[5490727360442cce]::uv::export::tests::computed_node_full_numerator_is_a_spenso_aware_typst_fragment::{closure#0} as core[940e698046960fd5]::ops::function::FnOnce<()>>::call_once<unknown>
  1392. 34.70 s > at <unknown source file>:<unknown line>
  1393. 34.70 s > 11: test[75d6903177b1d7e9]::__rust_begin_short_backtrace::<core[940e698046960fd5]::result::Result<(), alloc[2ea6bcb46fca0c42]::string::String>, fn() -> core[940e698046960fd5]::result::Result<(), alloc[2ea6bcb46fca0c42]::string::String>><unknown>
  1394. 34.70 s > at <unknown source file>:<unknown line>
  1395. 34.70 s > 12: test[75d6903177b1d7e9]::run_test::{closure#0}<unknown>
  1396. 34.70 s > at <unknown source file>:<unknown line>
  1397. 34.70 s > 13: std[bcb96dfbba0ab899]::sys::backtrace::__rust_begin_short_backtrace::<test[75d6903177b1d7e9]::run_test::{closure#1}, ()><unknown>
  1398. 34.70 s > at <unknown source file>:<unknown line>
  1399. 34.70 s > 14: <std[bcb96dfbba0ab899]::thread::lifecycle::spawn_unchecked<test[75d6903177b1d7e9]::run_test::{closure#1}, ()>::{closure#1} as core[940e698046960fd5]::ops::function::FnOnce<()>>::call_once::{shim:vtable#0}<unknown>
  1400. 34.70 s > at <unknown source file>:<unknown line>
  1401. 34.70 s > 15: <std[bcb96dfbba0ab899]::sys::thread::unix::Thread>::new::thread_start<unknown>
  1402. 34.70 s > at <unknown source file>:<unknown line>
  1403. 34.70 s > 16: start_thread<unknown>
  1404. 34.70 s > at <unknown source file>:<unknown line>
  1405. 34.70 s > 17: __clone3<unknown>
  1406. 34.70 s > at <unknown source file>:<unknown line>
  1407. 34.70 s >
  1408. 34.70 s > Run with COLORBT_SHOW_HIDDEN=1 environment variable to disable frame filtering.
  1409. 34.70 s > Run with RUST_BACKTRACE=full to include source snippets.
  1410. 34.70 s > =========================================
  1411. 34.70 s For full logs, run:
  1412. 34.70 s nix log /nix/store/hm35l98s8jf76hp5gsphwyhqjj06gcak-gammaloop-nextest-core.drv
  1413. 34.80 s [0 built (1 failed), 9 cRun failed.