test packages.x86_64-linux.nix-ci-check-gammaloop-doctest
0.21 s
$ /nix/store/9ypz3flqsrl5xl495mm8h645gadjsxi1-coreutils-9.11/bin/timeout --kill-after=15s 7200s /nix/store/23zk8sgzamrbmj1fday15szf7f2279s8-nix-2.34.7/bin/nix --extra-experimental-features nix-command --extra-experimental-features flakes flake clone git+https://github.com/alphal00p/gammaloop --dest /tmp/nix-ci-worker/stable-pwd/repo/
0.26 s
Cloning into '/tmp/nix-ci-worker/stable-pwd/repo'...
1.50 s
remote: Enumerating objects: 64191, done.
1.71 s
remote: Counting objects: 0% (1/9545)
remote: Counting objects: 1% (96/9545)
remote: Counting objects: 2% (191/9545)
remote: Counting objects: 3% (287/9545)
remote: Counting objects: 4% (382/9545)
remote: Counting objects: 5% (478/9545)
remote: Counting objects: 6% (573/9545)
remote: Counting objects: 7% (669/9545)
remote: Counting objects: 8% (764/9545)
remote: Counting objects: 9% (860/9545)
remote: Counting objects: 10% (955/9545)
remote: Counting objects: 11% (1050/9545)
remote: Counting objects: 12% (1146/9545)
remote: Counting objects: 13% (1241/9545)
remote: Counting objects: 14% (1337/9545)
remote: Counting objects: 15% (1432/9545)
remote: Counting objects: 16% (1528/9545)
remote: Counting objects: 17% (1623/9545)
remote: Counting objects: 18% (1719/9545)
remote: Counting objects: 19% (1814/9545)
remote: Counting objects: 20% (1909/9545)
remote: Counting objects: 21% (2005/9545)
remote: Counting objects: 22% (2100/9545)
remote: Counting objects: 23% (2196/9545)
remote: Counting objects: 24% (2291/9545)
remote: Counting objects: 25% (2387/9545)
remote: Counting objects: 26% (2482/9545)
remote: Counting objects: 27% (2578/9545)
remote: Counting objects: 28% (2673/9545)
remote: Counting objects: 29% (2769/9545)
remote: Counting objects: 30% (2864/9545)
remote: Counting objects: 31% (2959/9545)
remote: Counting objects: 32% (3055/9545)
remote: Counting objects: 33% (3150/9545)
remote: Counting objects: 34% (3246/9545)
remote: Counting objects: 35% (3341/9545)
remote: Counting objects: 36% (3437/9545)
remote: Counting objects: 37% (3532/9545)
remote: Counting objects: 38% (3628/9545)
remote: Counting objects: 39% (3723/9545)
remote: Counting objects: 40% (3818/9545)
remote: Counting objects: 41% (3914/9545)
remote: Counting objects: 42% (4009/9545)
remote: Counting objects: 43% (4105/9545)
remote: Counting objects: 44% (4200/9545)
remote: Counting objects: 45% (4296/9545)
remote: Counting objects: 46% (4391/9545)
remote: Counting objects: 47% (4487/9545)
remote: Counting objects: 48% (4582/9545)
remote: Counting objects: 49% (4678/9545)
remote: Counting objects: 50% (4773/9545)
remote: Counting objects: 51% (4868/9545)
remote: Counting objects: 52% (4964/9545)
remote: Counting objects: 53% (5059/9545)
remote: Counting objects: 54% (5155/9545)
remote: Counting objects: 55% (5250/9545)
remote: Counting objects: 56% (5346/9545)
remote: Counting objects: 57% (5441/9545)
remote: Counting objects: 58% (5537/9545)
remote: Counting objects: 59% (5632/9545)
remote: Counting objects: 60% (5727/9545)
remote: Counting objects: 61% (5823/9545)
remote: Counting objects: 62% (5918/9545)
remote: Counting objects: 63% (6014/9545)
remote: Counting objects: 64% (6109/9545)
remote: Counting objects: 65% (6205/9545)
remote: Counting objects: 66% (6300/9545)
remote: Counting objects: 67% (6396/9545)
remote: Counting objects: 68% (6491/9545)
remote: Counting objects: 69% (6587/9545)
remote: Counting objects: 70% (6682/9545)
remote: Counting objects: 71% (6777/9545)
remote: Counting objects: 72% (6873/9545)
remote: Counting objects: 73% (6968/9545)
remote: Counting objects: 74% (7064/9545)
remote: Counting objects: 75% (7159/9545)
remote: Counting objects: 76% (7255/9545)
remote: Counting objects: 77% (7350/9545)
remote: Counting objects: 78% (7446/9545)
remote: Counting objects: 79% (7541/9545)
remote: Counting objects: 80% (7636/9545)
remote: Counting objects: 81% (7732/9545)
remote: Counting objects: 82% (7827/9545)
remote: Counting objects: 83% (7923/9545)
remote: Counting objects: 84% (8018/9545)
remote: Counting objects: 85% (8114/9545)
remote: Counting objects: 86% (8209/9545)
remote: Counting objects: 87% (8305/9545)
remote: Counting objects: 88% (8400/9545)
remote: Counting objects: 89% (8496/9545)
remote: Counting objects: 90% (8591/9545)
remote: Counting objects: 91% (8686/9545)
remote: Counting objects: 92% (8782/9545)
remote: Counting objects: 93% (8877/9545)
remote: Counting objects: 94% (8973/9545)
remote: Counting objects: 95% (9068/9545)
remote: Counting objects: 96% (9164/9545)
remote: Counting objects: 97% (9259/9545)
remote: Counting objects: 98% (9355/9545)
remote: Counting objects: 99% (9450/9545)
remote: Counting objects: 100% (9545/9545)
remote: Counting objects: 100% (9545/9545), done.
3.91 s
remote: Compressing objects: 0% (1/2330)
remote: Compressing objects: 1% (24/2330)
remote: Compressing objects: 2% (47/2330)
remote: Compressing objects: 3% (70/2330)
remote: Compressing objects: 4% (94/2330)
remote: Compressing objects: 5% (117/2330)
remote: Compressing objects: 6% (140/2330)
remote: Compressing objects: 7% (164/2330)
remote: Compressing objects: 8% (187/2330)
remote: Compressing objects: 9% (210/2330)
remote: Compressing objects: 10% (233/2330)
remote: Compressing objects: 11% (257/2330)
remote: Compressing objects: 12% (280/2330)
remote: Compressing objects: 13% (303/2330)
remote: Compressing objects: 14% (327/2330)
remote: Compressing objects: 15% (350/2330)
remote: Compressing objects: 16% (373/2330)
remote: Compressing objects: 17% (397/2330)
remote: Compressing objects: 18% (420/2330)
remote: Compressing objects: 19% (443/2330)
remote: Compressing objects: 20% (466/2330)
remote: Compressing objects: 21% (490/2330)
remote: Compressing objects: 22% (513/2330)
remote: Compressing objects: 23% (536/2330)
remote: Compressing objects: 23% (553/2330)
remote: Compressing objects: 24% (560/2330)
remote: Compressing objects: 25% (583/2330)
remote: Compressing objects: 26% (606/2330)
remote: Compressing objects: 27% (630/2330)
remote: Compressing objects: 28% (653/2330)
remote: Compressing objects: 29% (676/2330)
remote: Compressing objects: 30% (699/2330)
remote: Compressing objects: 31% (723/2330)
remote: Compressing objects: 32% (746/2330)
remote: Compressing objects: 32% (749/2330)
remote: Compressing objects: 33% (769/2330)
remote: Compressing objects: 34% (793/2330)
remote: Compressing objects: 35% (816/2330)
remote: Compressing objects: 36% (839/2330)
remote: Compressing objects: 37% (863/2330)
remote: Compressing objects: 38% (886/2330)
remote: Compressing objects: 39% (909/2330)
remote: Compressing objects: 40% (932/2330)
remote: Compressing objects: 41% (956/2330)
remote: Compressing objects: 42% (979/2330)
remote: Compressing objects: 43% (1002/2330)
remote: Compressing objects: 44% (1026/2330)
remote: Compressing objects: 45% (1049/2330)
remote: Compressing objects: 46% (1072/2330)
remote: Compressing objects: 47% (1096/2330)
remote: Compressing objects: 48% (1119/2330)
remote: Compressing objects: 49% (1142/2330)
remote: Compressing objects: 50% (1165/2330)
remote: Compressing objects: 51% (1189/2330)
remote: Compressing objects: 52% (1212/2330)
remote: Compressing objects: 53% (1235/2330)
remote: Compressing objects: 54% (1259/2330)
remote: Compressing objects: 55% (1282/2330)
remote: Compressing objects: 56% (1305/2330)
remote: Compressing objects: 57% (1329/2330)
remote: Compressing objects: 58% (1352/2330)
remote: Compressing objects: 59% (1375/2330)
remote: Compressing objects: 60% (1398/2330)
remote: Compressing objects: 61% (1422/2330)
remote: Compressing objects: 62% (1445/2330)
remote: Compressing objects: 63% (1468/2330)
remote: Compressing objects: 64% (1492/2330)
remote: Compressing objects: 65% (1515/2330)
remote: Compressing objects: 66% (1538/2330)
remote: Compressing objects: 67% (1562/2330)
remote: Compressing objects: 68% (1585/2330)
remote: Compressing objects: 69% (1608/2330)
remote: Compressing objects: 70% (1631/2330)
remote: Compressing objects: 71% (1655/2330)
remote: Compressing objects: 72% (1678/2330)
remote: Compressing objects: 73% (1701/2330)
remote: Compressing objects: 74% (1725/2330)
remote: Compressing objects: 75% (1748/2330)
remote: Compressing objects: 76% (1771/2330)
remote: Compressing objects: 77% (1795/2330)
remote: Compressing objects: 78% (1818/2330)
remote: Compressing objects: 79% (1841/2330)
remote: Compressing objects: 80% (1864/2330)
remote: Compressing objects: 81% (1888/2330)
remote: Compressing objects: 82% (1911/2330)
remote: Compressing objects: 83% (1934/2330)
remote: Compressing objects: 84% (1958/2330)
remote: Compressing objects: 85% (1981/2330)
remote: Compressing objects: 86% (2004/2330)
remote: Compressing objects: 87% (2028/2330)
remote: Compressing objects: 88% (2051/2330)
remote: Compressing objects: 89% (2074/2330)
remote: Compressing objects: 90% (2097/2330)
remote: Compressing objects: 91% (2121/2330)
remote: Compressing objects: 92% (2144/2330)
remote: Compressing objects: 93% (2167/2330)
remote: Compressing objects: 94% (2191/2330)
remote: Compressing objects: 95% (2214/2330)
remote: Compressing objects: 96% (2237/2330)
remote: Compressing objects: 97% (2261/2330)
remote: Compressing objects: 98% (2284/2330)
remote: Compressing objects: 99% (2307/2330)
remote: Compressing objects: 100% (2330/2330)
remote: Compressing objects: 100% (2330/2330), done.
8.26 s
Receiving objects: 0% (1/64191)
Receiving objects: 1% (642/64191)
Receiving objects: 2% (1284/64191)
Receiving objects: 3% (1926/64191)
Receiving objects: 4% (2568/64191)
Receiving objects: 5% (3210/64191)
Receiving objects: 6% (3852/64191), 5.18 MiB | 10.28 MiB/s
Receiving objects: 7% (4494/64191), 5.18 MiB | 10.28 MiB/s
Receiving objects: 8% (5136/64191), 5.18 MiB | 10.28 MiB/s
Receiving objects: 9% (5778/64191), 5.18 MiB | 10.28 MiB/s
Receiving objects: 10% (6420/64191), 5.18 MiB | 10.28 MiB/s
Receiving objects: 11% (7062/64191), 5.18 MiB | 10.28 MiB/s
Receiving objects: 12% (7703/64191), 5.18 MiB | 10.28 MiB/s
Receiving objects: 13% (8345/64191), 5.18 MiB | 10.28 MiB/s
Receiving objects: 14% (8987/64191), 5.18 MiB | 10.28 MiB/s
Receiving objects: 15% (9629/64191), 5.18 MiB | 10.28 MiB/s
Receiving objects: 16% (10271/64191), 5.18 MiB | 10.28 MiB/s
Receiving objects: 17% (10913/64191), 5.18 MiB | 10.28 MiB/s
Receiving objects: 18% (11555/64191), 5.18 MiB | 10.28 MiB/s
Receiving objects: 19% (12197/64191), 5.18 MiB | 10.28 MiB/s
Receiving objects: 20% (12839/64191), 5.18 MiB | 10.28 MiB/s
Receiving objects: 21% (13481/64191), 5.18 MiB | 10.28 MiB/s
Receiving objects: 22% (14123/64191), 5.18 MiB | 10.28 MiB/s
Receiving objects: 23% (14764/64191), 5.18 MiB | 10.28 MiB/s
Receiving objects: 24% (15406/64191), 5.18 MiB | 10.28 MiB/s
Receiving objects: 25% (16048/64191), 5.18 MiB | 10.28 MiB/s
Receiving objects: 26% (16690/64191), 5.18 MiB | 10.28 MiB/s
Receiving objects: 27% (17332/64191), 5.18 MiB | 10.28 MiB/s
Receiving objects: 28% (17974/64191), 5.18 MiB | 10.28 MiB/s
Receiving objects: 28% (18216/64191), 5.18 MiB | 10.28 MiB/s
Receiving objects: 29% (18616/64191), 5.18 MiB | 10.28 MiB/s
Receiving objects: 30% (19258/64191), 18.05 MiB | 17.99 MiB/s
Receiving objects: 31% (19900/64191), 18.05 MiB | 17.99 MiB/s
Receiving objects: 32% (20542/64191), 18.05 MiB | 17.99 MiB/s
Receiving objects: 33% (21184/64191), 18.05 MiB | 17.99 MiB/s
Receiving objects: 34% (21825/64191), 18.05 MiB | 17.99 MiB/s
Receiving objects: 35% (22467/64191), 18.05 MiB | 17.99 MiB/s
Receiving objects: 36% (23109/64191), 18.05 MiB | 17.99 MiB/s
Receiving objects: 37% (23751/64191), 18.05 MiB | 17.99 MiB/s
Receiving objects: 38% (24393/64191), 18.05 MiB | 17.99 MiB/s
Receiving objects: 39% (25035/64191), 18.05 MiB | 17.99 MiB/s
Receiving objects: 40% (25677/64191), 18.05 MiB | 17.99 MiB/s
Receiving objects: 41% (26319/64191), 18.05 MiB | 17.99 MiB/s
Receiving objects: 42% (26961/64191), 18.05 MiB | 17.99 MiB/s
Receiving objects: 43% (27603/64191), 18.05 MiB | 17.99 MiB/s
Receiving objects: 44% (28245/64191), 18.05 MiB | 17.99 MiB/s
Receiving objects: 45% (28886/64191), 18.05 MiB | 17.99 MiB/s
Receiving objects: 46% (29528/64191), 18.05 MiB | 17.99 MiB/s
Receiving objects: 47% (30170/64191), 18.05 MiB | 17.99 MiB/s
Receiving objects: 48% (30812/64191), 18.05 MiB | 17.99 MiB/s
Receiving objects: 49% (31454/64191), 18.05 MiB | 17.99 MiB/s
Receiving objects: 50% (32096/64191), 18.05 MiB | 17.99 MiB/s
Receiving objects: 51% (32738/64191), 18.05 MiB | 17.99 MiB/s
Receiving objects: 52% (33380/64191), 18.05 MiB | 17.99 MiB/s
Receiving objects: 53% (34022/64191), 18.05 MiB | 17.99 MiB/s
Receiving objects: 54% (34664/64191), 18.05 MiB | 17.99 MiB/s
Receiving objects: 55% (35306/64191), 18.05 MiB | 17.99 MiB/s
Receiving objects: 56% (35947/64191), 18.05 MiB | 17.99 MiB/s
Receiving objects: 57% (36589/64191), 39.86 MiB | 26.48 MiB/s
Receiving objects: 58% (37231/64191), 39.86 MiB | 26.48 MiB/s
Receiving objects: 59% (37873/64191), 39.86 MiB | 26.48 MiB/s
Receiving objects: 60% (38515/64191), 39.86 MiB | 26.48 MiB/s
Receiving objects: 60% (38724/64191), 39.86 MiB | 26.48 MiB/s
Receiving objects: 61% (39157/64191), 49.38 MiB | 24.63 MiB/s
Receiving objects: 62% (39799/64191), 49.38 MiB | 24.63 MiB/s
Receiving objects: 63% (40441/64191), 49.38 MiB | 24.63 MiB/s
Receiving objects: 64% (41083/64191), 49.38 MiB | 24.63 MiB/s
Receiving objects: 65% (41725/64191), 49.38 MiB | 24.63 MiB/s
Receiving objects: 66% (42367/64191), 49.38 MiB | 24.63 MiB/s
Receiving objects: 67% (43008/64191), 59.36 MiB | 23.69 MiB/s
Receiving objects: 68% (43650/64191), 59.36 MiB | 23.69 MiB/s
Receiving objects: 69% (44292/64191), 59.36 MiB | 23.69 MiB/s
Receiving objects: 70% (44934/64191), 59.36 MiB | 23.69 MiB/s
Receiving objects: 71% (45576/64191), 59.36 MiB | 23.69 MiB/s
Receiving objects: 72% (46218/64191), 59.36 MiB | 23.69 MiB/s
Receiving objects: 73% (46860/64191), 59.36 MiB | 23.69 MiB/s
Receiving objects: 74% (47502/64191), 59.36 MiB | 23.69 MiB/s
Receiving objects: 74% (48097/64191), 59.36 MiB | 23.69 MiB/s
Receiving objects: 75% (48144/64191), 69.64 MiB | 23.16 MiB/s
Receiving objects: 76% (48786/64191), 69.64 MiB | 23.16 MiB/s
Receiving objects: 77% (49428/64191), 69.64 MiB | 23.16 MiB/s
Receiving objects: 78% (50069/64191), 69.64 MiB | 23.16 MiB/s
Receiving objects: 79% (50711/64191), 69.64 MiB | 23.16 MiB/s
Receiving objects: 80% (51353/64191), 69.64 MiB | 23.16 MiB/s
Receiving objects: 81% (51995/64191), 69.64 MiB | 23.16 MiB/s
Receiving objects: 82% (52637/64191), 69.64 MiB | 23.16 MiB/s
Receiving objects: 83% (53279/64191), 69.64 MiB | 23.16 MiB/s
Receiving objects: 84% (53921/64191), 69.64 MiB | 23.16 MiB/s
Receiving objects: 85% (54563/64191), 80.19 MiB | 22.87 MiB/s
Receiving objects: 86% (55205/64191), 80.19 MiB | 22.87 MiB/s
Receiving objects: 87% (55847/64191), 80.19 MiB | 22.87 MiB/s
Receiving objects: 88% (56489/64191), 80.19 MiB | 22.87 MiB/s
Receiving objects: 89% (57130/64191), 80.19 MiB | 22.87 MiB/s
Receiving objects: 90% (57772/64191), 80.19 MiB | 22.87 MiB/s
Receiving objects: 91% (58414/64191), 80.19 MiB | 22.87 MiB/s
Receiving objects: 92% (59056/64191), 80.19 MiB | 22.87 MiB/s
Receiving objects: 93% (59698/64191), 80.19 MiB | 22.87 MiB/s
Receiving objects: 94% (60340/64191), 80.19 MiB | 22.87 MiB/s
Receiving objects: 95% (60982/64191), 80.19 MiB | 22.87 MiB/s
Receiving objects: 96% (61624/64191), 80.19 MiB | 22.87 MiB/s
Receiving objects: 96% (61699/64191), 80.19 MiB | 22.87 MiB/s
Receiving objects: 97% (62266/64191), 90.91 MiB | 22.69 MiB/s
Receiving objects: 98% (62908/64191), 90.91 MiB | 22.69 MiB/s
Receiving objects: 99% (63550/64191), 90.91 MiB | 22.69 MiB/s
remote: Total 64191 (delta 7391), reused 7767 (delta 6670), pack-reused 54646 (from 3)
8.34 s
Receiving objects: 100% (64191/64191), 90.91 MiB | 22.69 MiB/s
Receiving objects: 100% (64191/64191), 97.83 MiB | 22.66 MiB/s, done.
10.97 s
Resolving deltas: 0% (0/44321)
Resolving deltas: 1% (444/44321)
Resolving deltas: 2% (887/44321)
Resolving deltas: 3% (1330/44321)
Resolving deltas: 4% (1773/44321)
Resolving deltas: 5% (2217/44321)
Resolving deltas: 6% (2660/44321)
Resolving deltas: 7% (3103/44321)
Resolving deltas: 8% (3546/44321)
Resolving deltas: 9% (3989/44321)
Resolving deltas: 10% (4433/44321)
Resolving deltas: 11% (4878/44321)
Resolving deltas: 12% (5319/44321)
Resolving deltas: 13% (5762/44321)
Resolving deltas: 14% (6205/44321)
Resolving deltas: 15% (6649/44321)
Resolving deltas: 16% (7092/44321)
Resolving deltas: 17% (7535/44321)
Resolving deltas: 18% (7979/44321)
Resolving deltas: 19% (8421/44321)
Resolving deltas: 20% (8865/44321)
Resolving deltas: 21% (9308/44321)
Resolving deltas: 22% (9752/44321)
Resolving deltas: 23% (10195/44321)
Resolving deltas: 24% (10638/44321)
Resolving deltas: 25% (11081/44321)
Resolving deltas: 26% (11524/44321)
Resolving deltas: 27% (11968/44321)
Resolving deltas: 28% (12412/44321)
Resolving deltas: 29% (12854/44321)
Resolving deltas: 30% (13297/44321)
Resolving deltas: 31% (13740/44321)
Resolving deltas: 32% (14183/44321)
Resolving deltas: 33% (14626/44321)
Resolving deltas: 34% (15070/44321)
Resolving deltas: 35% (15513/44321)
Resolving deltas: 36% (15956/44321)
Resolving deltas: 37% (16399/44321)
Resolving deltas: 38% (16845/44321)
Resolving deltas: 39% (17286/44321)
Resolving deltas: 40% (17729/44321)
Resolving deltas: 41% (18172/44321)
Resolving deltas: 42% (18615/44321)
Resolving deltas: 43% (19059/44321)
Resolving deltas: 44% (19502/44321)
Resolving deltas: 45% (19945/44321)
Resolving deltas: 46% (20388/44321)
Resolving deltas: 47% (20831/44321)
Resolving deltas: 48% (21275/44321)
Resolving deltas: 49% (21718/44321)
Resolving deltas: 50% (22161/44321)
Resolving deltas: 51% (22604/44321)
Resolving deltas: 52% (23047/44321)
Resolving deltas: 53% (23491/44321)
Resolving deltas: 54% (23934/44321)
Resolving deltas: 55% (24377/44321)
Resolving deltas: 56% (24820/44321)
Resolving deltas: 57% (25263/44321)
Resolving deltas: 57% (25488/44321)
Resolving deltas: 58% (25707/44321)
Resolving deltas: 59% (26150/44321)
Resolving deltas: 60% (26593/44321)
Resolving deltas: 61% (27036/44321)
Resolving deltas: 62% (27480/44321)
Resolving deltas: 63% (27923/44321)
Resolving deltas: 64% (28366/44321)
Resolving deltas: 65% (28809/44321)
Resolving deltas: 66% (29252/44321)
Resolving deltas: 67% (29696/44321)
Resolving deltas: 68% (30139/44321)
Resolving deltas: 69% (30582/44321)
Resolving deltas: 70% (31025/44321)
Resolving deltas: 71% (31468/44321)
Resolving deltas: 72% (31912/44321)
Resolving deltas: 73% (32355/44321)
Resolving deltas: 74% (32798/44321)
Resolving deltas: 75% (33241/44321)
Resolving deltas: 76% (33684/44321)
Resolving deltas: 76% (33897/44321)
Resolving deltas: 77% (34128/44321)
Resolving deltas: 78% (34571/44321)
Resolving deltas: 79% (35014/44321)
Resolving deltas: 80% (35457/44321)
Resolving deltas: 81% (35901/44321)
Resolving deltas: 82% (36345/44321)
Resolving deltas: 83% (36787/44321)
Resolving deltas: 84% (37230/44321)
Resolving deltas: 85% (37673/44321)
Resolving deltas: 86% (38117/44321)
Resolving deltas: 87% (38560/44321)
Resolving deltas: 88% (39005/44321)
Resolving deltas: 89% (39446/44321)
Resolving deltas: 90% (39889/44321)
Resolving deltas: 91% (40333/44321)
Resolving deltas: 92% (40776/44321)
Resolving deltas: 93% (41219/44321)
Resolving deltas: 94% (41662/44321)
Resolving deltas: 95% (42105/44321)
Resolving deltas: 96% (42549/44321)
Resolving deltas: 97% (42992/44321)
Resolving deltas: 98% (43435/44321)
Resolving deltas: 99% (43878/44321)
Resolving deltas: 100% (44321/44321)
Resolving deltas: 100% (44321/44321), done.
14.27 s
Fetching commit 3d241888b215b0c37d1e347e0c8ddcee728dacfb for push-vrpyqyylypmw ...
14.32 s
$ /nix/store/bcnisk3ydfgv26v2gw3zlky24g00yww2-git-2.54.0/bin/git fetch origin 3d241888b215b0c37d1e347e0c8ddcee728dacfb
14.96 s
From https://github.com/alphal00p/gammaloop
14.96 s
* branch 3d241888b215b0c37d1e347e0c8ddcee728dacfb -> FETCH_HEAD
15.05 s
$ /nix/store/9ypz3flqsrl5xl495mm8h645gadjsxi1-coreutils-9.11/bin/timeout --kill-after=15s 7200s /nix/store/bcnisk3ydfgv26v2gw3zlky24g00yww2-git-2.54.0/bin/git -c advice.detachedHead=false checkout 3d241888b215b0c37d1e347e0c8ddcee728dacfb
15.41 s
HEAD is now at 3d241888 run documentation tests through the Nix CI secret runner
15.44 s
$ /nix/store/9ypz3flqsrl5xl495mm8h645gadjsxi1-coreutils-9.11/bin/timeout --kill-after=15s 7200s /nix/store/23zk8sgzamrbmj1fday15szf7f2279s8-nix-2.34.7/bin/nix --extra-experimental-features nix-command --extra-experimental-features flakes --log-format internal-json run .#packages.x86_64-linux.nix-ci-check-gammaloop-doctest --print-build-logs
38.63 s
39.08 s
Downloading cached busybox from https://cache.nix-ci.com
39.13 s
Downloading cached boehm-gc from https://cache.nix-ci.com
39.13 s
Downloading cached libseccomp-2.6.0-lib from https://cache.nix-ci.com
39.13 s
Downloading cached libarchive-3.8.8-lib from https://cache.nix-ci.com
39.13 s
Downloading cached libsodium-1.0.22-unstable-2026-04 from https://cache.nix-ci.com
39.13 s
Downloading cached editline-1.17.1-unstable-2025-05 from https://cache.nix-ci.com
39.13 s
Downloading cached libcpuid from https://cache.nix-ci.com
39.13 s
Downloading cached aws-c-common from https://cache.nix-ci.com
39.13 s
Downloading cached libgit2-1.9.4-lib from https://cache.nix-ci.com
39.13 s
Downloading cached lowdown-3.0.1-lib from https://cache.nix-ci.com
39.13 s
Downloading cached s2n-tls from https://cache.nix-ci.com
39.13 s
Downloading cached hwloc-2.14.0-lib from https://cache.nix-ci.com
39.22 s
Downloaded cached busybox (230 KiB) in 140ms
39.25 s
Downloaded cached boehm-gc (312 KiB) in 119ms
39.25 s
Downloaded cached libcpuid (326 KiB) in 120ms
39.25 s
Progress: 0 of 1 built, 1 of 36 downloaded from cache (11 downloading)
39.25 s
Progress: 0 of 1 built, 2 of 36 downloaded from cache (10 downloading)
39.25 s
Progress: 0 of 1 built, 3 of 36 downloaded from cache (9 downloading)
39.27 s
Downloaded cached libseccomp-2.6.0-lib (193 KiB) in 136ms
39.29 s
Downloaded cached editline-1.17.1-unstable-2025-05 (58 KiB) in 159ms
39.29 s
Downloaded cached lowdown-3.0.1-lib (341 KiB) in 163ms
39.30 s
Downloaded cached libsodium-1.0.22-unstable-2026-04 (666 KiB) in 168ms
39.32 s
Downloaded cached libarchive-3.8.8-lib (953 KiB) in 185ms
39.33 s
Progress: 0 of 1 built, 4 of 36 downloaded from cache (8 downloading)
39.33 s
Progress: 0 of 1 built, 5 of 36 downloaded from cache (7 downloading)
39.33 s
Progress: 0 of 1 built, 6 of 36 downloaded from cache (6 downloading)
39.33 s
Progress: 0 of 1 built, 7 of 36 downloaded from cache (5 downloading)
39.33 s
Progress: 0 of 1 built, 8 of 36 downloaded from cache (4 downloading)
39.33 s
Downloaded cached s2n-tls (1.3 MiB) in 203ms
39.33 s
Progress: 0 of 1 built, 9 of 36 downloaded from cache (3 downloading)
39.35 s
Downloaded cached hwloc-2.14.0-lib (459 KiB) in 222ms
39.36 s
Progress: 0 of 1 built, 10 of 36 downloaded from cache (2 downloading)
39.36 s
Downloaded cached libgit2-1.9.4-lib (1.6 MiB) in 232ms
39.36 s
Downloading cached onetbb from https://cache.nix-ci.com
39.38 s
Progress: 0 of 1 built, 11 of 36 downloaded from cache (2 downloading)
39.39 s
Downloaded cached aws-c-common (1.1 MiB) in 254ms
39.39 s
Progress: 0 of 1 built, 12 of 36 downloaded from cache (1 downloading)
39.39 s
Downloading cached aws-c-sdkutils from https://cache.nix-ci.com
39.39 s
Downloading cached aws-c-compression from https://cache.nix-ci.com
39.39 s
Downloading cached aws-checksums from https://cache.nix-ci.com
39.39 s
Downloading cached aws-c-cal from https://cache.nix-ci.com
39.45 s
Downloaded cached aws-c-sdkutils (155 KiB) in 67ms
39.45 s
Progress: 0 of 1 built, 13 of 36 downloaded from cache (4 downloading)
39.46 s
Downloaded cached onetbb (626 KiB) in 98ms
39.48 s
Downloaded cached aws-c-compression (31 KiB) in 94ms
39.48 s
Downloaded cached aws-checksums (86 KiB) in 97ms
39.48 s
Progress: 0 of 1 built, 14 of 36 downloaded from cache (3 downloading)
39.48 s
Progress: 0 of 1 built, 15 of 36 downloaded from cache (3 downloading)
39.48 s
Downloading cached libblake3 from https://cache.nix-ci.com
39.48 s
Progress: 0 of 1 built, 16 of 36 downloaded from cache (2 downloading)
39.49 s
Downloaded cached aws-c-cal (158 KiB) in 101ms
39.49 s
Progress: 0 of 1 built, 17 of 36 downloaded from cache (1 downloading)
39.49 s
Downloading cached aws-c-io from https://cache.nix-ci.com
39.56 s
Downloaded cached libblake3 (117 KiB) in 70ms
39.56 s
Progress: 0 of 1 built, 18 of 36 downloaded from cache (1 downloading)
39.56 s
Downloading cached nix-util from https://cache.nix-ci.com
39.60 s
Downloaded cached aws-c-io (648 KiB) in 107ms
39.60 s
Progress: 0 of 1 built, 19 of 36 downloaded from cache (1 downloading)
39.60 s
Downloading cached aws-c-event-stream from https://cache.nix-ci.com
39.60 s
Downloading cached aws-c-http from https://cache.nix-ci.com
39.67 s
Downloaded cached nix-util (2.4 MiB) in 110ms
39.67 s
Progress: 0 of 1 built, 20 of 36 downloaded from cache (2 downloading)
39.67 s
Downloading cached nix-nswrapper from https://cache.nix-ci.com
39.67 s
Downloaded cached aws-c-event-stream (176 KiB) in 76ms
39.69 s
Progress: 0 of 1 built, 21 of 36 downloaded from cache (2 downloading)
39.69 s
Downloaded cached aws-c-http (641 KiB) in 88ms
39.69 s
Progress: 0 of 1 built, 22 of 36 downloaded from cache (1 downloading)
39.69 s
Downloading cached aws-c-auth from https://cache.nix-ci.com
39.69 s
Downloading cached aws-c-mqtt from https://cache.nix-ci.com
39.74 s
Downloaded cached nix-nswrapper (131 KiB) in 77ms
39.74 s
Progress: 0 of 1 built, 23 of 36 downloaded from cache (2 downloading)
39.76 s
Downloaded cached aws-c-auth (387 KiB) in 67ms
39.77 s
Progress: 0 of 1 built, 24 of 36 downloaded from cache (1 downloading)
39.77 s
Downloading cached aws-c-s3 from https://cache.nix-ci.com
39.77 s
Downloaded cached aws-c-mqtt (557 KiB) in 86ms
39.78 s
Progress: 0 of 1 built, 25 of 36 downloaded from cache (1 downloading)
39.84 s
Downloaded cached aws-c-s3 (384 KiB) in 67ms
39.84 s
Progress: 0 of 1 built, 26 of 36 downloaded from cache
39.85 s
Downloading cached aws-crt-cpp from https://cache.nix-ci.com
39.93 s
Downloaded cached aws-crt-cpp (979 KiB) in 86ms
39.93 s
Progress: 0 of 1 built, 27 of 36 downloaded from cache
39.93 s
Downloading cached nix-store from https://cache.nix-ci.com
40.08 s
Downloaded cached nix-store (5.8 MiB) in 146ms
40.08 s
Progress: 0 of 1 built, 28 of 36 downloaded from cache
40.08 s
Downloading cached nix-main from https://cache.nix-ci.com
40.09 s
Downloading cached nix-fetchers from https://cache.nix-ci.com
40.17 s
Downloaded cached nix-main (393 KiB) in 85ms
40.18 s
Downloaded cached nix-fetchers (1.5 MiB) in 90ms
40.18 s
Progress: 0 of 1 built, 29 of 36 downloaded from cache (1 downloading)
40.18 s
Progress: 0 of 1 built, 30 of 36 downloaded from cache
40.18 s
Downloading cached nix-expr from https://cache.nix-ci.com
40.31 s
Downloaded cached nix-expr (3.3 MiB) in 132ms
40.31 s
Progress: 0 of 1 built, 31 of 36 downloaded from cache
40.31 s
Downloading cached nix-flake from https://cache.nix-ci.com
40.42 s
Downloaded cached nix-flake (956 KiB) in 104ms
40.42 s
Progress: 0 of 1 built, 32 of 36 downloaded from cache
40.42 s
Downloading cached nix-cmd from https://cache.nix-ci.com
40.50 s
Downloaded cached nix-cmd (1 MiB) in 83ms
40.50 s
Progress: 0 of 1 built, 33 of 36 downloaded from cache
40.51 s
Downloading cached nix from https://cache.nix-ci.com
40.60 s
Downloaded cached nix (3.9 MiB) in 96ms
40.60 s
Progress: 0 of 1 built, 34 of 36 downloaded from cache
40.61 s
Downloading cached nix from https://cache.nix-ci.com
40.69 s
Downloaded cached nix (8848 B) in 83ms
40.69 s
Progress: 0 of 1 built, 35 of 36 downloaded from cache
40.69 s
Downloading cached nix-ci-check-gammaloop-doctest from https://cache.nix-ci.com
40.75 s
Downloaded cached nix-ci-check-gammaloop-doctest (1000 B) in 64ms
40.75 s
Progress: 0 of 1 built, 36 of 36 downloaded from cache
45.92 s
evaluating derivation 'g
copying '/nix/store/4jdn
evaluating derivation 'g
querying gammaloop-works
querying info about miss
querying gammaloop-works
[0.0 KiB DL] querying in
[0 /1 built, 0.0 KiB DL]
[1 /0 /1 built, 0.0 KiB DLgammaloop-workspace-doctest> Running phase: unpackPhase
46.01 s
gammaloop-workspace-doctest> unpacking source archive /nix/store/9wvq6ybm6dprplm1h2869fg539dqvd85-source
46.17 s
gammaloop-workspace-doctest> source root is source
46.24 s
gammaloop-workspace-doctest> Running phase: patchPhase
46.30 s
gammaloop-workspace-doctest> Executing configureCargoCommonVars
46.31 s
gammaloop-workspace-doctest> decompressing cargo artifacts from /nix/store/kbgwngi7xvi54jsr0kp8rhj1b9mfja7d-gammaloop-workspace-deps-deps-0.1.0/target.tar.zst to target
50.59 s
gammaloop-workspace-doctest> Running phase: updateAutotoolsGnuConfigScriptsPhase
50.66 s
gammaloop-workspace-doctest> Running phase: configurePhase
50.66 s
gammaloop-workspace-doctest> will append /build/source/.cargo-home/config.toml with contents of /nix/store/xdy1vvhll2bijdplvl9fcc2b9plkxhaa-vendor-cargo-deps/config.toml
50.67 s
gammaloop-workspace-doctest> default configurePhase, nothing to do
50.68 s
gammaloop-workspace-doctest> Running phase: buildPhase
50.69 s
gammaloop-workspace-doctest> +++ command cargo --version
50.69 s
gammaloop-workspace-doctest> cargo 1.97.0 (c980f4866 2026-06-30)
50.74 s
gammaloop-workspace-doctest> +++ command cargo test --profile ci-optim --doc --locked --workspace --features gammaloop-api/cli,gammaloop-tracing-filter/clap,gammaloop-tracing-filter/symbolica,idenso/bincode,idenso/reference-cases,linnet/bincode,linnet/drawing,linnet/nodestore-vec,linnet/rkyv,linnet/serde,linnet/symbolica,spenso-macros/shadowing,spenso/shadowing,symbolica/tracing_max_level_info
51.39 s
gammaloop-workspace-doctest> Compiling target-lexicon v0.13.5
51.44 s
gammaloop-workspace-doctest> Compiling symbolica v2.2.0 (https://github.com/symbolica-dev/symbolica?branch=dev#0441bd7a)
51.44 s
gammaloop-workspace-doctest> Compiling maplit v1.0.2
51.44 s
gammaloop-workspace-doctest> Compiling gammaloop-tracing-filter-macros v0.1.0 (/build/source/crates/gammaloop-tracing-filter-macros)
51.44 s
gammaloop-workspace-doctest> Compiling vakint v0.1.2 (/build/source/crates/vakint)
51.44 s
gammaloop-workspace-doctest> Compiling gammalooprs v0.3.4 (/build/source/crates/gammalooprs)
51.44 s
gammaloop-workspace-doctest> Compiling alphal00p-docs-macros v0.1.0 (/build/source/crates/alphal00p-docs-macros)
51.44 s
gammaloop-workspace-doctest> Compiling alphal00p-docs-schema v0.1.0 (/build/source/crates/alphal00p-docs-schema)
51.44 s
gammaloop-workspace-doctest> Compiling rustc_version v0.4.1
51.44 s
gammaloop-workspace-doctest> Compiling bincode v1.3.3
51.44 s
gammaloop-workspace-doctest> Compiling target-triple v1.0.1
51.46 s
gammaloop-workspace-doctest> Compiling gungraun-runner v0.18.2
51.46 s
gammaloop-workspace-doctest> Compiling iai-callgrind-runner v0.14.2
51.47 s
gammaloop-workspace-doctest> Compiling clinnet v0.1.8 (/build/source/crates/clinnet)
51.53 s
gammaloop-workspace-doctest> Compiling gammaloop-integration-tests v0.1.0 (/build/source/tests)
52.06 s
gammaloop-workspace-doctest> Compiling wait-timeout v0.2.1
52.20 s
gammaloop-workspace-doctest> Compiling test-log-core v0.2.20
52.21 s
gammaloop-workspace-doctest> Compiling bit-vec v0.8.0
52.25 s
gammaloop-workspace-doctest> Compiling quick-error v1.2.3
52.32 s
gammaloop-workspace-doctest> Compiling iai-callgrind v0.14.2
52.51 s
gammaloop-workspace-doctest> Compiling rusty-fork v0.3.1
52.77 s
gammaloop-workspace-doctest> Compiling bit-set v0.8.0
52.80 s
gammaloop-workspace-doctest> Compiling iai-callgrind-macros v0.5.1
52.93 s
gammaloop-workspace-doctest> Compiling rand_xorshift v0.4.0
53.03 s
gammaloop-workspace-doctest> Compiling console v0.15.11
53.15 s
gammaloop-workspace-doctest> Compiling glob v0.3.4
53.46 s
gammaloop-workspace-doctest> Compiling gungraun-macros v0.8.0
53.80 s
gammaloop-workspace-doctest> Compiling termcolor v1.4.1
53.93 s
gammaloop-workspace-doctest> Compiling unarray v0.1.4
54.12 s
gammaloop-workspace-doctest> Compiling base64 v0.21.7
55.11 s
gammaloop-workspace-doctest> Compiling pyo3-build-config v0.28.3
55.33 s
gammaloop-workspace-doctest> Compiling ron v0.8.1
55.37 s
gammaloop-workspace-doctest> Compiling trybuild v1.0.120
55.65 s
gammaloop-workspace-doctest> Compiling proptest v1.11.0
55.96 s
gammaloop-workspace-doctest> Compiling similar-asserts v1.7.0
56.21 s
gammaloop-workspace-doctest> Compiling kurvst v0.1.0 (/build/source/crates/kurvst)
57.86 s
gammaloop-workspace-doctest> Compiling alphal00p-docs-catalogs v0.1.0 (/build/source/crates/alphal00p-docs-catalogs)
57.93 s
gammaloop-workspace-doctest> Compiling test-log-macros v0.2.20
57.95 s
gammaloop-workspace-doctest> Compiling alphal00p-docs-builder v0.1.0 (/build/source/crates/alphal00p-docs-builder)
64.72 s
gammaloop-workspace-doctest> Compiling test-log v0.2.20
70.21 s
gammaloop-workspace-doctest> Compiling alphal00p-docs-examples v0.1.0 (/build/source/crates/alphal00p-docs-examples)
77.78 s
gammaloop-workspace-doctest> Compiling pyo3-macros-backend v0.28.3
77.83 s
gammaloop-workspace-doctest> Compiling pyo3-ffi v0.28.3
78.38 s
gammaloop-workspace-doctest> Compiling pyo3 v0.28.3
78.55 s
gammaloop-workspace-doctest> Compiling numpy v0.28.0
79.49 s
gammaloop-workspace-doctest> Compiling gammaloop-api v0.1.0 (/build/source/crates/gammaloop-api)
80.07 s
gammaloop-workspace-doctest> Compiling gungraun v0.18.2
99.71 s
gammaloop-workspace-doctest> Compiling pyo3-macros v0.28.3
109.91 s
gammaloop-workspace-doctest> Compiling pyo3-stub-gen v0.17.2
111.59 s
gammaloop-workspace-doctest> Compiling numerica v2.2.0 (https://github.com/symbolica-dev/symbolica?branch=dev#0441bd7a)
115.57 s
gammaloop-workspace-doctest> Compiling graphica v2.1.0 (https://github.com/symbolica-dev/symbolica?branch=dev#0441bd7a)
121.55 s
gammaloop-workspace-doctest> Compiling symbolica-utils v0.1.0 (/build/source/crates/symbolica-utils)
389.46 s
gammaloop-workspace-doctest> Compiling gammaloop-workspace-hack v0.1.0 (/build/source/crates/gammaloop-workspace-hack)
389.51 s
gammaloop-workspace-doctest> Compiling spenso-macros v0.3.2 (/build/source/crates/spenso-macros)
389.61 s
gammaloop-workspace-doctest> Compiling linnet v0.17.0 (/build/source/crates/linnet)
392.49 s
gammaloop-workspace-doctest> Compiling spenso v0.6.0 (/build/source/crates/spenso)
400.53 s
gammaloop-workspace-doctest> Compiling idenso v0.3.0 (/build/source/crates/idenso)
400.58 s
gammaloop-workspace-doctest> Compiling gammaloop-tracing-filter v0.1.0 (/build/source/crates/gammaloop-tracing-filter)
404.56 s
gammaloop-workspace-doctest> Compiling spenso-hep-lib v0.1.7 (/build/source/crates/spenso-hep-lib)
404.76 s
gammaloop-workspace-doctest> Compiling spynso3 v0.1.2 (/build/source/crates/spynso3)
439.94 s
gammaloop-workspace-doctest> Compiling linnest v0.1.0 (/build/source/crates/linnest)
439.99 s
gammaloop-workspace-doctest> Compiling linnet-py v0.1.0 (/build/source/crates/linnet-py)
540.94 s
gammaloop-workspace-doctest> Finished `ci-optim` profile [optimized] target(s) in 8m 10s
541.81 s
gammaloop-workspace-doctest> warning : the following packages contain code that will be rejected by a future version of Rust: proc-macro-error2 v2.0.1
541.81 s
gammaloop-workspace-doctest> note : to see what the problems were, use the option `--future-incompat-report`, or run `cargo report future-incompatibilities --id 1`
541.81 s
gammaloop-workspace-doctest> Doc-tests alphal00p_docs_builder
541.81 s
gammaloop-workspace-doctest>
541.81 s
gammaloop-workspace-doctest> running 0 tests
541.81 s
gammaloop-workspace-doctest>
541.81 s
gammaloop-workspace-doctest> test result: ok. 0 passed; 0 failed; 0 ignored; 0 measured; 0 filtered out; finished in 0.00s
541.81 s
gammaloop-workspace-doctest>
541.81 s
gammaloop-workspace-doctest> Doc-tests alphal00p_docs_catalogs
542.37 s
gammaloop-workspace-doctest>
542.37 s
gammaloop-workspace-doctest> running 0 tests
542.37 s
gammaloop-workspace-doctest>
542.37 s
gammaloop-workspace-doctest> test result: ok. 0 passed; 0 failed; 0 ignored; 0 measured; 0 filtered out; finished in 0.00s
542.37 s
gammaloop-workspace-doctest>
542.37 s
gammaloop-workspace-doctest> Doc-tests alphal00p_docs_examples
542.38 s
gammaloop-workspace-doctest>
542.38 s
gammaloop-workspace-doctest> running 0 tests
542.38 s
gammaloop-workspace-doctest>
542.38 s
gammaloop-workspace-doctest> test result: ok. 0 passed; 0 failed; 0 ignored; 0 measured; 0 filtered out; finished in 0.00s
542.38 s
gammaloop-workspace-doctest>
542.38 s
gammaloop-workspace-doctest> Doc-tests alphal00p_docs
542.44 s
gammaloop-workspace-doctest>
542.44 s
gammaloop-workspace-doctest> running 0 tests
542.44 s
gammaloop-workspace-doctest>
542.44 s
gammaloop-workspace-doctest> test result: ok. 0 passed; 0 failed; 0 ignored; 0 measured; 0 filtered out; finished in 0.00s
542.44 s
gammaloop-workspace-doctest>
542.44 s
gammaloop-workspace-doctest> Doc-tests alphal00p_docs_schema
542.51 s
gammaloop-workspace-doctest>
542.51 s
gammaloop-workspace-doctest> running 0 tests
542.51 s
gammaloop-workspace-doctest>
542.51 s
gammaloop-workspace-doctest> test result: ok. 0 passed; 0 failed; 0 ignored; 0 measured; 0 filtered out; finished in 0.00s
542.51 s
gammaloop-workspace-doctest>
542.51 s
gammaloop-workspace-doctest> Doc-tests clinnet
542.54 s
gammaloop-workspace-doctest>
542.54 s
gammaloop-workspace-doctest> running 0 tests
542.54 s
gammaloop-workspace-doctest>
542.54 s
gammaloop-workspace-doctest> test result: ok. 0 passed; 0 failed; 0 ignored; 0 measured; 0 filtered out; finished in 0.00s
542.54 s
gammaloop-workspace-doctest>
542.55 s
gammaloop-workspace-doctest> Doc-tests gammaloop_api
543.42 s
gammaloop-workspace-doctest>
543.42 s
gammaloop-workspace-doctest> running 13 tests
543.43 s
gammaloop-workspace-doctest> test crates/gammaloop-api/src/python.rs - python::GammaLoopAPI::get_default_runtime_settings (line 3688) ... FAILED
543.43 s
gammaloop-workspace-doctest> test crates/gammaloop-api/src/python.rs - python::GammaLoopAPI::get_integrand_info (line 3496) ... FAILED
543.43 s
gammaloop-workspace-doctest> test crates/gammaloop-api/src/python.rs - python::GammaLoopAPI::get_active_command_blocks (line 3652) ... FAILED
543.43 s
gammaloop-workspace-doctest> test crates/gammaloop-api/src/python.rs - python::GammaLoopAPI::get_integrand_settings (line 3539) ... FAILED
543.43 s
gammaloop-workspace-doctest> test crates/gammaloop-api/src/python.rs - python::GammaLoopAPI::evaluate_samples (line 3040) ... FAILED
543.43 s
gammaloop-workspace-doctest> test crates/gammaloop-api/src/python.rs - python::GammaLoopAPI::evaluate_sample (line 2926) ... FAILED
543.52 s
gammaloop-workspace-doctest> test crates/gammaloop-api/src/python.rs - python::GammaLoopAPI::get_global_settings (line 3631) ... FAILED
543.52 s
gammaloop-workspace-doctest> test crates/gammaloop-api/src/python.rs - python::GammaLoopAPI::run_command (line 3793) ... FAILED
543.52 s
gammaloop-workspace-doctest> test crates/gammaloop-api/src/python.rs - python::GammaLoopAPI::get_run_history (line 3603) ... FAILED
543.53 s
gammaloop-workspace-doctest> test crates/gammaloop-api/src/python.rs - python::GammaLoopAPI::new_python (line 2804) ... FAILED
543.53 s
gammaloop-workspace-doctest> test crates/gammaloop-api/src/python.rs - python::evaluate_graph_overall_factor (line 95) ... FAILED
543.53 s
gammaloop-workspace-doctest> test crates/gammaloop-api/src/python.rs - python::atom_to_canonical_string (line 128) ... FAILED
543.53 s
gammaloop-workspace-doctest> test crates/gammaloop-api/src/python.rs - python::atom_to_dots (line 157) ... FAILED
543.53 s
gammaloop-workspace-doctest>
543.53 s
gammaloop-workspace-doctest> failures:
543.53 s
gammaloop-workspace-doctest>
543.53 s
gammaloop-workspace-doctest> ---- crates/gammaloop-api/src/python.rs - python::GammaLoopAPI::get_default_runtime_settings (line 3688) stdout ----
543.53 s
gammaloop-workspace-doctest> error: expected one of `!` or `::`, found `=`
543.53 s
gammaloop-workspace-doctest> --> crates/gammaloop-api/src/python.rs:3689:9
543.53 s
gammaloop-workspace-doctest> |
543.53 s
gammaloop-workspace-doctest> 3689 | runtime = api.get_default_runtime_settings()
543.53 s
gammaloop-workspace-doctest> | ^ expected one of `!` or `::`
543.53 s
gammaloop-workspace-doctest>
543.53 s
gammaloop-workspace-doctest> error: aborting due to 1 previous error
543.53 s
gammaloop-workspace-doctest>
543.53 s
gammaloop-workspace-doctest> Couldn't compile the test.
543.53 s
gammaloop-workspace-doctest> ---- crates/gammaloop-api/src/python.rs - python::GammaLoopAPI::get_integrand_info (line 3496) stdout ----
543.53 s
gammaloop-workspace-doctest> error: expected one of `!` or `::`, found `=`
543.53 s
gammaloop-workspace-doctest> --> crates/gammaloop-api/src/python.rs:3497:6
543.53 s
gammaloop-workspace-doctest> |
543.53 s
gammaloop-workspace-doctest> 3497 | info = api.get_integrand_info(process_id=0)
543.53 s
gammaloop-workspace-doctest> | ^ expected one of `!` or `::`
543.53 s
gammaloop-workspace-doctest>
543.53 s
gammaloop-workspace-doctest> error: aborting due to 1 previous error
543.53 s
gammaloop-workspace-doctest>
543.53 s
gammaloop-workspace-doctest> Couldn't compile the test.
543.53 s
gammaloop-workspace-doctest> ---- crates/gammaloop-api/src/python.rs - python::GammaLoopAPI::get_active_command_blocks (line 3652) stdout ----
543.53 s
gammaloop-workspace-doctest> error: expected item, found keyword `for`
543.53 s
gammaloop-workspace-doctest> --> crates/gammaloop-api/src/python.rs:3653:1
543.53 s
gammaloop-workspace-doctest> |
543.53 s
gammaloop-workspace-doctest> 3653 | for name, commands in api.get_active_command_blocks().items():
543.53 s
gammaloop-workspace-doctest> | ^^^ expected item
543.53 s
gammaloop-workspace-doctest> |
543.53 s
gammaloop-workspace-doctest> = note: for a full list of items that can appear in modules, see <https://doc.rust-lang.org/reference/items.html>
543.53 s
gammaloop-workspace-doctest>
543.53 s
gammaloop-workspace-doctest> error: aborting due to 1 previous error
543.53 s
gammaloop-workspace-doctest>
543.53 s
gammaloop-workspace-doctest> Couldn't compile the test.
543.53 s
gammaloop-workspace-doctest> ---- crates/gammaloop-api/src/python.rs - python::GammaLoopAPI::get_integrand_settings (line 3539) stdout ----
543.53 s
gammaloop-workspace-doctest> error: expected one of `!` or `::`, found `=`
543.53 s
gammaloop-workspace-doctest> --> crates/gammaloop-api/src/python.rs:3540:10
543.53 s
gammaloop-workspace-doctest> |
543.53 s
gammaloop-workspace-doctest> 3540 | settings = api.get_integrand_settings(process_id=0)
543.53 s
gammaloop-workspace-doctest> | ^ expected one of `!` or `::`
543.53 s
gammaloop-workspace-doctest>
543.53 s
gammaloop-workspace-doctest> error: aborting due to 1 previous error
543.53 s
gammaloop-workspace-doctest>
543.53 s
gammaloop-workspace-doctest> Couldn't compile the test.
543.53 s
gammaloop-workspace-doctest> ---- crates/gammaloop-api/src/python.rs - python::GammaLoopAPI::evaluate_samples (line 3040) stdout ----
543.53 s
gammaloop-workspace-doctest> error: expected one of `!` or `::`, found `=`
543.53 s
gammaloop-workspace-doctest> --> crates/gammaloop-api/src/python.rs:3041:8
543.53 s
gammaloop-workspace-doctest> |
543.53 s
gammaloop-workspace-doctest> 3041 | points = numpy.asarray(points, dtype=numpy.float64)
543.53 s
gammaloop-workspace-doctest> | ^ expected one of `!` or `::`
543.53 s
gammaloop-workspace-doctest>
543.53 s
gammaloop-workspace-doctest> error: aborting due to 1 previous error
543.53 s
gammaloop-workspace-doctest>
543.53 s
gammaloop-workspace-doctest> Couldn't compile the test.
543.53 s
gammaloop-workspace-doctest> ---- crates/gammaloop-api/src/python.rs - python::GammaLoopAPI::evaluate_sample (line 2926) stdout ----
543.53 s
gammaloop-workspace-doctest> error: expected one of `!` or `::`, found `=`
543.53 s
gammaloop-workspace-doctest> --> crates/gammaloop-api/src/python.rs:2927:8
543.53 s
gammaloop-workspace-doctest> |
543.53 s
gammaloop-workspace-doctest> 2927 | result = api.evaluate_sample(point, process_id=0, minimal_output=True)
543.53 s
gammaloop-workspace-doctest> | ^ expected one of `!` or `::`
543.53 s
gammaloop-workspace-doctest>
543.53 s
gammaloop-workspace-doctest> error: aborting due to 1 previous error
543.53 s
gammaloop-workspace-doctest>
543.53 s
gammaloop-workspace-doctest> Couldn't compile the test.
543.53 s
gammaloop-workspace-doctest> ---- crates/gammaloop-api/src/python.rs - python::GammaLoopAPI::get_global_settings (line 3631) stdout ----
543.53 s
gammaloop-workspace-doctest> error[E0425] : cannot find value `settings_toml` in this scope
543.53 s
gammaloop-workspace-doctest> --> crates/gammaloop-api/src/python.rs:3632:1
543.53 s
gammaloop-workspace-doctest> |
543.53 s
gammaloop-workspace-doctest> 3632 | settings_toml = api.get_global_settings()
543.53 s
gammaloop-workspace-doctest> | ^^^^^^^^^^^^^
543.53 s
gammaloop-workspace-doctest> |
543.53 s
gammaloop-workspace-doctest> help : you might have meant to introduce a new binding
543.53 s
gammaloop-workspace-doctest> |
543.53 s
gammaloop-workspace-doctest> 3632 | let settings_toml = api.get_global_settings()
543.53 s
gammaloop-workspace-doctest> | +++
543.53 s
gammaloop-workspace-doctest>
543.53 s
gammaloop-workspace-doctest> error[E0425] : cannot find value `api` in this scope
543.53 s
gammaloop-workspace-doctest> --> crates/gammaloop-api/src/python.rs:3632:17
543.53 s
gammaloop-workspace-doctest> |
543.53 s
gammaloop-workspace-doctest> 3632 | settings_toml = api.get_global_settings()
543.53 s
gammaloop-workspace-doctest> | ^^^ not found in this scope
543.53 s
gammaloop-workspace-doctest>
543.53 s
gammaloop-workspace-doctest> error : aborting due to 2 previous errors
543.53 s
gammaloop-workspace-doctest>
543.53 s
gammaloop-workspace-doctest> For more information about this error, try `rustc --explain E0425`.
543.53 s
gammaloop-workspace-doctest> Couldn't compile the test.
543.53 s
gammaloop-workspace-doctest> ---- crates/gammaloop-api/src/python.rs - python::GammaLoopAPI::run_command (line 3793) stdout ----
543.53 s
gammaloop-workspace-doctest> error[E0425] : cannot find value `api` in this scope
543.53 s
gammaloop-workspace-doctest> --> crates/gammaloop-api/src/python.rs:3794:1
543.53 s
gammaloop-workspace-doctest> |
543.53 s
gammaloop-workspace-doctest> 3794 | api.run("display processes")
543.53 s
gammaloop-workspace-doctest> | ^^^ not found in this scope
543.53 s
gammaloop-workspace-doctest>
543.53 s
gammaloop-workspace-doctest> error : aborting due to 1 previous error
543.53 s
gammaloop-workspace-doctest>
543.53 s
gammaloop-workspace-doctest> For more information about this error, try `rustc --explain E0425`.
543.53 s
gammaloop-workspace-doctest> Couldn't compile the test.
543.53 s
gammaloop-workspace-doctest> ---- crates/gammaloop-api/src/python.rs - python::GammaLoopAPI::get_run_history (line 3603) stdout ----
543.53 s
gammaloop-workspace-doctest> error[E0425] : cannot find value `run_card_toml` in this scope
543.53 s
gammaloop-workspace-doctest> --> crates/gammaloop-api/src/python.rs:3604:1
543.53 s
gammaloop-workspace-doctest> |
543.53 s
gammaloop-workspace-doctest> 3604 | run_card_toml = api.get_run_history()
543.53 s
gammaloop-workspace-doctest> | ^^^^^^^^^^^^^
543.53 s
gammaloop-workspace-doctest> |
543.53 s
gammaloop-workspace-doctest> help : you might have meant to introduce a new binding
543.53 s
gammaloop-workspace-doctest> |
543.53 s
gammaloop-workspace-doctest> 3604 | let run_card_toml = api.get_run_history()
543.53 s
gammaloop-workspace-doctest> | +++
543.53 s
gammaloop-workspace-doctest>
543.53 s
gammaloop-workspace-doctest> error[E0425] : cannot find value `api` in this scope
543.53 s
gammaloop-workspace-doctest> --> crates/gammaloop-api/src/python.rs:3604:17
543.53 s
gammaloop-workspace-doctest> |
543.53 s
gammaloop-workspace-doctest> 3604 | run_card_toml = api.get_run_history()
543.53 s
gammaloop-workspace-doctest> | ^^^ not found in this scope
543.53 s
gammaloop-workspace-doctest>
543.53 s
gammaloop-workspace-doctest> error : aborting due to 2 previous errors
543.53 s
gammaloop-workspace-doctest>
543.53 s
gammaloop-workspace-doctest> For more information about this error, try `rustc --explain E0425`.
543.53 s
gammaloop-workspace-doctest> Couldn't compile the test.
543.53 s
gammaloop-workspace-doctest> ---- crates/gammaloop-api/src/python.rs - python::GammaLoopAPI::new_python (line 2804) stdout ----
543.53 s
gammaloop-workspace-doctest> error[E0425] : cannot find value `api` in this scope
543.53 s
gammaloop-workspace-doctest> --> crates/gammaloop-api/src/python.rs:2805:1
543.53 s
gammaloop-workspace-doctest> |
543.53 s
gammaloop-workspace-doctest> 2805 | api = GammaLoopAPI(state_folder="./state", read_only_state=True)
543.53 s
gammaloop-workspace-doctest> | ^^^
543.53 s
gammaloop-workspace-doctest> |
543.53 s
gammaloop-workspace-doctest> help : you might have meant to introduce a new binding
543.53 s
gammaloop-workspace-doctest> |
543.53 s
gammaloop-workspace-doctest> 2805 | let api = GammaLoopAPI(state_folder="./state", read_only_state=True)
543.53 s
gammaloop-workspace-doctest> | +++
543.53 s
gammaloop-workspace-doctest>
543.53 s
gammaloop-workspace-doctest> error[E0425] : cannot find value `state_folder` in this scope
543.53 s
gammaloop-workspace-doctest> --> crates/gammaloop-api/src/python.rs:2805:20
543.53 s
gammaloop-workspace-doctest> |
543.53 s
gammaloop-workspace-doctest> 2805 | api = GammaLoopAPI(state_folder="./state", read_only_state=True)
543.53 s
gammaloop-workspace-doctest> | ^^^^^^^^^^^^ not found in this scope
543.53 s
gammaloop-workspace-doctest>
543.53 s
gammaloop-workspace-doctest> error[E0425] : cannot find value `read_only_state` in this scope
543.53 s
gammaloop-workspace-doctest> --> crates/gammaloop-api/src/python.rs:2805:44
543.53 s
gammaloop-workspace-doctest> |
543.53 s
gammaloop-workspace-doctest> 2805 | api = GammaLoopAPI(state_folder="./state", read_only_state=True)
543.53 s
gammaloop-workspace-doctest> | ^^^^^^^^^^^^^^^ not found in this scope
543.53 s
gammaloop-workspace-doctest>
543.53 s
gammaloop-workspace-doctest> error[E0425] : cannot find value `True` in this scope
543.53 s
gammaloop-workspace-doctest> --> crates/gammaloop-api/src/python.rs:2805:60
543.53 s
gammaloop-workspace-doctest> |
543.53 s
gammaloop-workspace-doctest> 2805 | api = GammaLoopAPI(state_folder="./state", read_only_state=True)
543.53 s
gammaloop-workspace-doctest> | ^^^^ not found in this scope
543.53 s
gammaloop-workspace-doctest> |
543.53 s
gammaloop-workspace-doctest> help : you may want to use a bool value instead
543.53 s
gammaloop-workspace-doctest> |
543.53 s
gammaloop-workspace-doctest> 2805 - api = GammaLoopAPI(state_folder="./state", read_only_state=True )
543.53 s
gammaloop-workspace-doctest> 2805 + api = GammaLoopAPI(state_folder="./state", read_only_state=true )
543.53 s
gammaloop-workspace-doctest> |
543.53 s
gammaloop-workspace-doctest>
543.53 s
gammaloop-workspace-doctest> error[E0425] : cannot find function, tuple struct or tuple variant `GammaLoopAPI` in this scope
543.53 s
gammaloop-workspace-doctest> --> crates/gammaloop-api/src/python.rs:2805:7
543.53 s
gammaloop-workspace-doctest> |
543.53 s
gammaloop-workspace-doctest> 2805 | api = GammaLoopAPI(state_folder="./state", read_only_state=True)
543.53 s
gammaloop-workspace-doctest> | ^^^^^^^^^^^^ not found in this scope
543.53 s
gammaloop-workspace-doctest>
543.53 s
gammaloop-workspace-doctest> error : aborting due to 5 previous errors
543.53 s
gammaloop-workspace-doctest>
543.53 s
gammaloop-workspace-doctest> For more information about this error, try `rustc --explain E0425`.
543.53 s
gammaloop-workspace-doctest> Couldn't compile the test.
543.53 s
gammaloop-workspace-doctest> ---- crates/gammaloop-api/src/python.rs - python::evaluate_graph_overall_factor (line 95) stdout ----
543.53 s
gammaloop-workspace-doctest> error[E0425] : cannot find function `evaluate_graph_overall_factor` in this scope
543.53 s
gammaloop-workspace-doctest> --> crates/gammaloop-api/src/python.rs:96:1
543.53 s
gammaloop-workspace-doctest> |
543.53 s
gammaloop-workspace-doctest> 96 | evaluate_graph_overall_factor(
543.53 s
gammaloop-workspace-doctest> | ^^^^^^^^^^^^^^^^^^^^^^^^^^^^^ not found in this scope
543.53 s
gammaloop-workspace-doctest>
543.53 s
gammaloop-workspace-doctest> error : aborting due to 1 previous error
543.53 s
gammaloop-workspace-doctest>
543.53 s
gammaloop-workspace-doctest> For more information about this error, try `rustc --explain E0425`.
543.53 s
gammaloop-workspace-doctest> Couldn't compile the test.
543.53 s
gammaloop-workspace-doctest> ---- crates/gammaloop-api/src/python.rs - python::atom_to_canonical_string (line 128) stdout ----
543.53 s
gammaloop-workspace-doctest> error[E0425] : cannot find function `atom_to_canonical_string` in this scope
543.53 s
gammaloop-workspace-doctest> --> crates/gammaloop-api/src/python.rs:129:1
543.53 s
gammaloop-workspace-doctest> |
543.53 s
gammaloop-workspace-doctest> 129 | atom_to_canonical_string("x + x")
543.53 s
gammaloop-workspace-doctest> | ^^^^^^^^^^^^^^^^^^^^^^^^ not found in this scope
543.53 s
gammaloop-workspace-doctest>
543.53 s
gammaloop-workspace-doctest> error : aborting due to 1 previous error
543.53 s
gammaloop-workspace-doctest>
543.53 s
gammaloop-workspace-doctest> For more information about this error, try `rustc --explain E0425`.
543.53 s
gammaloop-workspace-doctest> Couldn't compile the test.
543.53 s
gammaloop-workspace-doctest> ---- crates/gammaloop-api/src/python.rs - python::atom_to_dots (line 157) stdout ----
543.53 s
gammaloop-workspace-doctest> error[E0425] : cannot find function `to_dots` in this scope
543.53 s
gammaloop-workspace-doctest> --> crates/gammaloop-api/src/python.rs:158:1
543.53 s
gammaloop-workspace-doctest> |
543.53 s
gammaloop-workspace-doctest> 158 | to_dots("p(mu) * q(mu)")
543.53 s
gammaloop-workspace-doctest> | ^^^^^^^ not found in this scope
543.53 s
gammaloop-workspace-doctest>
543.53 s
gammaloop-workspace-doctest> error : aborting due to 1 previous error
543.53 s
gammaloop-workspace-doctest>
543.53 s
gammaloop-workspace-doctest> For more information about this error, try `rustc --explain E0425`.
543.53 s
gammaloop-workspace-doctest> Couldn't compile the test.
543.53 s
gammaloop-workspace-doctest>
543.53 s
gammaloop-workspace-doctest> failures:
543.53 s
gammaloop-workspace-doctest> crates/gammaloop-api/src/python.rs - python::GammaLoopAPI::evaluate_sample (line 2926)
543.53 s
gammaloop-workspace-doctest> crates/gammaloop-api/src/python.rs - python::GammaLoopAPI::evaluate_samples (line 3040)
543.53 s
gammaloop-workspace-doctest> crates/gammaloop-api/src/python.rs - python::GammaLoopAPI::get_active_command_blocks (line 3652)
543.53 s
gammaloop-workspace-doctest> crates/gammaloop-api/src/python.rs - python::GammaLoopAPI::get_default_runtime_settings (line 3688)
543.53 s
gammaloop-workspace-doctest> crates/gammaloop-api/src/python.rs - python::GammaLoopAPI::get_global_settings (line 3631)
543.53 s
gammaloop-workspace-doctest> crates/gammaloop-api/src/python.rs - python::GammaLoopAPI::get_integrand_info (line 3496)
543.53 s
gammaloop-workspace-doctest> crates/gammaloop-api/src/python.rs - python::GammaLoopAPI::get_integrand_settings (line 3539)
543.53 s
gammaloop-workspace-doctest> crates/gammaloop-api/src/python.rs - python::GammaLoopAPI::get_run_history (line 3603)
543.53 s
gammaloop-workspace-doctest> crates/gammaloop-api/src/python.rs - python::GammaLoopAPI::new_python (line 2804)
543.53 s
gammaloop-workspace-doctest> crates/gammaloop-api/src/python.rs - python::GammaLoopAPI::run_command (line 3793)
543.53 s
gammaloop-workspace-doctest> crates/gammaloop-api/src/python.rs - python::atom_to_canonical_string (line 128)
543.53 s
gammaloop-workspace-doctest> crates/gammaloop-api/src/python.rs - python::atom_to_dots (line 157)
543.53 s
gammaloop-workspace-doctest> crates/gammaloop-api/src/python.rs - python::evaluate_graph_overall_factor (line 95)
543.53 s
gammaloop-workspace-doctest>
543.53 s
gammaloop-workspace-doctest> test result: FAILED. 0 passed; 13 failed; 0 ignored; 0 measured; 0 filtered out; finished in 0.11s
543.53 s
gammaloop-workspace-doctest>
543.53 s
gammaloop-workspace-doctest> error : doctest failed, to rerun pass `-p gammaloop-api --doc`
544.02 s
error: Cannot build '/nix/store/1v2gvnq6liv4ivdz0v1ycq4ka2zd8ni3-gammaloop-workspace-doctest-0.1.0.drv '.
544.02 s
Reason: builder failed with exit code 101 .
544.02 s
Output paths:
544.02 s
/nix/store/2zwrpghrg0khyjn3zdyd48zm4jbgkj7j-gammaloop-workspace-doctest-0.1.0
544.02 s
Last 349 log lines:
544.02 s
> Running phase: unpackPhase
544.02 s
> unpacking source archive /nix/store/9wvq6ybm6dprplm1h2869fg539dqvd85-source
544.02 s
> source root is source
544.02 s
> Running phase: patchPhase
544.02 s
> Executing configureCargoCommonVars
544.02 s
> decompressing cargo artifacts from /nix/store/kbgwngi7xvi54jsr0kp8rhj1b9mfja7d-gammaloop-workspace-deps-deps-0.1.0/target.tar.zst to target
544.02 s
> Running phase: updateAutotoolsGnuConfigScriptsPhase
544.02 s
> Running phase: configurePhase
544.02 s
> will append /build/source/.cargo-home/config.toml with contents of /nix/store/xdy1vvhll2bijdplvl9fcc2b9plkxhaa-vendor-cargo-deps/config.toml
544.02 s
> default configurePhase, nothing to do
544.02 s
> Running phase: buildPhase
544.02 s
> +++ command cargo --version
544.02 s
> cargo 1.97.0 (c980f4866 2026-06-30)
544.02 s
> +++ command cargo test --profile ci-optim --doc --locked --workspace --features gammaloop-api/cli,gammaloop-tracing-filter/clap,gammaloop-tracing-filter/symbolica,idenso/bincode,idenso/reference-cases,linnet/bincode,linnet/drawing,linnet/nodestore-vec,linnet/rkyv,linnet/serde,linnet/symbolica,spenso-macros/shadowing,spenso/shadowing,symbolica/tracing_max_level_info
544.02 s
> Compiling target-lexicon v0.13.5
544.02 s
> Compiling symbolica v2.2.0 (https://github.com/symbolica-dev/symbolica?branch=dev#0441bd7a)
544.02 s
> Compiling maplit v1.0.2
544.02 s
> Compiling gammaloop-tracing-filter-macros v0.1.0 (/build/source/crates/gammaloop-tracing-filter-macros)
544.02 s
> Compiling vakint v0.1.2 (/build/source/crates/vakint)
544.02 s
> Compiling gammalooprs v0.3.4 (/build/source/crates/gammalooprs)
544.02 s
> Compiling alphal00p-docs-macros v0.1.0 (/build/source/crates/alphal00p-docs-macros)
544.02 s
> Compiling alphal00p-docs-schema v0.1.0 (/build/source/crates/alphal00p-docs-schema)
544.02 s
> Compiling rustc_version v0.4.1
544.02 s
> Compiling bincode v1.3.3
544.02 s
> Compiling target-triple v1.0.1
544.02 s
> Compiling gungraun-runner v0.18.2
544.02 s
> Compiling iai-callgrind-runner v0.14.2
544.02 s
> Compiling clinnet v0.1.8 (/build/source/crates/clinnet)
544.02 s
> Compiling gammaloop-integration-tests v0.1.0 (/build/source/tests)
544.02 s
> Compiling wait-timeout v0.2.1
544.02 s
> Compiling test-log-core v0.2.20
544.02 s
> Compiling bit-vec v0.8.0
544.02 s
> Compiling quick-error v1.2.3
544.02 s
> Compiling iai-callgrind v0.14.2
544.02 s
> Compiling rusty-fork v0.3.1
544.02 s
> Compiling bit-set v0.8.0
544.02 s
> Compiling iai-callgrind-macros v0.5.1
544.02 s
> Compiling rand_xorshift v0.4.0
544.02 s
> Compiling console v0.15.11
544.02 s
> Compiling glob v0.3.4
544.02 s
> Compiling gungraun-macros v0.8.0
544.02 s
> Compiling termcolor v1.4.1
544.02 s
> Compiling unarray v0.1.4
544.02 s
> Compiling base64 v0.21.7
544.02 s
> Compiling pyo3-build-config v0.28.3
544.02 s
> Compiling ron v0.8.1
544.02 s
> Compiling trybuild v1.0.120
544.02 s
> Compiling proptest v1.11.0
544.02 s
> Compiling similar-asserts v1.7.0
544.02 s
> Compiling kurvst v0.1.0 (/build/source/crates/kurvst)
544.02 s
> Compiling alphal00p-docs-catalogs v0.1.0 (/build/source/crates/alphal00p-docs-catalogs)
544.02 s
> Compiling test-log-macros v0.2.20
544.02 s
> Compiling alphal00p-docs-builder v0.1.0 (/build/source/crates/alphal00p-docs-builder)
544.02 s
> Compiling test-log v0.2.20
544.02 s
> Compiling alphal00p-docs-examples v0.1.0 (/build/source/crates/alphal00p-docs-examples)
544.02 s
> Compiling pyo3-macros-backend v0.28.3
544.02 s
> Compiling pyo3-ffi v0.28.3
544.02 s
> Compiling pyo3 v0.28.3
544.02 s
> Compiling numpy v0.28.0
544.02 s
> Compiling gammaloop-api v0.1.0 (/build/source/crates/gammaloop-api)
544.02 s
> Compiling gungraun v0.18.2
544.02 s
> Compiling pyo3-macros v0.28.3
544.02 s
> Compiling pyo3-stub-gen v0.17.2
544.02 s
> Compiling numerica v2.2.0 (https://github.com/symbolica-dev/symbolica?branch=dev#0441bd7a)
544.02 s
> Compiling graphica v2.1.0 (https://github.com/symbolica-dev/symbolica?branch=dev#0441bd7a)
544.02 s
> Compiling symbolica-utils v0.1.0 (/build/source/crates/symbolica-utils)
544.02 s
> Compiling gammaloop-workspace-hack v0.1.0 (/build/source/crates/gammaloop-workspace-hack)
544.02 s
> Compiling spenso-macros v0.3.2 (/build/source/crates/spenso-macros)
544.02 s
> Compiling linnet v0.17.0 (/build/source/crates/linnet)
544.02 s
> Compiling spenso v0.6.0 (/build/source/crates/spenso)
544.02 s
> Compiling idenso v0.3.0 (/build/source/crates/idenso)
544.02 s
> Compiling gammaloop-tracing-filter v0.1.0 (/build/source/crates/gammaloop-tracing-filter)
544.02 s
> Compiling spenso-hep-lib v0.1.7 (/build/source/crates/spenso-hep-lib)
544.02 s
> Compiling spynso3 v0.1.2 (/build/source/crates/spynso3)
544.02 s
> Compiling linnest v0.1.0 (/build/source/crates/linnest)
544.02 s
> Compiling linnet-py v0.1.0 (/build/source/crates/linnet-py)
544.02 s
> Finished `ci-optim` profile [optimized] target(s) in 8m 10s
544.02 s
> warning : the following packages contain code that will be rejected by a future version of Rust: proc-macro-error2 v2.0.1
544.02 s
> note : to see what the problems were, use the option `--future-incompat-report`, or run `cargo report future-incompatibilities --id 1`
544.02 s
> Doc-tests alphal00p_docs_builder
544.02 s
>
544.02 s
> running 0 tests
544.02 s
>
544.02 s
> test result: ok. 0 passed; 0 failed; 0 ignored; 0 measured; 0 filtered out; finished in 0.00s
544.02 s
>
544.02 s
> Doc-tests alphal00p_docs_catalogs
544.02 s
>
544.02 s
> running 0 tests
544.02 s
>
544.02 s
> test result: ok. 0 passed; 0 failed; 0 ignored; 0 measured; 0 filtered out; finished in 0.00s
544.02 s
>
544.02 s
> Doc-tests alphal00p_docs_examples
544.02 s
>
544.02 s
> running 0 tests
544.02 s
>
544.02 s
> test result: ok. 0 passed; 0 failed; 0 ignored; 0 measured; 0 filtered out; finished in 0.00s
544.02 s
>
544.02 s
> Doc-tests alphal00p_docs
544.02 s
>
544.02 s
> running 0 tests
544.02 s
>
544.02 s
> test result: ok. 0 passed; 0 failed; 0 ignored; 0 measured; 0 filtered out; finished in 0.00s
544.02 s
>
544.02 s
> Doc-tests alphal00p_docs_schema
544.02 s
>
544.02 s
> running 0 tests
544.02 s
>
544.02 s
> test result: ok. 0 passed; 0 failed; 0 ignored; 0 measured; 0 filtered out; finished in 0.00s
544.02 s
>
544.02 s
> Doc-tests clinnet
544.02 s
>
544.02 s
> running 0 tests
544.02 s
>
544.02 s
> test result: ok. 0 passed; 0 failed; 0 ignored; 0 measured; 0 filtered out; finished in 0.00s
544.02 s
>
544.02 s
> Doc-tests gammaloop_api
544.02 s
>
544.02 s
> running 13 tests
544.02 s
> test crates/gammaloop-api/src/python.rs - python::GammaLoopAPI::get_default_runtime_settings (line 3688) ... FAILED
544.02 s
> test crates/gammaloop-api/src/python.rs - python::GammaLoopAPI::get_integrand_info (line 3496) ... FAILED
544.02 s
> test crates/gammaloop-api/src/python.rs - python::GammaLoopAPI::get_active_command_blocks (line 3652) ... FAILED
544.02 s
> test crates/gammaloop-api/src/python.rs - python::GammaLoopAPI::get_integrand_settings (line 3539) ... FAILED
544.02 s
> test crates/gammaloop-api/src/python.rs - python::GammaLoopAPI::evaluate_samples (line 3040) ... FAILED
544.02 s
> test crates/gammaloop-api/src/python.rs - python::GammaLoopAPI::evaluate_sample (line 2926) ... FAILED
544.02 s
> test crates/gammaloop-api/src/python.rs - python::GammaLoopAPI::get_global_settings (line 3631) ... FAILED
544.02 s
> test crates/gammaloop-api/src/python.rs - python::GammaLoopAPI::run_command (line 3793) ... FAILED
544.02 s
> test crates/gammaloop-api/src/python.rs - python::GammaLoopAPI::get_run_history (line 3603) ... FAILED
544.02 s
> test crates/gammaloop-api/src/python.rs - python::GammaLoopAPI::new_python (line 2804) ... FAILED
544.02 s
> test crates/gammaloop-api/src/python.rs - python::evaluate_graph_overall_factor (line 95) ... FAILED
544.02 s
> test crates/gammaloop-api/src/python.rs - python::atom_to_canonical_string (line 128) ... FAILED
544.02 s
> test crates/gammaloop-api/src/python.rs - python::atom_to_dots (line 157) ... FAILED
544.02 s
>
544.02 s
> failures:
544.02 s
>
544.02 s
> ---- crates/gammaloop-api/src/python.rs - python::GammaLoopAPI::get_default_runtime_settings (line 3688) stdout ----
544.02 s
> error: expected one of `!` or `::`, found `=`
544.02 s
> --> crates/gammaloop-api/src/python.rs:3689:9
544.02 s
> |
544.02 s
> 3689 | runtime = api.get_default_runtime_settings()
544.02 s
> | ^ expected one of `!` or `::`
544.02 s
>
544.02 s
> error: aborting due to 1 previous error
544.02 s
>
544.02 s
> Couldn't compile the test.
544.02 s
> ---- crates/gammaloop-api/src/python.rs - python::GammaLoopAPI::get_integrand_info (line 3496) stdout ----
544.02 s
> error: expected one of `!` or `::`, found `=`
544.02 s
> --> crates/gammaloop-api/src/python.rs:3497:6
544.02 s
> |
544.02 s
> 3497 | info = api.get_integrand_info(process_id=0)
544.02 s
> | ^ expected one of `!` or `::`
544.02 s
>
544.02 s
> error: aborting due to 1 previous error
544.02 s
>
544.02 s
> Couldn't compile the test.
544.02 s
> ---- crates/gammaloop-api/src/python.rs - python::GammaLoopAPI::get_active_command_blocks (line 3652) stdout ----
544.02 s
> error: expected item, found keyword `for`
544.02 s
> --> crates/gammaloop-api/src/python.rs:3653:1
544.02 s
> |
544.02 s
> 3653 | for name, commands in api.get_active_command_blocks().items():
544.02 s
> | ^^^ expected item
544.02 s
> |
544.02 s
> = note: for a full list of items that can appear in modules, see <https://doc.rust-lang.org/reference/items.html>
544.02 s
>
544.02 s
> error: aborting due to 1 previous error
544.02 s
>
544.02 s
> Couldn't compile the test.
544.02 s
> ---- crates/gammaloop-api/src/python.rs - python::GammaLoopAPI::get_integrand_settings (line 3539) stdout ----
544.02 s
> error: expected one of `!` or `::`, found `=`
544.02 s
> --> crates/gammaloop-api/src/python.rs:3540:10
544.02 s
> |
544.02 s
> 3540 | settings = api.get_integrand_settings(process_id=0)
544.02 s
> | ^ expected one of `!` or `::`
544.02 s
>
544.02 s
> error: aborting due to 1 previous error
544.02 s
>
544.02 s
> Couldn't compile the test.
544.02 s
> ---- crates/gammaloop-api/src/python.rs - python::GammaLoopAPI::evaluate_samples (line 3040) stdout ----
544.02 s
> error: expected one of `!` or `::`, found `=`
544.02 s
> --> crates/gammaloop-api/src/python.rs:3041:8
544.02 s
> |
544.02 s
> 3041 | points = numpy.asarray(points, dtype=numpy.float64)
544.02 s
> | ^ expected one of `!` or `::`
544.02 s
>
544.02 s
> error: aborting due to 1 previous error
544.02 s
>
544.02 s
> Couldn't compile the test.
544.02 s
> ---- crates/gammaloop-api/src/python.rs - python::GammaLoopAPI::evaluate_sample (line 2926) stdout ----
544.02 s
> error: expected one of `!` or `::`, found `=`
544.02 s
> --> crates/gammaloop-api/src/python.rs:2927:8
544.02 s
> |
544.02 s
> 2927 | result = api.evaluate_sample(point, process_id=0, minimal_output=True)
544.02 s
> | ^ expected one of `!` or `::`
544.02 s
>
544.02 s
> error: aborting due to 1 previous error
544.02 s
>
544.02 s
> Couldn't compile the test.
544.02 s
> ---- crates/gammaloop-api/src/python.rs - python::GammaLoopAPI::get_global_settings (line 3631) stdout ----
544.02 s
> error[E0425] : cannot find value `settings_toml` in this scope
544.02 s
> --> crates/gammaloop-api/src/python.rs:3632:1
544.02 s
> |
544.02 s
> 3632 | settings_toml = api.get_global_settings()
544.02 s
> | ^^^^^^^^^^^^^
544.02 s
> |
544.02 s
> help : you might have meant to introduce a new binding
544.02 s
> |
544.02 s
> 3632 | let settings_toml = api.get_global_settings()
544.02 s
> | +++
544.02 s
>
544.02 s
> error[E0425] : cannot find value `api` in this scope
544.02 s
> --> crates/gammaloop-api/src/python.rs:3632:17
544.02 s
> |
544.02 s
> 3632 | settings_toml = api.get_global_settings()
544.02 s
> | ^^^ not found in this scope
544.02 s
>
544.02 s
> error : aborting due to 2 previous errors
544.02 s
>
544.02 s
> For more information about this error, try `rustc --explain E0425`.
544.02 s
> Couldn't compile the test.
544.02 s
> ---- crates/gammaloop-api/src/python.rs - python::GammaLoopAPI::run_command (line 3793) stdout ----
544.02 s
> error[E0425] : cannot find value `api` in this scope
544.02 s
> --> crates/gammaloop-api/src/python.rs:3794:1
544.02 s
> |
544.02 s
> 3794 | api.run("display processes")
544.02 s
> | ^^^ not found in this scope
544.02 s
>
544.02 s
> error : aborting due to 1 previous error
544.02 s
>
544.02 s
> For more information about this error, try `rustc --explain E0425`.
544.02 s
> Couldn't compile the test.
544.02 s
> ---- crates/gammaloop-api/src/python.rs - python::GammaLoopAPI::get_run_history (line 3603) stdout ----
544.02 s
> error[E0425] : cannot find value `run_card_toml` in this scope
544.02 s
> --> crates/gammaloop-api/src/python.rs:3604:1
544.02 s
> |
544.02 s
> 3604 | run_card_toml = api.get_run_history()
544.02 s
> | ^^^^^^^^^^^^^
544.02 s
> |
544.02 s
> help : you might have meant to introduce a new binding
544.02 s
> |
544.02 s
> 3604 | let run_card_toml = api.get_run_history()
544.02 s
> | +++
544.02 s
>
544.02 s
> error[E0425] : cannot find value `api` in this scope
544.02 s
> --> crates/gammaloop-api/src/python.rs:3604:17
544.02 s
> |
544.02 s
> 3604 | run_card_toml = api.get_run_history()
544.02 s
> | ^^^ not found in this scope
544.02 s
>
544.02 s
> error : aborting due to 2 previous errors
544.02 s
>
544.02 s
> For more information about this error, try `rustc --explain E0425`.
544.02 s
> Couldn't compile the test.
544.02 s
> ---- crates/gammaloop-api/src/python.rs - python::GammaLoopAPI::new_python (line 2804) stdout ----
544.02 s
> error[E0425] : cannot find value `api` in this scope
544.02 s
> --> crates/gammaloop-api/src/python.rs:2805:1
544.02 s
> |
544.02 s
> 2805 | api = GammaLoopAPI(state_folder="./state", read_only_state=True)
544.02 s
> | ^^^
544.02 s
> |
544.02 s
> help : you might have meant to introduce a new binding
544.02 s
> |
544.02 s
> 2805 | let api = GammaLoopAPI(state_folder="./state", read_only_state=True)
544.02 s
> | +++
544.02 s
>
544.02 s
> error[E0425] : cannot find value `state_folder` in this scope
544.02 s
> --> crates/gammaloop-api/src/python.rs:2805:20
544.02 s
> |
544.02 s
> 2805 | api = GammaLoopAPI(state_folder="./state", read_only_state=True)
544.02 s
> | ^^^^^^^^^^^^ not found in this scope
544.02 s
>
544.02 s
> error[E0425] : cannot find value `read_only_state` in this scope
544.02 s
> --> crates/gammaloop-api/src/python.rs:2805:44
544.02 s
> |
544.02 s
> 2805 | api = GammaLoopAPI(state_folder="./state", read_only_state=True)
544.02 s
> | ^^^^^^^^^^^^^^^ not found in this scope
544.02 s
>
544.02 s
> error[E0425] : cannot find value `True` in this scope
544.02 s
> --> crates/gammaloop-api/src/python.rs:2805:60
544.02 s
> |
544.02 s
> 2805 | api = GammaLoopAPI(state_folder="./state", read_only_state=True)
544.02 s
> | ^^^^ not found in this scope
544.02 s
> |
544.02 s
> help : you may want to use a bool value instead
544.02 s
> |
544.02 s
> 2805 - api = GammaLoopAPI(state_folder="./state", read_only_state=True )
544.02 s
> 2805 + api = GammaLoopAPI(state_folder="./state", read_only_state=true )
544.02 s
> |
544.02 s
>
544.02 s
> error[E0425] : cannot find function, tuple struct or tuple variant `GammaLoopAPI` in this scope
544.02 s
> --> crates/gammaloop-api/src/python.rs:2805:7
544.02 s
> |
544.02 s
> 2805 | api = GammaLoopAPI(state_folder="./state", read_only_state=True)
544.02 s
> | ^^^^^^^^^^^^ not found in this scope
544.02 s
>
544.02 s
> error : aborting due to 5 previous errors
544.02 s
>
544.02 s
> For more information about this error, try `rustc --explain E0425`.
544.02 s
> Couldn't compile the test.
544.02 s
> ---- crates/gammaloop-api/src/python.rs - python::evaluate_graph_overall_factor (line 95) stdout ----
544.02 s
> error[E0425] : cannot find function `evaluate_graph_overall_factor` in this scope
544.02 s
> --> crates/gammaloop-api/src/python.rs:96:1
544.02 s
> |
544.02 s
> 96 | evaluate_graph_overall_factor(
544.02 s
> | ^^^^^^^^^^^^^^^^^^^^^^^^^^^^^ not found in this scope
544.02 s
>
544.02 s
> error : aborting due to 1 previous error
544.02 s
>
544.02 s
> For more information about this error, try `rustc --explain E0425`.
544.02 s
> Couldn't compile the test.
544.02 s
> ---- crates/gammaloop-api/src/python.rs - python::atom_to_canonical_string (line 128) stdout ----
544.02 s
> error[E0425] : cannot find function `atom_to_canonical_string` in this scope
544.02 s
> --> crates/gammaloop-api/src/python.rs:129:1
544.02 s
> |
544.02 s
> 129 | atom_to_canonical_string("x + x")
544.02 s
> | ^^^^^^^^^^^^^^^^^^^^^^^^ not found in this scope
544.02 s
>
544.02 s
> error : aborting due to 1 previous error
544.02 s
>
544.02 s
> For more information about this error, try `rustc --explain E0425`.
544.02 s
> Couldn't compile the test.
544.02 s
> ---- crates/gammaloop-api/src/python.rs - python::atom_to_dots (line 157) stdout ----
544.02 s
> error[E0425] : cannot find function `to_dots` in this scope
544.02 s
> --> crates/gammaloop-api/src/python.rs:158:1
544.02 s
> |
544.02 s
> 158 | to_dots("p(mu) * q(mu)")
544.02 s
> | ^^^^^^^ not found in this scope
544.02 s
>
544.02 s
> error : aborting due to 1 previous error
544.02 s
>
544.02 s
> For more information about this error, try `rustc --explain E0425`.
544.02 s
> Couldn't compile the test.
544.02 s
>
544.02 s
> failures:
544.02 s
> crates/gammaloop-api/src/python.rs - python::GammaLoopAPI::evaluate_sample (line 2926)
544.02 s
> crates/gammaloop-api/src/python.rs - python::GammaLoopAPI::evaluate_samples (line 3040)
544.02 s
> crates/gammaloop-api/src/python.rs - python::GammaLoopAPI::get_active_command_blocks (line 3652)
544.02 s
> crates/gammaloop-api/src/python.rs - python::GammaLoopAPI::get_default_runtime_settings (line 3688)
544.02 s
> crates/gammaloop-api/src/python.rs - python::GammaLoopAPI::get_global_settings (line 3631)
544.02 s
> crates/gammaloop-api/src/python.rs - python::GammaLoopAPI::get_integrand_info (line 3496)
544.02 s
> crates/gammaloop-api/src/python.rs - python::GammaLoopAPI::get_integrand_settings (line 3539)
544.02 s
> crates/gammaloop-api/src/python.rs - python::GammaLoopAPI::get_run_history (line 3603)
544.02 s
> crates/gammaloop-api/src/python.rs - python::GammaLoopAPI::new_python (line 2804)
544.02 s
> crates/gammaloop-api/src/python.rs - python::GammaLoopAPI::run_command (line 3793)
544.02 s
> crates/gammaloop-api/src/python.rs - python::atom_to_canonical_string (line 128)
544.02 s
> crates/gammaloop-api/src/python.rs - python::atom_to_dots (line 157)
544.02 s
> crates/gammaloop-api/src/python.rs - python::evaluate_graph_overall_factor (line 95)
544.02 s
>
544.02 s
> test result: FAILED. 0 passed; 13 failed; 0 ignored; 0 measured; 0 filtered out; finished in 0.11s
544.02 s
>
544.02 s
> error : doctest failed, to rerun pass `-p gammaloop-api --doc`
544.02 s
For full logs, run:
544.02 s
nix log /nix/store/1v2gvnq6liv4ivdz0v1ycq4ka2zd8ni3-gammaloop-workspace-doctest-0.1.0.drv
544.10 s
[0 built (1 failed ), 0.0 Run failed.