test packages.x86_64-linux.nix-ci-check-gammaloop-doctest

Reproduce this run
Original Run
  1. 1.07 s $ /nix/store/9ypz3flqsrl5xl495mm8h645gadjsxi1-coreutils-9.11/bin/timeout --kill-after=15s 7200s /nix/store/23zk8sgzamrbmj1fday15szf7f2279s8-nix-2.34.7/bin/nix --extra-experimental-features nix-command --extra-experimental-features flakes flake clone git+https://github.com/alphal00p/gammaloop --dest /tmp/nix-ci-worker/stable-pwd/repo/
  2. 1.12 s Cloning into '/tmp/nix-ci-worker/stable-pwd/repo'...
  3. 1.12 s remote: Enumerating objects: 64191, done.
  4. 1.18 s remote: Counting objects: 0% (1/9545) remote: Counting objects: 1% (96/9545) remote: Counting objects: 2% (191/9545) remote: Counting objects: 3% (287/9545) remote: Counting objects: 4% (382/9545) remote: Counting objects: 5% (478/9545) remote: Counting objects: 6% (573/9545) remote: Counting objects: 7% (669/9545) remote: Counting objects: 8% (764/9545) remote: Counting objects: 9% (860/9545) remote: Counting objects: 10% (955/9545) remote: Counting objects: 11% (1050/9545) remote: Counting objects: 12% (1146/9545) remote: Counting objects: 13% (1241/9545) remote: Counting objects: 14% (1337/9545) remote: Counting objects: 15% (1432/9545) remote: Counting objects: 16% (1528/9545) remote: Counting objects: 17% (1623/9545) remote: Counting objects: 18% (1719/9545) remote: Counting objects: 19% (1814/9545) remote: Counting objects: 20% (1909/9545) remote: Counting objects: 21% (2005/9545) remote: Counting objects: 22% (2100/9545) remote: Counting objects: 23% (2196/9545) remote: Counting objects: 24% (2291/9545) remote: Counting objects: 25% (2387/9545) remote: Counting objects: 26% (2482/9545) remote: Counting objects: 27% (2578/9545) remote: Counting objects: 28% (2673/9545) remote: Counting objects: 29% (2769/9545) remote: Counting objects: 30% (2864/9545) remote: Counting objects: 31% (2959/9545) remote: Counting objects: 32% (3055/9545) remote: Counting objects: 33% (3150/9545) remote: Counting objects: 34% (3246/9545) remote: Counting objects: 35% (3341/9545) remote: Counting objects: 36% (3437/9545) remote: Counting objects: 37% (3532/9545) remote: Counting objects: 38% (3628/9545) remote: Counting objects: 39% (3723/9545) remote: Counting objects: 40% (3818/9545) remote: Counting objects: 41% (3914/9545) remote: Counting objects: 42% (4009/9545) remote: Counting objects: 43% (4105/9545) remote: Counting objects: 44% (4200/9545) remote: Counting objects: 45% (4296/9545) remote: Counting objects: 46% (4391/9545) remote: Counting objects: 47% (4487/9545) remote: Counting objects: 48% (4582/9545) remote: Counting objects: 49% (4678/9545) remote: Counting objects: 50% (4773/9545) remote: Counting objects: 51% (4868/9545) remote: Counting objects: 52% (4964/9545) remote: Counting objects: 53% (5059/9545) remote: Counting objects: 54% (5155/9545) remote: Counting objects: 55% (5250/9545) remote: Counting objects: 56% (5346/9545) remote: Counting objects: 57% (5441/9545) remote: Counting objects: 58% (5537/9545) remote: Counting objects: 59% (5632/9545) remote: Counting objects: 60% (5727/9545) remote: Counting objects: 61% (5823/9545) remote: Counting objects: 62% (5918/9545) remote: Counting objects: 63% (6014/9545) remote: Counting objects: 64% (6109/9545) remote: Counting objects: 65% (6205/9545) remote: Counting objects: 66% (6300/9545) remote: Counting objects: 67% (6396/9545) remote: Counting objects: 68% (6491/9545) remote: Counting objects: 69% (6587/9545) remote: Counting objects: 70% (6682/9545) remote: Counting objects: 71% (6777/9545) remote: Counting objects: 72% (6873/9545) remote: Counting objects: 73% (6968/9545) remote: Counting objects: 74% (7064/9545) remote: Counting objects: 75% (7159/9545) remote: Counting objects: 76% (7255/9545) remote: Counting objects: 77% (7350/9545) remote: Counting objects: 78% (7446/9545) remote: Counting objects: 79% (7541/9545) remote: Counting objects: 80% (7636/9545) remote: Counting objects: 81% (7732/9545) remote: Counting objects: 82% (7827/9545) remote: Counting objects: 83% (7923/9545) remote: Counting objects: 84% (8018/9545) remote: Counting objects: 85% (8114/9545) remote: Counting objects: 86% (8209/9545) remote: Counting objects: 87% (8305/9545) remote: Counting objects: 88% (8400/9545) remote: Counting objects: 89% (8496/9545) remote: Counting objects: 90% (8591/9545) remote: Counting objects: 91% (8686/9545) remote: Counting objects: 92% (8782/9545) remote: Counting objects: 93% (8877/9545) remote: Counting objects: 94% (8973/9545) remote: Counting objects: 95% (9068/9545) remote: Counting objects: 96% (9164/9545) remote: Counting objects: 97% (9259/9545) remote: Counting objects: 98% (9355/9545) remote: Counting objects: 99% (9450/9545) remote: Counting objects: 100% (9545/9545) remote: Counting objects: 100% (9545/9545), done.
  5. 3.45 s remote: Compressing objects: 0% (1/2330) remote: Compressing objects: 1% (24/2330) remote: Compressing objects: 2% (47/2330) remote: Compressing objects: 3% (70/2330) remote: Compressing objects: 4% (94/2330) remote: Compressing objects: 5% (117/2330) remote: Compressing objects: 6% (140/2330) remote: Compressing objects: 7% (164/2330) remote: Compressing objects: 8% (187/2330) remote: Compressing objects: 9% (210/2330) remote: Compressing objects: 10% (233/2330) remote: Compressing objects: 11% (257/2330) remote: Compressing objects: 12% (280/2330) remote: Compressing objects: 13% (303/2330) remote: Compressing objects: 14% (327/2330) remote: Compressing objects: 15% (350/2330) remote: Compressing objects: 16% (373/2330) remote: Compressing objects: 17% (397/2330) remote: Compressing objects: 18% (420/2330) remote: Compressing objects: 19% (443/2330) remote: Compressing objects: 20% (466/2330) remote: Compressing objects: 21% (490/2330) remote: Compressing objects: 22% (513/2330) remote: Compressing objects: 23% (536/2330) remote: Compressing objects: 23% (548/2330) remote: Compressing objects: 24% (560/2330) remote: Compressing objects: 25% (583/2330) remote: Compressing objects: 26% (606/2330) remote: Compressing objects: 27% (630/2330) remote: Compressing objects: 28% (653/2330) remote: Compressing objects: 29% (676/2330) remote: Compressing objects: 30% (699/2330) remote: Compressing objects: 31% (723/2330) remote: Compressing objects: 31% (725/2330) remote: Compressing objects: 32% (746/2330) remote: Compressing objects: 33% (769/2330) remote: Compressing objects: 34% (793/2330) remote: Compressing objects: 35% (816/2330) remote: Compressing objects: 36% (839/2330) remote: Compressing objects: 37% (863/2330) remote: Compressing objects: 38% (886/2330) remote: Compressing objects: 39% (909/2330) remote: Compressing objects: 40% (932/2330) remote: Compressing objects: 41% (956/2330) remote: Compressing objects: 42% (979/2330) remote: Compressing objects: 43% (1002/2330) remote: Compressing objects: 44% (1026/2330) remote: Compressing objects: 45% (1049/2330) remote: Compressing objects: 46% (1072/2330) remote: Compressing objects: 47% (1096/2330) remote: Compressing objects: 48% (1119/2330) remote: Compressing objects: 49% (1142/2330) remote: Compressing objects: 50% (1165/2330) remote: Compressing objects: 51% (1189/2330) remote: Compressing objects: 52% (1212/2330) remote: Compressing objects: 53% (1235/2330) remote: Compressing objects: 54% (1259/2330) remote: Compressing objects: 55% (1282/2330) remote: Compressing objects: 56% (1305/2330) remote: Compressing objects: 57% (1329/2330) remote: Compressing objects: 58% (1352/2330) remote: Compressing objects: 59% (1375/2330) remote: Compressing objects: 60% (1398/2330) remote: Compressing objects: 61% (1422/2330) remote: Compressing objects: 62% (1445/2330) remote: Compressing objects: 63% (1468/2330) remote: Compressing objects: 64% (1492/2330) remote: Compressing objects: 65% (1515/2330) remote: Compressing objects: 66% (1538/2330) remote: Compressing objects: 67% (1562/2330) remote: Compressing objects: 68% (1585/2330) remote: Compressing objects: 69% (1608/2330) remote: Compressing objects: 70% (1631/2330) remote: Compressing objects: 71% (1655/2330) remote: Compressing objects: 72% (1678/2330) remote: Compressing objects: 73% (1701/2330) remote: Compressing objects: 74% (1725/2330) remote: Compressing objects: 75% (1748/2330) remote: Compressing objects: 76% (1771/2330) remote: Compressing objects: 77% (1795/2330) remote: Compressing objects: 78% (1818/2330) remote: Compressing objects: 79% (1841/2330) remote: Compressing objects: 80% (1864/2330) remote: Compressing objects: 81% (1888/2330) remote: Compressing objects: 82% (1911/2330) remote: Compressing objects: 83% (1934/2330) remote: Compressing objects: 84% (1958/2330) remote: Compressing objects: 85% (1981/2330) remote: Compressing objects: 86% (2004/2330) remote: Compressing objects: 87% (2028/2330) remote: Compressing objects: 88% (2051/2330) remote: Compressing objects: 89% (2074/2330) remote: Compressing objects: 90% (2097/2330) remote: Compressing objects: 91% (2121/2330) remote: Compressing objects: 92% (2144/2330) remote: Compressing objects: 93% (2167/2330) remote: Compressing objects: 94% (2191/2330) remote: Compressing objects: 95% (2214/2330) remote: Compressing objects: 96% (2237/2330) remote: Compressing objects: 97% (2261/2330) remote: Compressing objects: 98% (2284/2330) remote: Compressing objects: 99% (2307/2330) remote: Compressing objects: 100% (2330/2330) remote: Compressing objects: 100% (2330/2330), done.
  6. 6.54 s Receiving objects: 0% (1/64191) Receiving objects: 1% (642/64191) Receiving objects: 2% (1284/64191) Receiving objects: 3% (1926/64191) Receiving objects: 4% (2568/64191) Receiving objects: 5% (3210/64191) Receiving objects: 6% (3852/64191) Receiving objects: 7% (4494/64191) Receiving objects: 8% (5136/64191) Receiving objects: 9% (5778/64191) Receiving objects: 10% (6420/64191), 10.30 MiB | 20.58 MiB/s Receiving objects: 11% (7062/64191), 10.30 MiB | 20.58 MiB/s Receiving objects: 12% (7703/64191), 10.30 MiB | 20.58 MiB/s Receiving objects: 13% (8345/64191), 10.30 MiB | 20.58 MiB/s Receiving objects: 14% (8987/64191), 10.30 MiB | 20.58 MiB/s Receiving objects: 15% (9629/64191), 10.30 MiB | 20.58 MiB/s Receiving objects: 16% (10271/64191), 10.30 MiB | 20.58 MiB/s Receiving objects: 17% (10913/64191), 10.30 MiB | 20.58 MiB/s Receiving objects: 18% (11555/64191), 10.30 MiB | 20.58 MiB/s Receiving objects: 19% (12197/64191), 10.30 MiB | 20.58 MiB/s Receiving objects: 20% (12839/64191), 10.30 MiB | 20.58 MiB/s Receiving objects: 21% (13481/64191), 10.30 MiB | 20.58 MiB/s Receiving objects: 22% (14123/64191), 10.30 MiB | 20.58 MiB/s Receiving objects: 23% (14764/64191), 10.30 MiB | 20.58 MiB/s Receiving objects: 24% (15406/64191), 10.30 MiB | 20.58 MiB/s Receiving objects: 25% (16048/64191), 10.30 MiB | 20.58 MiB/s Receiving objects: 26% (16690/64191), 10.30 MiB | 20.58 MiB/s Receiving objects: 27% (17332/64191), 10.30 MiB | 20.58 MiB/s Receiving objects: 28% (17974/64191), 10.30 MiB | 20.58 MiB/s Receiving objects: 29% (18616/64191), 10.30 MiB | 20.58 MiB/s Receiving objects: 30% (19258/64191), 10.30 MiB | 20.58 MiB/s Receiving objects: 31% (19900/64191), 10.30 MiB | 20.58 MiB/s Receiving objects: 32% (20542/64191), 10.30 MiB | 20.58 MiB/s Receiving objects: 33% (21184/64191), 10.30 MiB | 20.58 MiB/s Receiving objects: 34% (21825/64191), 10.30 MiB | 20.58 MiB/s Receiving objects: 35% (22467/64191), 10.30 MiB | 20.58 MiB/s Receiving objects: 36% (23109/64191), 10.30 MiB | 20.58 MiB/s Receiving objects: 37% (23751/64191), 10.30 MiB | 20.58 MiB/s Receiving objects: 38% (24393/64191), 10.30 MiB | 20.58 MiB/s Receiving objects: 39% (25035/64191), 10.30 MiB | 20.58 MiB/s Receiving objects: 40% (25677/64191), 10.30 MiB | 20.58 MiB/s Receiving objects: 41% (26319/64191), 10.30 MiB | 20.58 MiB/s Receiving objects: 42% (26961/64191), 10.30 MiB | 20.58 MiB/s Receiving objects: 43% (27603/64191), 10.30 MiB | 20.58 MiB/s Receiving objects: 44% (28245/64191), 10.30 MiB | 20.58 MiB/s Receiving objects: 45% (28886/64191), 10.30 MiB | 20.58 MiB/s Receiving objects: 46% (29528/64191), 10.30 MiB | 20.58 MiB/s Receiving objects: 47% (30170/64191), 10.30 MiB | 20.58 MiB/s Receiving objects: 48% (30812/64191), 10.30 MiB | 20.58 MiB/s Receiving objects: 49% (31454/64191), 10.30 MiB | 20.58 MiB/s Receiving objects: 50% (32096/64191), 10.30 MiB | 20.58 MiB/s Receiving objects: 50% (32270/64191), 28.28 MiB | 28.21 MiB/s Receiving objects: 51% (32738/64191), 28.28 MiB | 28.21 MiB/s Receiving objects: 52% (33380/64191), 28.28 MiB | 28.21 MiB/s Receiving objects: 53% (34022/64191), 28.28 MiB | 28.21 MiB/s Receiving objects: 54% (34664/64191), 28.28 MiB | 28.21 MiB/s Receiving objects: 55% (35306/64191), 28.28 MiB | 28.21 MiB/s Receiving objects: 56% (35947/64191), 28.28 MiB | 28.21 MiB/s Receiving objects: 57% (36589/64191), 28.28 MiB | 28.21 MiB/s Receiving objects: 58% (37231/64191), 44.75 MiB | 29.79 MiB/s Receiving objects: 59% (37873/64191), 44.75 MiB | 29.79 MiB/s Receiving objects: 60% (38515/64191), 44.75 MiB | 29.79 MiB/s Receiving objects: 61% (39157/64191), 44.75 MiB | 29.79 MiB/s Receiving objects: 62% (39799/64191), 44.75 MiB | 29.79 MiB/s Receiving objects: 63% (40441/64191), 44.75 MiB | 29.79 MiB/s Receiving objects: 64% (41083/64191), 44.75 MiB | 29.79 MiB/s Receiving objects: 65% (41725/64191), 44.75 MiB | 29.79 MiB/s Receiving objects: 66% (42367/64191), 44.75 MiB | 29.79 MiB/s Receiving objects: 67% (43008/64191), 44.75 MiB | 29.79 MiB/s Receiving objects: 67% (43277/64191), 61.34 MiB | 30.59 MiB/s Receiving objects: 68% (43650/64191), 61.34 MiB | 30.59 MiB/s Receiving objects: 69% (44292/64191), 61.34 MiB | 30.59 MiB/s Receiving objects: 70% (44934/64191), 61.34 MiB | 30.59 MiB/s Receiving objects: 71% (45576/64191), 61.34 MiB | 30.59 MiB/s Receiving objects: 72% (46218/64191), 61.34 MiB | 30.59 MiB/s Receiving objects: 73% (46860/64191), 61.34 MiB | 30.59 MiB/s Receiving objects: 74% (47502/64191), 61.34 MiB | 30.59 MiB/s Receiving objects: 75% (48144/64191), 61.34 MiB | 30.59 MiB/s Receiving objects: 76% (48786/64191), 61.34 MiB | 30.59 MiB/s Receiving objects: 77% (49428/64191), 61.34 MiB | 30.59 MiB/s Receiving objects: 78% (50069/64191), 61.34 MiB | 30.59 MiB/s Receiving objects: 79% (50711/64191), 61.34 MiB | 30.59 MiB/s Receiving objects: 80% (51353/64191), 61.34 MiB | 30.59 MiB/s Receiving objects: 81% (51995/64191), 61.34 MiB | 30.59 MiB/s Receiving objects: 82% (52637/64191), 78.21 MiB | 31.16 MiB/s Receiving objects: 83% (53279/64191), 78.21 MiB | 31.16 MiB/s Receiving objects: 84% (53921/64191), 78.21 MiB | 31.16 MiB/s Receiving objects: 85% (54563/64191), 78.21 MiB | 31.16 MiB/s Receiving objects: 86% (55205/64191), 78.21 MiB | 31.16 MiB/s Receiving objects: 87% (55847/64191), 78.21 MiB | 31.16 MiB/s Receiving objects: 88% (56489/64191), 78.21 MiB | 31.16 MiB/s Receiving objects: 89% (57130/64191), 78.21 MiB | 31.16 MiB/s Receiving objects: 90% (57772/64191), 78.21 MiB | 31.16 MiB/s Receiving objects: 91% (58414/64191), 78.21 MiB | 31.16 MiB/s Receiving objects: 92% (59056/64191), 78.21 MiB | 31.16 MiB/s Receiving objects: 93% (59698/64191), 78.21 MiB | 31.16 MiB/s Receiving objects: 94% (60340/64191), 78.21 MiB | 31.16 MiB/s Receiving objects: 95% (60982/64191), 78.21 MiB | 31.16 MiB/s Receiving objects: 96% (61624/64191), 78.21 MiB | 31.16 MiB/s Receiving objects: 97% (62266/64191), 78.21 MiB | 31.16 MiB/s Receiving objects: 98% (62908/64191), 78.21 MiB | 31.16 MiB/s Receiving objects: 98% (62926/64191), 78.21 MiB | 31.16 MiB/s Receiving objects: 99% (63550/64191), 95.23 MiB | 31.64 MiB/s remote: Total 64191 (delta 7391), reused 7767 (delta 6670), pack-reused 54646 (from 3)
  7. 6.63 s Receiving objects: 100% (64191/64191), 95.23 MiB | 31.64 MiB/s Receiving objects: 100% (64191/64191), 97.83 MiB | 31.66 MiB/s, done.
  8. 7.14 s Resolving deltas: 0% (0/44321) Resolving deltas: 1% (444/44321) Resolving deltas: 2% (887/44321) Resolving deltas: 3% (1330/44321) Resolving deltas: 4% (1773/44321) Resolving deltas: 5% (2217/44321) Resolving deltas: 6% (2660/44321) Resolving deltas: 7% (3103/44321) Resolving deltas: 8% (3546/44321) Resolving deltas: 9% (3989/44321) Resolving deltas: 10% (4434/44321) Resolving deltas: 11% (4876/44321) Resolving deltas: 12% (5319/44321) Resolving deltas: 13% (5762/44321) Resolving deltas: 14% (6206/44321) Resolving deltas: 15% (6650/44321) Resolving deltas: 16% (7092/44321) Resolving deltas: 17% (7535/44321) Resolving deltas: 18% (7978/44321) Resolving deltas: 19% (8421/44321) Resolving deltas: 20% (8865/44321) Resolving deltas: 21% (9308/44321) Resolving deltas: 22% (9751/44321) Resolving deltas: 23% (10194/44321) Resolving deltas: 24% (10638/44321) Resolving deltas: 25% (11081/44321) Resolving deltas: 26% (11524/44321) Resolving deltas: 27% (11968/44321) Resolving deltas: 28% (12412/44321) Resolving deltas: 29% (12855/44321) Resolving deltas: 30% (13297/44321) Resolving deltas: 31% (13740/44321) Resolving deltas: 32% (14185/44321) Resolving deltas: 33% (14626/44321) Resolving deltas: 34% (15070/44321) Resolving deltas: 35% (15513/44321) Resolving deltas: 36% (15956/44321) Resolving deltas: 37% (16399/44321) Resolving deltas: 38% (16842/44321) Resolving deltas: 39% (17287/44321) Resolving deltas: 40% (17729/44321) Resolving deltas: 41% (18172/44321) Resolving deltas: 42% (18616/44321) Resolving deltas: 43% (19059/44321) Resolving deltas: 44% (19502/44321) Resolving deltas: 45% (19945/44321) Resolving deltas: 46% (20389/44321) Resolving deltas: 47% (20831/44321) Resolving deltas: 48% (21275/44321) Resolving deltas: 49% (21718/44321) Resolving deltas: 50% (22161/44321) Resolving deltas: 51% (22604/44321) Resolving deltas: 52% (23047/44321) Resolving deltas: 53% (23491/44321) Resolving deltas: 54% (23934/44321) Resolving deltas: 55% (24377/44321) Resolving deltas: 56% (24820/44321) Resolving deltas: 57% (25263/44321) Resolving deltas: 58% (25707/44321) Resolving deltas: 59% (26150/44321) Resolving deltas: 60% (26593/44321) Resolving deltas: 61% (27036/44321) Resolving deltas: 62% (27482/44321) Resolving deltas: 63% (27923/44321) Resolving deltas: 64% (28366/44321) Resolving deltas: 65% (28809/44321) Resolving deltas: 66% (29252/44321) Resolving deltas: 67% (29697/44321) Resolving deltas: 68% (30139/44321) Resolving deltas: 69% (30583/44321) Resolving deltas: 70% (31025/44321) Resolving deltas: 71% (31468/44321) Resolving deltas: 72% (31912/44321) Resolving deltas: 73% (32355/44321) Resolving deltas: 74% (32798/44321) Resolving deltas: 75% (33241/44321) Resolving deltas: 76% (33684/44321) Resolving deltas: 77% (34128/44321) Resolving deltas: 78% (34571/44321) Resolving deltas: 79% (35014/44321) Resolving deltas: 80% (35457/44321) Resolving deltas: 81% (35901/44321) Resolving deltas: 82% (36347/44321) Resolving deltas: 83% (36792/44321) Resolving deltas: 84% (37230/44321) Resolving deltas: 85% (37673/44321) Resolving deltas: 86% (38117/44321) Resolving deltas: 87% (38561/44321) Resolving deltas: 88% (39003/44321) Resolving deltas: 89% (39446/44321) Resolving deltas: 90% (39889/44321) Resolving deltas: 91% (40333/44321) Resolving deltas: 92% (40776/44321) Resolving deltas: 93% (41219/44321) Resolving deltas: 94% (41662/44321) Resolving deltas: 95% (42105/44321) Resolving deltas: 96% (42550/44321) Resolving deltas: 97% (42992/44321) Resolving deltas: 98% (43435/44321) Resolving deltas: 99% (43878/44321) Resolving deltas: 100% (44321/44321) Resolving deltas: 100% (44321/44321), done.
  9. 7.39 s Fetching commit 3d241888b215b0c37d1e347e0c8ddcee728dacfb for push-vrpyqyylypmw ...
  10. 7.39 s $ /nix/store/bcnisk3ydfgv26v2gw3zlky24g00yww2-git-2.54.0/bin/git fetch origin 3d241888b215b0c37d1e347e0c8ddcee728dacfb
  11. 7.88 s From https://github.com/alphal00p/gammaloop
  12. 7.88 s * branch 3d241888b215b0c37d1e347e0c8ddcee728dacfb -> FETCH_HEAD
  13. 7.89 s $ /nix/store/9ypz3flqsrl5xl495mm8h645gadjsxi1-coreutils-9.11/bin/timeout --kill-after=15s 7200s /nix/store/bcnisk3ydfgv26v2gw3zlky24g00yww2-git-2.54.0/bin/git -c advice.detachedHead=false checkout 3d241888b215b0c37d1e347e0c8ddcee728dacfb
  14. 8.07 s HEAD is now at 3d241888 run documentation tests through the Nix CI secret runner
  15. 8.07 s $ /nix/store/9ypz3flqsrl5xl495mm8h645gadjsxi1-coreutils-9.11/bin/timeout --kill-after=15s 7200s /nix/store/23zk8sgzamrbmj1fday15szf7f2279s8-nix-2.34.7/bin/nix --extra-experimental-features nix-command --extra-experimental-features flakes --log-format internal-json run .#packages.x86_64-linux.nix-ci-check-gammaloop-doctest --print-build-logs
  16. 10.09 s
  17. 12.48 s evaluating derivation 'g copying '/nix/store/4jdn evaluating derivation 'g querying gammaloop-works [0/1 built, 0.0 KiB DL] [1/0/1 built, 0.0 KiB DLgammaloop-workspace-doctest> Running phase: unpackPhase
  18. 12.53 s gammaloop-workspace-doctest> unpacking source archive /nix/store/9wvq6ybm6dprplm1h2869fg539dqvd85-source
  19. 12.59 s gammaloop-workspace-doctest> source root is source
  20. 12.61 s gammaloop-workspace-doctest> Running phase: patchPhase
  21. 12.61 s gammaloop-workspace-doctest> Executing configureCargoCommonVars
  22. 12.61 s gammaloop-workspace-doctest> decompressing cargo artifacts from /nix/store/kbgwngi7xvi54jsr0kp8rhj1b9mfja7d-gammaloop-workspace-deps-deps-0.1.0/target.tar.zst to target
  23. 13.79 s gammaloop-workspace-doctest> Running phase: updateAutotoolsGnuConfigScriptsPhase
  24. 13.82 s gammaloop-workspace-doctest> Running phase: configurePhase
  25. 13.82 s gammaloop-workspace-doctest> will append /build/source/.cargo-home/config.toml with contents of /nix/store/xdy1vvhll2bijdplvl9fcc2b9plkxhaa-vendor-cargo-deps/config.toml
  26. 13.82 s gammaloop-workspace-doctest> default configurePhase, nothing to do
  27. 13.82 s gammaloop-workspace-doctest> Running phase: buildPhase
  28. 13.83 s gammaloop-workspace-doctest> +++ command cargo --version
  29. 13.83 s gammaloop-workspace-doctest> cargo 1.97.0 (c980f4866 2026-06-30)
  30. 13.86 s gammaloop-workspace-doctest> +++ command cargo test --profile ci-optim --doc --locked --workspace --features gammaloop-api/cli,gammaloop-tracing-filter/clap,gammaloop-tracing-filter/symbolica,idenso/bincode,idenso/reference-cases,linnet/bincode,linnet/drawing,linnet/nodestore-vec,linnet/rkyv,linnet/serde,linnet/symbolica,spenso-macros/shadowing,spenso/shadowing,symbolica/tracing_max_level_info
  31. 14.14 s gammaloop-workspace-doctest> Compiling target-lexicon v0.13.5
  32. 14.15 s gammaloop-workspace-doctest> Compiling symbolica v2.2.0 (https://github.com/symbolica-dev/symbolica?branch=dev#0441bd7a)
  33. 14.15 s gammaloop-workspace-doctest> Compiling maplit v1.0.2
  34. 14.16 s gammaloop-workspace-doctest> Compiling gammaloop-tracing-filter-macros v0.1.0 (/build/source/crates/gammaloop-tracing-filter-macros)
  35. 14.16 s gammaloop-workspace-doctest> Compiling vakint v0.1.2 (/build/source/crates/vakint)
  36. 14.17 s gammaloop-workspace-doctest> Compiling gammalooprs v0.3.4 (/build/source/crates/gammalooprs)
  37. 14.18 s gammaloop-workspace-doctest> Compiling alphal00p-docs-macros v0.1.0 (/build/source/crates/alphal00p-docs-macros)
  38. 14.18 s gammaloop-workspace-doctest> Compiling alphal00p-docs-schema v0.1.0 (/build/source/crates/alphal00p-docs-schema)
  39. 14.18 s gammaloop-workspace-doctest> Compiling rustc_version v0.4.1
  40. 14.19 s gammaloop-workspace-doctest> Compiling bincode v1.3.3
  41. 14.19 s gammaloop-workspace-doctest> Compiling gungraun-runner v0.18.2
  42. 14.19 s gammaloop-workspace-doctest> Compiling target-triple v1.0.1
  43. 14.19 s gammaloop-workspace-doctest> Compiling iai-callgrind-runner v0.14.2
  44. 14.20 s gammaloop-workspace-doctest> Compiling clinnet v0.1.8 (/build/source/crates/clinnet)
  45. 14.20 s gammaloop-workspace-doctest> Compiling gammaloop-integration-tests v0.1.0 (/build/source/tests)
  46. 14.33 s gammaloop-workspace-doctest> Compiling test-log-core v0.2.20
  47. 14.36 s gammaloop-workspace-doctest> Compiling wait-timeout v0.2.1
  48. 14.36 s gammaloop-workspace-doctest> Compiling bit-vec v0.8.0
  49. 14.36 s gammaloop-workspace-doctest> Compiling quick-error v1.2.3
  50. 14.37 s gammaloop-workspace-doctest> Compiling iai-callgrind v0.14.2
  51. 14.49 s gammaloop-workspace-doctest> Compiling rusty-fork v0.3.1
  52. 14.51 s gammaloop-workspace-doctest> Compiling bit-set v0.8.0
  53. 14.55 s gammaloop-workspace-doctest> Compiling iai-callgrind-macros v0.5.1
  54. 14.55 s gammaloop-workspace-doctest> Compiling rand_xorshift v0.4.0
  55. 14.61 s gammaloop-workspace-doctest> Compiling console v0.15.11
  56. 14.63 s gammaloop-workspace-doctest> Compiling glob v0.3.4
  57. 14.69 s gammaloop-workspace-doctest> Compiling termcolor v1.4.1
  58. 14.70 s gammaloop-workspace-doctest> Compiling gungraun-macros v0.8.0
  59. 14.81 s gammaloop-workspace-doctest> Compiling base64 v0.21.7
  60. 15.01 s gammaloop-workspace-doctest> Compiling unarray v0.1.4
  61. 15.08 s gammaloop-workspace-doctest> Compiling proptest v1.11.0
  62. 15.08 s gammaloop-workspace-doctest> Compiling alphal00p-docs-catalogs v0.1.0 (/build/source/crates/alphal00p-docs-catalogs)
  63. 15.18 s gammaloop-workspace-doctest> Compiling ron v0.8.1
  64. 15.19 s gammaloop-workspace-doctest> Compiling pyo3-build-config v0.28.3
  65. 15.19 s gammaloop-workspace-doctest> Compiling trybuild v1.0.120
  66. 15.23 s gammaloop-workspace-doctest> Compiling similar-asserts v1.7.0
  67. 15.36 s gammaloop-workspace-doctest> Compiling alphal00p-docs-builder v0.1.0 (/build/source/crates/alphal00p-docs-builder)
  68. 15.41 s gammaloop-workspace-doctest> Compiling kurvst v0.1.0 (/build/source/crates/kurvst)
  69. 15.75 s gammaloop-workspace-doctest> Compiling test-log-macros v0.2.20
  70. 17.17 s gammaloop-workspace-doctest> Compiling test-log v0.2.20
  71. 17.28 s gammaloop-workspace-doctest> Compiling alphal00p-docs-examples v0.1.0 (/build/source/crates/alphal00p-docs-examples)
  72. 19.04 s gammaloop-workspace-doctest> Compiling pyo3-macros-backend v0.28.3
  73. 19.18 s gammaloop-workspace-doctest> Compiling pyo3-ffi v0.28.3
  74. 19.34 s gammaloop-workspace-doctest> Compiling pyo3 v0.28.3
  75. 19.46 s gammaloop-workspace-doctest> Compiling numpy v0.28.0
  76. 19.54 s gammaloop-workspace-doctest> Compiling gammaloop-api v0.1.0 (/build/source/crates/gammaloop-api)
  77. 19.63 s gammaloop-workspace-doctest> Compiling gungraun v0.18.2
  78. 23.56 s gammaloop-workspace-doctest> Compiling pyo3-macros v0.28.3
  79. 27.88 s gammaloop-workspace-doctest> Compiling pyo3-stub-gen v0.17.2
  80. 28.45 s gammaloop-workspace-doctest> Compiling numerica v2.2.0 (https://github.com/symbolica-dev/symbolica?branch=dev#0441bd7a)
  81. 30.34 s gammaloop-workspace-doctest> Compiling graphica v2.1.0 (https://github.com/symbolica-dev/symbolica?branch=dev#0441bd7a)
  82. 32.30 s gammaloop-workspace-doctest> Compiling symbolica-utils v0.1.0 (/build/source/crates/symbolica-utils)
  83. 167.46 s gammaloop-workspace-doctest> Compiling gammaloop-workspace-hack v0.1.0 (/build/source/crates/gammaloop-workspace-hack)
  84. 167.51 s gammaloop-workspace-doctest> Compiling spenso-macros v0.3.2 (/build/source/crates/spenso-macros)
  85. 167.60 s gammaloop-workspace-doctest> Compiling linnet v0.17.0 (/build/source/crates/linnet)
  86. 170.46 s gammaloop-workspace-doctest> Compiling spenso v0.6.0 (/build/source/crates/spenso)
  87. 176.80 s gammaloop-workspace-doctest> Compiling idenso v0.3.0 (/build/source/crates/idenso)
  88. 176.85 s gammaloop-workspace-doctest> Compiling gammaloop-tracing-filter v0.1.0 (/build/source/crates/gammaloop-tracing-filter)
  89. 179.90 s gammaloop-workspace-doctest> Compiling spenso-hep-lib v0.1.7 (/build/source/crates/spenso-hep-lib)
  90. 180.10 s gammaloop-workspace-doctest> Compiling spynso3 v0.1.2 (/build/source/crates/spynso3)
  91. 214.81 s gammaloop-workspace-doctest> Compiling linnest v0.1.0 (/build/source/crates/linnest)
  92. 214.85 s gammaloop-workspace-doctest> Compiling linnet-py v0.1.0 (/build/source/crates/linnet-py)
  93. 318.34 s gammaloop-workspace-doctest> Finished `ci-optim` profile [optimized] target(s) in 5m 04s
  94. 318.93 s gammaloop-workspace-doctest> warning: the following packages contain code that will be rejected by a future version of Rust: proc-macro-error2 v2.0.1
  95. 318.93 s gammaloop-workspace-doctest> note: to see what the problems were, use the option `--future-incompat-report`, or run `cargo report future-incompatibilities --id 1`
  96. 318.93 s gammaloop-workspace-doctest> Doc-tests alphal00p_docs_builder
  97. 318.93 s gammaloop-workspace-doctest>
  98. 318.93 s gammaloop-workspace-doctest> running 0 tests
  99. 318.93 s gammaloop-workspace-doctest>
  100. 318.93 s gammaloop-workspace-doctest> test result: ok. 0 passed; 0 failed; 0 ignored; 0 measured; 0 filtered out; finished in 0.00s
  101. 318.93 s gammaloop-workspace-doctest>
  102. 318.93 s gammaloop-workspace-doctest> Doc-tests alphal00p_docs_catalogs
  103. 319.68 s gammaloop-workspace-doctest>
  104. 319.68 s gammaloop-workspace-doctest> running 0 tests
  105. 319.68 s gammaloop-workspace-doctest>
  106. 319.68 s gammaloop-workspace-doctest> test result: ok. 0 passed; 0 failed; 0 ignored; 0 measured; 0 filtered out; finished in 0.00s
  107. 319.68 s gammaloop-workspace-doctest>
  108. 319.68 s gammaloop-workspace-doctest> Doc-tests alphal00p_docs_examples
  109. 319.69 s gammaloop-workspace-doctest>
  110. 319.69 s gammaloop-workspace-doctest> running 0 tests
  111. 319.69 s gammaloop-workspace-doctest>
  112. 319.69 s gammaloop-workspace-doctest> test result: ok. 0 passed; 0 failed; 0 ignored; 0 measured; 0 filtered out; finished in 0.00s
  113. 319.69 s gammaloop-workspace-doctest>
  114. 319.69 s gammaloop-workspace-doctest> Doc-tests alphal00p_docs
  115. 319.74 s gammaloop-workspace-doctest>
  116. 319.74 s gammaloop-workspace-doctest> running 0 tests
  117. 319.74 s gammaloop-workspace-doctest>
  118. 319.74 s gammaloop-workspace-doctest> test result: ok. 0 passed; 0 failed; 0 ignored; 0 measured; 0 filtered out; finished in 0.00s
  119. 319.74 s gammaloop-workspace-doctest>
  120. 319.74 s gammaloop-workspace-doctest> Doc-tests alphal00p_docs_schema
  121. 319.81 s gammaloop-workspace-doctest>
  122. 319.81 s gammaloop-workspace-doctest> running 0 tests
  123. 319.81 s gammaloop-workspace-doctest>
  124. 319.81 s gammaloop-workspace-doctest> test result: ok. 0 passed; 0 failed; 0 ignored; 0 measured; 0 filtered out; finished in 0.00s
  125. 319.81 s gammaloop-workspace-doctest>
  126. 319.81 s gammaloop-workspace-doctest> Doc-tests clinnet
  127. 319.85 s gammaloop-workspace-doctest>
  128. 319.85 s gammaloop-workspace-doctest> running 0 tests
  129. 319.85 s gammaloop-workspace-doctest>
  130. 319.85 s gammaloop-workspace-doctest> test result: ok. 0 passed; 0 failed; 0 ignored; 0 measured; 0 filtered out; finished in 0.00s
  131. 319.85 s gammaloop-workspace-doctest>
  132. 319.85 s gammaloop-workspace-doctest> Doc-tests gammaloop_api
  133. 320.70 s gammaloop-workspace-doctest>
  134. 320.70 s gammaloop-workspace-doctest> running 13 tests
  135. 320.71 s gammaloop-workspace-doctest> test crates/gammaloop-api/src/python.rs - python::GammaLoopAPI::evaluate_sample (line 2926) ... FAILED
  136. 320.72 s gammaloop-workspace-doctest> test crates/gammaloop-api/src/python.rs - python::GammaLoopAPI::get_integrand_info (line 3496) ... FAILED
  137. 320.72 s gammaloop-workspace-doctest> test crates/gammaloop-api/src/python.rs - python::GammaLoopAPI::get_active_command_blocks (line 3652) ... FAILED
  138. 320.72 s gammaloop-workspace-doctest> test crates/gammaloop-api/src/python.rs - python::GammaLoopAPI::get_default_runtime_settings (line 3688) ... FAILED
  139. 320.72 s gammaloop-workspace-doctest> test crates/gammaloop-api/src/python.rs - python::GammaLoopAPI::get_integrand_settings (line 3539) ... FAILED
  140. 320.72 s gammaloop-workspace-doctest> test crates/gammaloop-api/src/python.rs - python::GammaLoopAPI::evaluate_samples (line 3040) ... FAILED
  141. 320.80 s gammaloop-workspace-doctest> test crates/gammaloop-api/src/python.rs - python::GammaLoopAPI::run_command (line 3793) ... FAILED
  142. 320.80 s gammaloop-workspace-doctest> test crates/gammaloop-api/src/python.rs - python::GammaLoopAPI::get_global_settings (line 3631) ... FAILED
  143. 320.80 s gammaloop-workspace-doctest> test crates/gammaloop-api/src/python.rs - python::GammaLoopAPI::get_run_history (line 3603) ... FAILED
  144. 320.81 s gammaloop-workspace-doctest> test crates/gammaloop-api/src/python.rs - python::atom_to_canonical_string (line 128) ... FAILED
  145. 320.81 s gammaloop-workspace-doctest> test crates/gammaloop-api/src/python.rs - python::atom_to_dots (line 157) ... FAILED
  146. 320.81 s gammaloop-workspace-doctest> test crates/gammaloop-api/src/python.rs - python::evaluate_graph_overall_factor (line 95) ... FAILED
  147. 320.81 s gammaloop-workspace-doctest> test crates/gammaloop-api/src/python.rs - python::GammaLoopAPI::new_python (line 2804) ... FAILED
  148. 320.81 s gammaloop-workspace-doctest>
  149. 320.81 s gammaloop-workspace-doctest> failures:
  150. 320.81 s gammaloop-workspace-doctest>
  151. 320.81 s gammaloop-workspace-doctest> ---- crates/gammaloop-api/src/python.rs - python::GammaLoopAPI::evaluate_sample (line 2926) stdout ----
  152. 320.81 s gammaloop-workspace-doctest> error: expected one of `!` or `::`, found `=`
  153. 320.81 s gammaloop-workspace-doctest> --> crates/gammaloop-api/src/python.rs:2927:8
  154. 320.81 s gammaloop-workspace-doctest> |
  155. 320.81 s gammaloop-workspace-doctest> 2927 | result = api.evaluate_sample(point, process_id=0, minimal_output=True)
  156. 320.81 s gammaloop-workspace-doctest> | ^ expected one of `!` or `::`
  157. 320.81 s gammaloop-workspace-doctest>
  158. 320.81 s gammaloop-workspace-doctest> error: aborting due to 1 previous error
  159. 320.81 s gammaloop-workspace-doctest>
  160. 320.81 s gammaloop-workspace-doctest> Couldn't compile the test.
  161. 320.81 s gammaloop-workspace-doctest> ---- crates/gammaloop-api/src/python.rs - python::GammaLoopAPI::get_integrand_info (line 3496) stdout ----
  162. 320.81 s gammaloop-workspace-doctest> error: expected one of `!` or `::`, found `=`
  163. 320.81 s gammaloop-workspace-doctest> --> crates/gammaloop-api/src/python.rs:3497:6
  164. 320.81 s gammaloop-workspace-doctest> |
  165. 320.81 s gammaloop-workspace-doctest> 3497 | info = api.get_integrand_info(process_id=0)
  166. 320.81 s gammaloop-workspace-doctest> | ^ expected one of `!` or `::`
  167. 320.81 s gammaloop-workspace-doctest>
  168. 320.81 s gammaloop-workspace-doctest> error: aborting due to 1 previous error
  169. 320.81 s gammaloop-workspace-doctest>
  170. 320.81 s gammaloop-workspace-doctest> Couldn't compile the test.
  171. 320.81 s gammaloop-workspace-doctest> ---- crates/gammaloop-api/src/python.rs - python::GammaLoopAPI::get_active_command_blocks (line 3652) stdout ----
  172. 320.81 s gammaloop-workspace-doctest> error: expected item, found keyword `for`
  173. 320.81 s gammaloop-workspace-doctest> --> crates/gammaloop-api/src/python.rs:3653:1
  174. 320.81 s gammaloop-workspace-doctest> |
  175. 320.81 s gammaloop-workspace-doctest> 3653 | for name, commands in api.get_active_command_blocks().items():
  176. 320.81 s gammaloop-workspace-doctest> | ^^^ expected item
  177. 320.81 s gammaloop-workspace-doctest> |
  178. 320.81 s gammaloop-workspace-doctest> = note: for a full list of items that can appear in modules, see <https://doc.rust-lang.org/reference/items.html>
  179. 320.81 s gammaloop-workspace-doctest>
  180. 320.81 s gammaloop-workspace-doctest> error: aborting due to 1 previous error
  181. 320.81 s gammaloop-workspace-doctest>
  182. 320.81 s gammaloop-workspace-doctest> Couldn't compile the test.
  183. 320.81 s gammaloop-workspace-doctest> ---- crates/gammaloop-api/src/python.rs - python::GammaLoopAPI::get_default_runtime_settings (line 3688) stdout ----
  184. 320.81 s gammaloop-workspace-doctest> error: expected one of `!` or `::`, found `=`
  185. 320.81 s gammaloop-workspace-doctest> --> crates/gammaloop-api/src/python.rs:3689:9
  186. 320.81 s gammaloop-workspace-doctest> |
  187. 320.81 s gammaloop-workspace-doctest> 3689 | runtime = api.get_default_runtime_settings()
  188. 320.81 s gammaloop-workspace-doctest> | ^ expected one of `!` or `::`
  189. 320.81 s gammaloop-workspace-doctest>
  190. 320.81 s gammaloop-workspace-doctest> error: aborting due to 1 previous error
  191. 320.81 s gammaloop-workspace-doctest>
  192. 320.81 s gammaloop-workspace-doctest> Couldn't compile the test.
  193. 320.81 s gammaloop-workspace-doctest> ---- crates/gammaloop-api/src/python.rs - python::GammaLoopAPI::get_integrand_settings (line 3539) stdout ----
  194. 320.81 s gammaloop-workspace-doctest> error: expected one of `!` or `::`, found `=`
  195. 320.81 s gammaloop-workspace-doctest> --> crates/gammaloop-api/src/python.rs:3540:10
  196. 320.81 s gammaloop-workspace-doctest> |
  197. 320.81 s gammaloop-workspace-doctest> 3540 | settings = api.get_integrand_settings(process_id=0)
  198. 320.81 s gammaloop-workspace-doctest> | ^ expected one of `!` or `::`
  199. 320.81 s gammaloop-workspace-doctest>
  200. 320.81 s gammaloop-workspace-doctest> error: aborting due to 1 previous error
  201. 320.81 s gammaloop-workspace-doctest>
  202. 320.81 s gammaloop-workspace-doctest> Couldn't compile the test.
  203. 320.81 s gammaloop-workspace-doctest> ---- crates/gammaloop-api/src/python.rs - python::GammaLoopAPI::evaluate_samples (line 3040) stdout ----
  204. 320.81 s gammaloop-workspace-doctest> error: expected one of `!` or `::`, found `=`
  205. 320.81 s gammaloop-workspace-doctest> --> crates/gammaloop-api/src/python.rs:3041:8
  206. 320.81 s gammaloop-workspace-doctest> |
  207. 320.81 s gammaloop-workspace-doctest> 3041 | points = numpy.asarray(points, dtype=numpy.float64)
  208. 320.81 s gammaloop-workspace-doctest> | ^ expected one of `!` or `::`
  209. 320.81 s gammaloop-workspace-doctest>
  210. 320.81 s gammaloop-workspace-doctest> error: aborting due to 1 previous error
  211. 320.81 s gammaloop-workspace-doctest>
  212. 320.81 s gammaloop-workspace-doctest> Couldn't compile the test.
  213. 320.81 s gammaloop-workspace-doctest> ---- crates/gammaloop-api/src/python.rs - python::GammaLoopAPI::run_command (line 3793) stdout ----
  214. 320.81 s gammaloop-workspace-doctest> error[E0425]: cannot find value `api` in this scope
  215. 320.81 s gammaloop-workspace-doctest> --> crates/gammaloop-api/src/python.rs:3794:1
  216. 320.81 s gammaloop-workspace-doctest> |
  217. 320.81 s gammaloop-workspace-doctest> 3794 | api.run("display processes")
  218. 320.81 s gammaloop-workspace-doctest> | ^^^ not found in this scope
  219. 320.81 s gammaloop-workspace-doctest>
  220. 320.81 s gammaloop-workspace-doctest> error: aborting due to 1 previous error
  221. 320.81 s gammaloop-workspace-doctest>
  222. 320.81 s gammaloop-workspace-doctest> For more information about this error, try `rustc --explain E0425`.
  223. 320.81 s gammaloop-workspace-doctest> Couldn't compile the test.
  224. 320.81 s gammaloop-workspace-doctest> ---- crates/gammaloop-api/src/python.rs - python::GammaLoopAPI::get_global_settings (line 3631) stdout ----
  225. 320.81 s gammaloop-workspace-doctest> error[E0425]: cannot find value `settings_toml` in this scope
  226. 320.81 s gammaloop-workspace-doctest> --> crates/gammaloop-api/src/python.rs:3632:1
  227. 320.81 s gammaloop-workspace-doctest> |
  228. 320.81 s gammaloop-workspace-doctest> 3632 | settings_toml = api.get_global_settings()
  229. 320.81 s gammaloop-workspace-doctest> | ^^^^^^^^^^^^^
  230. 320.81 s gammaloop-workspace-doctest> |
  231. 320.81 s gammaloop-workspace-doctest> help: you might have meant to introduce a new binding
  232. 320.81 s gammaloop-workspace-doctest> |
  233. 320.81 s gammaloop-workspace-doctest> 3632 | let settings_toml = api.get_global_settings()
  234. 320.81 s gammaloop-workspace-doctest> | +++
  235. 320.81 s gammaloop-workspace-doctest>
  236. 320.81 s gammaloop-workspace-doctest> error[E0425]: cannot find value `api` in this scope
  237. 320.81 s gammaloop-workspace-doctest> --> crates/gammaloop-api/src/python.rs:3632:17
  238. 320.81 s gammaloop-workspace-doctest> |
  239. 320.81 s gammaloop-workspace-doctest> 3632 | settings_toml = api.get_global_settings()
  240. 320.81 s gammaloop-workspace-doctest> | ^^^ not found in this scope
  241. 320.81 s gammaloop-workspace-doctest>
  242. 320.81 s gammaloop-workspace-doctest> error: aborting due to 2 previous errors
  243. 320.81 s gammaloop-workspace-doctest>
  244. 320.81 s gammaloop-workspace-doctest> For more information about this error, try `rustc --explain E0425`.
  245. 320.81 s gammaloop-workspace-doctest> Couldn't compile the test.
  246. 320.81 s gammaloop-workspace-doctest> ---- crates/gammaloop-api/src/python.rs - python::GammaLoopAPI::get_run_history (line 3603) stdout ----
  247. 320.81 s gammaloop-workspace-doctest> error[E0425]: cannot find value `run_card_toml` in this scope
  248. 320.81 s gammaloop-workspace-doctest> --> crates/gammaloop-api/src/python.rs:3604:1
  249. 320.81 s gammaloop-workspace-doctest> |
  250. 320.81 s gammaloop-workspace-doctest> 3604 | run_card_toml = api.get_run_history()
  251. 320.81 s gammaloop-workspace-doctest> | ^^^^^^^^^^^^^
  252. 320.81 s gammaloop-workspace-doctest> |
  253. 320.81 s gammaloop-workspace-doctest> help: you might have meant to introduce a new binding
  254. 320.81 s gammaloop-workspace-doctest> |
  255. 320.81 s gammaloop-workspace-doctest> 3604 | let run_card_toml = api.get_run_history()
  256. 320.81 s gammaloop-workspace-doctest> | +++
  257. 320.81 s gammaloop-workspace-doctest>
  258. 320.81 s gammaloop-workspace-doctest> error[E0425]: cannot find value `api` in this scope
  259. 320.81 s gammaloop-workspace-doctest> --> crates/gammaloop-api/src/python.rs:3604:17
  260. 320.81 s gammaloop-workspace-doctest> |
  261. 320.81 s gammaloop-workspace-doctest> 3604 | run_card_toml = api.get_run_history()
  262. 320.81 s gammaloop-workspace-doctest> | ^^^ not found in this scope
  263. 320.81 s gammaloop-workspace-doctest>
  264. 320.81 s gammaloop-workspace-doctest> error: aborting due to 2 previous errors
  265. 320.81 s gammaloop-workspace-doctest>
  266. 320.81 s gammaloop-workspace-doctest> For more information about this error, try `rustc --explain E0425`.
  267. 320.81 s gammaloop-workspace-doctest> Couldn't compile the test.
  268. 320.81 s gammaloop-workspace-doctest> ---- crates/gammaloop-api/src/python.rs - python::atom_to_canonical_string (line 128) stdout ----
  269. 320.81 s gammaloop-workspace-doctest> error[E0425]: cannot find function `atom_to_canonical_string` in this scope
  270. 320.81 s gammaloop-workspace-doctest> --> crates/gammaloop-api/src/python.rs:129:1
  271. 320.81 s gammaloop-workspace-doctest> |
  272. 320.81 s gammaloop-workspace-doctest> 129 | atom_to_canonical_string("x + x")
  273. 320.81 s gammaloop-workspace-doctest> | ^^^^^^^^^^^^^^^^^^^^^^^^ not found in this scope
  274. 320.81 s gammaloop-workspace-doctest>
  275. 320.81 s gammaloop-workspace-doctest> error: aborting due to 1 previous error
  276. 320.81 s gammaloop-workspace-doctest>
  277. 320.81 s gammaloop-workspace-doctest> For more information about this error, try `rustc --explain E0425`.
  278. 320.81 s gammaloop-workspace-doctest> Couldn't compile the test.
  279. 320.81 s gammaloop-workspace-doctest> ---- crates/gammaloop-api/src/python.rs - python::atom_to_dots (line 157) stdout ----
  280. 320.81 s gammaloop-workspace-doctest> error[E0425]: cannot find function `to_dots` in this scope
  281. 320.81 s gammaloop-workspace-doctest> --> crates/gammaloop-api/src/python.rs:158:1
  282. 320.81 s gammaloop-workspace-doctest> |
  283. 320.81 s gammaloop-workspace-doctest> 158 | to_dots("p(mu) * q(mu)")
  284. 320.81 s gammaloop-workspace-doctest> | ^^^^^^^ not found in this scope
  285. 320.81 s gammaloop-workspace-doctest>
  286. 320.81 s gammaloop-workspace-doctest> error: aborting due to 1 previous error
  287. 320.81 s gammaloop-workspace-doctest>
  288. 320.81 s gammaloop-workspace-doctest> For more information about this error, try `rustc --explain E0425`.
  289. 320.81 s gammaloop-workspace-doctest> Couldn't compile the test.
  290. 320.81 s gammaloop-workspace-doctest> ---- crates/gammaloop-api/src/python.rs - python::evaluate_graph_overall_factor (line 95) stdout ----
  291. 320.81 s gammaloop-workspace-doctest> error[E0425]: cannot find function `evaluate_graph_overall_factor` in this scope
  292. 320.81 s gammaloop-workspace-doctest> --> crates/gammaloop-api/src/python.rs:96:1
  293. 320.81 s gammaloop-workspace-doctest> |
  294. 320.81 s gammaloop-workspace-doctest> 96 | evaluate_graph_overall_factor(
  295. 320.81 s gammaloop-workspace-doctest> | ^^^^^^^^^^^^^^^^^^^^^^^^^^^^^ not found in this scope
  296. 320.81 s gammaloop-workspace-doctest>
  297. 320.81 s gammaloop-workspace-doctest> error: aborting due to 1 previous error
  298. 320.81 s gammaloop-workspace-doctest>
  299. 320.81 s gammaloop-workspace-doctest> For more information about this error, try `rustc --explain E0425`.
  300. 320.81 s gammaloop-workspace-doctest> Couldn't compile the test.
  301. 320.81 s gammaloop-workspace-doctest> ---- crates/gammaloop-api/src/python.rs - python::GammaLoopAPI::new_python (line 2804) stdout ----
  302. 320.81 s gammaloop-workspace-doctest> error[E0425]: cannot find value `api` in this scope
  303. 320.81 s gammaloop-workspace-doctest> --> crates/gammaloop-api/src/python.rs:2805:1
  304. 320.81 s gammaloop-workspace-doctest> |
  305. 320.81 s gammaloop-workspace-doctest> 2805 | api = GammaLoopAPI(state_folder="./state", read_only_state=True)
  306. 320.81 s gammaloop-workspace-doctest> | ^^^
  307. 320.81 s gammaloop-workspace-doctest> |
  308. 320.81 s gammaloop-workspace-doctest> help: you might have meant to introduce a new binding
  309. 320.81 s gammaloop-workspace-doctest> |
  310. 320.81 s gammaloop-workspace-doctest> 2805 | let api = GammaLoopAPI(state_folder="./state", read_only_state=True)
  311. 320.81 s gammaloop-workspace-doctest> | +++
  312. 320.81 s gammaloop-workspace-doctest>
  313. 320.81 s gammaloop-workspace-doctest> error[E0425]: cannot find value `state_folder` in this scope
  314. 320.81 s gammaloop-workspace-doctest> --> crates/gammaloop-api/src/python.rs:2805:20
  315. 320.81 s gammaloop-workspace-doctest> |
  316. 320.81 s gammaloop-workspace-doctest> 2805 | api = GammaLoopAPI(state_folder="./state", read_only_state=True)
  317. 320.81 s gammaloop-workspace-doctest> | ^^^^^^^^^^^^ not found in this scope
  318. 320.81 s gammaloop-workspace-doctest>
  319. 320.81 s gammaloop-workspace-doctest> error[E0425]: cannot find value `read_only_state` in this scope
  320. 320.81 s gammaloop-workspace-doctest> --> crates/gammaloop-api/src/python.rs:2805:44
  321. 320.81 s gammaloop-workspace-doctest> |
  322. 320.81 s gammaloop-workspace-doctest> 2805 | api = GammaLoopAPI(state_folder="./state", read_only_state=True)
  323. 320.81 s gammaloop-workspace-doctest> | ^^^^^^^^^^^^^^^ not found in this scope
  324. 320.81 s gammaloop-workspace-doctest>
  325. 320.81 s gammaloop-workspace-doctest> error[E0425]: cannot find value `True` in this scope
  326. 320.81 s gammaloop-workspace-doctest> --> crates/gammaloop-api/src/python.rs:2805:60
  327. 320.81 s gammaloop-workspace-doctest> |
  328. 320.81 s gammaloop-workspace-doctest> 2805 | api = GammaLoopAPI(state_folder="./state", read_only_state=True)
  329. 320.81 s gammaloop-workspace-doctest> | ^^^^ not found in this scope
  330. 320.81 s gammaloop-workspace-doctest> |
  331. 320.81 s gammaloop-workspace-doctest> help: you may want to use a bool value instead
  332. 320.81 s gammaloop-workspace-doctest> |
  333. 320.81 s gammaloop-workspace-doctest> 2805 - api = GammaLoopAPI(state_folder="./state", read_only_state=True)
  334. 320.81 s gammaloop-workspace-doctest> 2805 + api = GammaLoopAPI(state_folder="./state", read_only_state=true)
  335. 320.81 s gammaloop-workspace-doctest> |
  336. 320.81 s gammaloop-workspace-doctest>
  337. 320.81 s gammaloop-workspace-doctest> error[E0425]: cannot find function, tuple struct or tuple variant `GammaLoopAPI` in this scope
  338. 320.81 s gammaloop-workspace-doctest> --> crates/gammaloop-api/src/python.rs:2805:7
  339. 320.81 s gammaloop-workspace-doctest> |
  340. 320.81 s gammaloop-workspace-doctest> 2805 | api = GammaLoopAPI(state_folder="./state", read_only_state=True)
  341. 320.81 s gammaloop-workspace-doctest> | ^^^^^^^^^^^^ not found in this scope
  342. 320.81 s gammaloop-workspace-doctest>
  343. 320.81 s gammaloop-workspace-doctest> error: aborting due to 5 previous errors
  344. 320.81 s gammaloop-workspace-doctest>
  345. 320.81 s gammaloop-workspace-doctest> For more information about this error, try `rustc --explain E0425`.
  346. 320.81 s gammaloop-workspace-doctest> Couldn't compile the test.
  347. 320.81 s gammaloop-workspace-doctest>
  348. 320.81 s gammaloop-workspace-doctest> failures:
  349. 320.81 s gammaloop-workspace-doctest> crates/gammaloop-api/src/python.rs - python::GammaLoopAPI::evaluate_sample (line 2926)
  350. 320.81 s gammaloop-workspace-doctest> crates/gammaloop-api/src/python.rs - python::GammaLoopAPI::evaluate_samples (line 3040)
  351. 320.81 s gammaloop-workspace-doctest> crates/gammaloop-api/src/python.rs - python::GammaLoopAPI::get_active_command_blocks (line 3652)
  352. 320.81 s gammaloop-workspace-doctest> crates/gammaloop-api/src/python.rs - python::GammaLoopAPI::get_default_runtime_settings (line 3688)
  353. 320.81 s gammaloop-workspace-doctest> crates/gammaloop-api/src/python.rs - python::GammaLoopAPI::get_global_settings (line 3631)
  354. 320.81 s gammaloop-workspace-doctest> crates/gammaloop-api/src/python.rs - python::GammaLoopAPI::get_integrand_info (line 3496)
  355. 320.81 s gammaloop-workspace-doctest> crates/gammaloop-api/src/python.rs - python::GammaLoopAPI::get_integrand_settings (line 3539)
  356. 320.81 s gammaloop-workspace-doctest> crates/gammaloop-api/src/python.rs - python::GammaLoopAPI::get_run_history (line 3603)
  357. 320.81 s gammaloop-workspace-doctest> crates/gammaloop-api/src/python.rs - python::GammaLoopAPI::new_python (line 2804)
  358. 320.81 s gammaloop-workspace-doctest> crates/gammaloop-api/src/python.rs - python::GammaLoopAPI::run_command (line 3793)
  359. 320.81 s gammaloop-workspace-doctest> crates/gammaloop-api/src/python.rs - python::atom_to_canonical_string (line 128)
  360. 320.81 s gammaloop-workspace-doctest> crates/gammaloop-api/src/python.rs - python::atom_to_dots (line 157)
  361. 320.81 s gammaloop-workspace-doctest> crates/gammaloop-api/src/python.rs - python::evaluate_graph_overall_factor (line 95)
  362. 320.81 s gammaloop-workspace-doctest>
  363. 320.81 s gammaloop-workspace-doctest> test result: FAILED. 0 passed; 13 failed; 0 ignored; 0 measured; 0 filtered out; finished in 0.11s
  364. 320.81 s gammaloop-workspace-doctest>
  365. 320.81 s gammaloop-workspace-doctest> error: doctest failed, to rerun pass `-p gammaloop-api --doc`
  366. 321.31 s error: Cannot build '/nix/store/1v2gvnq6liv4ivdz0v1ycq4ka2zd8ni3-gammaloop-workspace-doctest-0.1.0.drv'.
  367. 321.31 s Reason: builder failed with exit code 101.
  368. 321.31 s Output paths:
  369. 321.31 s /nix/store/2zwrpghrg0khyjn3zdyd48zm4jbgkj7j-gammaloop-workspace-doctest-0.1.0
  370. 321.31 s Last 349 log lines:
  371. 321.31 s > Running phase: unpackPhase
  372. 321.31 s > unpacking source archive /nix/store/9wvq6ybm6dprplm1h2869fg539dqvd85-source
  373. 321.31 s > source root is source
  374. 321.31 s > Running phase: patchPhase
  375. 321.31 s > Executing configureCargoCommonVars
  376. 321.31 s > decompressing cargo artifacts from /nix/store/kbgwngi7xvi54jsr0kp8rhj1b9mfja7d-gammaloop-workspace-deps-deps-0.1.0/target.tar.zst to target
  377. 321.31 s > Running phase: updateAutotoolsGnuConfigScriptsPhase
  378. 321.31 s > Running phase: configurePhase
  379. 321.31 s > will append /build/source/.cargo-home/config.toml with contents of /nix/store/xdy1vvhll2bijdplvl9fcc2b9plkxhaa-vendor-cargo-deps/config.toml
  380. 321.31 s > default configurePhase, nothing to do
  381. 321.31 s > Running phase: buildPhase
  382. 321.31 s > +++ command cargo --version
  383. 321.31 s > cargo 1.97.0 (c980f4866 2026-06-30)
  384. 321.31 s > +++ command cargo test --profile ci-optim --doc --locked --workspace --features gammaloop-api/cli,gammaloop-tracing-filter/clap,gammaloop-tracing-filter/symbolica,idenso/bincode,idenso/reference-cases,linnet/bincode,linnet/drawing,linnet/nodestore-vec,linnet/rkyv,linnet/serde,linnet/symbolica,spenso-macros/shadowing,spenso/shadowing,symbolica/tracing_max_level_info
  385. 321.31 s > Compiling target-lexicon v0.13.5
  386. 321.31 s > Compiling symbolica v2.2.0 (https://github.com/symbolica-dev/symbolica?branch=dev#0441bd7a)
  387. 321.31 s > Compiling maplit v1.0.2
  388. 321.31 s > Compiling gammaloop-tracing-filter-macros v0.1.0 (/build/source/crates/gammaloop-tracing-filter-macros)
  389. 321.31 s > Compiling vakint v0.1.2 (/build/source/crates/vakint)
  390. 321.31 s > Compiling gammalooprs v0.3.4 (/build/source/crates/gammalooprs)
  391. 321.31 s > Compiling alphal00p-docs-macros v0.1.0 (/build/source/crates/alphal00p-docs-macros)
  392. 321.31 s > Compiling alphal00p-docs-schema v0.1.0 (/build/source/crates/alphal00p-docs-schema)
  393. 321.31 s > Compiling rustc_version v0.4.1
  394. 321.31 s > Compiling bincode v1.3.3
  395. 321.31 s > Compiling gungraun-runner v0.18.2
  396. 321.31 s > Compiling target-triple v1.0.1
  397. 321.31 s > Compiling iai-callgrind-runner v0.14.2
  398. 321.31 s > Compiling clinnet v0.1.8 (/build/source/crates/clinnet)
  399. 321.31 s > Compiling gammaloop-integration-tests v0.1.0 (/build/source/tests)
  400. 321.31 s > Compiling test-log-core v0.2.20
  401. 321.31 s > Compiling wait-timeout v0.2.1
  402. 321.31 s > Compiling bit-vec v0.8.0
  403. 321.31 s > Compiling quick-error v1.2.3
  404. 321.31 s > Compiling iai-callgrind v0.14.2
  405. 321.31 s > Compiling rusty-fork v0.3.1
  406. 321.31 s > Compiling bit-set v0.8.0
  407. 321.31 s > Compiling iai-callgrind-macros v0.5.1
  408. 321.31 s > Compiling rand_xorshift v0.4.0
  409. 321.31 s > Compiling console v0.15.11
  410. 321.31 s > Compiling glob v0.3.4
  411. 321.31 s > Compiling termcolor v1.4.1
  412. 321.31 s > Compiling gungraun-macros v0.8.0
  413. 321.31 s > Compiling base64 v0.21.7
  414. 321.31 s > Compiling unarray v0.1.4
  415. 321.31 s > Compiling proptest v1.11.0
  416. 321.31 s > Compiling alphal00p-docs-catalogs v0.1.0 (/build/source/crates/alphal00p-docs-catalogs)
  417. 321.31 s > Compiling ron v0.8.1
  418. 321.31 s > Compiling pyo3-build-config v0.28.3
  419. 321.31 s > Compiling trybuild v1.0.120
  420. 321.31 s > Compiling similar-asserts v1.7.0
  421. 321.31 s > Compiling alphal00p-docs-builder v0.1.0 (/build/source/crates/alphal00p-docs-builder)
  422. 321.31 s > Compiling kurvst v0.1.0 (/build/source/crates/kurvst)
  423. 321.31 s > Compiling test-log-macros v0.2.20
  424. 321.31 s > Compiling test-log v0.2.20
  425. 321.31 s > Compiling alphal00p-docs-examples v0.1.0 (/build/source/crates/alphal00p-docs-examples)
  426. 321.31 s > Compiling pyo3-macros-backend v0.28.3
  427. 321.31 s > Compiling pyo3-ffi v0.28.3
  428. 321.31 s > Compiling pyo3 v0.28.3
  429. 321.31 s > Compiling numpy v0.28.0
  430. 321.31 s > Compiling gammaloop-api v0.1.0 (/build/source/crates/gammaloop-api)
  431. 321.31 s > Compiling gungraun v0.18.2
  432. 321.31 s > Compiling pyo3-macros v0.28.3
  433. 321.31 s > Compiling pyo3-stub-gen v0.17.2
  434. 321.31 s > Compiling numerica v2.2.0 (https://github.com/symbolica-dev/symbolica?branch=dev#0441bd7a)
  435. 321.31 s > Compiling graphica v2.1.0 (https://github.com/symbolica-dev/symbolica?branch=dev#0441bd7a)
  436. 321.31 s > Compiling symbolica-utils v0.1.0 (/build/source/crates/symbolica-utils)
  437. 321.31 s > Compiling gammaloop-workspace-hack v0.1.0 (/build/source/crates/gammaloop-workspace-hack)
  438. 321.31 s > Compiling spenso-macros v0.3.2 (/build/source/crates/spenso-macros)
  439. 321.31 s > Compiling linnet v0.17.0 (/build/source/crates/linnet)
  440. 321.31 s > Compiling spenso v0.6.0 (/build/source/crates/spenso)
  441. 321.31 s > Compiling idenso v0.3.0 (/build/source/crates/idenso)
  442. 321.31 s > Compiling gammaloop-tracing-filter v0.1.0 (/build/source/crates/gammaloop-tracing-filter)
  443. 321.31 s > Compiling spenso-hep-lib v0.1.7 (/build/source/crates/spenso-hep-lib)
  444. 321.31 s > Compiling spynso3 v0.1.2 (/build/source/crates/spynso3)
  445. 321.31 s > Compiling linnest v0.1.0 (/build/source/crates/linnest)
  446. 321.31 s > Compiling linnet-py v0.1.0 (/build/source/crates/linnet-py)
  447. 321.31 s > Finished `ci-optim` profile [optimized] target(s) in 5m 04s
  448. 321.31 s > warning: the following packages contain code that will be rejected by a future version of Rust: proc-macro-error2 v2.0.1
  449. 321.31 s > note: to see what the problems were, use the option `--future-incompat-report`, or run `cargo report future-incompatibilities --id 1`
  450. 321.31 s > Doc-tests alphal00p_docs_builder
  451. 321.31 s >
  452. 321.31 s > running 0 tests
  453. 321.31 s >
  454. 321.31 s > test result: ok. 0 passed; 0 failed; 0 ignored; 0 measured; 0 filtered out; finished in 0.00s
  455. 321.31 s >
  456. 321.31 s > Doc-tests alphal00p_docs_catalogs
  457. 321.31 s >
  458. 321.31 s > running 0 tests
  459. 321.31 s >
  460. 321.31 s > test result: ok. 0 passed; 0 failed; 0 ignored; 0 measured; 0 filtered out; finished in 0.00s
  461. 321.31 s >
  462. 321.31 s > Doc-tests alphal00p_docs_examples
  463. 321.31 s >
  464. 321.31 s > running 0 tests
  465. 321.31 s >
  466. 321.31 s > test result: ok. 0 passed; 0 failed; 0 ignored; 0 measured; 0 filtered out; finished in 0.00s
  467. 321.31 s >
  468. 321.31 s > Doc-tests alphal00p_docs
  469. 321.31 s >
  470. 321.31 s > running 0 tests
  471. 321.31 s >
  472. 321.31 s > test result: ok. 0 passed; 0 failed; 0 ignored; 0 measured; 0 filtered out; finished in 0.00s
  473. 321.31 s >
  474. 321.31 s > Doc-tests alphal00p_docs_schema
  475. 321.31 s >
  476. 321.31 s > running 0 tests
  477. 321.31 s >
  478. 321.31 s > test result: ok. 0 passed; 0 failed; 0 ignored; 0 measured; 0 filtered out; finished in 0.00s
  479. 321.31 s >
  480. 321.31 s > Doc-tests clinnet
  481. 321.31 s >
  482. 321.31 s > running 0 tests
  483. 321.31 s >
  484. 321.31 s > test result: ok. 0 passed; 0 failed; 0 ignored; 0 measured; 0 filtered out; finished in 0.00s
  485. 321.31 s >
  486. 321.31 s > Doc-tests gammaloop_api
  487. 321.31 s >
  488. 321.31 s > running 13 tests
  489. 321.31 s > test crates/gammaloop-api/src/python.rs - python::GammaLoopAPI::evaluate_sample (line 2926) ... FAILED
  490. 321.31 s > test crates/gammaloop-api/src/python.rs - python::GammaLoopAPI::get_integrand_info (line 3496) ... FAILED
  491. 321.31 s > test crates/gammaloop-api/src/python.rs - python::GammaLoopAPI::get_active_command_blocks (line 3652) ... FAILED
  492. 321.31 s > test crates/gammaloop-api/src/python.rs - python::GammaLoopAPI::get_default_runtime_settings (line 3688) ... FAILED
  493. 321.31 s > test crates/gammaloop-api/src/python.rs - python::GammaLoopAPI::get_integrand_settings (line 3539) ... FAILED
  494. 321.31 s > test crates/gammaloop-api/src/python.rs - python::GammaLoopAPI::evaluate_samples (line 3040) ... FAILED
  495. 321.31 s > test crates/gammaloop-api/src/python.rs - python::GammaLoopAPI::run_command (line 3793) ... FAILED
  496. 321.31 s > test crates/gammaloop-api/src/python.rs - python::GammaLoopAPI::get_global_settings (line 3631) ... FAILED
  497. 321.31 s > test crates/gammaloop-api/src/python.rs - python::GammaLoopAPI::get_run_history (line 3603) ... FAILED
  498. 321.31 s > test crates/gammaloop-api/src/python.rs - python::atom_to_canonical_string (line 128) ... FAILED
  499. 321.31 s > test crates/gammaloop-api/src/python.rs - python::atom_to_dots (line 157) ... FAILED
  500. 321.31 s > test crates/gammaloop-api/src/python.rs - python::evaluate_graph_overall_factor (line 95) ... FAILED
  501. 321.31 s > test crates/gammaloop-api/src/python.rs - python::GammaLoopAPI::new_python (line 2804) ... FAILED
  502. 321.31 s >
  503. 321.31 s > failures:
  504. 321.31 s >
  505. 321.31 s > ---- crates/gammaloop-api/src/python.rs - python::GammaLoopAPI::evaluate_sample (line 2926) stdout ----
  506. 321.31 s > error: expected one of `!` or `::`, found `=`
  507. 321.31 s > --> crates/gammaloop-api/src/python.rs:2927:8
  508. 321.31 s > |
  509. 321.31 s > 2927 | result = api.evaluate_sample(point, process_id=0, minimal_output=True)
  510. 321.31 s > | ^ expected one of `!` or `::`
  511. 321.31 s >
  512. 321.31 s > error: aborting due to 1 previous error
  513. 321.31 s >
  514. 321.31 s > Couldn't compile the test.
  515. 321.31 s > ---- crates/gammaloop-api/src/python.rs - python::GammaLoopAPI::get_integrand_info (line 3496) stdout ----
  516. 321.31 s > error: expected one of `!` or `::`, found `=`
  517. 321.31 s > --> crates/gammaloop-api/src/python.rs:3497:6
  518. 321.31 s > |
  519. 321.31 s > 3497 | info = api.get_integrand_info(process_id=0)
  520. 321.31 s > | ^ expected one of `!` or `::`
  521. 321.31 s >
  522. 321.31 s > error: aborting due to 1 previous error
  523. 321.31 s >
  524. 321.31 s > Couldn't compile the test.
  525. 321.31 s > ---- crates/gammaloop-api/src/python.rs - python::GammaLoopAPI::get_active_command_blocks (line 3652) stdout ----
  526. 321.31 s > error: expected item, found keyword `for`
  527. 321.31 s > --> crates/gammaloop-api/src/python.rs:3653:1
  528. 321.31 s > |
  529. 321.31 s > 3653 | for name, commands in api.get_active_command_blocks().items():
  530. 321.31 s > | ^^^ expected item
  531. 321.31 s > |
  532. 321.31 s > = note: for a full list of items that can appear in modules, see <https://doc.rust-lang.org/reference/items.html>
  533. 321.31 s >
  534. 321.31 s > error: aborting due to 1 previous error
  535. 321.31 s >
  536. 321.31 s > Couldn't compile the test.
  537. 321.31 s > ---- crates/gammaloop-api/src/python.rs - python::GammaLoopAPI::get_default_runtime_settings (line 3688) stdout ----
  538. 321.31 s > error: expected one of `!` or `::`, found `=`
  539. 321.31 s > --> crates/gammaloop-api/src/python.rs:3689:9
  540. 321.31 s > |
  541. 321.31 s > 3689 | runtime = api.get_default_runtime_settings()
  542. 321.31 s > | ^ expected one of `!` or `::`
  543. 321.31 s >
  544. 321.31 s > error: aborting due to 1 previous error
  545. 321.31 s >
  546. 321.31 s > Couldn't compile the test.
  547. 321.31 s > ---- crates/gammaloop-api/src/python.rs - python::GammaLoopAPI::get_integrand_settings (line 3539) stdout ----
  548. 321.31 s > error: expected one of `!` or `::`, found `=`
  549. 321.31 s > --> crates/gammaloop-api/src/python.rs:3540:10
  550. 321.31 s > |
  551. 321.31 s > 3540 | settings = api.get_integrand_settings(process_id=0)
  552. 321.31 s > | ^ expected one of `!` or `::`
  553. 321.31 s >
  554. 321.31 s > error: aborting due to 1 previous error
  555. 321.31 s >
  556. 321.31 s > Couldn't compile the test.
  557. 321.31 s > ---- crates/gammaloop-api/src/python.rs - python::GammaLoopAPI::evaluate_samples (line 3040) stdout ----
  558. 321.31 s > error: expected one of `!` or `::`, found `=`
  559. 321.31 s > --> crates/gammaloop-api/src/python.rs:3041:8
  560. 321.31 s > |
  561. 321.31 s > 3041 | points = numpy.asarray(points, dtype=numpy.float64)
  562. 321.31 s > | ^ expected one of `!` or `::`
  563. 321.31 s >
  564. 321.31 s > error: aborting due to 1 previous error
  565. 321.31 s >
  566. 321.31 s > Couldn't compile the test.
  567. 321.31 s > ---- crates/gammaloop-api/src/python.rs - python::GammaLoopAPI::run_command (line 3793) stdout ----
  568. 321.31 s > error[E0425]: cannot find value `api` in this scope
  569. 321.31 s > --> crates/gammaloop-api/src/python.rs:3794:1
  570. 321.31 s > |
  571. 321.31 s > 3794 | api.run("display processes")
  572. 321.31 s > | ^^^ not found in this scope
  573. 321.31 s >
  574. 321.31 s > error: aborting due to 1 previous error
  575. 321.31 s >
  576. 321.31 s > For more information about this error, try `rustc --explain E0425`.
  577. 321.31 s > Couldn't compile the test.
  578. 321.31 s > ---- crates/gammaloop-api/src/python.rs - python::GammaLoopAPI::get_global_settings (line 3631) stdout ----
  579. 321.31 s > error[E0425]: cannot find value `settings_toml` in this scope
  580. 321.31 s > --> crates/gammaloop-api/src/python.rs:3632:1
  581. 321.31 s > |
  582. 321.31 s > 3632 | settings_toml = api.get_global_settings()
  583. 321.31 s > | ^^^^^^^^^^^^^
  584. 321.31 s > |
  585. 321.31 s > help: you might have meant to introduce a new binding
  586. 321.31 s > |
  587. 321.31 s > 3632 | let settings_toml = api.get_global_settings()
  588. 321.31 s > | +++
  589. 321.31 s >
  590. 321.31 s > error[E0425]: cannot find value `api` in this scope
  591. 321.31 s > --> crates/gammaloop-api/src/python.rs:3632:17
  592. 321.31 s > |
  593. 321.31 s > 3632 | settings_toml = api.get_global_settings()
  594. 321.31 s > | ^^^ not found in this scope
  595. 321.31 s >
  596. 321.31 s > error: aborting due to 2 previous errors
  597. 321.31 s >
  598. 321.31 s > For more information about this error, try `rustc --explain E0425`.
  599. 321.31 s > Couldn't compile the test.
  600. 321.31 s > ---- crates/gammaloop-api/src/python.rs - python::GammaLoopAPI::get_run_history (line 3603) stdout ----
  601. 321.31 s > error[E0425]: cannot find value `run_card_toml` in this scope
  602. 321.31 s > --> crates/gammaloop-api/src/python.rs:3604:1
  603. 321.31 s > |
  604. 321.31 s > 3604 | run_card_toml = api.get_run_history()
  605. 321.31 s > | ^^^^^^^^^^^^^
  606. 321.31 s > |
  607. 321.31 s > help: you might have meant to introduce a new binding
  608. 321.31 s > |
  609. 321.31 s > 3604 | let run_card_toml = api.get_run_history()
  610. 321.31 s > | +++
  611. 321.31 s >
  612. 321.31 s > error[E0425]: cannot find value `api` in this scope
  613. 321.31 s > --> crates/gammaloop-api/src/python.rs:3604:17
  614. 321.31 s > |
  615. 321.31 s > 3604 | run_card_toml = api.get_run_history()
  616. 321.31 s > | ^^^ not found in this scope
  617. 321.31 s >
  618. 321.31 s > error: aborting due to 2 previous errors
  619. 321.31 s >
  620. 321.31 s > For more information about this error, try `rustc --explain E0425`.
  621. 321.31 s > Couldn't compile the test.
  622. 321.31 s > ---- crates/gammaloop-api/src/python.rs - python::atom_to_canonical_string (line 128) stdout ----
  623. 321.31 s > error[E0425]: cannot find function `atom_to_canonical_string` in this scope
  624. 321.31 s > --> crates/gammaloop-api/src/python.rs:129:1
  625. 321.31 s > |
  626. 321.31 s > 129 | atom_to_canonical_string("x + x")
  627. 321.31 s > | ^^^^^^^^^^^^^^^^^^^^^^^^ not found in this scope
  628. 321.31 s >
  629. 321.31 s > error: aborting due to 1 previous error
  630. 321.31 s >
  631. 321.31 s > For more information about this error, try `rustc --explain E0425`.
  632. 321.31 s > Couldn't compile the test.
  633. 321.31 s > ---- crates/gammaloop-api/src/python.rs - python::atom_to_dots (line 157) stdout ----
  634. 321.31 s > error[E0425]: cannot find function `to_dots` in this scope
  635. 321.31 s > --> crates/gammaloop-api/src/python.rs:158:1
  636. 321.31 s > |
  637. 321.31 s > 158 | to_dots("p(mu) * q(mu)")
  638. 321.31 s > | ^^^^^^^ not found in this scope
  639. 321.31 s >
  640. 321.31 s > error: aborting due to 1 previous error
  641. 321.31 s >
  642. 321.31 s > For more information about this error, try `rustc --explain E0425`.
  643. 321.31 s > Couldn't compile the test.
  644. 321.31 s > ---- crates/gammaloop-api/src/python.rs - python::evaluate_graph_overall_factor (line 95) stdout ----
  645. 321.31 s > error[E0425]: cannot find function `evaluate_graph_overall_factor` in this scope
  646. 321.31 s > --> crates/gammaloop-api/src/python.rs:96:1
  647. 321.31 s > |
  648. 321.31 s > 96 | evaluate_graph_overall_factor(
  649. 321.31 s > | ^^^^^^^^^^^^^^^^^^^^^^^^^^^^^ not found in this scope
  650. 321.31 s >
  651. 321.31 s > error: aborting due to 1 previous error
  652. 321.31 s >
  653. 321.31 s > For more information about this error, try `rustc --explain E0425`.
  654. 321.31 s > Couldn't compile the test.
  655. 321.31 s > ---- crates/gammaloop-api/src/python.rs - python::GammaLoopAPI::new_python (line 2804) stdout ----
  656. 321.31 s > error[E0425]: cannot find value `api` in this scope
  657. 321.31 s > --> crates/gammaloop-api/src/python.rs:2805:1
  658. 321.31 s > |
  659. 321.31 s > 2805 | api = GammaLoopAPI(state_folder="./state", read_only_state=True)
  660. 321.31 s > | ^^^
  661. 321.31 s > |
  662. 321.31 s > help: you might have meant to introduce a new binding
  663. 321.31 s > |
  664. 321.31 s > 2805 | let api = GammaLoopAPI(state_folder="./state", read_only_state=True)
  665. 321.31 s > | +++
  666. 321.31 s >
  667. 321.31 s > error[E0425]: cannot find value `state_folder` in this scope
  668. 321.31 s > --> crates/gammaloop-api/src/python.rs:2805:20
  669. 321.31 s > |
  670. 321.31 s > 2805 | api = GammaLoopAPI(state_folder="./state", read_only_state=True)
  671. 321.31 s > | ^^^^^^^^^^^^ not found in this scope
  672. 321.31 s >
  673. 321.31 s > error[E0425]: cannot find value `read_only_state` in this scope
  674. 321.31 s > --> crates/gammaloop-api/src/python.rs:2805:44
  675. 321.31 s > |
  676. 321.31 s > 2805 | api = GammaLoopAPI(state_folder="./state", read_only_state=True)
  677. 321.31 s > | ^^^^^^^^^^^^^^^ not found in this scope
  678. 321.31 s >
  679. 321.31 s > error[E0425]: cannot find value `True` in this scope
  680. 321.31 s > --> crates/gammaloop-api/src/python.rs:2805:60
  681. 321.31 s > |
  682. 321.31 s > 2805 | api = GammaLoopAPI(state_folder="./state", read_only_state=True)
  683. 321.31 s > | ^^^^ not found in this scope
  684. 321.31 s > |
  685. 321.31 s > help: you may want to use a bool value instead
  686. 321.31 s > |
  687. 321.31 s > 2805 - api = GammaLoopAPI(state_folder="./state", read_only_state=True)
  688. 321.31 s > 2805 + api = GammaLoopAPI(state_folder="./state", read_only_state=true)
  689. 321.31 s > |
  690. 321.31 s >
  691. 321.31 s > error[E0425]: cannot find function, tuple struct or tuple variant `GammaLoopAPI` in this scope
  692. 321.31 s > --> crates/gammaloop-api/src/python.rs:2805:7
  693. 321.31 s > |
  694. 321.31 s > 2805 | api = GammaLoopAPI(state_folder="./state", read_only_state=True)
  695. 321.31 s > | ^^^^^^^^^^^^ not found in this scope
  696. 321.31 s >
  697. 321.31 s > error: aborting due to 5 previous errors
  698. 321.31 s >
  699. 321.31 s > For more information about this error, try `rustc --explain E0425`.
  700. 321.31 s > Couldn't compile the test.
  701. 321.31 s >
  702. 321.31 s > failures:
  703. 321.31 s > crates/gammaloop-api/src/python.rs - python::GammaLoopAPI::evaluate_sample (line 2926)
  704. 321.31 s > crates/gammaloop-api/src/python.rs - python::GammaLoopAPI::evaluate_samples (line 3040)
  705. 321.31 s > crates/gammaloop-api/src/python.rs - python::GammaLoopAPI::get_active_command_blocks (line 3652)
  706. 321.31 s > crates/gammaloop-api/src/python.rs - python::GammaLoopAPI::get_default_runtime_settings (line 3688)
  707. 321.31 s > crates/gammaloop-api/src/python.rs - python::GammaLoopAPI::get_global_settings (line 3631)
  708. 321.31 s > crates/gammaloop-api/src/python.rs - python::GammaLoopAPI::get_integrand_info (line 3496)
  709. 321.31 s > crates/gammaloop-api/src/python.rs - python::GammaLoopAPI::get_integrand_settings (line 3539)
  710. 321.31 s > crates/gammaloop-api/src/python.rs - python::GammaLoopAPI::get_run_history (line 3603)
  711. 321.31 s > crates/gammaloop-api/src/python.rs - python::GammaLoopAPI::new_python (line 2804)
  712. 321.31 s > crates/gammaloop-api/src/python.rs - python::GammaLoopAPI::run_command (line 3793)
  713. 321.31 s > crates/gammaloop-api/src/python.rs - python::atom_to_canonical_string (line 128)
  714. 321.31 s > crates/gammaloop-api/src/python.rs - python::atom_to_dots (line 157)
  715. 321.31 s > crates/gammaloop-api/src/python.rs - python::evaluate_graph_overall_factor (line 95)
  716. 321.31 s >
  717. 321.31 s > test result: FAILED. 0 passed; 13 failed; 0 ignored; 0 measured; 0 filtered out; finished in 0.11s
  718. 321.31 s >
  719. 321.31 s > error: doctest failed, to rerun pass `-p gammaloop-api --doc`
  720. 321.31 s For full logs, run:
  721. 321.31 s nix log /nix/store/1v2gvnq6liv4ivdz0v1ycq4ka2zd8ni3-gammaloop-workspace-doctest-0.1.0.drv
  722. 321.40 s [0 built (1 failed), 0.0Run failed.