test packages.x86_64-linux.nix-ci-check-gammaloop-nextest-core

Reproduce this run
Original Run
  1. 0.08 s $ /nix/store/9ypz3flqsrl5xl495mm8h645gadjsxi1-coreutils-9.11/bin/timeout --kill-after=15s 7200s /nix/store/23zk8sgzamrbmj1fday15szf7f2279s8-nix-2.34.7/bin/nix --extra-experimental-features nix-command --extra-experimental-features flakes flake clone git+https://github.com/alphal00p/gammaloop --dest /tmp/nix-ci-worker/stable-pwd/repo/
  2. 0.10 s Cloning into '/tmp/nix-ci-worker/stable-pwd/repo'...
  3. 0.71 s remote: Enumerating objects: 64191, done.
  4. 0.83 s remote: Counting objects: 0% (1/9557) remote: Counting objects: 1% (96/9557) remote: Counting objects: 2% (192/9557) remote: Counting objects: 3% (287/9557) remote: Counting objects: 4% (383/9557) remote: Counting objects: 5% (478/9557) remote: Counting objects: 6% (574/9557) remote: Counting objects: 7% (669/9557) remote: Counting objects: 8% (765/9557) remote: Counting objects: 9% (861/9557) remote: Counting objects: 10% (956/9557) remote: Counting objects: 11% (1052/9557) remote: Counting objects: 12% (1147/9557) remote: Counting objects: 13% (1243/9557) remote: Counting objects: 14% (1338/9557) remote: Counting objects: 15% (1434/9557) remote: Counting objects: 16% (1530/9557) remote: Counting objects: 17% (1625/9557) remote: Counting objects: 18% (1721/9557) remote: Counting objects: 19% (1816/9557) remote: Counting objects: 20% (1912/9557) remote: Counting objects: 21% (2007/9557) remote: Counting objects: 22% (2103/9557) remote: Counting objects: 23% (2199/9557) remote: Counting objects: 24% (2294/9557) remote: Counting objects: 25% (2390/9557) remote: Counting objects: 26% (2485/9557) remote: Counting objects: 27% (2581/9557) remote: Counting objects: 28% (2676/9557) remote: Counting objects: 29% (2772/9557) remote: Counting objects: 30% (2868/9557) remote: Counting objects: 31% (2963/9557) remote: Counting objects: 32% (3059/9557) remote: Counting objects: 33% (3154/9557) remote: Counting objects: 34% (3250/9557) remote: Counting objects: 35% (3345/9557) remote: Counting objects: 36% (3441/9557) remote: Counting objects: 37% (3537/9557) remote: Counting objects: 38% (3632/9557) remote: Counting objects: 39% (3728/9557) remote: Counting objects: 40% (3823/9557) remote: Counting objects: 41% (3919/9557) remote: Counting objects: 42% (4014/9557) remote: Counting objects: 43% (4110/9557) remote: Counting objects: 44% (4206/9557) remote: Counting objects: 45% (4301/9557) remote: Counting objects: 46% (4397/9557) remote: Counting objects: 47% (4492/9557) remote: Counting objects: 48% (4588/9557) remote: Counting objects: 49% (4683/9557) remote: Counting objects: 50% (4779/9557) remote: Counting objects: 51% (4875/9557) remote: Counting objects: 52% (4970/9557) remote: Counting objects: 53% (5066/9557) remote: Counting objects: 54% (5161/9557) remote: Counting objects: 55% (5257/9557) remote: Counting objects: 56% (5352/9557) remote: Counting objects: 57% (5448/9557) remote: Counting objects: 58% (5544/9557) remote: Counting objects: 59% (5639/9557) remote: Counting objects: 60% (5735/9557) remote: Counting objects: 61% (5830/9557) remote: Counting objects: 62% (5926/9557) remote: Counting objects: 63% (6021/9557) remote: Counting objects: 64% (6117/9557) remote: Counting objects: 65% (6213/9557) remote: Counting objects: 66% (6308/9557) remote: Counting objects: 67% (6404/9557) remote: Counting objects: 68% (6499/9557) remote: Counting objects: 69% (6595/9557) remote: Counting objects: 70% (6690/9557) remote: Counting objects: 71% (6786/9557) remote: Counting objects: 72% (6882/9557) remote: Counting objects: 73% (6977/9557) remote: Counting objects: 74% (7073/9557) remote: Counting objects: 75% (7168/9557) remote: Counting objects: 76% (7264/9557) remote: Counting objects: 77% (7359/9557) remote: Counting objects: 78% (7455/9557) remote: Counting objects: 79% (7551/9557) remote: Counting objects: 80% (7646/9557) remote: Counting objects: 81% (7742/9557) remote: Counting objects: 82% (7837/9557) remote: Counting objects: 83% (7933/9557) remote: Counting objects: 84% (8028/9557) remote: Counting objects: 85% (8124/9557) remote: Counting objects: 86% (8220/9557) remote: Counting objects: 87% (8315/9557) remote: Counting objects: 88% (8411/9557) remote: Counting objects: 89% (8506/9557) remote: Counting objects: 90% (8602/9557) remote: Counting objects: 91% (8697/9557) remote: Counting objects: 92% (8793/9557) remote: Counting objects: 93% (8889/9557) remote: Counting objects: 94% (8984/9557) remote: Counting objects: 95% (9080/9557) remote: Counting objects: 96% (9175/9557) remote: Counting objects: 97% (9271/9557) remote: Counting objects: 98% (9366/9557) remote: Counting objects: 99% (9462/9557) remote: Counting objects: 100% (9557/9557) remote: Counting objects: 100% (9557/9557), done.
  5. 2.97 s remote: Compressing objects: 0% (1/2331) remote: Compressing objects: 1% (24/2331) remote: Compressing objects: 2% (47/2331) remote: Compressing objects: 3% (70/2331) remote: Compressing objects: 4% (94/2331) remote: Compressing objects: 5% (117/2331) remote: Compressing objects: 6% (140/2331) remote: Compressing objects: 7% (164/2331) remote: Compressing objects: 8% (187/2331) remote: Compressing objects: 9% (210/2331) remote: Compressing objects: 10% (234/2331) remote: Compressing objects: 11% (257/2331) remote: Compressing objects: 12% (280/2331) remote: Compressing objects: 13% (304/2331) remote: Compressing objects: 14% (327/2331) remote: Compressing objects: 15% (350/2331) remote: Compressing objects: 16% (373/2331) remote: Compressing objects: 17% (397/2331) remote: Compressing objects: 18% (420/2331) remote: Compressing objects: 19% (443/2331) remote: Compressing objects: 20% (467/2331) remote: Compressing objects: 21% (490/2331) remote: Compressing objects: 22% (513/2331) remote: Compressing objects: 23% (537/2331) remote: Compressing objects: 23% (555/2331) remote: Compressing objects: 24% (560/2331) remote: Compressing objects: 25% (583/2331) remote: Compressing objects: 26% (607/2331) remote: Compressing objects: 27% (630/2331) remote: Compressing objects: 28% (653/2331) remote: Compressing objects: 29% (676/2331) remote: Compressing objects: 30% (700/2331) remote: Compressing objects: 31% (723/2331) remote: Compressing objects: 32% (746/2331) remote: Compressing objects: 33% (770/2331) remote: Compressing objects: 33% (785/2331) remote: Compressing objects: 34% (793/2331) remote: Compressing objects: 35% (816/2331) remote: Compressing objects: 36% (840/2331) remote: Compressing objects: 37% (863/2331) remote: Compressing objects: 38% (886/2331) remote: Compressing objects: 39% (910/2331) remote: Compressing objects: 40% (933/2331) remote: Compressing objects: 41% (956/2331) remote: Compressing objects: 42% (980/2331) remote: Compressing objects: 43% (1003/2331) remote: Compressing objects: 44% (1026/2331) remote: Compressing objects: 45% (1049/2331) remote: Compressing objects: 46% (1073/2331) remote: Compressing objects: 47% (1096/2331) remote: Compressing objects: 48% (1119/2331) remote: Compressing objects: 49% (1143/2331) remote: Compressing objects: 50% (1166/2331) remote: Compressing objects: 51% (1189/2331) remote: Compressing objects: 52% (1213/2331) remote: Compressing objects: 53% (1236/2331) remote: Compressing objects: 54% (1259/2331) remote: Compressing objects: 55% (1283/2331) remote: Compressing objects: 56% (1306/2331) remote: Compressing objects: 57% (1329/2331) remote: Compressing objects: 58% (1352/2331) remote: Compressing objects: 59% (1376/2331) remote: Compressing objects: 60% (1399/2331) remote: Compressing objects: 61% (1422/2331) remote: Compressing objects: 62% (1446/2331) remote: Compressing objects: 63% (1469/2331) remote: Compressing objects: 64% (1492/2331) remote: Compressing objects: 65% (1516/2331) remote: Compressing objects: 66% (1539/2331) remote: Compressing objects: 67% (1562/2331) remote: Compressing objects: 68% (1586/2331) remote: Compressing objects: 69% (1609/2331) remote: Compressing objects: 70% (1632/2331) remote: Compressing objects: 71% (1656/2331) remote: Compressing objects: 72% (1679/2331) remote: Compressing objects: 73% (1702/2331) remote: Compressing objects: 74% (1725/2331) remote: Compressing objects: 75% (1749/2331) remote: Compressing objects: 76% (1772/2331) remote: Compressing objects: 77% (1795/2331) remote: Compressing objects: 78% (1819/2331) remote: Compressing objects: 79% (1842/2331) remote: Compressing objects: 80% (1865/2331) remote: Compressing objects: 81% (1889/2331) remote: Compressing objects: 82% (1912/2331) remote: Compressing objects: 83% (1935/2331) remote: Compressing objects: 84% (1959/2331) remote: Compressing objects: 85% (1982/2331) remote: Compressing objects: 86% (2005/2331) remote: Compressing objects: 87% (2028/2331) remote: Compressing objects: 88% (2052/2331) remote: Compressing objects: 89% (2075/2331) remote: Compressing objects: 90% (2098/2331) remote: Compressing objects: 91% (2122/2331) remote: Compressing objects: 92% (2145/2331) remote: Compressing objects: 93% (2168/2331) remote: Compressing objects: 94% (2192/2331) remote: Compressing objects: 95% (2215/2331) remote: Compressing objects: 96% (2238/2331) remote: Compressing objects: 97% (2262/2331) remote: Compressing objects: 98% (2285/2331) remote: Compressing objects: 99% (2308/2331) remote: Compressing objects: 100% (2331/2331) remote: Compressing objects: 100% (2331/2331), done.
  6. 5.88 s Receiving objects: 0% (1/64191) Receiving objects: 1% (642/64191) Receiving objects: 2% (1284/64191) Receiving objects: 3% (1926/64191) Receiving objects: 4% (2568/64191) Receiving objects: 5% (3210/64191) Receiving objects: 6% (3852/64191) Receiving objects: 7% (4494/64191) Receiving objects: 8% (5136/64191) Receiving objects: 9% (5778/64191) Receiving objects: 10% (6420/64191) Receiving objects: 11% (7062/64191) Receiving objects: 12% (7703/64191), 13.74 MiB | 27.46 MiB/s Receiving objects: 13% (8345/64191), 13.74 MiB | 27.46 MiB/s Receiving objects: 14% (8987/64191), 13.74 MiB | 27.46 MiB/s Receiving objects: 15% (9629/64191), 13.74 MiB | 27.46 MiB/s Receiving objects: 16% (10271/64191), 13.74 MiB | 27.46 MiB/s Receiving objects: 17% (10913/64191), 13.74 MiB | 27.46 MiB/s Receiving objects: 18% (11555/64191), 13.74 MiB | 27.46 MiB/s Receiving objects: 19% (12197/64191), 13.74 MiB | 27.46 MiB/s Receiving objects: 20% (12839/64191), 13.74 MiB | 27.46 MiB/s Receiving objects: 21% (13481/64191), 13.74 MiB | 27.46 MiB/s Receiving objects: 22% (14123/64191), 13.74 MiB | 27.46 MiB/s Receiving objects: 23% (14764/64191), 13.74 MiB | 27.46 MiB/s Receiving objects: 24% (15406/64191), 13.74 MiB | 27.46 MiB/s Receiving objects: 25% (16048/64191), 13.74 MiB | 27.46 MiB/s Receiving objects: 26% (16690/64191), 13.74 MiB | 27.46 MiB/s Receiving objects: 27% (17332/64191), 13.74 MiB | 27.46 MiB/s Receiving objects: 28% (17974/64191), 13.74 MiB | 27.46 MiB/s Receiving objects: 29% (18616/64191), 13.74 MiB | 27.46 MiB/s Receiving objects: 30% (19258/64191), 13.74 MiB | 27.46 MiB/s Receiving objects: 31% (19900/64191), 13.74 MiB | 27.46 MiB/s Receiving objects: 32% (20542/64191), 13.74 MiB | 27.46 MiB/s Receiving objects: 33% (21184/64191), 13.74 MiB | 27.46 MiB/s Receiving objects: 34% (21825/64191), 13.74 MiB | 27.46 MiB/s Receiving objects: 35% (22467/64191), 13.74 MiB | 27.46 MiB/s Receiving objects: 36% (23109/64191), 13.74 MiB | 27.46 MiB/s Receiving objects: 37% (23751/64191), 13.74 MiB | 27.46 MiB/s Receiving objects: 38% (24393/64191), 13.74 MiB | 27.46 MiB/s Receiving objects: 39% (25035/64191), 13.74 MiB | 27.46 MiB/s Receiving objects: 40% (25677/64191), 13.74 MiB | 27.46 MiB/s Receiving objects: 41% (26319/64191), 13.74 MiB | 27.46 MiB/s Receiving objects: 42% (26961/64191), 13.74 MiB | 27.46 MiB/s Receiving objects: 43% (27603/64191), 13.74 MiB | 27.46 MiB/s Receiving objects: 44% (28245/64191), 13.74 MiB | 27.46 MiB/s Receiving objects: 45% (28886/64191), 13.74 MiB | 27.46 MiB/s Receiving objects: 46% (29528/64191), 13.74 MiB | 27.46 MiB/s Receiving objects: 47% (30170/64191), 13.74 MiB | 27.46 MiB/s Receiving objects: 48% (30812/64191), 13.74 MiB | 27.46 MiB/s Receiving objects: 49% (31454/64191), 13.74 MiB | 27.46 MiB/s Receiving objects: 50% (32096/64191), 13.74 MiB | 27.46 MiB/s Receiving objects: 51% (32738/64191), 13.74 MiB | 27.46 MiB/s Receiving objects: 52% (33380/64191), 13.74 MiB | 27.46 MiB/s Receiving objects: 52% (33775/64191), 13.74 MiB | 27.46 MiB/s Receiving objects: 53% (34022/64191), 34.14 MiB | 34.14 MiB/s Receiving objects: 54% (34664/64191), 34.14 MiB | 34.14 MiB/s Receiving objects: 55% (35306/64191), 34.14 MiB | 34.14 MiB/s Receiving objects: 56% (35947/64191), 34.14 MiB | 34.14 MiB/s Receiving objects: 57% (36589/64191), 34.14 MiB | 34.14 MiB/s Receiving objects: 58% (37231/64191), 34.14 MiB | 34.14 MiB/s Receiving objects: 59% (37873/64191), 34.14 MiB | 34.14 MiB/s Receiving objects: 60% (38515/64191), 34.14 MiB | 34.14 MiB/s Receiving objects: 61% (39157/64191), 34.14 MiB | 34.14 MiB/s Receiving objects: 62% (39799/64191), 34.14 MiB | 34.14 MiB/s Receiving objects: 63% (40441/64191), 34.14 MiB | 34.14 MiB/s Receiving objects: 64% (41083/64191), 34.14 MiB | 34.14 MiB/s Receiving objects: 65% (41725/64191), 34.14 MiB | 34.14 MiB/s Receiving objects: 66% (42367/64191), 50.19 MiB | 33.46 MiB/s Receiving objects: 67% (43008/64191), 50.19 MiB | 33.46 MiB/s Receiving objects: 68% (43650/64191), 50.19 MiB | 33.46 MiB/s Receiving objects: 69% (44292/64191), 50.19 MiB | 33.46 MiB/s Receiving objects: 70% (44934/64191), 50.19 MiB | 33.46 MiB/s Receiving objects: 71% (45576/64191), 50.19 MiB | 33.46 MiB/s Receiving objects: 72% (46218/64191), 50.19 MiB | 33.46 MiB/s Receiving objects: 73% (46860/64191), 50.19 MiB | 33.46 MiB/s Receiving objects: 74% (47502/64191), 50.19 MiB | 33.46 MiB/s Receiving objects: 75% (48144/64191), 50.19 MiB | 33.46 MiB/s Receiving objects: 75% (48659/64191), 50.19 MiB | 33.46 MiB/s Receiving objects: 76% (48786/64191), 67.79 MiB | 33.89 MiB/s Receiving objects: 77% (49428/64191), 67.79 MiB | 33.89 MiB/s Receiving objects: 78% (50069/64191), 67.79 MiB | 33.89 MiB/s Receiving objects: 79% (50711/64191), 67.79 MiB | 33.89 MiB/s Receiving objects: 80% (51353/64191), 67.79 MiB | 33.89 MiB/s Receiving objects: 81% (51995/64191), 67.79 MiB | 33.89 MiB/s Receiving objects: 82% (52637/64191), 67.79 MiB | 33.89 MiB/s Receiving objects: 83% (53279/64191), 67.79 MiB | 33.89 MiB/s Receiving objects: 84% (53921/64191), 83.89 MiB | 33.33 MiB/s Receiving objects: 85% (54563/64191), 83.89 MiB | 33.33 MiB/s Receiving objects: 86% (55205/64191), 83.89 MiB | 33.33 MiB/s Receiving objects: 87% (55847/64191), 83.89 MiB | 33.33 MiB/s Receiving objects: 88% (56489/64191), 83.89 MiB | 33.33 MiB/s Receiving objects: 89% (57130/64191), 83.89 MiB | 33.33 MiB/s Receiving objects: 90% (57772/64191), 83.89 MiB | 33.33 MiB/s Receiving objects: 91% (58414/64191), 83.89 MiB | 33.33 MiB/s Receiving objects: 92% (59056/64191), 83.89 MiB | 33.33 MiB/s Receiving objects: 93% (59698/64191), 83.89 MiB | 33.33 MiB/s Receiving objects: 94% (60340/64191), 83.89 MiB | 33.33 MiB/s Receiving objects: 95% (60982/64191), 83.89 MiB | 33.33 MiB/s Receiving objects: 96% (61624/64191), 83.89 MiB | 33.33 MiB/s Receiving objects: 97% (62266/64191), 83.89 MiB | 33.33 MiB/s Receiving objects: 98% (62908/64191), 83.89 MiB | 33.33 MiB/s Receiving objects: 99% (63550/64191), 83.89 MiB | 33.33 MiB/s remote: Total 64191 (delta 7402), reused 7778 (delta 6681), pack-reused 54634 (from 3)
  7. 5.89 s Receiving objects: 100% (64191/64191), 83.89 MiB | 33.33 MiB/s Receiving objects: 100% (64191/64191), 97.84 MiB | 33.67 MiB/s, done.
  8. 7.62 s Resolving deltas: 0% (0/44321) Resolving deltas: 1% (444/44321) Resolving deltas: 2% (887/44321) Resolving deltas: 3% (1330/44321) Resolving deltas: 4% (1773/44321) Resolving deltas: 5% (2217/44321) Resolving deltas: 6% (2660/44321) Resolving deltas: 7% (3103/44321) Resolving deltas: 8% (3546/44321) Resolving deltas: 9% (3989/44321) Resolving deltas: 10% (4434/44321) Resolving deltas: 11% (4876/44321) Resolving deltas: 12% (5319/44321) Resolving deltas: 13% (5762/44321) Resolving deltas: 14% (6205/44321) Resolving deltas: 15% (6649/44321) Resolving deltas: 16% (7092/44321) Resolving deltas: 17% (7535/44321) Resolving deltas: 18% (7978/44321) Resolving deltas: 19% (8421/44321) Resolving deltas: 20% (8865/44321) Resolving deltas: 21% (9308/44321) Resolving deltas: 22% (9751/44321) Resolving deltas: 23% (10194/44321) Resolving deltas: 24% (10638/44321) Resolving deltas: 25% (11081/44321) Resolving deltas: 26% (11524/44321) Resolving deltas: 27% (11967/44321) Resolving deltas: 28% (12410/44321) Resolving deltas: 29% (12854/44321) Resolving deltas: 30% (13297/44321) Resolving deltas: 31% (13740/44321) Resolving deltas: 32% (14183/44321) Resolving deltas: 33% (14626/44321) Resolving deltas: 34% (15070/44321) Resolving deltas: 35% (15513/44321) Resolving deltas: 36% (15956/44321) Resolving deltas: 37% (16399/44321) Resolving deltas: 38% (16842/44321) Resolving deltas: 39% (17287/44321) Resolving deltas: 40% (17729/44321) Resolving deltas: 41% (18172/44321) Resolving deltas: 42% (18616/44321) Resolving deltas: 43% (19059/44321) Resolving deltas: 44% (19502/44321) Resolving deltas: 45% (19945/44321) Resolving deltas: 46% (20388/44321) Resolving deltas: 47% (20831/44321) Resolving deltas: 48% (21275/44321) Resolving deltas: 49% (21718/44321) Resolving deltas: 50% (22161/44321) Resolving deltas: 51% (22604/44321) Resolving deltas: 52% (23047/44321) Resolving deltas: 53% (23491/44321) Resolving deltas: 54% (23934/44321) Resolving deltas: 55% (24377/44321) Resolving deltas: 56% (24820/44321) Resolving deltas: 57% (25263/44321) Resolving deltas: 58% (25707/44321) Resolving deltas: 59% (26150/44321) Resolving deltas: 60% (26593/44321) Resolving deltas: 61% (27036/44321) Resolving deltas: 62% (27481/44321) Resolving deltas: 63% (27923/44321) Resolving deltas: 64% (28367/44321) Resolving deltas: 65% (28810/44321) Resolving deltas: 66% (29252/44321) Resolving deltas: 67% (29696/44321) Resolving deltas: 68% (30139/44321) Resolving deltas: 68% (30410/44321) Resolving deltas: 69% (30582/44321) Resolving deltas: 70% (31025/44321) Resolving deltas: 71% (31468/44321) Resolving deltas: 72% (31912/44321) Resolving deltas: 73% (32356/44321) Resolving deltas: 74% (32798/44321) Resolving deltas: 75% (33241/44321) Resolving deltas: 76% (33685/44321) Resolving deltas: 77% (34128/44321) Resolving deltas: 78% (34572/44321) Resolving deltas: 79% (35014/44321) Resolving deltas: 80% (35457/44321) Resolving deltas: 81% (35903/44321) Resolving deltas: 82% (36344/44321) Resolving deltas: 83% (36787/44321) Resolving deltas: 84% (37230/44321) Resolving deltas: 85% (37673/44321) Resolving deltas: 86% (38117/44321) Resolving deltas: 87% (38560/44321) Resolving deltas: 88% (39003/44321) Resolving deltas: 89% (39446/44321) Resolving deltas: 90% (39889/44321) Resolving deltas: 91% (40333/44321) Resolving deltas: 92% (40776/44321) Resolving deltas: 93% (41219/44321) Resolving deltas: 94% (41662/44321) Resolving deltas: 95% (42105/44321) Resolving deltas: 96% (42549/44321) Resolving deltas: 97% (42992/44321) Resolving deltas: 98% (43435/44321) Resolving deltas: 99% (43878/44321) Resolving deltas: 100% (44321/44321) Resolving deltas: 100% (44321/44321), done.
  9. 8.08 s Fetching commit 3d241888b215b0c37d1e347e0c8ddcee728dacfb for push-vrpyqyylypmw ...
  10. 8.08 s $ /nix/store/bcnisk3ydfgv26v2gw3zlky24g00yww2-git-2.54.0/bin/git fetch origin 3d241888b215b0c37d1e347e0c8ddcee728dacfb
  11. 8.65 s From https://github.com/alphal00p/gammaloop
  12. 8.65 s * branch 3d241888b215b0c37d1e347e0c8ddcee728dacfb -> FETCH_HEAD
  13. 8.68 s $ /nix/store/9ypz3flqsrl5xl495mm8h645gadjsxi1-coreutils-9.11/bin/timeout --kill-after=15s 7200s /nix/store/bcnisk3ydfgv26v2gw3zlky24g00yww2-git-2.54.0/bin/git -c advice.detachedHead=false checkout 3d241888b215b0c37d1e347e0c8ddcee728dacfb
  14. 8.93 s HEAD is now at 3d241888 run documentation tests through the Nix CI secret runner
  15. 8.94 s $ /nix/store/9ypz3flqsrl5xl495mm8h645gadjsxi1-coreutils-9.11/bin/timeout --kill-after=15s 7200s /nix/store/23zk8sgzamrbmj1fday15szf7f2279s8-nix-2.34.7/bin/nix --extra-experimental-features nix-command --extra-experimental-features flakes --log-format internal-json run .#packages.x86_64-linux.nix-ci-check-gammaloop-nextest-core --print-build-logs
  16. 13.33 s
  17. 18.08 s evaluating derivation 'g copying '/nix/store/4jdn evaluating derivation 'g copying '/nix/store/4jdn evaluating derivation 'g copying '/nix/store/4jdn evaluating derivation 'g copying '/nix/store/4jdn evaluating derivation 'g copying '/nix/store/4jdn evaluating derivation 'g copying '/nix/store/4jdn evaluating derivation 'g [0/1 built] [1/0/1 built] building ggammaloop-nextest-core> Extracting 3 binaries (including 1 non-test binary), 1 build script output directory, and 2 linked paths to /build/source
  18. 18.55 s gammaloop-nextest-core> Extracted 18 files to /build/source in 0.47s
  19. 18.56 s gammaloop-nextest-core> ------------
  20. 18.56 s gammaloop-nextest-core> Nextest run ID ffdfb75b-6de1-43f7-9727-7aede1fd6b85 with nextest profile: ci_gammaloop
  21. 18.56 s gammaloop-nextest-core> Starting 339 tests across 2 binaries
  22. 18.92 s gammaloop-nextest-core> FAIL [ 0.021s] (246/339) gammaloop-api repl::tests::completion_shows_type_hint_for_non_boolean_settings_leaf
  23. 18.92 s gammaloop-nextest-core> stdout ---
  24. 18.92 s gammaloop-nextest-core>
  25. 18.92 s gammaloop-nextest-core> running 1 test
  26. 18.92 s gammaloop-nextest-core> test repl::tests::completion_shows_type_hint_for_non_boolean_settings_leaf ... FAILED
  27. 18.92 s gammaloop-nextest-core>
  28. 18.92 s gammaloop-nextest-core> failures:
  29. 18.92 s gammaloop-nextest-core>
  30. 18.92 s gammaloop-nextest-core> failures:
  31. 18.92 s gammaloop-nextest-core> repl::tests::completion_shows_type_hint_for_non_boolean_settings_leaf
  32. 18.92 s gammaloop-nextest-core>
  33. 18.92 s gammaloop-nextest-core> test result: FAILED. 0 passed; 1 failed; 0 ignored; 0 measured; 338 filtered out; finished in 0.01s
  34. 18.92 s gammaloop-nextest-core>
  35. 18.92 s gammaloop-nextest-core> stderr ---
  36. 18.92 s gammaloop-nextest-core>
  37. 18.92 s gammaloop-nextest-core> thread 'repl::tests::completion_shows_type_hint_for_non_boolean_settings_leaf' (788) panicked at crates/gammaloop-api/src/repl.rs:5778:9:
  38. 18.92 s gammaloop-nextest-core> [Suggestion { value: "", description: Some("Number of samples in the first Monte Carlo iteration."), style: None, extra: None, span: Span { start: 42, end: 42 }, append_whitespace: false }]
  39. 18.92 s gammaloop-nextest-core> stack backtrace:
  40. 18.92 s gammaloop-nextest-core> 0: __rustc::rust_begin_unwind
  41. 18.92 s gammaloop-nextest-core> 1: core::panicking::panic_fmt
  42. 18.92 s gammaloop-nextest-core> 2: gammaloop_api::repl::tests::completion_shows_type_hint_for_non_boolean_settings_leaf
  43. 18.92 s gammaloop-nextest-core> 3: <gammaloop_api::repl::tests::completion_shows_type_hint_for_non_boolean_settings_leaf::{closure#0} as core::ops::function::FnOnce<()>>::call_once
  44. 18.92 s gammaloop-nextest-core> note: Some details are omitted, run with `RUST_BACKTRACE=full` for a verbose backtrace.
  45. 18.92 s gammaloop-nextest-core>
  46. 18.95 s gammaloop-nextest-core> FAIL [ 0.017s] (272/339) gammaloop-api templates::tests::extract_templates_uses_canonical_package_layout
  47. 18.95 s gammaloop-nextest-core> stdout ---
  48. 18.96 s gammaloop-nextest-core>
  49. 18.96 s gammaloop-nextest-core> running 1 test
  50. 18.96 s gammaloop-nextest-core> test templates::tests::extract_templates_uses_canonical_package_layout ... FAILED
  51. 18.96 s gammaloop-nextest-core>
  52. 18.96 s gammaloop-nextest-core> failures:
  53. 18.96 s gammaloop-nextest-core>
  54. 18.96 s gammaloop-nextest-core> failures:
  55. 18.96 s gammaloop-nextest-core> templates::tests::extract_templates_uses_canonical_package_layout
  56. 18.96 s gammaloop-nextest-core>
  57. 18.96 s gammaloop-nextest-core> test result: FAILED. 0 passed; 1 failed; 0 ignored; 0 measured; 338 filtered out; finished in 0.01s
  58. 18.96 s gammaloop-nextest-core>
  59. 18.96 s gammaloop-nextest-core> stderr ---
  60. 18.96 s gammaloop-nextest-core>
  61. 18.96 s gammaloop-nextest-core> thread 'templates::tests::extract_templates_uses_canonical_package_layout' (874) panicked at crates/gammaloop-api/src/templates.rs:99:9:
  62. 18.96 s gammaloop-nextest-core> assertion failed: figure.contains("amplitude-mode")
  63. 18.96 s gammaloop-nextest-core> stack backtrace:
  64. 18.96 s gammaloop-nextest-core> 0: __rustc::rust_begin_unwind
  65. 18.96 s gammaloop-nextest-core> 1: core::panicking::panic_fmt
  66. 18.96 s gammaloop-nextest-core> 2: core::panicking::panic
  67. 18.96 s gammaloop-nextest-core> 3: gammaloop_api::templates::tests::extract_templates_uses_canonical_package_layout
  68. 18.96 s gammaloop-nextest-core> 4: <gammaloop_api::templates::tests::extract_templates_uses_canonical_package_layout::{closure#0} as core::ops::function::FnOnce<()>>::call_once
  69. 18.96 s gammaloop-nextest-core> note: Some details are omitted, run with `RUST_BACKTRACE=full` for a verbose backtrace.
  70. 18.96 s gammaloop-nextest-core>
  71. 19.06 s gammaloop-nextest-core> ------------
  72. 19.06 s gammaloop-nextest-core> Summary [ 0.503s] 339 tests run: 337 passed, 2 failed, 0 skipped
  73. 19.06 s gammaloop-nextest-core> FAIL [ 0.021s] (246/339) gammaloop-api repl::tests::completion_shows_type_hint_for_non_boolean_settings_leaf
  74. 19.06 s gammaloop-nextest-core> stdout ---
  75. 19.06 s gammaloop-nextest-core>
  76. 19.06 s gammaloop-nextest-core> running 1 test
  77. 19.06 s gammaloop-nextest-core> test repl::tests::completion_shows_type_hint_for_non_boolean_settings_leaf ... FAILED
  78. 19.06 s gammaloop-nextest-core>
  79. 19.06 s gammaloop-nextest-core> failures:
  80. 19.06 s gammaloop-nextest-core>
  81. 19.06 s gammaloop-nextest-core> failures:
  82. 19.06 s gammaloop-nextest-core> repl::tests::completion_shows_type_hint_for_non_boolean_settings_leaf
  83. 19.06 s gammaloop-nextest-core>
  84. 19.06 s gammaloop-nextest-core> test result: FAILED. 0 passed; 1 failed; 0 ignored; 0 measured; 338 filtered out; finished in 0.01s
  85. 19.06 s gammaloop-nextest-core>
  86. 19.06 s gammaloop-nextest-core> stderr ---
  87. 19.06 s gammaloop-nextest-core>
  88. 19.06 s gammaloop-nextest-core> thread 'repl::tests::completion_shows_type_hint_for_non_boolean_settings_leaf' (788) panicked at crates/gammaloop-api/src/repl.rs:5778:9:
  89. 19.06 s gammaloop-nextest-core> [Suggestion { value: "", description: Some("Number of samples in the first Monte Carlo iteration."), style: None, extra: None, span: Span { start: 42, end: 42 }, append_whitespace: false }]
  90. 19.06 s gammaloop-nextest-core> stack backtrace:
  91. 19.06 s gammaloop-nextest-core> 0: __rustc::rust_begin_unwind
  92. 19.06 s gammaloop-nextest-core> 1: core::panicking::panic_fmt
  93. 19.06 s gammaloop-nextest-core> 2: gammaloop_api::repl::tests::completion_shows_type_hint_for_non_boolean_settings_leaf
  94. 19.06 s gammaloop-nextest-core> 3: <gammaloop_api::repl::tests::completion_shows_type_hint_for_non_boolean_settings_leaf::{closure#0} as core::ops::function::FnOnce<()>>::call_once
  95. 19.06 s gammaloop-nextest-core> note: Some details are omitted, run with `RUST_BACKTRACE=full` for a verbose backtrace.
  96. 19.06 s gammaloop-nextest-core>
  97. 19.06 s gammaloop-nextest-core> FAIL [ 0.017s] (272/339) gammaloop-api templates::tests::extract_templates_uses_canonical_package_layout
  98. 19.06 s gammaloop-nextest-core> stdout ---
  99. 19.06 s gammaloop-nextest-core>
  100. 19.06 s gammaloop-nextest-core> running 1 test
  101. 19.06 s gammaloop-nextest-core> test templates::tests::extract_templates_uses_canonical_package_layout ... FAILED
  102. 19.06 s gammaloop-nextest-core>
  103. 19.06 s gammaloop-nextest-core> failures:
  104. 19.06 s gammaloop-nextest-core>
  105. 19.06 s gammaloop-nextest-core> failures:
  106. 19.06 s gammaloop-nextest-core> templates::tests::extract_templates_uses_canonical_package_layout
  107. 19.06 s gammaloop-nextest-core>
  108. 19.06 s gammaloop-nextest-core> test result: FAILED. 0 passed; 1 failed; 0 ignored; 0 measured; 338 filtered out; finished in 0.01s
  109. 19.06 s gammaloop-nextest-core>
  110. 19.06 s gammaloop-nextest-core> stderr ---
  111. 19.06 s gammaloop-nextest-core>
  112. 19.06 s gammaloop-nextest-core> thread 'templates::tests::extract_templates_uses_canonical_package_layout' (874) panicked at crates/gammaloop-api/src/templates.rs:99:9:
  113. 19.06 s gammaloop-nextest-core> assertion failed: figure.contains("amplitude-mode")
  114. 19.06 s gammaloop-nextest-core> stack backtrace:
  115. 19.06 s gammaloop-nextest-core> 0: __rustc::rust_begin_unwind
  116. 19.06 s gammaloop-nextest-core> 1: core::panicking::panic_fmt
  117. 19.06 s gammaloop-nextest-core> 2: core::panicking::panic
  118. 19.06 s gammaloop-nextest-core> 3: gammaloop_api::templates::tests::extract_templates_uses_canonical_package_layout
  119. 19.06 s gammaloop-nextest-core> 4: <gammaloop_api::templates::tests::extract_templates_uses_canonical_package_layout::{closure#0} as core::ops::function::FnOnce<()>>::call_once
  120. 19.06 s gammaloop-nextest-core> note: Some details are omitted, run with `RUST_BACKTRACE=full` for a verbose backtrace.
  121. 19.06 s gammaloop-nextest-core>
  122. 19.07 s gammaloop-nextest-core> error: test run failed
  123. 19.09 s gammaloop-nextest-core>
  124. 19.09 s gammaloop-nextest-core> ========== nextest test summary ==========
  125. 19.09 s gammaloop-nextest-core> report: target/nextest/ci_gammaloop/junit.xml
  126. 19.09 s gammaloop-nextest-core> tests: 339, failures: 2, errors: 0
  127. 19.09 s gammaloop-nextest-core>
  128. 19.09 s gammaloop-nextest-core> 1. gammaloop-api::repl::tests::completion_shows_type_hint_for_non_boolean_settings_leaf
  129. 19.09 s gammaloop-nextest-core> failure: test failure with exit code 101
  130. 19.09 s gammaloop-nextest-core> thread 'repl::tests::completion_shows_type_hint_for_non_boolean_settings_leaf' (788) panicked at crates/gammaloop-api/src/repl.rs:5778:9:
  131. 19.09 s gammaloop-nextest-core> [Suggestion { value: "", description: Some("Number of samples in the first Monte Carlo iteration."), style: None, extra: None, span: Span { start: 42, end: 42 }, append_whitespace: false }]
  132. 19.09 s gammaloop-nextest-core> stack backtrace:
  133. 19.09 s gammaloop-nextest-core> 0: __rustc::rust_begin_unwind
  134. 19.09 s gammaloop-nextest-core> 1: core::panicking::panic_fmt
  135. 19.09 s gammaloop-nextest-core> 2: gammaloop_api::repl::tests::completion_shows_type_hint_for_non_boolean_settings_leaf
  136. 19.09 s gammaloop-nextest-core> 3: <gammaloop_api::repl::tests::completion_shows_type_hint_for_non_boolean_settings_leaf::{closure#0} as core::ops::function::FnOnce<()>>::call_once
  137. 19.09 s gammaloop-nextest-core> note: Some details are omitted, run with `RUST_BACKTRACE=full` for a verbose backtrace.
  138. 19.09 s gammaloop-nextest-core> system-out
  139. 19.09 s gammaloop-nextest-core> running 1 test
  140. 19.10 s gammaloop-nextest-core> test repl::tests::completion_shows_type_hint_for_non_boolean_settings_leaf ... FAILED
  141. 19.10 s gammaloop-nextest-core>
  142. 19.10 s gammaloop-nextest-core> failures:
  143. 19.10 s gammaloop-nextest-core>
  144. 19.10 s gammaloop-nextest-core> failures:
  145. 19.10 s gammaloop-nextest-core> repl::tests::completion_shows_type_hint_for_non_boolean_settings_leaf
  146. 19.10 s gammaloop-nextest-core>
  147. 19.10 s gammaloop-nextest-core> test result: FAILED. 0 passed; 1 failed; 0 ignored; 0 measured; 338 filtered out; finished in 0.01s
  148. 19.10 s gammaloop-nextest-core> system-err
  149. 19.10 s gammaloop-nextest-core> thread 'repl::tests::completion_shows_type_hint_for_non_boolean_settings_leaf' (788) panicked at crates/gammaloop-api/src/repl.rs:5778:9:
  150. 19.10 s gammaloop-nextest-core> [Suggestion { value: "", description: Some("Number of samples in the first Monte Carlo iteration."), style: None, extra: None, span: Span { start: 42, end: 42 }, append_whitespace: false }]
  151. 19.10 s gammaloop-nextest-core> stack backtrace:
  152. 19.10 s gammaloop-nextest-core> 0: __rustc::rust_begin_unwind
  153. 19.10 s gammaloop-nextest-core> 1: core::panicking::panic_fmt
  154. 19.10 s gammaloop-nextest-core> 2: gammaloop_api::repl::tests::completion_shows_type_hint_for_non_boolean_settings_leaf
  155. 19.10 s gammaloop-nextest-core> 3: <gammaloop_api::repl::tests::completion_shows_type_hint_for_non_boolean_settings_leaf::{closure#0} as core::ops::function::FnOnce<()>>::call_once
  156. 19.10 s gammaloop-nextest-core> note: Some details are omitted, run with `RUST_BACKTRACE=full` for a verbose backtrace.
  157. 19.10 s gammaloop-nextest-core>
  158. 19.10 s gammaloop-nextest-core> 2. gammaloop-api::templates::tests::extract_templates_uses_canonical_package_layout
  159. 19.10 s gammaloop-nextest-core> failure: test failure with exit code 101
  160. 19.10 s gammaloop-nextest-core> thread 'templates::tests::extract_templates_uses_canonical_package_layout' (874) panicked at crates/gammaloop-api/src/templates.rs:99:9:
  161. 19.10 s gammaloop-nextest-core> assertion failed: figure.contains("amplitude-mode")
  162. 19.10 s gammaloop-nextest-core> stack backtrace:
  163. 19.10 s gammaloop-nextest-core> 0: __rustc::rust_begin_unwind
  164. 19.10 s gammaloop-nextest-core> 1: core::panicking::panic_fmt
  165. 19.10 s gammaloop-nextest-core> 2: core::panicking::panic
  166. 19.10 s gammaloop-nextest-core> 3: gammaloop_api::templates::tests::extract_templates_uses_canonical_package_layout
  167. 19.10 s gammaloop-nextest-core> 4: <gammaloop_api::templates::tests::extract_templates_uses_canonical_package_layout::{closure#0} as core::ops::function::FnOnce<()>>::call_once
  168. 19.10 s gammaloop-nextest-core> note: Some details are omitted, run with `RUST_BACKTRACE=full` for a verbose backtrace.
  169. 19.10 s gammaloop-nextest-core> system-out
  170. 19.10 s gammaloop-nextest-core> running 1 test
  171. 19.10 s gammaloop-nextest-core> test templates::tests::extract_templates_uses_canonical_package_layout ... FAILED
  172. 19.10 s gammaloop-nextest-core>
  173. 19.10 s gammaloop-nextest-core> failures:
  174. 19.10 s gammaloop-nextest-core>
  175. 19.10 s gammaloop-nextest-core> failures:
  176. 19.10 s gammaloop-nextest-core> templates::tests::extract_templates_uses_canonical_package_layout
  177. 19.10 s gammaloop-nextest-core>
  178. 19.10 s gammaloop-nextest-core> test result: FAILED. 0 passed; 1 failed; 0 ignored; 0 measured; 338 filtered out; finished in 0.01s
  179. 19.10 s gammaloop-nextest-core> system-err
  180. 19.10 s gammaloop-nextest-core> thread 'templates::tests::extract_templates_uses_canonical_package_layout' (874) panicked at crates/gammaloop-api/src/templates.rs:99:9:
  181. 19.10 s gammaloop-nextest-core> assertion failed: figure.contains("amplitude-mode")
  182. 19.10 s gammaloop-nextest-core> stack backtrace:
  183. 19.10 s gammaloop-nextest-core> 0: __rustc::rust_begin_unwind
  184. 19.10 s gammaloop-nextest-core> 1: core::panicking::panic_fmt
  185. 19.10 s gammaloop-nextest-core> 2: core::panicking::panic
  186. 19.10 s gammaloop-nextest-core> 3: gammaloop_api::templates::tests::extract_templates_uses_canonical_package_layout
  187. 19.10 s gammaloop-nextest-core> 4: <gammaloop_api::templates::tests::extract_templates_uses_canonical_package_layout::{closure#0} as core::ops::function::FnOnce<()>>::call_once
  188. 19.10 s gammaloop-nextest-core> note: Some details are omitted, run with `RUST_BACKTRACE=full` for a verbose backtrace.
  189. 19.10 s gammaloop-nextest-core> =========================================
  190. 19.11 s gammaloop-nextest-core> Extracting 1 binary and 1 linked path to /build/source
  191. 19.18 s gammaloop-nextest-core> Extracted 7 files to /build/source in 0.07s
  192. 19.19 s gammaloop-nextest-core> ------------
  193. 19.19 s gammaloop-nextest-core> Nextest run ID d41b2278-d87b-4746-a9b7-875731a781c1 with nextest profile: ci_gammaloop
  194. 19.19 s gammaloop-nextest-core> Starting 19 tests across 1 binary
  195. 19.20 s gammaloop-nextest-core> ------------
  196. 19.20 s gammaloop-nextest-core> Summary [ 0.012s] 19 tests run: 19 passed, 0 skipped
  197. 19.23 s gammaloop-nextest-core>
  198. 19.23 s gammaloop-nextest-core> ========== nextest test summary ==========
  199. 19.23 s gammaloop-nextest-core> report: target/nextest/ci_gammaloop/junit.xml
  200. 19.23 s gammaloop-nextest-core> tests: 19, failures: 0, errors: 0
  201. 19.23 s gammaloop-nextest-core> No failing testcases found.
  202. 19.23 s gammaloop-nextest-core> =========================================
  203. 19.24 s gammaloop-nextest-core> Extracting 1 binary to /build/source
  204. 19.27 s gammaloop-nextest-core> Extracted 4 files to /build/source in 0.03s
  205. 19.28 s gammaloop-nextest-core> ------------
  206. 19.28 s gammaloop-nextest-core> Nextest run ID cd1edd44-cae5-4cc0-a30c-bd5d53e68f33 with nextest profile: ci_gammaloop
  207. 19.28 s gammaloop-nextest-core> Starting 0 tests across 1 binary
  208. 19.28 s gammaloop-nextest-core> ------------
  209. 19.28 s gammaloop-nextest-core> Summary [ 0.000s] 0 tests run: 0 passed, 0 skipped
  210. 19.31 s gammaloop-nextest-core>
  211. 19.31 s gammaloop-nextest-core> ========== nextest test summary ==========
  212. 19.31 s gammaloop-nextest-core> report: target/nextest/ci_gammaloop/junit.xml
  213. 19.31 s gammaloop-nextest-core> tests: 0, failures: 0, errors: 0
  214. 19.31 s gammaloop-nextest-core> No failing testcases found.
  215. 19.31 s gammaloop-nextest-core> =========================================
  216. 19.32 s gammaloop-nextest-core> Extracting 4 binaries, 1 build script output directory, and 2 linked paths to /build/source
  217. 19.78 s gammaloop-nextest-core> Extracted 18 files to /build/source in 0.46s
  218. 19.80 s gammaloop-nextest-core> ------------
  219. 19.80 s gammaloop-nextest-core> Nextest run ID 735b95ac-b655-427d-925f-6d9bfb0e449b with nextest profile: ci_gammaloop
  220. 19.80 s gammaloop-nextest-core> Starting 456 tests across 4 binaries (61 tests skipped, including 60 tests via profile.ci_gammaloop.default-filter)
  221. 20.01 s gammaloop-nextest-core> FAIL [ 0.095s] ( 73/456) gammalooprs graph::parse::tests::parse_lmbsetting_crossection
  222. 20.01 s gammaloop-nextest-core> stdout ---
  223. 20.01 s gammaloop-nextest-core>
  224. 20.01 s gammaloop-nextest-core> running 1 test
  225. 20.01 s gammaloop-nextest-core> ━━━━━━━━━━━━━━━━━━━━━━━━━━━━━━━ Snapshot Summary ━━━━━━━━━━━━━━━━━━━━━━━━━━━━━━━
  226. 20.01 s gammaloop-nextest-core> Snapshot: parse_lmbsetting_crossection
  227. 20.01 s gammaloop-nextest-core> Source: crates/gammalooprs/src/graph/parse/tests.rs:252
  228. 20.01 s gammaloop-nextest-core> ────────────────────────────────────────────────────────────────────────────────
  229. 20.01 s gammaloop-nextest-core> Expression: g.debug_dot()
  230. 20.01 s gammaloop-nextest-core> ────────────────────────────────────────────────────────────────────────────────
  231. 20.01 s gammaloop-nextest-core> -old snapshot
  232. 20.01 s gammaloop-nextest-core> +new results
  233. 20.01 s gammaloop-nextest-core> ────────────┬───────────────────────────────────────────────────────────────────
  234. 20.01 s gammaloop-nextest-core> 1 │-digraph G{
  235. 20.01 s gammaloop-nextest-core> 1 │+digraph G {
  236. 20.01 s gammaloop-nextest-core> 2 2 │ num = "1/2";
  237. 20.01 s gammaloop-nextest-core> 3 3 │ overall_factor = "2*x";
  238. 20.01 s gammaloop-nextest-core> 4 4 │ overall_factor_evaluated = "2*x";
  239. 20.01 s gammaloop-nextest-core> 5 5 │ projector = "spenso::t";
  240. 20.01 s gammaloop-nextest-core> ────────────┴───────────────────────────────────────────────────────────────────
  241. 20.01 s gammaloop-nextest-core> To update snapshots run `cargo insta review`
  242. 20.01 s gammaloop-nextest-core> Stopped on the first failure. Run `cargo insta test` to run all snapshots.
  243. 20.01 s gammaloop-nextest-core> test graph::parse::tests::parse_lmbsetting_crossection ... FAILED
  244. 20.01 s gammaloop-nextest-core>
  245. 20.01 s gammaloop-nextest-core> failures:
  246. 20.01 s gammaloop-nextest-core>
  247. 20.01 s gammaloop-nextest-core> failures:
  248. 20.01 s gammaloop-nextest-core> graph::parse::tests::parse_lmbsetting_crossection
  249. 20.01 s gammaloop-nextest-core>
  250. 20.01 s gammaloop-nextest-core> test result: FAILED. 0 passed; 1 failed; 0 ignored; 0 measured; 508 filtered out; finished in 0.08s
  251. 20.01 s gammaloop-nextest-core>
  252. 20.01 s gammaloop-nextest-core> stderr ---
  253. 20.01 s gammaloop-nextest-core> [22:04:03.427] @gammalooprs::graph::attribute_warnings WARNING : Unknown node attribute 'color_num' on graph 'G', node 'A'; did you mean 'num'?
  254. 20.01 s gammaloop-nextest-core> at crates/gammalooprs/src/graph/attribute_warnings.rs:198
  255. 20.01 s gammaloop-nextest-core> The application panicked (crashed).
  256. 20.01 s gammaloop-nextest-core> Message: snapshot assertion for 'parse_lmbsetting_crossection' failed in line 252
  257. 20.01 s gammaloop-nextest-core> Location: /nix/store/xdy1vvhll2bijdplvl9fcc2b9plkxhaa-vendor-cargo-deps/c19b7c6f923b580ac259164a89f2577984ad5ab09ee9d583b888f934adbbe8d0/insta-1.47.2/src/runtime.rs:719
  258. 20.01 s gammaloop-nextest-core>
  259. 20.01 s gammaloop-nextest-core> ━━━━━━━━━━━━━━━━━━━━━━━━━━━━━━━━━━ BACKTRACE ━━━━━━━━━━━━━━━━━━━━━━━━━━━━━━━━━━━
  260. 20.01 s gammaloop-nextest-core> 1: <color_eyre[b0c9e66060e883b2]::config::PanicHook>::panic_report<unknown>
  261. 20.01 s gammaloop-nextest-core> at <unknown source file>:<unknown line>
  262. 20.01 s gammaloop-nextest-core> 2: <color_eyre[b0c9e66060e883b2]::config::PanicHook>::into_panic_hook::{closure#0}<unknown>
  263. 20.01 s gammaloop-nextest-core> at <unknown source file>:<unknown line>
  264. 20.01 s gammaloop-nextest-core> 3: std[bcb96dfbba0ab899]::panicking::panic_with_hook<unknown>
  265. 20.01 s gammaloop-nextest-core> at <unknown source file>:<unknown line>
  266. 20.01 s gammaloop-nextest-core> 4: std[bcb96dfbba0ab899]::panicking::panic_handler::{closure#0}<unknown>
  267. 20.01 s gammaloop-nextest-core> at <unknown source file>:<unknown line>
  268. 20.01 s gammaloop-nextest-core> 5: std[bcb96dfbba0ab899]::sys::backtrace::__rust_end_short_backtrace::<std[bcb96dfbba0ab899]::panicking::panic_handler::{closure#0}, !><unknown>
  269. 20.01 s gammaloop-nextest-core> at <unknown source file>:<unknown line>
  270. 20.01 s gammaloop-nextest-core> 6: __rustc[6c289b9f9c454d21]::rust_begin_unwind<unknown>
  271. 20.01 s gammaloop-nextest-core> at <unknown source file>:<unknown line>
  272. 20.01 s gammaloop-nextest-core> 7: core[940e698046960fd5]::panicking::panic_fmt<unknown>
  273. 20.01 s gammaloop-nextest-core> at <unknown source file>:<unknown line>
  274. 20.01 s gammaloop-nextest-core> 8: insta[307a548ac79ef4d9]::runtime::assert_snapshot<unknown>
  275. 20.01 s gammaloop-nextest-core> at <unknown source file>:<unknown line>
  276. 20.01 s gammaloop-nextest-core> 9: gammalooprs[5490727360442cce]::graph::parse::tests::parse_lmbsetting_crossection<unknown>
  277. 20.01 s gammaloop-nextest-core> at <unknown source file>:<unknown line>
  278. 20.01 s gammaloop-nextest-core> 10: <gammalooprs[5490727360442cce]::graph::parse::tests::parse_lmbsetting_crossection::{closure#0} as core[940e698046960fd5]::ops::function::FnOnce<()>>::call_once<unknown>
  279. 20.01 s gammaloop-nextest-core> at <unknown source file>:<unknown line>
  280. 20.01 s gammaloop-nextest-core> 11: test[75d6903177b1d7e9]::__rust_begin_short_backtrace::<core[940e698046960fd5]::result::Result<(), alloc[2ea6bcb46fca0c42]::string::String>, fn() -> core[940e698046960fd5]::result::Result<(), alloc[2ea6bcb46fca0c42]::string::String>><unknown>
  281. 20.01 s gammaloop-nextest-core> at <unknown source file>:<unknown line>
  282. 20.01 s gammaloop-nextest-core> 12: test[75d6903177b1d7e9]::run_test::{closure#0}<unknown>
  283. 20.01 s gammaloop-nextest-core> at <unknown source file>:<unknown line>
  284. 20.01 s gammaloop-nextest-core> 13: std[bcb96dfbba0ab899]::sys::backtrace::__rust_begin_short_backtrace::<test[75d6903177b1d7e9]::run_test::{closure#1}, ()><unknown>
  285. 20.01 s gammaloop-nextest-core> at <unknown source file>:<unknown line>
  286. 20.01 s gammaloop-nextest-core> 14: <std[bcb96dfbba0ab899]::thread::lifecycle::spawn_unchecked<test[75d6903177b1d7e9]::run_test::{closure#1}, ()>::{closure#1} as core[940e698046960fd5]::ops::function::FnOnce<()>>::call_once::{shim:vtable#0}<unknown>
  287. 20.01 s gammaloop-nextest-core> at <unknown source file>:<unknown line>
  288. 20.01 s gammaloop-nextest-core> 15: <std[bcb96dfbba0ab899]::sys::thread::unix::Thread>::new::thread_start<unknown>
  289. 20.01 s gammaloop-nextest-core> at <unknown source file>:<unknown line>
  290. 20.01 s gammaloop-nextest-core> 16: start_thread<unknown>
  291. 20.01 s gammaloop-nextest-core> at <unknown source file>:<unknown line>
  292. 20.01 s gammaloop-nextest-core> 17: __clone3<unknown>
  293. 20.01 s gammaloop-nextest-core> at <unknown source file>:<unknown line>
  294. 20.01 s gammaloop-nextest-core>
  295. 20.01 s gammaloop-nextest-core> Run with COLORBT_SHOW_HIDDEN=1 environment variable to disable frame filtering.
  296. 20.01 s gammaloop-nextest-core> Run with RUST_BACKTRACE=full to include source snippets.
  297. 20.01 s gammaloop-nextest-core>
  298. 20.63 s gammaloop-nextest-core> FAIL [ 0.137s] (409/456) gammalooprs uv::export::tests::computed_node_full_numerator_is_a_spenso_aware_typst_fragment
  299. 20.63 s gammaloop-nextest-core> stdout ---
  300. 20.63 s gammaloop-nextest-core>
  301. 20.63 s gammaloop-nextest-core> running 1 test
  302. 20.63 s gammaloop-nextest-core> test uv::export::tests::computed_node_full_numerator_is_a_spenso_aware_typst_fragment ... FAILED
  303. 20.63 s gammaloop-nextest-core>
  304. 20.63 s gammaloop-nextest-core> failures:
  305. 20.63 s gammaloop-nextest-core>
  306. 20.63 s gammaloop-nextest-core> failures:
  307. 20.63 s gammaloop-nextest-core> uv::export::tests::computed_node_full_numerator_is_a_spenso_aware_typst_fragment
  308. 20.63 s gammaloop-nextest-core>
  309. 20.63 s gammaloop-nextest-core> test result: FAILED. 0 passed; 1 failed; 0 ignored; 0 measured; 508 filtered out; finished in 0.11s
  310. 20.63 s gammaloop-nextest-core>
  311. 20.63 s gammaloop-nextest-core> stderr ---
  312. 20.63 s gammaloop-nextest-core> The application panicked (crashed).
  313. 20.63 s gammaloop-nextest-core> Message: assertion failed: exported.dot.contains(r#"full_num = "op(\"Tr\")(1)";"#)
  314. 20.63 s gammaloop-nextest-core> Location: crates/gammalooprs/src/uv/export.rs:483
  315. 20.63 s gammaloop-nextest-core>
  316. 20.63 s gammaloop-nextest-core> ━━━━━━━━━━━━━━━━━━━━━━━━━━━━━━━━━━ BACKTRACE ━━━━━━━━━━━━━━━━━━━━━━━━━━━━━━━━━━━
  317. 20.63 s gammaloop-nextest-core> 1: <color_eyre[b0c9e66060e883b2]::config::PanicHook>::panic_report<unknown>
  318. 20.63 s gammaloop-nextest-core> at <unknown source file>:<unknown line>
  319. 20.63 s gammaloop-nextest-core> 2: <color_eyre[b0c9e66060e883b2]::config::PanicHook>::into_panic_hook::{closure#0}<unknown>
  320. 20.63 s gammaloop-nextest-core> at <unknown source file>:<unknown line>
  321. 20.63 s gammaloop-nextest-core> 3: std[bcb96dfbba0ab899]::panicking::panic_with_hook<unknown>
  322. 20.63 s gammaloop-nextest-core> at <unknown source file>:<unknown line>
  323. 20.63 s gammaloop-nextest-core> 4: std[bcb96dfbba0ab899]::panicking::panic_handler::{closure#0}<unknown>
  324. 20.63 s gammaloop-nextest-core> at <unknown source file>:<unknown line>
  325. 20.63 s gammaloop-nextest-core> 5: std[bcb96dfbba0ab899]::sys::backtrace::__rust_end_short_backtrace::<std[bcb96dfbba0ab899]::panicking::panic_handler::{closure#0}, !><unknown>
  326. 20.63 s gammaloop-nextest-core> at <unknown source file>:<unknown line>
  327. 20.63 s gammaloop-nextest-core> 6: __rustc[6c289b9f9c454d21]::rust_begin_unwind<unknown>
  328. 20.63 s gammaloop-nextest-core> at <unknown source file>:<unknown line>
  329. 20.63 s gammaloop-nextest-core> 7: core[940e698046960fd5]::panicking::panic_fmt<unknown>
  330. 20.63 s gammaloop-nextest-core> at <unknown source file>:<unknown line>
  331. 20.63 s gammaloop-nextest-core> 8: core[940e698046960fd5]::panicking::panic<unknown>
  332. 20.63 s gammaloop-nextest-core> at <unknown source file>:<unknown line>
  333. 20.63 s gammaloop-nextest-core> 9: gammalooprs[5490727360442cce]::uv::export::tests::computed_node_full_numerator_is_a_spenso_aware_typst_fragment<unknown>
  334. 20.63 s gammaloop-nextest-core> at <unknown source file>:<unknown line>
  335. 20.63 s gammaloop-nextest-core> 10: <gammalooprs[5490727360442cce]::uv::export::tests::computed_node_full_numerator_is_a_spenso_aware_typst_fragment::{closure#0} as core[940e698046960fd5]::ops::function::FnOnce<()>>::call_once<unknown>
  336. 20.63 s gammaloop-nextest-core> at <unknown source file>:<unknown line>
  337. 20.63 s gammaloop-nextest-core> 11: test[75d6903177b1d7e9]::__rust_begin_short_backtrace::<core[940e698046960fd5]::result::Result<(), alloc[2ea6bcb46fca0c42]::string::String>, fn() -> core[940e698046960fd5]::result::Result<(), alloc[2ea6bcb46fca0c42]::string::String>><unknown>
  338. 20.63 s gammaloop-nextest-core> at <unknown source file>:<unknown line>
  339. 20.63 s gammaloop-nextest-core> 12: test[75d6903177b1d7e9]::run_test::{closure#0}<unknown>
  340. 20.63 s gammaloop-nextest-core> at <unknown source file>:<unknown line>
  341. 20.63 s gammaloop-nextest-core> 13: std[bcb96dfbba0ab899]::sys::backtrace::__rust_begin_short_backtrace::<test[75d6903177b1d7e9]::run_test::{closure#1}, ()><unknown>
  342. 20.63 s gammaloop-nextest-core> at <unknown source file>:<unknown line>
  343. 20.63 s gammaloop-nextest-core> 14: <std[bcb96dfbba0ab899]::thread::lifecycle::spawn_unchecked<test[75d6903177b1d7e9]::run_test::{closure#1}, ()>::{closure#1} as core[940e698046960fd5]::ops::function::FnOnce<()>>::call_once::{shim:vtable#0}<unknown>
  344. 20.63 s gammaloop-nextest-core> at <unknown source file>:<unknown line>
  345. 20.63 s gammaloop-nextest-core> 15: <std[bcb96dfbba0ab899]::sys::thread::unix::Thread>::new::thread_start<unknown>
  346. 20.63 s gammaloop-nextest-core> at <unknown source file>:<unknown line>
  347. 20.63 s gammaloop-nextest-core> 16: start_thread<unknown>
  348. 20.63 s gammaloop-nextest-core> at <unknown source file>:<unknown line>
  349. 20.63 s gammaloop-nextest-core> 17: __clone3<unknown>
  350. 20.63 s gammaloop-nextest-core> at <unknown source file>:<unknown line>
  351. 20.63 s gammaloop-nextest-core>
  352. 20.63 s gammaloop-nextest-core> Run with COLORBT_SHOW_HIDDEN=1 environment variable to disable frame filtering.
  353. 20.63 s gammaloop-nextest-core> Run with RUST_BACKTRACE=full to include source snippets.
  354. 20.63 s gammaloop-nextest-core>
  355. 29.26 s gammaloop-nextest-core> ------------
  356. 29.27 s gammaloop-nextest-core> Summary [ 9.459s] 456 tests run: 454 passed, 2 failed, 61 skipped
  357. 29.27 s gammaloop-nextest-core> FAIL [ 0.095s] ( 73/456) gammalooprs graph::parse::tests::parse_lmbsetting_crossection
  358. 29.27 s gammaloop-nextest-core> stdout ---
  359. 29.27 s gammaloop-nextest-core>
  360. 29.27 s gammaloop-nextest-core> running 1 test
  361. 29.27 s gammaloop-nextest-core> ━━━━━━━━━━━━━━━━━━━━━━━━━━━━━━━ Snapshot Summary ━━━━━━━━━━━━━━━━━━━━━━━━━━━━━━━
  362. 29.27 s gammaloop-nextest-core> Snapshot: parse_lmbsetting_crossection
  363. 29.27 s gammaloop-nextest-core> Source: crates/gammalooprs/src/graph/parse/tests.rs:252
  364. 29.27 s gammaloop-nextest-core> ────────────────────────────────────────────────────────────────────────────────
  365. 29.27 s gammaloop-nextest-core> Expression: g.debug_dot()
  366. 29.27 s gammaloop-nextest-core> ────────────────────────────────────────────────────────────────────────────────
  367. 29.27 s gammaloop-nextest-core> -old snapshot
  368. 29.27 s gammaloop-nextest-core> +new results
  369. 29.27 s gammaloop-nextest-core> ────────────┬───────────────────────────────────────────────────────────────────
  370. 29.27 s gammaloop-nextest-core> 1 │-digraph G{
  371. 29.27 s gammaloop-nextest-core> 1 │+digraph G {
  372. 29.27 s gammaloop-nextest-core> 2 2 │ num = "1/2";
  373. 29.27 s gammaloop-nextest-core> 3 3 │ overall_factor = "2*x";
  374. 29.27 s gammaloop-nextest-core> 4 4 │ overall_factor_evaluated = "2*x";
  375. 29.27 s gammaloop-nextest-core> 5 5 │ projector = "spenso::t";
  376. 29.27 s gammaloop-nextest-core> ────────────┴───────────────────────────────────────────────────────────────────
  377. 29.27 s gammaloop-nextest-core> To update snapshots run `cargo insta review`
  378. 29.27 s gammaloop-nextest-core> Stopped on the first failure. Run `cargo insta test` to run all snapshots.
  379. 29.27 s gammaloop-nextest-core> test graph::parse::tests::parse_lmbsetting_crossection ... FAILED
  380. 29.27 s gammaloop-nextest-core>
  381. 29.27 s gammaloop-nextest-core> failures:
  382. 29.27 s gammaloop-nextest-core>
  383. 29.27 s gammaloop-nextest-core> failures:
  384. 29.27 s gammaloop-nextest-core> graph::parse::tests::parse_lmbsetting_crossection
  385. 29.27 s gammaloop-nextest-core>
  386. 29.27 s gammaloop-nextest-core> test result: FAILED. 0 passed; 1 failed; 0 ignored; 0 measured; 508 filtered out; finished in 0.08s
  387. 29.27 s gammaloop-nextest-core>
  388. 29.27 s gammaloop-nextest-core> stderr ---
  389. 29.27 s gammaloop-nextest-core> [22:04:03.427] @gammalooprs::graph::attribute_warnings WARNING : Unknown node attribute 'color_num' on graph 'G', node 'A'; did you mean 'num'?
  390. 29.27 s gammaloop-nextest-core> at crates/gammalooprs/src/graph/attribute_warnings.rs:198
  391. 29.27 s gammaloop-nextest-core> The application panicked (crashed).
  392. 29.27 s gammaloop-nextest-core> Message: snapshot assertion for 'parse_lmbsetting_crossection' failed in line 252
  393. 29.27 s gammaloop-nextest-core> Location: /nix/store/xdy1vvhll2bijdplvl9fcc2b9plkxhaa-vendor-cargo-deps/c19b7c6f923b580ac259164a89f2577984ad5ab09ee9d583b888f934adbbe8d0/insta-1.47.2/src/runtime.rs:719
  394. 29.27 s gammaloop-nextest-core>
  395. 29.27 s gammaloop-nextest-core> ━━━━━━━━━━━━━━━━━━━━━━━━━━━━━━━━━━ BACKTRACE ━━━━━━━━━━━━━━━━━━━━━━━━━━━━━━━━━━━
  396. 29.27 s gammaloop-nextest-core> 1: <color_eyre[b0c9e66060e883b2]::config::PanicHook>::panic_report<unknown>
  397. 29.27 s gammaloop-nextest-core> at <unknown source file>:<unknown line>
  398. 29.27 s gammaloop-nextest-core> 2: <color_eyre[b0c9e66060e883b2]::config::PanicHook>::into_panic_hook::{closure#0}<unknown>
  399. 29.27 s gammaloop-nextest-core> at <unknown source file>:<unknown line>
  400. 29.27 s gammaloop-nextest-core> 3: std[bcb96dfbba0ab899]::panicking::panic_with_hook<unknown>
  401. 29.27 s gammaloop-nextest-core> at <unknown source file>:<unknown line>
  402. 29.27 s gammaloop-nextest-core> 4: std[bcb96dfbba0ab899]::panicking::panic_handler::{closure#0}<unknown>
  403. 29.27 s gammaloop-nextest-core> at <unknown source file>:<unknown line>
  404. 29.27 s gammaloop-nextest-core> 5: std[bcb96dfbba0ab899]::sys::backtrace::__rust_end_short_backtrace::<std[bcb96dfbba0ab899]::panicking::panic_handler::{closure#0}, !><unknown>
  405. 29.27 s gammaloop-nextest-core> at <unknown source file>:<unknown line>
  406. 29.27 s gammaloop-nextest-core> 6: __rustc[6c289b9f9c454d21]::rust_begin_unwind<unknown>
  407. 29.27 s gammaloop-nextest-core> at <unknown source file>:<unknown line>
  408. 29.27 s gammaloop-nextest-core> 7: core[940e698046960fd5]::panicking::panic_fmt<unknown>
  409. 29.27 s gammaloop-nextest-core> at <unknown source file>:<unknown line>
  410. 29.27 s gammaloop-nextest-core> 8: insta[307a548ac79ef4d9]::runtime::assert_snapshot<unknown>
  411. 29.27 s gammaloop-nextest-core> at <unknown source file>:<unknown line>
  412. 29.27 s gammaloop-nextest-core> 9: gammalooprs[5490727360442cce]::graph::parse::tests::parse_lmbsetting_crossection<unknown>
  413. 29.27 s gammaloop-nextest-core> at <unknown source file>:<unknown line>
  414. 29.27 s gammaloop-nextest-core> 10: <gammalooprs[5490727360442cce]::graph::parse::tests::parse_lmbsetting_crossection::{closure#0} as core[940e698046960fd5]::ops::function::FnOnce<()>>::call_once<unknown>
  415. 29.27 s gammaloop-nextest-core> at <unknown source file>:<unknown line>
  416. 29.27 s gammaloop-nextest-core> 11: test[75d6903177b1d7e9]::__rust_begin_short_backtrace::<core[940e698046960fd5]::result::Result<(), alloc[2ea6bcb46fca0c42]::string::String>, fn() -> core[940e698046960fd5]::result::Result<(), alloc[2ea6bcb46fca0c42]::string::String>><unknown>
  417. 29.27 s gammaloop-nextest-core> at <unknown source file>:<unknown line>
  418. 29.27 s gammaloop-nextest-core> 12: test[75d6903177b1d7e9]::run_test::{closure#0}<unknown>
  419. 29.27 s gammaloop-nextest-core> at <unknown source file>:<unknown line>
  420. 29.27 s gammaloop-nextest-core> 13: std[bcb96dfbba0ab899]::sys::backtrace::__rust_begin_short_backtrace::<test[75d6903177b1d7e9]::run_test::{closure#1}, ()><unknown>
  421. 29.27 s gammaloop-nextest-core> at <unknown source file>:<unknown line>
  422. 29.27 s gammaloop-nextest-core> 14: <std[bcb96dfbba0ab899]::thread::lifecycle::spawn_unchecked<test[75d6903177b1d7e9]::run_test::{closure#1}, ()>::{closure#1} as core[940e698046960fd5]::ops::function::FnOnce<()>>::call_once::{shim:vtable#0}<unknown>
  423. 29.27 s gammaloop-nextest-core> at <unknown source file>:<unknown line>
  424. 29.27 s gammaloop-nextest-core> 15: <std[bcb96dfbba0ab899]::sys::thread::unix::Thread>::new::thread_start<unknown>
  425. 29.27 s gammaloop-nextest-core> at <unknown source file>:<unknown line>
  426. 29.27 s gammaloop-nextest-core> 16: start_thread<unknown>
  427. 29.27 s gammaloop-nextest-core> at <unknown source file>:<unknown line>
  428. 29.27 s gammaloop-nextest-core> 17: __clone3<unknown>
  429. 29.27 s gammaloop-nextest-core> at <unknown source file>:<unknown line>
  430. 29.27 s gammaloop-nextest-core>
  431. 29.27 s gammaloop-nextest-core> Run with COLORBT_SHOW_HIDDEN=1 environment variable to disable frame filtering.
  432. 29.27 s gammaloop-nextest-core> Run with RUST_BACKTRACE=full to include source snippets.
  433. 29.27 s gammaloop-nextest-core>
  434. 29.27 s gammaloop-nextest-core> FAIL [ 0.137s] (409/456) gammalooprs uv::export::tests::computed_node_full_numerator_is_a_spenso_aware_typst_fragment
  435. 29.27 s gammaloop-nextest-core> stdout ---
  436. 29.27 s gammaloop-nextest-core>
  437. 29.27 s gammaloop-nextest-core> running 1 test
  438. 29.27 s gammaloop-nextest-core> test uv::export::tests::computed_node_full_numerator_is_a_spenso_aware_typst_fragment ... FAILED
  439. 29.27 s gammaloop-nextest-core>
  440. 29.27 s gammaloop-nextest-core> failures:
  441. 29.27 s gammaloop-nextest-core>
  442. 29.27 s gammaloop-nextest-core> failures:
  443. 29.27 s gammaloop-nextest-core> uv::export::tests::computed_node_full_numerator_is_a_spenso_aware_typst_fragment
  444. 29.27 s gammaloop-nextest-core>
  445. 29.27 s gammaloop-nextest-core> test result: FAILED. 0 passed; 1 failed; 0 ignored; 0 measured; 508 filtered out; finished in 0.11s
  446. 29.27 s gammaloop-nextest-core>
  447. 29.27 s gammaloop-nextest-core> stderr ---
  448. 29.27 s gammaloop-nextest-core> The application panicked (crashed).
  449. 29.27 s gammaloop-nextest-core> Message: assertion failed: exported.dot.contains(r#"full_num = "op(\"Tr\")(1)";"#)
  450. 29.27 s gammaloop-nextest-core> Location: crates/gammalooprs/src/uv/export.rs:483
  451. 29.27 s gammaloop-nextest-core>
  452. 29.27 s gammaloop-nextest-core> ━━━━━━━━━━━━━━━━━━━━━━━━━━━━━━━━━━ BACKTRACE ━━━━━━━━━━━━━━━━━━━━━━━━━━━━━━━━━━━
  453. 29.27 s gammaloop-nextest-core> 1: <color_eyre[b0c9e66060e883b2]::config::PanicHook>::panic_report<unknown>
  454. 29.27 s gammaloop-nextest-core> at <unknown source file>:<unknown line>
  455. 29.27 s gammaloop-nextest-core> 2: <color_eyre[b0c9e66060e883b2]::config::PanicHook>::into_panic_hook::{closure#0}<unknown>
  456. 29.27 s gammaloop-nextest-core> at <unknown source file>:<unknown line>
  457. 29.27 s gammaloop-nextest-core> 3: std[bcb96dfbba0ab899]::panicking::panic_with_hook<unknown>
  458. 29.27 s gammaloop-nextest-core> at <unknown source file>:<unknown line>
  459. 29.27 s gammaloop-nextest-core> 4: std[bcb96dfbba0ab899]::panicking::panic_handler::{closure#0}<unknown>
  460. 29.27 s gammaloop-nextest-core> at <unknown source file>:<unknown line>
  461. 29.27 s gammaloop-nextest-core> 5: std[bcb96dfbba0ab899]::sys::backtrace::__rust_end_short_backtrace::<std[bcb96dfbba0ab899]::panicking::panic_handler::{closure#0}, !><unknown>
  462. 29.27 s gammaloop-nextest-core> at <unknown source file>:<unknown line>
  463. 29.27 s gammaloop-nextest-core> 6: __rustc[6c289b9f9c454d21]::rust_begin_unwind<unknown>
  464. 29.27 s gammaloop-nextest-core> at <unknown source file>:<unknown line>
  465. 29.27 s gammaloop-nextest-core> 7: core[940e698046960fd5]::panicking::panic_fmt<unknown>
  466. 29.27 s gammaloop-nextest-core> at <unknown source file>:<unknown line>
  467. 29.27 s gammaloop-nextest-core> 8: core[940e698046960fd5]::panicking::panic<unknown>
  468. 29.27 s gammaloop-nextest-core> at <unknown source file>:<unknown line>
  469. 29.27 s gammaloop-nextest-core> 9: gammalooprs[5490727360442cce]::uv::export::tests::computed_node_full_numerator_is_a_spenso_aware_typst_fragment<unknown>
  470. 29.27 s gammaloop-nextest-core> at <unknown source file>:<unknown line>
  471. 29.27 s gammaloop-nextest-core> 10: <gammalooprs[5490727360442cce]::uv::export::tests::computed_node_full_numerator_is_a_spenso_aware_typst_fragment::{closure#0} as core[940e698046960fd5]::ops::function::FnOnce<()>>::call_once<unknown>
  472. 29.27 s gammaloop-nextest-core> at <unknown source file>:<unknown line>
  473. 29.27 s gammaloop-nextest-core> 11: test[75d6903177b1d7e9]::__rust_begin_short_backtrace::<core[940e698046960fd5]::result::Result<(), alloc[2ea6bcb46fca0c42]::string::String>, fn() -> core[940e698046960fd5]::result::Result<(), alloc[2ea6bcb46fca0c42]::string::String>><unknown>
  474. 29.27 s gammaloop-nextest-core> at <unknown source file>:<unknown line>
  475. 29.27 s gammaloop-nextest-core> 12: test[75d6903177b1d7e9]::run_test::{closure#0}<unknown>
  476. 29.27 s gammaloop-nextest-core> at <unknown source file>:<unknown line>
  477. 29.27 s gammaloop-nextest-core> 13: std[bcb96dfbba0ab899]::sys::backtrace::__rust_begin_short_backtrace::<test[75d6903177b1d7e9]::run_test::{closure#1}, ()><unknown>
  478. 29.27 s gammaloop-nextest-core> at <unknown source file>:<unknown line>
  479. 29.27 s gammaloop-nextest-core> 14: <std[bcb96dfbba0ab899]::thread::lifecycle::spawn_unchecked<test[75d6903177b1d7e9]::run_test::{closure#1}, ()>::{closure#1} as core[940e698046960fd5]::ops::function::FnOnce<()>>::call_once::{shim:vtable#0}<unknown>
  480. 29.27 s gammaloop-nextest-core> at <unknown source file>:<unknown line>
  481. 29.27 s gammaloop-nextest-core> 15: <std[bcb96dfbba0ab899]::sys::thread::unix::Thread>::new::thread_start<unknown>
  482. 29.27 s gammaloop-nextest-core> at <unknown source file>:<unknown line>
  483. 29.27 s gammaloop-nextest-core> 16: start_thread<unknown>
  484. 29.27 s gammaloop-nextest-core> at <unknown source file>:<unknown line>
  485. 29.27 s gammaloop-nextest-core> 17: __clone3<unknown>
  486. 29.27 s gammaloop-nextest-core> at <unknown source file>:<unknown line>
  487. 29.27 s gammaloop-nextest-core>
  488. 29.27 s gammaloop-nextest-core> Run with COLORBT_SHOW_HIDDEN=1 environment variable to disable frame filtering.
  489. 29.27 s gammaloop-nextest-core> Run with RUST_BACKTRACE=full to include source snippets.
  490. 29.27 s gammaloop-nextest-core>
  491. 29.27 s gammaloop-nextest-core> error: test run failed
  492. 29.29 s gammaloop-nextest-core>
  493. 29.29 s gammaloop-nextest-core> ========== nextest test summary ==========
  494. 29.29 s gammaloop-nextest-core> report: target/nextest/ci_gammaloop/junit.xml
  495. 29.29 s gammaloop-nextest-core> tests: 456, failures: 2, errors: 0
  496. 29.29 s gammaloop-nextest-core>
  497. 29.29 s gammaloop-nextest-core> 1. gammalooprs::graph::parse::tests::parse_lmbsetting_crossection
  498. 29.29 s gammaloop-nextest-core> failure: test failure with exit code 101
  499. 29.29 s gammaloop-nextest-core> system-out
  500. 29.29 s gammaloop-nextest-core> running 1 test
  501. 29.29 s gammaloop-nextest-core> ━━━━━━━━━━━━━━━━━━━━━━━━━━━━━━━ Snapshot Summary ━━━━━━━━━━━━━━━━━━━━━━━━━━━━━━━
  502. 29.29 s gammaloop-nextest-core> Snapshot: parse_lmbsetting_crossection
  503. 29.29 s gammaloop-nextest-core> Source: crates/gammalooprs/src/graph/parse/tests.rs:252
  504. 29.29 s gammaloop-nextest-core> ────────────────────────────────────────────────────────────────────────────────
  505. 29.29 s gammaloop-nextest-core> Expression: g.debug_dot()
  506. 29.29 s gammaloop-nextest-core> ────────────────────────────────────────────────────────────────────────────────
  507. 29.29 s gammaloop-nextest-core> -old snapshot
  508. 29.29 s gammaloop-nextest-core> +new results
  509. 29.29 s gammaloop-nextest-core> ────────────┬───────────────────────────────────────────────────────────────────
  510. 29.29 s gammaloop-nextest-core> 1 │-digraph G{
  511. 29.29 s gammaloop-nextest-core> 1 │+digraph G {
  512. 29.29 s gammaloop-nextest-core> 2 2 │ num = "1/2";
  513. 29.29 s gammaloop-nextest-core> 3 3 │ overall_factor = "2*x";
  514. 29.29 s gammaloop-nextest-core> 4 4 │ overall_factor_evaluated = "2*x";
  515. 29.29 s gammaloop-nextest-core> 5 5 │ projector = "spenso::t";
  516. 29.29 s gammaloop-nextest-core> ────────────┴───────────────────────────────────────────────────────────────────
  517. 29.29 s gammaloop-nextest-core> To update snapshots run `cargo insta review`
  518. 29.29 s gammaloop-nextest-core> Stopped on the first failure. Run `cargo insta test` to run all snapshots.
  519. 29.29 s gammaloop-nextest-core> test graph::parse::tests::parse_lmbsetting_crossection ... FAILED
  520. 29.29 s gammaloop-nextest-core>
  521. 29.29 s gammaloop-nextest-core> failures:
  522. 29.29 s gammaloop-nextest-core>
  523. 29.29 s gammaloop-nextest-core> failures:
  524. 29.29 s gammaloop-nextest-core> graph::parse::tests::parse_lmbsetting_crossection
  525. 29.29 s gammaloop-nextest-core>
  526. 29.29 s gammaloop-nextest-core> test result: FAILED. 0 passed; 1 failed; 0 ignored; 0 measured; 508 filtered out; finished in 0.08s
  527. 29.29 s gammaloop-nextest-core> system-err
  528. 29.29 s gammaloop-nextest-core> [22:04:03.427] @gammalooprs::graph::attribute_warnings WARNING : Unknown node attribute 'color_num' on graph 'G', node 'A'; did you mean 'num'?
  529. 29.29 s gammaloop-nextest-core> at crates/gammalooprs/src/graph/attribute_warnings.rs:198
  530. 29.29 s gammaloop-nextest-core> The application panicked (crashed).
  531. 29.29 s gammaloop-nextest-core> Message: snapshot assertion for 'parse_lmbsetting_crossection' failed in line 252
  532. 29.29 s gammaloop-nextest-core> Location: /nix/store/xdy1vvhll2bijdplvl9fcc2b9plkxhaa-vendor-cargo-deps/c19b7c6f923b580ac259164a89f2577984ad5ab09ee9d583b888f934adbbe8d0/insta-1.47.2/src/runtime.rs:719
  533. 29.29 s gammaloop-nextest-core>
  534. 29.29 s gammaloop-nextest-core> ━━━━━━━━━━━━━━━━━━━━━━━━━━━━━━━━━━ BACKTRACE ━━━━━━━━━━━━━━━━━━━━━━━━━━━━━━━━━━━
  535. 29.29 s gammaloop-nextest-core> 1: <color_eyre[b0c9e66060e883b2]::config::PanicHook>::panic_report<unknown>
  536. 29.29 s gammaloop-nextest-core> at <unknown source file>:<unknown line>
  537. 29.29 s gammaloop-nextest-core> 2: <color_eyre[b0c9e66060e883b2]::config::PanicHook>::into_panic_hook::{closure#0}<unknown>
  538. 29.29 s gammaloop-nextest-core> at <unknown source file>:<unknown line>
  539. 29.29 s gammaloop-nextest-core> 3: std[bcb96dfbba0ab899]::panicking::panic_with_hook<unknown>
  540. 29.29 s gammaloop-nextest-core> at <unknown source file>:<unknown line>
  541. 29.29 s gammaloop-nextest-core> 4: std[bcb96dfbba0ab899]::panicking::panic_handler::{closure#0}<unknown>
  542. 29.29 s gammaloop-nextest-core> at <unknown source file>:<unknown line>
  543. 29.29 s gammaloop-nextest-core> 5: std[bcb96dfbba0ab899]::sys::backtrace::__rust_end_short_backtrace::<std[bcb96dfbba0ab899]::panicking::panic_handler::{closure#0}, !><unknown>
  544. 29.29 s gammaloop-nextest-core> at <unknown source file>:<unknown line>
  545. 29.29 s gammaloop-nextest-core> 6: __rustc[6c289b9f9c454d21]::rust_begin_unwind<unknown>
  546. 29.29 s gammaloop-nextest-core> at <unknown source file>:<unknown line>
  547. 29.29 s gammaloop-nextest-core> 7: core[940e698046960fd5]::panicking::panic_fmt<unknown>
  548. 29.29 s gammaloop-nextest-core> at <unknown source file>:<unknown line>
  549. 29.29 s gammaloop-nextest-core> 8: insta[307a548ac79ef4d9]::runtime::assert_snapshot<unknown>
  550. 29.29 s gammaloop-nextest-core> at <unknown source file>:<unknown line>
  551. 29.29 s gammaloop-nextest-core> 9: gammalooprs[5490727360442cce]::graph::parse::tests::parse_lmbsetting_crossection<unknown>
  552. 29.29 s gammaloop-nextest-core> at <unknown source file>:<unknown line>
  553. 29.29 s gammaloop-nextest-core> 10: <gammalooprs[5490727360442cce]::graph::parse::tests::parse_lmbsetting_crossection::{closure#0} as core[940e698046960fd5]::ops::function::FnOnce<()>>::call_once<unknown>
  554. 29.29 s gammaloop-nextest-core> at <unknown source file>:<unknown line>
  555. 29.29 s gammaloop-nextest-core> 11: test[75d6903177b1d7e9]::__rust_begin_short_backtrace::<core[940e698046960fd5]::result::Result<(), alloc[2ea6bcb46fca0c42]::string::String>, fn() -> core[940e698046960fd5]::result::Result<(), alloc[2ea6bcb46fca0c42]::string::String>><unknown>
  556. 29.29 s gammaloop-nextest-core> at <unknown source file>:<unknown line>
  557. 29.29 s gammaloop-nextest-core> 12: test[75d6903177b1d7e9]::run_test::{closure#0}<unknown>
  558. 29.29 s gammaloop-nextest-core> at <unknown source file>:<unknown line>
  559. 29.29 s gammaloop-nextest-core> 13: std[bcb96dfbba0ab899]::sys::backtrace::__rust_begin_short_backtrace::<test[75d6903177b1d7e9]::run_test::{closure#1}, ()><unknown>
  560. 29.29 s gammaloop-nextest-core> at <unknown source file>:<unknown line>
  561. 29.29 s gammaloop-nextest-core> 14: <std[bcb96dfbba0ab899]::thread::lifecycle::spawn_unchecked<test[75d6903177b1d7e9]::run_test::{closure#1}, ()>::{closure#1} as core[940e698046960fd5]::ops::function::FnOnce<()>>::call_once::{shim:vtable#0}<unknown>
  562. 29.29 s gammaloop-nextest-core> at <unknown source file>:<unknown line>
  563. 29.29 s gammaloop-nextest-core> 15: <std[bcb96dfbba0ab899]::sys::thread::unix::Thread>::new::thread_start<unknown>
  564. 29.29 s gammaloop-nextest-core> at <unknown source file>:<unknown line>
  565. 29.29 s gammaloop-nextest-core> 16: start_thread<unknown>
  566. 29.29 s gammaloop-nextest-core> at <unknown source file>:<unknown line>
  567. 29.29 s gammaloop-nextest-core> 17: __clone3<unknown>
  568. 29.29 s gammaloop-nextest-core> at <unknown source file>:<unknown line>
  569. 29.29 s gammaloop-nextest-core>
  570. 29.29 s gammaloop-nextest-core> Run with COLORBT_SHOW_HIDDEN=1 environment variable to disable frame filtering.
  571. 29.29 s gammaloop-nextest-core> Run with RUST_BACKTRACE=full to include source snippets.
  572. 29.29 s gammaloop-nextest-core>
  573. 29.29 s gammaloop-nextest-core> 2. gammalooprs::uv::export::tests::computed_node_full_numerator_is_a_spenso_aware_typst_fragment
  574. 29.29 s gammaloop-nextest-core> failure: test failure with exit code 101
  575. 29.29 s gammaloop-nextest-core> system-out
  576. 29.29 s gammaloop-nextest-core> running 1 test
  577. 29.29 s gammaloop-nextest-core> test uv::export::tests::computed_node_full_numerator_is_a_spenso_aware_typst_fragment ... FAILED
  578. 29.29 s gammaloop-nextest-core>
  579. 29.29 s gammaloop-nextest-core> failures:
  580. 29.29 s gammaloop-nextest-core>
  581. 29.29 s gammaloop-nextest-core> failures:
  582. 29.29 s gammaloop-nextest-core> uv::export::tests::computed_node_full_numerator_is_a_spenso_aware_typst_fragment
  583. 29.29 s gammaloop-nextest-core>
  584. 29.29 s gammaloop-nextest-core> test result: FAILED. 0 passed; 1 failed; 0 ignored; 0 measured; 508 filtered out; finished in 0.11s
  585. 29.29 s gammaloop-nextest-core> system-err
  586. 29.29 s gammaloop-nextest-core> The application panicked (crashed).
  587. 29.29 s gammaloop-nextest-core> Message: assertion failed: exported.dot.contains(r#"full_num = "op(\"Tr\")(1)";"#)
  588. 29.29 s gammaloop-nextest-core> Location: crates/gammalooprs/src/uv/export.rs:483
  589. 29.29 s gammaloop-nextest-core>
  590. 29.29 s gammaloop-nextest-core> ━━━━━━━━━━━━━━━━━━━━━━━━━━━━━━━━━━ BACKTRACE ━━━━━━━━━━━━━━━━━━━━━━━━━━━━━━━━━━━
  591. 29.29 s gammaloop-nextest-core> 1: <color_eyre[b0c9e66060e883b2]::config::PanicHook>::panic_report<unknown>
  592. 29.29 s gammaloop-nextest-core> at <unknown source file>:<unknown line>
  593. 29.29 s gammaloop-nextest-core> 2: <color_eyre[b0c9e66060e883b2]::config::PanicHook>::into_panic_hook::{closure#0}<unknown>
  594. 29.29 s gammaloop-nextest-core> at <unknown source file>:<unknown line>
  595. 29.29 s gammaloop-nextest-core> 3: std[bcb96dfbba0ab899]::panicking::panic_with_hook<unknown>
  596. 29.29 s gammaloop-nextest-core> at <unknown source file>:<unknown line>
  597. 29.29 s gammaloop-nextest-core> 4: std[bcb96dfbba0ab899]::panicking::panic_handler::{closure#0}<unknown>
  598. 29.29 s gammaloop-nextest-core> at <unknown source file>:<unknown line>
  599. 29.29 s gammaloop-nextest-core> 5: std[bcb96dfbba0ab899]::sys::backtrace::__rust_end_short_backtrace::<std[bcb96dfbba0ab899]::panicking::panic_handler::{closure#0}, !><unknown>
  600. 29.29 s gammaloop-nextest-core> at <unknown source file>:<unknown line>
  601. 29.29 s gammaloop-nextest-core> 6: __rustc[6c289b9f9c454d21]::rust_begin_unwind<unknown>
  602. 29.29 s gammaloop-nextest-core> at <unknown source file>:<unknown line>
  603. 29.29 s gammaloop-nextest-core> 7: core[940e698046960fd5]::panicking::panic_fmt<unknown>
  604. 29.29 s gammaloop-nextest-core> at <unknown source file>:<unknown line>
  605. 29.29 s gammaloop-nextest-core> 8: core[940e698046960fd5]::panicking::panic<unknown>
  606. 29.29 s gammaloop-nextest-core> at <unknown source file>:<unknown line>
  607. 29.29 s gammaloop-nextest-core> 9: gammalooprs[5490727360442cce]::uv::export::tests::computed_node_full_numerator_is_a_spenso_aware_typst_fragment<unknown>
  608. 29.29 s gammaloop-nextest-core> at <unknown source file>:<unknown line>
  609. 29.29 s gammaloop-nextest-core> 10: <gammalooprs[5490727360442cce]::uv::export::tests::computed_node_full_numerator_is_a_spenso_aware_typst_fragment::{closure#0} as core[940e698046960fd5]::ops::function::FnOnce<()>>::call_once<unknown>
  610. 29.29 s gammaloop-nextest-core> at <unknown source file>:<unknown line>
  611. 29.29 s gammaloop-nextest-core> 11: test[75d6903177b1d7e9]::__rust_begin_short_backtrace::<core[940e698046960fd5]::result::Result<(), alloc[2ea6bcb46fca0c42]::string::String>, fn() -> core[940e698046960fd5]::result::Result<(), alloc[2ea6bcb46fca0c42]::string::String>><unknown>
  612. 29.29 s gammaloop-nextest-core> at <unknown source file>:<unknown line>
  613. 29.29 s gammaloop-nextest-core> 12: test[75d6903177b1d7e9]::run_test::{closure#0}<unknown>
  614. 29.29 s gammaloop-nextest-core> at <unknown source file>:<unknown line>
  615. 29.29 s gammaloop-nextest-core> 13: std[bcb96dfbba0ab899]::sys::backtrace::__rust_begin_short_backtrace::<test[75d6903177b1d7e9]::run_test::{closure#1}, ()><unknown>
  616. 29.29 s gammaloop-nextest-core> at <unknown source file>:<unknown line>
  617. 29.29 s gammaloop-nextest-core> 14: <std[bcb96dfbba0ab899]::thread::lifecycle::spawn_unchecked<test[75d6903177b1d7e9]::run_test::{closure#1}, ()>::{closure#1} as core[940e698046960fd5]::ops::function::FnOnce<()>>::call_once::{shim:vtable#0}<unknown>
  618. 29.29 s gammaloop-nextest-core> at <unknown source file>:<unknown line>
  619. 29.29 s gammaloop-nextest-core> 15: <std[bcb96dfbba0ab899]::sys::thread::unix::Thread>::new::thread_start<unknown>
  620. 29.29 s gammaloop-nextest-core> at <unknown source file>:<unknown line>
  621. 29.29 s gammaloop-nextest-core> 16: start_thread<unknown>
  622. 29.29 s gammaloop-nextest-core> at <unknown source file>:<unknown line>
  623. 29.29 s gammaloop-nextest-core> 17: __clone3<unknown>
  624. 29.29 s gammaloop-nextest-core> at <unknown source file>:<unknown line>
  625. 29.29 s gammaloop-nextest-core>
  626. 29.29 s gammaloop-nextest-core> Run with COLORBT_SHOW_HIDDEN=1 environment variable to disable frame filtering.
  627. 29.29 s gammaloop-nextest-core> Run with RUST_BACKTRACE=full to include source snippets.
  628. 29.29 s gammaloop-nextest-core> =========================================
  629. 29.47 s error: Cannot build '/nix/store/j0r373mhy6rmbqq05bplwn7cimlqrcnq-gammaloop-nextest-core.drv'.
  630. 29.47 s Reason: builder failed with exit code 100.
  631. 29.47 s Output paths:
  632. 29.47 s /nix/store/p7bqxxb972f7f3209b2sl1hcrmagzj6s-gammaloop-nextest-core
  633. 29.47 s Last 612 log lines:
  634. 29.47 s > Extracting 3 binaries (including 1 non-test binary), 1 build script output directory, and 2 linked paths to /build/source
  635. 29.47 s > Extracted 18 files to /build/source in 0.47s
  636. 29.47 s > ------------
  637. 29.47 s > Nextest run ID ffdfb75b-6de1-43f7-9727-7aede1fd6b85 with nextest profile: ci_gammaloop
  638. 29.47 s > Starting 339 tests across 2 binaries
  639. 29.47 s > FAIL [ 0.021s] (246/339) gammaloop-api repl::tests::completion_shows_type_hint_for_non_boolean_settings_leaf
  640. 29.47 s > stdout ---
  641. 29.47 s >
  642. 29.47 s > running 1 test
  643. 29.47 s > test repl::tests::completion_shows_type_hint_for_non_boolean_settings_leaf ... FAILED
  644. 29.47 s >
  645. 29.47 s > failures:
  646. 29.47 s >
  647. 29.47 s > failures:
  648. 29.47 s > repl::tests::completion_shows_type_hint_for_non_boolean_settings_leaf
  649. 29.47 s >
  650. 29.47 s > test result: FAILED. 0 passed; 1 failed; 0 ignored; 0 measured; 338 filtered out; finished in 0.01s
  651. 29.47 s >
  652. 29.47 s > stderr ---
  653. 29.47 s >
  654. 29.47 s > thread 'repl::tests::completion_shows_type_hint_for_non_boolean_settings_leaf' (788) panicked at crates/gammaloop-api/src/repl.rs:5778:9:
  655. 29.47 s > [Suggestion { value: "", description: Some("Number of samples in the first Monte Carlo iteration."), style: None, extra: None, span: Span { start: 42, end: 42 }, append_whitespace: false }]
  656. 29.47 s > stack backtrace:
  657. 29.47 s > 0: __rustc::rust_begin_unwind
  658. 29.47 s > 1: core::panicking::panic_fmt
  659. 29.47 s > 2: gammaloop_api::repl::tests::completion_shows_type_hint_for_non_boolean_settings_leaf
  660. 29.47 s > 3: <gammaloop_api::repl::tests::completion_shows_type_hint_for_non_boolean_settings_leaf::{closure#0} as core::ops::function::FnOnce<()>>::call_once
  661. 29.47 s > note: Some details are omitted, run with `RUST_BACKTRACE=full` for a verbose backtrace.
  662. 29.47 s >
  663. 29.47 s > FAIL [ 0.017s] (272/339) gammaloop-api templates::tests::extract_templates_uses_canonical_package_layout
  664. 29.47 s > stdout ---
  665. 29.47 s >
  666. 29.47 s > running 1 test
  667. 29.47 s > test templates::tests::extract_templates_uses_canonical_package_layout ... FAILED
  668. 29.47 s >
  669. 29.47 s > failures:
  670. 29.47 s >
  671. 29.47 s > failures:
  672. 29.47 s > templates::tests::extract_templates_uses_canonical_package_layout
  673. 29.47 s >
  674. 29.47 s > test result: FAILED. 0 passed; 1 failed; 0 ignored; 0 measured; 338 filtered out; finished in 0.01s
  675. 29.47 s >
  676. 29.47 s > stderr ---
  677. 29.47 s >
  678. 29.47 s > thread 'templates::tests::extract_templates_uses_canonical_package_layout' (874) panicked at crates/gammaloop-api/src/templates.rs:99:9:
  679. 29.47 s > assertion failed: figure.contains("amplitude-mode")
  680. 29.47 s > stack backtrace:
  681. 29.47 s > 0: __rustc::rust_begin_unwind
  682. 29.47 s > 1: core::panicking::panic_fmt
  683. 29.47 s > 2: core::panicking::panic
  684. 29.47 s > 3: gammaloop_api::templates::tests::extract_templates_uses_canonical_package_layout
  685. 29.47 s > 4: <gammaloop_api::templates::tests::extract_templates_uses_canonical_package_layout::{closure#0} as core::ops::function::FnOnce<()>>::call_once
  686. 29.47 s > note: Some details are omitted, run with `RUST_BACKTRACE=full` for a verbose backtrace.
  687. 29.47 s >
  688. 29.47 s > ------------
  689. 29.47 s > Summary [ 0.503s] 339 tests run: 337 passed, 2 failed, 0 skipped
  690. 29.47 s > FAIL [ 0.021s] (246/339) gammaloop-api repl::tests::completion_shows_type_hint_for_non_boolean_settings_leaf
  691. 29.47 s > stdout ---
  692. 29.47 s >
  693. 29.47 s > running 1 test
  694. 29.47 s > test repl::tests::completion_shows_type_hint_for_non_boolean_settings_leaf ... FAILED
  695. 29.47 s >
  696. 29.47 s > failures:
  697. 29.47 s >
  698. 29.47 s > failures:
  699. 29.47 s > repl::tests::completion_shows_type_hint_for_non_boolean_settings_leaf
  700. 29.47 s >
  701. 29.47 s > test result: FAILED. 0 passed; 1 failed; 0 ignored; 0 measured; 338 filtered out; finished in 0.01s
  702. 29.47 s >
  703. 29.47 s > stderr ---
  704. 29.47 s >
  705. 29.47 s > thread 'repl::tests::completion_shows_type_hint_for_non_boolean_settings_leaf' (788) panicked at crates/gammaloop-api/src/repl.rs:5778:9:
  706. 29.47 s > [Suggestion { value: "", description: Some("Number of samples in the first Monte Carlo iteration."), style: None, extra: None, span: Span { start: 42, end: 42 }, append_whitespace: false }]
  707. 29.47 s > stack backtrace:
  708. 29.47 s > 0: __rustc::rust_begin_unwind
  709. 29.47 s > 1: core::panicking::panic_fmt
  710. 29.47 s > 2: gammaloop_api::repl::tests::completion_shows_type_hint_for_non_boolean_settings_leaf
  711. 29.47 s > 3: <gammaloop_api::repl::tests::completion_shows_type_hint_for_non_boolean_settings_leaf::{closure#0} as core::ops::function::FnOnce<()>>::call_once
  712. 29.47 s > note: Some details are omitted, run with `RUST_BACKTRACE=full` for a verbose backtrace.
  713. 29.47 s >
  714. 29.47 s > FAIL [ 0.017s] (272/339) gammaloop-api templates::tests::extract_templates_uses_canonical_package_layout
  715. 29.47 s > stdout ---
  716. 29.47 s >
  717. 29.47 s > running 1 test
  718. 29.47 s > test templates::tests::extract_templates_uses_canonical_package_layout ... FAILED
  719. 29.47 s >
  720. 29.47 s > failures:
  721. 29.47 s >
  722. 29.47 s > failures:
  723. 29.47 s > templates::tests::extract_templates_uses_canonical_package_layout
  724. 29.47 s >
  725. 29.47 s > test result: FAILED. 0 passed; 1 failed; 0 ignored; 0 measured; 338 filtered out; finished in 0.01s
  726. 29.47 s >
  727. 29.47 s > stderr ---
  728. 29.47 s >
  729. 29.47 s > thread 'templates::tests::extract_templates_uses_canonical_package_layout' (874) panicked at crates/gammaloop-api/src/templates.rs:99:9:
  730. 29.47 s > assertion failed: figure.contains("amplitude-mode")
  731. 29.47 s > stack backtrace:
  732. 29.47 s > 0: __rustc::rust_begin_unwind
  733. 29.47 s > 1: core::panicking::panic_fmt
  734. 29.47 s > 2: core::panicking::panic
  735. 29.47 s > 3: gammaloop_api::templates::tests::extract_templates_uses_canonical_package_layout
  736. 29.47 s > 4: <gammaloop_api::templates::tests::extract_templates_uses_canonical_package_layout::{closure#0} as core::ops::function::FnOnce<()>>::call_once
  737. 29.47 s > note: Some details are omitted, run with `RUST_BACKTRACE=full` for a verbose backtrace.
  738. 29.47 s >
  739. 29.47 s > error: test run failed
  740. 29.47 s >
  741. 29.47 s > ========== nextest test summary ==========
  742. 29.47 s > report: target/nextest/ci_gammaloop/junit.xml
  743. 29.47 s > tests: 339, failures: 2, errors: 0
  744. 29.47 s >
  745. 29.47 s > 1. gammaloop-api::repl::tests::completion_shows_type_hint_for_non_boolean_settings_leaf
  746. 29.47 s > failure: test failure with exit code 101
  747. 29.47 s > thread 'repl::tests::completion_shows_type_hint_for_non_boolean_settings_leaf' (788) panicked at crates/gammaloop-api/src/repl.rs:5778:9:
  748. 29.47 s > [Suggestion { value: "", description: Some("Number of samples in the first Monte Carlo iteration."), style: None, extra: None, span: Span { start: 42, end: 42 }, append_whitespace: false }]
  749. 29.47 s > stack backtrace:
  750. 29.47 s > 0: __rustc::rust_begin_unwind
  751. 29.47 s > 1: core::panicking::panic_fmt
  752. 29.47 s > 2: gammaloop_api::repl::tests::completion_shows_type_hint_for_non_boolean_settings_leaf
  753. 29.47 s > 3: <gammaloop_api::repl::tests::completion_shows_type_hint_for_non_boolean_settings_leaf::{closure#0} as core::ops::function::FnOnce<()>>::call_once
  754. 29.47 s > note: Some details are omitted, run with `RUST_BACKTRACE=full` for a verbose backtrace.
  755. 29.47 s > system-out
  756. 29.47 s > running 1 test
  757. 29.47 s > test repl::tests::completion_shows_type_hint_for_non_boolean_settings_leaf ... FAILED
  758. 29.47 s >
  759. 29.47 s > failures:
  760. 29.47 s >
  761. 29.47 s > failures:
  762. 29.47 s > repl::tests::completion_shows_type_hint_for_non_boolean_settings_leaf
  763. 29.47 s >
  764. 29.47 s > test result: FAILED. 0 passed; 1 failed; 0 ignored; 0 measured; 338 filtered out; finished in 0.01s
  765. 29.47 s > system-err
  766. 29.47 s > thread 'repl::tests::completion_shows_type_hint_for_non_boolean_settings_leaf' (788) panicked at crates/gammaloop-api/src/repl.rs:5778:9:
  767. 29.47 s > [Suggestion { value: "", description: Some("Number of samples in the first Monte Carlo iteration."), style: None, extra: None, span: Span { start: 42, end: 42 }, append_whitespace: false }]
  768. 29.47 s > stack backtrace:
  769. 29.47 s > 0: __rustc::rust_begin_unwind
  770. 29.47 s > 1: core::panicking::panic_fmt
  771. 29.47 s > 2: gammaloop_api::repl::tests::completion_shows_type_hint_for_non_boolean_settings_leaf
  772. 29.47 s > 3: <gammaloop_api::repl::tests::completion_shows_type_hint_for_non_boolean_settings_leaf::{closure#0} as core::ops::function::FnOnce<()>>::call_once
  773. 29.47 s > note: Some details are omitted, run with `RUST_BACKTRACE=full` for a verbose backtrace.
  774. 29.47 s >
  775. 29.47 s > 2. gammaloop-api::templates::tests::extract_templates_uses_canonical_package_layout
  776. 29.47 s > failure: test failure with exit code 101
  777. 29.47 s > thread 'templates::tests::extract_templates_uses_canonical_package_layout' (874) panicked at crates/gammaloop-api/src/templates.rs:99:9:
  778. 29.47 s > assertion failed: figure.contains("amplitude-mode")
  779. 29.47 s > stack backtrace:
  780. 29.47 s > 0: __rustc::rust_begin_unwind
  781. 29.47 s > 1: core::panicking::panic_fmt
  782. 29.47 s > 2: core::panicking::panic
  783. 29.47 s > 3: gammaloop_api::templates::tests::extract_templates_uses_canonical_package_layout
  784. 29.47 s > 4: <gammaloop_api::templates::tests::extract_templates_uses_canonical_package_layout::{closure#0} as core::ops::function::FnOnce<()>>::call_once
  785. 29.47 s > note: Some details are omitted, run with `RUST_BACKTRACE=full` for a verbose backtrace.
  786. 29.47 s > system-out
  787. 29.47 s > running 1 test
  788. 29.47 s > test templates::tests::extract_templates_uses_canonical_package_layout ... FAILED
  789. 29.47 s >
  790. 29.47 s > failures:
  791. 29.47 s >
  792. 29.47 s > failures:
  793. 29.47 s > templates::tests::extract_templates_uses_canonical_package_layout
  794. 29.47 s >
  795. 29.47 s > test result: FAILED. 0 passed; 1 failed; 0 ignored; 0 measured; 338 filtered out; finished in 0.01s
  796. 29.47 s > system-err
  797. 29.47 s > thread 'templates::tests::extract_templates_uses_canonical_package_layout' (874) panicked at crates/gammaloop-api/src/templates.rs:99:9:
  798. 29.47 s > assertion failed: figure.contains("amplitude-mode")
  799. 29.47 s > stack backtrace:
  800. 29.47 s > 0: __rustc::rust_begin_unwind
  801. 29.47 s > 1: core::panicking::panic_fmt
  802. 29.47 s > 2: core::panicking::panic
  803. 29.47 s > 3: gammaloop_api::templates::tests::extract_templates_uses_canonical_package_layout
  804. 29.47 s > 4: <gammaloop_api::templates::tests::extract_templates_uses_canonical_package_layout::{closure#0} as core::ops::function::FnOnce<()>>::call_once
  805. 29.47 s > note: Some details are omitted, run with `RUST_BACKTRACE=full` for a verbose backtrace.
  806. 29.47 s > =========================================
  807. 29.47 s > Extracting 1 binary and 1 linked path to /build/source
  808. 29.47 s > Extracted 7 files to /build/source in 0.07s
  809. 29.47 s > ------------
  810. 29.47 s > Nextest run ID d41b2278-d87b-4746-a9b7-875731a781c1 with nextest profile: ci_gammaloop
  811. 29.47 s > Starting 19 tests across 1 binary
  812. 29.47 s > ------------
  813. 29.47 s > Summary [ 0.012s] 19 tests run: 19 passed, 0 skipped
  814. 29.47 s >
  815. 29.47 s > ========== nextest test summary ==========
  816. 29.47 s > report: target/nextest/ci_gammaloop/junit.xml
  817. 29.47 s > tests: 19, failures: 0, errors: 0
  818. 29.47 s > No failing testcases found.
  819. 29.47 s > =========================================
  820. 29.47 s > Extracting 1 binary to /build/source
  821. 29.47 s > Extracted 4 files to /build/source in 0.03s
  822. 29.47 s > ------------
  823. 29.47 s > Nextest run ID cd1edd44-cae5-4cc0-a30c-bd5d53e68f33 with nextest profile: ci_gammaloop
  824. 29.47 s > Starting 0 tests across 1 binary
  825. 29.47 s > ------------
  826. 29.47 s > Summary [ 0.000s] 0 tests run: 0 passed, 0 skipped
  827. 29.47 s >
  828. 29.47 s > ========== nextest test summary ==========
  829. 29.47 s > report: target/nextest/ci_gammaloop/junit.xml
  830. 29.47 s > tests: 0, failures: 0, errors: 0
  831. 29.47 s > No failing testcases found.
  832. 29.47 s > =========================================
  833. 29.47 s > Extracting 4 binaries, 1 build script output directory, and 2 linked paths to /build/source
  834. 29.47 s > Extracted 18 files to /build/source in 0.46s
  835. 29.47 s > ------------
  836. 29.47 s > Nextest run ID 735b95ac-b655-427d-925f-6d9bfb0e449b with nextest profile: ci_gammaloop
  837. 29.47 s > Starting 456 tests across 4 binaries (61 tests skipped, including 60 tests via profile.ci_gammaloop.default-filter)
  838. 29.47 s > FAIL [ 0.095s] ( 73/456) gammalooprs graph::parse::tests::parse_lmbsetting_crossection
  839. 29.47 s > stdout ---
  840. 29.47 s >
  841. 29.47 s > running 1 test
  842. 29.47 s > ━━━━━━━━━━━━━━━━━━━━━━━━━━━━━━━ Snapshot Summary ━━━━━━━━━━━━━━━━━━━━━━━━━━━━━━━
  843. 29.47 s > Snapshot: parse_lmbsetting_crossection
  844. 29.47 s > Source: crates/gammalooprs/src/graph/parse/tests.rs:252
  845. 29.47 s > ────────────────────────────────────────────────────────────────────────────────
  846. 29.47 s > Expression: g.debug_dot()
  847. 29.47 s > ────────────────────────────────────────────────────────────────────────────────
  848. 29.47 s > -old snapshot
  849. 29.47 s > +new results
  850. 29.47 s > ────────────┬───────────────────────────────────────────────────────────────────
  851. 29.47 s > 1 │-digraph G{
  852. 29.47 s > 1 │+digraph G {
  853. 29.47 s > 2 2 │ num = "1/2";
  854. 29.47 s > 3 3 │ overall_factor = "2*x";
  855. 29.47 s > 4 4 │ overall_factor_evaluated = "2*x";
  856. 29.47 s > 5 5 │ projector = "spenso::t";
  857. 29.47 s > ────────────┴───────────────────────────────────────────────────────────────────
  858. 29.47 s > To update snapshots run `cargo insta review`
  859. 29.47 s > Stopped on the first failure. Run `cargo insta test` to run all snapshots.
  860. 29.47 s > test graph::parse::tests::parse_lmbsetting_crossection ... FAILED
  861. 29.47 s >
  862. 29.47 s > failures:
  863. 29.47 s >
  864. 29.47 s > failures:
  865. 29.47 s > graph::parse::tests::parse_lmbsetting_crossection
  866. 29.47 s >
  867. 29.47 s > test result: FAILED. 0 passed; 1 failed; 0 ignored; 0 measured; 508 filtered out; finished in 0.08s
  868. 29.47 s >
  869. 29.47 s > stderr ---
  870. 29.47 s > [22:04:03.427] @gammalooprs::graph::attribute_warnings WARNING : Unknown node attribute 'color_num' on graph 'G', node 'A'; did you mean 'num'?
  871. 29.47 s > at crates/gammalooprs/src/graph/attribute_warnings.rs:198
  872. 29.47 s > The application panicked (crashed).
  873. 29.47 s > Message: snapshot assertion for 'parse_lmbsetting_crossection' failed in line 252
  874. 29.47 s > Location: /nix/store/xdy1vvhll2bijdplvl9fcc2b9plkxhaa-vendor-cargo-deps/c19b7c6f923b580ac259164a89f2577984ad5ab09ee9d583b888f934adbbe8d0/insta-1.47.2/src/runtime.rs:719
  875. 29.47 s >
  876. 29.47 s > ━━━━━━━━━━━━━━━━━━━━━━━━━━━━━━━━━━ BACKTRACE ━━━━━━━━━━━━━━━━━━━━━━━━━━━━━━━━━━━
  877. 29.47 s > 1: <color_eyre[b0c9e66060e883b2]::config::PanicHook>::panic_report<unknown>
  878. 29.47 s > at <unknown source file>:<unknown line>
  879. 29.47 s > 2: <color_eyre[b0c9e66060e883b2]::config::PanicHook>::into_panic_hook::{closure#0}<unknown>
  880. 29.47 s > at <unknown source file>:<unknown line>
  881. 29.47 s > 3: std[bcb96dfbba0ab899]::panicking::panic_with_hook<unknown>
  882. 29.47 s > at <unknown source file>:<unknown line>
  883. 29.47 s > 4: std[bcb96dfbba0ab899]::panicking::panic_handler::{closure#0}<unknown>
  884. 29.47 s > at <unknown source file>:<unknown line>
  885. 29.47 s > 5: std[bcb96dfbba0ab899]::sys::backtrace::__rust_end_short_backtrace::<std[bcb96dfbba0ab899]::panicking::panic_handler::{closure#0}, !><unknown>
  886. 29.47 s > at <unknown source file>:<unknown line>
  887. 29.47 s > 6: __rustc[6c289b9f9c454d21]::rust_begin_unwind<unknown>
  888. 29.47 s > at <unknown source file>:<unknown line>
  889. 29.47 s > 7: core[940e698046960fd5]::panicking::panic_fmt<unknown>
  890. 29.47 s > at <unknown source file>:<unknown line>
  891. 29.47 s > 8: insta[307a548ac79ef4d9]::runtime::assert_snapshot<unknown>
  892. 29.47 s > at <unknown source file>:<unknown line>
  893. 29.47 s > 9: gammalooprs[5490727360442cce]::graph::parse::tests::parse_lmbsetting_crossection<unknown>
  894. 29.47 s > at <unknown source file>:<unknown line>
  895. 29.47 s > 10: <gammalooprs[5490727360442cce]::graph::parse::tests::parse_lmbsetting_crossection::{closure#0} as core[940e698046960fd5]::ops::function::FnOnce<()>>::call_once<unknown>
  896. 29.47 s > at <unknown source file>:<unknown line>
  897. 29.47 s > 11: test[75d6903177b1d7e9]::__rust_begin_short_backtrace::<core[940e698046960fd5]::result::Result<(), alloc[2ea6bcb46fca0c42]::string::String>, fn() -> core[940e698046960fd5]::result::Result<(), alloc[2ea6bcb46fca0c42]::string::String>><unknown>
  898. 29.47 s > at <unknown source file>:<unknown line>
  899. 29.47 s > 12: test[75d6903177b1d7e9]::run_test::{closure#0}<unknown>
  900. 29.47 s > at <unknown source file>:<unknown line>
  901. 29.47 s > 13: std[bcb96dfbba0ab899]::sys::backtrace::__rust_begin_short_backtrace::<test[75d6903177b1d7e9]::run_test::{closure#1}, ()><unknown>
  902. 29.47 s > at <unknown source file>:<unknown line>
  903. 29.47 s > 14: <std[bcb96dfbba0ab899]::thread::lifecycle::spawn_unchecked<test[75d6903177b1d7e9]::run_test::{closure#1}, ()>::{closure#1} as core[940e698046960fd5]::ops::function::FnOnce<()>>::call_once::{shim:vtable#0}<unknown>
  904. 29.47 s > at <unknown source file>:<unknown line>
  905. 29.47 s > 15: <std[bcb96dfbba0ab899]::sys::thread::unix::Thread>::new::thread_start<unknown>
  906. 29.47 s > at <unknown source file>:<unknown line>
  907. 29.47 s > 16: start_thread<unknown>
  908. 29.47 s > at <unknown source file>:<unknown line>
  909. 29.47 s > 17: __clone3<unknown>
  910. 29.47 s > at <unknown source file>:<unknown line>
  911. 29.47 s >
  912. 29.47 s > Run with COLORBT_SHOW_HIDDEN=1 environment variable to disable frame filtering.
  913. 29.47 s > Run with RUST_BACKTRACE=full to include source snippets.
  914. 29.47 s >
  915. 29.47 s > FAIL [ 0.137s] (409/456) gammalooprs uv::export::tests::computed_node_full_numerator_is_a_spenso_aware_typst_fragment
  916. 29.47 s > stdout ---
  917. 29.47 s >
  918. 29.47 s > running 1 test
  919. 29.47 s > test uv::export::tests::computed_node_full_numerator_is_a_spenso_aware_typst_fragment ... FAILED
  920. 29.47 s >
  921. 29.47 s > failures:
  922. 29.47 s >
  923. 29.47 s > failures:
  924. 29.47 s > uv::export::tests::computed_node_full_numerator_is_a_spenso_aware_typst_fragment
  925. 29.47 s >
  926. 29.47 s > test result: FAILED. 0 passed; 1 failed; 0 ignored; 0 measured; 508 filtered out; finished in 0.11s
  927. 29.47 s >
  928. 29.47 s > stderr ---
  929. 29.47 s > The application panicked (crashed).
  930. 29.47 s > Message: assertion failed: exported.dot.contains(r#"full_num = "op(\"Tr\")(1)";"#)
  931. 29.47 s > Location: crates/gammalooprs/src/uv/export.rs:483
  932. 29.47 s >
  933. 29.47 s > ━━━━━━━━━━━━━━━━━━━━━━━━━━━━━━━━━━ BACKTRACE ━━━━━━━━━━━━━━━━━━━━━━━━━━━━━━━━━━━
  934. 29.47 s > 1: <color_eyre[b0c9e66060e883b2]::config::PanicHook>::panic_report<unknown>
  935. 29.47 s > at <unknown source file>:<unknown line>
  936. 29.47 s > 2: <color_eyre[b0c9e66060e883b2]::config::PanicHook>::into_panic_hook::{closure#0}<unknown>
  937. 29.47 s > at <unknown source file>:<unknown line>
  938. 29.47 s > 3: std[bcb96dfbba0ab899]::panicking::panic_with_hook<unknown>
  939. 29.47 s > at <unknown source file>:<unknown line>
  940. 29.47 s > 4: std[bcb96dfbba0ab899]::panicking::panic_handler::{closure#0}<unknown>
  941. 29.47 s > at <unknown source file>:<unknown line>
  942. 29.47 s > 5: std[bcb96dfbba0ab899]::sys::backtrace::__rust_end_short_backtrace::<std[bcb96dfbba0ab899]::panicking::panic_handler::{closure#0}, !><unknown>
  943. 29.47 s > at <unknown source file>:<unknown line>
  944. 29.47 s > 6: __rustc[6c289b9f9c454d21]::rust_begin_unwind<unknown>
  945. 29.47 s > at <unknown source file>:<unknown line>
  946. 29.47 s > 7: core[940e698046960fd5]::panicking::panic_fmt<unknown>
  947. 29.47 s > at <unknown source file>:<unknown line>
  948. 29.47 s > 8: core[940e698046960fd5]::panicking::panic<unknown>
  949. 29.47 s > at <unknown source file>:<unknown line>
  950. 29.47 s > 9: gammalooprs[5490727360442cce]::uv::export::tests::computed_node_full_numerator_is_a_spenso_aware_typst_fragment<unknown>
  951. 29.47 s > at <unknown source file>:<unknown line>
  952. 29.47 s > 10: <gammalooprs[5490727360442cce]::uv::export::tests::computed_node_full_numerator_is_a_spenso_aware_typst_fragment::{closure#0} as core[940e698046960fd5]::ops::function::FnOnce<()>>::call_once<unknown>
  953. 29.47 s > at <unknown source file>:<unknown line>
  954. 29.47 s > 11: test[75d6903177b1d7e9]::__rust_begin_short_backtrace::<core[940e698046960fd5]::result::Result<(), alloc[2ea6bcb46fca0c42]::string::String>, fn() -> core[940e698046960fd5]::result::Result<(), alloc[2ea6bcb46fca0c42]::string::String>><unknown>
  955. 29.47 s > at <unknown source file>:<unknown line>
  956. 29.47 s > 12: test[75d6903177b1d7e9]::run_test::{closure#0}<unknown>
  957. 29.47 s > at <unknown source file>:<unknown line>
  958. 29.47 s > 13: std[bcb96dfbba0ab899]::sys::backtrace::__rust_begin_short_backtrace::<test[75d6903177b1d7e9]::run_test::{closure#1}, ()><unknown>
  959. 29.47 s > at <unknown source file>:<unknown line>
  960. 29.47 s > 14: <std[bcb96dfbba0ab899]::thread::lifecycle::spawn_unchecked<test[75d6903177b1d7e9]::run_test::{closure#1}, ()>::{closure#1} as core[940e698046960fd5]::ops::function::FnOnce<()>>::call_once::{shim:vtable#0}<unknown>
  961. 29.47 s > at <unknown source file>:<unknown line>
  962. 29.47 s > 15: <std[bcb96dfbba0ab899]::sys::thread::unix::Thread>::new::thread_start<unknown>
  963. 29.47 s > at <unknown source file>:<unknown line>
  964. 29.47 s > 16: start_thread<unknown>
  965. 29.47 s > at <unknown source file>:<unknown line>
  966. 29.47 s > 17: __clone3<unknown>
  967. 29.47 s > at <unknown source file>:<unknown line>
  968. 29.47 s >
  969. 29.47 s > Run with COLORBT_SHOW_HIDDEN=1 environment variable to disable frame filtering.
  970. 29.47 s > Run with RUST_BACKTRACE=full to include source snippets.
  971. 29.47 s >
  972. 29.47 s > ------------
  973. 29.47 s > Summary [ 9.459s] 456 tests run: 454 passed, 2 failed, 61 skipped
  974. 29.47 s > FAIL [ 0.095s] ( 73/456) gammalooprs graph::parse::tests::parse_lmbsetting_crossection
  975. 29.47 s > stdout ---
  976. 29.47 s >
  977. 29.47 s > running 1 test
  978. 29.47 s > ━━━━━━━━━━━━━━━━━━━━━━━━━━━━━━━ Snapshot Summary ━━━━━━━━━━━━━━━━━━━━━━━━━━━━━━━
  979. 29.47 s > Snapshot: parse_lmbsetting_crossection
  980. 29.47 s > Source: crates/gammalooprs/src/graph/parse/tests.rs:252
  981. 29.47 s > ────────────────────────────────────────────────────────────────────────────────
  982. 29.47 s > Expression: g.debug_dot()
  983. 29.47 s > ────────────────────────────────────────────────────────────────────────────────
  984. 29.47 s > -old snapshot
  985. 29.47 s > +new results
  986. 29.47 s > ────────────┬───────────────────────────────────────────────────────────────────
  987. 29.47 s > 1 │-digraph G{
  988. 29.47 s > 1 │+digraph G {
  989. 29.47 s > 2 2 │ num = "1/2";
  990. 29.47 s > 3 3 │ overall_factor = "2*x";
  991. 29.47 s > 4 4 │ overall_factor_evaluated = "2*x";
  992. 29.47 s > 5 5 │ projector = "spenso::t";
  993. 29.47 s > ────────────┴───────────────────────────────────────────────────────────────────
  994. 29.47 s > To update snapshots run `cargo insta review`
  995. 29.47 s > Stopped on the first failure. Run `cargo insta test` to run all snapshots.
  996. 29.47 s > test graph::parse::tests::parse_lmbsetting_crossection ... FAILED
  997. 29.47 s >
  998. 29.47 s > failures:
  999. 29.47 s >
  1000. 29.47 s > failures:
  1001. 29.47 s > graph::parse::tests::parse_lmbsetting_crossection
  1002. 29.47 s >
  1003. 29.47 s > test result: FAILED. 0 passed; 1 failed; 0 ignored; 0 measured; 508 filtered out; finished in 0.08s
  1004. 29.47 s >
  1005. 29.47 s > stderr ---
  1006. 29.47 s > [22:04:03.427] @gammalooprs::graph::attribute_warnings WARNING : Unknown node attribute 'color_num' on graph 'G', node 'A'; did you mean 'num'?
  1007. 29.47 s > at crates/gammalooprs/src/graph/attribute_warnings.rs:198
  1008. 29.47 s > The application panicked (crashed).
  1009. 29.47 s > Message: snapshot assertion for 'parse_lmbsetting_crossection' failed in line 252
  1010. 29.47 s > Location: /nix/store/xdy1vvhll2bijdplvl9fcc2b9plkxhaa-vendor-cargo-deps/c19b7c6f923b580ac259164a89f2577984ad5ab09ee9d583b888f934adbbe8d0/insta-1.47.2/src/runtime.rs:719
  1011. 29.47 s >
  1012. 29.47 s > ━━━━━━━━━━━━━━━━━━━━━━━━━━━━━━━━━━ BACKTRACE ━━━━━━━━━━━━━━━━━━━━━━━━━━━━━━━━━━━
  1013. 29.47 s > 1: <color_eyre[b0c9e66060e883b2]::config::PanicHook>::panic_report<unknown>
  1014. 29.47 s > at <unknown source file>:<unknown line>
  1015. 29.47 s > 2: <color_eyre[b0c9e66060e883b2]::config::PanicHook>::into_panic_hook::{closure#0}<unknown>
  1016. 29.47 s > at <unknown source file>:<unknown line>
  1017. 29.47 s > 3: std[bcb96dfbba0ab899]::panicking::panic_with_hook<unknown>
  1018. 29.47 s > at <unknown source file>:<unknown line>
  1019. 29.47 s > 4: std[bcb96dfbba0ab899]::panicking::panic_handler::{closure#0}<unknown>
  1020. 29.47 s > at <unknown source file>:<unknown line>
  1021. 29.47 s > 5: std[bcb96dfbba0ab899]::sys::backtrace::__rust_end_short_backtrace::<std[bcb96dfbba0ab899]::panicking::panic_handler::{closure#0}, !><unknown>
  1022. 29.47 s > at <unknown source file>:<unknown line>
  1023. 29.47 s > 6: __rustc[6c289b9f9c454d21]::rust_begin_unwind<unknown>
  1024. 29.47 s > at <unknown source file>:<unknown line>
  1025. 29.47 s > 7: core[940e698046960fd5]::panicking::panic_fmt<unknown>
  1026. 29.47 s > at <unknown source file>:<unknown line>
  1027. 29.47 s > 8: insta[307a548ac79ef4d9]::runtime::assert_snapshot<unknown>
  1028. 29.47 s > at <unknown source file>:<unknown line>
  1029. 29.47 s > 9: gammalooprs[5490727360442cce]::graph::parse::tests::parse_lmbsetting_crossection<unknown>
  1030. 29.47 s > at <unknown source file>:<unknown line>
  1031. 29.47 s > 10: <gammalooprs[5490727360442cce]::graph::parse::tests::parse_lmbsetting_crossection::{closure#0} as core[940e698046960fd5]::ops::function::FnOnce<()>>::call_once<unknown>
  1032. 29.47 s > at <unknown source file>:<unknown line>
  1033. 29.47 s > 11: test[75d6903177b1d7e9]::__rust_begin_short_backtrace::<core[940e698046960fd5]::result::Result<(), alloc[2ea6bcb46fca0c42]::string::String>, fn() -> core[940e698046960fd5]::result::Result<(), alloc[2ea6bcb46fca0c42]::string::String>><unknown>
  1034. 29.47 s > at <unknown source file>:<unknown line>
  1035. 29.47 s > 12: test[75d6903177b1d7e9]::run_test::{closure#0}<unknown>
  1036. 29.47 s > at <unknown source file>:<unknown line>
  1037. 29.47 s > 13: std[bcb96dfbba0ab899]::sys::backtrace::__rust_begin_short_backtrace::<test[75d6903177b1d7e9]::run_test::{closure#1}, ()><unknown>
  1038. 29.47 s > at <unknown source file>:<unknown line>
  1039. 29.47 s > 14: <std[bcb96dfbba0ab899]::thread::lifecycle::spawn_unchecked<test[75d6903177b1d7e9]::run_test::{closure#1}, ()>::{closure#1} as core[940e698046960fd5]::ops::function::FnOnce<()>>::call_once::{shim:vtable#0}<unknown>
  1040. 29.47 s > at <unknown source file>:<unknown line>
  1041. 29.47 s > 15: <std[bcb96dfbba0ab899]::sys::thread::unix::Thread>::new::thread_start<unknown>
  1042. 29.47 s > at <unknown source file>:<unknown line>
  1043. 29.47 s > 16: start_thread<unknown>
  1044. 29.47 s > at <unknown source file>:<unknown line>
  1045. 29.47 s > 17: __clone3<unknown>
  1046. 29.47 s > at <unknown source file>:<unknown line>
  1047. 29.47 s >
  1048. 29.47 s > Run with COLORBT_SHOW_HIDDEN=1 environment variable to disable frame filtering.
  1049. 29.47 s > Run with RUST_BACKTRACE=full to include source snippets.
  1050. 29.47 s >
  1051. 29.47 s > FAIL [ 0.137s] (409/456) gammalooprs uv::export::tests::computed_node_full_numerator_is_a_spenso_aware_typst_fragment
  1052. 29.47 s > stdout ---
  1053. 29.47 s >
  1054. 29.47 s > running 1 test
  1055. 29.47 s > test uv::export::tests::computed_node_full_numerator_is_a_spenso_aware_typst_fragment ... FAILED
  1056. 29.47 s >
  1057. 29.47 s > failures:
  1058. 29.47 s >
  1059. 29.47 s > failures:
  1060. 29.47 s > uv::export::tests::computed_node_full_numerator_is_a_spenso_aware_typst_fragment
  1061. 29.47 s >
  1062. 29.47 s > test result: FAILED. 0 passed; 1 failed; 0 ignored; 0 measured; 508 filtered out; finished in 0.11s
  1063. 29.47 s >
  1064. 29.47 s > stderr ---
  1065. 29.47 s > The application panicked (crashed).
  1066. 29.47 s > Message: assertion failed: exported.dot.contains(r#"full_num = "op(\"Tr\")(1)";"#)
  1067. 29.47 s > Location: crates/gammalooprs/src/uv/export.rs:483
  1068. 29.47 s >
  1069. 29.47 s > ━━━━━━━━━━━━━━━━━━━━━━━━━━━━━━━━━━ BACKTRACE ━━━━━━━━━━━━━━━━━━━━━━━━━━━━━━━━━━━
  1070. 29.47 s > 1: <color_eyre[b0c9e66060e883b2]::config::PanicHook>::panic_report<unknown>
  1071. 29.47 s > at <unknown source file>:<unknown line>
  1072. 29.47 s > 2: <color_eyre[b0c9e66060e883b2]::config::PanicHook>::into_panic_hook::{closure#0}<unknown>
  1073. 29.47 s > at <unknown source file>:<unknown line>
  1074. 29.47 s > 3: std[bcb96dfbba0ab899]::panicking::panic_with_hook<unknown>
  1075. 29.47 s > at <unknown source file>:<unknown line>
  1076. 29.47 s > 4: std[bcb96dfbba0ab899]::panicking::panic_handler::{closure#0}<unknown>
  1077. 29.47 s > at <unknown source file>:<unknown line>
  1078. 29.47 s > 5: std[bcb96dfbba0ab899]::sys::backtrace::__rust_end_short_backtrace::<std[bcb96dfbba0ab899]::panicking::panic_handler::{closure#0}, !><unknown>
  1079. 29.47 s > at <unknown source file>:<unknown line>
  1080. 29.47 s > 6: __rustc[6c289b9f9c454d21]::rust_begin_unwind<unknown>
  1081. 29.47 s > at <unknown source file>:<unknown line>
  1082. 29.47 s > 7: core[940e698046960fd5]::panicking::panic_fmt<unknown>
  1083. 29.47 s > at <unknown source file>:<unknown line>
  1084. 29.47 s > 8: core[940e698046960fd5]::panicking::panic<unknown>
  1085. 29.47 s > at <unknown source file>:<unknown line>
  1086. 29.47 s > 9: gammalooprs[5490727360442cce]::uv::export::tests::computed_node_full_numerator_is_a_spenso_aware_typst_fragment<unknown>
  1087. 29.47 s > at <unknown source file>:<unknown line>
  1088. 29.47 s > 10: <gammalooprs[5490727360442cce]::uv::export::tests::computed_node_full_numerator_is_a_spenso_aware_typst_fragment::{closure#0} as core[940e698046960fd5]::ops::function::FnOnce<()>>::call_once<unknown>
  1089. 29.47 s > at <unknown source file>:<unknown line>
  1090. 29.47 s > 11: test[75d6903177b1d7e9]::__rust_begin_short_backtrace::<core[940e698046960fd5]::result::Result<(), alloc[2ea6bcb46fca0c42]::string::String>, fn() -> core[940e698046960fd5]::result::Result<(), alloc[2ea6bcb46fca0c42]::string::String>><unknown>
  1091. 29.47 s > at <unknown source file>:<unknown line>
  1092. 29.47 s > 12: test[75d6903177b1d7e9]::run_test::{closure#0}<unknown>
  1093. 29.47 s > at <unknown source file>:<unknown line>
  1094. 29.47 s > 13: std[bcb96dfbba0ab899]::sys::backtrace::__rust_begin_short_backtrace::<test[75d6903177b1d7e9]::run_test::{closure#1}, ()><unknown>
  1095. 29.47 s > at <unknown source file>:<unknown line>
  1096. 29.47 s > 14: <std[bcb96dfbba0ab899]::thread::lifecycle::spawn_unchecked<test[75d6903177b1d7e9]::run_test::{closure#1}, ()>::{closure#1} as core[940e698046960fd5]::ops::function::FnOnce<()>>::call_once::{shim:vtable#0}<unknown>
  1097. 29.47 s > at <unknown source file>:<unknown line>
  1098. 29.47 s > 15: <std[bcb96dfbba0ab899]::sys::thread::unix::Thread>::new::thread_start<unknown>
  1099. 29.47 s > at <unknown source file>:<unknown line>
  1100. 29.47 s > 16: start_thread<unknown>
  1101. 29.47 s > at <unknown source file>:<unknown line>
  1102. 29.47 s > 17: __clone3<unknown>
  1103. 29.47 s > at <unknown source file>:<unknown line>
  1104. 29.47 s >
  1105. 29.47 s > Run with COLORBT_SHOW_HIDDEN=1 environment variable to disable frame filtering.
  1106. 29.47 s > Run with RUST_BACKTRACE=full to include source snippets.
  1107. 29.47 s >
  1108. 29.47 s > error: test run failed
  1109. 29.47 s >
  1110. 29.47 s > ========== nextest test summary ==========
  1111. 29.47 s > report: target/nextest/ci_gammaloop/junit.xml
  1112. 29.47 s > tests: 456, failures: 2, errors: 0
  1113. 29.47 s >
  1114. 29.47 s > 1. gammalooprs::graph::parse::tests::parse_lmbsetting_crossection
  1115. 29.47 s > failure: test failure with exit code 101
  1116. 29.47 s > system-out
  1117. 29.47 s > running 1 test
  1118. 29.47 s > ━━━━━━━━━━━━━━━━━━━━━━━━━━━━━━━ Snapshot Summary ━━━━━━━━━━━━━━━━━━━━━━━━━━━━━━━
  1119. 29.47 s > Snapshot: parse_lmbsetting_crossection
  1120. 29.47 s > Source: crates/gammalooprs/src/graph/parse/tests.rs:252
  1121. 29.47 s > ────────────────────────────────────────────────────────────────────────────────
  1122. 29.47 s > Expression: g.debug_dot()
  1123. 29.47 s > ────────────────────────────────────────────────────────────────────────────────
  1124. 29.47 s > -old snapshot
  1125. 29.47 s > +new results
  1126. 29.47 s > ────────────┬───────────────────────────────────────────────────────────────────
  1127. 29.47 s > 1 │-digraph G{
  1128. 29.47 s > 1 │+digraph G {
  1129. 29.47 s > 2 2 │ num = "1/2";
  1130. 29.47 s > 3 3 │ overall_factor = "2*x";
  1131. 29.47 s > 4 4 │ overall_factor_evaluated = "2*x";
  1132. 29.47 s > 5 5 │ projector = "spenso::t";
  1133. 29.47 s > ────────────┴───────────────────────────────────────────────────────────────────
  1134. 29.47 s > To update snapshots run `cargo insta review`
  1135. 29.47 s > Stopped on the first failure. Run `cargo insta test` to run all snapshots.
  1136. 29.47 s > test graph::parse::tests::parse_lmbsetting_crossection ... FAILED
  1137. 29.47 s >
  1138. 29.47 s > failures:
  1139. 29.47 s >
  1140. 29.47 s > failures:
  1141. 29.47 s > graph::parse::tests::parse_lmbsetting_crossection
  1142. 29.47 s >
  1143. 29.47 s > test result: FAILED. 0 passed; 1 failed; 0 ignored; 0 measured; 508 filtered out; finished in 0.08s
  1144. 29.47 s > system-err
  1145. 29.47 s > [22:04:03.427] @gammalooprs::graph::attribute_warnings WARNING : Unknown node attribute 'color_num' on graph 'G', node 'A'; did you mean 'num'?
  1146. 29.47 s > at crates/gammalooprs/src/graph/attribute_warnings.rs:198
  1147. 29.47 s > The application panicked (crashed).
  1148. 29.47 s > Message: snapshot assertion for 'parse_lmbsetting_crossection' failed in line 252
  1149. 29.47 s > Location: /nix/store/xdy1vvhll2bijdplvl9fcc2b9plkxhaa-vendor-cargo-deps/c19b7c6f923b580ac259164a89f2577984ad5ab09ee9d583b888f934adbbe8d0/insta-1.47.2/src/runtime.rs:719
  1150. 29.47 s >
  1151. 29.47 s > ━━━━━━━━━━━━━━━━━━━━━━━━━━━━━━━━━━ BACKTRACE ━━━━━━━━━━━━━━━━━━━━━━━━━━━━━━━━━━━
  1152. 29.47 s > 1: <color_eyre[b0c9e66060e883b2]::config::PanicHook>::panic_report<unknown>
  1153. 29.47 s > at <unknown source file>:<unknown line>
  1154. 29.47 s > 2: <color_eyre[b0c9e66060e883b2]::config::PanicHook>::into_panic_hook::{closure#0}<unknown>
  1155. 29.47 s > at <unknown source file>:<unknown line>
  1156. 29.47 s > 3: std[bcb96dfbba0ab899]::panicking::panic_with_hook<unknown>
  1157. 29.47 s > at <unknown source file>:<unknown line>
  1158. 29.47 s > 4: std[bcb96dfbba0ab899]::panicking::panic_handler::{closure#0}<unknown>
  1159. 29.47 s > at <unknown source file>:<unknown line>
  1160. 29.47 s > 5: std[bcb96dfbba0ab899]::sys::backtrace::__rust_end_short_backtrace::<std[bcb96dfbba0ab899]::panicking::panic_handler::{closure#0}, !><unknown>
  1161. 29.47 s > at <unknown source file>:<unknown line>
  1162. 29.47 s > 6: __rustc[6c289b9f9c454d21]::rust_begin_unwind<unknown>
  1163. 29.47 s > at <unknown source file>:<unknown line>
  1164. 29.47 s > 7: core[940e698046960fd5]::panicking::panic_fmt<unknown>
  1165. 29.47 s > at <unknown source file>:<unknown line>
  1166. 29.47 s > 8: insta[307a548ac79ef4d9]::runtime::assert_snapshot<unknown>
  1167. 29.47 s > at <unknown source file>:<unknown line>
  1168. 29.47 s > 9: gammalooprs[5490727360442cce]::graph::parse::tests::parse_lmbsetting_crossection<unknown>
  1169. 29.47 s > at <unknown source file>:<unknown line>
  1170. 29.47 s > 10: <gammalooprs[5490727360442cce]::graph::parse::tests::parse_lmbsetting_crossection::{closure#0} as core[940e698046960fd5]::ops::function::FnOnce<()>>::call_once<unknown>
  1171. 29.47 s > at <unknown source file>:<unknown line>
  1172. 29.47 s > 11: test[75d6903177b1d7e9]::__rust_begin_short_backtrace::<core[940e698046960fd5]::result::Result<(), alloc[2ea6bcb46fca0c42]::string::String>, fn() -> core[940e698046960fd5]::result::Result<(), alloc[2ea6bcb46fca0c42]::string::String>><unknown>
  1173. 29.47 s > at <unknown source file>:<unknown line>
  1174. 29.47 s > 12: test[75d6903177b1d7e9]::run_test::{closure#0}<unknown>
  1175. 29.47 s > at <unknown source file>:<unknown line>
  1176. 29.47 s > 13: std[bcb96dfbba0ab899]::sys::backtrace::__rust_begin_short_backtrace::<test[75d6903177b1d7e9]::run_test::{closure#1}, ()><unknown>
  1177. 29.47 s > at <unknown source file>:<unknown line>
  1178. 29.47 s > 14: <std[bcb96dfbba0ab899]::thread::lifecycle::spawn_unchecked<test[75d6903177b1d7e9]::run_test::{closure#1}, ()>::{closure#1} as core[940e698046960fd5]::ops::function::FnOnce<()>>::call_once::{shim:vtable#0}<unknown>
  1179. 29.47 s > at <unknown source file>:<unknown line>
  1180. 29.47 s > 15: <std[bcb96dfbba0ab899]::sys::thread::unix::Thread>::new::thread_start<unknown>
  1181. 29.47 s > at <unknown source file>:<unknown line>
  1182. 29.47 s > 16: start_thread<unknown>
  1183. 29.47 s > at <unknown source file>:<unknown line>
  1184. 29.47 s > 17: __clone3<unknown>
  1185. 29.47 s > at <unknown source file>:<unknown line>
  1186. 29.47 s >
  1187. 29.47 s > Run with COLORBT_SHOW_HIDDEN=1 environment variable to disable frame filtering.
  1188. 29.47 s > Run with RUST_BACKTRACE=full to include source snippets.
  1189. 29.47 s >
  1190. 29.47 s > 2. gammalooprs::uv::export::tests::computed_node_full_numerator_is_a_spenso_aware_typst_fragment
  1191. 29.47 s > failure: test failure with exit code 101
  1192. 29.47 s > system-out
  1193. 29.47 s > running 1 test
  1194. 29.47 s > test uv::export::tests::computed_node_full_numerator_is_a_spenso_aware_typst_fragment ... FAILED
  1195. 29.47 s >
  1196. 29.47 s > failures:
  1197. 29.47 s >
  1198. 29.47 s > failures:
  1199. 29.47 s > uv::export::tests::computed_node_full_numerator_is_a_spenso_aware_typst_fragment
  1200. 29.47 s >
  1201. 29.47 s > test result: FAILED. 0 passed; 1 failed; 0 ignored; 0 measured; 508 filtered out; finished in 0.11s
  1202. 29.47 s > system-err
  1203. 29.47 s > The application panicked (crashed).
  1204. 29.47 s > Message: assertion failed: exported.dot.contains(r#"full_num = "op(\"Tr\")(1)";"#)
  1205. 29.47 s > Location: crates/gammalooprs/src/uv/export.rs:483
  1206. 29.47 s >
  1207. 29.47 s > ━━━━━━━━━━━━━━━━━━━━━━━━━━━━━━━━━━ BACKTRACE ━━━━━━━━━━━━━━━━━━━━━━━━━━━━━━━━━━━
  1208. 29.47 s > 1: <color_eyre[b0c9e66060e883b2]::config::PanicHook>::panic_report<unknown>
  1209. 29.47 s > at <unknown source file>:<unknown line>
  1210. 29.47 s > 2: <color_eyre[b0c9e66060e883b2]::config::PanicHook>::into_panic_hook::{closure#0}<unknown>
  1211. 29.47 s > at <unknown source file>:<unknown line>
  1212. 29.47 s > 3: std[bcb96dfbba0ab899]::panicking::panic_with_hook<unknown>
  1213. 29.47 s > at <unknown source file>:<unknown line>
  1214. 29.47 s > 4: std[bcb96dfbba0ab899]::panicking::panic_handler::{closure#0}<unknown>
  1215. 29.47 s > at <unknown source file>:<unknown line>
  1216. 29.47 s > 5: std[bcb96dfbba0ab899]::sys::backtrace::__rust_end_short_backtrace::<std[bcb96dfbba0ab899]::panicking::panic_handler::{closure#0}, !><unknown>
  1217. 29.47 s > at <unknown source file>:<unknown line>
  1218. 29.47 s > 6: __rustc[6c289b9f9c454d21]::rust_begin_unwind<unknown>
  1219. 29.47 s > at <unknown source file>:<unknown line>
  1220. 29.47 s > 7: core[940e698046960fd5]::panicking::panic_fmt<unknown>
  1221. 29.47 s > at <unknown source file>:<unknown line>
  1222. 29.47 s > 8: core[940e698046960fd5]::panicking::panic<unknown>
  1223. 29.47 s > at <unknown source file>:<unknown line>
  1224. 29.47 s > 9: gammalooprs[5490727360442cce]::uv::export::tests::computed_node_full_numerator_is_a_spenso_aware_typst_fragment<unknown>
  1225. 29.47 s > at <unknown source file>:<unknown line>
  1226. 29.47 s > 10: <gammalooprs[5490727360442cce]::uv::export::tests::computed_node_full_numerator_is_a_spenso_aware_typst_fragment::{closure#0} as core[940e698046960fd5]::ops::function::FnOnce<()>>::call_once<unknown>
  1227. 29.47 s > at <unknown source file>:<unknown line>
  1228. 29.47 s > 11: test[75d6903177b1d7e9]::__rust_begin_short_backtrace::<core[940e698046960fd5]::result::Result<(), alloc[2ea6bcb46fca0c42]::string::String>, fn() -> core[940e698046960fd5]::result::Result<(), alloc[2ea6bcb46fca0c42]::string::String>><unknown>
  1229. 29.47 s > at <unknown source file>:<unknown line>
  1230. 29.47 s > 12: test[75d6903177b1d7e9]::run_test::{closure#0}<unknown>
  1231. 29.47 s > at <unknown source file>:<unknown line>
  1232. 29.47 s > 13: std[bcb96dfbba0ab899]::sys::backtrace::__rust_begin_short_backtrace::<test[75d6903177b1d7e9]::run_test::{closure#1}, ()><unknown>
  1233. 29.47 s > at <unknown source file>:<unknown line>
  1234. 29.47 s > 14: <std[bcb96dfbba0ab899]::thread::lifecycle::spawn_unchecked<test[75d6903177b1d7e9]::run_test::{closure#1}, ()>::{closure#1} as core[940e698046960fd5]::ops::function::FnOnce<()>>::call_once::{shim:vtable#0}<unknown>
  1235. 29.47 s > at <unknown source file>:<unknown line>
  1236. 29.47 s > 15: <std[bcb96dfbba0ab899]::sys::thread::unix::Thread>::new::thread_start<unknown>
  1237. 29.47 s > at <unknown source file>:<unknown line>
  1238. 29.47 s > 16: start_thread<unknown>
  1239. 29.47 s > at <unknown source file>:<unknown line>
  1240. 29.47 s > 17: __clone3<unknown>
  1241. 29.47 s > at <unknown source file>:<unknown line>
  1242. 29.47 s >
  1243. 29.47 s > Run with COLORBT_SHOW_HIDDEN=1 environment variable to disable frame filtering.
  1244. 29.47 s > Run with RUST_BACKTRACE=full to include source snippets.
  1245. 29.47 s > =========================================
  1246. 29.47 s For full logs, run:
  1247. 29.47 s nix log /nix/store/j0r373mhy6rmbqq05bplwn7cimlqrcnq-gammaloop-nextest-core.drv
  1248. 29.59 s [0 built (1 failed)]Run failed.