test packages.x86_64-linux.nix-ci-check-gammaloop-nextest-core
0.09 s
$ /nix/store/9ypz3flqsrl5xl495mm8h645gadjsxi1-coreutils-9.11/bin/timeout --kill-after=15s 7200s /nix/store/23zk8sgzamrbmj1fday15szf7f2279s8-nix-2.34.7/bin/nix --extra-experimental-features nix-command --extra-experimental-features flakes flake clone git+https://github.com/alphal00p/gammaloop --dest /tmp/nix-ci-worker/stable-pwd/repo/
0.10 s
Cloning into '/tmp/nix-ci-worker/stable-pwd/repo'...
1.47 s
remote: Enumerating objects: 64191, done.
2.03 s
remote: Counting objects: 0% (1/9557)
remote: Counting objects: 1% (96/9557)
remote: Counting objects: 2% (192/9557)
remote: Counting objects: 3% (287/9557)
remote: Counting objects: 4% (383/9557)
remote: Counting objects: 5% (478/9557)
remote: Counting objects: 6% (574/9557)
remote: Counting objects: 7% (669/9557)
remote: Counting objects: 8% (765/9557)
remote: Counting objects: 9% (861/9557)
remote: Counting objects: 10% (956/9557)
remote: Counting objects: 11% (1052/9557)
remote: Counting objects: 12% (1147/9557)
remote: Counting objects: 13% (1243/9557)
remote: Counting objects: 14% (1338/9557)
remote: Counting objects: 15% (1434/9557)
remote: Counting objects: 16% (1530/9557)
remote: Counting objects: 17% (1625/9557)
remote: Counting objects: 18% (1721/9557)
remote: Counting objects: 19% (1816/9557)
remote: Counting objects: 20% (1912/9557)
remote: Counting objects: 21% (2007/9557)
remote: Counting objects: 22% (2103/9557)
remote: Counting objects: 23% (2199/9557)
remote: Counting objects: 24% (2294/9557)
remote: Counting objects: 25% (2390/9557)
remote: Counting objects: 26% (2485/9557)
remote: Counting objects: 27% (2581/9557)
remote: Counting objects: 28% (2676/9557)
remote: Counting objects: 29% (2772/9557)
remote: Counting objects: 30% (2868/9557)
remote: Counting objects: 31% (2963/9557)
remote: Counting objects: 32% (3059/9557)
remote: Counting objects: 33% (3154/9557)
remote: Counting objects: 34% (3250/9557)
remote: Counting objects: 35% (3345/9557)
remote: Counting objects: 36% (3441/9557)
remote: Counting objects: 37% (3537/9557)
remote: Counting objects: 38% (3632/9557)
remote: Counting objects: 39% (3728/9557)
remote: Counting objects: 40% (3823/9557)
remote: Counting objects: 41% (3919/9557)
remote: Counting objects: 42% (4014/9557)
remote: Counting objects: 43% (4110/9557)
remote: Counting objects: 44% (4206/9557)
remote: Counting objects: 45% (4301/9557)
remote: Counting objects: 46% (4397/9557)
remote: Counting objects: 47% (4492/9557)
remote: Counting objects: 48% (4588/9557)
remote: Counting objects: 49% (4683/9557)
remote: Counting objects: 50% (4779/9557)
remote: Counting objects: 51% (4875/9557)
remote: Counting objects: 52% (4970/9557)
remote: Counting objects: 53% (5066/9557)
remote: Counting objects: 54% (5161/9557)
remote: Counting objects: 55% (5257/9557)
remote: Counting objects: 56% (5352/9557)
remote: Counting objects: 57% (5448/9557)
remote: Counting objects: 58% (5544/9557)
remote: Counting objects: 59% (5639/9557)
remote: Counting objects: 60% (5735/9557)
remote: Counting objects: 61% (5830/9557)
remote: Counting objects: 62% (5926/9557)
remote: Counting objects: 63% (6021/9557)
remote: Counting objects: 64% (6117/9557)
remote: Counting objects: 65% (6213/9557)
remote: Counting objects: 66% (6308/9557)
remote: Counting objects: 67% (6404/9557)
remote: Counting objects: 68% (6499/9557)
remote: Counting objects: 69% (6595/9557)
remote: Counting objects: 70% (6690/9557)
remote: Counting objects: 71% (6786/9557)
remote: Counting objects: 72% (6882/9557)
remote: Counting objects: 73% (6977/9557)
remote: Counting objects: 74% (7073/9557)
remote: Counting objects: 75% (7168/9557)
remote: Counting objects: 76% (7264/9557)
remote: Counting objects: 77% (7359/9557)
remote: Counting objects: 78% (7455/9557)
remote: Counting objects: 79% (7551/9557)
remote: Counting objects: 80% (7646/9557)
remote: Counting objects: 81% (7742/9557)
remote: Counting objects: 82% (7837/9557)
remote: Counting objects: 83% (7933/9557)
remote: Counting objects: 84% (8028/9557)
remote: Counting objects: 85% (8124/9557)
remote: Counting objects: 86% (8220/9557)
remote: Counting objects: 87% (8315/9557)
remote: Counting objects: 88% (8411/9557)
remote: Counting objects: 89% (8506/9557)
remote: Counting objects: 90% (8602/9557)
remote: Counting objects: 91% (8697/9557)
remote: Counting objects: 92% (8793/9557)
remote: Counting objects: 93% (8889/9557)
remote: Counting objects: 94% (8984/9557)
remote: Counting objects: 95% (9080/9557)
remote: Counting objects: 96% (9175/9557)
remote: Counting objects: 97% (9271/9557)
remote: Counting objects: 98% (9366/9557)
remote: Counting objects: 99% (9462/9557)
remote: Counting objects: 100% (9557/9557)
remote: Counting objects: 100% (9557/9557), done.
3.89 s
remote: Compressing objects: 0% (1/2331)
remote: Compressing objects: 1% (24/2331)
remote: Compressing objects: 2% (47/2331)
remote: Compressing objects: 3% (70/2331)
remote: Compressing objects: 4% (94/2331)
remote: Compressing objects: 5% (117/2331)
remote: Compressing objects: 6% (140/2331)
remote: Compressing objects: 7% (164/2331)
remote: Compressing objects: 8% (187/2331)
remote: Compressing objects: 9% (210/2331)
remote: Compressing objects: 10% (234/2331)
remote: Compressing objects: 11% (257/2331)
remote: Compressing objects: 12% (280/2331)
remote: Compressing objects: 13% (304/2331)
remote: Compressing objects: 14% (327/2331)
remote: Compressing objects: 15% (350/2331)
remote: Compressing objects: 16% (373/2331)
remote: Compressing objects: 17% (397/2331)
remote: Compressing objects: 18% (420/2331)
remote: Compressing objects: 19% (443/2331)
remote: Compressing objects: 20% (467/2331)
remote: Compressing objects: 21% (490/2331)
remote: Compressing objects: 22% (513/2331)
remote: Compressing objects: 23% (537/2331)
remote: Compressing objects: 23% (552/2331)
remote: Compressing objects: 24% (560/2331)
remote: Compressing objects: 25% (583/2331)
remote: Compressing objects: 26% (607/2331)
remote: Compressing objects: 27% (630/2331)
remote: Compressing objects: 28% (653/2331)
remote: Compressing objects: 29% (676/2331)
remote: Compressing objects: 30% (700/2331)
remote: Compressing objects: 31% (723/2331)
remote: Compressing objects: 31% (733/2331)
remote: Compressing objects: 32% (746/2331)
remote: Compressing objects: 33% (770/2331)
remote: Compressing objects: 34% (793/2331)
remote: Compressing objects: 35% (816/2331)
remote: Compressing objects: 36% (840/2331)
remote: Compressing objects: 37% (863/2331)
remote: Compressing objects: 38% (886/2331)
remote: Compressing objects: 39% (910/2331)
remote: Compressing objects: 40% (933/2331)
remote: Compressing objects: 41% (956/2331)
remote: Compressing objects: 42% (980/2331)
remote: Compressing objects: 43% (1003/2331)
remote: Compressing objects: 44% (1026/2331)
remote: Compressing objects: 45% (1049/2331)
remote: Compressing objects: 46% (1073/2331)
remote: Compressing objects: 47% (1096/2331)
remote: Compressing objects: 48% (1119/2331)
remote: Compressing objects: 49% (1143/2331)
remote: Compressing objects: 50% (1166/2331)
remote: Compressing objects: 51% (1189/2331)
remote: Compressing objects: 52% (1213/2331)
remote: Compressing objects: 53% (1236/2331)
remote: Compressing objects: 54% (1259/2331)
remote: Compressing objects: 55% (1283/2331)
remote: Compressing objects: 56% (1306/2331)
remote: Compressing objects: 57% (1329/2331)
remote: Compressing objects: 58% (1352/2331)
remote: Compressing objects: 59% (1376/2331)
remote: Compressing objects: 60% (1399/2331)
remote: Compressing objects: 61% (1422/2331)
remote: Compressing objects: 62% (1446/2331)
remote: Compressing objects: 63% (1469/2331)
remote: Compressing objects: 64% (1492/2331)
remote: Compressing objects: 65% (1516/2331)
remote: Compressing objects: 66% (1539/2331)
remote: Compressing objects: 67% (1562/2331)
remote: Compressing objects: 68% (1586/2331)
remote: Compressing objects: 69% (1609/2331)
remote: Compressing objects: 70% (1632/2331)
remote: Compressing objects: 71% (1656/2331)
remote: Compressing objects: 72% (1679/2331)
remote: Compressing objects: 73% (1702/2331)
remote: Compressing objects: 74% (1725/2331)
remote: Compressing objects: 75% (1749/2331)
remote: Compressing objects: 76% (1772/2331)
remote: Compressing objects: 77% (1795/2331)
remote: Compressing objects: 78% (1819/2331)
remote: Compressing objects: 79% (1842/2331)
remote: Compressing objects: 80% (1865/2331)
remote: Compressing objects: 81% (1889/2331)
remote: Compressing objects: 82% (1912/2331)
remote: Compressing objects: 83% (1935/2331)
remote: Compressing objects: 84% (1959/2331)
remote: Compressing objects: 85% (1982/2331)
remote: Compressing objects: 86% (2005/2331)
remote: Compressing objects: 87% (2028/2331)
remote: Compressing objects: 88% (2052/2331)
remote: Compressing objects: 89% (2075/2331)
remote: Compressing objects: 90% (2098/2331)
remote: Compressing objects: 91% (2122/2331)
remote: Compressing objects: 92% (2145/2331)
remote: Compressing objects: 93% (2168/2331)
remote: Compressing objects: 94% (2192/2331)
remote: Compressing objects: 95% (2215/2331)
remote: Compressing objects: 96% (2238/2331)
remote: Compressing objects: 97% (2262/2331)
remote: Compressing objects: 98% (2285/2331)
remote: Compressing objects: 99% (2308/2331)
remote: Compressing objects: 100% (2331/2331)
remote: Compressing objects: 100% (2331/2331), done.
6.74 s
Receiving objects: 0% (1/64191)
Receiving objects: 1% (642/64191)
Receiving objects: 2% (1284/64191)
Receiving objects: 3% (1926/64191)
Receiving objects: 4% (2568/64191)
Receiving objects: 5% (3210/64191)
Receiving objects: 6% (3852/64191)
Receiving objects: 7% (4494/64191)
Receiving objects: 8% (5136/64191)
Receiving objects: 9% (5778/64191)
Receiving objects: 10% (6420/64191)
Receiving objects: 11% (7062/64191)
Receiving objects: 12% (7703/64191)
Receiving objects: 13% (8345/64191)
Receiving objects: 14% (8987/64191)
Receiving objects: 15% (9629/64191)
Receiving objects: 16% (10271/64191), 15.25 MiB | 30.49 MiB/s
Receiving objects: 17% (10913/64191), 15.25 MiB | 30.49 MiB/s
Receiving objects: 18% (11555/64191), 15.25 MiB | 30.49 MiB/s
Receiving objects: 19% (12197/64191), 15.25 MiB | 30.49 MiB/s
Receiving objects: 20% (12839/64191), 15.25 MiB | 30.49 MiB/s
Receiving objects: 21% (13481/64191), 15.25 MiB | 30.49 MiB/s
Receiving objects: 22% (14123/64191), 15.25 MiB | 30.49 MiB/s
Receiving objects: 23% (14764/64191), 15.25 MiB | 30.49 MiB/s
Receiving objects: 24% (15406/64191), 15.25 MiB | 30.49 MiB/s
Receiving objects: 25% (16048/64191), 15.25 MiB | 30.49 MiB/s
Receiving objects: 26% (16690/64191), 15.25 MiB | 30.49 MiB/s
Receiving objects: 27% (17332/64191), 15.25 MiB | 30.49 MiB/s
Receiving objects: 28% (17974/64191), 15.25 MiB | 30.49 MiB/s
Receiving objects: 29% (18616/64191), 15.25 MiB | 30.49 MiB/s
Receiving objects: 30% (19258/64191), 15.25 MiB | 30.49 MiB/s
Receiving objects: 31% (19900/64191), 15.25 MiB | 30.49 MiB/s
Receiving objects: 32% (20542/64191), 15.25 MiB | 30.49 MiB/s
Receiving objects: 33% (21184/64191), 15.25 MiB | 30.49 MiB/s
Receiving objects: 34% (21825/64191), 15.25 MiB | 30.49 MiB/s
Receiving objects: 35% (22467/64191), 15.25 MiB | 30.49 MiB/s
Receiving objects: 36% (23109/64191), 15.25 MiB | 30.49 MiB/s
Receiving objects: 37% (23751/64191), 15.25 MiB | 30.49 MiB/s
Receiving objects: 38% (24393/64191), 15.25 MiB | 30.49 MiB/s
Receiving objects: 39% (25035/64191), 15.25 MiB | 30.49 MiB/s
Receiving objects: 40% (25677/64191), 15.25 MiB | 30.49 MiB/s
Receiving objects: 41% (26319/64191), 15.25 MiB | 30.49 MiB/s
Receiving objects: 42% (26961/64191), 15.25 MiB | 30.49 MiB/s
Receiving objects: 43% (27603/64191), 15.25 MiB | 30.49 MiB/s
Receiving objects: 44% (28245/64191), 15.25 MiB | 30.49 MiB/s
Receiving objects: 45% (28886/64191), 15.25 MiB | 30.49 MiB/s
Receiving objects: 46% (29528/64191), 15.25 MiB | 30.49 MiB/s
Receiving objects: 47% (30170/64191), 15.25 MiB | 30.49 MiB/s
Receiving objects: 48% (30812/64191), 15.25 MiB | 30.49 MiB/s
Receiving objects: 49% (31454/64191), 15.25 MiB | 30.49 MiB/s
Receiving objects: 50% (32096/64191), 15.25 MiB | 30.49 MiB/s
Receiving objects: 51% (32738/64191), 15.25 MiB | 30.49 MiB/s
Receiving objects: 52% (33380/64191), 15.25 MiB | 30.49 MiB/s
Receiving objects: 52% (33603/64191), 15.25 MiB | 30.49 MiB/s
Receiving objects: 53% (34022/64191), 33.83 MiB | 33.82 MiB/s
Receiving objects: 54% (34664/64191), 33.83 MiB | 33.82 MiB/s
Receiving objects: 55% (35306/64191), 33.83 MiB | 33.82 MiB/s
Receiving objects: 56% (35947/64191), 33.83 MiB | 33.82 MiB/s
Receiving objects: 57% (36589/64191), 33.83 MiB | 33.82 MiB/s
Receiving objects: 58% (37231/64191), 33.83 MiB | 33.82 MiB/s
Receiving objects: 59% (37873/64191), 33.83 MiB | 33.82 MiB/s
Receiving objects: 60% (38515/64191), 33.83 MiB | 33.82 MiB/s
Receiving objects: 61% (39157/64191), 33.83 MiB | 33.82 MiB/s
Receiving objects: 62% (39799/64191), 33.83 MiB | 33.82 MiB/s
Receiving objects: 63% (40441/64191), 33.83 MiB | 33.82 MiB/s
Receiving objects: 64% (41083/64191), 33.83 MiB | 33.82 MiB/s
Receiving objects: 65% (41725/64191), 33.83 MiB | 33.82 MiB/s
Receiving objects: 66% (42367/64191), 33.83 MiB | 33.82 MiB/s
Receiving objects: 67% (43008/64191), 33.83 MiB | 33.82 MiB/s
Receiving objects: 68% (43650/64191), 51.37 MiB | 33.87 MiB/s
Receiving objects: 69% (44292/64191), 51.37 MiB | 33.87 MiB/s
Receiving objects: 70% (44934/64191), 51.37 MiB | 33.87 MiB/s
Receiving objects: 71% (45576/64191), 51.37 MiB | 33.87 MiB/s
Receiving objects: 72% (46218/64191), 51.37 MiB | 33.87 MiB/s
Receiving objects: 73% (46860/64191), 51.37 MiB | 33.87 MiB/s
Receiving objects: 74% (47502/64191), 51.37 MiB | 33.87 MiB/s
Receiving objects: 75% (48144/64191), 51.37 MiB | 33.87 MiB/s
Receiving objects: 76% (48786/64191), 51.37 MiB | 33.87 MiB/s
Receiving objects: 76% (49164/64191), 51.37 MiB | 33.87 MiB/s
Receiving objects: 77% (49428/64191), 51.37 MiB | 33.87 MiB/s
Receiving objects: 78% (50069/64191), 70.27 MiB | 34.84 MiB/s
Receiving objects: 79% (50711/64191), 70.27 MiB | 34.84 MiB/s
Receiving objects: 80% (51353/64191), 70.27 MiB | 34.84 MiB/s
Receiving objects: 81% (51995/64191), 70.27 MiB | 34.84 MiB/s
Receiving objects: 82% (52637/64191), 70.27 MiB | 34.84 MiB/s
Receiving objects: 83% (53279/64191), 70.27 MiB | 34.84 MiB/s
Receiving objects: 84% (53921/64191), 70.27 MiB | 34.84 MiB/s
Receiving objects: 85% (54563/64191), 70.27 MiB | 34.84 MiB/s
Receiving objects: 86% (55205/64191), 86.89 MiB | 34.53 MiB/s
Receiving objects: 87% (55847/64191), 86.89 MiB | 34.53 MiB/s
Receiving objects: 88% (56489/64191), 86.89 MiB | 34.53 MiB/s
Receiving objects: 89% (57130/64191), 86.89 MiB | 34.53 MiB/s
Receiving objects: 90% (57772/64191), 86.89 MiB | 34.53 MiB/s
Receiving objects: 91% (58414/64191), 86.89 MiB | 34.53 MiB/s
Receiving objects: 92% (59056/64191), 86.89 MiB | 34.53 MiB/s
Receiving objects: 93% (59698/64191), 86.89 MiB | 34.53 MiB/s
Receiving objects: 94% (60340/64191), 86.89 MiB | 34.53 MiB/s
Receiving objects: 95% (60982/64191), 86.89 MiB | 34.53 MiB/s
Receiving objects: 96% (61624/64191), 86.89 MiB | 34.53 MiB/s
Receiving objects: 97% (62266/64191), 86.89 MiB | 34.53 MiB/s
Receiving objects: 98% (62908/64191), 86.89 MiB | 34.53 MiB/s
Receiving objects: 99% (63550/64191), 86.89 MiB | 34.53 MiB/s
remote: Total 64191 (delta 7402), reused 7778 (delta 6681), pack-reused 54634 (from 3)
6.75 s
Receiving objects: 100% (64191/64191), 86.89 MiB | 34.53 MiB/s
Receiving objects: 100% (64191/64191), 97.84 MiB | 34.39 MiB/s, done.
7.50 s
Resolving deltas: 0% (0/44321)
Resolving deltas: 1% (444/44321)
Resolving deltas: 2% (887/44321)
Resolving deltas: 3% (1330/44321)
Resolving deltas: 4% (1774/44321)
Resolving deltas: 5% (2217/44321)
Resolving deltas: 6% (2661/44321)
Resolving deltas: 7% (3103/44321)
Resolving deltas: 8% (3546/44321)
Resolving deltas: 9% (3993/44321)
Resolving deltas: 10% (4433/44321)
Resolving deltas: 11% (4876/44321)
Resolving deltas: 12% (5319/44321)
Resolving deltas: 13% (5762/44321)
Resolving deltas: 14% (6205/44321)
Resolving deltas: 15% (6651/44321)
Resolving deltas: 16% (7093/44321)
Resolving deltas: 17% (7535/44321)
Resolving deltas: 18% (7979/44321)
Resolving deltas: 19% (8421/44321)
Resolving deltas: 20% (8865/44321)
Resolving deltas: 21% (9309/44321)
Resolving deltas: 22% (9751/44321)
Resolving deltas: 23% (10194/44321)
Resolving deltas: 24% (10638/44321)
Resolving deltas: 25% (11081/44321)
Resolving deltas: 26% (11524/44321)
Resolving deltas: 27% (11967/44321)
Resolving deltas: 28% (12410/44321)
Resolving deltas: 29% (12854/44321)
Resolving deltas: 30% (13298/44321)
Resolving deltas: 31% (13741/44321)
Resolving deltas: 32% (14183/44321)
Resolving deltas: 33% (14627/44321)
Resolving deltas: 34% (15070/44321)
Resolving deltas: 35% (15513/44321)
Resolving deltas: 36% (15956/44321)
Resolving deltas: 37% (16400/44321)
Resolving deltas: 38% (16842/44321)
Resolving deltas: 39% (17286/44321)
Resolving deltas: 40% (17729/44321)
Resolving deltas: 41% (18172/44321)
Resolving deltas: 42% (18616/44321)
Resolving deltas: 43% (19059/44321)
Resolving deltas: 44% (19502/44321)
Resolving deltas: 45% (19945/44321)
Resolving deltas: 46% (20389/44321)
Resolving deltas: 47% (20831/44321)
Resolving deltas: 48% (21275/44321)
Resolving deltas: 49% (21718/44321)
Resolving deltas: 50% (22161/44321)
Resolving deltas: 51% (22604/44321)
Resolving deltas: 52% (23048/44321)
Resolving deltas: 53% (23491/44321)
Resolving deltas: 54% (23934/44321)
Resolving deltas: 55% (24379/44321)
Resolving deltas: 56% (24820/44321)
Resolving deltas: 57% (25264/44321)
Resolving deltas: 58% (25707/44321)
Resolving deltas: 59% (26150/44321)
Resolving deltas: 60% (26593/44321)
Resolving deltas: 61% (27036/44321)
Resolving deltas: 62% (27480/44321)
Resolving deltas: 63% (27924/44321)
Resolving deltas: 64% (28366/44321)
Resolving deltas: 65% (28809/44321)
Resolving deltas: 66% (29252/44321)
Resolving deltas: 67% (29696/44321)
Resolving deltas: 68% (30139/44321)
Resolving deltas: 69% (30582/44321)
Resolving deltas: 70% (31026/44321)
Resolving deltas: 71% (31468/44321)
Resolving deltas: 72% (31912/44321)
Resolving deltas: 73% (32355/44321)
Resolving deltas: 74% (32798/44321)
Resolving deltas: 75% (33244/44321)
Resolving deltas: 76% (33684/44321)
Resolving deltas: 77% (34128/44321)
Resolving deltas: 78% (34571/44321)
Resolving deltas: 79% (35014/44321)
Resolving deltas: 80% (35457/44321)
Resolving deltas: 81% (35901/44321)
Resolving deltas: 82% (36344/44321)
Resolving deltas: 83% (36787/44321)
Resolving deltas: 84% (37230/44321)
Resolving deltas: 85% (37673/44321)
Resolving deltas: 86% (38117/44321)
Resolving deltas: 87% (38560/44321)
Resolving deltas: 88% (39003/44321)
Resolving deltas: 89% (39447/44321)
Resolving deltas: 90% (39889/44321)
Resolving deltas: 91% (40333/44321)
Resolving deltas: 92% (40776/44321)
Resolving deltas: 93% (41219/44321)
Resolving deltas: 94% (41662/44321)
Resolving deltas: 95% (42105/44321)
Resolving deltas: 96% (42549/44321)
Resolving deltas: 97% (42993/44321)
Resolving deltas: 98% (43435/44321)
Resolving deltas: 99% (43878/44321)
Resolving deltas: 100% (44321/44321)
Resolving deltas: 100% (44321/44321), done.
7.81 s
Fetching commit 3d241888b215b0c37d1e347e0c8ddcee728dacfb for push-vrpyqyylypmw ...
7.81 s
$ /nix/store/bcnisk3ydfgv26v2gw3zlky24g00yww2-git-2.54.0/bin/git fetch origin 3d241888b215b0c37d1e347e0c8ddcee728dacfb
8.22 s
From https://github.com/alphal00p/gammaloop
8.22 s
* branch 3d241888b215b0c37d1e347e0c8ddcee728dacfb -> FETCH_HEAD
8.23 s
$ /nix/store/9ypz3flqsrl5xl495mm8h645gadjsxi1-coreutils-9.11/bin/timeout --kill-after=15s 7200s /nix/store/bcnisk3ydfgv26v2gw3zlky24g00yww2-git-2.54.0/bin/git -c advice.detachedHead=false checkout 3d241888b215b0c37d1e347e0c8ddcee728dacfb
8.45 s
HEAD is now at 3d241888 run documentation tests through the Nix CI secret runner
8.45 s
$ /nix/store/9ypz3flqsrl5xl495mm8h645gadjsxi1-coreutils-9.11/bin/timeout --kill-after=15s 7200s /nix/store/23zk8sgzamrbmj1fday15szf7f2279s8-nix-2.34.7/bin/nix --extra-experimental-features nix-command --extra-experimental-features flakes --log-format internal-json run .#packages.x86_64-linux.nix-ci-check-gammaloop-nextest-core --print-build-logs
12.69 s
12.94 s
Downloading cached gammaloop-nextest-binaries-core-gammaloop-api from https://cache.nix-ci.com
12.95 s
Downloading cached gammaloop-nextest-binaries-core-gammaloop-tracing-filter from https://cache.nix-ci.com
12.95 s
Downloading cached gammaloop-nextest-binaries-core-gammaloop-tracing-filter-macros from https://cache.nix-ci.com
12.95 s
Downloading cached gammaloop-nextest-binaries-core-gammalooprs from https://cache.nix-ci.com
13.00 s
Downloaded cached gammaloop-nextest-binaries-core-gammaloop-tracing-filter-macros (1.7 MiB) in 45ms
13.00 s
Progress: 0 of 1 built, 1 of 6 downloaded from cache (3 downloading)
13.15 s
Downloaded cached gammaloop-nextest-binaries-core-gammaloop-tracing-filter (8.1 MiB) in 197ms
13.15 s
Progress: 0 of 1 built, 2 of 6 downloaded from cache (2 downloading)
14.18 s
Downloaded cached gammaloop-nextest-binaries-core-gammaloop-api (68.4 MiB) in 1.2s
14.18 s
Progress: 0 of 1 built, 3 of 6 downloaded from cache (1 downloading)
14.47 s
Downloaded cached gammaloop-nextest-binaries-core-gammalooprs (79.4 MiB) in 1.5s
14.47 s
Progress: 0 of 1 built, 4 of 6 downloaded from cache
14.47 s
Downloading cached gammaloop-nextest-binaries-core from https://cache.nix-ci.com
14.49 s
Downloaded cached gammaloop-nextest-binaries-core (1640 B) in 16ms
14.49 s
Progress: 0 of 1 built, 5 of 6 downloaded from cache
14.49 s
Downloading cached nix-ci-check-gammaloop-nextest-core from https://cache.nix-ci.com
14.51 s
Downloaded cached nix-ci-check-gammaloop-nextest-core (1016 B) in 16ms
14.51 s
Progress: 0 of 1 built, 6 of 6 downloaded from cache
19.72 s
evaluating derivation 'g
copying '/nix/store/4jdn
evaluating derivation 'g
copying '/nix/store/4jdn
evaluating derivation 'g
copying '/nix/store/4jdn
evaluating derivation 'g
copying '/nix/store/4jdn
evaluating derivation 'g
copying '/nix/store/4jdn
evaluating derivation 'g
copying '/nix/store/4jdn
evaluating derivation 'g
copying '/nix/store/4jdn
evaluating derivation 'g
copying '/nix/store/4jdn
evaluating derivation 'g
copying '/nix/store/4jdn
evaluating derivation 'g
querying gammaloop-nexte
[0 /1 built, 0.0 KiB DL]
[1 /0 /1 built, 0.0 KiB DLgammaloop-nextest-core> Extracting 3 binaries (including 1 non-test binary), 1 build script output directory, and 2 linked paths to /build/source
20.15 s
gammaloop-nextest-core> Extracted 18 files to /build/source in 0.43s
20.16 s
gammaloop-nextest-core> ------------
20.16 s
gammaloop-nextest-core> Nextest run ID 48e6bad4-df81-4c2b-bf26-aad3db2e082d with nextest profile: ci_gammaloop
20.16 s
gammaloop-nextest-core> Starting 339 tests across 2 binaries
20.48 s
gammaloop-nextest-core> FAIL [ 0.019s] (243/339) gammaloop-api repl::tests :: completion_shows_type_hint_for_non_boolean_settings_leaf
20.48 s
gammaloop-nextest-core> stdout ---
20.48 s
gammaloop-nextest-core>
20.48 s
gammaloop-nextest-core> running 1 test
20.48 s
gammaloop-nextest-core> test repl::tests::completion_shows_type_hint_for_non_boolean_settings_leaf ... FAILED
20.48 s
gammaloop-nextest-core>
20.48 s
gammaloop-nextest-core> failures:
20.48 s
gammaloop-nextest-core>
20.48 s
gammaloop-nextest-core> failures:
20.48 s
gammaloop-nextest-core> repl::tests::completion_shows_type_hint_for_non_boolean_settings_leaf
20.48 s
gammaloop-nextest-core>
20.48 s
gammaloop-nextest-core> test result: FAILED. 0 passed; 1 failed; 0 ignored; 0 measured; 338 filtered out; finished in 0.01s
20.48 s
gammaloop-nextest-core>
20.48 s
gammaloop-nextest-core> stderr ---
20.48 s
gammaloop-nextest-core>
20.48 s
gammaloop-nextest-core> thread 'repl::tests::completion_shows_type_hint_for_non_boolean_settings_leaf' (778) panicked at crates/gammaloop-api/src/repl.rs:5778:9:
20.48 s
gammaloop-nextest-core> [Suggestion { value: "", description: Some("Number of samples in the first Monte Carlo iteration."), style: None, extra: None, span: Span { start: 42, end: 42 }, append_whitespace: false }]
20.48 s
gammaloop-nextest-core> stack backtrace:
20.48 s
gammaloop-nextest-core> 0: __rustc::rust_begin_unwind
20.48 s
gammaloop-nextest-core> 1: core::panicking::panic_fmt
20.48 s
gammaloop-nextest-core> 2: gammaloop_api::repl::tests::completion_shows_type_hint_for_non_boolean_settings_leaf
20.48 s
gammaloop-nextest-core> 3: <gammaloop_api::repl::tests::completion_shows_type_hint_for_non_boolean_settings_leaf::{closure#0} as core::ops::function::FnOnce<()>>::call_once
20.48 s
gammaloop-nextest-core> note: Some details are omitted, run with `RUST_BACKTRACE=full` for a verbose backtrace.
20.48 s
gammaloop-nextest-core>
20.53 s
gammaloop-nextest-core> FAIL [ 0.033s] (278/339) gammaloop-api templates::tests :: extract_templates_uses_canonical_package_layout
20.53 s
gammaloop-nextest-core> stdout ---
20.53 s
gammaloop-nextest-core>
20.53 s
gammaloop-nextest-core> running 1 test
20.53 s
gammaloop-nextest-core> test templates::tests::extract_templates_uses_canonical_package_layout ... FAILED
20.53 s
gammaloop-nextest-core>
20.53 s
gammaloop-nextest-core> failures:
20.53 s
gammaloop-nextest-core>
20.53 s
gammaloop-nextest-core> failures:
20.53 s
gammaloop-nextest-core> templates::tests::extract_templates_uses_canonical_package_layout
20.53 s
gammaloop-nextest-core>
20.53 s
gammaloop-nextest-core> test result: FAILED. 0 passed; 1 failed; 0 ignored; 0 measured; 338 filtered out; finished in 0.02s
20.53 s
gammaloop-nextest-core>
20.53 s
gammaloop-nextest-core> stderr ---
20.53 s
gammaloop-nextest-core>
20.53 s
gammaloop-nextest-core> thread 'templates::tests::extract_templates_uses_canonical_package_layout' (876) panicked at crates/gammaloop-api/src/templates.rs:99:9:
20.53 s
gammaloop-nextest-core> assertion failed: figure.contains("amplitude-mode")
20.53 s
gammaloop-nextest-core> stack backtrace:
20.53 s
gammaloop-nextest-core> 0: __rustc::rust_begin_unwind
20.53 s
gammaloop-nextest-core> 1: core::panicking::panic_fmt
20.53 s
gammaloop-nextest-core> 2: core::panicking::panic
20.53 s
gammaloop-nextest-core> 3: gammaloop_api::templates::tests::extract_templates_uses_canonical_package_layout
20.53 s
gammaloop-nextest-core> 4: <gammaloop_api::templates::tests::extract_templates_uses_canonical_package_layout::{closure#0} as core::ops::function::FnOnce<()>>::call_once
20.53 s
gammaloop-nextest-core> note: Some details are omitted, run with `RUST_BACKTRACE=full` for a verbose backtrace.
20.53 s
gammaloop-nextest-core>
20.65 s
gammaloop-nextest-core> ------------
20.65 s
gammaloop-nextest-core> Summary [ 0.491s] 339 tests run: 337 passed , 2 failed , 0 skipped
20.65 s
gammaloop-nextest-core> FAIL [ 0.019s] (243/339) gammaloop-api repl::tests :: completion_shows_type_hint_for_non_boolean_settings_leaf
20.65 s
gammaloop-nextest-core> stdout ---
20.65 s
gammaloop-nextest-core>
20.65 s
gammaloop-nextest-core> running 1 test
20.65 s
gammaloop-nextest-core> test repl::tests::completion_shows_type_hint_for_non_boolean_settings_leaf ... FAILED
20.65 s
gammaloop-nextest-core>
20.65 s
gammaloop-nextest-core> failures:
20.65 s
gammaloop-nextest-core>
20.65 s
gammaloop-nextest-core> failures:
20.65 s
gammaloop-nextest-core> repl::tests::completion_shows_type_hint_for_non_boolean_settings_leaf
20.65 s
gammaloop-nextest-core>
20.65 s
gammaloop-nextest-core> test result: FAILED. 0 passed; 1 failed; 0 ignored; 0 measured; 338 filtered out; finished in 0.01s
20.65 s
gammaloop-nextest-core>
20.65 s
gammaloop-nextest-core> stderr ---
20.65 s
gammaloop-nextest-core>
20.65 s
gammaloop-nextest-core> thread 'repl::tests::completion_shows_type_hint_for_non_boolean_settings_leaf' (778) panicked at crates/gammaloop-api/src/repl.rs:5778:9:
20.65 s
gammaloop-nextest-core> [Suggestion { value: "", description: Some("Number of samples in the first Monte Carlo iteration."), style: None, extra: None, span: Span { start: 42, end: 42 }, append_whitespace: false }]
20.65 s
gammaloop-nextest-core> stack backtrace:
20.65 s
gammaloop-nextest-core> 0: __rustc::rust_begin_unwind
20.65 s
gammaloop-nextest-core> 1: core::panicking::panic_fmt
20.65 s
gammaloop-nextest-core> 2: gammaloop_api::repl::tests::completion_shows_type_hint_for_non_boolean_settings_leaf
20.65 s
gammaloop-nextest-core> 3: <gammaloop_api::repl::tests::completion_shows_type_hint_for_non_boolean_settings_leaf::{closure#0} as core::ops::function::FnOnce<()>>::call_once
20.65 s
gammaloop-nextest-core> note: Some details are omitted, run with `RUST_BACKTRACE=full` for a verbose backtrace.
20.65 s
gammaloop-nextest-core>
20.65 s
gammaloop-nextest-core> FAIL [ 0.033s] (278/339) gammaloop-api templates::tests :: extract_templates_uses_canonical_package_layout
20.65 s
gammaloop-nextest-core> stdout ---
20.65 s
gammaloop-nextest-core>
20.65 s
gammaloop-nextest-core> running 1 test
20.65 s
gammaloop-nextest-core> test templates::tests::extract_templates_uses_canonical_package_layout ... FAILED
20.65 s
gammaloop-nextest-core>
20.65 s
gammaloop-nextest-core> failures:
20.65 s
gammaloop-nextest-core>
20.65 s
gammaloop-nextest-core> failures:
20.65 s
gammaloop-nextest-core> templates::tests::extract_templates_uses_canonical_package_layout
20.65 s
gammaloop-nextest-core>
20.65 s
gammaloop-nextest-core> test result: FAILED. 0 passed; 1 failed; 0 ignored; 0 measured; 338 filtered out; finished in 0.02s
20.65 s
gammaloop-nextest-core>
20.65 s
gammaloop-nextest-core> stderr ---
20.65 s
gammaloop-nextest-core>
20.65 s
gammaloop-nextest-core> thread 'templates::tests::extract_templates_uses_canonical_package_layout' (876) panicked at crates/gammaloop-api/src/templates.rs:99:9:
20.65 s
gammaloop-nextest-core> assertion failed: figure.contains("amplitude-mode")
20.65 s
gammaloop-nextest-core> stack backtrace:
20.65 s
gammaloop-nextest-core> 0: __rustc::rust_begin_unwind
20.65 s
gammaloop-nextest-core> 1: core::panicking::panic_fmt
20.65 s
gammaloop-nextest-core> 2: core::panicking::panic
20.65 s
gammaloop-nextest-core> 3: gammaloop_api::templates::tests::extract_templates_uses_canonical_package_layout
20.65 s
gammaloop-nextest-core> 4: <gammaloop_api::templates::tests::extract_templates_uses_canonical_package_layout::{closure#0} as core::ops::function::FnOnce<()>>::call_once
20.65 s
gammaloop-nextest-core> note: Some details are omitted, run with `RUST_BACKTRACE=full` for a verbose backtrace.
20.65 s
gammaloop-nextest-core>
20.66 s
gammaloop-nextest-core> error : test run failed
20.69 s
gammaloop-nextest-core>
20.69 s
gammaloop-nextest-core> ========== nextest test summary ==========
20.69 s
gammaloop-nextest-core> report: target/nextest/ci_gammaloop/junit.xml
20.69 s
gammaloop-nextest-core> tests: 339, failures: 2, errors: 0
20.69 s
gammaloop-nextest-core>
20.69 s
gammaloop-nextest-core> 1. gammaloop-api::repl::tests::completion_shows_type_hint_for_non_boolean_settings_leaf
20.69 s
gammaloop-nextest-core> failure: test failure with exit code 101
20.69 s
gammaloop-nextest-core> thread 'repl::tests::completion_shows_type_hint_for_non_boolean_settings_leaf' (778) panicked at crates/gammaloop-api/src/repl.rs:5778:9:
20.69 s
gammaloop-nextest-core> [Suggestion { value: "", description: Some("Number of samples in the first Monte Carlo iteration."), style: None, extra: None, span: Span { start: 42, end: 42 }, append_whitespace: false }]
20.69 s
gammaloop-nextest-core> stack backtrace:
20.69 s
gammaloop-nextest-core> 0: __rustc::rust_begin_unwind
20.69 s
gammaloop-nextest-core> 1: core::panicking::panic_fmt
20.69 s
gammaloop-nextest-core> 2: gammaloop_api::repl::tests::completion_shows_type_hint_for_non_boolean_settings_leaf
20.69 s
gammaloop-nextest-core> 3: <gammaloop_api::repl::tests::completion_shows_type_hint_for_non_boolean_settings_leaf::{closure#0} as core::ops::function::FnOnce<()>>::call_once
20.69 s
gammaloop-nextest-core> note: Some details are omitted, run with `RUST_BACKTRACE=full` for a verbose backtrace.
20.69 s
gammaloop-nextest-core> system-out
20.69 s
gammaloop-nextest-core> running 1 test
20.69 s
gammaloop-nextest-core> test repl::tests::completion_shows_type_hint_for_non_boolean_settings_leaf ... FAILED
20.69 s
gammaloop-nextest-core>
20.69 s
gammaloop-nextest-core> failures:
20.69 s
gammaloop-nextest-core>
20.69 s
gammaloop-nextest-core> failures:
20.69 s
gammaloop-nextest-core> repl::tests::completion_shows_type_hint_for_non_boolean_settings_leaf
20.69 s
gammaloop-nextest-core>
20.69 s
gammaloop-nextest-core> test result: FAILED. 0 passed; 1 failed; 0 ignored; 0 measured; 338 filtered out; finished in 0.01s
20.69 s
gammaloop-nextest-core> system-err
20.69 s
gammaloop-nextest-core> thread 'repl::tests::completion_shows_type_hint_for_non_boolean_settings_leaf' (778) panicked at crates/gammaloop-api/src/repl.rs:5778:9:
20.69 s
gammaloop-nextest-core> [Suggestion { value: "", description: Some("Number of samples in the first Monte Carlo iteration."), style: None, extra: None, span: Span { start: 42, end: 42 }, append_whitespace: false }]
20.69 s
gammaloop-nextest-core> stack backtrace:
20.69 s
gammaloop-nextest-core> 0: __rustc::rust_begin_unwind
20.69 s
gammaloop-nextest-core> 1: core::panicking::panic_fmt
20.69 s
gammaloop-nextest-core> 2: gammaloop_api::repl::tests::completion_shows_type_hint_for_non_boolean_settings_leaf
20.69 s
gammaloop-nextest-core> 3: <gammaloop_api::repl::tests::completion_shows_type_hint_for_non_boolean_settings_leaf::{closure#0} as core::ops::function::FnOnce<()>>::call_once
20.69 s
gammaloop-nextest-core> note: Some details are omitted, run with `RUST_BACKTRACE=full` for a verbose backtrace.
20.69 s
gammaloop-nextest-core>
20.69 s
gammaloop-nextest-core> 2. gammaloop-api::templates::tests::extract_templates_uses_canonical_package_layout
20.69 s
gammaloop-nextest-core> failure: test failure with exit code 101
20.69 s
gammaloop-nextest-core> thread 'templates::tests::extract_templates_uses_canonical_package_layout' (876) panicked at crates/gammaloop-api/src/templates.rs:99:9:
20.69 s
gammaloop-nextest-core> assertion failed: figure.contains("amplitude-mode")
20.69 s
gammaloop-nextest-core> stack backtrace:
20.69 s
gammaloop-nextest-core> 0: __rustc::rust_begin_unwind
20.69 s
gammaloop-nextest-core> 1: core::panicking::panic_fmt
20.69 s
gammaloop-nextest-core> 2: core::panicking::panic
20.69 s
gammaloop-nextest-core> 3: gammaloop_api::templates::tests::extract_templates_uses_canonical_package_layout
20.69 s
gammaloop-nextest-core> 4: <gammaloop_api::templates::tests::extract_templates_uses_canonical_package_layout::{closure#0} as core::ops::function::FnOnce<()>>::call_once
20.69 s
gammaloop-nextest-core> note: Some details are omitted, run with `RUST_BACKTRACE=full` for a verbose backtrace.
20.69 s
gammaloop-nextest-core> system-out
20.69 s
gammaloop-nextest-core> running 1 test
20.69 s
gammaloop-nextest-core> test templates::tests::extract_templates_uses_canonical_package_layout ... FAILED
20.69 s
gammaloop-nextest-core>
20.69 s
gammaloop-nextest-core> failures:
20.69 s
gammaloop-nextest-core>
20.69 s
gammaloop-nextest-core> failures:
20.69 s
gammaloop-nextest-core> templates::tests::extract_templates_uses_canonical_package_layout
20.69 s
gammaloop-nextest-core>
20.69 s
gammaloop-nextest-core> test result: FAILED. 0 passed; 1 failed; 0 ignored; 0 measured; 338 filtered out; finished in 0.02s
20.69 s
gammaloop-nextest-core> system-err
20.69 s
gammaloop-nextest-core> thread 'templates::tests::extract_templates_uses_canonical_package_layout' (876) panicked at crates/gammaloop-api/src/templates.rs:99:9:
20.69 s
gammaloop-nextest-core> assertion failed: figure.contains("amplitude-mode")
20.69 s
gammaloop-nextest-core> stack backtrace:
20.69 s
gammaloop-nextest-core> 0: __rustc::rust_begin_unwind
20.69 s
gammaloop-nextest-core> 1: core::panicking::panic_fmt
20.69 s
gammaloop-nextest-core> 2: core::panicking::panic
20.69 s
gammaloop-nextest-core> 3: gammaloop_api::templates::tests::extract_templates_uses_canonical_package_layout
20.69 s
gammaloop-nextest-core> 4: <gammaloop_api::templates::tests::extract_templates_uses_canonical_package_layout::{closure#0} as core::ops::function::FnOnce<()>>::call_once
20.69 s
gammaloop-nextest-core> note: Some details are omitted, run with `RUST_BACKTRACE=full` for a verbose backtrace.
20.69 s
gammaloop-nextest-core> =========================================
20.70 s
gammaloop-nextest-core> Extracting 1 binary and 1 linked path to /build/source
20.77 s
gammaloop-nextest-core> Extracted 7 files to /build/source in 0.07s
20.78 s
gammaloop-nextest-core> ------------
20.78 s
gammaloop-nextest-core> Nextest run ID e7d3d1f5-afef-44df-baaf-91cad84a6449 with nextest profile: ci_gammaloop
20.78 s
gammaloop-nextest-core> Starting 19 tests across 1 binary
20.80 s
gammaloop-nextest-core> ------------
20.80 s
gammaloop-nextest-core> Summary [ 0.013s] 19 tests run: 19 passed , 0 skipped
20.83 s
gammaloop-nextest-core>
20.83 s
gammaloop-nextest-core> ========== nextest test summary ==========
20.83 s
gammaloop-nextest-core> report: target/nextest/ci_gammaloop/junit.xml
20.83 s
gammaloop-nextest-core> tests: 19, failures: 0, errors: 0
20.83 s
gammaloop-nextest-core> No failing testcases found.
20.83 s
gammaloop-nextest-core> =========================================
20.84 s
gammaloop-nextest-core> Extracting 1 binary to /build/source
20.88 s
gammaloop-nextest-core> Extracted 4 files to /build/source in 0.04s
20.88 s
gammaloop-nextest-core> ------------
20.88 s
gammaloop-nextest-core> Nextest run ID cc420566-0c3a-48c6-8131-41348c035b79 with nextest profile: ci_gammaloop
20.88 s
gammaloop-nextest-core> Starting 0 tests across 1 binary
20.88 s
gammaloop-nextest-core> ------------
20.88 s
gammaloop-nextest-core> Summary [ 0.000s] 0 tests run: 0 passed , 0 skipped
20.91 s
gammaloop-nextest-core>
20.91 s
gammaloop-nextest-core> ========== nextest test summary ==========
20.91 s
gammaloop-nextest-core> report: target/nextest/ci_gammaloop/junit.xml
20.91 s
gammaloop-nextest-core> tests: 0, failures: 0, errors: 0
20.91 s
gammaloop-nextest-core> No failing testcases found.
20.91 s
gammaloop-nextest-core> =========================================
20.93 s
gammaloop-nextest-core> Extracting 4 binaries, 1 build script output directory, and 2 linked paths to /build/source
21.37 s
gammaloop-nextest-core> Extracted 18 files to /build/source in 0.44s
21.38 s
gammaloop-nextest-core> ------------
21.38 s
gammaloop-nextest-core> Nextest run ID b48d0cbe-0a1a-474c-b19f-6279862b89a1 with nextest profile: ci_gammaloop
21.38 s
gammaloop-nextest-core> Starting 456 tests across 4 binaries (61 tests skipped , including 60 tests via profile.ci_gammaloop.default-filter )
21.74 s
gammaloop-nextest-core> FAIL [ 0.260s] (161/456) gammalooprs graph::parse::tests :: parse_lmbsetting_crossection
21.74 s
gammaloop-nextest-core> stdout ---
21.74 s
gammaloop-nextest-core>
21.74 s
gammaloop-nextest-core> running 1 test
21.74 s
gammaloop-nextest-core> ━━━━━━━━━━━━━━━━━━━━━━━━━━━━━━━ Snapshot Summary ━━━━━━━━━━━━━━━━━━━━━━━━━━━━━━━
21.74 s
gammaloop-nextest-core> Snapshot: parse_lmbsetting_crossection
21.74 s
gammaloop-nextest-core> Source: crates/gammalooprs/src/graph/parse/tests.rs:252
21.74 s
gammaloop-nextest-core> ────────────────────────────────────────────────────────────────────────────────
21.74 s
gammaloop-nextest-core> Expression: g.debug_dot()
21.74 s
gammaloop-nextest-core> ────────────────────────────────────────────────────────────────────────────────
21.74 s
gammaloop-nextest-core> -old snapshot
21.74 s
gammaloop-nextest-core> +new results
21.75 s
gammaloop-nextest-core> ────────────┬───────────────────────────────────────────────────────────────────
21.75 s
gammaloop-nextest-core> 1 │-digraph G{
21.75 s
gammaloop-nextest-core> 1 │+digraph G {
21.75 s
gammaloop-nextest-core> 2 2 │ num = "1/2";
21.75 s
gammaloop-nextest-core> 3 3 │ overall_factor = "2*x";
21.75 s
gammaloop-nextest-core> 4 4 │ overall_factor_evaluated = "2*x";
21.75 s
gammaloop-nextest-core> 5 5 │ projector = "spenso::t";
21.75 s
gammaloop-nextest-core> ────────────┴───────────────────────────────────────────────────────────────────
21.75 s
gammaloop-nextest-core> To update snapshots run `cargo insta review`
21.75 s
gammaloop-nextest-core> Stopped on the first failure. Run `cargo insta test` to run all snapshots.
21.75 s
gammaloop-nextest-core> test graph::parse::tests::parse_lmbsetting_crossection ... FAILED
21.75 s
gammaloop-nextest-core>
21.75 s
gammaloop-nextest-core> failures:
21.75 s
gammaloop-nextest-core>
21.75 s
gammaloop-nextest-core> failures:
21.75 s
gammaloop-nextest-core> graph::parse::tests::parse_lmbsetting_crossection
21.75 s
gammaloop-nextest-core>
21.75 s
gammaloop-nextest-core> test result: FAILED. 0 passed; 1 failed; 0 ignored; 0 measured; 508 filtered out; finished in 0.25s
21.75 s
gammaloop-nextest-core>
21.75 s
gammaloop-nextest-core> stderr ---
21.75 s
gammaloop-nextest-core> [22:03:32.134] @gammalooprs::graph::attribute_warnings WARNING : Unknown node attribute 'color_num' on graph 'G', node 'A'; did you mean 'num'?
21.75 s
gammaloop-nextest-core> at crates/gammalooprs/src/graph/attribute_warnings.rs:198
21.75 s
gammaloop-nextest-core> The application panicked (crashed).
21.75 s
gammaloop-nextest-core> Message: snapshot assertion for 'parse_lmbsetting_crossection' failed in line 252
21.75 s
gammaloop-nextest-core> Location: /nix/store/xdy1vvhll2bijdplvl9fcc2b9plkxhaa-vendor-cargo-deps/c19b7c6f923b580ac259164a89f2577984ad5ab09ee9d583b888f934adbbe8d0/insta-1.47.2/src/runtime.rs :719
21.75 s
gammaloop-nextest-core>
21.75 s
gammaloop-nextest-core> ━━━━━━━━━━━━━━━━━━━━━━━━━━━━━━━━━━ BACKTRACE ━━━━━━━━━━━━━━━━━━━━━━━━━━━━━━━━━━━
21.75 s
gammaloop-nextest-core> 1: <color_eyre[b0c9e66060e883b2]::config::PanicHook>::panic_report <unknown>
21.75 s
gammaloop-nextest-core> at <unknown source file> :<unknown line>
21.75 s
gammaloop-nextest-core> 2: <color_eyre[b0c9e66060e883b2]::config::PanicHook>::into_panic_hook::{closure#0} <unknown>
21.75 s
gammaloop-nextest-core> at <unknown source file> :<unknown line>
21.75 s
gammaloop-nextest-core> 3: std[bcb96dfbba0ab899]::panicking::panic_with_hook <unknown>
21.75 s
gammaloop-nextest-core> at <unknown source file> :<unknown line>
21.75 s
gammaloop-nextest-core> 4: std[bcb96dfbba0ab899]::panicking::panic_handler::{closure#0} <unknown>
21.75 s
gammaloop-nextest-core> at <unknown source file> :<unknown line>
21.75 s
gammaloop-nextest-core> 5: std[bcb96dfbba0ab899]::sys::backtrace::__rust_end_short_backtrace::<std[bcb96dfbba0ab899]::panicking::panic_handler::{closure#0}, !> <unknown>
21.75 s
gammaloop-nextest-core> at <unknown source file> :<unknown line>
21.75 s
gammaloop-nextest-core> 6: __rustc[6c289b9f9c454d21]::rust_begin_unwind <unknown>
21.75 s
gammaloop-nextest-core> at <unknown source file> :<unknown line>
21.75 s
gammaloop-nextest-core> 7: core[940e698046960fd5]::panicking::panic_fmt <unknown>
21.75 s
gammaloop-nextest-core> at <unknown source file> :<unknown line>
21.75 s
gammaloop-nextest-core> 8: insta[307a548ac79ef4d9]::runtime::assert_snapshot <unknown>
21.75 s
gammaloop-nextest-core> at <unknown source file> :<unknown line>
21.75 s
gammaloop-nextest-core> 9: gammalooprs[5490727360442cce]::graph::parse::tests::parse_lmbsetting_crossection <unknown>
21.75 s
gammaloop-nextest-core> at <unknown source file> :<unknown line>
21.75 s
gammaloop-nextest-core> 10: <gammalooprs[5490727360442cce]::graph::parse::tests::parse_lmbsetting_crossection::{closure#0} as core[940e698046960fd5]::ops::function::FnOnce<()>>::call_once <unknown>
21.75 s
gammaloop-nextest-core> at <unknown source file> :<unknown line>
21.75 s
gammaloop-nextest-core> 11: test[75d6903177b1d7e9]::__rust_begin_short_backtrace::<core[940e698046960fd5]::result::Result<(), alloc[2ea6bcb46fca0c42]::string::String>, fn() -> core[940e698046960fd5]::result::Result<(), alloc[2ea6bcb46fca0c42]::string::String>> <unknown>
21.75 s
gammaloop-nextest-core> at <unknown source file> :<unknown line>
21.75 s
gammaloop-nextest-core> 12: test[75d6903177b1d7e9]::run_test::{closure#0} <unknown>
21.75 s
gammaloop-nextest-core> at <unknown source file> :<unknown line>
21.75 s
gammaloop-nextest-core> 13: std[bcb96dfbba0ab899]::sys::backtrace::__rust_begin_short_backtrace::<test[75d6903177b1d7e9]::run_test::{closure#1}, ()> <unknown>
21.75 s
gammaloop-nextest-core> at <unknown source file> :<unknown line>
21.75 s
gammaloop-nextest-core> 14: <std[bcb96dfbba0ab899]::thread::lifecycle::spawn_unchecked<test[75d6903177b1d7e9]::run_test::{closure#1}, ()>::{closure#1} as core[940e698046960fd5]::ops::function::FnOnce<()>>::call_once::{shim:vtable#0} <unknown>
21.75 s
gammaloop-nextest-core> at <unknown source file> :<unknown line>
21.75 s
gammaloop-nextest-core> 15: <std[bcb96dfbba0ab899]::sys::thread::unix::Thread>::new::thread_start <unknown>
21.75 s
gammaloop-nextest-core> at <unknown source file> :<unknown line>
21.75 s
gammaloop-nextest-core> 16: start_thread <unknown>
21.75 s
gammaloop-nextest-core> at <unknown source file> :<unknown line>
21.75 s
gammaloop-nextest-core> 17: __clone3 <unknown>
21.75 s
gammaloop-nextest-core> at <unknown source file> :<unknown line>
21.75 s
gammaloop-nextest-core>
21.75 s
gammaloop-nextest-core> Run with COLORBT_SHOW_HIDDEN=1 environment variable to disable frame filtering.
21.75 s
gammaloop-nextest-core> Run with RUST_BACKTRACE=full to include source snippets.
21.75 s
gammaloop-nextest-core>
22.20 s
gammaloop-nextest-core> FAIL [ 0.086s] (407/456) gammalooprs uv::export::tests :: computed_node_full_numerator_is_a_spenso_aware_typst_fragment
22.20 s
gammaloop-nextest-core> stdout ---
22.20 s
gammaloop-nextest-core>
22.20 s
gammaloop-nextest-core> running 1 test
22.20 s
gammaloop-nextest-core> test uv::export::tests::computed_node_full_numerator_is_a_spenso_aware_typst_fragment ... FAILED
22.20 s
gammaloop-nextest-core>
22.20 s
gammaloop-nextest-core> failures:
22.20 s
gammaloop-nextest-core>
22.20 s
gammaloop-nextest-core> failures:
22.20 s
gammaloop-nextest-core> uv::export::tests::computed_node_full_numerator_is_a_spenso_aware_typst_fragment
22.20 s
gammaloop-nextest-core>
22.20 s
gammaloop-nextest-core> test result: FAILED. 0 passed; 1 failed; 0 ignored; 0 measured; 508 filtered out; finished in 0.07s
22.20 s
gammaloop-nextest-core>
22.20 s
gammaloop-nextest-core> stderr ---
22.20 s
gammaloop-nextest-core> The application panicked (crashed).
22.20 s
gammaloop-nextest-core> Message: assertion failed: exported.dot.contains(r#"full_num = "op(\"Tr\")(1)";"#)
22.20 s
gammaloop-nextest-core> Location: crates/gammalooprs/src/uv/export.rs :483
22.20 s
gammaloop-nextest-core>
22.20 s
gammaloop-nextest-core> ━━━━━━━━━━━━━━━━━━━━━━━━━━━━━━━━━━ BACKTRACE ━━━━━━━━━━━━━━━━━━━━━━━━━━━━━━━━━━━
22.20 s
gammaloop-nextest-core> 1: <color_eyre[b0c9e66060e883b2]::config::PanicHook>::panic_report <unknown>
22.20 s
gammaloop-nextest-core> at <unknown source file> :<unknown line>
22.20 s
gammaloop-nextest-core> 2: <color_eyre[b0c9e66060e883b2]::config::PanicHook>::into_panic_hook::{closure#0} <unknown>
22.20 s
gammaloop-nextest-core> at <unknown source file> :<unknown line>
22.20 s
gammaloop-nextest-core> 3: std[bcb96dfbba0ab899]::panicking::panic_with_hook <unknown>
22.20 s
gammaloop-nextest-core> at <unknown source file> :<unknown line>
22.20 s
gammaloop-nextest-core> 4: std[bcb96dfbba0ab899]::panicking::panic_handler::{closure#0} <unknown>
22.20 s
gammaloop-nextest-core> at <unknown source file> :<unknown line>
22.20 s
gammaloop-nextest-core> 5: std[bcb96dfbba0ab899]::sys::backtrace::__rust_end_short_backtrace::<std[bcb96dfbba0ab899]::panicking::panic_handler::{closure#0}, !> <unknown>
22.20 s
gammaloop-nextest-core> at <unknown source file> :<unknown line>
22.20 s
gammaloop-nextest-core> 6: __rustc[6c289b9f9c454d21]::rust_begin_unwind <unknown>
22.20 s
gammaloop-nextest-core> at <unknown source file> :<unknown line>
22.20 s
gammaloop-nextest-core> 7: core[940e698046960fd5]::panicking::panic_fmt <unknown>
22.20 s
gammaloop-nextest-core> at <unknown source file> :<unknown line>
22.20 s
gammaloop-nextest-core> 8: core[940e698046960fd5]::panicking::panic <unknown>
22.20 s
gammaloop-nextest-core> at <unknown source file> :<unknown line>
22.20 s
gammaloop-nextest-core> 9: gammalooprs[5490727360442cce]::uv::export::tests::computed_node_full_numerator_is_a_spenso_aware_typst_fragment <unknown>
22.20 s
gammaloop-nextest-core> at <unknown source file> :<unknown line>
22.20 s
gammaloop-nextest-core> 10: <gammalooprs[5490727360442cce]::uv::export::tests::computed_node_full_numerator_is_a_spenso_aware_typst_fragment::{closure#0} as core[940e698046960fd5]::ops::function::FnOnce<()>>::call_once <unknown>
22.20 s
gammaloop-nextest-core> at <unknown source file> :<unknown line>
22.20 s
gammaloop-nextest-core> 11: test[75d6903177b1d7e9]::__rust_begin_short_backtrace::<core[940e698046960fd5]::result::Result<(), alloc[2ea6bcb46fca0c42]::string::String>, fn() -> core[940e698046960fd5]::result::Result<(), alloc[2ea6bcb46fca0c42]::string::String>> <unknown>
22.20 s
gammaloop-nextest-core> at <unknown source file> :<unknown line>
22.20 s
gammaloop-nextest-core> 12: test[75d6903177b1d7e9]::run_test::{closure#0} <unknown>
22.20 s
gammaloop-nextest-core> at <unknown source file> :<unknown line>
22.20 s
gammaloop-nextest-core> 13: std[bcb96dfbba0ab899]::sys::backtrace::__rust_begin_short_backtrace::<test[75d6903177b1d7e9]::run_test::{closure#1}, ()> <unknown>
22.20 s
gammaloop-nextest-core> at <unknown source file> :<unknown line>
22.20 s
gammaloop-nextest-core> 14: <std[bcb96dfbba0ab899]::thread::lifecycle::spawn_unchecked<test[75d6903177b1d7e9]::run_test::{closure#1}, ()>::{closure#1} as core[940e698046960fd5]::ops::function::FnOnce<()>>::call_once::{shim:vtable#0} <unknown>
22.20 s
gammaloop-nextest-core> at <unknown source file> :<unknown line>
22.20 s
gammaloop-nextest-core> 15: <std[bcb96dfbba0ab899]::sys::thread::unix::Thread>::new::thread_start <unknown>
22.20 s
gammaloop-nextest-core> at <unknown source file> :<unknown line>
22.20 s
gammaloop-nextest-core> 16: start_thread <unknown>
22.20 s
gammaloop-nextest-core> at <unknown source file> :<unknown line>
22.20 s
gammaloop-nextest-core> 17: __clone3 <unknown>
22.20 s
gammaloop-nextest-core> at <unknown source file> :<unknown line>
22.20 s
gammaloop-nextest-core>
22.20 s
gammaloop-nextest-core> Run with COLORBT_SHOW_HIDDEN=1 environment variable to disable frame filtering.
22.20 s
gammaloop-nextest-core> Run with RUST_BACKTRACE=full to include source snippets.
22.20 s
gammaloop-nextest-core>
30.62 s
gammaloop-nextest-core> ------------
30.63 s
gammaloop-nextest-core> Summary [ 9.243s] 456 tests run: 454 passed , 2 failed , 61 skipped
30.63 s
gammaloop-nextest-core> FAIL [ 0.260s] (161/456) gammalooprs graph::parse::tests :: parse_lmbsetting_crossection
30.63 s
gammaloop-nextest-core> stdout ---
30.63 s
gammaloop-nextest-core>
30.63 s
gammaloop-nextest-core> running 1 test
30.63 s
gammaloop-nextest-core> ━━━━━━━━━━━━━━━━━━━━━━━━━━━━━━━ Snapshot Summary ━━━━━━━━━━━━━━━━━━━━━━━━━━━━━━━
30.63 s
gammaloop-nextest-core> Snapshot: parse_lmbsetting_crossection
30.63 s
gammaloop-nextest-core> Source: crates/gammalooprs/src/graph/parse/tests.rs:252
30.63 s
gammaloop-nextest-core> ────────────────────────────────────────────────────────────────────────────────
30.63 s
gammaloop-nextest-core> Expression: g.debug_dot()
30.63 s
gammaloop-nextest-core> ────────────────────────────────────────────────────────────────────────────────
30.63 s
gammaloop-nextest-core> -old snapshot
30.63 s
gammaloop-nextest-core> +new results
30.63 s
gammaloop-nextest-core> ────────────┬───────────────────────────────────────────────────────────────────
30.63 s
gammaloop-nextest-core> 1 │-digraph G{
30.63 s
gammaloop-nextest-core> 1 │+digraph G {
30.63 s
gammaloop-nextest-core> 2 2 │ num = "1/2";
30.63 s
gammaloop-nextest-core> 3 3 │ overall_factor = "2*x";
30.63 s
gammaloop-nextest-core> 4 4 │ overall_factor_evaluated = "2*x";
30.63 s
gammaloop-nextest-core> 5 5 │ projector = "spenso::t";
30.63 s
gammaloop-nextest-core> ────────────┴───────────────────────────────────────────────────────────────────
30.63 s
gammaloop-nextest-core> To update snapshots run `cargo insta review`
30.63 s
gammaloop-nextest-core> Stopped on the first failure. Run `cargo insta test` to run all snapshots.
30.63 s
gammaloop-nextest-core> test graph::parse::tests::parse_lmbsetting_crossection ... FAILED
30.63 s
gammaloop-nextest-core>
30.63 s
gammaloop-nextest-core> failures:
30.63 s
gammaloop-nextest-core>
30.63 s
gammaloop-nextest-core> failures:
30.63 s
gammaloop-nextest-core> graph::parse::tests::parse_lmbsetting_crossection
30.63 s
gammaloop-nextest-core>
30.63 s
gammaloop-nextest-core> test result: FAILED. 0 passed; 1 failed; 0 ignored; 0 measured; 508 filtered out; finished in 0.25s
30.63 s
gammaloop-nextest-core>
30.63 s
gammaloop-nextest-core> stderr ---
30.63 s
gammaloop-nextest-core> [22:03:32.134] @gammalooprs::graph::attribute_warnings WARNING : Unknown node attribute 'color_num' on graph 'G', node 'A'; did you mean 'num'?
30.63 s
gammaloop-nextest-core> at crates/gammalooprs/src/graph/attribute_warnings.rs:198
30.63 s
gammaloop-nextest-core> The application panicked (crashed).
30.63 s
gammaloop-nextest-core> Message: snapshot assertion for 'parse_lmbsetting_crossection' failed in line 252
30.63 s
gammaloop-nextest-core> Location: /nix/store/xdy1vvhll2bijdplvl9fcc2b9plkxhaa-vendor-cargo-deps/c19b7c6f923b580ac259164a89f2577984ad5ab09ee9d583b888f934adbbe8d0/insta-1.47.2/src/runtime.rs :719
30.63 s
gammaloop-nextest-core>
30.63 s
gammaloop-nextest-core> ━━━━━━━━━━━━━━━━━━━━━━━━━━━━━━━━━━ BACKTRACE ━━━━━━━━━━━━━━━━━━━━━━━━━━━━━━━━━━━
30.63 s
gammaloop-nextest-core> 1: <color_eyre[b0c9e66060e883b2]::config::PanicHook>::panic_report <unknown>
30.63 s
gammaloop-nextest-core> at <unknown source file> :<unknown line>
30.63 s
gammaloop-nextest-core> 2: <color_eyre[b0c9e66060e883b2]::config::PanicHook>::into_panic_hook::{closure#0} <unknown>
30.63 s
gammaloop-nextest-core> at <unknown source file> :<unknown line>
30.63 s
gammaloop-nextest-core> 3: std[bcb96dfbba0ab899]::panicking::panic_with_hook <unknown>
30.63 s
gammaloop-nextest-core> at <unknown source file> :<unknown line>
30.63 s
gammaloop-nextest-core> 4: std[bcb96dfbba0ab899]::panicking::panic_handler::{closure#0} <unknown>
30.63 s
gammaloop-nextest-core> at <unknown source file> :<unknown line>
30.63 s
gammaloop-nextest-core> 5: std[bcb96dfbba0ab899]::sys::backtrace::__rust_end_short_backtrace::<std[bcb96dfbba0ab899]::panicking::panic_handler::{closure#0}, !> <unknown>
30.63 s
gammaloop-nextest-core> at <unknown source file> :<unknown line>
30.63 s
gammaloop-nextest-core> 6: __rustc[6c289b9f9c454d21]::rust_begin_unwind <unknown>
30.63 s
gammaloop-nextest-core> at <unknown source file> :<unknown line>
30.63 s
gammaloop-nextest-core> 7: core[940e698046960fd5]::panicking::panic_fmt <unknown>
30.63 s
gammaloop-nextest-core> at <unknown source file> :<unknown line>
30.63 s
gammaloop-nextest-core> 8: insta[307a548ac79ef4d9]::runtime::assert_snapshot <unknown>
30.63 s
gammaloop-nextest-core> at <unknown source file> :<unknown line>
30.63 s
gammaloop-nextest-core> 9: gammalooprs[5490727360442cce]::graph::parse::tests::parse_lmbsetting_crossection <unknown>
30.63 s
gammaloop-nextest-core> at <unknown source file> :<unknown line>
30.63 s
gammaloop-nextest-core> 10: <gammalooprs[5490727360442cce]::graph::parse::tests::parse_lmbsetting_crossection::{closure#0} as core[940e698046960fd5]::ops::function::FnOnce<()>>::call_once <unknown>
30.63 s
gammaloop-nextest-core> at <unknown source file> :<unknown line>
30.63 s
gammaloop-nextest-core> 11: test[75d6903177b1d7e9]::__rust_begin_short_backtrace::<core[940e698046960fd5]::result::Result<(), alloc[2ea6bcb46fca0c42]::string::String>, fn() -> core[940e698046960fd5]::result::Result<(), alloc[2ea6bcb46fca0c42]::string::String>> <unknown>
30.63 s
gammaloop-nextest-core> at <unknown source file> :<unknown line>
30.63 s
gammaloop-nextest-core> 12: test[75d6903177b1d7e9]::run_test::{closure#0} <unknown>
30.63 s
gammaloop-nextest-core> at <unknown source file> :<unknown line>
30.63 s
gammaloop-nextest-core> 13: std[bcb96dfbba0ab899]::sys::backtrace::__rust_begin_short_backtrace::<test[75d6903177b1d7e9]::run_test::{closure#1}, ()> <unknown>
30.63 s
gammaloop-nextest-core> at <unknown source file> :<unknown line>
30.63 s
gammaloop-nextest-core> 14: <std[bcb96dfbba0ab899]::thread::lifecycle::spawn_unchecked<test[75d6903177b1d7e9]::run_test::{closure#1}, ()>::{closure#1} as core[940e698046960fd5]::ops::function::FnOnce<()>>::call_once::{shim:vtable#0} <unknown>
30.63 s
gammaloop-nextest-core> at <unknown source file> :<unknown line>
30.63 s
gammaloop-nextest-core> 15: <std[bcb96dfbba0ab899]::sys::thread::unix::Thread>::new::thread_start <unknown>
30.63 s
gammaloop-nextest-core> at <unknown source file> :<unknown line>
30.63 s
gammaloop-nextest-core> 16: start_thread <unknown>
30.63 s
gammaloop-nextest-core> at <unknown source file> :<unknown line>
30.63 s
gammaloop-nextest-core> 17: __clone3 <unknown>
30.63 s
gammaloop-nextest-core> at <unknown source file> :<unknown line>
30.63 s
gammaloop-nextest-core>
30.63 s
gammaloop-nextest-core> Run with COLORBT_SHOW_HIDDEN=1 environment variable to disable frame filtering.
30.63 s
gammaloop-nextest-core> Run with RUST_BACKTRACE=full to include source snippets.
30.63 s
gammaloop-nextest-core>
30.63 s
gammaloop-nextest-core> FAIL [ 0.086s] (407/456) gammalooprs uv::export::tests :: computed_node_full_numerator_is_a_spenso_aware_typst_fragment
30.63 s
gammaloop-nextest-core> stdout ---
30.63 s
gammaloop-nextest-core>
30.63 s
gammaloop-nextest-core> running 1 test
30.63 s
gammaloop-nextest-core> test uv::export::tests::computed_node_full_numerator_is_a_spenso_aware_typst_fragment ... FAILED
30.63 s
gammaloop-nextest-core>
30.63 s
gammaloop-nextest-core> failures:
30.63 s
gammaloop-nextest-core>
30.63 s
gammaloop-nextest-core> failures:
30.63 s
gammaloop-nextest-core> uv::export::tests::computed_node_full_numerator_is_a_spenso_aware_typst_fragment
30.63 s
gammaloop-nextest-core>
30.63 s
gammaloop-nextest-core> test result: FAILED. 0 passed; 1 failed; 0 ignored; 0 measured; 508 filtered out; finished in 0.07s
30.63 s
gammaloop-nextest-core>
30.63 s
gammaloop-nextest-core> stderr ---
30.63 s
gammaloop-nextest-core> The application panicked (crashed).
30.63 s
gammaloop-nextest-core> Message: assertion failed: exported.dot.contains(r#"full_num = "op(\"Tr\")(1)";"#)
30.63 s
gammaloop-nextest-core> Location: crates/gammalooprs/src/uv/export.rs :483
30.63 s
gammaloop-nextest-core>
30.63 s
gammaloop-nextest-core> ━━━━━━━━━━━━━━━━━━━━━━━━━━━━━━━━━━ BACKTRACE ━━━━━━━━━━━━━━━━━━━━━━━━━━━━━━━━━━━
30.63 s
gammaloop-nextest-core> 1: <color_eyre[b0c9e66060e883b2]::config::PanicHook>::panic_report <unknown>
30.63 s
gammaloop-nextest-core> at <unknown source file> :<unknown line>
30.63 s
gammaloop-nextest-core> 2: <color_eyre[b0c9e66060e883b2]::config::PanicHook>::into_panic_hook::{closure#0} <unknown>
30.63 s
gammaloop-nextest-core> at <unknown source file> :<unknown line>
30.63 s
gammaloop-nextest-core> 3: std[bcb96dfbba0ab899]::panicking::panic_with_hook <unknown>
30.63 s
gammaloop-nextest-core> at <unknown source file> :<unknown line>
30.63 s
gammaloop-nextest-core> 4: std[bcb96dfbba0ab899]::panicking::panic_handler::{closure#0} <unknown>
30.63 s
gammaloop-nextest-core> at <unknown source file> :<unknown line>
30.63 s
gammaloop-nextest-core> 5: std[bcb96dfbba0ab899]::sys::backtrace::__rust_end_short_backtrace::<std[bcb96dfbba0ab899]::panicking::panic_handler::{closure#0}, !> <unknown>
30.63 s
gammaloop-nextest-core> at <unknown source file> :<unknown line>
30.63 s
gammaloop-nextest-core> 6: __rustc[6c289b9f9c454d21]::rust_begin_unwind <unknown>
30.63 s
gammaloop-nextest-core> at <unknown source file> :<unknown line>
30.63 s
gammaloop-nextest-core> 7: core[940e698046960fd5]::panicking::panic_fmt <unknown>
30.63 s
gammaloop-nextest-core> at <unknown source file> :<unknown line>
30.63 s
gammaloop-nextest-core> 8: core[940e698046960fd5]::panicking::panic <unknown>
30.63 s
gammaloop-nextest-core> at <unknown source file> :<unknown line>
30.63 s
gammaloop-nextest-core> 9: gammalooprs[5490727360442cce]::uv::export::tests::computed_node_full_numerator_is_a_spenso_aware_typst_fragment <unknown>
30.63 s
gammaloop-nextest-core> at <unknown source file> :<unknown line>
30.63 s
gammaloop-nextest-core> 10: <gammalooprs[5490727360442cce]::uv::export::tests::computed_node_full_numerator_is_a_spenso_aware_typst_fragment::{closure#0} as core[940e698046960fd5]::ops::function::FnOnce<()>>::call_once <unknown>
30.63 s
gammaloop-nextest-core> at <unknown source file> :<unknown line>
30.63 s
gammaloop-nextest-core> 11: test[75d6903177b1d7e9]::__rust_begin_short_backtrace::<core[940e698046960fd5]::result::Result<(), alloc[2ea6bcb46fca0c42]::string::String>, fn() -> core[940e698046960fd5]::result::Result<(), alloc[2ea6bcb46fca0c42]::string::String>> <unknown>
30.63 s
gammaloop-nextest-core> at <unknown source file> :<unknown line>
30.63 s
gammaloop-nextest-core> 12: test[75d6903177b1d7e9]::run_test::{closure#0} <unknown>
30.63 s
gammaloop-nextest-core> at <unknown source file> :<unknown line>
30.63 s
gammaloop-nextest-core> 13: std[bcb96dfbba0ab899]::sys::backtrace::__rust_begin_short_backtrace::<test[75d6903177b1d7e9]::run_test::{closure#1}, ()> <unknown>
30.63 s
gammaloop-nextest-core> at <unknown source file> :<unknown line>
30.63 s
gammaloop-nextest-core> 14: <std[bcb96dfbba0ab899]::thread::lifecycle::spawn_unchecked<test[75d6903177b1d7e9]::run_test::{closure#1}, ()>::{closure#1} as core[940e698046960fd5]::ops::function::FnOnce<()>>::call_once::{shim:vtable#0} <unknown>
30.63 s
gammaloop-nextest-core> at <unknown source file> :<unknown line>
30.63 s
gammaloop-nextest-core> 15: <std[bcb96dfbba0ab899]::sys::thread::unix::Thread>::new::thread_start <unknown>
30.63 s
gammaloop-nextest-core> at <unknown source file> :<unknown line>
30.63 s
gammaloop-nextest-core> 16: start_thread <unknown>
30.63 s
gammaloop-nextest-core> at <unknown source file> :<unknown line>
30.63 s
gammaloop-nextest-core> 17: __clone3 <unknown>
30.63 s
gammaloop-nextest-core> at <unknown source file> :<unknown line>
30.63 s
gammaloop-nextest-core>
30.63 s
gammaloop-nextest-core> Run with COLORBT_SHOW_HIDDEN=1 environment variable to disable frame filtering.
30.63 s
gammaloop-nextest-core> Run with RUST_BACKTRACE=full to include source snippets.
30.63 s
gammaloop-nextest-core>
30.63 s
gammaloop-nextest-core> error : test run failed
30.65 s
gammaloop-nextest-core>
30.65 s
gammaloop-nextest-core> ========== nextest test summary ==========
30.65 s
gammaloop-nextest-core> report: target/nextest/ci_gammaloop/junit.xml
30.65 s
gammaloop-nextest-core> tests: 456, failures: 2, errors: 0
30.65 s
gammaloop-nextest-core>
30.65 s
gammaloop-nextest-core> 1. gammalooprs::graph::parse::tests::parse_lmbsetting_crossection
30.65 s
gammaloop-nextest-core> failure: test failure with exit code 101
30.65 s
gammaloop-nextest-core> system-out
30.66 s
gammaloop-nextest-core> running 1 test
30.66 s
gammaloop-nextest-core> ━━━━━━━━━━━━━━━━━━━━━━━━━━━━━━━ Snapshot Summary ━━━━━━━━━━━━━━━━━━━━━━━━━━━━━━━
30.66 s
gammaloop-nextest-core> Snapshot: parse_lmbsetting_crossection
30.66 s
gammaloop-nextest-core> Source: crates/gammalooprs/src/graph/parse/tests.rs:252
30.66 s
gammaloop-nextest-core> ────────────────────────────────────────────────────────────────────────────────
30.66 s
gammaloop-nextest-core> Expression: g.debug_dot()
30.66 s
gammaloop-nextest-core> ────────────────────────────────────────────────────────────────────────────────
30.66 s
gammaloop-nextest-core> -old snapshot
30.66 s
gammaloop-nextest-core> +new results
30.66 s
gammaloop-nextest-core> ────────────┬───────────────────────────────────────────────────────────────────
30.66 s
gammaloop-nextest-core> 1 │-digraph G{
30.66 s
gammaloop-nextest-core> 1 │+digraph G {
30.66 s
gammaloop-nextest-core> 2 2 │ num = "1/2";
30.66 s
gammaloop-nextest-core> 3 3 │ overall_factor = "2*x";
30.66 s
gammaloop-nextest-core> 4 4 │ overall_factor_evaluated = "2*x";
30.66 s
gammaloop-nextest-core> 5 5 │ projector = "spenso::t";
30.66 s
gammaloop-nextest-core> ────────────┴───────────────────────────────────────────────────────────────────
30.66 s
gammaloop-nextest-core> To update snapshots run `cargo insta review`
30.66 s
gammaloop-nextest-core> Stopped on the first failure. Run `cargo insta test` to run all snapshots.
30.66 s
gammaloop-nextest-core> test graph::parse::tests::parse_lmbsetting_crossection ... FAILED
30.66 s
gammaloop-nextest-core>
30.66 s
gammaloop-nextest-core> failures:
30.66 s
gammaloop-nextest-core>
30.66 s
gammaloop-nextest-core> failures:
30.66 s
gammaloop-nextest-core> graph::parse::tests::parse_lmbsetting_crossection
30.66 s
gammaloop-nextest-core>
30.66 s
gammaloop-nextest-core> test result: FAILED. 0 passed; 1 failed; 0 ignored; 0 measured; 508 filtered out; finished in 0.25s
30.66 s
gammaloop-nextest-core> system-err
30.66 s
gammaloop-nextest-core> [22:03:32.134] @gammalooprs::graph::attribute_warnings WARNING : Unknown node attribute 'color_num' on graph 'G', node 'A'; did you mean 'num'?
30.66 s
gammaloop-nextest-core> at crates/gammalooprs/src/graph/attribute_warnings.rs:198
30.66 s
gammaloop-nextest-core> The application panicked (crashed).
30.66 s
gammaloop-nextest-core> Message: snapshot assertion for 'parse_lmbsetting_crossection' failed in line 252
30.66 s
gammaloop-nextest-core> Location: /nix/store/xdy1vvhll2bijdplvl9fcc2b9plkxhaa-vendor-cargo-deps/c19b7c6f923b580ac259164a89f2577984ad5ab09ee9d583b888f934adbbe8d0/insta-1.47.2/src/runtime.rs:719
30.66 s
gammaloop-nextest-core>
30.66 s
gammaloop-nextest-core> ━━━━━━━━━━━━━━━━━━━━━━━━━━━━━━━━━━ BACKTRACE ━━━━━━━━━━━━━━━━━━━━━━━━━━━━━━━━━━━
30.66 s
gammaloop-nextest-core> 1: <color_eyre[b0c9e66060e883b2]::config::PanicHook>::panic_report<unknown>
30.66 s
gammaloop-nextest-core> at <unknown source file>:<unknown line>
30.66 s
gammaloop-nextest-core> 2: <color_eyre[b0c9e66060e883b2]::config::PanicHook>::into_panic_hook::{closure#0}<unknown>
30.66 s
gammaloop-nextest-core> at <unknown source file>:<unknown line>
30.66 s
gammaloop-nextest-core> 3: std[bcb96dfbba0ab899]::panicking::panic_with_hook<unknown>
30.66 s
gammaloop-nextest-core> at <unknown source file>:<unknown line>
30.66 s
gammaloop-nextest-core> 4: std[bcb96dfbba0ab899]::panicking::panic_handler::{closure#0}<unknown>
30.66 s
gammaloop-nextest-core> at <unknown source file>:<unknown line>
30.66 s
gammaloop-nextest-core> 5: std[bcb96dfbba0ab899]::sys::backtrace::__rust_end_short_backtrace::<std[bcb96dfbba0ab899]::panicking::panic_handler::{closure#0}, !><unknown>
30.66 s
gammaloop-nextest-core> at <unknown source file>:<unknown line>
30.66 s
gammaloop-nextest-core> 6: __rustc[6c289b9f9c454d21]::rust_begin_unwind<unknown>
30.66 s
gammaloop-nextest-core> at <unknown source file>:<unknown line>
30.66 s
gammaloop-nextest-core> 7: core[940e698046960fd5]::panicking::panic_fmt<unknown>
30.66 s
gammaloop-nextest-core> at <unknown source file>:<unknown line>
30.66 s
gammaloop-nextest-core> 8: insta[307a548ac79ef4d9]::runtime::assert_snapshot<unknown>
30.66 s
gammaloop-nextest-core> at <unknown source file>:<unknown line>
30.66 s
gammaloop-nextest-core> 9: gammalooprs[5490727360442cce]::graph::parse::tests::parse_lmbsetting_crossection<unknown>
30.66 s
gammaloop-nextest-core> at <unknown source file>:<unknown line>
30.66 s
gammaloop-nextest-core> 10: <gammalooprs[5490727360442cce]::graph::parse::tests::parse_lmbsetting_crossection::{closure#0} as core[940e698046960fd5]::ops::function::FnOnce<()>>::call_once<unknown>
30.66 s
gammaloop-nextest-core> at <unknown source file>:<unknown line>
30.66 s
gammaloop-nextest-core> 11: test[75d6903177b1d7e9]::__rust_begin_short_backtrace::<core[940e698046960fd5]::result::Result<(), alloc[2ea6bcb46fca0c42]::string::String>, fn() -> core[940e698046960fd5]::result::Result<(), alloc[2ea6bcb46fca0c42]::string::String>><unknown>
30.66 s
gammaloop-nextest-core> at <unknown source file>:<unknown line>
30.66 s
gammaloop-nextest-core> 12: test[75d6903177b1d7e9]::run_test::{closure#0}<unknown>
30.66 s
gammaloop-nextest-core> at <unknown source file>:<unknown line>
30.66 s
gammaloop-nextest-core> 13: std[bcb96dfbba0ab899]::sys::backtrace::__rust_begin_short_backtrace::<test[75d6903177b1d7e9]::run_test::{closure#1}, ()><unknown>
30.66 s
gammaloop-nextest-core> at <unknown source file>:<unknown line>
30.66 s
gammaloop-nextest-core> 14: <std[bcb96dfbba0ab899]::thread::lifecycle::spawn_unchecked<test[75d6903177b1d7e9]::run_test::{closure#1}, ()>::{closure#1} as core[940e698046960fd5]::ops::function::FnOnce<()>>::call_once::{shim:vtable#0}<unknown>
30.66 s
gammaloop-nextest-core> at <unknown source file>:<unknown line>
30.66 s
gammaloop-nextest-core> 15: <std[bcb96dfbba0ab899]::sys::thread::unix::Thread>::new::thread_start<unknown>
30.66 s
gammaloop-nextest-core> at <unknown source file>:<unknown line>
30.66 s
gammaloop-nextest-core> 16: start_thread<unknown>
30.66 s
gammaloop-nextest-core> at <unknown source file>:<unknown line>
30.66 s
gammaloop-nextest-core> 17: __clone3<unknown>
30.66 s
gammaloop-nextest-core> at <unknown source file>:<unknown line>
30.66 s
gammaloop-nextest-core>
30.66 s
gammaloop-nextest-core> Run with COLORBT_SHOW_HIDDEN=1 environment variable to disable frame filtering.
30.66 s
gammaloop-nextest-core> Run with RUST_BACKTRACE=full to include source snippets.
30.66 s
gammaloop-nextest-core>
30.66 s
gammaloop-nextest-core> 2. gammalooprs::uv::export::tests::computed_node_full_numerator_is_a_spenso_aware_typst_fragment
30.66 s
gammaloop-nextest-core> failure: test failure with exit code 101
30.66 s
gammaloop-nextest-core> system-out
30.66 s
gammaloop-nextest-core> running 1 test
30.66 s
gammaloop-nextest-core> test uv::export::tests::computed_node_full_numerator_is_a_spenso_aware_typst_fragment ... FAILED
30.66 s
gammaloop-nextest-core>
30.66 s
gammaloop-nextest-core> failures:
30.66 s
gammaloop-nextest-core>
30.66 s
gammaloop-nextest-core> failures:
30.66 s
gammaloop-nextest-core> uv::export::tests::computed_node_full_numerator_is_a_spenso_aware_typst_fragment
30.66 s
gammaloop-nextest-core>
30.66 s
gammaloop-nextest-core> test result: FAILED. 0 passed; 1 failed; 0 ignored; 0 measured; 508 filtered out; finished in 0.07s
30.66 s
gammaloop-nextest-core> system-err
30.66 s
gammaloop-nextest-core> The application panicked (crashed).
30.66 s
gammaloop-nextest-core> Message: assertion failed: exported.dot.contains(r#"full_num = "op(\"Tr\")(1)";"#)
30.66 s
gammaloop-nextest-core> Location: crates/gammalooprs/src/uv/export.rs:483
30.66 s
gammaloop-nextest-core>
30.66 s
gammaloop-nextest-core> ━━━━━━━━━━━━━━━━━━━━━━━━━━━━━━━━━━ BACKTRACE ━━━━━━━━━━━━━━━━━━━━━━━━━━━━━━━━━━━
30.66 s
gammaloop-nextest-core> 1: <color_eyre[b0c9e66060e883b2]::config::PanicHook>::panic_report<unknown>
30.66 s
gammaloop-nextest-core> at <unknown source file>:<unknown line>
30.66 s
gammaloop-nextest-core> 2: <color_eyre[b0c9e66060e883b2]::config::PanicHook>::into_panic_hook::{closure#0}<unknown>
30.66 s
gammaloop-nextest-core> at <unknown source file>:<unknown line>
30.66 s
gammaloop-nextest-core> 3: std[bcb96dfbba0ab899]::panicking::panic_with_hook<unknown>
30.66 s
gammaloop-nextest-core> at <unknown source file>:<unknown line>
30.66 s
gammaloop-nextest-core> 4: std[bcb96dfbba0ab899]::panicking::panic_handler::{closure#0}<unknown>
30.66 s
gammaloop-nextest-core> at <unknown source file>:<unknown line>
30.66 s
gammaloop-nextest-core> 5: std[bcb96dfbba0ab899]::sys::backtrace::__rust_end_short_backtrace::<std[bcb96dfbba0ab899]::panicking::panic_handler::{closure#0}, !><unknown>
30.66 s
gammaloop-nextest-core> at <unknown source file>:<unknown line>
30.66 s
gammaloop-nextest-core> 6: __rustc[6c289b9f9c454d21]::rust_begin_unwind<unknown>
30.66 s
gammaloop-nextest-core> at <unknown source file>:<unknown line>
30.66 s
gammaloop-nextest-core> 7: core[940e698046960fd5]::panicking::panic_fmt<unknown>
30.66 s
gammaloop-nextest-core> at <unknown source file>:<unknown line>
30.66 s
gammaloop-nextest-core> 8: core[940e698046960fd5]::panicking::panic<unknown>
30.66 s
gammaloop-nextest-core> at <unknown source file>:<unknown line>
30.66 s
gammaloop-nextest-core> 9: gammalooprs[5490727360442cce]::uv::export::tests::computed_node_full_numerator_is_a_spenso_aware_typst_fragment<unknown>
30.66 s
gammaloop-nextest-core> at <unknown source file>:<unknown line>
30.66 s
gammaloop-nextest-core> 10: <gammalooprs[5490727360442cce]::uv::export::tests::computed_node_full_numerator_is_a_spenso_aware_typst_fragment::{closure#0} as core[940e698046960fd5]::ops::function::FnOnce<()>>::call_once<unknown>
30.66 s
gammaloop-nextest-core> at <unknown source file>:<unknown line>
30.66 s
gammaloop-nextest-core> 11: test[75d6903177b1d7e9]::__rust_begin_short_backtrace::<core[940e698046960fd5]::result::Result<(), alloc[2ea6bcb46fca0c42]::string::String>, fn() -> core[940e698046960fd5]::result::Result<(), alloc[2ea6bcb46fca0c42]::string::String>><unknown>
30.66 s
gammaloop-nextest-core> at <unknown source file>:<unknown line>
30.66 s
gammaloop-nextest-core> 12: test[75d6903177b1d7e9]::run_test::{closure#0}<unknown>
30.66 s
gammaloop-nextest-core> at <unknown source file>:<unknown line>
30.66 s
gammaloop-nextest-core> 13: std[bcb96dfbba0ab899]::sys::backtrace::__rust_begin_short_backtrace::<test[75d6903177b1d7e9]::run_test::{closure#1}, ()><unknown>
30.66 s
gammaloop-nextest-core> at <unknown source file>:<unknown line>
30.66 s
gammaloop-nextest-core> 14: <std[bcb96dfbba0ab899]::thread::lifecycle::spawn_unchecked<test[75d6903177b1d7e9]::run_test::{closure#1}, ()>::{closure#1} as core[940e698046960fd5]::ops::function::FnOnce<()>>::call_once::{shim:vtable#0}<unknown>
30.66 s
gammaloop-nextest-core> at <unknown source file>:<unknown line>
30.66 s
gammaloop-nextest-core> 15: <std[bcb96dfbba0ab899]::sys::thread::unix::Thread>::new::thread_start<unknown>
30.66 s
gammaloop-nextest-core> at <unknown source file>:<unknown line>
30.66 s
gammaloop-nextest-core> 16: start_thread<unknown>
30.66 s
gammaloop-nextest-core> at <unknown source file>:<unknown line>
30.66 s
gammaloop-nextest-core> 17: __clone3<unknown>
30.66 s
gammaloop-nextest-core> at <unknown source file>:<unknown line>
30.66 s
gammaloop-nextest-core>
30.66 s
gammaloop-nextest-core> Run with COLORBT_SHOW_HIDDEN=1 environment variable to disable frame filtering.
30.66 s
gammaloop-nextest-core> Run with RUST_BACKTRACE=full to include source snippets.
30.66 s
gammaloop-nextest-core> =========================================
30.82 s
error: Cannot build '/nix/store/j0r373mhy6rmbqq05bplwn7cimlqrcnq-gammaloop-nextest-core.drv '.
30.82 s
Reason: builder failed with exit code 100 .
30.82 s
Output paths:
30.82 s
/nix/store/p7bqxxb972f7f3209b2sl1hcrmagzj6s-gammaloop-nextest-core
30.82 s
Last 612 log lines:
30.82 s
> Extracting 3 binaries (including 1 non-test binary), 1 build script output directory, and 2 linked paths to /build/source
30.82 s
> Extracted 18 files to /build/source in 0.43s
30.82 s
> ------------
30.82 s
> Nextest run ID 48e6bad4-df81-4c2b-bf26-aad3db2e082d with nextest profile: ci_gammaloop
30.82 s
> Starting 339 tests across 2 binaries
30.82 s
> FAIL [ 0.019s] (243/339) gammaloop-api repl::tests :: completion_shows_type_hint_for_non_boolean_settings_leaf
30.82 s
> stdout ---
30.82 s
>
30.82 s
> running 1 test
30.82 s
> test repl::tests::completion_shows_type_hint_for_non_boolean_settings_leaf ... FAILED
30.82 s
>
30.82 s
> failures:
30.82 s
>
30.82 s
> failures:
30.82 s
> repl::tests::completion_shows_type_hint_for_non_boolean_settings_leaf
30.82 s
>
30.82 s
> test result: FAILED. 0 passed; 1 failed; 0 ignored; 0 measured; 338 filtered out; finished in 0.01s
30.82 s
>
30.82 s
> stderr ---
30.82 s
>
30.82 s
> thread 'repl::tests::completion_shows_type_hint_for_non_boolean_settings_leaf' (778) panicked at crates/gammaloop-api/src/repl.rs:5778:9:
30.82 s
> [Suggestion { value: "", description: Some("Number of samples in the first Monte Carlo iteration."), style: None, extra: None, span: Span { start: 42, end: 42 }, append_whitespace: false }]
30.82 s
> stack backtrace:
30.82 s
> 0: __rustc::rust_begin_unwind
30.82 s
> 1: core::panicking::panic_fmt
30.82 s
> 2: gammaloop_api::repl::tests::completion_shows_type_hint_for_non_boolean_settings_leaf
30.82 s
> 3: <gammaloop_api::repl::tests::completion_shows_type_hint_for_non_boolean_settings_leaf::{closure#0} as core::ops::function::FnOnce<()>>::call_once
30.82 s
> note: Some details are omitted, run with `RUST_BACKTRACE=full` for a verbose backtrace.
30.82 s
>
30.82 s
> FAIL [ 0.033s] (278/339) gammaloop-api templates::tests :: extract_templates_uses_canonical_package_layout
30.82 s
> stdout ---
30.82 s
>
30.82 s
> running 1 test
30.82 s
> test templates::tests::extract_templates_uses_canonical_package_layout ... FAILED
30.82 s
>
30.82 s
> failures:
30.82 s
>
30.82 s
> failures:
30.82 s
> templates::tests::extract_templates_uses_canonical_package_layout
30.82 s
>
30.82 s
> test result: FAILED. 0 passed; 1 failed; 0 ignored; 0 measured; 338 filtered out; finished in 0.02s
30.82 s
>
30.82 s
> stderr ---
30.82 s
>
30.82 s
> thread 'templates::tests::extract_templates_uses_canonical_package_layout' (876) panicked at crates/gammaloop-api/src/templates.rs:99:9:
30.82 s
> assertion failed: figure.contains("amplitude-mode")
30.82 s
> stack backtrace:
30.82 s
> 0: __rustc::rust_begin_unwind
30.82 s
> 1: core::panicking::panic_fmt
30.82 s
> 2: core::panicking::panic
30.82 s
> 3: gammaloop_api::templates::tests::extract_templates_uses_canonical_package_layout
30.82 s
> 4: <gammaloop_api::templates::tests::extract_templates_uses_canonical_package_layout::{closure#0} as core::ops::function::FnOnce<()>>::call_once
30.82 s
> note: Some details are omitted, run with `RUST_BACKTRACE=full` for a verbose backtrace.
30.82 s
>
30.82 s
> ------------
30.82 s
> Summary [ 0.491s] 339 tests run: 337 passed , 2 failed , 0 skipped
30.82 s
> FAIL [ 0.019s] (243/339) gammaloop-api repl::tests :: completion_shows_type_hint_for_non_boolean_settings_leaf
30.82 s
> stdout ---
30.82 s
>
30.82 s
> running 1 test
30.82 s
> test repl::tests::completion_shows_type_hint_for_non_boolean_settings_leaf ... FAILED
30.82 s
>
30.82 s
> failures:
30.82 s
>
30.82 s
> failures:
30.82 s
> repl::tests::completion_shows_type_hint_for_non_boolean_settings_leaf
30.82 s
>
30.82 s
> test result: FAILED. 0 passed; 1 failed; 0 ignored; 0 measured; 338 filtered out; finished in 0.01s
30.82 s
>
30.82 s
> stderr ---
30.82 s
>
30.82 s
> thread 'repl::tests::completion_shows_type_hint_for_non_boolean_settings_leaf' (778) panicked at crates/gammaloop-api/src/repl.rs:5778:9:
30.82 s
> [Suggestion { value: "", description: Some("Number of samples in the first Monte Carlo iteration."), style: None, extra: None, span: Span { start: 42, end: 42 }, append_whitespace: false }]
30.82 s
> stack backtrace:
30.82 s
> 0: __rustc::rust_begin_unwind
30.82 s
> 1: core::panicking::panic_fmt
30.82 s
> 2: gammaloop_api::repl::tests::completion_shows_type_hint_for_non_boolean_settings_leaf
30.82 s
> 3: <gammaloop_api::repl::tests::completion_shows_type_hint_for_non_boolean_settings_leaf::{closure#0} as core::ops::function::FnOnce<()>>::call_once
30.82 s
> note: Some details are omitted, run with `RUST_BACKTRACE=full` for a verbose backtrace.
30.82 s
>
30.82 s
> FAIL [ 0.033s] (278/339) gammaloop-api templates::tests :: extract_templates_uses_canonical_package_layout
30.82 s
> stdout ---
30.82 s
>
30.82 s
> running 1 test
30.82 s
> test templates::tests::extract_templates_uses_canonical_package_layout ... FAILED
30.82 s
>
30.82 s
> failures:
30.82 s
>
30.82 s
> failures:
30.82 s
> templates::tests::extract_templates_uses_canonical_package_layout
30.82 s
>
30.82 s
> test result: FAILED. 0 passed; 1 failed; 0 ignored; 0 measured; 338 filtered out; finished in 0.02s
30.82 s
>
30.82 s
> stderr ---
30.82 s
>
30.82 s
> thread 'templates::tests::extract_templates_uses_canonical_package_layout' (876) panicked at crates/gammaloop-api/src/templates.rs:99:9:
30.82 s
> assertion failed: figure.contains("amplitude-mode")
30.82 s
> stack backtrace:
30.82 s
> 0: __rustc::rust_begin_unwind
30.82 s
> 1: core::panicking::panic_fmt
30.82 s
> 2: core::panicking::panic
30.82 s
> 3: gammaloop_api::templates::tests::extract_templates_uses_canonical_package_layout
30.82 s
> 4: <gammaloop_api::templates::tests::extract_templates_uses_canonical_package_layout::{closure#0} as core::ops::function::FnOnce<()>>::call_once
30.82 s
> note: Some details are omitted, run with `RUST_BACKTRACE=full` for a verbose backtrace.
30.82 s
>
30.82 s
> error : test run failed
30.82 s
>
30.82 s
> ========== nextest test summary ==========
30.82 s
> report: target/nextest/ci_gammaloop/junit.xml
30.82 s
> tests: 339, failures: 2, errors: 0
30.82 s
>
30.82 s
> 1. gammaloop-api::repl::tests::completion_shows_type_hint_for_non_boolean_settings_leaf
30.82 s
> failure: test failure with exit code 101
30.82 s
> thread 'repl::tests::completion_shows_type_hint_for_non_boolean_settings_leaf' (778) panicked at crates/gammaloop-api/src/repl.rs:5778:9:
30.82 s
> [Suggestion { value: "", description: Some("Number of samples in the first Monte Carlo iteration."), style: None, extra: None, span: Span { start: 42, end: 42 }, append_whitespace: false }]
30.82 s
> stack backtrace:
30.82 s
> 0: __rustc::rust_begin_unwind
30.82 s
> 1: core::panicking::panic_fmt
30.82 s
> 2: gammaloop_api::repl::tests::completion_shows_type_hint_for_non_boolean_settings_leaf
30.82 s
> 3: <gammaloop_api::repl::tests::completion_shows_type_hint_for_non_boolean_settings_leaf::{closure#0} as core::ops::function::FnOnce<()>>::call_once
30.82 s
> note: Some details are omitted, run with `RUST_BACKTRACE=full` for a verbose backtrace.
30.82 s
> system-out
30.82 s
> running 1 test
30.82 s
> test repl::tests::completion_shows_type_hint_for_non_boolean_settings_leaf ... FAILED
30.82 s
>
30.82 s
> failures:
30.82 s
>
30.82 s
> failures:
30.82 s
> repl::tests::completion_shows_type_hint_for_non_boolean_settings_leaf
30.82 s
>
30.82 s
> test result: FAILED. 0 passed; 1 failed; 0 ignored; 0 measured; 338 filtered out; finished in 0.01s
30.82 s
> system-err
30.82 s
> thread 'repl::tests::completion_shows_type_hint_for_non_boolean_settings_leaf' (778) panicked at crates/gammaloop-api/src/repl.rs:5778:9:
30.82 s
> [Suggestion { value: "", description: Some("Number of samples in the first Monte Carlo iteration."), style: None, extra: None, span: Span { start: 42, end: 42 }, append_whitespace: false }]
30.82 s
> stack backtrace:
30.82 s
> 0: __rustc::rust_begin_unwind
30.82 s
> 1: core::panicking::panic_fmt
30.82 s
> 2: gammaloop_api::repl::tests::completion_shows_type_hint_for_non_boolean_settings_leaf
30.82 s
> 3: <gammaloop_api::repl::tests::completion_shows_type_hint_for_non_boolean_settings_leaf::{closure#0} as core::ops::function::FnOnce<()>>::call_once
30.82 s
> note: Some details are omitted, run with `RUST_BACKTRACE=full` for a verbose backtrace.
30.82 s
>
30.82 s
> 2. gammaloop-api::templates::tests::extract_templates_uses_canonical_package_layout
30.82 s
> failure: test failure with exit code 101
30.82 s
> thread 'templates::tests::extract_templates_uses_canonical_package_layout' (876) panicked at crates/gammaloop-api/src/templates.rs:99:9:
30.82 s
> assertion failed: figure.contains("amplitude-mode")
30.82 s
> stack backtrace:
30.82 s
> 0: __rustc::rust_begin_unwind
30.82 s
> 1: core::panicking::panic_fmt
30.82 s
> 2: core::panicking::panic
30.82 s
> 3: gammaloop_api::templates::tests::extract_templates_uses_canonical_package_layout
30.82 s
> 4: <gammaloop_api::templates::tests::extract_templates_uses_canonical_package_layout::{closure#0} as core::ops::function::FnOnce<()>>::call_once
30.82 s
> note: Some details are omitted, run with `RUST_BACKTRACE=full` for a verbose backtrace.
30.82 s
> system-out
30.82 s
> running 1 test
30.82 s
> test templates::tests::extract_templates_uses_canonical_package_layout ... FAILED
30.82 s
>
30.82 s
> failures:
30.82 s
>
30.82 s
> failures:
30.82 s
> templates::tests::extract_templates_uses_canonical_package_layout
30.82 s
>
30.82 s
> test result: FAILED. 0 passed; 1 failed; 0 ignored; 0 measured; 338 filtered out; finished in 0.02s
30.82 s
> system-err
30.82 s
> thread 'templates::tests::extract_templates_uses_canonical_package_layout' (876) panicked at crates/gammaloop-api/src/templates.rs:99:9:
30.82 s
> assertion failed: figure.contains("amplitude-mode")
30.82 s
> stack backtrace:
30.82 s
> 0: __rustc::rust_begin_unwind
30.82 s
> 1: core::panicking::panic_fmt
30.82 s
> 2: core::panicking::panic
30.82 s
> 3: gammaloop_api::templates::tests::extract_templates_uses_canonical_package_layout
30.82 s
> 4: <gammaloop_api::templates::tests::extract_templates_uses_canonical_package_layout::{closure#0} as core::ops::function::FnOnce<()>>::call_once
30.82 s
> note: Some details are omitted, run with `RUST_BACKTRACE=full` for a verbose backtrace.
30.82 s
> =========================================
30.82 s
> Extracting 1 binary and 1 linked path to /build/source
30.82 s
> Extracted 7 files to /build/source in 0.07s
30.82 s
> ------------
30.82 s
> Nextest run ID e7d3d1f5-afef-44df-baaf-91cad84a6449 with nextest profile: ci_gammaloop
30.82 s
> Starting 19 tests across 1 binary
30.82 s
> ------------
30.82 s
> Summary [ 0.013s] 19 tests run: 19 passed , 0 skipped
30.82 s
>
30.82 s
> ========== nextest test summary ==========
30.82 s
> report: target/nextest/ci_gammaloop/junit.xml
30.82 s
> tests: 19, failures: 0, errors: 0
30.82 s
> No failing testcases found.
30.82 s
> =========================================
30.82 s
> Extracting 1 binary to /build/source
30.82 s
> Extracted 4 files to /build/source in 0.04s
30.82 s
> ------------
30.82 s
> Nextest run ID cc420566-0c3a-48c6-8131-41348c035b79 with nextest profile: ci_gammaloop
30.82 s
> Starting 0 tests across 1 binary
30.82 s
> ------------
30.82 s
> Summary [ 0.000s] 0 tests run: 0 passed , 0 skipped
30.82 s
>
30.82 s
> ========== nextest test summary ==========
30.82 s
> report: target/nextest/ci_gammaloop/junit.xml
30.82 s
> tests: 0, failures: 0, errors: 0
30.82 s
> No failing testcases found.
30.82 s
> =========================================
30.82 s
> Extracting 4 binaries, 1 build script output directory, and 2 linked paths to /build/source
30.82 s
> Extracted 18 files to /build/source in 0.44s
30.82 s
> ------------
30.82 s
> Nextest run ID b48d0cbe-0a1a-474c-b19f-6279862b89a1 with nextest profile: ci_gammaloop
30.82 s
> Starting 456 tests across 4 binaries (61 tests skipped , including 60 tests via profile.ci_gammaloop.default-filter )
30.82 s
> FAIL [ 0.260s] (161/456) gammalooprs graph::parse::tests :: parse_lmbsetting_crossection
30.82 s
> stdout ---
30.82 s
>
30.82 s
> running 1 test
30.82 s
> ━━━━━━━━━━━━━━━━━━━━━━━━━━━━━━━ Snapshot Summary ━━━━━━━━━━━━━━━━━━━━━━━━━━━━━━━
30.82 s
> Snapshot: parse_lmbsetting_crossection
30.82 s
> Source: crates/gammalooprs/src/graph/parse/tests.rs:252
30.82 s
> ────────────────────────────────────────────────────────────────────────────────
30.82 s
> Expression: g.debug_dot()
30.82 s
> ────────────────────────────────────────────────────────────────────────────────
30.82 s
> -old snapshot
30.82 s
> +new results
30.82 s
> ────────────┬───────────────────────────────────────────────────────────────────
30.82 s
> 1 │-digraph G{
30.82 s
> 1 │+digraph G {
30.82 s
> 2 2 │ num = "1/2";
30.82 s
> 3 3 │ overall_factor = "2*x";
30.82 s
> 4 4 │ overall_factor_evaluated = "2*x";
30.82 s
> 5 5 │ projector = "spenso::t";
30.82 s
> ────────────┴───────────────────────────────────────────────────────────────────
30.82 s
> To update snapshots run `cargo insta review`
30.82 s
> Stopped on the first failure. Run `cargo insta test` to run all snapshots.
30.82 s
> test graph::parse::tests::parse_lmbsetting_crossection ... FAILED
30.82 s
>
30.82 s
> failures:
30.82 s
>
30.82 s
> failures:
30.82 s
> graph::parse::tests::parse_lmbsetting_crossection
30.82 s
>
30.82 s
> test result: FAILED. 0 passed; 1 failed; 0 ignored; 0 measured; 508 filtered out; finished in 0.25s
30.82 s
>
30.82 s
> stderr ---
30.82 s
> [22:03:32.134] @gammalooprs::graph::attribute_warnings WARNING : Unknown node attribute 'color_num' on graph 'G', node 'A'; did you mean 'num'?
30.82 s
> at crates/gammalooprs/src/graph/attribute_warnings.rs:198
30.82 s
> The application panicked (crashed).
30.82 s
> Message: snapshot assertion for 'parse_lmbsetting_crossection' failed in line 252
30.82 s
> Location: /nix/store/xdy1vvhll2bijdplvl9fcc2b9plkxhaa-vendor-cargo-deps/c19b7c6f923b580ac259164a89f2577984ad5ab09ee9d583b888f934adbbe8d0/insta-1.47.2/src/runtime.rs :719
30.82 s
>
30.82 s
> ━━━━━━━━━━━━━━━━━━━━━━━━━━━━━━━━━━ BACKTRACE ━━━━━━━━━━━━━━━━━━━━━━━━━━━━━━━━━━━
30.82 s
> 1: <color_eyre[b0c9e66060e883b2]::config::PanicHook>::panic_report <unknown>
30.82 s
> at <unknown source file> :<unknown line>
30.82 s
> 2: <color_eyre[b0c9e66060e883b2]::config::PanicHook>::into_panic_hook::{closure#0} <unknown>
30.82 s
> at <unknown source file> :<unknown line>
30.82 s
> 3: std[bcb96dfbba0ab899]::panicking::panic_with_hook <unknown>
30.82 s
> at <unknown source file> :<unknown line>
30.82 s
> 4: std[bcb96dfbba0ab899]::panicking::panic_handler::{closure#0} <unknown>
30.82 s
> at <unknown source file> :<unknown line>
30.82 s
> 5: std[bcb96dfbba0ab899]::sys::backtrace::__rust_end_short_backtrace::<std[bcb96dfbba0ab899]::panicking::panic_handler::{closure#0}, !> <unknown>
30.82 s
> at <unknown source file> :<unknown line>
30.82 s
> 6: __rustc[6c289b9f9c454d21]::rust_begin_unwind <unknown>
30.82 s
> at <unknown source file> :<unknown line>
30.82 s
> 7: core[940e698046960fd5]::panicking::panic_fmt <unknown>
30.82 s
> at <unknown source file> :<unknown line>
30.82 s
> 8: insta[307a548ac79ef4d9]::runtime::assert_snapshot <unknown>
30.82 s
> at <unknown source file> :<unknown line>
30.82 s
> 9: gammalooprs[5490727360442cce]::graph::parse::tests::parse_lmbsetting_crossection <unknown>
30.82 s
> at <unknown source file> :<unknown line>
30.82 s
> 10: <gammalooprs[5490727360442cce]::graph::parse::tests::parse_lmbsetting_crossection::{closure#0} as core[940e698046960fd5]::ops::function::FnOnce<()>>::call_once <unknown>
30.82 s
> at <unknown source file> :<unknown line>
30.82 s
> 11: test[75d6903177b1d7e9]::__rust_begin_short_backtrace::<core[940e698046960fd5]::result::Result<(), alloc[2ea6bcb46fca0c42]::string::String>, fn() -> core[940e698046960fd5]::result::Result<(), alloc[2ea6bcb46fca0c42]::string::String>> <unknown>
30.82 s
> at <unknown source file> :<unknown line>
30.82 s
> 12: test[75d6903177b1d7e9]::run_test::{closure#0} <unknown>
30.82 s
> at <unknown source file> :<unknown line>
30.82 s
> 13: std[bcb96dfbba0ab899]::sys::backtrace::__rust_begin_short_backtrace::<test[75d6903177b1d7e9]::run_test::{closure#1}, ()> <unknown>
30.82 s
> at <unknown source file> :<unknown line>
30.82 s
> 14: <std[bcb96dfbba0ab899]::thread::lifecycle::spawn_unchecked<test[75d6903177b1d7e9]::run_test::{closure#1}, ()>::{closure#1} as core[940e698046960fd5]::ops::function::FnOnce<()>>::call_once::{shim:vtable#0} <unknown>
30.82 s
> at <unknown source file> :<unknown line>
30.82 s
> 15: <std[bcb96dfbba0ab899]::sys::thread::unix::Thread>::new::thread_start <unknown>
30.82 s
> at <unknown source file> :<unknown line>
30.82 s
> 16: start_thread <unknown>
30.82 s
> at <unknown source file> :<unknown line>
30.82 s
> 17: __clone3 <unknown>
30.82 s
> at <unknown source file> :<unknown line>
30.82 s
>
30.82 s
> Run with COLORBT_SHOW_HIDDEN=1 environment variable to disable frame filtering.
30.82 s
> Run with RUST_BACKTRACE=full to include source snippets.
30.82 s
>
30.82 s
> FAIL [ 0.086s] (407/456) gammalooprs uv::export::tests :: computed_node_full_numerator_is_a_spenso_aware_typst_fragment
30.82 s
> stdout ---
30.82 s
>
30.82 s
> running 1 test
30.82 s
> test uv::export::tests::computed_node_full_numerator_is_a_spenso_aware_typst_fragment ... FAILED
30.82 s
>
30.82 s
> failures:
30.82 s
>
30.82 s
> failures:
30.82 s
> uv::export::tests::computed_node_full_numerator_is_a_spenso_aware_typst_fragment
30.82 s
>
30.82 s
> test result: FAILED. 0 passed; 1 failed; 0 ignored; 0 measured; 508 filtered out; finished in 0.07s
30.82 s
>
30.82 s
> stderr ---
30.82 s
> The application panicked (crashed).
30.82 s
> Message: assertion failed: exported.dot.contains(r#"full_num = "op(\"Tr\")(1)";"#)
30.82 s
> Location: crates/gammalooprs/src/uv/export.rs :483
30.82 s
>
30.82 s
> ━━━━━━━━━━━━━━━━━━━━━━━━━━━━━━━━━━ BACKTRACE ━━━━━━━━━━━━━━━━━━━━━━━━━━━━━━━━━━━
30.82 s
> 1: <color_eyre[b0c9e66060e883b2]::config::PanicHook>::panic_report <unknown>
30.82 s
> at <unknown source file> :<unknown line>
30.82 s
> 2: <color_eyre[b0c9e66060e883b2]::config::PanicHook>::into_panic_hook::{closure#0} <unknown>
30.82 s
> at <unknown source file> :<unknown line>
30.82 s
> 3: std[bcb96dfbba0ab899]::panicking::panic_with_hook <unknown>
30.82 s
> at <unknown source file> :<unknown line>
30.82 s
> 4: std[bcb96dfbba0ab899]::panicking::panic_handler::{closure#0} <unknown>
30.82 s
> at <unknown source file> :<unknown line>
30.82 s
> 5: std[bcb96dfbba0ab899]::sys::backtrace::__rust_end_short_backtrace::<std[bcb96dfbba0ab899]::panicking::panic_handler::{closure#0}, !> <unknown>
30.82 s
> at <unknown source file> :<unknown line>
30.82 s
> 6: __rustc[6c289b9f9c454d21]::rust_begin_unwind <unknown>
30.82 s
> at <unknown source file> :<unknown line>
30.82 s
> 7: core[940e698046960fd5]::panicking::panic_fmt <unknown>
30.82 s
> at <unknown source file> :<unknown line>
30.82 s
> 8: core[940e698046960fd5]::panicking::panic <unknown>
30.82 s
> at <unknown source file> :<unknown line>
30.82 s
> 9: gammalooprs[5490727360442cce]::uv::export::tests::computed_node_full_numerator_is_a_spenso_aware_typst_fragment <unknown>
30.82 s
> at <unknown source file> :<unknown line>
30.82 s
> 10: <gammalooprs[5490727360442cce]::uv::export::tests::computed_node_full_numerator_is_a_spenso_aware_typst_fragment::{closure#0} as core[940e698046960fd5]::ops::function::FnOnce<()>>::call_once <unknown>
30.82 s
> at <unknown source file> :<unknown line>
30.82 s
> 11: test[75d6903177b1d7e9]::__rust_begin_short_backtrace::<core[940e698046960fd5]::result::Result<(), alloc[2ea6bcb46fca0c42]::string::String>, fn() -> core[940e698046960fd5]::result::Result<(), alloc[2ea6bcb46fca0c42]::string::String>> <unknown>
30.82 s
> at <unknown source file> :<unknown line>
30.82 s
> 12: test[75d6903177b1d7e9]::run_test::{closure#0} <unknown>
30.82 s
> at <unknown source file> :<unknown line>
30.82 s
> 13: std[bcb96dfbba0ab899]::sys::backtrace::__rust_begin_short_backtrace::<test[75d6903177b1d7e9]::run_test::{closure#1}, ()> <unknown>
30.82 s
> at <unknown source file> :<unknown line>
30.82 s
> 14: <std[bcb96dfbba0ab899]::thread::lifecycle::spawn_unchecked<test[75d6903177b1d7e9]::run_test::{closure#1}, ()>::{closure#1} as core[940e698046960fd5]::ops::function::FnOnce<()>>::call_once::{shim:vtable#0} <unknown>
30.82 s
> at <unknown source file> :<unknown line>
30.82 s
> 15: <std[bcb96dfbba0ab899]::sys::thread::unix::Thread>::new::thread_start <unknown>
30.82 s
> at <unknown source file> :<unknown line>
30.82 s
> 16: start_thread <unknown>
30.82 s
> at <unknown source file> :<unknown line>
30.82 s
> 17: __clone3 <unknown>
30.82 s
> at <unknown source file> :<unknown line>
30.82 s
>
30.82 s
> Run with COLORBT_SHOW_HIDDEN=1 environment variable to disable frame filtering.
30.82 s
> Run with RUST_BACKTRACE=full to include source snippets.
30.82 s
>
30.82 s
> ------------
30.82 s
> Summary [ 9.243s] 456 tests run: 454 passed , 2 failed , 61 skipped
30.82 s
> FAIL [ 0.260s] (161/456) gammalooprs graph::parse::tests :: parse_lmbsetting_crossection
30.82 s
> stdout ---
30.82 s
>
30.82 s
> running 1 test
30.82 s
> ━━━━━━━━━━━━━━━━━━━━━━━━━━━━━━━ Snapshot Summary ━━━━━━━━━━━━━━━━━━━━━━━━━━━━━━━
30.82 s
> Snapshot: parse_lmbsetting_crossection
30.82 s
> Source: crates/gammalooprs/src/graph/parse/tests.rs:252
30.82 s
> ────────────────────────────────────────────────────────────────────────────────
30.82 s
> Expression: g.debug_dot()
30.82 s
> ────────────────────────────────────────────────────────────────────────────────
30.82 s
> -old snapshot
30.82 s
> +new results
30.82 s
> ────────────┬───────────────────────────────────────────────────────────────────
30.82 s
> 1 │-digraph G{
30.82 s
> 1 │+digraph G {
30.82 s
> 2 2 │ num = "1/2";
30.82 s
> 3 3 │ overall_factor = "2*x";
30.82 s
> 4 4 │ overall_factor_evaluated = "2*x";
30.82 s
> 5 5 │ projector = "spenso::t";
30.82 s
> ────────────┴───────────────────────────────────────────────────────────────────
30.82 s
> To update snapshots run `cargo insta review`
30.82 s
> Stopped on the first failure. Run `cargo insta test` to run all snapshots.
30.82 s
> test graph::parse::tests::parse_lmbsetting_crossection ... FAILED
30.82 s
>
30.82 s
> failures:
30.82 s
>
30.82 s
> failures:
30.82 s
> graph::parse::tests::parse_lmbsetting_crossection
30.82 s
>
30.82 s
> test result: FAILED. 0 passed; 1 failed; 0 ignored; 0 measured; 508 filtered out; finished in 0.25s
30.82 s
>
30.82 s
> stderr ---
30.82 s
> [22:03:32.134] @gammalooprs::graph::attribute_warnings WARNING : Unknown node attribute 'color_num' on graph 'G', node 'A'; did you mean 'num'?
30.82 s
> at crates/gammalooprs/src/graph/attribute_warnings.rs:198
30.82 s
> The application panicked (crashed).
30.82 s
> Message: snapshot assertion for 'parse_lmbsetting_crossection' failed in line 252
30.82 s
> Location: /nix/store/xdy1vvhll2bijdplvl9fcc2b9plkxhaa-vendor-cargo-deps/c19b7c6f923b580ac259164a89f2577984ad5ab09ee9d583b888f934adbbe8d0/insta-1.47.2/src/runtime.rs :719
30.82 s
>
30.82 s
> ━━━━━━━━━━━━━━━━━━━━━━━━━━━━━━━━━━ BACKTRACE ━━━━━━━━━━━━━━━━━━━━━━━━━━━━━━━━━━━
30.82 s
> 1: <color_eyre[b0c9e66060e883b2]::config::PanicHook>::panic_report <unknown>
30.82 s
> at <unknown source file> :<unknown line>
30.82 s
> 2: <color_eyre[b0c9e66060e883b2]::config::PanicHook>::into_panic_hook::{closure#0} <unknown>
30.82 s
> at <unknown source file> :<unknown line>
30.82 s
> 3: std[bcb96dfbba0ab899]::panicking::panic_with_hook <unknown>
30.82 s
> at <unknown source file> :<unknown line>
30.82 s
> 4: std[bcb96dfbba0ab899]::panicking::panic_handler::{closure#0} <unknown>
30.82 s
> at <unknown source file> :<unknown line>
30.82 s
> 5: std[bcb96dfbba0ab899]::sys::backtrace::__rust_end_short_backtrace::<std[bcb96dfbba0ab899]::panicking::panic_handler::{closure#0}, !> <unknown>
30.82 s
> at <unknown source file> :<unknown line>
30.82 s
> 6: __rustc[6c289b9f9c454d21]::rust_begin_unwind <unknown>
30.82 s
> at <unknown source file> :<unknown line>
30.82 s
> 7: core[940e698046960fd5]::panicking::panic_fmt <unknown>
30.82 s
> at <unknown source file> :<unknown line>
30.82 s
> 8: insta[307a548ac79ef4d9]::runtime::assert_snapshot <unknown>
30.82 s
> at <unknown source file> :<unknown line>
30.82 s
> 9: gammalooprs[5490727360442cce]::graph::parse::tests::parse_lmbsetting_crossection <unknown>
30.82 s
> at <unknown source file> :<unknown line>
30.82 s
> 10: <gammalooprs[5490727360442cce]::graph::parse::tests::parse_lmbsetting_crossection::{closure#0} as core[940e698046960fd5]::ops::function::FnOnce<()>>::call_once <unknown>
30.82 s
> at <unknown source file> :<unknown line>
30.82 s
> 11: test[75d6903177b1d7e9]::__rust_begin_short_backtrace::<core[940e698046960fd5]::result::Result<(), alloc[2ea6bcb46fca0c42]::string::String>, fn() -> core[940e698046960fd5]::result::Result<(), alloc[2ea6bcb46fca0c42]::string::String>> <unknown>
30.82 s
> at <unknown source file> :<unknown line>
30.82 s
> 12: test[75d6903177b1d7e9]::run_test::{closure#0} <unknown>
30.82 s
> at <unknown source file> :<unknown line>
30.82 s
> 13: std[bcb96dfbba0ab899]::sys::backtrace::__rust_begin_short_backtrace::<test[75d6903177b1d7e9]::run_test::{closure#1}, ()> <unknown>
30.82 s
> at <unknown source file> :<unknown line>
30.82 s
> 14: <std[bcb96dfbba0ab899]::thread::lifecycle::spawn_unchecked<test[75d6903177b1d7e9]::run_test::{closure#1}, ()>::{closure#1} as core[940e698046960fd5]::ops::function::FnOnce<()>>::call_once::{shim:vtable#0} <unknown>
30.82 s
> at <unknown source file> :<unknown line>
30.82 s
> 15: <std[bcb96dfbba0ab899]::sys::thread::unix::Thread>::new::thread_start <unknown>
30.82 s
> at <unknown source file> :<unknown line>
30.82 s
> 16: start_thread <unknown>
30.82 s
> at <unknown source file> :<unknown line>
30.82 s
> 17: __clone3 <unknown>
30.82 s
> at <unknown source file> :<unknown line>
30.82 s
>
30.82 s
> Run with COLORBT_SHOW_HIDDEN=1 environment variable to disable frame filtering.
30.82 s
> Run with RUST_BACKTRACE=full to include source snippets.
30.82 s
>
30.82 s
> FAIL [ 0.086s] (407/456) gammalooprs uv::export::tests :: computed_node_full_numerator_is_a_spenso_aware_typst_fragment
30.82 s
> stdout ---
30.82 s
>
30.82 s
> running 1 test
30.82 s
> test uv::export::tests::computed_node_full_numerator_is_a_spenso_aware_typst_fragment ... FAILED
30.82 s
>
30.82 s
> failures:
30.82 s
>
30.82 s
> failures:
30.82 s
> uv::export::tests::computed_node_full_numerator_is_a_spenso_aware_typst_fragment
30.82 s
>
30.82 s
> test result: FAILED. 0 passed; 1 failed; 0 ignored; 0 measured; 508 filtered out; finished in 0.07s
30.82 s
>
30.82 s
> stderr ---
30.82 s
> The application panicked (crashed).
30.83 s
> Message: assertion failed: exported.dot.contains(r#"full_num = "op(\"Tr\")(1)";"#)
30.83 s
> Location: crates/gammalooprs/src/uv/export.rs :483
30.83 s
>
30.83 s
> ━━━━━━━━━━━━━━━━━━━━━━━━━━━━━━━━━━ BACKTRACE ━━━━━━━━━━━━━━━━━━━━━━━━━━━━━━━━━━━
30.83 s
> 1: <color_eyre[b0c9e66060e883b2]::config::PanicHook>::panic_report <unknown>
30.83 s
> at <unknown source file> :<unknown line>
30.83 s
> 2: <color_eyre[b0c9e66060e883b2]::config::PanicHook>::into_panic_hook::{closure#0} <unknown>
30.83 s
> at <unknown source file> :<unknown line>
30.83 s
> 3: std[bcb96dfbba0ab899]::panicking::panic_with_hook <unknown>
30.83 s
> at <unknown source file> :<unknown line>
30.83 s
> 4: std[bcb96dfbba0ab899]::panicking::panic_handler::{closure#0} <unknown>
30.83 s
> at <unknown source file> :<unknown line>
30.83 s
> 5: std[bcb96dfbba0ab899]::sys::backtrace::__rust_end_short_backtrace::<std[bcb96dfbba0ab899]::panicking::panic_handler::{closure#0}, !> <unknown>
30.83 s
> at <unknown source file> :<unknown line>
30.83 s
> 6: __rustc[6c289b9f9c454d21]::rust_begin_unwind <unknown>
30.83 s
> at <unknown source file> :<unknown line>
30.83 s
> 7: core[940e698046960fd5]::panicking::panic_fmt <unknown>
30.83 s
> at <unknown source file> :<unknown line>
30.83 s
> 8: core[940e698046960fd5]::panicking::panic <unknown>
30.83 s
> at <unknown source file> :<unknown line>
30.83 s
> 9: gammalooprs[5490727360442cce]::uv::export::tests::computed_node_full_numerator_is_a_spenso_aware_typst_fragment <unknown>
30.83 s
> at <unknown source file> :<unknown line>
30.83 s
> 10: <gammalooprs[5490727360442cce]::uv::export::tests::computed_node_full_numerator_is_a_spenso_aware_typst_fragment::{closure#0} as core[940e698046960fd5]::ops::function::FnOnce<()>>::call_once <unknown>
30.83 s
> at <unknown source file> :<unknown line>
30.83 s
> 11: test[75d6903177b1d7e9]::__rust_begin_short_backtrace::<core[940e698046960fd5]::result::Result<(), alloc[2ea6bcb46fca0c42]::string::String>, fn() -> core[940e698046960fd5]::result::Result<(), alloc[2ea6bcb46fca0c42]::string::String>> <unknown>
30.83 s
> at <unknown source file> :<unknown line>
30.83 s
> 12: test[75d6903177b1d7e9]::run_test::{closure#0} <unknown>
30.83 s
> at <unknown source file> :<unknown line>
30.83 s
> 13: std[bcb96dfbba0ab899]::sys::backtrace::__rust_begin_short_backtrace::<test[75d6903177b1d7e9]::run_test::{closure#1}, ()> <unknown>
30.83 s
> at <unknown source file> :<unknown line>
30.83 s
> 14: <std[bcb96dfbba0ab899]::thread::lifecycle::spawn_unchecked<test[75d6903177b1d7e9]::run_test::{closure#1}, ()>::{closure#1} as core[940e698046960fd5]::ops::function::FnOnce<()>>::call_once::{shim:vtable#0} <unknown>
30.83 s
> at <unknown source file> :<unknown line>
30.83 s
> 15: <std[bcb96dfbba0ab899]::sys::thread::unix::Thread>::new::thread_start <unknown>
30.83 s
> at <unknown source file> :<unknown line>
30.83 s
> 16: start_thread <unknown>
30.83 s
> at <unknown source file> :<unknown line>
30.83 s
> 17: __clone3 <unknown>
30.83 s
> at <unknown source file> :<unknown line>
30.83 s
>
30.83 s
> Run with COLORBT_SHOW_HIDDEN=1 environment variable to disable frame filtering.
30.83 s
> Run with RUST_BACKTRACE=full to include source snippets.
30.83 s
>
30.83 s
> error : test run failed
30.83 s
>
30.83 s
> ========== nextest test summary ==========
30.83 s
> report: target/nextest/ci_gammaloop/junit.xml
30.83 s
> tests: 456, failures: 2, errors: 0
30.83 s
>
30.83 s
> 1. gammalooprs::graph::parse::tests::parse_lmbsetting_crossection
30.83 s
> failure: test failure with exit code 101
30.83 s
> system-out
30.83 s
> running 1 test
30.83 s
> ━━━━━━━━━━━━━━━━━━━━━━━━━━━━━━━ Snapshot Summary ━━━━━━━━━━━━━━━━━━━━━━━━━━━━━━━
30.83 s
> Snapshot: parse_lmbsetting_crossection
30.83 s
> Source: crates/gammalooprs/src/graph/parse/tests.rs:252
30.83 s
> ────────────────────────────────────────────────────────────────────────────────
30.83 s
> Expression: g.debug_dot()
30.83 s
> ────────────────────────────────────────────────────────────────────────────────
30.83 s
> -old snapshot
30.83 s
> +new results
30.83 s
> ────────────┬───────────────────────────────────────────────────────────────────
30.83 s
> 1 │-digraph G{
30.83 s
> 1 │+digraph G {
30.83 s
> 2 2 │ num = "1/2";
30.83 s
> 3 3 │ overall_factor = "2*x";
30.83 s
> 4 4 │ overall_factor_evaluated = "2*x";
30.83 s
> 5 5 │ projector = "spenso::t";
30.83 s
> ────────────┴───────────────────────────────────────────────────────────────────
30.83 s
> To update snapshots run `cargo insta review`
30.83 s
> Stopped on the first failure. Run `cargo insta test` to run all snapshots.
30.83 s
> test graph::parse::tests::parse_lmbsetting_crossection ... FAILED
30.83 s
>
30.83 s
> failures:
30.83 s
>
30.83 s
> failures:
30.83 s
> graph::parse::tests::parse_lmbsetting_crossection
30.83 s
>
30.83 s
> test result: FAILED. 0 passed; 1 failed; 0 ignored; 0 measured; 508 filtered out; finished in 0.25s
30.83 s
> system-err
30.83 s
> [22:03:32.134] @gammalooprs::graph::attribute_warnings WARNING : Unknown node attribute 'color_num' on graph 'G', node 'A'; did you mean 'num'?
30.83 s
> at crates/gammalooprs/src/graph/attribute_warnings.rs:198
30.83 s
> The application panicked (crashed).
30.83 s
> Message: snapshot assertion for 'parse_lmbsetting_crossection' failed in line 252
30.83 s
> Location: /nix/store/xdy1vvhll2bijdplvl9fcc2b9plkxhaa-vendor-cargo-deps/c19b7c6f923b580ac259164a89f2577984ad5ab09ee9d583b888f934adbbe8d0/insta-1.47.2/src/runtime.rs:719
30.83 s
>
30.83 s
> ━━━━━━━━━━━━━━━━━━━━━━━━━━━━━━━━━━ BACKTRACE ━━━━━━━━━━━━━━━━━━━━━━━━━━━━━━━━━━━
30.83 s
> 1: <color_eyre[b0c9e66060e883b2]::config::PanicHook>::panic_report<unknown>
30.83 s
> at <unknown source file>:<unknown line>
30.83 s
> 2: <color_eyre[b0c9e66060e883b2]::config::PanicHook>::into_panic_hook::{closure#0}<unknown>
30.83 s
> at <unknown source file>:<unknown line>
30.83 s
> 3: std[bcb96dfbba0ab899]::panicking::panic_with_hook<unknown>
30.83 s
> at <unknown source file>:<unknown line>
30.83 s
> 4: std[bcb96dfbba0ab899]::panicking::panic_handler::{closure#0}<unknown>
30.83 s
> at <unknown source file>:<unknown line>
30.83 s
> 5: std[bcb96dfbba0ab899]::sys::backtrace::__rust_end_short_backtrace::<std[bcb96dfbba0ab899]::panicking::panic_handler::{closure#0}, !><unknown>
30.83 s
> at <unknown source file>:<unknown line>
30.83 s
> 6: __rustc[6c289b9f9c454d21]::rust_begin_unwind<unknown>
30.83 s
> at <unknown source file>:<unknown line>
30.83 s
> 7: core[940e698046960fd5]::panicking::panic_fmt<unknown>
30.83 s
> at <unknown source file>:<unknown line>
30.83 s
> 8: insta[307a548ac79ef4d9]::runtime::assert_snapshot<unknown>
30.83 s
> at <unknown source file>:<unknown line>
30.83 s
> 9: gammalooprs[5490727360442cce]::graph::parse::tests::parse_lmbsetting_crossection<unknown>
30.83 s
> at <unknown source file>:<unknown line>
30.83 s
> 10: <gammalooprs[5490727360442cce]::graph::parse::tests::parse_lmbsetting_crossection::{closure#0} as core[940e698046960fd5]::ops::function::FnOnce<()>>::call_once<unknown>
30.83 s
> at <unknown source file>:<unknown line>
30.83 s
> 11: test[75d6903177b1d7e9]::__rust_begin_short_backtrace::<core[940e698046960fd5]::result::Result<(), alloc[2ea6bcb46fca0c42]::string::String>, fn() -> core[940e698046960fd5]::result::Result<(), alloc[2ea6bcb46fca0c42]::string::String>><unknown>
30.83 s
> at <unknown source file>:<unknown line>
30.83 s
> 12: test[75d6903177b1d7e9]::run_test::{closure#0}<unknown>
30.83 s
> at <unknown source file>:<unknown line>
30.83 s
> 13: std[bcb96dfbba0ab899]::sys::backtrace::__rust_begin_short_backtrace::<test[75d6903177b1d7e9]::run_test::{closure#1}, ()><unknown>
30.83 s
> at <unknown source file>:<unknown line>
30.83 s
> 14: <std[bcb96dfbba0ab899]::thread::lifecycle::spawn_unchecked<test[75d6903177b1d7e9]::run_test::{closure#1}, ()>::{closure#1} as core[940e698046960fd5]::ops::function::FnOnce<()>>::call_once::{shim:vtable#0}<unknown>
30.83 s
> at <unknown source file>:<unknown line>
30.83 s
> 15: <std[bcb96dfbba0ab899]::sys::thread::unix::Thread>::new::thread_start<unknown>
30.83 s
> at <unknown source file>:<unknown line>
30.83 s
> 16: start_thread<unknown>
30.83 s
> at <unknown source file>:<unknown line>
30.83 s
> 17: __clone3<unknown>
30.83 s
> at <unknown source file>:<unknown line>
30.83 s
>
30.83 s
> Run with COLORBT_SHOW_HIDDEN=1 environment variable to disable frame filtering.
30.83 s
> Run with RUST_BACKTRACE=full to include source snippets.
30.83 s
>
30.83 s
> 2. gammalooprs::uv::export::tests::computed_node_full_numerator_is_a_spenso_aware_typst_fragment
30.83 s
> failure: test failure with exit code 101
30.83 s
> system-out
30.83 s
> running 1 test
30.83 s
> test uv::export::tests::computed_node_full_numerator_is_a_spenso_aware_typst_fragment ... FAILED
30.83 s
>
30.83 s
> failures:
30.83 s
>
30.83 s
> failures:
30.83 s
> uv::export::tests::computed_node_full_numerator_is_a_spenso_aware_typst_fragment
30.83 s
>
30.83 s
> test result: FAILED. 0 passed; 1 failed; 0 ignored; 0 measured; 508 filtered out; finished in 0.07s
30.83 s
> system-err
30.83 s
> The application panicked (crashed).
30.83 s
> Message: assertion failed: exported.dot.contains(r#"full_num = "op(\"Tr\")(1)";"#)
30.83 s
> Location: crates/gammalooprs/src/uv/export.rs:483
30.83 s
>
30.83 s
> ━━━━━━━━━━━━━━━━━━━━━━━━━━━━━━━━━━ BACKTRACE ━━━━━━━━━━━━━━━━━━━━━━━━━━━━━━━━━━━
30.83 s
> 1: <color_eyre[b0c9e66060e883b2]::config::PanicHook>::panic_report<unknown>
30.83 s
> at <unknown source file>:<unknown line>
30.83 s
> 2: <color_eyre[b0c9e66060e883b2]::config::PanicHook>::into_panic_hook::{closure#0}<unknown>
30.83 s
> at <unknown source file>:<unknown line>
30.83 s
> 3: std[bcb96dfbba0ab899]::panicking::panic_with_hook<unknown>
30.83 s
> at <unknown source file>:<unknown line>
30.83 s
> 4: std[bcb96dfbba0ab899]::panicking::panic_handler::{closure#0}<unknown>
30.83 s
> at <unknown source file>:<unknown line>
30.83 s
> 5: std[bcb96dfbba0ab899]::sys::backtrace::__rust_end_short_backtrace::<std[bcb96dfbba0ab899]::panicking::panic_handler::{closure#0}, !><unknown>
30.83 s
> at <unknown source file>:<unknown line>
30.83 s
> 6: __rustc[6c289b9f9c454d21]::rust_begin_unwind<unknown>
30.83 s
> at <unknown source file>:<unknown line>
30.83 s
> 7: core[940e698046960fd5]::panicking::panic_fmt<unknown>
30.83 s
> at <unknown source file>:<unknown line>
30.83 s
> 8: core[940e698046960fd5]::panicking::panic<unknown>
30.83 s
> at <unknown source file>:<unknown line>
30.83 s
> 9: gammalooprs[5490727360442cce]::uv::export::tests::computed_node_full_numerator_is_a_spenso_aware_typst_fragment<unknown>
30.83 s
> at <unknown source file>:<unknown line>
30.83 s
> 10: <gammalooprs[5490727360442cce]::uv::export::tests::computed_node_full_numerator_is_a_spenso_aware_typst_fragment::{closure#0} as core[940e698046960fd5]::ops::function::FnOnce<()>>::call_once<unknown>
30.83 s
> at <unknown source file>:<unknown line>
30.83 s
> 11: test[75d6903177b1d7e9]::__rust_begin_short_backtrace::<core[940e698046960fd5]::result::Result<(), alloc[2ea6bcb46fca0c42]::string::String>, fn() -> core[940e698046960fd5]::result::Result<(), alloc[2ea6bcb46fca0c42]::string::String>><unknown>
30.83 s
> at <unknown source file>:<unknown line>
30.83 s
> 12: test[75d6903177b1d7e9]::run_test::{closure#0}<unknown>
30.83 s
> at <unknown source file>:<unknown line>
30.83 s
> 13: std[bcb96dfbba0ab899]::sys::backtrace::__rust_begin_short_backtrace::<test[75d6903177b1d7e9]::run_test::{closure#1}, ()><unknown>
30.83 s
> at <unknown source file>:<unknown line>
30.83 s
> 14: <std[bcb96dfbba0ab899]::thread::lifecycle::spawn_unchecked<test[75d6903177b1d7e9]::run_test::{closure#1}, ()>::{closure#1} as core[940e698046960fd5]::ops::function::FnOnce<()>>::call_once::{shim:vtable#0}<unknown>
30.83 s
> at <unknown source file>:<unknown line>
30.83 s
> 15: <std[bcb96dfbba0ab899]::sys::thread::unix::Thread>::new::thread_start<unknown>
30.83 s
> at <unknown source file>:<unknown line>
30.83 s
> 16: start_thread<unknown>
30.83 s
> at <unknown source file>:<unknown line>
30.83 s
> 17: __clone3<unknown>
30.83 s
> at <unknown source file>:<unknown line>
30.83 s
>
30.83 s
> Run with COLORBT_SHOW_HIDDEN=1 environment variable to disable frame filtering.
30.83 s
> Run with RUST_BACKTRACE=full to include source snippets.
30.83 s
> =========================================
30.83 s
For full logs, run:
30.83 s
nix log /nix/store/j0r373mhy6rmbqq05bplwn7cimlqrcnq-gammaloop-nextest-core.drv
30.93 s
[0 built (1 failed ), 0.0 Run failed.