1. 0.09 s $ /nix/store/9ypz3flqsrl5xl495mm8h645gadjsxi1-coreutils-9.11/bin/timeout --kill-after=15s 7200s /nix/store/23zk8sgzamrbmj1fday15szf7f2279s8-nix-2.34.7/bin/nix --extra-experimental-features nix-command --extra-experimental-features flakes flake clone git+https://github.com/alphal00p/gammaloop --dest /tmp/nix-ci-worker/stable-pwd/repo/
  2. 0.10 s Cloning into '/tmp/nix-ci-worker/stable-pwd/repo'...
  3. 1.47 s remote: Enumerating objects: 64191, done.
  4. 2.03 s remote: Counting objects: 0% (1/9557) remote: Counting objects: 1% (96/9557) remote: Counting objects: 2% (192/9557) remote: Counting objects: 3% (287/9557) remote: Counting objects: 4% (383/9557) remote: Counting objects: 5% (478/9557) remote: Counting objects: 6% (574/9557) remote: Counting objects: 7% (669/9557) remote: Counting objects: 8% (765/9557) remote: Counting objects: 9% (861/9557) remote: Counting objects: 10% (956/9557) remote: Counting objects: 11% (1052/9557) remote: Counting objects: 12% (1147/9557) remote: Counting objects: 13% (1243/9557) remote: Counting objects: 14% (1338/9557) remote: Counting objects: 15% (1434/9557) remote: Counting objects: 16% (1530/9557) remote: Counting objects: 17% (1625/9557) remote: Counting objects: 18% (1721/9557) remote: Counting objects: 19% (1816/9557) remote: Counting objects: 20% (1912/9557) remote: Counting objects: 21% (2007/9557) remote: Counting objects: 22% (2103/9557) remote: Counting objects: 23% (2199/9557) remote: Counting objects: 24% (2294/9557) remote: Counting objects: 25% (2390/9557) remote: Counting objects: 26% (2485/9557) remote: Counting objects: 27% (2581/9557) remote: Counting objects: 28% (2676/9557) remote: Counting objects: 29% (2772/9557) remote: Counting objects: 30% (2868/9557) remote: Counting objects: 31% (2963/9557) remote: Counting objects: 32% (3059/9557) remote: Counting objects: 33% (3154/9557) remote: Counting objects: 34% (3250/9557) remote: Counting objects: 35% (3345/9557) remote: Counting objects: 36% (3441/9557) remote: Counting objects: 37% (3537/9557) remote: Counting objects: 38% (3632/9557) remote: Counting objects: 39% (3728/9557) remote: Counting objects: 40% (3823/9557) remote: Counting objects: 41% (3919/9557) remote: Counting objects: 42% (4014/9557) remote: Counting objects: 43% (4110/9557) remote: Counting objects: 44% (4206/9557) remote: Counting objects: 45% (4301/9557) remote: Counting objects: 46% (4397/9557) remote: Counting objects: 47% (4492/9557) remote: Counting objects: 48% (4588/9557) remote: Counting objects: 49% (4683/9557) remote: Counting objects: 50% (4779/9557) remote: Counting objects: 51% (4875/9557) remote: Counting objects: 52% (4970/9557) remote: Counting objects: 53% (5066/9557) remote: Counting objects: 54% (5161/9557) remote: Counting objects: 55% (5257/9557) remote: Counting objects: 56% (5352/9557) remote: Counting objects: 57% (5448/9557) remote: Counting objects: 58% (5544/9557) remote: Counting objects: 59% (5639/9557) remote: Counting objects: 60% (5735/9557) remote: Counting objects: 61% (5830/9557) remote: Counting objects: 62% (5926/9557) remote: Counting objects: 63% (6021/9557) remote: Counting objects: 64% (6117/9557) remote: Counting objects: 65% (6213/9557) remote: Counting objects: 66% (6308/9557) remote: Counting objects: 67% (6404/9557) remote: Counting objects: 68% (6499/9557) remote: Counting objects: 69% (6595/9557) remote: Counting objects: 70% (6690/9557) remote: Counting objects: 71% (6786/9557) remote: Counting objects: 72% (6882/9557) remote: Counting objects: 73% (6977/9557) remote: Counting objects: 74% (7073/9557) remote: Counting objects: 75% (7168/9557) remote: Counting objects: 76% (7264/9557) remote: Counting objects: 77% (7359/9557) remote: Counting objects: 78% (7455/9557) remote: Counting objects: 79% (7551/9557) remote: Counting objects: 80% (7646/9557) remote: Counting objects: 81% (7742/9557) remote: Counting objects: 82% (7837/9557) remote: Counting objects: 83% (7933/9557) remote: Counting objects: 84% (8028/9557) remote: Counting objects: 85% (8124/9557) remote: Counting objects: 86% (8220/9557) remote: Counting objects: 87% (8315/9557) remote: Counting objects: 88% (8411/9557) remote: Counting objects: 89% (8506/9557) remote: Counting objects: 90% (8602/9557) remote: Counting objects: 91% (8697/9557) remote: Counting objects: 92% (8793/9557) remote: Counting objects: 93% (8889/9557) remote: Counting objects: 94% (8984/9557) remote: Counting objects: 95% (9080/9557) remote: Counting objects: 96% (9175/9557) remote: Counting objects: 97% (9271/9557) remote: Counting objects: 98% (9366/9557) remote: Counting objects: 99% (9462/9557) remote: Counting objects: 100% (9557/9557) remote: Counting objects: 100% (9557/9557), done.
  5. 3.89 s remote: Compressing objects: 0% (1/2331) remote: Compressing objects: 1% (24/2331) remote: Compressing objects: 2% (47/2331) remote: Compressing objects: 3% (70/2331) remote: Compressing objects: 4% (94/2331) remote: Compressing objects: 5% (117/2331) remote: Compressing objects: 6% (140/2331) remote: Compressing objects: 7% (164/2331) remote: Compressing objects: 8% (187/2331) remote: Compressing objects: 9% (210/2331) remote: Compressing objects: 10% (234/2331) remote: Compressing objects: 11% (257/2331) remote: Compressing objects: 12% (280/2331) remote: Compressing objects: 13% (304/2331) remote: Compressing objects: 14% (327/2331) remote: Compressing objects: 15% (350/2331) remote: Compressing objects: 16% (373/2331) remote: Compressing objects: 17% (397/2331) remote: Compressing objects: 18% (420/2331) remote: Compressing objects: 19% (443/2331) remote: Compressing objects: 20% (467/2331) remote: Compressing objects: 21% (490/2331) remote: Compressing objects: 22% (513/2331) remote: Compressing objects: 23% (537/2331) remote: Compressing objects: 23% (552/2331) remote: Compressing objects: 24% (560/2331) remote: Compressing objects: 25% (583/2331) remote: Compressing objects: 26% (607/2331) remote: Compressing objects: 27% (630/2331) remote: Compressing objects: 28% (653/2331) remote: Compressing objects: 29% (676/2331) remote: Compressing objects: 30% (700/2331) remote: Compressing objects: 31% (723/2331) remote: Compressing objects: 31% (733/2331) remote: Compressing objects: 32% (746/2331) remote: Compressing objects: 33% (770/2331) remote: Compressing objects: 34% (793/2331) remote: Compressing objects: 35% (816/2331) remote: Compressing objects: 36% (840/2331) remote: Compressing objects: 37% (863/2331) remote: Compressing objects: 38% (886/2331) remote: Compressing objects: 39% (910/2331) remote: Compressing objects: 40% (933/2331) remote: Compressing objects: 41% (956/2331) remote: Compressing objects: 42% (980/2331) remote: Compressing objects: 43% (1003/2331) remote: Compressing objects: 44% (1026/2331) remote: Compressing objects: 45% (1049/2331) remote: Compressing objects: 46% (1073/2331) remote: Compressing objects: 47% (1096/2331) remote: Compressing objects: 48% (1119/2331) remote: Compressing objects: 49% (1143/2331) remote: Compressing objects: 50% (1166/2331) remote: Compressing objects: 51% (1189/2331) remote: Compressing objects: 52% (1213/2331) remote: Compressing objects: 53% (1236/2331) remote: Compressing objects: 54% (1259/2331) remote: Compressing objects: 55% (1283/2331) remote: Compressing objects: 56% (1306/2331) remote: Compressing objects: 57% (1329/2331) remote: Compressing objects: 58% (1352/2331) remote: Compressing objects: 59% (1376/2331) remote: Compressing objects: 60% (1399/2331) remote: Compressing objects: 61% (1422/2331) remote: Compressing objects: 62% (1446/2331) remote: Compressing objects: 63% (1469/2331) remote: Compressing objects: 64% (1492/2331) remote: Compressing objects: 65% (1516/2331) remote: Compressing objects: 66% (1539/2331) remote: Compressing objects: 67% (1562/2331) remote: Compressing objects: 68% (1586/2331) remote: Compressing objects: 69% (1609/2331) remote: Compressing objects: 70% (1632/2331) remote: Compressing objects: 71% (1656/2331) remote: Compressing objects: 72% (1679/2331) remote: Compressing objects: 73% (1702/2331) remote: Compressing objects: 74% (1725/2331) remote: Compressing objects: 75% (1749/2331) remote: Compressing objects: 76% (1772/2331) remote: Compressing objects: 77% (1795/2331) remote: Compressing objects: 78% (1819/2331) remote: Compressing objects: 79% (1842/2331) remote: Compressing objects: 80% (1865/2331) remote: Compressing objects: 81% (1889/2331) remote: Compressing objects: 82% (1912/2331) remote: Compressing objects: 83% (1935/2331) remote: Compressing objects: 84% (1959/2331) remote: Compressing objects: 85% (1982/2331) remote: Compressing objects: 86% (2005/2331) remote: Compressing objects: 87% (2028/2331) remote: Compressing objects: 88% (2052/2331) remote: Compressing objects: 89% (2075/2331) remote: Compressing objects: 90% (2098/2331) remote: Compressing objects: 91% (2122/2331) remote: Compressing objects: 92% (2145/2331) remote: Compressing objects: 93% (2168/2331) remote: Compressing objects: 94% (2192/2331) remote: Compressing objects: 95% (2215/2331) remote: Compressing objects: 96% (2238/2331) remote: Compressing objects: 97% (2262/2331) remote: Compressing objects: 98% (2285/2331) remote: Compressing objects: 99% (2308/2331) remote: Compressing objects: 100% (2331/2331) remote: Compressing objects: 100% (2331/2331), done.
  6. 6.74 s Receiving objects: 0% (1/64191) Receiving objects: 1% (642/64191) Receiving objects: 2% (1284/64191) Receiving objects: 3% (1926/64191) Receiving objects: 4% (2568/64191) Receiving objects: 5% (3210/64191) Receiving objects: 6% (3852/64191) Receiving objects: 7% (4494/64191) Receiving objects: 8% (5136/64191) Receiving objects: 9% (5778/64191) Receiving objects: 10% (6420/64191) Receiving objects: 11% (7062/64191) Receiving objects: 12% (7703/64191) Receiving objects: 13% (8345/64191) Receiving objects: 14% (8987/64191) Receiving objects: 15% (9629/64191) Receiving objects: 16% (10271/64191), 15.25 MiB | 30.49 MiB/s Receiving objects: 17% (10913/64191), 15.25 MiB | 30.49 MiB/s Receiving objects: 18% (11555/64191), 15.25 MiB | 30.49 MiB/s Receiving objects: 19% (12197/64191), 15.25 MiB | 30.49 MiB/s Receiving objects: 20% (12839/64191), 15.25 MiB | 30.49 MiB/s Receiving objects: 21% (13481/64191), 15.25 MiB | 30.49 MiB/s Receiving objects: 22% (14123/64191), 15.25 MiB | 30.49 MiB/s Receiving objects: 23% (14764/64191), 15.25 MiB | 30.49 MiB/s Receiving objects: 24% (15406/64191), 15.25 MiB | 30.49 MiB/s Receiving objects: 25% (16048/64191), 15.25 MiB | 30.49 MiB/s Receiving objects: 26% (16690/64191), 15.25 MiB | 30.49 MiB/s Receiving objects: 27% (17332/64191), 15.25 MiB | 30.49 MiB/s Receiving objects: 28% (17974/64191), 15.25 MiB | 30.49 MiB/s Receiving objects: 29% (18616/64191), 15.25 MiB | 30.49 MiB/s Receiving objects: 30% (19258/64191), 15.25 MiB | 30.49 MiB/s Receiving objects: 31% (19900/64191), 15.25 MiB | 30.49 MiB/s Receiving objects: 32% (20542/64191), 15.25 MiB | 30.49 MiB/s Receiving objects: 33% (21184/64191), 15.25 MiB | 30.49 MiB/s Receiving objects: 34% (21825/64191), 15.25 MiB | 30.49 MiB/s Receiving objects: 35% (22467/64191), 15.25 MiB | 30.49 MiB/s Receiving objects: 36% (23109/64191), 15.25 MiB | 30.49 MiB/s Receiving objects: 37% (23751/64191), 15.25 MiB | 30.49 MiB/s Receiving objects: 38% (24393/64191), 15.25 MiB | 30.49 MiB/s Receiving objects: 39% (25035/64191), 15.25 MiB | 30.49 MiB/s Receiving objects: 40% (25677/64191), 15.25 MiB | 30.49 MiB/s Receiving objects: 41% (26319/64191), 15.25 MiB | 30.49 MiB/s Receiving objects: 42% (26961/64191), 15.25 MiB | 30.49 MiB/s Receiving objects: 43% (27603/64191), 15.25 MiB | 30.49 MiB/s Receiving objects: 44% (28245/64191), 15.25 MiB | 30.49 MiB/s Receiving objects: 45% (28886/64191), 15.25 MiB | 30.49 MiB/s Receiving objects: 46% (29528/64191), 15.25 MiB | 30.49 MiB/s Receiving objects: 47% (30170/64191), 15.25 MiB | 30.49 MiB/s Receiving objects: 48% (30812/64191), 15.25 MiB | 30.49 MiB/s Receiving objects: 49% (31454/64191), 15.25 MiB | 30.49 MiB/s Receiving objects: 50% (32096/64191), 15.25 MiB | 30.49 MiB/s Receiving objects: 51% (32738/64191), 15.25 MiB | 30.49 MiB/s Receiving objects: 52% (33380/64191), 15.25 MiB | 30.49 MiB/s Receiving objects: 52% (33603/64191), 15.25 MiB | 30.49 MiB/s Receiving objects: 53% (34022/64191), 33.83 MiB | 33.82 MiB/s Receiving objects: 54% (34664/64191), 33.83 MiB | 33.82 MiB/s Receiving objects: 55% (35306/64191), 33.83 MiB | 33.82 MiB/s Receiving objects: 56% (35947/64191), 33.83 MiB | 33.82 MiB/s Receiving objects: 57% (36589/64191), 33.83 MiB | 33.82 MiB/s Receiving objects: 58% (37231/64191), 33.83 MiB | 33.82 MiB/s Receiving objects: 59% (37873/64191), 33.83 MiB | 33.82 MiB/s Receiving objects: 60% (38515/64191), 33.83 MiB | 33.82 MiB/s Receiving objects: 61% (39157/64191), 33.83 MiB | 33.82 MiB/s Receiving objects: 62% (39799/64191), 33.83 MiB | 33.82 MiB/s Receiving objects: 63% (40441/64191), 33.83 MiB | 33.82 MiB/s Receiving objects: 64% (41083/64191), 33.83 MiB | 33.82 MiB/s Receiving objects: 65% (41725/64191), 33.83 MiB | 33.82 MiB/s Receiving objects: 66% (42367/64191), 33.83 MiB | 33.82 MiB/s Receiving objects: 67% (43008/64191), 33.83 MiB | 33.82 MiB/s Receiving objects: 68% (43650/64191), 51.37 MiB | 33.87 MiB/s Receiving objects: 69% (44292/64191), 51.37 MiB | 33.87 MiB/s Receiving objects: 70% (44934/64191), 51.37 MiB | 33.87 MiB/s Receiving objects: 71% (45576/64191), 51.37 MiB | 33.87 MiB/s Receiving objects: 72% (46218/64191), 51.37 MiB | 33.87 MiB/s Receiving objects: 73% (46860/64191), 51.37 MiB | 33.87 MiB/s Receiving objects: 74% (47502/64191), 51.37 MiB | 33.87 MiB/s Receiving objects: 75% (48144/64191), 51.37 MiB | 33.87 MiB/s Receiving objects: 76% (48786/64191), 51.37 MiB | 33.87 MiB/s Receiving objects: 76% (49164/64191), 51.37 MiB | 33.87 MiB/s Receiving objects: 77% (49428/64191), 51.37 MiB | 33.87 MiB/s Receiving objects: 78% (50069/64191), 70.27 MiB | 34.84 MiB/s Receiving objects: 79% (50711/64191), 70.27 MiB | 34.84 MiB/s Receiving objects: 80% (51353/64191), 70.27 MiB | 34.84 MiB/s Receiving objects: 81% (51995/64191), 70.27 MiB | 34.84 MiB/s Receiving objects: 82% (52637/64191), 70.27 MiB | 34.84 MiB/s Receiving objects: 83% (53279/64191), 70.27 MiB | 34.84 MiB/s Receiving objects: 84% (53921/64191), 70.27 MiB | 34.84 MiB/s Receiving objects: 85% (54563/64191), 70.27 MiB | 34.84 MiB/s Receiving objects: 86% (55205/64191), 86.89 MiB | 34.53 MiB/s Receiving objects: 87% (55847/64191), 86.89 MiB | 34.53 MiB/s Receiving objects: 88% (56489/64191), 86.89 MiB | 34.53 MiB/s Receiving objects: 89% (57130/64191), 86.89 MiB | 34.53 MiB/s Receiving objects: 90% (57772/64191), 86.89 MiB | 34.53 MiB/s Receiving objects: 91% (58414/64191), 86.89 MiB | 34.53 MiB/s Receiving objects: 92% (59056/64191), 86.89 MiB | 34.53 MiB/s Receiving objects: 93% (59698/64191), 86.89 MiB | 34.53 MiB/s Receiving objects: 94% (60340/64191), 86.89 MiB | 34.53 MiB/s Receiving objects: 95% (60982/64191), 86.89 MiB | 34.53 MiB/s Receiving objects: 96% (61624/64191), 86.89 MiB | 34.53 MiB/s Receiving objects: 97% (62266/64191), 86.89 MiB | 34.53 MiB/s Receiving objects: 98% (62908/64191), 86.89 MiB | 34.53 MiB/s Receiving objects: 99% (63550/64191), 86.89 MiB | 34.53 MiB/s remote: Total 64191 (delta 7402), reused 7778 (delta 6681), pack-reused 54634 (from 3)
  7. 6.75 s Receiving objects: 100% (64191/64191), 86.89 MiB | 34.53 MiB/s Receiving objects: 100% (64191/64191), 97.84 MiB | 34.39 MiB/s, done.
  8. 7.50 s Resolving deltas: 0% (0/44321) Resolving deltas: 1% (444/44321) Resolving deltas: 2% (887/44321) Resolving deltas: 3% (1330/44321) Resolving deltas: 4% (1774/44321) Resolving deltas: 5% (2217/44321) Resolving deltas: 6% (2661/44321) Resolving deltas: 7% (3103/44321) Resolving deltas: 8% (3546/44321) Resolving deltas: 9% (3993/44321) Resolving deltas: 10% (4433/44321) Resolving deltas: 11% (4876/44321) Resolving deltas: 12% (5319/44321) Resolving deltas: 13% (5762/44321) Resolving deltas: 14% (6205/44321) Resolving deltas: 15% (6651/44321) Resolving deltas: 16% (7093/44321) Resolving deltas: 17% (7535/44321) Resolving deltas: 18% (7979/44321) Resolving deltas: 19% (8421/44321) Resolving deltas: 20% (8865/44321) Resolving deltas: 21% (9309/44321) Resolving deltas: 22% (9751/44321) Resolving deltas: 23% (10194/44321) Resolving deltas: 24% (10638/44321) Resolving deltas: 25% (11081/44321) Resolving deltas: 26% (11524/44321) Resolving deltas: 27% (11967/44321) Resolving deltas: 28% (12410/44321) Resolving deltas: 29% (12854/44321) Resolving deltas: 30% (13298/44321) Resolving deltas: 31% (13741/44321) Resolving deltas: 32% (14183/44321) Resolving deltas: 33% (14627/44321) Resolving deltas: 34% (15070/44321) Resolving deltas: 35% (15513/44321) Resolving deltas: 36% (15956/44321) Resolving deltas: 37% (16400/44321) Resolving deltas: 38% (16842/44321) Resolving deltas: 39% (17286/44321) Resolving deltas: 40% (17729/44321) Resolving deltas: 41% (18172/44321) Resolving deltas: 42% (18616/44321) Resolving deltas: 43% (19059/44321) Resolving deltas: 44% (19502/44321) Resolving deltas: 45% (19945/44321) Resolving deltas: 46% (20389/44321) Resolving deltas: 47% (20831/44321) Resolving deltas: 48% (21275/44321) Resolving deltas: 49% (21718/44321) Resolving deltas: 50% (22161/44321) Resolving deltas: 51% (22604/44321) Resolving deltas: 52% (23048/44321) Resolving deltas: 53% (23491/44321) Resolving deltas: 54% (23934/44321) Resolving deltas: 55% (24379/44321) Resolving deltas: 56% (24820/44321) Resolving deltas: 57% (25264/44321) Resolving deltas: 58% (25707/44321) Resolving deltas: 59% (26150/44321) Resolving deltas: 60% (26593/44321) Resolving deltas: 61% (27036/44321) Resolving deltas: 62% (27480/44321) Resolving deltas: 63% (27924/44321) Resolving deltas: 64% (28366/44321) Resolving deltas: 65% (28809/44321) Resolving deltas: 66% (29252/44321) Resolving deltas: 67% (29696/44321) Resolving deltas: 68% (30139/44321) Resolving deltas: 69% (30582/44321) Resolving deltas: 70% (31026/44321) Resolving deltas: 71% (31468/44321) Resolving deltas: 72% (31912/44321) Resolving deltas: 73% (32355/44321) Resolving deltas: 74% (32798/44321) Resolving deltas: 75% (33244/44321) Resolving deltas: 76% (33684/44321) Resolving deltas: 77% (34128/44321) Resolving deltas: 78% (34571/44321) Resolving deltas: 79% (35014/44321) Resolving deltas: 80% (35457/44321) Resolving deltas: 81% (35901/44321) Resolving deltas: 82% (36344/44321) Resolving deltas: 83% (36787/44321) Resolving deltas: 84% (37230/44321) Resolving deltas: 85% (37673/44321) Resolving deltas: 86% (38117/44321) Resolving deltas: 87% (38560/44321) Resolving deltas: 88% (39003/44321) Resolving deltas: 89% (39447/44321) Resolving deltas: 90% (39889/44321) Resolving deltas: 91% (40333/44321) Resolving deltas: 92% (40776/44321) Resolving deltas: 93% (41219/44321) Resolving deltas: 94% (41662/44321) Resolving deltas: 95% (42105/44321) Resolving deltas: 96% (42549/44321) Resolving deltas: 97% (42993/44321) Resolving deltas: 98% (43435/44321) Resolving deltas: 99% (43878/44321) Resolving deltas: 100% (44321/44321) Resolving deltas: 100% (44321/44321), done.
  9. 7.81 s Fetching commit 3d241888b215b0c37d1e347e0c8ddcee728dacfb for push-vrpyqyylypmw ...
  10. 7.81 s $ /nix/store/bcnisk3ydfgv26v2gw3zlky24g00yww2-git-2.54.0/bin/git fetch origin 3d241888b215b0c37d1e347e0c8ddcee728dacfb
  11. 8.22 s From https://github.com/alphal00p/gammaloop
  12. 8.22 s * branch 3d241888b215b0c37d1e347e0c8ddcee728dacfb -> FETCH_HEAD
  13. 8.23 s $ /nix/store/9ypz3flqsrl5xl495mm8h645gadjsxi1-coreutils-9.11/bin/timeout --kill-after=15s 7200s /nix/store/bcnisk3ydfgv26v2gw3zlky24g00yww2-git-2.54.0/bin/git -c advice.detachedHead=false checkout 3d241888b215b0c37d1e347e0c8ddcee728dacfb
  14. 8.45 s HEAD is now at 3d241888 run documentation tests through the Nix CI secret runner
  15. 8.45 s $ /nix/store/9ypz3flqsrl5xl495mm8h645gadjsxi1-coreutils-9.11/bin/timeout --kill-after=15s 7200s /nix/store/23zk8sgzamrbmj1fday15szf7f2279s8-nix-2.34.7/bin/nix --extra-experimental-features nix-command --extra-experimental-features flakes --log-format internal-json run .#packages.x86_64-linux.nix-ci-check-gammaloop-nextest-core --print-build-logs
  16. 12.69 s
  17. 12.94 s Downloading cached gammaloop-nextest-binaries-core-gammaloop-api from https://cache.nix-ci.com
  18. 12.95 s Downloading cached gammaloop-nextest-binaries-core-gammaloop-tracing-filter from https://cache.nix-ci.com
  19. 12.95 s Downloading cached gammaloop-nextest-binaries-core-gammaloop-tracing-filter-macros from https://cache.nix-ci.com
  20. 12.95 s Downloading cached gammaloop-nextest-binaries-core-gammalooprs from https://cache.nix-ci.com
  21. 13.00 s Downloaded cached gammaloop-nextest-binaries-core-gammaloop-tracing-filter-macros (1.7 MiB) in 45ms
  22. 13.00 s Progress: 0 of 1 built, 1 of 6 downloaded from cache (3 downloading)
  23. 13.15 s Downloaded cached gammaloop-nextest-binaries-core-gammaloop-tracing-filter (8.1 MiB) in 197ms
  24. 13.15 s Progress: 0 of 1 built, 2 of 6 downloaded from cache (2 downloading)
  25. 14.18 s Downloaded cached gammaloop-nextest-binaries-core-gammaloop-api (68.4 MiB) in 1.2s
  26. 14.18 s Progress: 0 of 1 built, 3 of 6 downloaded from cache (1 downloading)
  27. 14.47 s Downloaded cached gammaloop-nextest-binaries-core-gammalooprs (79.4 MiB) in 1.5s
  28. 14.47 s Progress: 0 of 1 built, 4 of 6 downloaded from cache
  29. 14.47 s Downloading cached gammaloop-nextest-binaries-core from https://cache.nix-ci.com
  30. 14.49 s Downloaded cached gammaloop-nextest-binaries-core (1640 B) in 16ms
  31. 14.49 s Progress: 0 of 1 built, 5 of 6 downloaded from cache
  32. 14.49 s Downloading cached nix-ci-check-gammaloop-nextest-core from https://cache.nix-ci.com
  33. 14.51 s Downloaded cached nix-ci-check-gammaloop-nextest-core (1016 B) in 16ms
  34. 14.51 s Progress: 0 of 1 built, 6 of 6 downloaded from cache
  35. 19.72 s evaluating derivation 'g copying '/nix/store/4jdn evaluating derivation 'g copying '/nix/store/4jdn evaluating derivation 'g copying '/nix/store/4jdn evaluating derivation 'g copying '/nix/store/4jdn evaluating derivation 'g copying '/nix/store/4jdn evaluating derivation 'g copying '/nix/store/4jdn evaluating derivation 'g copying '/nix/store/4jdn evaluating derivation 'g copying '/nix/store/4jdn evaluating derivation 'g copying '/nix/store/4jdn evaluating derivation 'g querying gammaloop-nexte [0/1 built, 0.0 KiB DL] [1/0/1 built, 0.0 KiB DLgammaloop-nextest-core> Extracting 3 binaries (including 1 non-test binary), 1 build script output directory, and 2 linked paths to /build/source
  36. 20.15 s gammaloop-nextest-core> Extracted 18 files to /build/source in 0.43s
  37. 20.16 s gammaloop-nextest-core> ------------
  38. 20.16 s gammaloop-nextest-core> Nextest run ID 48e6bad4-df81-4c2b-bf26-aad3db2e082d with nextest profile: ci_gammaloop
  39. 20.16 s gammaloop-nextest-core> Starting 339 tests across 2 binaries
  40. 20.48 s gammaloop-nextest-core> FAIL [ 0.019s] (243/339) gammaloop-api repl::tests::completion_shows_type_hint_for_non_boolean_settings_leaf
  41. 20.48 s gammaloop-nextest-core> stdout ---
  42. 20.48 s gammaloop-nextest-core>
  43. 20.48 s gammaloop-nextest-core> running 1 test
  44. 20.48 s gammaloop-nextest-core> test repl::tests::completion_shows_type_hint_for_non_boolean_settings_leaf ... FAILED
  45. 20.48 s gammaloop-nextest-core>
  46. 20.48 s gammaloop-nextest-core> failures:
  47. 20.48 s gammaloop-nextest-core>
  48. 20.48 s gammaloop-nextest-core> failures:
  49. 20.48 s gammaloop-nextest-core> repl::tests::completion_shows_type_hint_for_non_boolean_settings_leaf
  50. 20.48 s gammaloop-nextest-core>
  51. 20.48 s gammaloop-nextest-core> test result: FAILED. 0 passed; 1 failed; 0 ignored; 0 measured; 338 filtered out; finished in 0.01s
  52. 20.48 s gammaloop-nextest-core>
  53. 20.48 s gammaloop-nextest-core> stderr ---
  54. 20.48 s gammaloop-nextest-core>
  55. 20.48 s gammaloop-nextest-core> thread 'repl::tests::completion_shows_type_hint_for_non_boolean_settings_leaf' (778) panicked at crates/gammaloop-api/src/repl.rs:5778:9:
  56. 20.48 s gammaloop-nextest-core> [Suggestion { value: "", description: Some("Number of samples in the first Monte Carlo iteration."), style: None, extra: None, span: Span { start: 42, end: 42 }, append_whitespace: false }]
  57. 20.48 s gammaloop-nextest-core> stack backtrace:
  58. 20.48 s gammaloop-nextest-core> 0: __rustc::rust_begin_unwind
  59. 20.48 s gammaloop-nextest-core> 1: core::panicking::panic_fmt
  60. 20.48 s gammaloop-nextest-core> 2: gammaloop_api::repl::tests::completion_shows_type_hint_for_non_boolean_settings_leaf
  61. 20.48 s gammaloop-nextest-core> 3: <gammaloop_api::repl::tests::completion_shows_type_hint_for_non_boolean_settings_leaf::{closure#0} as core::ops::function::FnOnce<()>>::call_once
  62. 20.48 s gammaloop-nextest-core> note: Some details are omitted, run with `RUST_BACKTRACE=full` for a verbose backtrace.
  63. 20.48 s gammaloop-nextest-core>
  64. 20.53 s gammaloop-nextest-core> FAIL [ 0.033s] (278/339) gammaloop-api templates::tests::extract_templates_uses_canonical_package_layout
  65. 20.53 s gammaloop-nextest-core> stdout ---
  66. 20.53 s gammaloop-nextest-core>
  67. 20.53 s gammaloop-nextest-core> running 1 test
  68. 20.53 s gammaloop-nextest-core> test templates::tests::extract_templates_uses_canonical_package_layout ... FAILED
  69. 20.53 s gammaloop-nextest-core>
  70. 20.53 s gammaloop-nextest-core> failures:
  71. 20.53 s gammaloop-nextest-core>
  72. 20.53 s gammaloop-nextest-core> failures:
  73. 20.53 s gammaloop-nextest-core> templates::tests::extract_templates_uses_canonical_package_layout
  74. 20.53 s gammaloop-nextest-core>
  75. 20.53 s gammaloop-nextest-core> test result: FAILED. 0 passed; 1 failed; 0 ignored; 0 measured; 338 filtered out; finished in 0.02s
  76. 20.53 s gammaloop-nextest-core>
  77. 20.53 s gammaloop-nextest-core> stderr ---
  78. 20.53 s gammaloop-nextest-core>
  79. 20.53 s gammaloop-nextest-core> thread 'templates::tests::extract_templates_uses_canonical_package_layout' (876) panicked at crates/gammaloop-api/src/templates.rs:99:9:
  80. 20.53 s gammaloop-nextest-core> assertion failed: figure.contains("amplitude-mode")
  81. 20.53 s gammaloop-nextest-core> stack backtrace:
  82. 20.53 s gammaloop-nextest-core> 0: __rustc::rust_begin_unwind
  83. 20.53 s gammaloop-nextest-core> 1: core::panicking::panic_fmt
  84. 20.53 s gammaloop-nextest-core> 2: core::panicking::panic
  85. 20.53 s gammaloop-nextest-core> 3: gammaloop_api::templates::tests::extract_templates_uses_canonical_package_layout
  86. 20.53 s gammaloop-nextest-core> 4: <gammaloop_api::templates::tests::extract_templates_uses_canonical_package_layout::{closure#0} as core::ops::function::FnOnce<()>>::call_once
  87. 20.53 s gammaloop-nextest-core> note: Some details are omitted, run with `RUST_BACKTRACE=full` for a verbose backtrace.
  88. 20.53 s gammaloop-nextest-core>
  89. 20.65 s gammaloop-nextest-core> ------------
  90. 20.65 s gammaloop-nextest-core> Summary [ 0.491s] 339 tests run: 337 passed, 2 failed, 0 skipped
  91. 20.65 s gammaloop-nextest-core> FAIL [ 0.019s] (243/339) gammaloop-api repl::tests::completion_shows_type_hint_for_non_boolean_settings_leaf
  92. 20.65 s gammaloop-nextest-core> stdout ---
  93. 20.65 s gammaloop-nextest-core>
  94. 20.65 s gammaloop-nextest-core> running 1 test
  95. 20.65 s gammaloop-nextest-core> test repl::tests::completion_shows_type_hint_for_non_boolean_settings_leaf ... FAILED
  96. 20.65 s gammaloop-nextest-core>
  97. 20.65 s gammaloop-nextest-core> failures:
  98. 20.65 s gammaloop-nextest-core>
  99. 20.65 s gammaloop-nextest-core> failures:
  100. 20.65 s gammaloop-nextest-core> repl::tests::completion_shows_type_hint_for_non_boolean_settings_leaf
  101. 20.65 s gammaloop-nextest-core>
  102. 20.65 s gammaloop-nextest-core> test result: FAILED. 0 passed; 1 failed; 0 ignored; 0 measured; 338 filtered out; finished in 0.01s
  103. 20.65 s gammaloop-nextest-core>
  104. 20.65 s gammaloop-nextest-core> stderr ---
  105. 20.65 s gammaloop-nextest-core>
  106. 20.65 s gammaloop-nextest-core> thread 'repl::tests::completion_shows_type_hint_for_non_boolean_settings_leaf' (778) panicked at crates/gammaloop-api/src/repl.rs:5778:9:
  107. 20.65 s gammaloop-nextest-core> [Suggestion { value: "", description: Some("Number of samples in the first Monte Carlo iteration."), style: None, extra: None, span: Span { start: 42, end: 42 }, append_whitespace: false }]
  108. 20.65 s gammaloop-nextest-core> stack backtrace:
  109. 20.65 s gammaloop-nextest-core> 0: __rustc::rust_begin_unwind
  110. 20.65 s gammaloop-nextest-core> 1: core::panicking::panic_fmt
  111. 20.65 s gammaloop-nextest-core> 2: gammaloop_api::repl::tests::completion_shows_type_hint_for_non_boolean_settings_leaf
  112. 20.65 s gammaloop-nextest-core> 3: <gammaloop_api::repl::tests::completion_shows_type_hint_for_non_boolean_settings_leaf::{closure#0} as core::ops::function::FnOnce<()>>::call_once
  113. 20.65 s gammaloop-nextest-core> note: Some details are omitted, run with `RUST_BACKTRACE=full` for a verbose backtrace.
  114. 20.65 s gammaloop-nextest-core>
  115. 20.65 s gammaloop-nextest-core> FAIL [ 0.033s] (278/339) gammaloop-api templates::tests::extract_templates_uses_canonical_package_layout
  116. 20.65 s gammaloop-nextest-core> stdout ---
  117. 20.65 s gammaloop-nextest-core>
  118. 20.65 s gammaloop-nextest-core> running 1 test
  119. 20.65 s gammaloop-nextest-core> test templates::tests::extract_templates_uses_canonical_package_layout ... FAILED
  120. 20.65 s gammaloop-nextest-core>
  121. 20.65 s gammaloop-nextest-core> failures:
  122. 20.65 s gammaloop-nextest-core>
  123. 20.65 s gammaloop-nextest-core> failures:
  124. 20.65 s gammaloop-nextest-core> templates::tests::extract_templates_uses_canonical_package_layout
  125. 20.65 s gammaloop-nextest-core>
  126. 20.65 s gammaloop-nextest-core> test result: FAILED. 0 passed; 1 failed; 0 ignored; 0 measured; 338 filtered out; finished in 0.02s
  127. 20.65 s gammaloop-nextest-core>
  128. 20.65 s gammaloop-nextest-core> stderr ---
  129. 20.65 s gammaloop-nextest-core>
  130. 20.65 s gammaloop-nextest-core> thread 'templates::tests::extract_templates_uses_canonical_package_layout' (876) panicked at crates/gammaloop-api/src/templates.rs:99:9:
  131. 20.65 s gammaloop-nextest-core> assertion failed: figure.contains("amplitude-mode")
  132. 20.65 s gammaloop-nextest-core> stack backtrace:
  133. 20.65 s gammaloop-nextest-core> 0: __rustc::rust_begin_unwind
  134. 20.65 s gammaloop-nextest-core> 1: core::panicking::panic_fmt
  135. 20.65 s gammaloop-nextest-core> 2: core::panicking::panic
  136. 20.65 s gammaloop-nextest-core> 3: gammaloop_api::templates::tests::extract_templates_uses_canonical_package_layout
  137. 20.65 s gammaloop-nextest-core> 4: <gammaloop_api::templates::tests::extract_templates_uses_canonical_package_layout::{closure#0} as core::ops::function::FnOnce<()>>::call_once
  138. 20.65 s gammaloop-nextest-core> note: Some details are omitted, run with `RUST_BACKTRACE=full` for a verbose backtrace.
  139. 20.65 s gammaloop-nextest-core>
  140. 20.66 s gammaloop-nextest-core> error: test run failed
  141. 20.69 s gammaloop-nextest-core>
  142. 20.69 s gammaloop-nextest-core> ========== nextest test summary ==========
  143. 20.69 s gammaloop-nextest-core> report: target/nextest/ci_gammaloop/junit.xml
  144. 20.69 s gammaloop-nextest-core> tests: 339, failures: 2, errors: 0
  145. 20.69 s gammaloop-nextest-core>
  146. 20.69 s gammaloop-nextest-core> 1. gammaloop-api::repl::tests::completion_shows_type_hint_for_non_boolean_settings_leaf
  147. 20.69 s gammaloop-nextest-core> failure: test failure with exit code 101
  148. 20.69 s gammaloop-nextest-core> thread 'repl::tests::completion_shows_type_hint_for_non_boolean_settings_leaf' (778) panicked at crates/gammaloop-api/src/repl.rs:5778:9:
  149. 20.69 s gammaloop-nextest-core> [Suggestion { value: "", description: Some("Number of samples in the first Monte Carlo iteration."), style: None, extra: None, span: Span { start: 42, end: 42 }, append_whitespace: false }]
  150. 20.69 s gammaloop-nextest-core> stack backtrace:
  151. 20.69 s gammaloop-nextest-core> 0: __rustc::rust_begin_unwind
  152. 20.69 s gammaloop-nextest-core> 1: core::panicking::panic_fmt
  153. 20.69 s gammaloop-nextest-core> 2: gammaloop_api::repl::tests::completion_shows_type_hint_for_non_boolean_settings_leaf
  154. 20.69 s gammaloop-nextest-core> 3: <gammaloop_api::repl::tests::completion_shows_type_hint_for_non_boolean_settings_leaf::{closure#0} as core::ops::function::FnOnce<()>>::call_once
  155. 20.69 s gammaloop-nextest-core> note: Some details are omitted, run with `RUST_BACKTRACE=full` for a verbose backtrace.
  156. 20.69 s gammaloop-nextest-core> system-out
  157. 20.69 s gammaloop-nextest-core> running 1 test
  158. 20.69 s gammaloop-nextest-core> test repl::tests::completion_shows_type_hint_for_non_boolean_settings_leaf ... FAILED
  159. 20.69 s gammaloop-nextest-core>
  160. 20.69 s gammaloop-nextest-core> failures:
  161. 20.69 s gammaloop-nextest-core>
  162. 20.69 s gammaloop-nextest-core> failures:
  163. 20.69 s gammaloop-nextest-core> repl::tests::completion_shows_type_hint_for_non_boolean_settings_leaf
  164. 20.69 s gammaloop-nextest-core>
  165. 20.69 s gammaloop-nextest-core> test result: FAILED. 0 passed; 1 failed; 0 ignored; 0 measured; 338 filtered out; finished in 0.01s
  166. 20.69 s gammaloop-nextest-core> system-err
  167. 20.69 s gammaloop-nextest-core> thread 'repl::tests::completion_shows_type_hint_for_non_boolean_settings_leaf' (778) panicked at crates/gammaloop-api/src/repl.rs:5778:9:
  168. 20.69 s gammaloop-nextest-core> [Suggestion { value: "", description: Some("Number of samples in the first Monte Carlo iteration."), style: None, extra: None, span: Span { start: 42, end: 42 }, append_whitespace: false }]
  169. 20.69 s gammaloop-nextest-core> stack backtrace:
  170. 20.69 s gammaloop-nextest-core> 0: __rustc::rust_begin_unwind
  171. 20.69 s gammaloop-nextest-core> 1: core::panicking::panic_fmt
  172. 20.69 s gammaloop-nextest-core> 2: gammaloop_api::repl::tests::completion_shows_type_hint_for_non_boolean_settings_leaf
  173. 20.69 s gammaloop-nextest-core> 3: <gammaloop_api::repl::tests::completion_shows_type_hint_for_non_boolean_settings_leaf::{closure#0} as core::ops::function::FnOnce<()>>::call_once
  174. 20.69 s gammaloop-nextest-core> note: Some details are omitted, run with `RUST_BACKTRACE=full` for a verbose backtrace.
  175. 20.69 s gammaloop-nextest-core>
  176. 20.69 s gammaloop-nextest-core> 2. gammaloop-api::templates::tests::extract_templates_uses_canonical_package_layout
  177. 20.69 s gammaloop-nextest-core> failure: test failure with exit code 101
  178. 20.69 s gammaloop-nextest-core> thread 'templates::tests::extract_templates_uses_canonical_package_layout' (876) panicked at crates/gammaloop-api/src/templates.rs:99:9:
  179. 20.69 s gammaloop-nextest-core> assertion failed: figure.contains("amplitude-mode")
  180. 20.69 s gammaloop-nextest-core> stack backtrace:
  181. 20.69 s gammaloop-nextest-core> 0: __rustc::rust_begin_unwind
  182. 20.69 s gammaloop-nextest-core> 1: core::panicking::panic_fmt
  183. 20.69 s gammaloop-nextest-core> 2: core::panicking::panic
  184. 20.69 s gammaloop-nextest-core> 3: gammaloop_api::templates::tests::extract_templates_uses_canonical_package_layout
  185. 20.69 s gammaloop-nextest-core> 4: <gammaloop_api::templates::tests::extract_templates_uses_canonical_package_layout::{closure#0} as core::ops::function::FnOnce<()>>::call_once
  186. 20.69 s gammaloop-nextest-core> note: Some details are omitted, run with `RUST_BACKTRACE=full` for a verbose backtrace.
  187. 20.69 s gammaloop-nextest-core> system-out
  188. 20.69 s gammaloop-nextest-core> running 1 test
  189. 20.69 s gammaloop-nextest-core> test templates::tests::extract_templates_uses_canonical_package_layout ... FAILED
  190. 20.69 s gammaloop-nextest-core>
  191. 20.69 s gammaloop-nextest-core> failures:
  192. 20.69 s gammaloop-nextest-core>
  193. 20.69 s gammaloop-nextest-core> failures:
  194. 20.69 s gammaloop-nextest-core> templates::tests::extract_templates_uses_canonical_package_layout
  195. 20.69 s gammaloop-nextest-core>
  196. 20.69 s gammaloop-nextest-core> test result: FAILED. 0 passed; 1 failed; 0 ignored; 0 measured; 338 filtered out; finished in 0.02s
  197. 20.69 s gammaloop-nextest-core> system-err
  198. 20.69 s gammaloop-nextest-core> thread 'templates::tests::extract_templates_uses_canonical_package_layout' (876) panicked at crates/gammaloop-api/src/templates.rs:99:9:
  199. 20.69 s gammaloop-nextest-core> assertion failed: figure.contains("amplitude-mode")
  200. 20.69 s gammaloop-nextest-core> stack backtrace:
  201. 20.69 s gammaloop-nextest-core> 0: __rustc::rust_begin_unwind
  202. 20.69 s gammaloop-nextest-core> 1: core::panicking::panic_fmt
  203. 20.69 s gammaloop-nextest-core> 2: core::panicking::panic
  204. 20.69 s gammaloop-nextest-core> 3: gammaloop_api::templates::tests::extract_templates_uses_canonical_package_layout
  205. 20.69 s gammaloop-nextest-core> 4: <gammaloop_api::templates::tests::extract_templates_uses_canonical_package_layout::{closure#0} as core::ops::function::FnOnce<()>>::call_once
  206. 20.69 s gammaloop-nextest-core> note: Some details are omitted, run with `RUST_BACKTRACE=full` for a verbose backtrace.
  207. 20.69 s gammaloop-nextest-core> =========================================
  208. 20.70 s gammaloop-nextest-core> Extracting 1 binary and 1 linked path to /build/source
  209. 20.77 s gammaloop-nextest-core> Extracted 7 files to /build/source in 0.07s
  210. 20.78 s gammaloop-nextest-core> ------------
  211. 20.78 s gammaloop-nextest-core> Nextest run ID e7d3d1f5-afef-44df-baaf-91cad84a6449 with nextest profile: ci_gammaloop
  212. 20.78 s gammaloop-nextest-core> Starting 19 tests across 1 binary
  213. 20.80 s gammaloop-nextest-core> ------------
  214. 20.80 s gammaloop-nextest-core> Summary [ 0.013s] 19 tests run: 19 passed, 0 skipped
  215. 20.83 s gammaloop-nextest-core>
  216. 20.83 s gammaloop-nextest-core> ========== nextest test summary ==========
  217. 20.83 s gammaloop-nextest-core> report: target/nextest/ci_gammaloop/junit.xml
  218. 20.83 s gammaloop-nextest-core> tests: 19, failures: 0, errors: 0
  219. 20.83 s gammaloop-nextest-core> No failing testcases found.
  220. 20.83 s gammaloop-nextest-core> =========================================
  221. 20.84 s gammaloop-nextest-core> Extracting 1 binary to /build/source
  222. 20.88 s gammaloop-nextest-core> Extracted 4 files to /build/source in 0.04s
  223. 20.88 s gammaloop-nextest-core> ------------
  224. 20.88 s gammaloop-nextest-core> Nextest run ID cc420566-0c3a-48c6-8131-41348c035b79 with nextest profile: ci_gammaloop
  225. 20.88 s gammaloop-nextest-core> Starting 0 tests across 1 binary
  226. 20.88 s gammaloop-nextest-core> ------------
  227. 20.88 s gammaloop-nextest-core> Summary [ 0.000s] 0 tests run: 0 passed, 0 skipped
  228. 20.91 s gammaloop-nextest-core>
  229. 20.91 s gammaloop-nextest-core> ========== nextest test summary ==========
  230. 20.91 s gammaloop-nextest-core> report: target/nextest/ci_gammaloop/junit.xml
  231. 20.91 s gammaloop-nextest-core> tests: 0, failures: 0, errors: 0
  232. 20.91 s gammaloop-nextest-core> No failing testcases found.
  233. 20.91 s gammaloop-nextest-core> =========================================
  234. 20.93 s gammaloop-nextest-core> Extracting 4 binaries, 1 build script output directory, and 2 linked paths to /build/source
  235. 21.37 s gammaloop-nextest-core> Extracted 18 files to /build/source in 0.44s
  236. 21.38 s gammaloop-nextest-core> ------------
  237. 21.38 s gammaloop-nextest-core> Nextest run ID b48d0cbe-0a1a-474c-b19f-6279862b89a1 with nextest profile: ci_gammaloop
  238. 21.38 s gammaloop-nextest-core> Starting 456 tests across 4 binaries (61 tests skipped, including 60 tests via profile.ci_gammaloop.default-filter)
  239. 21.74 s gammaloop-nextest-core> FAIL [ 0.260s] (161/456) gammalooprs graph::parse::tests::parse_lmbsetting_crossection
  240. 21.74 s gammaloop-nextest-core> stdout ---
  241. 21.74 s gammaloop-nextest-core>
  242. 21.74 s gammaloop-nextest-core> running 1 test
  243. 21.74 s gammaloop-nextest-core> ━━━━━━━━━━━━━━━━━━━━━━━━━━━━━━━ Snapshot Summary ━━━━━━━━━━━━━━━━━━━━━━━━━━━━━━━
  244. 21.74 s gammaloop-nextest-core> Snapshot: parse_lmbsetting_crossection
  245. 21.74 s gammaloop-nextest-core> Source: crates/gammalooprs/src/graph/parse/tests.rs:252
  246. 21.74 s gammaloop-nextest-core> ────────────────────────────────────────────────────────────────────────────────
  247. 21.74 s gammaloop-nextest-core> Expression: g.debug_dot()
  248. 21.74 s gammaloop-nextest-core> ────────────────────────────────────────────────────────────────────────────────
  249. 21.74 s gammaloop-nextest-core> -old snapshot
  250. 21.74 s gammaloop-nextest-core> +new results
  251. 21.75 s gammaloop-nextest-core> ────────────┬───────────────────────────────────────────────────────────────────
  252. 21.75 s gammaloop-nextest-core> 1 │-digraph G{
  253. 21.75 s gammaloop-nextest-core> 1 │+digraph G {
  254. 21.75 s gammaloop-nextest-core> 2 2 │ num = "1/2";
  255. 21.75 s gammaloop-nextest-core> 3 3 │ overall_factor = "2*x";
  256. 21.75 s gammaloop-nextest-core> 4 4 │ overall_factor_evaluated = "2*x";
  257. 21.75 s gammaloop-nextest-core> 5 5 │ projector = "spenso::t";
  258. 21.75 s gammaloop-nextest-core> ────────────┴───────────────────────────────────────────────────────────────────
  259. 21.75 s gammaloop-nextest-core> To update snapshots run `cargo insta review`
  260. 21.75 s gammaloop-nextest-core> Stopped on the first failure. Run `cargo insta test` to run all snapshots.
  261. 21.75 s gammaloop-nextest-core> test graph::parse::tests::parse_lmbsetting_crossection ... FAILED
  262. 21.75 s gammaloop-nextest-core>
  263. 21.75 s gammaloop-nextest-core> failures:
  264. 21.75 s gammaloop-nextest-core>
  265. 21.75 s gammaloop-nextest-core> failures:
  266. 21.75 s gammaloop-nextest-core> graph::parse::tests::parse_lmbsetting_crossection
  267. 21.75 s gammaloop-nextest-core>
  268. 21.75 s gammaloop-nextest-core> test result: FAILED. 0 passed; 1 failed; 0 ignored; 0 measured; 508 filtered out; finished in 0.25s
  269. 21.75 s gammaloop-nextest-core>
  270. 21.75 s gammaloop-nextest-core> stderr ---
  271. 21.75 s gammaloop-nextest-core> [22:03:32.134] @gammalooprs::graph::attribute_warnings WARNING : Unknown node attribute 'color_num' on graph 'G', node 'A'; did you mean 'num'?
  272. 21.75 s gammaloop-nextest-core> at crates/gammalooprs/src/graph/attribute_warnings.rs:198
  273. 21.75 s gammaloop-nextest-core> The application panicked (crashed).
  274. 21.75 s gammaloop-nextest-core> Message: snapshot assertion for 'parse_lmbsetting_crossection' failed in line 252
  275. 21.75 s gammaloop-nextest-core> Location: /nix/store/xdy1vvhll2bijdplvl9fcc2b9plkxhaa-vendor-cargo-deps/c19b7c6f923b580ac259164a89f2577984ad5ab09ee9d583b888f934adbbe8d0/insta-1.47.2/src/runtime.rs:719
  276. 21.75 s gammaloop-nextest-core>
  277. 21.75 s gammaloop-nextest-core> ━━━━━━━━━━━━━━━━━━━━━━━━━━━━━━━━━━ BACKTRACE ━━━━━━━━━━━━━━━━━━━━━━━━━━━━━━━━━━━
  278. 21.75 s gammaloop-nextest-core> 1: <color_eyre[b0c9e66060e883b2]::config::PanicHook>::panic_report<unknown>
  279. 21.75 s gammaloop-nextest-core> at <unknown source file>:<unknown line>
  280. 21.75 s gammaloop-nextest-core> 2: <color_eyre[b0c9e66060e883b2]::config::PanicHook>::into_panic_hook::{closure#0}<unknown>
  281. 21.75 s gammaloop-nextest-core> at <unknown source file>:<unknown line>
  282. 21.75 s gammaloop-nextest-core> 3: std[bcb96dfbba0ab899]::panicking::panic_with_hook<unknown>
  283. 21.75 s gammaloop-nextest-core> at <unknown source file>:<unknown line>
  284. 21.75 s gammaloop-nextest-core> 4: std[bcb96dfbba0ab899]::panicking::panic_handler::{closure#0}<unknown>
  285. 21.75 s gammaloop-nextest-core> at <unknown source file>:<unknown line>
  286. 21.75 s gammaloop-nextest-core> 5: std[bcb96dfbba0ab899]::sys::backtrace::__rust_end_short_backtrace::<std[bcb96dfbba0ab899]::panicking::panic_handler::{closure#0}, !><unknown>
  287. 21.75 s gammaloop-nextest-core> at <unknown source file>:<unknown line>
  288. 21.75 s gammaloop-nextest-core> 6: __rustc[6c289b9f9c454d21]::rust_begin_unwind<unknown>
  289. 21.75 s gammaloop-nextest-core> at <unknown source file>:<unknown line>
  290. 21.75 s gammaloop-nextest-core> 7: core[940e698046960fd5]::panicking::panic_fmt<unknown>
  291. 21.75 s gammaloop-nextest-core> at <unknown source file>:<unknown line>
  292. 21.75 s gammaloop-nextest-core> 8: insta[307a548ac79ef4d9]::runtime::assert_snapshot<unknown>
  293. 21.75 s gammaloop-nextest-core> at <unknown source file>:<unknown line>
  294. 21.75 s gammaloop-nextest-core> 9: gammalooprs[5490727360442cce]::graph::parse::tests::parse_lmbsetting_crossection<unknown>
  295. 21.75 s gammaloop-nextest-core> at <unknown source file>:<unknown line>
  296. 21.75 s gammaloop-nextest-core> 10: <gammalooprs[5490727360442cce]::graph::parse::tests::parse_lmbsetting_crossection::{closure#0} as core[940e698046960fd5]::ops::function::FnOnce<()>>::call_once<unknown>
  297. 21.75 s gammaloop-nextest-core> at <unknown source file>:<unknown line>
  298. 21.75 s gammaloop-nextest-core> 11: test[75d6903177b1d7e9]::__rust_begin_short_backtrace::<core[940e698046960fd5]::result::Result<(), alloc[2ea6bcb46fca0c42]::string::String>, fn() -> core[940e698046960fd5]::result::Result<(), alloc[2ea6bcb46fca0c42]::string::String>><unknown>
  299. 21.75 s gammaloop-nextest-core> at <unknown source file>:<unknown line>
  300. 21.75 s gammaloop-nextest-core> 12: test[75d6903177b1d7e9]::run_test::{closure#0}<unknown>
  301. 21.75 s gammaloop-nextest-core> at <unknown source file>:<unknown line>
  302. 21.75 s gammaloop-nextest-core> 13: std[bcb96dfbba0ab899]::sys::backtrace::__rust_begin_short_backtrace::<test[75d6903177b1d7e9]::run_test::{closure#1}, ()><unknown>
  303. 21.75 s gammaloop-nextest-core> at <unknown source file>:<unknown line>
  304. 21.75 s gammaloop-nextest-core> 14: <std[bcb96dfbba0ab899]::thread::lifecycle::spawn_unchecked<test[75d6903177b1d7e9]::run_test::{closure#1}, ()>::{closure#1} as core[940e698046960fd5]::ops::function::FnOnce<()>>::call_once::{shim:vtable#0}<unknown>
  305. 21.75 s gammaloop-nextest-core> at <unknown source file>:<unknown line>
  306. 21.75 s gammaloop-nextest-core> 15: <std[bcb96dfbba0ab899]::sys::thread::unix::Thread>::new::thread_start<unknown>
  307. 21.75 s gammaloop-nextest-core> at <unknown source file>:<unknown line>
  308. 21.75 s gammaloop-nextest-core> 16: start_thread<unknown>
  309. 21.75 s gammaloop-nextest-core> at <unknown source file>:<unknown line>
  310. 21.75 s gammaloop-nextest-core> 17: __clone3<unknown>
  311. 21.75 s gammaloop-nextest-core> at <unknown source file>:<unknown line>
  312. 21.75 s gammaloop-nextest-core>
  313. 21.75 s gammaloop-nextest-core> Run with COLORBT_SHOW_HIDDEN=1 environment variable to disable frame filtering.
  314. 21.75 s gammaloop-nextest-core> Run with RUST_BACKTRACE=full to include source snippets.
  315. 21.75 s gammaloop-nextest-core>
  316. 22.20 s gammaloop-nextest-core> FAIL [ 0.086s] (407/456) gammalooprs uv::export::tests::computed_node_full_numerator_is_a_spenso_aware_typst_fragment
  317. 22.20 s gammaloop-nextest-core> stdout ---
  318. 22.20 s gammaloop-nextest-core>
  319. 22.20 s gammaloop-nextest-core> running 1 test
  320. 22.20 s gammaloop-nextest-core> test uv::export::tests::computed_node_full_numerator_is_a_spenso_aware_typst_fragment ... FAILED
  321. 22.20 s gammaloop-nextest-core>
  322. 22.20 s gammaloop-nextest-core> failures:
  323. 22.20 s gammaloop-nextest-core>
  324. 22.20 s gammaloop-nextest-core> failures:
  325. 22.20 s gammaloop-nextest-core> uv::export::tests::computed_node_full_numerator_is_a_spenso_aware_typst_fragment
  326. 22.20 s gammaloop-nextest-core>
  327. 22.20 s gammaloop-nextest-core> test result: FAILED. 0 passed; 1 failed; 0 ignored; 0 measured; 508 filtered out; finished in 0.07s
  328. 22.20 s gammaloop-nextest-core>
  329. 22.20 s gammaloop-nextest-core> stderr ---
  330. 22.20 s gammaloop-nextest-core> The application panicked (crashed).
  331. 22.20 s gammaloop-nextest-core> Message: assertion failed: exported.dot.contains(r#"full_num = "op(\"Tr\")(1)";"#)
  332. 22.20 s gammaloop-nextest-core> Location: crates/gammalooprs/src/uv/export.rs:483
  333. 22.20 s gammaloop-nextest-core>
  334. 22.20 s gammaloop-nextest-core> ━━━━━━━━━━━━━━━━━━━━━━━━━━━━━━━━━━ BACKTRACE ━━━━━━━━━━━━━━━━━━━━━━━━━━━━━━━━━━━
  335. 22.20 s gammaloop-nextest-core> 1: <color_eyre[b0c9e66060e883b2]::config::PanicHook>::panic_report<unknown>
  336. 22.20 s gammaloop-nextest-core> at <unknown source file>:<unknown line>
  337. 22.20 s gammaloop-nextest-core> 2: <color_eyre[b0c9e66060e883b2]::config::PanicHook>::into_panic_hook::{closure#0}<unknown>
  338. 22.20 s gammaloop-nextest-core> at <unknown source file>:<unknown line>
  339. 22.20 s gammaloop-nextest-core> 3: std[bcb96dfbba0ab899]::panicking::panic_with_hook<unknown>
  340. 22.20 s gammaloop-nextest-core> at <unknown source file>:<unknown line>
  341. 22.20 s gammaloop-nextest-core> 4: std[bcb96dfbba0ab899]::panicking::panic_handler::{closure#0}<unknown>
  342. 22.20 s gammaloop-nextest-core> at <unknown source file>:<unknown line>
  343. 22.20 s gammaloop-nextest-core> 5: std[bcb96dfbba0ab899]::sys::backtrace::__rust_end_short_backtrace::<std[bcb96dfbba0ab899]::panicking::panic_handler::{closure#0}, !><unknown>
  344. 22.20 s gammaloop-nextest-core> at <unknown source file>:<unknown line>
  345. 22.20 s gammaloop-nextest-core> 6: __rustc[6c289b9f9c454d21]::rust_begin_unwind<unknown>
  346. 22.20 s gammaloop-nextest-core> at <unknown source file>:<unknown line>
  347. 22.20 s gammaloop-nextest-core> 7: core[940e698046960fd5]::panicking::panic_fmt<unknown>
  348. 22.20 s gammaloop-nextest-core> at <unknown source file>:<unknown line>
  349. 22.20 s gammaloop-nextest-core> 8: core[940e698046960fd5]::panicking::panic<unknown>
  350. 22.20 s gammaloop-nextest-core> at <unknown source file>:<unknown line>
  351. 22.20 s gammaloop-nextest-core> 9: gammalooprs[5490727360442cce]::uv::export::tests::computed_node_full_numerator_is_a_spenso_aware_typst_fragment<unknown>
  352. 22.20 s gammaloop-nextest-core> at <unknown source file>:<unknown line>
  353. 22.20 s gammaloop-nextest-core> 10: <gammalooprs[5490727360442cce]::uv::export::tests::computed_node_full_numerator_is_a_spenso_aware_typst_fragment::{closure#0} as core[940e698046960fd5]::ops::function::FnOnce<()>>::call_once<unknown>
  354. 22.20 s gammaloop-nextest-core> at <unknown source file>:<unknown line>
  355. 22.20 s gammaloop-nextest-core> 11: test[75d6903177b1d7e9]::__rust_begin_short_backtrace::<core[940e698046960fd5]::result::Result<(), alloc[2ea6bcb46fca0c42]::string::String>, fn() -> core[940e698046960fd5]::result::Result<(), alloc[2ea6bcb46fca0c42]::string::String>><unknown>
  356. 22.20 s gammaloop-nextest-core> at <unknown source file>:<unknown line>
  357. 22.20 s gammaloop-nextest-core> 12: test[75d6903177b1d7e9]::run_test::{closure#0}<unknown>
  358. 22.20 s gammaloop-nextest-core> at <unknown source file>:<unknown line>
  359. 22.20 s gammaloop-nextest-core> 13: std[bcb96dfbba0ab899]::sys::backtrace::__rust_begin_short_backtrace::<test[75d6903177b1d7e9]::run_test::{closure#1}, ()><unknown>
  360. 22.20 s gammaloop-nextest-core> at <unknown source file>:<unknown line>
  361. 22.20 s gammaloop-nextest-core> 14: <std[bcb96dfbba0ab899]::thread::lifecycle::spawn_unchecked<test[75d6903177b1d7e9]::run_test::{closure#1}, ()>::{closure#1} as core[940e698046960fd5]::ops::function::FnOnce<()>>::call_once::{shim:vtable#0}<unknown>
  362. 22.20 s gammaloop-nextest-core> at <unknown source file>:<unknown line>
  363. 22.20 s gammaloop-nextest-core> 15: <std[bcb96dfbba0ab899]::sys::thread::unix::Thread>::new::thread_start<unknown>
  364. 22.20 s gammaloop-nextest-core> at <unknown source file>:<unknown line>
  365. 22.20 s gammaloop-nextest-core> 16: start_thread<unknown>
  366. 22.20 s gammaloop-nextest-core> at <unknown source file>:<unknown line>
  367. 22.20 s gammaloop-nextest-core> 17: __clone3<unknown>
  368. 22.20 s gammaloop-nextest-core> at <unknown source file>:<unknown line>
  369. 22.20 s gammaloop-nextest-core>
  370. 22.20 s gammaloop-nextest-core> Run with COLORBT_SHOW_HIDDEN=1 environment variable to disable frame filtering.
  371. 22.20 s gammaloop-nextest-core> Run with RUST_BACKTRACE=full to include source snippets.
  372. 22.20 s gammaloop-nextest-core>
  373. 30.62 s gammaloop-nextest-core> ------------
  374. 30.63 s gammaloop-nextest-core> Summary [ 9.243s] 456 tests run: 454 passed, 2 failed, 61 skipped
  375. 30.63 s gammaloop-nextest-core> FAIL [ 0.260s] (161/456) gammalooprs graph::parse::tests::parse_lmbsetting_crossection
  376. 30.63 s gammaloop-nextest-core> stdout ---
  377. 30.63 s gammaloop-nextest-core>
  378. 30.63 s gammaloop-nextest-core> running 1 test
  379. 30.63 s gammaloop-nextest-core> ━━━━━━━━━━━━━━━━━━━━━━━━━━━━━━━ Snapshot Summary ━━━━━━━━━━━━━━━━━━━━━━━━━━━━━━━
  380. 30.63 s gammaloop-nextest-core> Snapshot: parse_lmbsetting_crossection
  381. 30.63 s gammaloop-nextest-core> Source: crates/gammalooprs/src/graph/parse/tests.rs:252
  382. 30.63 s gammaloop-nextest-core> ────────────────────────────────────────────────────────────────────────────────
  383. 30.63 s gammaloop-nextest-core> Expression: g.debug_dot()
  384. 30.63 s gammaloop-nextest-core> ────────────────────────────────────────────────────────────────────────────────
  385. 30.63 s gammaloop-nextest-core> -old snapshot
  386. 30.63 s gammaloop-nextest-core> +new results
  387. 30.63 s gammaloop-nextest-core> ────────────┬───────────────────────────────────────────────────────────────────
  388. 30.63 s gammaloop-nextest-core> 1 │-digraph G{
  389. 30.63 s gammaloop-nextest-core> 1 │+digraph G {
  390. 30.63 s gammaloop-nextest-core> 2 2 │ num = "1/2";
  391. 30.63 s gammaloop-nextest-core> 3 3 │ overall_factor = "2*x";
  392. 30.63 s gammaloop-nextest-core> 4 4 │ overall_factor_evaluated = "2*x";
  393. 30.63 s gammaloop-nextest-core> 5 5 │ projector = "spenso::t";
  394. 30.63 s gammaloop-nextest-core> ────────────┴───────────────────────────────────────────────────────────────────
  395. 30.63 s gammaloop-nextest-core> To update snapshots run `cargo insta review`
  396. 30.63 s gammaloop-nextest-core> Stopped on the first failure. Run `cargo insta test` to run all snapshots.
  397. 30.63 s gammaloop-nextest-core> test graph::parse::tests::parse_lmbsetting_crossection ... FAILED
  398. 30.63 s gammaloop-nextest-core>
  399. 30.63 s gammaloop-nextest-core> failures:
  400. 30.63 s gammaloop-nextest-core>
  401. 30.63 s gammaloop-nextest-core> failures:
  402. 30.63 s gammaloop-nextest-core> graph::parse::tests::parse_lmbsetting_crossection
  403. 30.63 s gammaloop-nextest-core>
  404. 30.63 s gammaloop-nextest-core> test result: FAILED. 0 passed; 1 failed; 0 ignored; 0 measured; 508 filtered out; finished in 0.25s
  405. 30.63 s gammaloop-nextest-core>
  406. 30.63 s gammaloop-nextest-core> stderr ---
  407. 30.63 s gammaloop-nextest-core> [22:03:32.134] @gammalooprs::graph::attribute_warnings WARNING : Unknown node attribute 'color_num' on graph 'G', node 'A'; did you mean 'num'?
  408. 30.63 s gammaloop-nextest-core> at crates/gammalooprs/src/graph/attribute_warnings.rs:198
  409. 30.63 s gammaloop-nextest-core> The application panicked (crashed).
  410. 30.63 s gammaloop-nextest-core> Message: snapshot assertion for 'parse_lmbsetting_crossection' failed in line 252
  411. 30.63 s gammaloop-nextest-core> Location: /nix/store/xdy1vvhll2bijdplvl9fcc2b9plkxhaa-vendor-cargo-deps/c19b7c6f923b580ac259164a89f2577984ad5ab09ee9d583b888f934adbbe8d0/insta-1.47.2/src/runtime.rs:719
  412. 30.63 s gammaloop-nextest-core>
  413. 30.63 s gammaloop-nextest-core> ━━━━━━━━━━━━━━━━━━━━━━━━━━━━━━━━━━ BACKTRACE ━━━━━━━━━━━━━━━━━━━━━━━━━━━━━━━━━━━
  414. 30.63 s gammaloop-nextest-core> 1: <color_eyre[b0c9e66060e883b2]::config::PanicHook>::panic_report<unknown>
  415. 30.63 s gammaloop-nextest-core> at <unknown source file>:<unknown line>
  416. 30.63 s gammaloop-nextest-core> 2: <color_eyre[b0c9e66060e883b2]::config::PanicHook>::into_panic_hook::{closure#0}<unknown>
  417. 30.63 s gammaloop-nextest-core> at <unknown source file>:<unknown line>
  418. 30.63 s gammaloop-nextest-core> 3: std[bcb96dfbba0ab899]::panicking::panic_with_hook<unknown>
  419. 30.63 s gammaloop-nextest-core> at <unknown source file>:<unknown line>
  420. 30.63 s gammaloop-nextest-core> 4: std[bcb96dfbba0ab899]::panicking::panic_handler::{closure#0}<unknown>
  421. 30.63 s gammaloop-nextest-core> at <unknown source file>:<unknown line>
  422. 30.63 s gammaloop-nextest-core> 5: std[bcb96dfbba0ab899]::sys::backtrace::__rust_end_short_backtrace::<std[bcb96dfbba0ab899]::panicking::panic_handler::{closure#0}, !><unknown>
  423. 30.63 s gammaloop-nextest-core> at <unknown source file>:<unknown line>
  424. 30.63 s gammaloop-nextest-core> 6: __rustc[6c289b9f9c454d21]::rust_begin_unwind<unknown>
  425. 30.63 s gammaloop-nextest-core> at <unknown source file>:<unknown line>
  426. 30.63 s gammaloop-nextest-core> 7: core[940e698046960fd5]::panicking::panic_fmt<unknown>
  427. 30.63 s gammaloop-nextest-core> at <unknown source file>:<unknown line>
  428. 30.63 s gammaloop-nextest-core> 8: insta[307a548ac79ef4d9]::runtime::assert_snapshot<unknown>
  429. 30.63 s gammaloop-nextest-core> at <unknown source file>:<unknown line>
  430. 30.63 s gammaloop-nextest-core> 9: gammalooprs[5490727360442cce]::graph::parse::tests::parse_lmbsetting_crossection<unknown>
  431. 30.63 s gammaloop-nextest-core> at <unknown source file>:<unknown line>
  432. 30.63 s gammaloop-nextest-core> 10: <gammalooprs[5490727360442cce]::graph::parse::tests::parse_lmbsetting_crossection::{closure#0} as core[940e698046960fd5]::ops::function::FnOnce<()>>::call_once<unknown>
  433. 30.63 s gammaloop-nextest-core> at <unknown source file>:<unknown line>
  434. 30.63 s gammaloop-nextest-core> 11: test[75d6903177b1d7e9]::__rust_begin_short_backtrace::<core[940e698046960fd5]::result::Result<(), alloc[2ea6bcb46fca0c42]::string::String>, fn() -> core[940e698046960fd5]::result::Result<(), alloc[2ea6bcb46fca0c42]::string::String>><unknown>
  435. 30.63 s gammaloop-nextest-core> at <unknown source file>:<unknown line>
  436. 30.63 s gammaloop-nextest-core> 12: test[75d6903177b1d7e9]::run_test::{closure#0}<unknown>
  437. 30.63 s gammaloop-nextest-core> at <unknown source file>:<unknown line>
  438. 30.63 s gammaloop-nextest-core> 13: std[bcb96dfbba0ab899]::sys::backtrace::__rust_begin_short_backtrace::<test[75d6903177b1d7e9]::run_test::{closure#1}, ()><unknown>
  439. 30.63 s gammaloop-nextest-core> at <unknown source file>:<unknown line>
  440. 30.63 s gammaloop-nextest-core> 14: <std[bcb96dfbba0ab899]::thread::lifecycle::spawn_unchecked<test[75d6903177b1d7e9]::run_test::{closure#1}, ()>::{closure#1} as core[940e698046960fd5]::ops::function::FnOnce<()>>::call_once::{shim:vtable#0}<unknown>
  441. 30.63 s gammaloop-nextest-core> at <unknown source file>:<unknown line>
  442. 30.63 s gammaloop-nextest-core> 15: <std[bcb96dfbba0ab899]::sys::thread::unix::Thread>::new::thread_start<unknown>
  443. 30.63 s gammaloop-nextest-core> at <unknown source file>:<unknown line>
  444. 30.63 s gammaloop-nextest-core> 16: start_thread<unknown>
  445. 30.63 s gammaloop-nextest-core> at <unknown source file>:<unknown line>
  446. 30.63 s gammaloop-nextest-core> 17: __clone3<unknown>
  447. 30.63 s gammaloop-nextest-core> at <unknown source file>:<unknown line>
  448. 30.63 s gammaloop-nextest-core>
  449. 30.63 s gammaloop-nextest-core> Run with COLORBT_SHOW_HIDDEN=1 environment variable to disable frame filtering.
  450. 30.63 s gammaloop-nextest-core> Run with RUST_BACKTRACE=full to include source snippets.
  451. 30.63 s gammaloop-nextest-core>
  452. 30.63 s gammaloop-nextest-core> FAIL [ 0.086s] (407/456) gammalooprs uv::export::tests::computed_node_full_numerator_is_a_spenso_aware_typst_fragment
  453. 30.63 s gammaloop-nextest-core> stdout ---
  454. 30.63 s gammaloop-nextest-core>
  455. 30.63 s gammaloop-nextest-core> running 1 test
  456. 30.63 s gammaloop-nextest-core> test uv::export::tests::computed_node_full_numerator_is_a_spenso_aware_typst_fragment ... FAILED
  457. 30.63 s gammaloop-nextest-core>
  458. 30.63 s gammaloop-nextest-core> failures:
  459. 30.63 s gammaloop-nextest-core>
  460. 30.63 s gammaloop-nextest-core> failures:
  461. 30.63 s gammaloop-nextest-core> uv::export::tests::computed_node_full_numerator_is_a_spenso_aware_typst_fragment
  462. 30.63 s gammaloop-nextest-core>
  463. 30.63 s gammaloop-nextest-core> test result: FAILED. 0 passed; 1 failed; 0 ignored; 0 measured; 508 filtered out; finished in 0.07s
  464. 30.63 s gammaloop-nextest-core>
  465. 30.63 s gammaloop-nextest-core> stderr ---
  466. 30.63 s gammaloop-nextest-core> The application panicked (crashed).
  467. 30.63 s gammaloop-nextest-core> Message: assertion failed: exported.dot.contains(r#"full_num = "op(\"Tr\")(1)";"#)
  468. 30.63 s gammaloop-nextest-core> Location: crates/gammalooprs/src/uv/export.rs:483
  469. 30.63 s gammaloop-nextest-core>
  470. 30.63 s gammaloop-nextest-core> ━━━━━━━━━━━━━━━━━━━━━━━━━━━━━━━━━━ BACKTRACE ━━━━━━━━━━━━━━━━━━━━━━━━━━━━━━━━━━━
  471. 30.63 s gammaloop-nextest-core> 1: <color_eyre[b0c9e66060e883b2]::config::PanicHook>::panic_report<unknown>
  472. 30.63 s gammaloop-nextest-core> at <unknown source file>:<unknown line>
  473. 30.63 s gammaloop-nextest-core> 2: <color_eyre[b0c9e66060e883b2]::config::PanicHook>::into_panic_hook::{closure#0}<unknown>
  474. 30.63 s gammaloop-nextest-core> at <unknown source file>:<unknown line>
  475. 30.63 s gammaloop-nextest-core> 3: std[bcb96dfbba0ab899]::panicking::panic_with_hook<unknown>
  476. 30.63 s gammaloop-nextest-core> at <unknown source file>:<unknown line>
  477. 30.63 s gammaloop-nextest-core> 4: std[bcb96dfbba0ab899]::panicking::panic_handler::{closure#0}<unknown>
  478. 30.63 s gammaloop-nextest-core> at <unknown source file>:<unknown line>
  479. 30.63 s gammaloop-nextest-core> 5: std[bcb96dfbba0ab899]::sys::backtrace::__rust_end_short_backtrace::<std[bcb96dfbba0ab899]::panicking::panic_handler::{closure#0}, !><unknown>
  480. 30.63 s gammaloop-nextest-core> at <unknown source file>:<unknown line>
  481. 30.63 s gammaloop-nextest-core> 6: __rustc[6c289b9f9c454d21]::rust_begin_unwind<unknown>
  482. 30.63 s gammaloop-nextest-core> at <unknown source file>:<unknown line>
  483. 30.63 s gammaloop-nextest-core> 7: core[940e698046960fd5]::panicking::panic_fmt<unknown>
  484. 30.63 s gammaloop-nextest-core> at <unknown source file>:<unknown line>
  485. 30.63 s gammaloop-nextest-core> 8: core[940e698046960fd5]::panicking::panic<unknown>
  486. 30.63 s gammaloop-nextest-core> at <unknown source file>:<unknown line>
  487. 30.63 s gammaloop-nextest-core> 9: gammalooprs[5490727360442cce]::uv::export::tests::computed_node_full_numerator_is_a_spenso_aware_typst_fragment<unknown>
  488. 30.63 s gammaloop-nextest-core> at <unknown source file>:<unknown line>
  489. 30.63 s gammaloop-nextest-core> 10: <gammalooprs[5490727360442cce]::uv::export::tests::computed_node_full_numerator_is_a_spenso_aware_typst_fragment::{closure#0} as core[940e698046960fd5]::ops::function::FnOnce<()>>::call_once<unknown>
  490. 30.63 s gammaloop-nextest-core> at <unknown source file>:<unknown line>
  491. 30.63 s gammaloop-nextest-core> 11: test[75d6903177b1d7e9]::__rust_begin_short_backtrace::<core[940e698046960fd5]::result::Result<(), alloc[2ea6bcb46fca0c42]::string::String>, fn() -> core[940e698046960fd5]::result::Result<(), alloc[2ea6bcb46fca0c42]::string::String>><unknown>
  492. 30.63 s gammaloop-nextest-core> at <unknown source file>:<unknown line>
  493. 30.63 s gammaloop-nextest-core> 12: test[75d6903177b1d7e9]::run_test::{closure#0}<unknown>
  494. 30.63 s gammaloop-nextest-core> at <unknown source file>:<unknown line>
  495. 30.63 s gammaloop-nextest-core> 13: std[bcb96dfbba0ab899]::sys::backtrace::__rust_begin_short_backtrace::<test[75d6903177b1d7e9]::run_test::{closure#1}, ()><unknown>
  496. 30.63 s gammaloop-nextest-core> at <unknown source file>:<unknown line>
  497. 30.63 s gammaloop-nextest-core> 14: <std[bcb96dfbba0ab899]::thread::lifecycle::spawn_unchecked<test[75d6903177b1d7e9]::run_test::{closure#1}, ()>::{closure#1} as core[940e698046960fd5]::ops::function::FnOnce<()>>::call_once::{shim:vtable#0}<unknown>
  498. 30.63 s gammaloop-nextest-core> at <unknown source file>:<unknown line>
  499. 30.63 s gammaloop-nextest-core> 15: <std[bcb96dfbba0ab899]::sys::thread::unix::Thread>::new::thread_start<unknown>
  500. 30.63 s gammaloop-nextest-core> at <unknown source file>:<unknown line>
  501. 30.63 s gammaloop-nextest-core> 16: start_thread<unknown>
  502. 30.63 s gammaloop-nextest-core> at <unknown source file>:<unknown line>
  503. 30.63 s gammaloop-nextest-core> 17: __clone3<unknown>
  504. 30.63 s gammaloop-nextest-core> at <unknown source file>:<unknown line>
  505. 30.63 s gammaloop-nextest-core>
  506. 30.63 s gammaloop-nextest-core> Run with COLORBT_SHOW_HIDDEN=1 environment variable to disable frame filtering.
  507. 30.63 s gammaloop-nextest-core> Run with RUST_BACKTRACE=full to include source snippets.
  508. 30.63 s gammaloop-nextest-core>
  509. 30.63 s gammaloop-nextest-core> error: test run failed
  510. 30.65 s gammaloop-nextest-core>
  511. 30.65 s gammaloop-nextest-core> ========== nextest test summary ==========
  512. 30.65 s gammaloop-nextest-core> report: target/nextest/ci_gammaloop/junit.xml
  513. 30.65 s gammaloop-nextest-core> tests: 456, failures: 2, errors: 0
  514. 30.65 s gammaloop-nextest-core>
  515. 30.65 s gammaloop-nextest-core> 1. gammalooprs::graph::parse::tests::parse_lmbsetting_crossection
  516. 30.65 s gammaloop-nextest-core> failure: test failure with exit code 101
  517. 30.65 s gammaloop-nextest-core> system-out
  518. 30.66 s gammaloop-nextest-core> running 1 test
  519. 30.66 s gammaloop-nextest-core> ━━━━━━━━━━━━━━━━━━━━━━━━━━━━━━━ Snapshot Summary ━━━━━━━━━━━━━━━━━━━━━━━━━━━━━━━
  520. 30.66 s gammaloop-nextest-core> Snapshot: parse_lmbsetting_crossection
  521. 30.66 s gammaloop-nextest-core> Source: crates/gammalooprs/src/graph/parse/tests.rs:252
  522. 30.66 s gammaloop-nextest-core> ────────────────────────────────────────────────────────────────────────────────
  523. 30.66 s gammaloop-nextest-core> Expression: g.debug_dot()
  524. 30.66 s gammaloop-nextest-core> ────────────────────────────────────────────────────────────────────────────────
  525. 30.66 s gammaloop-nextest-core> -old snapshot
  526. 30.66 s gammaloop-nextest-core> +new results
  527. 30.66 s gammaloop-nextest-core> ────────────┬───────────────────────────────────────────────────────────────────
  528. 30.66 s gammaloop-nextest-core> 1 │-digraph G{
  529. 30.66 s gammaloop-nextest-core> 1 │+digraph G {
  530. 30.66 s gammaloop-nextest-core> 2 2 │ num = "1/2";
  531. 30.66 s gammaloop-nextest-core> 3 3 │ overall_factor = "2*x";
  532. 30.66 s gammaloop-nextest-core> 4 4 │ overall_factor_evaluated = "2*x";
  533. 30.66 s gammaloop-nextest-core> 5 5 │ projector = "spenso::t";
  534. 30.66 s gammaloop-nextest-core> ────────────┴───────────────────────────────────────────────────────────────────
  535. 30.66 s gammaloop-nextest-core> To update snapshots run `cargo insta review`
  536. 30.66 s gammaloop-nextest-core> Stopped on the first failure. Run `cargo insta test` to run all snapshots.
  537. 30.66 s gammaloop-nextest-core> test graph::parse::tests::parse_lmbsetting_crossection ... FAILED
  538. 30.66 s gammaloop-nextest-core>
  539. 30.66 s gammaloop-nextest-core> failures:
  540. 30.66 s gammaloop-nextest-core>
  541. 30.66 s gammaloop-nextest-core> failures:
  542. 30.66 s gammaloop-nextest-core> graph::parse::tests::parse_lmbsetting_crossection
  543. 30.66 s gammaloop-nextest-core>
  544. 30.66 s gammaloop-nextest-core> test result: FAILED. 0 passed; 1 failed; 0 ignored; 0 measured; 508 filtered out; finished in 0.25s
  545. 30.66 s gammaloop-nextest-core> system-err
  546. 30.66 s gammaloop-nextest-core> [22:03:32.134] @gammalooprs::graph::attribute_warnings WARNING : Unknown node attribute 'color_num' on graph 'G', node 'A'; did you mean 'num'?
  547. 30.66 s gammaloop-nextest-core> at crates/gammalooprs/src/graph/attribute_warnings.rs:198
  548. 30.66 s gammaloop-nextest-core> The application panicked (crashed).
  549. 30.66 s gammaloop-nextest-core> Message: snapshot assertion for 'parse_lmbsetting_crossection' failed in line 252
  550. 30.66 s gammaloop-nextest-core> Location: /nix/store/xdy1vvhll2bijdplvl9fcc2b9plkxhaa-vendor-cargo-deps/c19b7c6f923b580ac259164a89f2577984ad5ab09ee9d583b888f934adbbe8d0/insta-1.47.2/src/runtime.rs:719
  551. 30.66 s gammaloop-nextest-core>
  552. 30.66 s gammaloop-nextest-core> ━━━━━━━━━━━━━━━━━━━━━━━━━━━━━━━━━━ BACKTRACE ━━━━━━━━━━━━━━━━━━━━━━━━━━━━━━━━━━━
  553. 30.66 s gammaloop-nextest-core> 1: <color_eyre[b0c9e66060e883b2]::config::PanicHook>::panic_report<unknown>
  554. 30.66 s gammaloop-nextest-core> at <unknown source file>:<unknown line>
  555. 30.66 s gammaloop-nextest-core> 2: <color_eyre[b0c9e66060e883b2]::config::PanicHook>::into_panic_hook::{closure#0}<unknown>
  556. 30.66 s gammaloop-nextest-core> at <unknown source file>:<unknown line>
  557. 30.66 s gammaloop-nextest-core> 3: std[bcb96dfbba0ab899]::panicking::panic_with_hook<unknown>
  558. 30.66 s gammaloop-nextest-core> at <unknown source file>:<unknown line>
  559. 30.66 s gammaloop-nextest-core> 4: std[bcb96dfbba0ab899]::panicking::panic_handler::{closure#0}<unknown>
  560. 30.66 s gammaloop-nextest-core> at <unknown source file>:<unknown line>
  561. 30.66 s gammaloop-nextest-core> 5: std[bcb96dfbba0ab899]::sys::backtrace::__rust_end_short_backtrace::<std[bcb96dfbba0ab899]::panicking::panic_handler::{closure#0}, !><unknown>
  562. 30.66 s gammaloop-nextest-core> at <unknown source file>:<unknown line>
  563. 30.66 s gammaloop-nextest-core> 6: __rustc[6c289b9f9c454d21]::rust_begin_unwind<unknown>
  564. 30.66 s gammaloop-nextest-core> at <unknown source file>:<unknown line>
  565. 30.66 s gammaloop-nextest-core> 7: core[940e698046960fd5]::panicking::panic_fmt<unknown>
  566. 30.66 s gammaloop-nextest-core> at <unknown source file>:<unknown line>
  567. 30.66 s gammaloop-nextest-core> 8: insta[307a548ac79ef4d9]::runtime::assert_snapshot<unknown>
  568. 30.66 s gammaloop-nextest-core> at <unknown source file>:<unknown line>
  569. 30.66 s gammaloop-nextest-core> 9: gammalooprs[5490727360442cce]::graph::parse::tests::parse_lmbsetting_crossection<unknown>
  570. 30.66 s gammaloop-nextest-core> at <unknown source file>:<unknown line>
  571. 30.66 s gammaloop-nextest-core> 10: <gammalooprs[5490727360442cce]::graph::parse::tests::parse_lmbsetting_crossection::{closure#0} as core[940e698046960fd5]::ops::function::FnOnce<()>>::call_once<unknown>
  572. 30.66 s gammaloop-nextest-core> at <unknown source file>:<unknown line>
  573. 30.66 s gammaloop-nextest-core> 11: test[75d6903177b1d7e9]::__rust_begin_short_backtrace::<core[940e698046960fd5]::result::Result<(), alloc[2ea6bcb46fca0c42]::string::String>, fn() -> core[940e698046960fd5]::result::Result<(), alloc[2ea6bcb46fca0c42]::string::String>><unknown>
  574. 30.66 s gammaloop-nextest-core> at <unknown source file>:<unknown line>
  575. 30.66 s gammaloop-nextest-core> 12: test[75d6903177b1d7e9]::run_test::{closure#0}<unknown>
  576. 30.66 s gammaloop-nextest-core> at <unknown source file>:<unknown line>
  577. 30.66 s gammaloop-nextest-core> 13: std[bcb96dfbba0ab899]::sys::backtrace::__rust_begin_short_backtrace::<test[75d6903177b1d7e9]::run_test::{closure#1}, ()><unknown>
  578. 30.66 s gammaloop-nextest-core> at <unknown source file>:<unknown line>
  579. 30.66 s gammaloop-nextest-core> 14: <std[bcb96dfbba0ab899]::thread::lifecycle::spawn_unchecked<test[75d6903177b1d7e9]::run_test::{closure#1}, ()>::{closure#1} as core[940e698046960fd5]::ops::function::FnOnce<()>>::call_once::{shim:vtable#0}<unknown>
  580. 30.66 s gammaloop-nextest-core> at <unknown source file>:<unknown line>
  581. 30.66 s gammaloop-nextest-core> 15: <std[bcb96dfbba0ab899]::sys::thread::unix::Thread>::new::thread_start<unknown>
  582. 30.66 s gammaloop-nextest-core> at <unknown source file>:<unknown line>
  583. 30.66 s gammaloop-nextest-core> 16: start_thread<unknown>
  584. 30.66 s gammaloop-nextest-core> at <unknown source file>:<unknown line>
  585. 30.66 s gammaloop-nextest-core> 17: __clone3<unknown>
  586. 30.66 s gammaloop-nextest-core> at <unknown source file>:<unknown line>
  587. 30.66 s gammaloop-nextest-core>
  588. 30.66 s gammaloop-nextest-core> Run with COLORBT_SHOW_HIDDEN=1 environment variable to disable frame filtering.
  589. 30.66 s gammaloop-nextest-core> Run with RUST_BACKTRACE=full to include source snippets.
  590. 30.66 s gammaloop-nextest-core>
  591. 30.66 s gammaloop-nextest-core> 2. gammalooprs::uv::export::tests::computed_node_full_numerator_is_a_spenso_aware_typst_fragment
  592. 30.66 s gammaloop-nextest-core> failure: test failure with exit code 101
  593. 30.66 s gammaloop-nextest-core> system-out
  594. 30.66 s gammaloop-nextest-core> running 1 test
  595. 30.66 s gammaloop-nextest-core> test uv::export::tests::computed_node_full_numerator_is_a_spenso_aware_typst_fragment ... FAILED
  596. 30.66 s gammaloop-nextest-core>
  597. 30.66 s gammaloop-nextest-core> failures:
  598. 30.66 s gammaloop-nextest-core>
  599. 30.66 s gammaloop-nextest-core> failures:
  600. 30.66 s gammaloop-nextest-core> uv::export::tests::computed_node_full_numerator_is_a_spenso_aware_typst_fragment
  601. 30.66 s gammaloop-nextest-core>
  602. 30.66 s gammaloop-nextest-core> test result: FAILED. 0 passed; 1 failed; 0 ignored; 0 measured; 508 filtered out; finished in 0.07s
  603. 30.66 s gammaloop-nextest-core> system-err
  604. 30.66 s gammaloop-nextest-core> The application panicked (crashed).
  605. 30.66 s gammaloop-nextest-core> Message: assertion failed: exported.dot.contains(r#"full_num = "op(\"Tr\")(1)";"#)
  606. 30.66 s gammaloop-nextest-core> Location: crates/gammalooprs/src/uv/export.rs:483
  607. 30.66 s gammaloop-nextest-core>
  608. 30.66 s gammaloop-nextest-core> ━━━━━━━━━━━━━━━━━━━━━━━━━━━━━━━━━━ BACKTRACE ━━━━━━━━━━━━━━━━━━━━━━━━━━━━━━━━━━━
  609. 30.66 s gammaloop-nextest-core> 1: <color_eyre[b0c9e66060e883b2]::config::PanicHook>::panic_report<unknown>
  610. 30.66 s gammaloop-nextest-core> at <unknown source file>:<unknown line>
  611. 30.66 s gammaloop-nextest-core> 2: <color_eyre[b0c9e66060e883b2]::config::PanicHook>::into_panic_hook::{closure#0}<unknown>
  612. 30.66 s gammaloop-nextest-core> at <unknown source file>:<unknown line>
  613. 30.66 s gammaloop-nextest-core> 3: std[bcb96dfbba0ab899]::panicking::panic_with_hook<unknown>
  614. 30.66 s gammaloop-nextest-core> at <unknown source file>:<unknown line>
  615. 30.66 s gammaloop-nextest-core> 4: std[bcb96dfbba0ab899]::panicking::panic_handler::{closure#0}<unknown>
  616. 30.66 s gammaloop-nextest-core> at <unknown source file>:<unknown line>
  617. 30.66 s gammaloop-nextest-core> 5: std[bcb96dfbba0ab899]::sys::backtrace::__rust_end_short_backtrace::<std[bcb96dfbba0ab899]::panicking::panic_handler::{closure#0}, !><unknown>
  618. 30.66 s gammaloop-nextest-core> at <unknown source file>:<unknown line>
  619. 30.66 s gammaloop-nextest-core> 6: __rustc[6c289b9f9c454d21]::rust_begin_unwind<unknown>
  620. 30.66 s gammaloop-nextest-core> at <unknown source file>:<unknown line>
  621. 30.66 s gammaloop-nextest-core> 7: core[940e698046960fd5]::panicking::panic_fmt<unknown>
  622. 30.66 s gammaloop-nextest-core> at <unknown source file>:<unknown line>
  623. 30.66 s gammaloop-nextest-core> 8: core[940e698046960fd5]::panicking::panic<unknown>
  624. 30.66 s gammaloop-nextest-core> at <unknown source file>:<unknown line>
  625. 30.66 s gammaloop-nextest-core> 9: gammalooprs[5490727360442cce]::uv::export::tests::computed_node_full_numerator_is_a_spenso_aware_typst_fragment<unknown>
  626. 30.66 s gammaloop-nextest-core> at <unknown source file>:<unknown line>
  627. 30.66 s gammaloop-nextest-core> 10: <gammalooprs[5490727360442cce]::uv::export::tests::computed_node_full_numerator_is_a_spenso_aware_typst_fragment::{closure#0} as core[940e698046960fd5]::ops::function::FnOnce<()>>::call_once<unknown>
  628. 30.66 s gammaloop-nextest-core> at <unknown source file>:<unknown line>
  629. 30.66 s gammaloop-nextest-core> 11: test[75d6903177b1d7e9]::__rust_begin_short_backtrace::<core[940e698046960fd5]::result::Result<(), alloc[2ea6bcb46fca0c42]::string::String>, fn() -> core[940e698046960fd5]::result::Result<(), alloc[2ea6bcb46fca0c42]::string::String>><unknown>
  630. 30.66 s gammaloop-nextest-core> at <unknown source file>:<unknown line>
  631. 30.66 s gammaloop-nextest-core> 12: test[75d6903177b1d7e9]::run_test::{closure#0}<unknown>
  632. 30.66 s gammaloop-nextest-core> at <unknown source file>:<unknown line>
  633. 30.66 s gammaloop-nextest-core> 13: std[bcb96dfbba0ab899]::sys::backtrace::__rust_begin_short_backtrace::<test[75d6903177b1d7e9]::run_test::{closure#1}, ()><unknown>
  634. 30.66 s gammaloop-nextest-core> at <unknown source file>:<unknown line>
  635. 30.66 s gammaloop-nextest-core> 14: <std[bcb96dfbba0ab899]::thread::lifecycle::spawn_unchecked<test[75d6903177b1d7e9]::run_test::{closure#1}, ()>::{closure#1} as core[940e698046960fd5]::ops::function::FnOnce<()>>::call_once::{shim:vtable#0}<unknown>
  636. 30.66 s gammaloop-nextest-core> at <unknown source file>:<unknown line>
  637. 30.66 s gammaloop-nextest-core> 15: <std[bcb96dfbba0ab899]::sys::thread::unix::Thread>::new::thread_start<unknown>
  638. 30.66 s gammaloop-nextest-core> at <unknown source file>:<unknown line>
  639. 30.66 s gammaloop-nextest-core> 16: start_thread<unknown>
  640. 30.66 s gammaloop-nextest-core> at <unknown source file>:<unknown line>
  641. 30.66 s gammaloop-nextest-core> 17: __clone3<unknown>
  642. 30.66 s gammaloop-nextest-core> at <unknown source file>:<unknown line>
  643. 30.66 s gammaloop-nextest-core>
  644. 30.66 s gammaloop-nextest-core> Run with COLORBT_SHOW_HIDDEN=1 environment variable to disable frame filtering.
  645. 30.66 s gammaloop-nextest-core> Run with RUST_BACKTRACE=full to include source snippets.
  646. 30.66 s gammaloop-nextest-core> =========================================
  647. 30.82 s error: Cannot build '/nix/store/j0r373mhy6rmbqq05bplwn7cimlqrcnq-gammaloop-nextest-core.drv'.
  648. 30.82 s Reason: builder failed with exit code 100.
  649. 30.82 s Output paths:
  650. 30.82 s /nix/store/p7bqxxb972f7f3209b2sl1hcrmagzj6s-gammaloop-nextest-core
  651. 30.82 s Last 612 log lines:
  652. 30.82 s > Extracting 3 binaries (including 1 non-test binary), 1 build script output directory, and 2 linked paths to /build/source
  653. 30.82 s > Extracted 18 files to /build/source in 0.43s
  654. 30.82 s > ------------
  655. 30.82 s > Nextest run ID 48e6bad4-df81-4c2b-bf26-aad3db2e082d with nextest profile: ci_gammaloop
  656. 30.82 s > Starting 339 tests across 2 binaries
  657. 30.82 s > FAIL [ 0.019s] (243/339) gammaloop-api repl::tests::completion_shows_type_hint_for_non_boolean_settings_leaf
  658. 30.82 s > stdout ---
  659. 30.82 s >
  660. 30.82 s > running 1 test
  661. 30.82 s > test repl::tests::completion_shows_type_hint_for_non_boolean_settings_leaf ... FAILED
  662. 30.82 s >
  663. 30.82 s > failures:
  664. 30.82 s >
  665. 30.82 s > failures:
  666. 30.82 s > repl::tests::completion_shows_type_hint_for_non_boolean_settings_leaf
  667. 30.82 s >
  668. 30.82 s > test result: FAILED. 0 passed; 1 failed; 0 ignored; 0 measured; 338 filtered out; finished in 0.01s
  669. 30.82 s >
  670. 30.82 s > stderr ---
  671. 30.82 s >
  672. 30.82 s > thread 'repl::tests::completion_shows_type_hint_for_non_boolean_settings_leaf' (778) panicked at crates/gammaloop-api/src/repl.rs:5778:9:
  673. 30.82 s > [Suggestion { value: "", description: Some("Number of samples in the first Monte Carlo iteration."), style: None, extra: None, span: Span { start: 42, end: 42 }, append_whitespace: false }]
  674. 30.82 s > stack backtrace:
  675. 30.82 s > 0: __rustc::rust_begin_unwind
  676. 30.82 s > 1: core::panicking::panic_fmt
  677. 30.82 s > 2: gammaloop_api::repl::tests::completion_shows_type_hint_for_non_boolean_settings_leaf
  678. 30.82 s > 3: <gammaloop_api::repl::tests::completion_shows_type_hint_for_non_boolean_settings_leaf::{closure#0} as core::ops::function::FnOnce<()>>::call_once
  679. 30.82 s > note: Some details are omitted, run with `RUST_BACKTRACE=full` for a verbose backtrace.
  680. 30.82 s >
  681. 30.82 s > FAIL [ 0.033s] (278/339) gammaloop-api templates::tests::extract_templates_uses_canonical_package_layout
  682. 30.82 s > stdout ---
  683. 30.82 s >
  684. 30.82 s > running 1 test
  685. 30.82 s > test templates::tests::extract_templates_uses_canonical_package_layout ... FAILED
  686. 30.82 s >
  687. 30.82 s > failures:
  688. 30.82 s >
  689. 30.82 s > failures:
  690. 30.82 s > templates::tests::extract_templates_uses_canonical_package_layout
  691. 30.82 s >
  692. 30.82 s > test result: FAILED. 0 passed; 1 failed; 0 ignored; 0 measured; 338 filtered out; finished in 0.02s
  693. 30.82 s >
  694. 30.82 s > stderr ---
  695. 30.82 s >
  696. 30.82 s > thread 'templates::tests::extract_templates_uses_canonical_package_layout' (876) panicked at crates/gammaloop-api/src/templates.rs:99:9:
  697. 30.82 s > assertion failed: figure.contains("amplitude-mode")
  698. 30.82 s > stack backtrace:
  699. 30.82 s > 0: __rustc::rust_begin_unwind
  700. 30.82 s > 1: core::panicking::panic_fmt
  701. 30.82 s > 2: core::panicking::panic
  702. 30.82 s > 3: gammaloop_api::templates::tests::extract_templates_uses_canonical_package_layout
  703. 30.82 s > 4: <gammaloop_api::templates::tests::extract_templates_uses_canonical_package_layout::{closure#0} as core::ops::function::FnOnce<()>>::call_once
  704. 30.82 s > note: Some details are omitted, run with `RUST_BACKTRACE=full` for a verbose backtrace.
  705. 30.82 s >
  706. 30.82 s > ------------
  707. 30.82 s > Summary [ 0.491s] 339 tests run: 337 passed, 2 failed, 0 skipped
  708. 30.82 s > FAIL [ 0.019s] (243/339) gammaloop-api repl::tests::completion_shows_type_hint_for_non_boolean_settings_leaf
  709. 30.82 s > stdout ---
  710. 30.82 s >
  711. 30.82 s > running 1 test
  712. 30.82 s > test repl::tests::completion_shows_type_hint_for_non_boolean_settings_leaf ... FAILED
  713. 30.82 s >
  714. 30.82 s > failures:
  715. 30.82 s >
  716. 30.82 s > failures:
  717. 30.82 s > repl::tests::completion_shows_type_hint_for_non_boolean_settings_leaf
  718. 30.82 s >
  719. 30.82 s > test result: FAILED. 0 passed; 1 failed; 0 ignored; 0 measured; 338 filtered out; finished in 0.01s
  720. 30.82 s >
  721. 30.82 s > stderr ---
  722. 30.82 s >
  723. 30.82 s > thread 'repl::tests::completion_shows_type_hint_for_non_boolean_settings_leaf' (778) panicked at crates/gammaloop-api/src/repl.rs:5778:9:
  724. 30.82 s > [Suggestion { value: "", description: Some("Number of samples in the first Monte Carlo iteration."), style: None, extra: None, span: Span { start: 42, end: 42 }, append_whitespace: false }]
  725. 30.82 s > stack backtrace:
  726. 30.82 s > 0: __rustc::rust_begin_unwind
  727. 30.82 s > 1: core::panicking::panic_fmt
  728. 30.82 s > 2: gammaloop_api::repl::tests::completion_shows_type_hint_for_non_boolean_settings_leaf
  729. 30.82 s > 3: <gammaloop_api::repl::tests::completion_shows_type_hint_for_non_boolean_settings_leaf::{closure#0} as core::ops::function::FnOnce<()>>::call_once
  730. 30.82 s > note: Some details are omitted, run with `RUST_BACKTRACE=full` for a verbose backtrace.
  731. 30.82 s >
  732. 30.82 s > FAIL [ 0.033s] (278/339) gammaloop-api templates::tests::extract_templates_uses_canonical_package_layout
  733. 30.82 s > stdout ---
  734. 30.82 s >
  735. 30.82 s > running 1 test
  736. 30.82 s > test templates::tests::extract_templates_uses_canonical_package_layout ... FAILED
  737. 30.82 s >
  738. 30.82 s > failures:
  739. 30.82 s >
  740. 30.82 s > failures:
  741. 30.82 s > templates::tests::extract_templates_uses_canonical_package_layout
  742. 30.82 s >
  743. 30.82 s > test result: FAILED. 0 passed; 1 failed; 0 ignored; 0 measured; 338 filtered out; finished in 0.02s
  744. 30.82 s >
  745. 30.82 s > stderr ---
  746. 30.82 s >
  747. 30.82 s > thread 'templates::tests::extract_templates_uses_canonical_package_layout' (876) panicked at crates/gammaloop-api/src/templates.rs:99:9:
  748. 30.82 s > assertion failed: figure.contains("amplitude-mode")
  749. 30.82 s > stack backtrace:
  750. 30.82 s > 0: __rustc::rust_begin_unwind
  751. 30.82 s > 1: core::panicking::panic_fmt
  752. 30.82 s > 2: core::panicking::panic
  753. 30.82 s > 3: gammaloop_api::templates::tests::extract_templates_uses_canonical_package_layout
  754. 30.82 s > 4: <gammaloop_api::templates::tests::extract_templates_uses_canonical_package_layout::{closure#0} as core::ops::function::FnOnce<()>>::call_once
  755. 30.82 s > note: Some details are omitted, run with `RUST_BACKTRACE=full` for a verbose backtrace.
  756. 30.82 s >
  757. 30.82 s > error: test run failed
  758. 30.82 s >
  759. 30.82 s > ========== nextest test summary ==========
  760. 30.82 s > report: target/nextest/ci_gammaloop/junit.xml
  761. 30.82 s > tests: 339, failures: 2, errors: 0
  762. 30.82 s >
  763. 30.82 s > 1. gammaloop-api::repl::tests::completion_shows_type_hint_for_non_boolean_settings_leaf
  764. 30.82 s > failure: test failure with exit code 101
  765. 30.82 s > thread 'repl::tests::completion_shows_type_hint_for_non_boolean_settings_leaf' (778) panicked at crates/gammaloop-api/src/repl.rs:5778:9:
  766. 30.82 s > [Suggestion { value: "", description: Some("Number of samples in the first Monte Carlo iteration."), style: None, extra: None, span: Span { start: 42, end: 42 }, append_whitespace: false }]
  767. 30.82 s > stack backtrace:
  768. 30.82 s > 0: __rustc::rust_begin_unwind
  769. 30.82 s > 1: core::panicking::panic_fmt
  770. 30.82 s > 2: gammaloop_api::repl::tests::completion_shows_type_hint_for_non_boolean_settings_leaf
  771. 30.82 s > 3: <gammaloop_api::repl::tests::completion_shows_type_hint_for_non_boolean_settings_leaf::{closure#0} as core::ops::function::FnOnce<()>>::call_once
  772. 30.82 s > note: Some details are omitted, run with `RUST_BACKTRACE=full` for a verbose backtrace.
  773. 30.82 s > system-out
  774. 30.82 s > running 1 test
  775. 30.82 s > test repl::tests::completion_shows_type_hint_for_non_boolean_settings_leaf ... FAILED
  776. 30.82 s >
  777. 30.82 s > failures:
  778. 30.82 s >
  779. 30.82 s > failures:
  780. 30.82 s > repl::tests::completion_shows_type_hint_for_non_boolean_settings_leaf
  781. 30.82 s >
  782. 30.82 s > test result: FAILED. 0 passed; 1 failed; 0 ignored; 0 measured; 338 filtered out; finished in 0.01s
  783. 30.82 s > system-err
  784. 30.82 s > thread 'repl::tests::completion_shows_type_hint_for_non_boolean_settings_leaf' (778) panicked at crates/gammaloop-api/src/repl.rs:5778:9:
  785. 30.82 s > [Suggestion { value: "", description: Some("Number of samples in the first Monte Carlo iteration."), style: None, extra: None, span: Span { start: 42, end: 42 }, append_whitespace: false }]
  786. 30.82 s > stack backtrace:
  787. 30.82 s > 0: __rustc::rust_begin_unwind
  788. 30.82 s > 1: core::panicking::panic_fmt
  789. 30.82 s > 2: gammaloop_api::repl::tests::completion_shows_type_hint_for_non_boolean_settings_leaf
  790. 30.82 s > 3: <gammaloop_api::repl::tests::completion_shows_type_hint_for_non_boolean_settings_leaf::{closure#0} as core::ops::function::FnOnce<()>>::call_once
  791. 30.82 s > note: Some details are omitted, run with `RUST_BACKTRACE=full` for a verbose backtrace.
  792. 30.82 s >
  793. 30.82 s > 2. gammaloop-api::templates::tests::extract_templates_uses_canonical_package_layout
  794. 30.82 s > failure: test failure with exit code 101
  795. 30.82 s > thread 'templates::tests::extract_templates_uses_canonical_package_layout' (876) panicked at crates/gammaloop-api/src/templates.rs:99:9:
  796. 30.82 s > assertion failed: figure.contains("amplitude-mode")
  797. 30.82 s > stack backtrace:
  798. 30.82 s > 0: __rustc::rust_begin_unwind
  799. 30.82 s > 1: core::panicking::panic_fmt
  800. 30.82 s > 2: core::panicking::panic
  801. 30.82 s > 3: gammaloop_api::templates::tests::extract_templates_uses_canonical_package_layout
  802. 30.82 s > 4: <gammaloop_api::templates::tests::extract_templates_uses_canonical_package_layout::{closure#0} as core::ops::function::FnOnce<()>>::call_once
  803. 30.82 s > note: Some details are omitted, run with `RUST_BACKTRACE=full` for a verbose backtrace.
  804. 30.82 s > system-out
  805. 30.82 s > running 1 test
  806. 30.82 s > test templates::tests::extract_templates_uses_canonical_package_layout ... FAILED
  807. 30.82 s >
  808. 30.82 s > failures:
  809. 30.82 s >
  810. 30.82 s > failures:
  811. 30.82 s > templates::tests::extract_templates_uses_canonical_package_layout
  812. 30.82 s >
  813. 30.82 s > test result: FAILED. 0 passed; 1 failed; 0 ignored; 0 measured; 338 filtered out; finished in 0.02s
  814. 30.82 s > system-err
  815. 30.82 s > thread 'templates::tests::extract_templates_uses_canonical_package_layout' (876) panicked at crates/gammaloop-api/src/templates.rs:99:9:
  816. 30.82 s > assertion failed: figure.contains("amplitude-mode")
  817. 30.82 s > stack backtrace:
  818. 30.82 s > 0: __rustc::rust_begin_unwind
  819. 30.82 s > 1: core::panicking::panic_fmt
  820. 30.82 s > 2: core::panicking::panic
  821. 30.82 s > 3: gammaloop_api::templates::tests::extract_templates_uses_canonical_package_layout
  822. 30.82 s > 4: <gammaloop_api::templates::tests::extract_templates_uses_canonical_package_layout::{closure#0} as core::ops::function::FnOnce<()>>::call_once
  823. 30.82 s > note: Some details are omitted, run with `RUST_BACKTRACE=full` for a verbose backtrace.
  824. 30.82 s > =========================================
  825. 30.82 s > Extracting 1 binary and 1 linked path to /build/source
  826. 30.82 s > Extracted 7 files to /build/source in 0.07s
  827. 30.82 s > ------------
  828. 30.82 s > Nextest run ID e7d3d1f5-afef-44df-baaf-91cad84a6449 with nextest profile: ci_gammaloop
  829. 30.82 s > Starting 19 tests across 1 binary
  830. 30.82 s > ------------
  831. 30.82 s > Summary [ 0.013s] 19 tests run: 19 passed, 0 skipped
  832. 30.82 s >
  833. 30.82 s > ========== nextest test summary ==========
  834. 30.82 s > report: target/nextest/ci_gammaloop/junit.xml
  835. 30.82 s > tests: 19, failures: 0, errors: 0
  836. 30.82 s > No failing testcases found.
  837. 30.82 s > =========================================
  838. 30.82 s > Extracting 1 binary to /build/source
  839. 30.82 s > Extracted 4 files to /build/source in 0.04s
  840. 30.82 s > ------------
  841. 30.82 s > Nextest run ID cc420566-0c3a-48c6-8131-41348c035b79 with nextest profile: ci_gammaloop
  842. 30.82 s > Starting 0 tests across 1 binary
  843. 30.82 s > ------------
  844. 30.82 s > Summary [ 0.000s] 0 tests run: 0 passed, 0 skipped
  845. 30.82 s >
  846. 30.82 s > ========== nextest test summary ==========
  847. 30.82 s > report: target/nextest/ci_gammaloop/junit.xml
  848. 30.82 s > tests: 0, failures: 0, errors: 0
  849. 30.82 s > No failing testcases found.
  850. 30.82 s > =========================================
  851. 30.82 s > Extracting 4 binaries, 1 build script output directory, and 2 linked paths to /build/source
  852. 30.82 s > Extracted 18 files to /build/source in 0.44s
  853. 30.82 s > ------------
  854. 30.82 s > Nextest run ID b48d0cbe-0a1a-474c-b19f-6279862b89a1 with nextest profile: ci_gammaloop
  855. 30.82 s > Starting 456 tests across 4 binaries (61 tests skipped, including 60 tests via profile.ci_gammaloop.default-filter)
  856. 30.82 s > FAIL [ 0.260s] (161/456) gammalooprs graph::parse::tests::parse_lmbsetting_crossection
  857. 30.82 s > stdout ---
  858. 30.82 s >
  859. 30.82 s > running 1 test
  860. 30.82 s > ━━━━━━━━━━━━━━━━━━━━━━━━━━━━━━━ Snapshot Summary ━━━━━━━━━━━━━━━━━━━━━━━━━━━━━━━
  861. 30.82 s > Snapshot: parse_lmbsetting_crossection
  862. 30.82 s > Source: crates/gammalooprs/src/graph/parse/tests.rs:252
  863. 30.82 s > ────────────────────────────────────────────────────────────────────────────────
  864. 30.82 s > Expression: g.debug_dot()
  865. 30.82 s > ────────────────────────────────────────────────────────────────────────────────
  866. 30.82 s > -old snapshot
  867. 30.82 s > +new results
  868. 30.82 s > ────────────┬───────────────────────────────────────────────────────────────────
  869. 30.82 s > 1 │-digraph G{
  870. 30.82 s > 1 │+digraph G {
  871. 30.82 s > 2 2 │ num = "1/2";
  872. 30.82 s > 3 3 │ overall_factor = "2*x";
  873. 30.82 s > 4 4 │ overall_factor_evaluated = "2*x";
  874. 30.82 s > 5 5 │ projector = "spenso::t";
  875. 30.82 s > ────────────┴───────────────────────────────────────────────────────────────────
  876. 30.82 s > To update snapshots run `cargo insta review`
  877. 30.82 s > Stopped on the first failure. Run `cargo insta test` to run all snapshots.
  878. 30.82 s > test graph::parse::tests::parse_lmbsetting_crossection ... FAILED
  879. 30.82 s >
  880. 30.82 s > failures:
  881. 30.82 s >
  882. 30.82 s > failures:
  883. 30.82 s > graph::parse::tests::parse_lmbsetting_crossection
  884. 30.82 s >
  885. 30.82 s > test result: FAILED. 0 passed; 1 failed; 0 ignored; 0 measured; 508 filtered out; finished in 0.25s
  886. 30.82 s >
  887. 30.82 s > stderr ---
  888. 30.82 s > [22:03:32.134] @gammalooprs::graph::attribute_warnings WARNING : Unknown node attribute 'color_num' on graph 'G', node 'A'; did you mean 'num'?
  889. 30.82 s > at crates/gammalooprs/src/graph/attribute_warnings.rs:198
  890. 30.82 s > The application panicked (crashed).
  891. 30.82 s > Message: snapshot assertion for 'parse_lmbsetting_crossection' failed in line 252
  892. 30.82 s > Location: /nix/store/xdy1vvhll2bijdplvl9fcc2b9plkxhaa-vendor-cargo-deps/c19b7c6f923b580ac259164a89f2577984ad5ab09ee9d583b888f934adbbe8d0/insta-1.47.2/src/runtime.rs:719
  893. 30.82 s >
  894. 30.82 s > ━━━━━━━━━━━━━━━━━━━━━━━━━━━━━━━━━━ BACKTRACE ━━━━━━━━━━━━━━━━━━━━━━━━━━━━━━━━━━━
  895. 30.82 s > 1: <color_eyre[b0c9e66060e883b2]::config::PanicHook>::panic_report<unknown>
  896. 30.82 s > at <unknown source file>:<unknown line>
  897. 30.82 s > 2: <color_eyre[b0c9e66060e883b2]::config::PanicHook>::into_panic_hook::{closure#0}<unknown>
  898. 30.82 s > at <unknown source file>:<unknown line>
  899. 30.82 s > 3: std[bcb96dfbba0ab899]::panicking::panic_with_hook<unknown>
  900. 30.82 s > at <unknown source file>:<unknown line>
  901. 30.82 s > 4: std[bcb96dfbba0ab899]::panicking::panic_handler::{closure#0}<unknown>
  902. 30.82 s > at <unknown source file>:<unknown line>
  903. 30.82 s > 5: std[bcb96dfbba0ab899]::sys::backtrace::__rust_end_short_backtrace::<std[bcb96dfbba0ab899]::panicking::panic_handler::{closure#0}, !><unknown>
  904. 30.82 s > at <unknown source file>:<unknown line>
  905. 30.82 s > 6: __rustc[6c289b9f9c454d21]::rust_begin_unwind<unknown>
  906. 30.82 s > at <unknown source file>:<unknown line>
  907. 30.82 s > 7: core[940e698046960fd5]::panicking::panic_fmt<unknown>
  908. 30.82 s > at <unknown source file>:<unknown line>
  909. 30.82 s > 8: insta[307a548ac79ef4d9]::runtime::assert_snapshot<unknown>
  910. 30.82 s > at <unknown source file>:<unknown line>
  911. 30.82 s > 9: gammalooprs[5490727360442cce]::graph::parse::tests::parse_lmbsetting_crossection<unknown>
  912. 30.82 s > at <unknown source file>:<unknown line>
  913. 30.82 s > 10: <gammalooprs[5490727360442cce]::graph::parse::tests::parse_lmbsetting_crossection::{closure#0} as core[940e698046960fd5]::ops::function::FnOnce<()>>::call_once<unknown>
  914. 30.82 s > at <unknown source file>:<unknown line>
  915. 30.82 s > 11: test[75d6903177b1d7e9]::__rust_begin_short_backtrace::<core[940e698046960fd5]::result::Result<(), alloc[2ea6bcb46fca0c42]::string::String>, fn() -> core[940e698046960fd5]::result::Result<(), alloc[2ea6bcb46fca0c42]::string::String>><unknown>
  916. 30.82 s > at <unknown source file>:<unknown line>
  917. 30.82 s > 12: test[75d6903177b1d7e9]::run_test::{closure#0}<unknown>
  918. 30.82 s > at <unknown source file>:<unknown line>
  919. 30.82 s > 13: std[bcb96dfbba0ab899]::sys::backtrace::__rust_begin_short_backtrace::<test[75d6903177b1d7e9]::run_test::{closure#1}, ()><unknown>
  920. 30.82 s > at <unknown source file>:<unknown line>
  921. 30.82 s > 14: <std[bcb96dfbba0ab899]::thread::lifecycle::spawn_unchecked<test[75d6903177b1d7e9]::run_test::{closure#1}, ()>::{closure#1} as core[940e698046960fd5]::ops::function::FnOnce<()>>::call_once::{shim:vtable#0}<unknown>
  922. 30.82 s > at <unknown source file>:<unknown line>
  923. 30.82 s > 15: <std[bcb96dfbba0ab899]::sys::thread::unix::Thread>::new::thread_start<unknown>
  924. 30.82 s > at <unknown source file>:<unknown line>
  925. 30.82 s > 16: start_thread<unknown>
  926. 30.82 s > at <unknown source file>:<unknown line>
  927. 30.82 s > 17: __clone3<unknown>
  928. 30.82 s > at <unknown source file>:<unknown line>
  929. 30.82 s >
  930. 30.82 s > Run with COLORBT_SHOW_HIDDEN=1 environment variable to disable frame filtering.
  931. 30.82 s > Run with RUST_BACKTRACE=full to include source snippets.
  932. 30.82 s >
  933. 30.82 s > FAIL [ 0.086s] (407/456) gammalooprs uv::export::tests::computed_node_full_numerator_is_a_spenso_aware_typst_fragment
  934. 30.82 s > stdout ---
  935. 30.82 s >
  936. 30.82 s > running 1 test
  937. 30.82 s > test uv::export::tests::computed_node_full_numerator_is_a_spenso_aware_typst_fragment ... FAILED
  938. 30.82 s >
  939. 30.82 s > failures:
  940. 30.82 s >
  941. 30.82 s > failures:
  942. 30.82 s > uv::export::tests::computed_node_full_numerator_is_a_spenso_aware_typst_fragment
  943. 30.82 s >
  944. 30.82 s > test result: FAILED. 0 passed; 1 failed; 0 ignored; 0 measured; 508 filtered out; finished in 0.07s
  945. 30.82 s >
  946. 30.82 s > stderr ---
  947. 30.82 s > The application panicked (crashed).
  948. 30.82 s > Message: assertion failed: exported.dot.contains(r#"full_num = "op(\"Tr\")(1)";"#)
  949. 30.82 s > Location: crates/gammalooprs/src/uv/export.rs:483
  950. 30.82 s >
  951. 30.82 s > ━━━━━━━━━━━━━━━━━━━━━━━━━━━━━━━━━━ BACKTRACE ━━━━━━━━━━━━━━━━━━━━━━━━━━━━━━━━━━━
  952. 30.82 s > 1: <color_eyre[b0c9e66060e883b2]::config::PanicHook>::panic_report<unknown>
  953. 30.82 s > at <unknown source file>:<unknown line>
  954. 30.82 s > 2: <color_eyre[b0c9e66060e883b2]::config::PanicHook>::into_panic_hook::{closure#0}<unknown>
  955. 30.82 s > at <unknown source file>:<unknown line>
  956. 30.82 s > 3: std[bcb96dfbba0ab899]::panicking::panic_with_hook<unknown>
  957. 30.82 s > at <unknown source file>:<unknown line>
  958. 30.82 s > 4: std[bcb96dfbba0ab899]::panicking::panic_handler::{closure#0}<unknown>
  959. 30.82 s > at <unknown source file>:<unknown line>
  960. 30.82 s > 5: std[bcb96dfbba0ab899]::sys::backtrace::__rust_end_short_backtrace::<std[bcb96dfbba0ab899]::panicking::panic_handler::{closure#0}, !><unknown>
  961. 30.82 s > at <unknown source file>:<unknown line>
  962. 30.82 s > 6: __rustc[6c289b9f9c454d21]::rust_begin_unwind<unknown>
  963. 30.82 s > at <unknown source file>:<unknown line>
  964. 30.82 s > 7: core[940e698046960fd5]::panicking::panic_fmt<unknown>
  965. 30.82 s > at <unknown source file>:<unknown line>
  966. 30.82 s > 8: core[940e698046960fd5]::panicking::panic<unknown>
  967. 30.82 s > at <unknown source file>:<unknown line>
  968. 30.82 s > 9: gammalooprs[5490727360442cce]::uv::export::tests::computed_node_full_numerator_is_a_spenso_aware_typst_fragment<unknown>
  969. 30.82 s > at <unknown source file>:<unknown line>
  970. 30.82 s > 10: <gammalooprs[5490727360442cce]::uv::export::tests::computed_node_full_numerator_is_a_spenso_aware_typst_fragment::{closure#0} as core[940e698046960fd5]::ops::function::FnOnce<()>>::call_once<unknown>
  971. 30.82 s > at <unknown source file>:<unknown line>
  972. 30.82 s > 11: test[75d6903177b1d7e9]::__rust_begin_short_backtrace::<core[940e698046960fd5]::result::Result<(), alloc[2ea6bcb46fca0c42]::string::String>, fn() -> core[940e698046960fd5]::result::Result<(), alloc[2ea6bcb46fca0c42]::string::String>><unknown>
  973. 30.82 s > at <unknown source file>:<unknown line>
  974. 30.82 s > 12: test[75d6903177b1d7e9]::run_test::{closure#0}<unknown>
  975. 30.82 s > at <unknown source file>:<unknown line>
  976. 30.82 s > 13: std[bcb96dfbba0ab899]::sys::backtrace::__rust_begin_short_backtrace::<test[75d6903177b1d7e9]::run_test::{closure#1}, ()><unknown>
  977. 30.82 s > at <unknown source file>:<unknown line>
  978. 30.82 s > 14: <std[bcb96dfbba0ab899]::thread::lifecycle::spawn_unchecked<test[75d6903177b1d7e9]::run_test::{closure#1}, ()>::{closure#1} as core[940e698046960fd5]::ops::function::FnOnce<()>>::call_once::{shim:vtable#0}<unknown>
  979. 30.82 s > at <unknown source file>:<unknown line>
  980. 30.82 s > 15: <std[bcb96dfbba0ab899]::sys::thread::unix::Thread>::new::thread_start<unknown>
  981. 30.82 s > at <unknown source file>:<unknown line>
  982. 30.82 s > 16: start_thread<unknown>
  983. 30.82 s > at <unknown source file>:<unknown line>
  984. 30.82 s > 17: __clone3<unknown>
  985. 30.82 s > at <unknown source file>:<unknown line>
  986. 30.82 s >
  987. 30.82 s > Run with COLORBT_SHOW_HIDDEN=1 environment variable to disable frame filtering.
  988. 30.82 s > Run with RUST_BACKTRACE=full to include source snippets.
  989. 30.82 s >
  990. 30.82 s > ------------
  991. 30.82 s > Summary [ 9.243s] 456 tests run: 454 passed, 2 failed, 61 skipped
  992. 30.82 s > FAIL [ 0.260s] (161/456) gammalooprs graph::parse::tests::parse_lmbsetting_crossection
  993. 30.82 s > stdout ---
  994. 30.82 s >
  995. 30.82 s > running 1 test
  996. 30.82 s > ━━━━━━━━━━━━━━━━━━━━━━━━━━━━━━━ Snapshot Summary ━━━━━━━━━━━━━━━━━━━━━━━━━━━━━━━
  997. 30.82 s > Snapshot: parse_lmbsetting_crossection
  998. 30.82 s > Source: crates/gammalooprs/src/graph/parse/tests.rs:252
  999. 30.82 s > ────────────────────────────────────────────────────────────────────────────────
  1000. 30.82 s > Expression: g.debug_dot()
  1001. 30.82 s > ────────────────────────────────────────────────────────────────────────────────
  1002. 30.82 s > -old snapshot
  1003. 30.82 s > +new results
  1004. 30.82 s > ────────────┬───────────────────────────────────────────────────────────────────
  1005. 30.82 s > 1 │-digraph G{
  1006. 30.82 s > 1 │+digraph G {
  1007. 30.82 s > 2 2 │ num = "1/2";
  1008. 30.82 s > 3 3 │ overall_factor = "2*x";
  1009. 30.82 s > 4 4 │ overall_factor_evaluated = "2*x";
  1010. 30.82 s > 5 5 │ projector = "spenso::t";
  1011. 30.82 s > ────────────┴───────────────────────────────────────────────────────────────────
  1012. 30.82 s > To update snapshots run `cargo insta review`
  1013. 30.82 s > Stopped on the first failure. Run `cargo insta test` to run all snapshots.
  1014. 30.82 s > test graph::parse::tests::parse_lmbsetting_crossection ... FAILED
  1015. 30.82 s >
  1016. 30.82 s > failures:
  1017. 30.82 s >
  1018. 30.82 s > failures:
  1019. 30.82 s > graph::parse::tests::parse_lmbsetting_crossection
  1020. 30.82 s >
  1021. 30.82 s > test result: FAILED. 0 passed; 1 failed; 0 ignored; 0 measured; 508 filtered out; finished in 0.25s
  1022. 30.82 s >
  1023. 30.82 s > stderr ---
  1024. 30.82 s > [22:03:32.134] @gammalooprs::graph::attribute_warnings WARNING : Unknown node attribute 'color_num' on graph 'G', node 'A'; did you mean 'num'?
  1025. 30.82 s > at crates/gammalooprs/src/graph/attribute_warnings.rs:198
  1026. 30.82 s > The application panicked (crashed).
  1027. 30.82 s > Message: snapshot assertion for 'parse_lmbsetting_crossection' failed in line 252
  1028. 30.82 s > Location: /nix/store/xdy1vvhll2bijdplvl9fcc2b9plkxhaa-vendor-cargo-deps/c19b7c6f923b580ac259164a89f2577984ad5ab09ee9d583b888f934adbbe8d0/insta-1.47.2/src/runtime.rs:719
  1029. 30.82 s >
  1030. 30.82 s > ━━━━━━━━━━━━━━━━━━━━━━━━━━━━━━━━━━ BACKTRACE ━━━━━━━━━━━━━━━━━━━━━━━━━━━━━━━━━━━
  1031. 30.82 s > 1: <color_eyre[b0c9e66060e883b2]::config::PanicHook>::panic_report<unknown>
  1032. 30.82 s > at <unknown source file>:<unknown line>
  1033. 30.82 s > 2: <color_eyre[b0c9e66060e883b2]::config::PanicHook>::into_panic_hook::{closure#0}<unknown>
  1034. 30.82 s > at <unknown source file>:<unknown line>
  1035. 30.82 s > 3: std[bcb96dfbba0ab899]::panicking::panic_with_hook<unknown>
  1036. 30.82 s > at <unknown source file>:<unknown line>
  1037. 30.82 s > 4: std[bcb96dfbba0ab899]::panicking::panic_handler::{closure#0}<unknown>
  1038. 30.82 s > at <unknown source file>:<unknown line>
  1039. 30.82 s > 5: std[bcb96dfbba0ab899]::sys::backtrace::__rust_end_short_backtrace::<std[bcb96dfbba0ab899]::panicking::panic_handler::{closure#0}, !><unknown>
  1040. 30.82 s > at <unknown source file>:<unknown line>
  1041. 30.82 s > 6: __rustc[6c289b9f9c454d21]::rust_begin_unwind<unknown>
  1042. 30.82 s > at <unknown source file>:<unknown line>
  1043. 30.82 s > 7: core[940e698046960fd5]::panicking::panic_fmt<unknown>
  1044. 30.82 s > at <unknown source file>:<unknown line>
  1045. 30.82 s > 8: insta[307a548ac79ef4d9]::runtime::assert_snapshot<unknown>
  1046. 30.82 s > at <unknown source file>:<unknown line>
  1047. 30.82 s > 9: gammalooprs[5490727360442cce]::graph::parse::tests::parse_lmbsetting_crossection<unknown>
  1048. 30.82 s > at <unknown source file>:<unknown line>
  1049. 30.82 s > 10: <gammalooprs[5490727360442cce]::graph::parse::tests::parse_lmbsetting_crossection::{closure#0} as core[940e698046960fd5]::ops::function::FnOnce<()>>::call_once<unknown>
  1050. 30.82 s > at <unknown source file>:<unknown line>
  1051. 30.82 s > 11: test[75d6903177b1d7e9]::__rust_begin_short_backtrace::<core[940e698046960fd5]::result::Result<(), alloc[2ea6bcb46fca0c42]::string::String>, fn() -> core[940e698046960fd5]::result::Result<(), alloc[2ea6bcb46fca0c42]::string::String>><unknown>
  1052. 30.82 s > at <unknown source file>:<unknown line>
  1053. 30.82 s > 12: test[75d6903177b1d7e9]::run_test::{closure#0}<unknown>
  1054. 30.82 s > at <unknown source file>:<unknown line>
  1055. 30.82 s > 13: std[bcb96dfbba0ab899]::sys::backtrace::__rust_begin_short_backtrace::<test[75d6903177b1d7e9]::run_test::{closure#1}, ()><unknown>
  1056. 30.82 s > at <unknown source file>:<unknown line>
  1057. 30.82 s > 14: <std[bcb96dfbba0ab899]::thread::lifecycle::spawn_unchecked<test[75d6903177b1d7e9]::run_test::{closure#1}, ()>::{closure#1} as core[940e698046960fd5]::ops::function::FnOnce<()>>::call_once::{shim:vtable#0}<unknown>
  1058. 30.82 s > at <unknown source file>:<unknown line>
  1059. 30.82 s > 15: <std[bcb96dfbba0ab899]::sys::thread::unix::Thread>::new::thread_start<unknown>
  1060. 30.82 s > at <unknown source file>:<unknown line>
  1061. 30.82 s > 16: start_thread<unknown>
  1062. 30.82 s > at <unknown source file>:<unknown line>
  1063. 30.82 s > 17: __clone3<unknown>
  1064. 30.82 s > at <unknown source file>:<unknown line>
  1065. 30.82 s >
  1066. 30.82 s > Run with COLORBT_SHOW_HIDDEN=1 environment variable to disable frame filtering.
  1067. 30.82 s > Run with RUST_BACKTRACE=full to include source snippets.
  1068. 30.82 s >
  1069. 30.82 s > FAIL [ 0.086s] (407/456) gammalooprs uv::export::tests::computed_node_full_numerator_is_a_spenso_aware_typst_fragment
  1070. 30.82 s > stdout ---
  1071. 30.82 s >
  1072. 30.82 s > running 1 test
  1073. 30.82 s > test uv::export::tests::computed_node_full_numerator_is_a_spenso_aware_typst_fragment ... FAILED
  1074. 30.82 s >
  1075. 30.82 s > failures:
  1076. 30.82 s >
  1077. 30.82 s > failures:
  1078. 30.82 s > uv::export::tests::computed_node_full_numerator_is_a_spenso_aware_typst_fragment
  1079. 30.82 s >
  1080. 30.82 s > test result: FAILED. 0 passed; 1 failed; 0 ignored; 0 measured; 508 filtered out; finished in 0.07s
  1081. 30.82 s >
  1082. 30.82 s > stderr ---
  1083. 30.82 s > The application panicked (crashed).
  1084. 30.83 s > Message: assertion failed: exported.dot.contains(r#"full_num = "op(\"Tr\")(1)";"#)
  1085. 30.83 s > Location: crates/gammalooprs/src/uv/export.rs:483
  1086. 30.83 s >
  1087. 30.83 s > ━━━━━━━━━━━━━━━━━━━━━━━━━━━━━━━━━━ BACKTRACE ━━━━━━━━━━━━━━━━━━━━━━━━━━━━━━━━━━━
  1088. 30.83 s > 1: <color_eyre[b0c9e66060e883b2]::config::PanicHook>::panic_report<unknown>
  1089. 30.83 s > at <unknown source file>:<unknown line>
  1090. 30.83 s > 2: <color_eyre[b0c9e66060e883b2]::config::PanicHook>::into_panic_hook::{closure#0}<unknown>
  1091. 30.83 s > at <unknown source file>:<unknown line>
  1092. 30.83 s > 3: std[bcb96dfbba0ab899]::panicking::panic_with_hook<unknown>
  1093. 30.83 s > at <unknown source file>:<unknown line>
  1094. 30.83 s > 4: std[bcb96dfbba0ab899]::panicking::panic_handler::{closure#0}<unknown>
  1095. 30.83 s > at <unknown source file>:<unknown line>
  1096. 30.83 s > 5: std[bcb96dfbba0ab899]::sys::backtrace::__rust_end_short_backtrace::<std[bcb96dfbba0ab899]::panicking::panic_handler::{closure#0}, !><unknown>
  1097. 30.83 s > at <unknown source file>:<unknown line>
  1098. 30.83 s > 6: __rustc[6c289b9f9c454d21]::rust_begin_unwind<unknown>
  1099. 30.83 s > at <unknown source file>:<unknown line>
  1100. 30.83 s > 7: core[940e698046960fd5]::panicking::panic_fmt<unknown>
  1101. 30.83 s > at <unknown source file>:<unknown line>
  1102. 30.83 s > 8: core[940e698046960fd5]::panicking::panic<unknown>
  1103. 30.83 s > at <unknown source file>:<unknown line>
  1104. 30.83 s > 9: gammalooprs[5490727360442cce]::uv::export::tests::computed_node_full_numerator_is_a_spenso_aware_typst_fragment<unknown>
  1105. 30.83 s > at <unknown source file>:<unknown line>
  1106. 30.83 s > 10: <gammalooprs[5490727360442cce]::uv::export::tests::computed_node_full_numerator_is_a_spenso_aware_typst_fragment::{closure#0} as core[940e698046960fd5]::ops::function::FnOnce<()>>::call_once<unknown>
  1107. 30.83 s > at <unknown source file>:<unknown line>
  1108. 30.83 s > 11: test[75d6903177b1d7e9]::__rust_begin_short_backtrace::<core[940e698046960fd5]::result::Result<(), alloc[2ea6bcb46fca0c42]::string::String>, fn() -> core[940e698046960fd5]::result::Result<(), alloc[2ea6bcb46fca0c42]::string::String>><unknown>
  1109. 30.83 s > at <unknown source file>:<unknown line>
  1110. 30.83 s > 12: test[75d6903177b1d7e9]::run_test::{closure#0}<unknown>
  1111. 30.83 s > at <unknown source file>:<unknown line>
  1112. 30.83 s > 13: std[bcb96dfbba0ab899]::sys::backtrace::__rust_begin_short_backtrace::<test[75d6903177b1d7e9]::run_test::{closure#1}, ()><unknown>
  1113. 30.83 s > at <unknown source file>:<unknown line>
  1114. 30.83 s > 14: <std[bcb96dfbba0ab899]::thread::lifecycle::spawn_unchecked<test[75d6903177b1d7e9]::run_test::{closure#1}, ()>::{closure#1} as core[940e698046960fd5]::ops::function::FnOnce<()>>::call_once::{shim:vtable#0}<unknown>
  1115. 30.83 s > at <unknown source file>:<unknown line>
  1116. 30.83 s > 15: <std[bcb96dfbba0ab899]::sys::thread::unix::Thread>::new::thread_start<unknown>
  1117. 30.83 s > at <unknown source file>:<unknown line>
  1118. 30.83 s > 16: start_thread<unknown>
  1119. 30.83 s > at <unknown source file>:<unknown line>
  1120. 30.83 s > 17: __clone3<unknown>
  1121. 30.83 s > at <unknown source file>:<unknown line>
  1122. 30.83 s >
  1123. 30.83 s > Run with COLORBT_SHOW_HIDDEN=1 environment variable to disable frame filtering.
  1124. 30.83 s > Run with RUST_BACKTRACE=full to include source snippets.
  1125. 30.83 s >
  1126. 30.83 s > error: test run failed
  1127. 30.83 s >
  1128. 30.83 s > ========== nextest test summary ==========
  1129. 30.83 s > report: target/nextest/ci_gammaloop/junit.xml
  1130. 30.83 s > tests: 456, failures: 2, errors: 0
  1131. 30.83 s >
  1132. 30.83 s > 1. gammalooprs::graph::parse::tests::parse_lmbsetting_crossection
  1133. 30.83 s > failure: test failure with exit code 101
  1134. 30.83 s > system-out
  1135. 30.83 s > running 1 test
  1136. 30.83 s > ━━━━━━━━━━━━━━━━━━━━━━━━━━━━━━━ Snapshot Summary ━━━━━━━━━━━━━━━━━━━━━━━━━━━━━━━
  1137. 30.83 s > Snapshot: parse_lmbsetting_crossection
  1138. 30.83 s > Source: crates/gammalooprs/src/graph/parse/tests.rs:252
  1139. 30.83 s > ────────────────────────────────────────────────────────────────────────────────
  1140. 30.83 s > Expression: g.debug_dot()
  1141. 30.83 s > ────────────────────────────────────────────────────────────────────────────────
  1142. 30.83 s > -old snapshot
  1143. 30.83 s > +new results
  1144. 30.83 s > ────────────┬───────────────────────────────────────────────────────────────────
  1145. 30.83 s > 1 │-digraph G{
  1146. 30.83 s > 1 │+digraph G {
  1147. 30.83 s > 2 2 │ num = "1/2";
  1148. 30.83 s > 3 3 │ overall_factor = "2*x";
  1149. 30.83 s > 4 4 │ overall_factor_evaluated = "2*x";
  1150. 30.83 s > 5 5 │ projector = "spenso::t";
  1151. 30.83 s > ────────────┴───────────────────────────────────────────────────────────────────
  1152. 30.83 s > To update snapshots run `cargo insta review`
  1153. 30.83 s > Stopped on the first failure. Run `cargo insta test` to run all snapshots.
  1154. 30.83 s > test graph::parse::tests::parse_lmbsetting_crossection ... FAILED
  1155. 30.83 s >
  1156. 30.83 s > failures:
  1157. 30.83 s >
  1158. 30.83 s > failures:
  1159. 30.83 s > graph::parse::tests::parse_lmbsetting_crossection
  1160. 30.83 s >
  1161. 30.83 s > test result: FAILED. 0 passed; 1 failed; 0 ignored; 0 measured; 508 filtered out; finished in 0.25s
  1162. 30.83 s > system-err
  1163. 30.83 s > [22:03:32.134] @gammalooprs::graph::attribute_warnings WARNING : Unknown node attribute 'color_num' on graph 'G', node 'A'; did you mean 'num'?
  1164. 30.83 s > at crates/gammalooprs/src/graph/attribute_warnings.rs:198
  1165. 30.83 s > The application panicked (crashed).
  1166. 30.83 s > Message: snapshot assertion for 'parse_lmbsetting_crossection' failed in line 252
  1167. 30.83 s > Location: /nix/store/xdy1vvhll2bijdplvl9fcc2b9plkxhaa-vendor-cargo-deps/c19b7c6f923b580ac259164a89f2577984ad5ab09ee9d583b888f934adbbe8d0/insta-1.47.2/src/runtime.rs:719
  1168. 30.83 s >
  1169. 30.83 s > ━━━━━━━━━━━━━━━━━━━━━━━━━━━━━━━━━━ BACKTRACE ━━━━━━━━━━━━━━━━━━━━━━━━━━━━━━━━━━━
  1170. 30.83 s > 1: <color_eyre[b0c9e66060e883b2]::config::PanicHook>::panic_report<unknown>
  1171. 30.83 s > at <unknown source file>:<unknown line>
  1172. 30.83 s > 2: <color_eyre[b0c9e66060e883b2]::config::PanicHook>::into_panic_hook::{closure#0}<unknown>
  1173. 30.83 s > at <unknown source file>:<unknown line>
  1174. 30.83 s > 3: std[bcb96dfbba0ab899]::panicking::panic_with_hook<unknown>
  1175. 30.83 s > at <unknown source file>:<unknown line>
  1176. 30.83 s > 4: std[bcb96dfbba0ab899]::panicking::panic_handler::{closure#0}<unknown>
  1177. 30.83 s > at <unknown source file>:<unknown line>
  1178. 30.83 s > 5: std[bcb96dfbba0ab899]::sys::backtrace::__rust_end_short_backtrace::<std[bcb96dfbba0ab899]::panicking::panic_handler::{closure#0}, !><unknown>
  1179. 30.83 s > at <unknown source file>:<unknown line>
  1180. 30.83 s > 6: __rustc[6c289b9f9c454d21]::rust_begin_unwind<unknown>
  1181. 30.83 s > at <unknown source file>:<unknown line>
  1182. 30.83 s > 7: core[940e698046960fd5]::panicking::panic_fmt<unknown>
  1183. 30.83 s > at <unknown source file>:<unknown line>
  1184. 30.83 s > 8: insta[307a548ac79ef4d9]::runtime::assert_snapshot<unknown>
  1185. 30.83 s > at <unknown source file>:<unknown line>
  1186. 30.83 s > 9: gammalooprs[5490727360442cce]::graph::parse::tests::parse_lmbsetting_crossection<unknown>
  1187. 30.83 s > at <unknown source file>:<unknown line>
  1188. 30.83 s > 10: <gammalooprs[5490727360442cce]::graph::parse::tests::parse_lmbsetting_crossection::{closure#0} as core[940e698046960fd5]::ops::function::FnOnce<()>>::call_once<unknown>
  1189. 30.83 s > at <unknown source file>:<unknown line>
  1190. 30.83 s > 11: test[75d6903177b1d7e9]::__rust_begin_short_backtrace::<core[940e698046960fd5]::result::Result<(), alloc[2ea6bcb46fca0c42]::string::String>, fn() -> core[940e698046960fd5]::result::Result<(), alloc[2ea6bcb46fca0c42]::string::String>><unknown>
  1191. 30.83 s > at <unknown source file>:<unknown line>
  1192. 30.83 s > 12: test[75d6903177b1d7e9]::run_test::{closure#0}<unknown>
  1193. 30.83 s > at <unknown source file>:<unknown line>
  1194. 30.83 s > 13: std[bcb96dfbba0ab899]::sys::backtrace::__rust_begin_short_backtrace::<test[75d6903177b1d7e9]::run_test::{closure#1}, ()><unknown>
  1195. 30.83 s > at <unknown source file>:<unknown line>
  1196. 30.83 s > 14: <std[bcb96dfbba0ab899]::thread::lifecycle::spawn_unchecked<test[75d6903177b1d7e9]::run_test::{closure#1}, ()>::{closure#1} as core[940e698046960fd5]::ops::function::FnOnce<()>>::call_once::{shim:vtable#0}<unknown>
  1197. 30.83 s > at <unknown source file>:<unknown line>
  1198. 30.83 s > 15: <std[bcb96dfbba0ab899]::sys::thread::unix::Thread>::new::thread_start<unknown>
  1199. 30.83 s > at <unknown source file>:<unknown line>
  1200. 30.83 s > 16: start_thread<unknown>
  1201. 30.83 s > at <unknown source file>:<unknown line>
  1202. 30.83 s > 17: __clone3<unknown>
  1203. 30.83 s > at <unknown source file>:<unknown line>
  1204. 30.83 s >
  1205. 30.83 s > Run with COLORBT_SHOW_HIDDEN=1 environment variable to disable frame filtering.
  1206. 30.83 s > Run with RUST_BACKTRACE=full to include source snippets.
  1207. 30.83 s >
  1208. 30.83 s > 2. gammalooprs::uv::export::tests::computed_node_full_numerator_is_a_spenso_aware_typst_fragment
  1209. 30.83 s > failure: test failure with exit code 101
  1210. 30.83 s > system-out
  1211. 30.83 s > running 1 test
  1212. 30.83 s > test uv::export::tests::computed_node_full_numerator_is_a_spenso_aware_typst_fragment ... FAILED
  1213. 30.83 s >
  1214. 30.83 s > failures:
  1215. 30.83 s >
  1216. 30.83 s > failures:
  1217. 30.83 s > uv::export::tests::computed_node_full_numerator_is_a_spenso_aware_typst_fragment
  1218. 30.83 s >
  1219. 30.83 s > test result: FAILED. 0 passed; 1 failed; 0 ignored; 0 measured; 508 filtered out; finished in 0.07s
  1220. 30.83 s > system-err
  1221. 30.83 s > The application panicked (crashed).
  1222. 30.83 s > Message: assertion failed: exported.dot.contains(r#"full_num = "op(\"Tr\")(1)";"#)
  1223. 30.83 s > Location: crates/gammalooprs/src/uv/export.rs:483
  1224. 30.83 s >
  1225. 30.83 s > ━━━━━━━━━━━━━━━━━━━━━━━━━━━━━━━━━━ BACKTRACE ━━━━━━━━━━━━━━━━━━━━━━━━━━━━━━━━━━━
  1226. 30.83 s > 1: <color_eyre[b0c9e66060e883b2]::config::PanicHook>::panic_report<unknown>
  1227. 30.83 s > at <unknown source file>:<unknown line>
  1228. 30.83 s > 2: <color_eyre[b0c9e66060e883b2]::config::PanicHook>::into_panic_hook::{closure#0}<unknown>
  1229. 30.83 s > at <unknown source file>:<unknown line>
  1230. 30.83 s > 3: std[bcb96dfbba0ab899]::panicking::panic_with_hook<unknown>
  1231. 30.83 s > at <unknown source file>:<unknown line>
  1232. 30.83 s > 4: std[bcb96dfbba0ab899]::panicking::panic_handler::{closure#0}<unknown>
  1233. 30.83 s > at <unknown source file>:<unknown line>
  1234. 30.83 s > 5: std[bcb96dfbba0ab899]::sys::backtrace::__rust_end_short_backtrace::<std[bcb96dfbba0ab899]::panicking::panic_handler::{closure#0}, !><unknown>
  1235. 30.83 s > at <unknown source file>:<unknown line>
  1236. 30.83 s > 6: __rustc[6c289b9f9c454d21]::rust_begin_unwind<unknown>
  1237. 30.83 s > at <unknown source file>:<unknown line>
  1238. 30.83 s > 7: core[940e698046960fd5]::panicking::panic_fmt<unknown>
  1239. 30.83 s > at <unknown source file>:<unknown line>
  1240. 30.83 s > 8: core[940e698046960fd5]::panicking::panic<unknown>
  1241. 30.83 s > at <unknown source file>:<unknown line>
  1242. 30.83 s > 9: gammalooprs[5490727360442cce]::uv::export::tests::computed_node_full_numerator_is_a_spenso_aware_typst_fragment<unknown>
  1243. 30.83 s > at <unknown source file>:<unknown line>
  1244. 30.83 s > 10: <gammalooprs[5490727360442cce]::uv::export::tests::computed_node_full_numerator_is_a_spenso_aware_typst_fragment::{closure#0} as core[940e698046960fd5]::ops::function::FnOnce<()>>::call_once<unknown>
  1245. 30.83 s > at <unknown source file>:<unknown line>
  1246. 30.83 s > 11: test[75d6903177b1d7e9]::__rust_begin_short_backtrace::<core[940e698046960fd5]::result::Result<(), alloc[2ea6bcb46fca0c42]::string::String>, fn() -> core[940e698046960fd5]::result::Result<(), alloc[2ea6bcb46fca0c42]::string::String>><unknown>
  1247. 30.83 s > at <unknown source file>:<unknown line>
  1248. 30.83 s > 12: test[75d6903177b1d7e9]::run_test::{closure#0}<unknown>
  1249. 30.83 s > at <unknown source file>:<unknown line>
  1250. 30.83 s > 13: std[bcb96dfbba0ab899]::sys::backtrace::__rust_begin_short_backtrace::<test[75d6903177b1d7e9]::run_test::{closure#1}, ()><unknown>
  1251. 30.83 s > at <unknown source file>:<unknown line>
  1252. 30.83 s > 14: <std[bcb96dfbba0ab899]::thread::lifecycle::spawn_unchecked<test[75d6903177b1d7e9]::run_test::{closure#1}, ()>::{closure#1} as core[940e698046960fd5]::ops::function::FnOnce<()>>::call_once::{shim:vtable#0}<unknown>
  1253. 30.83 s > at <unknown source file>:<unknown line>
  1254. 30.83 s > 15: <std[bcb96dfbba0ab899]::sys::thread::unix::Thread>::new::thread_start<unknown>
  1255. 30.83 s > at <unknown source file>:<unknown line>
  1256. 30.83 s > 16: start_thread<unknown>
  1257. 30.83 s > at <unknown source file>:<unknown line>
  1258. 30.83 s > 17: __clone3<unknown>
  1259. 30.83 s > at <unknown source file>:<unknown line>
  1260. 30.83 s >
  1261. 30.83 s > Run with COLORBT_SHOW_HIDDEN=1 environment variable to disable frame filtering.
  1262. 30.83 s > Run with RUST_BACKTRACE=full to include source snippets.
  1263. 30.83 s > =========================================
  1264. 30.83 s For full logs, run:
  1265. 30.83 s nix log /nix/store/j0r373mhy6rmbqq05bplwn7cimlqrcnq-gammaloop-nextest-core.drv
  1266. 30.93 s [0 built (1 failed), 0.0Run failed.