1.07 s
$ /nix/store/9ypz3flqsrl5xl495mm8h645gadjsxi1-coreutils-9.11/bin/timeout --kill-after=15s 7200s /nix/store/23zk8sgzamrbmj1fday15szf7f2279s8-nix-2.34.7/bin/nix --extra-experimental-features nix-command --extra-experimental-features flakes flake clone git+https://github.com/alphal00p/gammaloop --dest /tmp/nix-ci-worker/stable-pwd/repo/
1.12 s
Cloning into '/tmp/nix-ci-worker/stable-pwd/repo'...
1.12 s
remote: Enumerating objects: 64191, done.
1.18 s
remote: Counting objects: 0% (1/9545)
remote: Counting objects: 1% (96/9545)
remote: Counting objects: 2% (191/9545)
remote: Counting objects: 3% (287/9545)
remote: Counting objects: 4% (382/9545)
remote: Counting objects: 5% (478/9545)
remote: Counting objects: 6% (573/9545)
remote: Counting objects: 7% (669/9545)
remote: Counting objects: 8% (764/9545)
remote: Counting objects: 9% (860/9545)
remote: Counting objects: 10% (955/9545)
remote: Counting objects: 11% (1050/9545)
remote: Counting objects: 12% (1146/9545)
remote: Counting objects: 13% (1241/9545)
remote: Counting objects: 14% (1337/9545)
remote: Counting objects: 15% (1432/9545)
remote: Counting objects: 16% (1528/9545)
remote: Counting objects: 17% (1623/9545)
remote: Counting objects: 18% (1719/9545)
remote: Counting objects: 19% (1814/9545)
remote: Counting objects: 20% (1909/9545)
remote: Counting objects: 21% (2005/9545)
remote: Counting objects: 22% (2100/9545)
remote: Counting objects: 23% (2196/9545)
remote: Counting objects: 24% (2291/9545)
remote: Counting objects: 25% (2387/9545)
remote: Counting objects: 26% (2482/9545)
remote: Counting objects: 27% (2578/9545)
remote: Counting objects: 28% (2673/9545)
remote: Counting objects: 29% (2769/9545)
remote: Counting objects: 30% (2864/9545)
remote: Counting objects: 31% (2959/9545)
remote: Counting objects: 32% (3055/9545)
remote: Counting objects: 33% (3150/9545)
remote: Counting objects: 34% (3246/9545)
remote: Counting objects: 35% (3341/9545)
remote: Counting objects: 36% (3437/9545)
remote: Counting objects: 37% (3532/9545)
remote: Counting objects: 38% (3628/9545)
remote: Counting objects: 39% (3723/9545)
remote: Counting objects: 40% (3818/9545)
remote: Counting objects: 41% (3914/9545)
remote: Counting objects: 42% (4009/9545)
remote: Counting objects: 43% (4105/9545)
remote: Counting objects: 44% (4200/9545)
remote: Counting objects: 45% (4296/9545)
remote: Counting objects: 46% (4391/9545)
remote: Counting objects: 47% (4487/9545)
remote: Counting objects: 48% (4582/9545)
remote: Counting objects: 49% (4678/9545)
remote: Counting objects: 50% (4773/9545)
remote: Counting objects: 51% (4868/9545)
remote: Counting objects: 52% (4964/9545)
remote: Counting objects: 53% (5059/9545)
remote: Counting objects: 54% (5155/9545)
remote: Counting objects: 55% (5250/9545)
remote: Counting objects: 56% (5346/9545)
remote: Counting objects: 57% (5441/9545)
remote: Counting objects: 58% (5537/9545)
remote: Counting objects: 59% (5632/9545)
remote: Counting objects: 60% (5727/9545)
remote: Counting objects: 61% (5823/9545)
remote: Counting objects: 62% (5918/9545)
remote: Counting objects: 63% (6014/9545)
remote: Counting objects: 64% (6109/9545)
remote: Counting objects: 65% (6205/9545)
remote: Counting objects: 66% (6300/9545)
remote: Counting objects: 67% (6396/9545)
remote: Counting objects: 68% (6491/9545)
remote: Counting objects: 69% (6587/9545)
remote: Counting objects: 70% (6682/9545)
remote: Counting objects: 71% (6777/9545)
remote: Counting objects: 72% (6873/9545)
remote: Counting objects: 73% (6968/9545)
remote: Counting objects: 74% (7064/9545)
remote: Counting objects: 75% (7159/9545)
remote: Counting objects: 76% (7255/9545)
remote: Counting objects: 77% (7350/9545)
remote: Counting objects: 78% (7446/9545)
remote: Counting objects: 79% (7541/9545)
remote: Counting objects: 80% (7636/9545)
remote: Counting objects: 81% (7732/9545)
remote: Counting objects: 82% (7827/9545)
remote: Counting objects: 83% (7923/9545)
remote: Counting objects: 84% (8018/9545)
remote: Counting objects: 85% (8114/9545)
remote: Counting objects: 86% (8209/9545)
remote: Counting objects: 87% (8305/9545)
remote: Counting objects: 88% (8400/9545)
remote: Counting objects: 89% (8496/9545)
remote: Counting objects: 90% (8591/9545)
remote: Counting objects: 91% (8686/9545)
remote: Counting objects: 92% (8782/9545)
remote: Counting objects: 93% (8877/9545)
remote: Counting objects: 94% (8973/9545)
remote: Counting objects: 95% (9068/9545)
remote: Counting objects: 96% (9164/9545)
remote: Counting objects: 97% (9259/9545)
remote: Counting objects: 98% (9355/9545)
remote: Counting objects: 99% (9450/9545)
remote: Counting objects: 100% (9545/9545)
remote: Counting objects: 100% (9545/9545), done.
3.45 s
remote: Compressing objects: 0% (1/2330)
remote: Compressing objects: 1% (24/2330)
remote: Compressing objects: 2% (47/2330)
remote: Compressing objects: 3% (70/2330)
remote: Compressing objects: 4% (94/2330)
remote: Compressing objects: 5% (117/2330)
remote: Compressing objects: 6% (140/2330)
remote: Compressing objects: 7% (164/2330)
remote: Compressing objects: 8% (187/2330)
remote: Compressing objects: 9% (210/2330)
remote: Compressing objects: 10% (233/2330)
remote: Compressing objects: 11% (257/2330)
remote: Compressing objects: 12% (280/2330)
remote: Compressing objects: 13% (303/2330)
remote: Compressing objects: 14% (327/2330)
remote: Compressing objects: 15% (350/2330)
remote: Compressing objects: 16% (373/2330)
remote: Compressing objects: 17% (397/2330)
remote: Compressing objects: 18% (420/2330)
remote: Compressing objects: 19% (443/2330)
remote: Compressing objects: 20% (466/2330)
remote: Compressing objects: 21% (490/2330)
remote: Compressing objects: 22% (513/2330)
remote: Compressing objects: 23% (536/2330)
remote: Compressing objects: 23% (548/2330)
remote: Compressing objects: 24% (560/2330)
remote: Compressing objects: 25% (583/2330)
remote: Compressing objects: 26% (606/2330)
remote: Compressing objects: 27% (630/2330)
remote: Compressing objects: 28% (653/2330)
remote: Compressing objects: 29% (676/2330)
remote: Compressing objects: 30% (699/2330)
remote: Compressing objects: 31% (723/2330)
remote: Compressing objects: 31% (725/2330)
remote: Compressing objects: 32% (746/2330)
remote: Compressing objects: 33% (769/2330)
remote: Compressing objects: 34% (793/2330)
remote: Compressing objects: 35% (816/2330)
remote: Compressing objects: 36% (839/2330)
remote: Compressing objects: 37% (863/2330)
remote: Compressing objects: 38% (886/2330)
remote: Compressing objects: 39% (909/2330)
remote: Compressing objects: 40% (932/2330)
remote: Compressing objects: 41% (956/2330)
remote: Compressing objects: 42% (979/2330)
remote: Compressing objects: 43% (1002/2330)
remote: Compressing objects: 44% (1026/2330)
remote: Compressing objects: 45% (1049/2330)
remote: Compressing objects: 46% (1072/2330)
remote: Compressing objects: 47% (1096/2330)
remote: Compressing objects: 48% (1119/2330)
remote: Compressing objects: 49% (1142/2330)
remote: Compressing objects: 50% (1165/2330)
remote: Compressing objects: 51% (1189/2330)
remote: Compressing objects: 52% (1212/2330)
remote: Compressing objects: 53% (1235/2330)
remote: Compressing objects: 54% (1259/2330)
remote: Compressing objects: 55% (1282/2330)
remote: Compressing objects: 56% (1305/2330)
remote: Compressing objects: 57% (1329/2330)
remote: Compressing objects: 58% (1352/2330)
remote: Compressing objects: 59% (1375/2330)
remote: Compressing objects: 60% (1398/2330)
remote: Compressing objects: 61% (1422/2330)
remote: Compressing objects: 62% (1445/2330)
remote: Compressing objects: 63% (1468/2330)
remote: Compressing objects: 64% (1492/2330)
remote: Compressing objects: 65% (1515/2330)
remote: Compressing objects: 66% (1538/2330)
remote: Compressing objects: 67% (1562/2330)
remote: Compressing objects: 68% (1585/2330)
remote: Compressing objects: 69% (1608/2330)
remote: Compressing objects: 70% (1631/2330)
remote: Compressing objects: 71% (1655/2330)
remote: Compressing objects: 72% (1678/2330)
remote: Compressing objects: 73% (1701/2330)
remote: Compressing objects: 74% (1725/2330)
remote: Compressing objects: 75% (1748/2330)
remote: Compressing objects: 76% (1771/2330)
remote: Compressing objects: 77% (1795/2330)
remote: Compressing objects: 78% (1818/2330)
remote: Compressing objects: 79% (1841/2330)
remote: Compressing objects: 80% (1864/2330)
remote: Compressing objects: 81% (1888/2330)
remote: Compressing objects: 82% (1911/2330)
remote: Compressing objects: 83% (1934/2330)
remote: Compressing objects: 84% (1958/2330)
remote: Compressing objects: 85% (1981/2330)
remote: Compressing objects: 86% (2004/2330)
remote: Compressing objects: 87% (2028/2330)
remote: Compressing objects: 88% (2051/2330)
remote: Compressing objects: 89% (2074/2330)
remote: Compressing objects: 90% (2097/2330)
remote: Compressing objects: 91% (2121/2330)
remote: Compressing objects: 92% (2144/2330)
remote: Compressing objects: 93% (2167/2330)
remote: Compressing objects: 94% (2191/2330)
remote: Compressing objects: 95% (2214/2330)
remote: Compressing objects: 96% (2237/2330)
remote: Compressing objects: 97% (2261/2330)
remote: Compressing objects: 98% (2284/2330)
remote: Compressing objects: 99% (2307/2330)
remote: Compressing objects: 100% (2330/2330)
remote: Compressing objects: 100% (2330/2330), done.
6.54 s
Receiving objects: 0% (1/64191)
Receiving objects: 1% (642/64191)
Receiving objects: 2% (1284/64191)
Receiving objects: 3% (1926/64191)
Receiving objects: 4% (2568/64191)
Receiving objects: 5% (3210/64191)
Receiving objects: 6% (3852/64191)
Receiving objects: 7% (4494/64191)
Receiving objects: 8% (5136/64191)
Receiving objects: 9% (5778/64191)
Receiving objects: 10% (6420/64191), 10.30 MiB | 20.58 MiB/s
Receiving objects: 11% (7062/64191), 10.30 MiB | 20.58 MiB/s
Receiving objects: 12% (7703/64191), 10.30 MiB | 20.58 MiB/s
Receiving objects: 13% (8345/64191), 10.30 MiB | 20.58 MiB/s
Receiving objects: 14% (8987/64191), 10.30 MiB | 20.58 MiB/s
Receiving objects: 15% (9629/64191), 10.30 MiB | 20.58 MiB/s
Receiving objects: 16% (10271/64191), 10.30 MiB | 20.58 MiB/s
Receiving objects: 17% (10913/64191), 10.30 MiB | 20.58 MiB/s
Receiving objects: 18% (11555/64191), 10.30 MiB | 20.58 MiB/s
Receiving objects: 19% (12197/64191), 10.30 MiB | 20.58 MiB/s
Receiving objects: 20% (12839/64191), 10.30 MiB | 20.58 MiB/s
Receiving objects: 21% (13481/64191), 10.30 MiB | 20.58 MiB/s
Receiving objects: 22% (14123/64191), 10.30 MiB | 20.58 MiB/s
Receiving objects: 23% (14764/64191), 10.30 MiB | 20.58 MiB/s
Receiving objects: 24% (15406/64191), 10.30 MiB | 20.58 MiB/s
Receiving objects: 25% (16048/64191), 10.30 MiB | 20.58 MiB/s
Receiving objects: 26% (16690/64191), 10.30 MiB | 20.58 MiB/s
Receiving objects: 27% (17332/64191), 10.30 MiB | 20.58 MiB/s
Receiving objects: 28% (17974/64191), 10.30 MiB | 20.58 MiB/s
Receiving objects: 29% (18616/64191), 10.30 MiB | 20.58 MiB/s
Receiving objects: 30% (19258/64191), 10.30 MiB | 20.58 MiB/s
Receiving objects: 31% (19900/64191), 10.30 MiB | 20.58 MiB/s
Receiving objects: 32% (20542/64191), 10.30 MiB | 20.58 MiB/s
Receiving objects: 33% (21184/64191), 10.30 MiB | 20.58 MiB/s
Receiving objects: 34% (21825/64191), 10.30 MiB | 20.58 MiB/s
Receiving objects: 35% (22467/64191), 10.30 MiB | 20.58 MiB/s
Receiving objects: 36% (23109/64191), 10.30 MiB | 20.58 MiB/s
Receiving objects: 37% (23751/64191), 10.30 MiB | 20.58 MiB/s
Receiving objects: 38% (24393/64191), 10.30 MiB | 20.58 MiB/s
Receiving objects: 39% (25035/64191), 10.30 MiB | 20.58 MiB/s
Receiving objects: 40% (25677/64191), 10.30 MiB | 20.58 MiB/s
Receiving objects: 41% (26319/64191), 10.30 MiB | 20.58 MiB/s
Receiving objects: 42% (26961/64191), 10.30 MiB | 20.58 MiB/s
Receiving objects: 43% (27603/64191), 10.30 MiB | 20.58 MiB/s
Receiving objects: 44% (28245/64191), 10.30 MiB | 20.58 MiB/s
Receiving objects: 45% (28886/64191), 10.30 MiB | 20.58 MiB/s
Receiving objects: 46% (29528/64191), 10.30 MiB | 20.58 MiB/s
Receiving objects: 47% (30170/64191), 10.30 MiB | 20.58 MiB/s
Receiving objects: 48% (30812/64191), 10.30 MiB | 20.58 MiB/s
Receiving objects: 49% (31454/64191), 10.30 MiB | 20.58 MiB/s
Receiving objects: 50% (32096/64191), 10.30 MiB | 20.58 MiB/s
Receiving objects: 50% (32270/64191), 28.28 MiB | 28.21 MiB/s
Receiving objects: 51% (32738/64191), 28.28 MiB | 28.21 MiB/s
Receiving objects: 52% (33380/64191), 28.28 MiB | 28.21 MiB/s
Receiving objects: 53% (34022/64191), 28.28 MiB | 28.21 MiB/s
Receiving objects: 54% (34664/64191), 28.28 MiB | 28.21 MiB/s
Receiving objects: 55% (35306/64191), 28.28 MiB | 28.21 MiB/s
Receiving objects: 56% (35947/64191), 28.28 MiB | 28.21 MiB/s
Receiving objects: 57% (36589/64191), 28.28 MiB | 28.21 MiB/s
Receiving objects: 58% (37231/64191), 44.75 MiB | 29.79 MiB/s
Receiving objects: 59% (37873/64191), 44.75 MiB | 29.79 MiB/s
Receiving objects: 60% (38515/64191), 44.75 MiB | 29.79 MiB/s
Receiving objects: 61% (39157/64191), 44.75 MiB | 29.79 MiB/s
Receiving objects: 62% (39799/64191), 44.75 MiB | 29.79 MiB/s
Receiving objects: 63% (40441/64191), 44.75 MiB | 29.79 MiB/s
Receiving objects: 64% (41083/64191), 44.75 MiB | 29.79 MiB/s
Receiving objects: 65% (41725/64191), 44.75 MiB | 29.79 MiB/s
Receiving objects: 66% (42367/64191), 44.75 MiB | 29.79 MiB/s
Receiving objects: 67% (43008/64191), 44.75 MiB | 29.79 MiB/s
Receiving objects: 67% (43277/64191), 61.34 MiB | 30.59 MiB/s
Receiving objects: 68% (43650/64191), 61.34 MiB | 30.59 MiB/s
Receiving objects: 69% (44292/64191), 61.34 MiB | 30.59 MiB/s
Receiving objects: 70% (44934/64191), 61.34 MiB | 30.59 MiB/s
Receiving objects: 71% (45576/64191), 61.34 MiB | 30.59 MiB/s
Receiving objects: 72% (46218/64191), 61.34 MiB | 30.59 MiB/s
Receiving objects: 73% (46860/64191), 61.34 MiB | 30.59 MiB/s
Receiving objects: 74% (47502/64191), 61.34 MiB | 30.59 MiB/s
Receiving objects: 75% (48144/64191), 61.34 MiB | 30.59 MiB/s
Receiving objects: 76% (48786/64191), 61.34 MiB | 30.59 MiB/s
Receiving objects: 77% (49428/64191), 61.34 MiB | 30.59 MiB/s
Receiving objects: 78% (50069/64191), 61.34 MiB | 30.59 MiB/s
Receiving objects: 79% (50711/64191), 61.34 MiB | 30.59 MiB/s
Receiving objects: 80% (51353/64191), 61.34 MiB | 30.59 MiB/s
Receiving objects: 81% (51995/64191), 61.34 MiB | 30.59 MiB/s
Receiving objects: 82% (52637/64191), 78.21 MiB | 31.16 MiB/s
Receiving objects: 83% (53279/64191), 78.21 MiB | 31.16 MiB/s
Receiving objects: 84% (53921/64191), 78.21 MiB | 31.16 MiB/s
Receiving objects: 85% (54563/64191), 78.21 MiB | 31.16 MiB/s
Receiving objects: 86% (55205/64191), 78.21 MiB | 31.16 MiB/s
Receiving objects: 87% (55847/64191), 78.21 MiB | 31.16 MiB/s
Receiving objects: 88% (56489/64191), 78.21 MiB | 31.16 MiB/s
Receiving objects: 89% (57130/64191), 78.21 MiB | 31.16 MiB/s
Receiving objects: 90% (57772/64191), 78.21 MiB | 31.16 MiB/s
Receiving objects: 91% (58414/64191), 78.21 MiB | 31.16 MiB/s
Receiving objects: 92% (59056/64191), 78.21 MiB | 31.16 MiB/s
Receiving objects: 93% (59698/64191), 78.21 MiB | 31.16 MiB/s
Receiving objects: 94% (60340/64191), 78.21 MiB | 31.16 MiB/s
Receiving objects: 95% (60982/64191), 78.21 MiB | 31.16 MiB/s
Receiving objects: 96% (61624/64191), 78.21 MiB | 31.16 MiB/s
Receiving objects: 97% (62266/64191), 78.21 MiB | 31.16 MiB/s
Receiving objects: 98% (62908/64191), 78.21 MiB | 31.16 MiB/s
Receiving objects: 98% (62926/64191), 78.21 MiB | 31.16 MiB/s
Receiving objects: 99% (63550/64191), 95.23 MiB | 31.64 MiB/s
remote: Total 64191 (delta 7391), reused 7767 (delta 6670), pack-reused 54646 (from 3)
6.63 s
Receiving objects: 100% (64191/64191), 95.23 MiB | 31.64 MiB/s
Receiving objects: 100% (64191/64191), 97.83 MiB | 31.66 MiB/s, done.
7.14 s
Resolving deltas: 0% (0/44321)
Resolving deltas: 1% (444/44321)
Resolving deltas: 2% (887/44321)
Resolving deltas: 3% (1330/44321)
Resolving deltas: 4% (1773/44321)
Resolving deltas: 5% (2217/44321)
Resolving deltas: 6% (2660/44321)
Resolving deltas: 7% (3103/44321)
Resolving deltas: 8% (3546/44321)
Resolving deltas: 9% (3989/44321)
Resolving deltas: 10% (4434/44321)
Resolving deltas: 11% (4876/44321)
Resolving deltas: 12% (5319/44321)
Resolving deltas: 13% (5762/44321)
Resolving deltas: 14% (6206/44321)
Resolving deltas: 15% (6650/44321)
Resolving deltas: 16% (7092/44321)
Resolving deltas: 17% (7535/44321)
Resolving deltas: 18% (7978/44321)
Resolving deltas: 19% (8421/44321)
Resolving deltas: 20% (8865/44321)
Resolving deltas: 21% (9308/44321)
Resolving deltas: 22% (9751/44321)
Resolving deltas: 23% (10194/44321)
Resolving deltas: 24% (10638/44321)
Resolving deltas: 25% (11081/44321)
Resolving deltas: 26% (11524/44321)
Resolving deltas: 27% (11968/44321)
Resolving deltas: 28% (12412/44321)
Resolving deltas: 29% (12855/44321)
Resolving deltas: 30% (13297/44321)
Resolving deltas: 31% (13740/44321)
Resolving deltas: 32% (14185/44321)
Resolving deltas: 33% (14626/44321)
Resolving deltas: 34% (15070/44321)
Resolving deltas: 35% (15513/44321)
Resolving deltas: 36% (15956/44321)
Resolving deltas: 37% (16399/44321)
Resolving deltas: 38% (16842/44321)
Resolving deltas: 39% (17287/44321)
Resolving deltas: 40% (17729/44321)
Resolving deltas: 41% (18172/44321)
Resolving deltas: 42% (18616/44321)
Resolving deltas: 43% (19059/44321)
Resolving deltas: 44% (19502/44321)
Resolving deltas: 45% (19945/44321)
Resolving deltas: 46% (20389/44321)
Resolving deltas: 47% (20831/44321)
Resolving deltas: 48% (21275/44321)
Resolving deltas: 49% (21718/44321)
Resolving deltas: 50% (22161/44321)
Resolving deltas: 51% (22604/44321)
Resolving deltas: 52% (23047/44321)
Resolving deltas: 53% (23491/44321)
Resolving deltas: 54% (23934/44321)
Resolving deltas: 55% (24377/44321)
Resolving deltas: 56% (24820/44321)
Resolving deltas: 57% (25263/44321)
Resolving deltas: 58% (25707/44321)
Resolving deltas: 59% (26150/44321)
Resolving deltas: 60% (26593/44321)
Resolving deltas: 61% (27036/44321)
Resolving deltas: 62% (27482/44321)
Resolving deltas: 63% (27923/44321)
Resolving deltas: 64% (28366/44321)
Resolving deltas: 65% (28809/44321)
Resolving deltas: 66% (29252/44321)
Resolving deltas: 67% (29697/44321)
Resolving deltas: 68% (30139/44321)
Resolving deltas: 69% (30583/44321)
Resolving deltas: 70% (31025/44321)
Resolving deltas: 71% (31468/44321)
Resolving deltas: 72% (31912/44321)
Resolving deltas: 73% (32355/44321)
Resolving deltas: 74% (32798/44321)
Resolving deltas: 75% (33241/44321)
Resolving deltas: 76% (33684/44321)
Resolving deltas: 77% (34128/44321)
Resolving deltas: 78% (34571/44321)
Resolving deltas: 79% (35014/44321)
Resolving deltas: 80% (35457/44321)
Resolving deltas: 81% (35901/44321)
Resolving deltas: 82% (36347/44321)
Resolving deltas: 83% (36792/44321)
Resolving deltas: 84% (37230/44321)
Resolving deltas: 85% (37673/44321)
Resolving deltas: 86% (38117/44321)
Resolving deltas: 87% (38561/44321)
Resolving deltas: 88% (39003/44321)
Resolving deltas: 89% (39446/44321)
Resolving deltas: 90% (39889/44321)
Resolving deltas: 91% (40333/44321)
Resolving deltas: 92% (40776/44321)
Resolving deltas: 93% (41219/44321)
Resolving deltas: 94% (41662/44321)
Resolving deltas: 95% (42105/44321)
Resolving deltas: 96% (42550/44321)
Resolving deltas: 97% (42992/44321)
Resolving deltas: 98% (43435/44321)
Resolving deltas: 99% (43878/44321)
Resolving deltas: 100% (44321/44321)
Resolving deltas: 100% (44321/44321), done.
7.39 s
Fetching commit 3d241888b215b0c37d1e347e0c8ddcee728dacfb for push-vrpyqyylypmw ...
7.39 s
$ /nix/store/bcnisk3ydfgv26v2gw3zlky24g00yww2-git-2.54.0/bin/git fetch origin 3d241888b215b0c37d1e347e0c8ddcee728dacfb
7.88 s
From https://github.com/alphal00p/gammaloop
7.88 s
* branch 3d241888b215b0c37d1e347e0c8ddcee728dacfb -> FETCH_HEAD
7.89 s
$ /nix/store/9ypz3flqsrl5xl495mm8h645gadjsxi1-coreutils-9.11/bin/timeout --kill-after=15s 7200s /nix/store/bcnisk3ydfgv26v2gw3zlky24g00yww2-git-2.54.0/bin/git -c advice.detachedHead=false checkout 3d241888b215b0c37d1e347e0c8ddcee728dacfb
8.07 s
HEAD is now at 3d241888 run documentation tests through the Nix CI secret runner
8.07 s
$ /nix/store/9ypz3flqsrl5xl495mm8h645gadjsxi1-coreutils-9.11/bin/timeout --kill-after=15s 7200s /nix/store/23zk8sgzamrbmj1fday15szf7f2279s8-nix-2.34.7/bin/nix --extra-experimental-features nix-command --extra-experimental-features flakes --log-format internal-json run .#packages.x86_64-linux.nix-ci-check-gammaloop-doctest --print-build-logs
10.09 s
12.48 s
evaluating derivation 'g
copying '/nix/store/4jdn
evaluating derivation 'g
querying gammaloop-works
[0 /1 built, 0.0 KiB DL]
[1 /0 /1 built, 0.0 KiB DLgammaloop-workspace-doctest> Running phase: unpackPhase
12.53 s
gammaloop-workspace-doctest> unpacking source archive /nix/store/9wvq6ybm6dprplm1h2869fg539dqvd85-source
12.59 s
gammaloop-workspace-doctest> source root is source
12.61 s
gammaloop-workspace-doctest> Running phase: patchPhase
12.61 s
gammaloop-workspace-doctest> Executing configureCargoCommonVars
12.61 s
gammaloop-workspace-doctest> decompressing cargo artifacts from /nix/store/kbgwngi7xvi54jsr0kp8rhj1b9mfja7d-gammaloop-workspace-deps-deps-0.1.0/target.tar.zst to target
13.79 s
gammaloop-workspace-doctest> Running phase: updateAutotoolsGnuConfigScriptsPhase
13.82 s
gammaloop-workspace-doctest> Running phase: configurePhase
13.82 s
gammaloop-workspace-doctest> will append /build/source/.cargo-home/config.toml with contents of /nix/store/xdy1vvhll2bijdplvl9fcc2b9plkxhaa-vendor-cargo-deps/config.toml
13.82 s
gammaloop-workspace-doctest> default configurePhase, nothing to do
13.82 s
gammaloop-workspace-doctest> Running phase: buildPhase
13.83 s
gammaloop-workspace-doctest> +++ command cargo --version
13.83 s
gammaloop-workspace-doctest> cargo 1.97.0 (c980f4866 2026-06-30)
13.86 s
gammaloop-workspace-doctest> +++ command cargo test --profile ci-optim --doc --locked --workspace --features gammaloop-api/cli,gammaloop-tracing-filter/clap,gammaloop-tracing-filter/symbolica,idenso/bincode,idenso/reference-cases,linnet/bincode,linnet/drawing,linnet/nodestore-vec,linnet/rkyv,linnet/serde,linnet/symbolica,spenso-macros/shadowing,spenso/shadowing,symbolica/tracing_max_level_info
14.14 s
gammaloop-workspace-doctest> Compiling target-lexicon v0.13.5
14.15 s
gammaloop-workspace-doctest> Compiling symbolica v2.2.0 (https://github.com/symbolica-dev/symbolica?branch=dev#0441bd7a)
14.15 s
gammaloop-workspace-doctest> Compiling maplit v1.0.2
14.16 s
gammaloop-workspace-doctest> Compiling gammaloop-tracing-filter-macros v0.1.0 (/build/source/crates/gammaloop-tracing-filter-macros)
14.16 s
gammaloop-workspace-doctest> Compiling vakint v0.1.2 (/build/source/crates/vakint)
14.17 s
gammaloop-workspace-doctest> Compiling gammalooprs v0.3.4 (/build/source/crates/gammalooprs)
14.18 s
gammaloop-workspace-doctest> Compiling alphal00p-docs-macros v0.1.0 (/build/source/crates/alphal00p-docs-macros)
14.18 s
gammaloop-workspace-doctest> Compiling alphal00p-docs-schema v0.1.0 (/build/source/crates/alphal00p-docs-schema)
14.18 s
gammaloop-workspace-doctest> Compiling rustc_version v0.4.1
14.19 s
gammaloop-workspace-doctest> Compiling bincode v1.3.3
14.19 s
gammaloop-workspace-doctest> Compiling gungraun-runner v0.18.2
14.19 s
gammaloop-workspace-doctest> Compiling target-triple v1.0.1
14.19 s
gammaloop-workspace-doctest> Compiling iai-callgrind-runner v0.14.2
14.20 s
gammaloop-workspace-doctest> Compiling clinnet v0.1.8 (/build/source/crates/clinnet)
14.20 s
gammaloop-workspace-doctest> Compiling gammaloop-integration-tests v0.1.0 (/build/source/tests)
14.33 s
gammaloop-workspace-doctest> Compiling test-log-core v0.2.20
14.36 s
gammaloop-workspace-doctest> Compiling wait-timeout v0.2.1
14.36 s
gammaloop-workspace-doctest> Compiling bit-vec v0.8.0
14.36 s
gammaloop-workspace-doctest> Compiling quick-error v1.2.3
14.37 s
gammaloop-workspace-doctest> Compiling iai-callgrind v0.14.2
14.49 s
gammaloop-workspace-doctest> Compiling rusty-fork v0.3.1
14.51 s
gammaloop-workspace-doctest> Compiling bit-set v0.8.0
14.55 s
gammaloop-workspace-doctest> Compiling iai-callgrind-macros v0.5.1
14.55 s
gammaloop-workspace-doctest> Compiling rand_xorshift v0.4.0
14.61 s
gammaloop-workspace-doctest> Compiling console v0.15.11
14.63 s
gammaloop-workspace-doctest> Compiling glob v0.3.4
14.69 s
gammaloop-workspace-doctest> Compiling termcolor v1.4.1
14.70 s
gammaloop-workspace-doctest> Compiling gungraun-macros v0.8.0
14.81 s
gammaloop-workspace-doctest> Compiling base64 v0.21.7
15.01 s
gammaloop-workspace-doctest> Compiling unarray v0.1.4
15.08 s
gammaloop-workspace-doctest> Compiling proptest v1.11.0
15.08 s
gammaloop-workspace-doctest> Compiling alphal00p-docs-catalogs v0.1.0 (/build/source/crates/alphal00p-docs-catalogs)
15.18 s
gammaloop-workspace-doctest> Compiling ron v0.8.1
15.19 s
gammaloop-workspace-doctest> Compiling pyo3-build-config v0.28.3
15.19 s
gammaloop-workspace-doctest> Compiling trybuild v1.0.120
15.23 s
gammaloop-workspace-doctest> Compiling similar-asserts v1.7.0
15.36 s
gammaloop-workspace-doctest> Compiling alphal00p-docs-builder v0.1.0 (/build/source/crates/alphal00p-docs-builder)
15.41 s
gammaloop-workspace-doctest> Compiling kurvst v0.1.0 (/build/source/crates/kurvst)
15.75 s
gammaloop-workspace-doctest> Compiling test-log-macros v0.2.20
17.17 s
gammaloop-workspace-doctest> Compiling test-log v0.2.20
17.28 s
gammaloop-workspace-doctest> Compiling alphal00p-docs-examples v0.1.0 (/build/source/crates/alphal00p-docs-examples)
19.04 s
gammaloop-workspace-doctest> Compiling pyo3-macros-backend v0.28.3
19.18 s
gammaloop-workspace-doctest> Compiling pyo3-ffi v0.28.3
19.34 s
gammaloop-workspace-doctest> Compiling pyo3 v0.28.3
19.46 s
gammaloop-workspace-doctest> Compiling numpy v0.28.0
19.54 s
gammaloop-workspace-doctest> Compiling gammaloop-api v0.1.0 (/build/source/crates/gammaloop-api)
19.63 s
gammaloop-workspace-doctest> Compiling gungraun v0.18.2
23.56 s
gammaloop-workspace-doctest> Compiling pyo3-macros v0.28.3
27.88 s
gammaloop-workspace-doctest> Compiling pyo3-stub-gen v0.17.2
28.45 s
gammaloop-workspace-doctest> Compiling numerica v2.2.0 (https://github.com/symbolica-dev/symbolica?branch=dev#0441bd7a)
30.34 s
gammaloop-workspace-doctest> Compiling graphica v2.1.0 (https://github.com/symbolica-dev/symbolica?branch=dev#0441bd7a)
32.30 s
gammaloop-workspace-doctest> Compiling symbolica-utils v0.1.0 (/build/source/crates/symbolica-utils)
167.46 s
gammaloop-workspace-doctest> Compiling gammaloop-workspace-hack v0.1.0 (/build/source/crates/gammaloop-workspace-hack)
167.51 s
gammaloop-workspace-doctest> Compiling spenso-macros v0.3.2 (/build/source/crates/spenso-macros)
167.60 s
gammaloop-workspace-doctest> Compiling linnet v0.17.0 (/build/source/crates/linnet)
170.46 s
gammaloop-workspace-doctest> Compiling spenso v0.6.0 (/build/source/crates/spenso)
176.80 s
gammaloop-workspace-doctest> Compiling idenso v0.3.0 (/build/source/crates/idenso)
176.85 s
gammaloop-workspace-doctest> Compiling gammaloop-tracing-filter v0.1.0 (/build/source/crates/gammaloop-tracing-filter)
179.90 s
gammaloop-workspace-doctest> Compiling spenso-hep-lib v0.1.7 (/build/source/crates/spenso-hep-lib)
180.10 s
gammaloop-workspace-doctest> Compiling spynso3 v0.1.2 (/build/source/crates/spynso3)
214.81 s
gammaloop-workspace-doctest> Compiling linnest v0.1.0 (/build/source/crates/linnest)
214.85 s
gammaloop-workspace-doctest> Compiling linnet-py v0.1.0 (/build/source/crates/linnet-py)
318.34 s
gammaloop-workspace-doctest> Finished `ci-optim` profile [optimized] target(s) in 5m 04s
318.93 s
gammaloop-workspace-doctest> warning : the following packages contain code that will be rejected by a future version of Rust: proc-macro-error2 v2.0.1
318.93 s
gammaloop-workspace-doctest> note : to see what the problems were, use the option `--future-incompat-report`, or run `cargo report future-incompatibilities --id 1`
318.93 s
gammaloop-workspace-doctest> Doc-tests alphal00p_docs_builder
318.93 s
gammaloop-workspace-doctest>
318.93 s
gammaloop-workspace-doctest> running 0 tests
318.93 s
gammaloop-workspace-doctest>
318.93 s
gammaloop-workspace-doctest> test result: ok. 0 passed; 0 failed; 0 ignored; 0 measured; 0 filtered out; finished in 0.00s
318.93 s
gammaloop-workspace-doctest>
318.93 s
gammaloop-workspace-doctest> Doc-tests alphal00p_docs_catalogs
319.68 s
gammaloop-workspace-doctest>
319.68 s
gammaloop-workspace-doctest> running 0 tests
319.68 s
gammaloop-workspace-doctest>
319.68 s
gammaloop-workspace-doctest> test result: ok. 0 passed; 0 failed; 0 ignored; 0 measured; 0 filtered out; finished in 0.00s
319.68 s
gammaloop-workspace-doctest>
319.68 s
gammaloop-workspace-doctest> Doc-tests alphal00p_docs_examples
319.69 s
gammaloop-workspace-doctest>
319.69 s
gammaloop-workspace-doctest> running 0 tests
319.69 s
gammaloop-workspace-doctest>
319.69 s
gammaloop-workspace-doctest> test result: ok. 0 passed; 0 failed; 0 ignored; 0 measured; 0 filtered out; finished in 0.00s
319.69 s
gammaloop-workspace-doctest>
319.69 s
gammaloop-workspace-doctest> Doc-tests alphal00p_docs
319.74 s
gammaloop-workspace-doctest>
319.74 s
gammaloop-workspace-doctest> running 0 tests
319.74 s
gammaloop-workspace-doctest>
319.74 s
gammaloop-workspace-doctest> test result: ok. 0 passed; 0 failed; 0 ignored; 0 measured; 0 filtered out; finished in 0.00s
319.74 s
gammaloop-workspace-doctest>
319.74 s
gammaloop-workspace-doctest> Doc-tests alphal00p_docs_schema
319.81 s
gammaloop-workspace-doctest>
319.81 s
gammaloop-workspace-doctest> running 0 tests
319.81 s
gammaloop-workspace-doctest>
319.81 s
gammaloop-workspace-doctest> test result: ok. 0 passed; 0 failed; 0 ignored; 0 measured; 0 filtered out; finished in 0.00s
319.81 s
gammaloop-workspace-doctest>
319.81 s
gammaloop-workspace-doctest> Doc-tests clinnet
319.85 s
gammaloop-workspace-doctest>
319.85 s
gammaloop-workspace-doctest> running 0 tests
319.85 s
gammaloop-workspace-doctest>
319.85 s
gammaloop-workspace-doctest> test result: ok. 0 passed; 0 failed; 0 ignored; 0 measured; 0 filtered out; finished in 0.00s
319.85 s
gammaloop-workspace-doctest>
319.85 s
gammaloop-workspace-doctest> Doc-tests gammaloop_api
320.70 s
gammaloop-workspace-doctest>
320.70 s
gammaloop-workspace-doctest> running 13 tests
320.71 s
gammaloop-workspace-doctest> test crates/gammaloop-api/src/python.rs - python::GammaLoopAPI::evaluate_sample (line 2926) ... FAILED
320.72 s
gammaloop-workspace-doctest> test crates/gammaloop-api/src/python.rs - python::GammaLoopAPI::get_integrand_info (line 3496) ... FAILED
320.72 s
gammaloop-workspace-doctest> test crates/gammaloop-api/src/python.rs - python::GammaLoopAPI::get_active_command_blocks (line 3652) ... FAILED
320.72 s
gammaloop-workspace-doctest> test crates/gammaloop-api/src/python.rs - python::GammaLoopAPI::get_default_runtime_settings (line 3688) ... FAILED
320.72 s
gammaloop-workspace-doctest> test crates/gammaloop-api/src/python.rs - python::GammaLoopAPI::get_integrand_settings (line 3539) ... FAILED
320.72 s
gammaloop-workspace-doctest> test crates/gammaloop-api/src/python.rs - python::GammaLoopAPI::evaluate_samples (line 3040) ... FAILED
320.80 s
gammaloop-workspace-doctest> test crates/gammaloop-api/src/python.rs - python::GammaLoopAPI::run_command (line 3793) ... FAILED
320.80 s
gammaloop-workspace-doctest> test crates/gammaloop-api/src/python.rs - python::GammaLoopAPI::get_global_settings (line 3631) ... FAILED
320.80 s
gammaloop-workspace-doctest> test crates/gammaloop-api/src/python.rs - python::GammaLoopAPI::get_run_history (line 3603) ... FAILED
320.81 s
gammaloop-workspace-doctest> test crates/gammaloop-api/src/python.rs - python::atom_to_canonical_string (line 128) ... FAILED
320.81 s
gammaloop-workspace-doctest> test crates/gammaloop-api/src/python.rs - python::atom_to_dots (line 157) ... FAILED
320.81 s
gammaloop-workspace-doctest> test crates/gammaloop-api/src/python.rs - python::evaluate_graph_overall_factor (line 95) ... FAILED
320.81 s
gammaloop-workspace-doctest> test crates/gammaloop-api/src/python.rs - python::GammaLoopAPI::new_python (line 2804) ... FAILED
320.81 s
gammaloop-workspace-doctest>
320.81 s
gammaloop-workspace-doctest> failures:
320.81 s
gammaloop-workspace-doctest>
320.81 s
gammaloop-workspace-doctest> ---- crates/gammaloop-api/src/python.rs - python::GammaLoopAPI::evaluate_sample (line 2926) stdout ----
320.81 s
gammaloop-workspace-doctest> error: expected one of `!` or `::`, found `=`
320.81 s
gammaloop-workspace-doctest> --> crates/gammaloop-api/src/python.rs:2927:8
320.81 s
gammaloop-workspace-doctest> |
320.81 s
gammaloop-workspace-doctest> 2927 | result = api.evaluate_sample(point, process_id=0, minimal_output=True)
320.81 s
gammaloop-workspace-doctest> | ^ expected one of `!` or `::`
320.81 s
gammaloop-workspace-doctest>
320.81 s
gammaloop-workspace-doctest> error: aborting due to 1 previous error
320.81 s
gammaloop-workspace-doctest>
320.81 s
gammaloop-workspace-doctest> Couldn't compile the test.
320.81 s
gammaloop-workspace-doctest> ---- crates/gammaloop-api/src/python.rs - python::GammaLoopAPI::get_integrand_info (line 3496) stdout ----
320.81 s
gammaloop-workspace-doctest> error: expected one of `!` or `::`, found `=`
320.81 s
gammaloop-workspace-doctest> --> crates/gammaloop-api/src/python.rs:3497:6
320.81 s
gammaloop-workspace-doctest> |
320.81 s
gammaloop-workspace-doctest> 3497 | info = api.get_integrand_info(process_id=0)
320.81 s
gammaloop-workspace-doctest> | ^ expected one of `!` or `::`
320.81 s
gammaloop-workspace-doctest>
320.81 s
gammaloop-workspace-doctest> error: aborting due to 1 previous error
320.81 s
gammaloop-workspace-doctest>
320.81 s
gammaloop-workspace-doctest> Couldn't compile the test.
320.81 s
gammaloop-workspace-doctest> ---- crates/gammaloop-api/src/python.rs - python::GammaLoopAPI::get_active_command_blocks (line 3652) stdout ----
320.81 s
gammaloop-workspace-doctest> error: expected item, found keyword `for`
320.81 s
gammaloop-workspace-doctest> --> crates/gammaloop-api/src/python.rs:3653:1
320.81 s
gammaloop-workspace-doctest> |
320.81 s
gammaloop-workspace-doctest> 3653 | for name, commands in api.get_active_command_blocks().items():
320.81 s
gammaloop-workspace-doctest> | ^^^ expected item
320.81 s
gammaloop-workspace-doctest> |
320.81 s
gammaloop-workspace-doctest> = note: for a full list of items that can appear in modules, see <https://doc.rust-lang.org/reference/items.html>
320.81 s
gammaloop-workspace-doctest>
320.81 s
gammaloop-workspace-doctest> error: aborting due to 1 previous error
320.81 s
gammaloop-workspace-doctest>
320.81 s
gammaloop-workspace-doctest> Couldn't compile the test.
320.81 s
gammaloop-workspace-doctest> ---- crates/gammaloop-api/src/python.rs - python::GammaLoopAPI::get_default_runtime_settings (line 3688) stdout ----
320.81 s
gammaloop-workspace-doctest> error: expected one of `!` or `::`, found `=`
320.81 s
gammaloop-workspace-doctest> --> crates/gammaloop-api/src/python.rs:3689:9
320.81 s
gammaloop-workspace-doctest> |
320.81 s
gammaloop-workspace-doctest> 3689 | runtime = api.get_default_runtime_settings()
320.81 s
gammaloop-workspace-doctest> | ^ expected one of `!` or `::`
320.81 s
gammaloop-workspace-doctest>
320.81 s
gammaloop-workspace-doctest> error: aborting due to 1 previous error
320.81 s
gammaloop-workspace-doctest>
320.81 s
gammaloop-workspace-doctest> Couldn't compile the test.
320.81 s
gammaloop-workspace-doctest> ---- crates/gammaloop-api/src/python.rs - python::GammaLoopAPI::get_integrand_settings (line 3539) stdout ----
320.81 s
gammaloop-workspace-doctest> error: expected one of `!` or `::`, found `=`
320.81 s
gammaloop-workspace-doctest> --> crates/gammaloop-api/src/python.rs:3540:10
320.81 s
gammaloop-workspace-doctest> |
320.81 s
gammaloop-workspace-doctest> 3540 | settings = api.get_integrand_settings(process_id=0)
320.81 s
gammaloop-workspace-doctest> | ^ expected one of `!` or `::`
320.81 s
gammaloop-workspace-doctest>
320.81 s
gammaloop-workspace-doctest> error: aborting due to 1 previous error
320.81 s
gammaloop-workspace-doctest>
320.81 s
gammaloop-workspace-doctest> Couldn't compile the test.
320.81 s
gammaloop-workspace-doctest> ---- crates/gammaloop-api/src/python.rs - python::GammaLoopAPI::evaluate_samples (line 3040) stdout ----
320.81 s
gammaloop-workspace-doctest> error: expected one of `!` or `::`, found `=`
320.81 s
gammaloop-workspace-doctest> --> crates/gammaloop-api/src/python.rs:3041:8
320.81 s
gammaloop-workspace-doctest> |
320.81 s
gammaloop-workspace-doctest> 3041 | points = numpy.asarray(points, dtype=numpy.float64)
320.81 s
gammaloop-workspace-doctest> | ^ expected one of `!` or `::`
320.81 s
gammaloop-workspace-doctest>
320.81 s
gammaloop-workspace-doctest> error: aborting due to 1 previous error
320.81 s
gammaloop-workspace-doctest>
320.81 s
gammaloop-workspace-doctest> Couldn't compile the test.
320.81 s
gammaloop-workspace-doctest> ---- crates/gammaloop-api/src/python.rs - python::GammaLoopAPI::run_command (line 3793) stdout ----
320.81 s
gammaloop-workspace-doctest> error[E0425] : cannot find value `api` in this scope
320.81 s
gammaloop-workspace-doctest> --> crates/gammaloop-api/src/python.rs:3794:1
320.81 s
gammaloop-workspace-doctest> |
320.81 s
gammaloop-workspace-doctest> 3794 | api.run("display processes")
320.81 s
gammaloop-workspace-doctest> | ^^^ not found in this scope
320.81 s
gammaloop-workspace-doctest>
320.81 s
gammaloop-workspace-doctest> error : aborting due to 1 previous error
320.81 s
gammaloop-workspace-doctest>
320.81 s
gammaloop-workspace-doctest> For more information about this error, try `rustc --explain E0425`.
320.81 s
gammaloop-workspace-doctest> Couldn't compile the test.
320.81 s
gammaloop-workspace-doctest> ---- crates/gammaloop-api/src/python.rs - python::GammaLoopAPI::get_global_settings (line 3631) stdout ----
320.81 s
gammaloop-workspace-doctest> error[E0425] : cannot find value `settings_toml` in this scope
320.81 s
gammaloop-workspace-doctest> --> crates/gammaloop-api/src/python.rs:3632:1
320.81 s
gammaloop-workspace-doctest> |
320.81 s
gammaloop-workspace-doctest> 3632 | settings_toml = api.get_global_settings()
320.81 s
gammaloop-workspace-doctest> | ^^^^^^^^^^^^^
320.81 s
gammaloop-workspace-doctest> |
320.81 s
gammaloop-workspace-doctest> help : you might have meant to introduce a new binding
320.81 s
gammaloop-workspace-doctest> |
320.81 s
gammaloop-workspace-doctest> 3632 | let settings_toml = api.get_global_settings()
320.81 s
gammaloop-workspace-doctest> | +++
320.81 s
gammaloop-workspace-doctest>
320.81 s
gammaloop-workspace-doctest> error[E0425] : cannot find value `api` in this scope
320.81 s
gammaloop-workspace-doctest> --> crates/gammaloop-api/src/python.rs:3632:17
320.81 s
gammaloop-workspace-doctest> |
320.81 s
gammaloop-workspace-doctest> 3632 | settings_toml = api.get_global_settings()
320.81 s
gammaloop-workspace-doctest> | ^^^ not found in this scope
320.81 s
gammaloop-workspace-doctest>
320.81 s
gammaloop-workspace-doctest> error : aborting due to 2 previous errors
320.81 s
gammaloop-workspace-doctest>
320.81 s
gammaloop-workspace-doctest> For more information about this error, try `rustc --explain E0425`.
320.81 s
gammaloop-workspace-doctest> Couldn't compile the test.
320.81 s
gammaloop-workspace-doctest> ---- crates/gammaloop-api/src/python.rs - python::GammaLoopAPI::get_run_history (line 3603) stdout ----
320.81 s
gammaloop-workspace-doctest> error[E0425] : cannot find value `run_card_toml` in this scope
320.81 s
gammaloop-workspace-doctest> --> crates/gammaloop-api/src/python.rs:3604:1
320.81 s
gammaloop-workspace-doctest> |
320.81 s
gammaloop-workspace-doctest> 3604 | run_card_toml = api.get_run_history()
320.81 s
gammaloop-workspace-doctest> | ^^^^^^^^^^^^^
320.81 s
gammaloop-workspace-doctest> |
320.81 s
gammaloop-workspace-doctest> help : you might have meant to introduce a new binding
320.81 s
gammaloop-workspace-doctest> |
320.81 s
gammaloop-workspace-doctest> 3604 | let run_card_toml = api.get_run_history()
320.81 s
gammaloop-workspace-doctest> | +++
320.81 s
gammaloop-workspace-doctest>
320.81 s
gammaloop-workspace-doctest> error[E0425] : cannot find value `api` in this scope
320.81 s
gammaloop-workspace-doctest> --> crates/gammaloop-api/src/python.rs:3604:17
320.81 s
gammaloop-workspace-doctest> |
320.81 s
gammaloop-workspace-doctest> 3604 | run_card_toml = api.get_run_history()
320.81 s
gammaloop-workspace-doctest> | ^^^ not found in this scope
320.81 s
gammaloop-workspace-doctest>
320.81 s
gammaloop-workspace-doctest> error : aborting due to 2 previous errors
320.81 s
gammaloop-workspace-doctest>
320.81 s
gammaloop-workspace-doctest> For more information about this error, try `rustc --explain E0425`.
320.81 s
gammaloop-workspace-doctest> Couldn't compile the test.
320.81 s
gammaloop-workspace-doctest> ---- crates/gammaloop-api/src/python.rs - python::atom_to_canonical_string (line 128) stdout ----
320.81 s
gammaloop-workspace-doctest> error[E0425] : cannot find function `atom_to_canonical_string` in this scope
320.81 s
gammaloop-workspace-doctest> --> crates/gammaloop-api/src/python.rs:129:1
320.81 s
gammaloop-workspace-doctest> |
320.81 s
gammaloop-workspace-doctest> 129 | atom_to_canonical_string("x + x")
320.81 s
gammaloop-workspace-doctest> | ^^^^^^^^^^^^^^^^^^^^^^^^ not found in this scope
320.81 s
gammaloop-workspace-doctest>
320.81 s
gammaloop-workspace-doctest> error : aborting due to 1 previous error
320.81 s
gammaloop-workspace-doctest>
320.81 s
gammaloop-workspace-doctest> For more information about this error, try `rustc --explain E0425`.
320.81 s
gammaloop-workspace-doctest> Couldn't compile the test.
320.81 s
gammaloop-workspace-doctest> ---- crates/gammaloop-api/src/python.rs - python::atom_to_dots (line 157) stdout ----
320.81 s
gammaloop-workspace-doctest> error[E0425] : cannot find function `to_dots` in this scope
320.81 s
gammaloop-workspace-doctest> --> crates/gammaloop-api/src/python.rs:158:1
320.81 s
gammaloop-workspace-doctest> |
320.81 s
gammaloop-workspace-doctest> 158 | to_dots("p(mu) * q(mu)")
320.81 s
gammaloop-workspace-doctest> | ^^^^^^^ not found in this scope
320.81 s
gammaloop-workspace-doctest>
320.81 s
gammaloop-workspace-doctest> error : aborting due to 1 previous error
320.81 s
gammaloop-workspace-doctest>
320.81 s
gammaloop-workspace-doctest> For more information about this error, try `rustc --explain E0425`.
320.81 s
gammaloop-workspace-doctest> Couldn't compile the test.
320.81 s
gammaloop-workspace-doctest> ---- crates/gammaloop-api/src/python.rs - python::evaluate_graph_overall_factor (line 95) stdout ----
320.81 s
gammaloop-workspace-doctest> error[E0425] : cannot find function `evaluate_graph_overall_factor` in this scope
320.81 s
gammaloop-workspace-doctest> --> crates/gammaloop-api/src/python.rs:96:1
320.81 s
gammaloop-workspace-doctest> |
320.81 s
gammaloop-workspace-doctest> 96 | evaluate_graph_overall_factor(
320.81 s
gammaloop-workspace-doctest> | ^^^^^^^^^^^^^^^^^^^^^^^^^^^^^ not found in this scope
320.81 s
gammaloop-workspace-doctest>
320.81 s
gammaloop-workspace-doctest> error : aborting due to 1 previous error
320.81 s
gammaloop-workspace-doctest>
320.81 s
gammaloop-workspace-doctest> For more information about this error, try `rustc --explain E0425`.
320.81 s
gammaloop-workspace-doctest> Couldn't compile the test.
320.81 s
gammaloop-workspace-doctest> ---- crates/gammaloop-api/src/python.rs - python::GammaLoopAPI::new_python (line 2804) stdout ----
320.81 s
gammaloop-workspace-doctest> error[E0425] : cannot find value `api` in this scope
320.81 s
gammaloop-workspace-doctest> --> crates/gammaloop-api/src/python.rs:2805:1
320.81 s
gammaloop-workspace-doctest> |
320.81 s
gammaloop-workspace-doctest> 2805 | api = GammaLoopAPI(state_folder="./state", read_only_state=True)
320.81 s
gammaloop-workspace-doctest> | ^^^
320.81 s
gammaloop-workspace-doctest> |
320.81 s
gammaloop-workspace-doctest> help : you might have meant to introduce a new binding
320.81 s
gammaloop-workspace-doctest> |
320.81 s
gammaloop-workspace-doctest> 2805 | let api = GammaLoopAPI(state_folder="./state", read_only_state=True)
320.81 s
gammaloop-workspace-doctest> | +++
320.81 s
gammaloop-workspace-doctest>
320.81 s
gammaloop-workspace-doctest> error[E0425] : cannot find value `state_folder` in this scope
320.81 s
gammaloop-workspace-doctest> --> crates/gammaloop-api/src/python.rs:2805:20
320.81 s
gammaloop-workspace-doctest> |
320.81 s
gammaloop-workspace-doctest> 2805 | api = GammaLoopAPI(state_folder="./state", read_only_state=True)
320.81 s
gammaloop-workspace-doctest> | ^^^^^^^^^^^^ not found in this scope
320.81 s
gammaloop-workspace-doctest>
320.81 s
gammaloop-workspace-doctest> error[E0425] : cannot find value `read_only_state` in this scope
320.81 s
gammaloop-workspace-doctest> --> crates/gammaloop-api/src/python.rs:2805:44
320.81 s
gammaloop-workspace-doctest> |
320.81 s
gammaloop-workspace-doctest> 2805 | api = GammaLoopAPI(state_folder="./state", read_only_state=True)
320.81 s
gammaloop-workspace-doctest> | ^^^^^^^^^^^^^^^ not found in this scope
320.81 s
gammaloop-workspace-doctest>
320.81 s
gammaloop-workspace-doctest> error[E0425] : cannot find value `True` in this scope
320.81 s
gammaloop-workspace-doctest> --> crates/gammaloop-api/src/python.rs:2805:60
320.81 s
gammaloop-workspace-doctest> |
320.81 s
gammaloop-workspace-doctest> 2805 | api = GammaLoopAPI(state_folder="./state", read_only_state=True)
320.81 s
gammaloop-workspace-doctest> | ^^^^ not found in this scope
320.81 s
gammaloop-workspace-doctest> |
320.81 s
gammaloop-workspace-doctest> help : you may want to use a bool value instead
320.81 s
gammaloop-workspace-doctest> |
320.81 s
gammaloop-workspace-doctest> 2805 - api = GammaLoopAPI(state_folder="./state", read_only_state=True )
320.81 s
gammaloop-workspace-doctest> 2805 + api = GammaLoopAPI(state_folder="./state", read_only_state=true )
320.81 s
gammaloop-workspace-doctest> |
320.81 s
gammaloop-workspace-doctest>
320.81 s
gammaloop-workspace-doctest> error[E0425] : cannot find function, tuple struct or tuple variant `GammaLoopAPI` in this scope
320.81 s
gammaloop-workspace-doctest> --> crates/gammaloop-api/src/python.rs:2805:7
320.81 s
gammaloop-workspace-doctest> |
320.81 s
gammaloop-workspace-doctest> 2805 | api = GammaLoopAPI(state_folder="./state", read_only_state=True)
320.81 s
gammaloop-workspace-doctest> | ^^^^^^^^^^^^ not found in this scope
320.81 s
gammaloop-workspace-doctest>
320.81 s
gammaloop-workspace-doctest> error : aborting due to 5 previous errors
320.81 s
gammaloop-workspace-doctest>
320.81 s
gammaloop-workspace-doctest> For more information about this error, try `rustc --explain E0425`.
320.81 s
gammaloop-workspace-doctest> Couldn't compile the test.
320.81 s
gammaloop-workspace-doctest>
320.81 s
gammaloop-workspace-doctest> failures:
320.81 s
gammaloop-workspace-doctest> crates/gammaloop-api/src/python.rs - python::GammaLoopAPI::evaluate_sample (line 2926)
320.81 s
gammaloop-workspace-doctest> crates/gammaloop-api/src/python.rs - python::GammaLoopAPI::evaluate_samples (line 3040)
320.81 s
gammaloop-workspace-doctest> crates/gammaloop-api/src/python.rs - python::GammaLoopAPI::get_active_command_blocks (line 3652)
320.81 s
gammaloop-workspace-doctest> crates/gammaloop-api/src/python.rs - python::GammaLoopAPI::get_default_runtime_settings (line 3688)
320.81 s
gammaloop-workspace-doctest> crates/gammaloop-api/src/python.rs - python::GammaLoopAPI::get_global_settings (line 3631)
320.81 s
gammaloop-workspace-doctest> crates/gammaloop-api/src/python.rs - python::GammaLoopAPI::get_integrand_info (line 3496)
320.81 s
gammaloop-workspace-doctest> crates/gammaloop-api/src/python.rs - python::GammaLoopAPI::get_integrand_settings (line 3539)
320.81 s
gammaloop-workspace-doctest> crates/gammaloop-api/src/python.rs - python::GammaLoopAPI::get_run_history (line 3603)
320.81 s
gammaloop-workspace-doctest> crates/gammaloop-api/src/python.rs - python::GammaLoopAPI::new_python (line 2804)
320.81 s
gammaloop-workspace-doctest> crates/gammaloop-api/src/python.rs - python::GammaLoopAPI::run_command (line 3793)
320.81 s
gammaloop-workspace-doctest> crates/gammaloop-api/src/python.rs - python::atom_to_canonical_string (line 128)
320.81 s
gammaloop-workspace-doctest> crates/gammaloop-api/src/python.rs - python::atom_to_dots (line 157)
320.81 s
gammaloop-workspace-doctest> crates/gammaloop-api/src/python.rs - python::evaluate_graph_overall_factor (line 95)
320.81 s
gammaloop-workspace-doctest>
320.81 s
gammaloop-workspace-doctest> test result: FAILED. 0 passed; 13 failed; 0 ignored; 0 measured; 0 filtered out; finished in 0.11s
320.81 s
gammaloop-workspace-doctest>
320.81 s
gammaloop-workspace-doctest> error : doctest failed, to rerun pass `-p gammaloop-api --doc`
321.31 s
error: Cannot build '/nix/store/1v2gvnq6liv4ivdz0v1ycq4ka2zd8ni3-gammaloop-workspace-doctest-0.1.0.drv '.
321.31 s
Reason: builder failed with exit code 101 .
321.31 s
Output paths:
321.31 s
/nix/store/2zwrpghrg0khyjn3zdyd48zm4jbgkj7j-gammaloop-workspace-doctest-0.1.0
321.31 s
Last 349 log lines:
321.31 s
> Running phase: unpackPhase
321.31 s
> unpacking source archive /nix/store/9wvq6ybm6dprplm1h2869fg539dqvd85-source
321.31 s
> source root is source
321.31 s
> Running phase: patchPhase
321.31 s
> Executing configureCargoCommonVars
321.31 s
> decompressing cargo artifacts from /nix/store/kbgwngi7xvi54jsr0kp8rhj1b9mfja7d-gammaloop-workspace-deps-deps-0.1.0/target.tar.zst to target
321.31 s
> Running phase: updateAutotoolsGnuConfigScriptsPhase
321.31 s
> Running phase: configurePhase
321.31 s
> will append /build/source/.cargo-home/config.toml with contents of /nix/store/xdy1vvhll2bijdplvl9fcc2b9plkxhaa-vendor-cargo-deps/config.toml
321.31 s
> default configurePhase, nothing to do
321.31 s
> Running phase: buildPhase
321.31 s
> +++ command cargo --version
321.31 s
> cargo 1.97.0 (c980f4866 2026-06-30)
321.31 s
> +++ command cargo test --profile ci-optim --doc --locked --workspace --features gammaloop-api/cli,gammaloop-tracing-filter/clap,gammaloop-tracing-filter/symbolica,idenso/bincode,idenso/reference-cases,linnet/bincode,linnet/drawing,linnet/nodestore-vec,linnet/rkyv,linnet/serde,linnet/symbolica,spenso-macros/shadowing,spenso/shadowing,symbolica/tracing_max_level_info
321.31 s
> Compiling target-lexicon v0.13.5
321.31 s
> Compiling symbolica v2.2.0 (https://github.com/symbolica-dev/symbolica?branch=dev#0441bd7a)
321.31 s
> Compiling maplit v1.0.2
321.31 s
> Compiling gammaloop-tracing-filter-macros v0.1.0 (/build/source/crates/gammaloop-tracing-filter-macros)
321.31 s
> Compiling vakint v0.1.2 (/build/source/crates/vakint)
321.31 s
> Compiling gammalooprs v0.3.4 (/build/source/crates/gammalooprs)
321.31 s
> Compiling alphal00p-docs-macros v0.1.0 (/build/source/crates/alphal00p-docs-macros)
321.31 s
> Compiling alphal00p-docs-schema v0.1.0 (/build/source/crates/alphal00p-docs-schema)
321.31 s
> Compiling rustc_version v0.4.1
321.31 s
> Compiling bincode v1.3.3
321.31 s
> Compiling gungraun-runner v0.18.2
321.31 s
> Compiling target-triple v1.0.1
321.31 s
> Compiling iai-callgrind-runner v0.14.2
321.31 s
> Compiling clinnet v0.1.8 (/build/source/crates/clinnet)
321.31 s
> Compiling gammaloop-integration-tests v0.1.0 (/build/source/tests)
321.31 s
> Compiling test-log-core v0.2.20
321.31 s
> Compiling wait-timeout v0.2.1
321.31 s
> Compiling bit-vec v0.8.0
321.31 s
> Compiling quick-error v1.2.3
321.31 s
> Compiling iai-callgrind v0.14.2
321.31 s
> Compiling rusty-fork v0.3.1
321.31 s
> Compiling bit-set v0.8.0
321.31 s
> Compiling iai-callgrind-macros v0.5.1
321.31 s
> Compiling rand_xorshift v0.4.0
321.31 s
> Compiling console v0.15.11
321.31 s
> Compiling glob v0.3.4
321.31 s
> Compiling termcolor v1.4.1
321.31 s
> Compiling gungraun-macros v0.8.0
321.31 s
> Compiling base64 v0.21.7
321.31 s
> Compiling unarray v0.1.4
321.31 s
> Compiling proptest v1.11.0
321.31 s
> Compiling alphal00p-docs-catalogs v0.1.0 (/build/source/crates/alphal00p-docs-catalogs)
321.31 s
> Compiling ron v0.8.1
321.31 s
> Compiling pyo3-build-config v0.28.3
321.31 s
> Compiling trybuild v1.0.120
321.31 s
> Compiling similar-asserts v1.7.0
321.31 s
> Compiling alphal00p-docs-builder v0.1.0 (/build/source/crates/alphal00p-docs-builder)
321.31 s
> Compiling kurvst v0.1.0 (/build/source/crates/kurvst)
321.31 s
> Compiling test-log-macros v0.2.20
321.31 s
> Compiling test-log v0.2.20
321.31 s
> Compiling alphal00p-docs-examples v0.1.0 (/build/source/crates/alphal00p-docs-examples)
321.31 s
> Compiling pyo3-macros-backend v0.28.3
321.31 s
> Compiling pyo3-ffi v0.28.3
321.31 s
> Compiling pyo3 v0.28.3
321.31 s
> Compiling numpy v0.28.0
321.31 s
> Compiling gammaloop-api v0.1.0 (/build/source/crates/gammaloop-api)
321.31 s
> Compiling gungraun v0.18.2
321.31 s
> Compiling pyo3-macros v0.28.3
321.31 s
> Compiling pyo3-stub-gen v0.17.2
321.31 s
> Compiling numerica v2.2.0 (https://github.com/symbolica-dev/symbolica?branch=dev#0441bd7a)
321.31 s
> Compiling graphica v2.1.0 (https://github.com/symbolica-dev/symbolica?branch=dev#0441bd7a)
321.31 s
> Compiling symbolica-utils v0.1.0 (/build/source/crates/symbolica-utils)
321.31 s
> Compiling gammaloop-workspace-hack v0.1.0 (/build/source/crates/gammaloop-workspace-hack)
321.31 s
> Compiling spenso-macros v0.3.2 (/build/source/crates/spenso-macros)
321.31 s
> Compiling linnet v0.17.0 (/build/source/crates/linnet)
321.31 s
> Compiling spenso v0.6.0 (/build/source/crates/spenso)
321.31 s
> Compiling idenso v0.3.0 (/build/source/crates/idenso)
321.31 s
> Compiling gammaloop-tracing-filter v0.1.0 (/build/source/crates/gammaloop-tracing-filter)
321.31 s
> Compiling spenso-hep-lib v0.1.7 (/build/source/crates/spenso-hep-lib)
321.31 s
> Compiling spynso3 v0.1.2 (/build/source/crates/spynso3)
321.31 s
> Compiling linnest v0.1.0 (/build/source/crates/linnest)
321.31 s
> Compiling linnet-py v0.1.0 (/build/source/crates/linnet-py)
321.31 s
> Finished `ci-optim` profile [optimized] target(s) in 5m 04s
321.31 s
> warning : the following packages contain code that will be rejected by a future version of Rust: proc-macro-error2 v2.0.1
321.31 s
> note : to see what the problems were, use the option `--future-incompat-report`, or run `cargo report future-incompatibilities --id 1`
321.31 s
> Doc-tests alphal00p_docs_builder
321.31 s
>
321.31 s
> running 0 tests
321.31 s
>
321.31 s
> test result: ok. 0 passed; 0 failed; 0 ignored; 0 measured; 0 filtered out; finished in 0.00s
321.31 s
>
321.31 s
> Doc-tests alphal00p_docs_catalogs
321.31 s
>
321.31 s
> running 0 tests
321.31 s
>
321.31 s
> test result: ok. 0 passed; 0 failed; 0 ignored; 0 measured; 0 filtered out; finished in 0.00s
321.31 s
>
321.31 s
> Doc-tests alphal00p_docs_examples
321.31 s
>
321.31 s
> running 0 tests
321.31 s
>
321.31 s
> test result: ok. 0 passed; 0 failed; 0 ignored; 0 measured; 0 filtered out; finished in 0.00s
321.31 s
>
321.31 s
> Doc-tests alphal00p_docs
321.31 s
>
321.31 s
> running 0 tests
321.31 s
>
321.31 s
> test result: ok. 0 passed; 0 failed; 0 ignored; 0 measured; 0 filtered out; finished in 0.00s
321.31 s
>
321.31 s
> Doc-tests alphal00p_docs_schema
321.31 s
>
321.31 s
> running 0 tests
321.31 s
>
321.31 s
> test result: ok. 0 passed; 0 failed; 0 ignored; 0 measured; 0 filtered out; finished in 0.00s
321.31 s
>
321.31 s
> Doc-tests clinnet
321.31 s
>
321.31 s
> running 0 tests
321.31 s
>
321.31 s
> test result: ok. 0 passed; 0 failed; 0 ignored; 0 measured; 0 filtered out; finished in 0.00s
321.31 s
>
321.31 s
> Doc-tests gammaloop_api
321.31 s
>
321.31 s
> running 13 tests
321.31 s
> test crates/gammaloop-api/src/python.rs - python::GammaLoopAPI::evaluate_sample (line 2926) ... FAILED
321.31 s
> test crates/gammaloop-api/src/python.rs - python::GammaLoopAPI::get_integrand_info (line 3496) ... FAILED
321.31 s
> test crates/gammaloop-api/src/python.rs - python::GammaLoopAPI::get_active_command_blocks (line 3652) ... FAILED
321.31 s
> test crates/gammaloop-api/src/python.rs - python::GammaLoopAPI::get_default_runtime_settings (line 3688) ... FAILED
321.31 s
> test crates/gammaloop-api/src/python.rs - python::GammaLoopAPI::get_integrand_settings (line 3539) ... FAILED
321.31 s
> test crates/gammaloop-api/src/python.rs - python::GammaLoopAPI::evaluate_samples (line 3040) ... FAILED
321.31 s
> test crates/gammaloop-api/src/python.rs - python::GammaLoopAPI::run_command (line 3793) ... FAILED
321.31 s
> test crates/gammaloop-api/src/python.rs - python::GammaLoopAPI::get_global_settings (line 3631) ... FAILED
321.31 s
> test crates/gammaloop-api/src/python.rs - python::GammaLoopAPI::get_run_history (line 3603) ... FAILED
321.31 s
> test crates/gammaloop-api/src/python.rs - python::atom_to_canonical_string (line 128) ... FAILED
321.31 s
> test crates/gammaloop-api/src/python.rs - python::atom_to_dots (line 157) ... FAILED
321.31 s
> test crates/gammaloop-api/src/python.rs - python::evaluate_graph_overall_factor (line 95) ... FAILED
321.31 s
> test crates/gammaloop-api/src/python.rs - python::GammaLoopAPI::new_python (line 2804) ... FAILED
321.31 s
>
321.31 s
> failures:
321.31 s
>
321.31 s
> ---- crates/gammaloop-api/src/python.rs - python::GammaLoopAPI::evaluate_sample (line 2926) stdout ----
321.31 s
> error: expected one of `!` or `::`, found `=`
321.31 s
> --> crates/gammaloop-api/src/python.rs:2927:8
321.31 s
> |
321.31 s
> 2927 | result = api.evaluate_sample(point, process_id=0, minimal_output=True)
321.31 s
> | ^ expected one of `!` or `::`
321.31 s
>
321.31 s
> error: aborting due to 1 previous error
321.31 s
>
321.31 s
> Couldn't compile the test.
321.31 s
> ---- crates/gammaloop-api/src/python.rs - python::GammaLoopAPI::get_integrand_info (line 3496) stdout ----
321.31 s
> error: expected one of `!` or `::`, found `=`
321.31 s
> --> crates/gammaloop-api/src/python.rs:3497:6
321.31 s
> |
321.31 s
> 3497 | info = api.get_integrand_info(process_id=0)
321.31 s
> | ^ expected one of `!` or `::`
321.31 s
>
321.31 s
> error: aborting due to 1 previous error
321.31 s
>
321.31 s
> Couldn't compile the test.
321.31 s
> ---- crates/gammaloop-api/src/python.rs - python::GammaLoopAPI::get_active_command_blocks (line 3652) stdout ----
321.31 s
> error: expected item, found keyword `for`
321.31 s
> --> crates/gammaloop-api/src/python.rs:3653:1
321.31 s
> |
321.31 s
> 3653 | for name, commands in api.get_active_command_blocks().items():
321.31 s
> | ^^^ expected item
321.31 s
> |
321.31 s
> = note: for a full list of items that can appear in modules, see <https://doc.rust-lang.org/reference/items.html>
321.31 s
>
321.31 s
> error: aborting due to 1 previous error
321.31 s
>
321.31 s
> Couldn't compile the test.
321.31 s
> ---- crates/gammaloop-api/src/python.rs - python::GammaLoopAPI::get_default_runtime_settings (line 3688) stdout ----
321.31 s
> error: expected one of `!` or `::`, found `=`
321.31 s
> --> crates/gammaloop-api/src/python.rs:3689:9
321.31 s
> |
321.31 s
> 3689 | runtime = api.get_default_runtime_settings()
321.31 s
> | ^ expected one of `!` or `::`
321.31 s
>
321.31 s
> error: aborting due to 1 previous error
321.31 s
>
321.31 s
> Couldn't compile the test.
321.31 s
> ---- crates/gammaloop-api/src/python.rs - python::GammaLoopAPI::get_integrand_settings (line 3539) stdout ----
321.31 s
> error: expected one of `!` or `::`, found `=`
321.31 s
> --> crates/gammaloop-api/src/python.rs:3540:10
321.31 s
> |
321.31 s
> 3540 | settings = api.get_integrand_settings(process_id=0)
321.31 s
> | ^ expected one of `!` or `::`
321.31 s
>
321.31 s
> error: aborting due to 1 previous error
321.31 s
>
321.31 s
> Couldn't compile the test.
321.31 s
> ---- crates/gammaloop-api/src/python.rs - python::GammaLoopAPI::evaluate_samples (line 3040) stdout ----
321.31 s
> error: expected one of `!` or `::`, found `=`
321.31 s
> --> crates/gammaloop-api/src/python.rs:3041:8
321.31 s
> |
321.31 s
> 3041 | points = numpy.asarray(points, dtype=numpy.float64)
321.31 s
> | ^ expected one of `!` or `::`
321.31 s
>
321.31 s
> error: aborting due to 1 previous error
321.31 s
>
321.31 s
> Couldn't compile the test.
321.31 s
> ---- crates/gammaloop-api/src/python.rs - python::GammaLoopAPI::run_command (line 3793) stdout ----
321.31 s
> error[E0425] : cannot find value `api` in this scope
321.31 s
> --> crates/gammaloop-api/src/python.rs:3794:1
321.31 s
> |
321.31 s
> 3794 | api.run("display processes")
321.31 s
> | ^^^ not found in this scope
321.31 s
>
321.31 s
> error : aborting due to 1 previous error
321.31 s
>
321.31 s
> For more information about this error, try `rustc --explain E0425`.
321.31 s
> Couldn't compile the test.
321.31 s
> ---- crates/gammaloop-api/src/python.rs - python::GammaLoopAPI::get_global_settings (line 3631) stdout ----
321.31 s
> error[E0425] : cannot find value `settings_toml` in this scope
321.31 s
> --> crates/gammaloop-api/src/python.rs:3632:1
321.31 s
> |
321.31 s
> 3632 | settings_toml = api.get_global_settings()
321.31 s
> | ^^^^^^^^^^^^^
321.31 s
> |
321.31 s
> help : you might have meant to introduce a new binding
321.31 s
> |
321.31 s
> 3632 | let settings_toml = api.get_global_settings()
321.31 s
> | +++
321.31 s
>
321.31 s
> error[E0425] : cannot find value `api` in this scope
321.31 s
> --> crates/gammaloop-api/src/python.rs:3632:17
321.31 s
> |
321.31 s
> 3632 | settings_toml = api.get_global_settings()
321.31 s
> | ^^^ not found in this scope
321.31 s
>
321.31 s
> error : aborting due to 2 previous errors
321.31 s
>
321.31 s
> For more information about this error, try `rustc --explain E0425`.
321.31 s
> Couldn't compile the test.
321.31 s
> ---- crates/gammaloop-api/src/python.rs - python::GammaLoopAPI::get_run_history (line 3603) stdout ----
321.31 s
> error[E0425] : cannot find value `run_card_toml` in this scope
321.31 s
> --> crates/gammaloop-api/src/python.rs:3604:1
321.31 s
> |
321.31 s
> 3604 | run_card_toml = api.get_run_history()
321.31 s
> | ^^^^^^^^^^^^^
321.31 s
> |
321.31 s
> help : you might have meant to introduce a new binding
321.31 s
> |
321.31 s
> 3604 | let run_card_toml = api.get_run_history()
321.31 s
> | +++
321.31 s
>
321.31 s
> error[E0425] : cannot find value `api` in this scope
321.31 s
> --> crates/gammaloop-api/src/python.rs:3604:17
321.31 s
> |
321.31 s
> 3604 | run_card_toml = api.get_run_history()
321.31 s
> | ^^^ not found in this scope
321.31 s
>
321.31 s
> error : aborting due to 2 previous errors
321.31 s
>
321.31 s
> For more information about this error, try `rustc --explain E0425`.
321.31 s
> Couldn't compile the test.
321.31 s
> ---- crates/gammaloop-api/src/python.rs - python::atom_to_canonical_string (line 128) stdout ----
321.31 s
> error[E0425] : cannot find function `atom_to_canonical_string` in this scope
321.31 s
> --> crates/gammaloop-api/src/python.rs:129:1
321.31 s
> |
321.31 s
> 129 | atom_to_canonical_string("x + x")
321.31 s
> | ^^^^^^^^^^^^^^^^^^^^^^^^ not found in this scope
321.31 s
>
321.31 s
> error : aborting due to 1 previous error
321.31 s
>
321.31 s
> For more information about this error, try `rustc --explain E0425`.
321.31 s
> Couldn't compile the test.
321.31 s
> ---- crates/gammaloop-api/src/python.rs - python::atom_to_dots (line 157) stdout ----
321.31 s
> error[E0425] : cannot find function `to_dots` in this scope
321.31 s
> --> crates/gammaloop-api/src/python.rs:158:1
321.31 s
> |
321.31 s
> 158 | to_dots("p(mu) * q(mu)")
321.31 s
> | ^^^^^^^ not found in this scope
321.31 s
>
321.31 s
> error : aborting due to 1 previous error
321.31 s
>
321.31 s
> For more information about this error, try `rustc --explain E0425`.
321.31 s
> Couldn't compile the test.
321.31 s
> ---- crates/gammaloop-api/src/python.rs - python::evaluate_graph_overall_factor (line 95) stdout ----
321.31 s
> error[E0425] : cannot find function `evaluate_graph_overall_factor` in this scope
321.31 s
> --> crates/gammaloop-api/src/python.rs:96:1
321.31 s
> |
321.31 s
> 96 | evaluate_graph_overall_factor(
321.31 s
> | ^^^^^^^^^^^^^^^^^^^^^^^^^^^^^ not found in this scope
321.31 s
>
321.31 s
> error : aborting due to 1 previous error
321.31 s
>
321.31 s
> For more information about this error, try `rustc --explain E0425`.
321.31 s
> Couldn't compile the test.
321.31 s
> ---- crates/gammaloop-api/src/python.rs - python::GammaLoopAPI::new_python (line 2804) stdout ----
321.31 s
> error[E0425] : cannot find value `api` in this scope
321.31 s
> --> crates/gammaloop-api/src/python.rs:2805:1
321.31 s
> |
321.31 s
> 2805 | api = GammaLoopAPI(state_folder="./state", read_only_state=True)
321.31 s
> | ^^^
321.31 s
> |
321.31 s
> help : you might have meant to introduce a new binding
321.31 s
> |
321.31 s
> 2805 | let api = GammaLoopAPI(state_folder="./state", read_only_state=True)
321.31 s
> | +++
321.31 s
>
321.31 s
> error[E0425] : cannot find value `state_folder` in this scope
321.31 s
> --> crates/gammaloop-api/src/python.rs:2805:20
321.31 s
> |
321.31 s
> 2805 | api = GammaLoopAPI(state_folder="./state", read_only_state=True)
321.31 s
> | ^^^^^^^^^^^^ not found in this scope
321.31 s
>
321.31 s
> error[E0425] : cannot find value `read_only_state` in this scope
321.31 s
> --> crates/gammaloop-api/src/python.rs:2805:44
321.31 s
> |
321.31 s
> 2805 | api = GammaLoopAPI(state_folder="./state", read_only_state=True)
321.31 s
> | ^^^^^^^^^^^^^^^ not found in this scope
321.31 s
>
321.31 s
> error[E0425] : cannot find value `True` in this scope
321.31 s
> --> crates/gammaloop-api/src/python.rs:2805:60
321.31 s
> |
321.31 s
> 2805 | api = GammaLoopAPI(state_folder="./state", read_only_state=True)
321.31 s
> | ^^^^ not found in this scope
321.31 s
> |
321.31 s
> help : you may want to use a bool value instead
321.31 s
> |
321.31 s
> 2805 - api = GammaLoopAPI(state_folder="./state", read_only_state=True )
321.31 s
> 2805 + api = GammaLoopAPI(state_folder="./state", read_only_state=true )
321.31 s
> |
321.31 s
>
321.31 s
> error[E0425] : cannot find function, tuple struct or tuple variant `GammaLoopAPI` in this scope
321.31 s
> --> crates/gammaloop-api/src/python.rs:2805:7
321.31 s
> |
321.31 s
> 2805 | api = GammaLoopAPI(state_folder="./state", read_only_state=True)
321.31 s
> | ^^^^^^^^^^^^ not found in this scope
321.31 s
>
321.31 s
> error : aborting due to 5 previous errors
321.31 s
>
321.31 s
> For more information about this error, try `rustc --explain E0425`.
321.31 s
> Couldn't compile the test.
321.31 s
>
321.31 s
> failures:
321.31 s
> crates/gammaloop-api/src/python.rs - python::GammaLoopAPI::evaluate_sample (line 2926)
321.31 s
> crates/gammaloop-api/src/python.rs - python::GammaLoopAPI::evaluate_samples (line 3040)
321.31 s
> crates/gammaloop-api/src/python.rs - python::GammaLoopAPI::get_active_command_blocks (line 3652)
321.31 s
> crates/gammaloop-api/src/python.rs - python::GammaLoopAPI::get_default_runtime_settings (line 3688)
321.31 s
> crates/gammaloop-api/src/python.rs - python::GammaLoopAPI::get_global_settings (line 3631)
321.31 s
> crates/gammaloop-api/src/python.rs - python::GammaLoopAPI::get_integrand_info (line 3496)
321.31 s
> crates/gammaloop-api/src/python.rs - python::GammaLoopAPI::get_integrand_settings (line 3539)
321.31 s
> crates/gammaloop-api/src/python.rs - python::GammaLoopAPI::get_run_history (line 3603)
321.31 s
> crates/gammaloop-api/src/python.rs - python::GammaLoopAPI::new_python (line 2804)
321.31 s
> crates/gammaloop-api/src/python.rs - python::GammaLoopAPI::run_command (line 3793)
321.31 s
> crates/gammaloop-api/src/python.rs - python::atom_to_canonical_string (line 128)
321.31 s
> crates/gammaloop-api/src/python.rs - python::atom_to_dots (line 157)
321.31 s
> crates/gammaloop-api/src/python.rs - python::evaluate_graph_overall_factor (line 95)
321.31 s
>
321.31 s
> test result: FAILED. 0 passed; 13 failed; 0 ignored; 0 measured; 0 filtered out; finished in 0.11s
321.31 s
>
321.31 s
> error : doctest failed, to rerun pass `-p gammaloop-api --doc`
321.31 s
For full logs, run:
321.31 s
nix log /nix/store/1v2gvnq6liv4ivdz0v1ycq4ka2zd8ni3-gammaloop-workspace-doctest-0.1.0.drv
321.40 s
[0 built (1 failed ), 0.0 Run failed.