test packages.x86_64-linux.nix-ci-check-gammaloop-nextest-integration

Reproduce this run
Retry Run
  1. 141.89 s gammaloop-nextest-integration> | dod2_bubble | rls.integrated | GL0 | pass | 0.0sigma | compatible within 2sigma | - |
  2. 141.89 s gammaloop-nextest-integration> +-------------+-----------------+---------+--------+----------+-----------------------------------------------------------------------------------------------------------------------+-------+
  3. 141.89 s gammaloop-nextest-integration> | dod2_bubble | mu_r.inspect | inspect | pass | - | best inspect relative delta 6.951e-1 >= 1000*accuracy 1.000e-7 (accuracy=1.000e-10, exponent=+0.0, seed=0, probes=10) | - |
  4. 141.89 s gammaloop-nextest-integration> +-------------+-----------------+---------+--------+----------+-----------------------------------------------------------------------------------------------------------------------+-------+
  5. 141.89 s gammaloop-nextest-integration> | dod2_bubble | target | - | pass | - | 2sigma | - |
  6. 141.89 s gammaloop-nextest-integration> +-------------+-----------------+---------+--------+----------+-----------------------------------------------------------------------------------------------------------------------+-------+
  7. 141.89 s gammaloop-nextest-integration> test dod2_bubble_uv ... FAILED
  8. 141.89 s gammaloop-nextest-integration>
  9. 141.89 s gammaloop-nextest-integration> failures:
  10. 141.89 s gammaloop-nextest-integration>
  11. 141.89 s gammaloop-nextest-integration> failures:
  12. 141.89 s gammaloop-nextest-integration> dod2_bubble_uv
  13. 141.89 s gammaloop-nextest-integration>
  14. 141.89 s gammaloop-nextest-integration> test result: FAILED. 0 passed; 1 failed; 0 ignored; 0 measured; 24 filtered out; finished in 40.35s
  15. 141.89 s gammaloop-nextest-integration> system-err
  16. 141.89 s gammaloop-nextest-integration> [2026-08-28 17:29:12.748] @gammaloop_api::se... INFO : Running command run generate
  17. 141.89 s gammaloop-nextest-integration> [2026-08-28 17:29:12.748] @gammaloop_api::se... INFO : Starting command block generate
  18. 141.89 s gammaloop-nextest-integration> [2026-08-28 17:29:12.749] @gammaloop_api::se... INFO : Running command import model scalars-default.json
  19. 141.89 s gammaloop-nextest-integration> [2026-08-28 17:29:12.749] @import::model INFO : Loading built-in JSON model scalars-default
  20. 141.89 s gammaloop-nextest-integration> [2026-08-28 17:29:12.752] @gammalooprs::model INFO : The following 2 external parameters were forced to zero by the restriction card:
  21. 141.89 s gammaloop-nextest-integration> width_scalar_1, width_scalar_2
  22. 141.89 s gammaloop-nextest-integration> [2026-08-28 17:29:12.753] @gammaloop_api::se... INFO : Running command remove processes
  23. 141.89 s gammaloop-nextest-integration> [2026-08-28 17:29:12.753] @gammaloop_api::se... INFO : Running command set global kv global.generation.uv.generate_integrated=true
  24. 141.89 s gammaloop-nextest-integration> [2026-08-28 17:29:12.753] @gammaloop_api::se... INFO : Running command import graphs ./tests/resources/graphs/scalar/dod2_bubble.dot -p bubble_dod2 -i scalar_bubble_below_thres
  25. 141.89 s gammaloop-nextest-integration> [2026-08-28 17:29:12.753] @commands::import INFO : Loading graphs from '/build/source/tests/resources/graphs/scalar/dod2_bubble.dot'
  26. 141.89 s gammaloop-nextest-integration> [2026-08-28 17:29:12.756] @gammaloop_api::se... INFO : Running command generate existing -p bubble_dod2 -i scalar_bubble_below_thres
  27. 141.89 s gammaloop-nextest-integration> [2026-08-28 17:29:12.758] @approx::local_4d [{#uv, #inspect, #integrated}] DEBUG : Rescaled momenta expanded
  28. 141.89 s gammaloop-nextest-integration> field value
  29. 141.89 s gammaloop-nextest-integration> res n-terms: 1, byte size: 585,expr:
  30. 141.89 s gammaloop-nextest-integration> -SCALAR_COUPLING²·q₀(αᵉ².¹)·q₀(αᵉ³.¹)·q₂(αᵉ².¹)·q₂(αᵉ³.¹)
  31. 141.89 s gammaloop-nextest-integration> /(t²·denom(3,-q₀-q₂/t,mass_scalar_2²,-mass_scalar_2²+2·(q₀.q₂)/t+(q₂.q₂)/t²+(q₀.q₀))
  32. 141.89 s gammaloop-nextest-integration> ·denom(2,q₂/t,mass_scalar_2²,-mass_scalar_2²+(q₂.q₂)/t²))
  33. 141.89 s gammaloop-nextest-integration> [2026-08-28 17:29:12.772] @approx::local_4d [{#uv, #inspect, #integrated}] DEBUG : Rescaled momenta expanded
  34. 141.89 s gammaloop-nextest-integration> field value
  35. 141.89 s gammaloop-nextest-integration> res n-terms: 1, byte size: 3,expr:
  36. 141.89 s gammaloop-nextest-integration> 1
  37. 141.89 s gammaloop-nextest-integration> [2026-08-28 17:29:12.773] @approx::final_integrand[{#generation, #profile, #uv, #graph, #summary}] DEBUG : Computed global numerator
  38. 141.89 s gammaloop-nextest-integration> field value
  39. 141.89 s gammaloop-nextest-integration> global_num n-terms: 1, byte size: 4,expr:
  40. 141.89 s gammaloop-nextest-integration> 1/2
  41. 141.89 s gammaloop-nextest-integration> span build_3d{span_context=true graph=GL0 current=subgraph=0, topo_order=0, dod=0}
  42. 141.89 s gammaloop-nextest-integration> [2026-08-28 17:29:12.777] @uv::approx [{#generation, #uv, #fourd}] DEBUG : Computing 4D
  43. 141.89 s gammaloop-nextest-integration> field value
  44. 141.89 s gammaloop-nextest-integration> simple subgraph(S_11,S_y)*Approx(subgraph(S_y,0)) of GL0
  45. 141.89 s gammaloop-nextest-integration> span compute_4d{span_context=true graph=GL0 current=subgraph=y, topo_order=1, dod=2 given=subgraph=0, topo_order=0, dod=0 reduced=SubSet { set: BitVec<usize, bitvec::order::Lsb0> { addr: 0x7fffec00a8f0, head: 000000, bits: 6, capacity: 64 } [0, 0, 1, 1, 1, 1], id: PhantomData<linnet::half_edge::involution::Hedge> }}
  46. 141.89 s gammaloop-nextest-integration> [2026-08-28 17:29:12.778] @approx::local_4d [{#uv, #algebra, #integrated, #start}] DEBUG :
  47. 141.89 s gammaloop-nextest-integration> field value
  48. 141.89 s gammaloop-nextest-integration> integrand n-terms: 1, byte size: 409,expr:
  49. 141.89 s gammaloop-nextest-integration> SCALAR_COUPLING²·(q₀(αᵉ³.¹)+q₃(αᵉ³.¹))·q₀(αᵉ².¹)·q₀(αᵉ³.¹)·q₂(αᵉ².¹)
  50. 141.89 s gammaloop-nextest-integration> /(denom(2,q₂,mass_scalar_2²,-mass_scalar_2²+(q₂.q₂))·denom(3,q₃,mass_scalar_2²,-mass_scalar_2²+(q₃.q₃)))
  51. 141.89 s gammaloop-nextest-integration> reduced y
  52. 141.89 s gammaloop-nextest-integration> span grow{span_context=true current=subgraph=y, topo_order=1, dod=2 given=subgraph=0, topo_order=0, dod=0}
  53. 141.89 s gammaloop-nextest-integration> [2026-08-28 17:29:12.778] @approx::local_4d [{#uv, #inspect, #integrated}] DEBUG : Rescaled momenta expanded
  54. 141.89 s gammaloop-nextest-integration> field value
  55. 141.89 s gammaloop-nextest-integration> res n-terms: 1, byte size: 585,expr:
  56. 141.89 s gammaloop-nextest-integration> -SCALAR_COUPLING²·q₀(αᵉ².¹)·q₀(αᵉ³.¹)·q₂(αᵉ².¹)·q₂(αᵉ³.¹)
  57. 141.89 s gammaloop-nextest-integration> /(t²·denom(3,-q₀-q₂/t,mass_scalar_2²,-mass_scalar_2²+2·(q₀.q₂)/t+(q₂.q₂)/t²+(q₀.q₀))
  58. 141.89 s gammaloop-nextest-integration> ·denom(2,q₂/t,mass_scalar_2²,-mass_scalar_2²+(q₂.q₂)/t²))
  59. 141.89 s gammaloop-nextest-integration> span t{span_context=true current=subgraph=y, topo_order=1, dod=2 given=subgraph=0, topo_order=0, dod=0}
  60. 141.89 s gammaloop-nextest-integration> [2026-08-28 17:29:12.778] @approx::local_4d [{#uv, #integrated, #rescaled}] DEBUG : Rescaled expanded
  61. 141.89 s gammaloop-nextest-integration> field value
  62. 141.89 s gammaloop-nextest-integration> n_loops 1
  63. 141.89 s gammaloop-nextest-integration> res n-terms: 1, byte size: 707,expr:
  64. 141.89 s gammaloop-nextest-integration> -SCALAR_COUPLING²·q₀(αᵉ².¹)·q₀(αᵉ³.¹)·q₂(αᵉ².¹)·q₂(αᵉ³.¹)
  65. 141.89 s gammaloop-nextest-integration> /(t²·denom(3,-q₂,mUVexp²+t²·mass_scalar_2²,-mUV²+t²·(-mass_scalar_2²+2·(q₀.q₂)/t+(q₂.q₂)/t²+(q₀.q₀))+t²·mUVexp²)
  66. 141.89 s gammaloop-nextest-integration> ·denom(2,q₂,mUVexp²+t²·mass_scalar_2²,-mUV²+t²·(-mass_scalar_2²+(q₂.q₂)/t²)+t²·mUVexp²))
  67. 141.89 s gammaloop-nextest-integration> span t{span_context=true current=subgraph=y, topo_order=1, dod=2 given=subgraph=0, topo_order=0, dod=0}
  68. 141.89 s gammaloop-nextest-integration> [2026-08-28 17:29:12.779] @approx::local_4d [{#uv, #integrated, #series}] DEBUG : Series expanded
  69. 141.89 s gammaloop-nextest-integration> field value
  70. 141.89 s gammaloop-nextest-integration> res n-terms: 3, byte size: 1896,expr:
  71. 141.89 s gammaloop-nextest-integration> (1/2·SCALAR_COUPLING²·(2·mUVexp²-2·mass_scalar_2²)/(denom(2,q₂,mUVexp²,-mUV²+(q₂.q₂))²·denom(3,-q₂,mUVexp²,-mUV²+(q₂.q₂)))
  72. 141.89 s gammaloop-nextest-integration> -SCALAR_COUPLING²
  73. 141.89 s gammaloop-nextest-integration> ·(-1/2·(2·mUVexp²-2·mass_scalar_2²+2·(q₀.q₀))/denom(3,-q₂,mUVexp²,-mUV²+(q₂.q₂))
  74. 141.89 s gammaloop-nextest-integration> +4·(q₀.q₂)²/denom(3,-q₂,mUVexp²,-mUV²+(q₂.q₂))²
  75. 141.89 s gammaloop-nextest-integration> )/(denom(2,q₂,mUVexp²,-mUV²+(q₂.q₂))·denom(3,-q₂,mUVexp²,-mUV²+(q₂.q₂)))
  76. 141.89 s gammaloop-nextest-integration> )·q₀(αᵉ².¹)·q₀(αᵉ³.¹)·q₂(αᵉ².¹)·q₂(αᵉ³.¹)
  77. 141.89 s gammaloop-nextest-integration> +2·SCALAR_COUPLING²·(q₀.q₂)·q₀(αᵉ².¹)·q₀(αᵉ³.¹)·q₂(αᵉ².¹)·q₂(αᵉ³.¹)
  78. 141.89 s gammaloop-nextest-integration> /(t·denom(2,q₂,mUVexp²,-mUV²+(q₂.q₂))·denom(3,-q₂,mUVexp²,-mUV²+(q₂.q₂))²)
  79. 141.89 s gammaloop-nextest-integration> -SCALAR_COUPLING²·q₀(αᵉ².¹)·q₀(αᵉ³.¹)·q₂(αᵉ².¹)·q₂(αᵉ³.¹)
  80. 141.89 s gammaloop-nextest-integration> /(t²·denom(2,q₂,mUVexp²,-mUV²+(q₂.q₂))·denom(3,-q₂,mUVexp²,-mUV²+(q₂.q₂)))
  81. 141.89 s gammaloop-nextest-integration> span t{span_context=true current=subgraph=y, topo_order=1, dod=2 given=subgraph=0, topo_order=0, dod=0}
  82. 141.89 s gammaloop-nextest-integration> [2026-08-28 17:29:12.779] @approx::local_4d [{#uv, #integrated, #series}] DEBUG : Evaluated at t = 1
  83. 141.89 s gammaloop-nextest-integration> field value
  84. 141.89 s gammaloop-nextest-integration> res n-terms: 3, byte size: 1880,expr:
  85. 141.89 s gammaloop-nextest-integration> (1/2·SCALAR_COUPLING²·(2·mUVexp²-2·mass_scalar_2²)/(denom(2,q₂,mUVexp²,-mUV²+(q₂.q₂))²·denom(3,-q₂,mUVexp²,-mUV²+(q₂.q₂)))
  86. 141.89 s gammaloop-nextest-integration> -SCALAR_COUPLING²
  87. 141.89 s gammaloop-nextest-integration> ·(-1/2·(2·mUVexp²-2·mass_scalar_2²+2·(q₀.q₀))/denom(3,-q₂,mUVexp²,-mUV²+(q₂.q₂))
  88. 141.89 s gammaloop-nextest-integration> +4·(q₀.q₂)²/denom(3,-q₂,mUVexp²,-mUV²+(q₂.q₂))²
  89. 141.89 s gammaloop-nextest-integration> )/(denom(2,q₂,mUVexp²,-mUV²+(q₂.q₂))·denom(3,-q₂,mUVexp²,-mUV²+(q₂.q₂)))
  90. 141.89 s gammaloop-nextest-integration> )·q₀(αᵉ².¹)·q₀(αᵉ³.¹)·q₂(αᵉ².¹)·q₂(αᵉ³.¹)
  91. 141.89 s gammaloop-nextest-integration> -SCALAR_COUPLING²·q₀(αᵉ².¹)·q₀(αᵉ³.¹)·q₂(αᵉ².¹)·q₂(αᵉ³.¹)
  92. 141.89 s gammaloop-nextest-integration> /(denom(2,q₂,mUVexp²,-mUV²+(q₂.q₂))·denom(3,-q₂,mUVexp²,-mUV²+(q₂.q₂)))
  93. 141.89 s gammaloop-nextest-integration> +2·SCALAR_COUPLING²·(q₀.q₂)·q₀(αᵉ².¹)·q₀(αᵉ³.¹)·q₂(αᵉ².¹)·q₂(αᵉ³.¹)
  94. 141.89 s gammaloop-nextest-integration> /(denom(2,q₂,mUVexp²,-mUV²+(q₂.q₂))·denom(3,-q₂,mUVexp²,-mUV²+(q₂.q₂))²)
  95. 141.89 s gammaloop-nextest-integration> span t{span_context=true current=subgraph=y, topo_order=1, dod=2 given=subgraph=0, topo_order=0, dod=0}
  96. 141.89 s gammaloop-nextest-integration> [2026-08-28 17:29:12.780] @approx::local_4d [{#uv, #collect, #integrated}] DEBUG : After gamma chain collection
  97. 141.89 s gammaloop-nextest-integration> field value
  98. 141.89 s gammaloop-nextest-integration> expr n-terms: 3, byte size: 1880,expr:
  99. 141.89 s gammaloop-nextest-integration> (1/2·SCALAR_COUPLING²·(2·mUVexp²-2·mass_scalar_2²)/(denom(2,q₂,mUVexp²,-mUV²+(q₂.q₂))²·denom(3,-q₂,mUVexp²,-mUV²+(q₂.q₂)))
  100. 141.89 s gammaloop-nextest-integration> -SCALAR_COUPLING²
  101. 141.89 s gammaloop-nextest-integration> ·(-1/2·(2·mUVexp²-2·mass_scalar_2²+2·(q₀.q₀))/denom(3,-q₂,mUVexp²,-mUV²+(q₂.q₂))
  102. 141.89 s gammaloop-nextest-integration> +4·(q₀.q₂)²/denom(3,-q₂,mUVexp²,-mUV²+(q₂.q₂))²
  103. 141.89 s gammaloop-nextest-integration> )/(denom(2,q₂,mUVexp²,-mUV²+(q₂.q₂))·denom(3,-q₂,mUVexp²,-mUV²+(q₂.q₂)))
  104. 141.89 s gammaloop-nextest-integration> )·q₀(αᵉ².¹)·q₀(αᵉ³.¹)·q₂(αᵉ².¹)·q₂(αᵉ³.¹)
  105. 141.89 s gammaloop-nextest-integration> -SCALAR_COUPLING²·q₀(αᵉ².¹)·q₀(αᵉ³.¹)·q₂(αᵉ².¹)·q₂(αᵉ³.¹)
  106. 141.89 s gammaloop-nextest-integration> /(denom(2,q₂,mUVexp²,-mUV²+(q₂.q₂))·denom(3,-q₂,mUVexp²,-mUV²+(q₂.q₂)))
  107. 141.89 s gammaloop-nextest-integration> +2·SCALAR_COUPLING²·(q₀.q₂)·q₀(αᵉ².¹)·q₀(αᵉ³.¹)·q₂(αᵉ².¹)·q₂(αᵉ³.¹)
  108. 141.89 s gammaloop-nextest-integration> /(denom(2,q₂,mUVexp²,-mUV²+(q₂.q₂))·denom(3,-q₂,mUVexp²,-mUV²+(q₂.q₂))²)
  109. 141.89 s gammaloop-nextest-integration> span t{span_context=true current=subgraph=y, topo_order=1, dod=2 given=subgraph=0, topo_order=0, dod=0}
  110. 141.89 s gammaloop-nextest-integration> [2026-08-28 17:29:12.782] @approx::local_4d [{#profile, #uv, #collect, #integrated, #start, #trace}] DEBUG : After gamma schoonschip
  111. 141.89 s gammaloop-nextest-integration> field value
  112. 141.89 s gammaloop-nextest-integration> expr n-terms: 3, byte size: 1631,expr:
  113. 141.89 s gammaloop-nextest-integration> (1/2·SCALAR_COUPLING²·(2·mUVexp²-2·mass_scalar_2²)/(denom(2,q₂,mUVexp²,-mUV²+(q₂.q₂))²·denom(3,-q₂,mUVexp²,-mUV²+(q₂.q₂)))
  114. 141.89 s gammaloop-nextest-integration> -SCALAR_COUPLING²
  115. 141.89 s gammaloop-nextest-integration> ·(-1/2·(2·mUVexp²-2·mass_scalar_2²+2·(q₀.q₀))/denom(3,-q₂,mUVexp²,-mUV²+(q₂.q₂))
  116. 141.89 s gammaloop-nextest-integration> +4·(q₀.q₂)²/denom(3,-q₂,mUVexp²,-mUV²+(q₂.q₂))²
  117. 141.89 s gammaloop-nextest-integration> )/(denom(2,q₂,mUVexp²,-mUV²+(q₂.q₂))·denom(3,-q₂,mUVexp²,-mUV²+(q₂.q₂)))
  118. 141.89 s gammaloop-nextest-integration> )·(q₀.q₂)²
  119. 141.89 s gammaloop-nextest-integration> -SCALAR_COUPLING²·(q₀.q₂)²/(denom(2,q₂,mUVexp²,-mUV²+(q₂.q₂))·denom(3,-q₂,mUVexp²,-mUV²+(q₂.q₂)))
  120. 141.89 s gammaloop-nextest-integration> +2·SCALAR_COUPLING²·(q₀.q₂)·(q₀.q₂)²
  121. 141.89 s gammaloop-nextest-integration> /(denom(2,q₂,mUVexp²,-mUV²+(q₂.q₂))·denom(3,-q₂,mUVexp²,-mUV²+(q₂.q₂))²)
  122. 141.89 s gammaloop-nextest-integration> span t{span_context=true current=subgraph=y, topo_order=1, dod=2 given=subgraph=0, topo_order=0, dod=0}
  123. 141.89 s gammaloop-nextest-integration> [2026-08-28 17:29:12.783] @approx::local_4d [{#profile, #uv, #collect, #integrated, #start, #trace}] DEBUG : After gamma collection
  124. 141.89 s gammaloop-nextest-integration> field value
  125. 141.89 s gammaloop-nextest-integration> expr n-terms: 1, byte size: 1347,expr:
  126. 141.89 s gammaloop-nextest-integration> SCALAR_COUPLING²
  127. 141.89 s gammaloop-nextest-integration> ·(-denom(2,q₂,mUVexp²,-mUV²+(q₂.q₂))·denom(3,-q₂,mUVexp²,-mUV²+(q₂.q₂))²
  128. 141.89 s gammaloop-nextest-integration> +1/2·(2·mUVexp²-2·mass_scalar_2²)·denom(3,-q₂,mUVexp²,-mUV²+(q₂.q₂))²
  129. 141.89 s gammaloop-nextest-integration> -(-1/2·(2·mUVexp²-2·mass_scalar_2²+2·(q₀.q₀))·denom(3,-q₂,mUVexp²,-mUV²+(q₂.q₂))+4·(q₀.q₂)²)
  130. 141.89 s gammaloop-nextest-integration> ·denom(2,q₂,mUVexp²,-mUV²+(q₂.q₂))
  131. 141.89 s gammaloop-nextest-integration> +2·(q₀.q₂)·denom(2,q₂,mUVexp²,-mUV²+(q₂.q₂))·denom(3,-q₂,mUVexp²,-mUV²+(q₂.q₂))
  132. 141.89 s gammaloop-nextest-integration> )·(q₀.q₂)²/(denom(2,q₂,mUVexp²,-mUV²+(q₂.q₂))²·denom(3,-q₂,mUVexp²,-mUV²+(q₂.q₂))³)
  133. 141.89 s gammaloop-nextest-integration> span t{span_context=true current=subgraph=y, topo_order=1, dod=2 given=subgraph=0, topo_order=0, dod=0}
  134. 141.89 s gammaloop-nextest-integration> [2026-08-28 17:29:12.784] @approx::local_4d [{#profile, #uv, #gamma, #integrated, #start, #trace, #vakint}] DEBUG : After gamma simplification
  135. 141.89 s gammaloop-nextest-integration> ... omitted 3263 more lines; see full nextest output above
  136. 141.89 s gammaloop-nextest-integration>
  137. 141.89 s gammaloop-nextest-integration> 8. gammaloop-integration-tests::uv::sunrise_scalar_1_uv
  138. 141.93 s gammaloop-nextest-integration> failure: test failure with exit code 101
  139. 141.93 s gammaloop-nextest-integration> system-out
  140. 141.93 s gammaloop-nextest-integration> running 1 test
  141. 141.93 s gammaloop-nextest-integration> test sunrise_scalar_1_uv has been running for over 60 seconds
  142. 141.93 s gammaloop-nextest-integration> +------------------+------------------------+--------------+--------+----------+----------------------------------------------------------------------------------------------------------------------+-------+
  143. 141.93 s gammaloop-nextest-integration> | case | check | graph | status | sigma | threshold | error |
  144. 141.93 s gammaloop-nextest-integration> +------------------+------------------------+--------------+--------+----------+----------------------------------------------------------------------------------------------------------------------+-------+
  145. 141.93 s gammaloop-nextest-integration> | sunrise_scalar_1 | uv_profile | - | FAIL | - | - | - |
  146. 141.93 s gammaloop-nextest-integration> +------------------+------------------------+--------------+--------+----------+----------------------------------------------------------------------------------------------------------------------+-------+
  147. 141.93 s gammaloop-nextest-integration> | sunrise_scalar_1 | m_uv.inspect | inspect | pass | - | best inspect relative delta 1.624e0 >= 1000*accuracy 1.000e-3 (accuracy=1.000e-6, exponent=+1.0, seed=1, probes=10) | - |
  148. 141.93 s gammaloop-nextest-integration> +------------------+------------------------+--------------+--------+----------+----------------------------------------------------------------------------------------------------------------------+-------+
  149. 141.93 s gammaloop-nextest-integration> | sunrise_scalar_1 | m_uv.integrated | sunrise | pass | 0.1sigma | compatible within 2sigma | - |
  150. 141.93 s gammaloop-nextest-integration> +------------------+------------------------+--------------+--------+----------+----------------------------------------------------------------------------------------------------------------------+-------+
  151. 141.93 s gammaloop-nextest-integration> | sunrise_scalar_1 | rls.inspect | inspect | pass | - | best inspect relative delta 8.682e-1 >= 1000*accuracy 1.000e-3 (accuracy=1.000e-6, exponent=+1.0, seed=1, probes=10) | - |
  152. 141.93 s gammaloop-nextest-integration> +------------------+------------------------+--------------+--------+----------+----------------------------------------------------------------------------------------------------------------------+-------+
  153. 141.93 s gammaloop-nextest-integration> | sunrise_scalar_1 | rls.integrated | sunrise | pass | 0.0sigma | compatible within 2sigma | - |
  154. 141.93 s gammaloop-nextest-integration> +------------------+------------------------+--------------+--------+----------+----------------------------------------------------------------------------------------------------------------------+-------+
  155. 141.93 s gammaloop-nextest-integration> | sunrise_scalar_1 | mu_r.inspect | inspect | pass | - | best inspect relative delta 1.752e0 >= 1000*accuracy 1.000e-3 (accuracy=1.000e-6, exponent=+1.0, seed=1, probes=10) | - |
  156. 141.93 s gammaloop-nextest-integration> +------------------+------------------------+--------------+--------+----------+----------------------------------------------------------------------------------------------------------------------+-------+
  157. 141.93 s gammaloop-nextest-integration> | sunrise_scalar_1 | integrated.relerr | integrated | pass | - | relative error 9.20% <= 10.00% | - |
  158. 141.93 s gammaloop-nextest-integration> +------------------+------------------------+--------------+--------+----------+----------------------------------------------------------------------------------------------------------------------+-------+
  159. 141.93 s gammaloop-nextest-integration> | sunrise_scalar_1 | m_uv.integrated.relerr | m_uv-shifted | pass | - | relative error 5.89% <= 10.00% | - |
  160. 141.93 s gammaloop-nextest-integration> +------------------+------------------------+--------------+--------+----------+----------------------------------------------------------------------------------------------------------------------+-------+
  161. 141.93 s gammaloop-nextest-integration> | sunrise_scalar_1 | target | - | pass | - | 2sigma | - |
  162. 141.93 s gammaloop-nextest-integration> +------------------+------------------------+--------------+--------+----------+----------------------------------------------------------------------------------------------------------------------+-------+
  163. 141.93 s gammaloop-nextest-integration> test sunrise_scalar_1_uv ... FAILED
  164. 141.93 s gammaloop-nextest-integration>
  165. 141.93 s gammaloop-nextest-integration> failures:
  166. 141.93 s gammaloop-nextest-integration>
  167. 141.93 s gammaloop-nextest-integration> failures:
  168. 141.93 s gammaloop-nextest-integration> sunrise_scalar_1_uv
  169. 141.93 s gammaloop-nextest-integration>
  170. 141.93 s gammaloop-nextest-integration> test result: FAILED. 0 passed; 1 failed; 0 ignored; 0 measured; 24 filtered out; finished in 100.86s
  171. 141.94 s gammaloop-nextest-integration> system-err
  172. 141.94 s gammaloop-nextest-integration> [2026-08-28 17:29:17.645] @gammaloop_api::se... INFO : Running command run generate
  173. 141.94 s gammaloop-nextest-integration> [2026-08-28 17:29:17.645] @gammaloop_api::se... INFO : Starting command block generate
  174. 141.94 s gammaloop-nextest-integration> [2026-08-28 17:29:17.646] @gammaloop_api::se... INFO : Running command import model scalars-default.json
  175. 141.94 s gammaloop-nextest-integration> [2026-08-28 17:29:17.646] @import::model INFO : Loading built-in JSON model scalars-default
  176. 141.94 s gammaloop-nextest-integration> [2026-08-28 17:29:17.650] @gammalooprs::model INFO : The following 2 external parameters were forced to zero by the restriction card:
  177. 141.94 s gammaloop-nextest-integration> width_scalar_1, width_scalar_2
  178. 141.94 s gammaloop-nextest-integration> [2026-08-28 17:29:17.650] @gammaloop_api::se... INFO : Running command remove processes
  179. 141.94 s gammaloop-nextest-integration> [2026-08-28 17:29:17.650] @gammaloop_api::se... INFO : Running command set global kv global.generation.uv.generate_integrated=true
  180. 141.94 s gammaloop-nextest-integration> [2026-08-28 17:29:17.651] @gammaloop_api::se... INFO : Running command import graphs ./tests/resources/graphs/scalar_sunrise.dot -p sunrise_scalar_1 -i scalar_sunrise
  181. 141.94 s gammaloop-nextest-integration> [2026-08-28 17:29:17.651] @commands::import INFO : Loading graphs from '/build/source/tests/resources/graphs/scalar_sunrise.dot'
  182. 141.94 s gammaloop-nextest-integration> [2026-08-28 17:29:17.653] @gammaloop_api::se... INFO : Running command generate existing -p sunrise_scalar_1 -i scalar_sunrise
  183. 141.94 s gammaloop-nextest-integration> [2026-08-28 17:29:17.656] @approx::local_4d [{#uv, #inspect, #integrated}] DEBUG : Rescaled momenta expanded
  184. 141.94 s gammaloop-nextest-integration> field value
  185. 141.94 s gammaloop-nextest-integration> res n-terms: 1, byte size: 611,expr:
  186. 141.94 s gammaloop-nextest-integration> 1/(denom(0,q₀/t,mass_scalar_1²,-mass_scalar_1²+(q₀.q₀)/t²)
  187. 141.94 s gammaloop-nextest-integration> ·denom(2,-q₁+q₃-q₀/t,mass_scalar_1²,
  188. 141.94 s gammaloop-nextest-integration> -mass_scalar_1²+2·(q₀.q₁)/t-2·(q₀.q₃)/t+(q₀.q₀)/t²+(q₁.q₁)
  189. 141.94 s gammaloop-nextest-integration> -2·(q₁.q₃)+(q₃.q₃)
  190. 141.94 s gammaloop-nextest-integration> ))
  191. 141.94 s gammaloop-nextest-integration> [2026-08-28 17:29:17.660] @approx::local_4d [{#uv, #inspect, #integrated}] DEBUG : Rescaled momenta expanded
  192. 141.94 s gammaloop-nextest-integration> field value
  193. 141.94 s gammaloop-nextest-integration> res n-terms: 1, byte size: 3,expr:
  194. 141.94 s gammaloop-nextest-integration> 1
  195. 141.94 s gammaloop-nextest-integration> [2026-08-28 17:29:17.660] @approx::local_4d [{#uv, #inspect, #integrated}] DEBUG : Rescaled momenta expanded
  196. 141.94 s gammaloop-nextest-integration> field value
  197. 141.94 s gammaloop-nextest-integration> res n-terms: 1, byte size: 611,expr:
  198. 141.94 s gammaloop-nextest-integration> 1/(denom(0,q₀/t,mass_scalar_1²,-mass_scalar_1²+(q₀.q₀)/t²)
  199. 141.94 s gammaloop-nextest-integration> ·denom(1,-q₂+q₃-q₀/t,mass_scalar_1²,
  200. 141.94 s gammaloop-nextest-integration> -mass_scalar_1²+2·(q₀.q₂)/t-2·(q₀.q₃)/t+(q₀.q₀)/t²+(q₂.q₂)
  201. 141.94 s gammaloop-nextest-integration> -2·(q₂.q₃)+(q₃.q₃)
  202. 141.94 s gammaloop-nextest-integration> ))
  203. 141.94 s gammaloop-nextest-integration> [2026-08-28 17:29:17.661] @approx::local_4d [{#uv, #inspect, #integrated}] DEBUG : Rescaled momenta expanded
  204. 141.94 s gammaloop-nextest-integration> field value
  205. 141.94 s gammaloop-nextest-integration> res n-terms: 1, byte size: 611,expr:
  206. 141.94 s gammaloop-nextest-integration> 1/(denom(1,q₁/t,mass_scalar_1²,-mass_scalar_1²+(q₁.q₁)/t²)
  207. 141.94 s gammaloop-nextest-integration> ·denom(2,-q₀+q₃-q₁/t,mass_scalar_1²,
  208. 141.94 s gammaloop-nextest-integration> -mass_scalar_1²+2·(q₀.q₁)/t-2·(q₁.q₃)/t+(q₁.q₁)/t²+(q₀.q₀)
  209. 141.94 s gammaloop-nextest-integration> -2·(q₀.q₃)+(q₃.q₃)
  210. 141.94 s gammaloop-nextest-integration> ))
  211. 141.94 s gammaloop-nextest-integration> [2026-08-28 17:29:17.662] @approx::local_4d [{#uv, #inspect, #integrated}] DEBUG : Rescaled momenta expanded
  212. 141.94 s gammaloop-nextest-integration> field value
  213. 141.94 s gammaloop-nextest-integration> res n-terms: 1, byte size: 777,expr:
  214. 141.94 s gammaloop-nextest-integration> 1/(denom(0,q₀/t,mass_scalar_1²,-mass_scalar_1²+(q₀.q₀)/t²)·denom(1,q₁/t,mass_scalar_1²,-mass_scalar_1²+(q₁.q₁)/t²)
  215. 141.94 s gammaloop-nextest-integration> ·denom(2,q₄-q₀/t-q₁/t,mass_scalar_1²,
  216. 141.94 s gammaloop-nextest-integration> -mass_scalar_1²-2·(q₀.q₄)/t-2·(q₁.q₄)/t+(q₀.q₀)/t²+2·(q₀.q₁)/t²
  217. 141.94 s gammaloop-nextest-integration> +(q₁.q₁)/t²+(q₄.q₄)
  218. 141.94 s gammaloop-nextest-integration> ))
  219. 141.94 s gammaloop-nextest-integration> [2026-08-28 17:29:17.669] @approx::final_integrand[{#generation, #profile, #uv, #graph, #summary}] DEBUG : Computed global numerator
  220. 141.94 s gammaloop-nextest-integration> field value
  221. 141.94 s gammaloop-nextest-integration> global_num n-terms: 1, byte size: 3,expr:
  222. 141.94 s gammaloop-nextest-integration> 1
  223. 141.94 s gammaloop-nextest-integration> span build_3d{span_context=true graph=sunrise current=subgraph=0, topo_order=0, dod=0}
  224. 141.94 s gammaloop-nextest-integration> [2026-08-28 17:29:17.670] @uv::approx [{#generation, #uv, #fourd}] DEBUG : Computing 4D
  225. 141.94 s gammaloop-nextest-integration> field value
  226. 141.94 s gammaloop-nextest-integration> simple subgraph(S_47,S_3I)*Approx(subgraph(S_3I,0)) of sunrise
  227. 141.94 s gammaloop-nextest-integration> span compute_4d{span_context=true graph=sunrise current=subgraph=3I, topo_order=1, dod=0 given=subgraph=0, topo_order=0, dod=0 reduced=SubSet { set: BitVec<usize, bitvec::order::Lsb0> { addr: 0x7fffec0184f0, head: 000000, bits: 8, capacity: 64 } [0, 0, 1, 1, 0, 0, 1, 1], id: PhantomData<linnet::half_edge::involution::Hedge> }}
  228. 141.94 s gammaloop-nextest-integration> [2026-08-28 17:29:17.674] @approx::local_4d [{#uv, #algebra, #integrated, #start}] DEBUG :
  229. 141.94 s gammaloop-nextest-integration> field value
  230. 141.94 s gammaloop-nextest-integration> integrand n-terms: 1, byte size: 217,expr:
  231. 141.94 s gammaloop-nextest-integration> 1/(denom(0,q₀,mass_scalar_1²,-mass_scalar_1²+(q₀.q₀))·denom(2,q₂,mass_scalar_1²,-mass_scalar_1²+(q₂.q₂)))
  232. 141.94 s gammaloop-nextest-integration> reduced 3I
  233. 141.94 s gammaloop-nextest-integration> span grow{span_context=true current=subgraph=3I, topo_order=1, dod=0 given=subgraph=0, topo_order=0, dod=0}
  234. 141.94 s gammaloop-nextest-integration> [2026-08-28 17:29:17.674] @approx::local_4d [{#uv, #inspect, #integrated}] DEBUG : Rescaled momenta expanded
  235. 141.94 s gammaloop-nextest-integration> field value
  236. 141.94 s gammaloop-nextest-integration> res n-terms: 1, byte size: 611,expr:
  237. 141.94 s gammaloop-nextest-integration> 1/(denom(0,q₀/t,mass_scalar_1²,-mass_scalar_1²+(q₀.q₀)/t²)
  238. 141.94 s gammaloop-nextest-integration> ·denom(2,-q₁+q₃-q₀/t,mass_scalar_1²,
  239. 141.94 s gammaloop-nextest-integration> -mass_scalar_1²+2·(q₀.q₁)/t-2·(q₀.q₃)/t+(q₀.q₀)/t²+(q₁.q₁)
  240. 141.94 s gammaloop-nextest-integration> -2·(q₁.q₃)+(q₃.q₃)
  241. 141.94 s gammaloop-nextest-integration> ))
  242. 141.94 s gammaloop-nextest-integration> span t{span_context=true current=subgraph=3I, topo_order=1, dod=0 given=subgraph=0, topo_order=0, dod=0}
  243. 141.94 s gammaloop-nextest-integration> [2026-08-28 17:29:17.674] @approx::local_4d [{#uv, #integrated, #rescaled}] DEBUG : Rescaled expanded
  244. 141.94 s gammaloop-nextest-integration> field value
  245. 141.94 s gammaloop-nextest-integration> n_loops 1
  246. 141.94 s gammaloop-nextest-integration> res n-terms: 1, byte size: 723,expr:
  247. 141.94 s gammaloop-nextest-integration> 1/(denom(0,q₀,mUVexp²+t²·mass_scalar_1²,-mUV²+t²·(-mass_scalar_1²+(q₀.q₀)/t²)+t²·mUVexp²)
  248. 141.94 s gammaloop-nextest-integration> ·denom(2,-q₀,mUVexp²+t²·mass_scalar_1²,
  249. 141.94 s gammaloop-nextest-integration> -mUV²
  250. 141.94 s gammaloop-nextest-integration> +t²
  251. 141.94 s gammaloop-nextest-integration> ·(-mass_scalar_1²+2·(q₀.q₁)/t-2·(q₀.q₃)/t+(q₀.q₀)/t²+(q₁.q₁)
  252. 141.94 s gammaloop-nextest-integration> -2·(q₁.q₃)+(q₃.q₃)
  253. 141.94 s gammaloop-nextest-integration> )
  254. 141.94 s gammaloop-nextest-integration> +t²·mUVexp²
  255. 141.94 s gammaloop-nextest-integration> ))
  256. 141.94 s gammaloop-nextest-integration> span t{span_context=true current=subgraph=3I, topo_order=1, dod=0 given=subgraph=0, topo_order=0, dod=0}
  257. 141.94 s gammaloop-nextest-integration> [2026-08-28 17:29:17.675] @approx::local_4d [{#uv, #integrated, #series}] DEBUG : Series expanded
  258. 141.94 s gammaloop-nextest-integration> field value
  259. 141.94 s gammaloop-nextest-integration> res n-terms: 1, byte size: 223,expr:
  260. 141.94 s gammaloop-nextest-integration> 1/(denom(0,q₀,mUVexp²,-mUV²+(q₀.q₀))·denom(2,-q₀,mUVexp²,-mUV²+(q₀.q₀)))
  261. 141.94 s gammaloop-nextest-integration> span t{span_context=true current=subgraph=3I, topo_order=1, dod=0 given=subgraph=0, topo_order=0, dod=0}
  262. 141.94 s gammaloop-nextest-integration> [2026-08-28 17:29:17.675] @approx::local_4d [{#uv, #integrated, #series}] DEBUG : Evaluated at t = 1
  263. 141.94 s gammaloop-nextest-integration> field value
  264. 141.94 s gammaloop-nextest-integration> res n-terms: 1, byte size: 223,expr:
  265. 141.94 s gammaloop-nextest-integration> 1/(denom(0,q₀,mUVexp²,-mUV²+(q₀.q₀))·denom(2,-q₀,mUVexp²,-mUV²+(q₀.q₀)))
  266. 141.94 s gammaloop-nextest-integration> span t{span_context=true current=subgraph=3I, topo_order=1, dod=0 given=subgraph=0, topo_order=0, dod=0}
  267. 141.94 s gammaloop-nextest-integration> [2026-08-28 17:29:17.675] @approx::local_4d [{#uv, #collect, #integrated}] DEBUG : After gamma chain collection
  268. 141.94 s gammaloop-nextest-integration> field value
  269. 141.94 s gammaloop-nextest-integration> expr n-terms: 1, byte size: 223,expr:
  270. 141.94 s gammaloop-nextest-integration> 1/(denom(0,q₀,mUVexp²,-mUV²+(q₀.q₀))·denom(2,-q₀,mUVexp²,-mUV²+(q₀.q₀)))
  271. 141.94 s gammaloop-nextest-integration> span t{span_context=true current=subgraph=3I, topo_order=1, dod=0 given=subgraph=0, topo_order=0, dod=0}
  272. 141.94 s gammaloop-nextest-integration> [2026-08-28 17:29:17.675] @approx::local_4d [{#profile, #uv, #collect, #integrated, #start, #trace}] DEBUG : After gamma schoonschip
  273. 141.94 s gammaloop-nextest-integration> field value
  274. 141.94 s gammaloop-nextest-integration> expr n-terms: 1, byte size: 223,expr:
  275. 141.94 s gammaloop-nextest-integration> 1/(denom(0,q₀,mUVexp²,-mUV²+(q₀.q₀))·denom(2,-q₀,mUVexp²,-mUV²+(q₀.q₀)))
  276. 141.94 s gammaloop-nextest-integration> span t{span_context=true current=subgraph=3I, topo_order=1, dod=0 given=subgraph=0, topo_order=0, dod=0}
  277. 141.94 s gammaloop-nextest-integration> [2026-08-28 17:29:17.675] @approx::local_4d [{#profile, #uv, #collect, #integrated, #start, #trace}] DEBUG : After gamma collection
  278. 141.94 s gammaloop-nextest-integration> field value
  279. 141.94 s gammaloop-nextest-integration> expr n-terms: 1, byte size: 223,expr:
  280. 141.94 s gammaloop-nextest-integration> 1/(denom(0,q₀,mUVexp²,-mUV²+(q₀.q₀))·denom(2,-q₀,mUVexp²,-mUV²+(q₀.q₀)))
  281. 141.94 s gammaloop-nextest-integration> span t{span_context=true current=subgraph=3I, topo_order=1, dod=0 given=subgraph=0, topo_order=0, dod=0}
  282. 141.94 s gammaloop-nextest-integration> [2026-08-28 17:29:17.676] @approx::local_4d [{#profile, #uv, #gamma, #integrated, #start, #trace, #vakint}] DEBUG : After gamma simplification
  283. 141.94 s gammaloop-nextest-integration> field value
  284. 141.94 s gammaloop-nextest-integration> expr n-terms: 1, byte size: 223,expr:
  285. 141.94 s gammaloop-nextest-integration> 1/(denom(0,q₀,mUVexp²,-mUV²+(q₀.q₀))·denom(2,-q₀,mUVexp²,-mUV²+(q₀.q₀)))
  286. 141.94 s gammaloop-nextest-integration> span t{span_context=true current=subgraph=3I, topo_order=1, dod=0 given=subgraph=0, topo_order=0, dod=0}
  287. 141.94 s gammaloop-nextest-integration> [2026-08-28 17:29:17.676] @approx::local_4d [{#profile, #uv, #integrated, #schoonschip, #start, #trace, #vakint}] DEBUG : After Schoonschip net
  288. 141.94 s gammaloop-nextest-integration> field value
  289. 141.94 s gammaloop-nextest-integration> expr n-terms: 1, byte size: 223,expr:
  290. 141.94 s gammaloop-nextest-integration> 1/(denom(0,q₀,mUVexp²,-mUV²+(q₀.q₀))·denom(2,-q₀,mUVexp²,-mUV²+(q₀.q₀)))
  291. 141.94 s gammaloop-nextest-integration> ... omitted 20095 more lines; see full nextest output above
  292. 141.94 s gammaloop-nextest-integration>
  293. 141.94 s gammaloop-nextest-integration> 9. gammaloop-integration-tests::uv::se1l_uv
  294. 141.94 s gammaloop-nextest-integration> failure: test failure with exit code 101
  295. 141.94 s gammaloop-nextest-integration> system-out
  296. 141.94 s gammaloop-nextest-integration> running 1 test
  297. 141.94 s gammaloop-nextest-integration> test se1l_uv has been running for over 60 seconds
  298. 141.94 s gammaloop-nextest-integration> +------+-----------------+---------+--------+----------+-----------------------------------------------------------------------------------------------------------------------+-------+
  299. 141.94 s gammaloop-nextest-integration> | case | check | graph | status | sigma | threshold | error |
  300. 141.94 s gammaloop-nextest-integration> +------+-----------------+---------+--------+----------+-----------------------------------------------------------------------------------------------------------------------+-------+
  301. 141.94 s gammaloop-nextest-integration> | se1l | uv_profile | - | FAIL | - | - | - |
  302. 141.94 s gammaloop-nextest-integration> +------+-----------------+---------+--------+----------+-----------------------------------------------------------------------------------------------------------------------+-------+
  303. 141.94 s gammaloop-nextest-integration> | se1l | m_uv.inspect | inspect | pass | - | best inspect relative delta 1.097e-1 >= 1000*accuracy 1.000e-7 (accuracy=1.000e-10, exponent=+2.0, seed=1, probes=10) | - |
  304. 141.94 s gammaloop-nextest-integration> +------+-----------------+---------+--------+----------+-----------------------------------------------------------------------------------------------------------------------+-------+
  305. 141.94 s gammaloop-nextest-integration> | se1l | m_uv.integrated | se1l | pass | 0.1sigma | compatible within 2sigma | - |
  306. 141.94 s gammaloop-nextest-integration> +------+-----------------+---------+--------+----------+-----------------------------------------------------------------------------------------------------------------------+-------+
  307. 141.94 s gammaloop-nextest-integration> | se1l | rls.inspect | inspect | pass | - | best inspect relative delta 4.499e-2 >= 1000*accuracy 1.000e-7 (accuracy=1.000e-10, exponent=+2.0, seed=1, probes=10) | - |
  308. 141.94 s gammaloop-nextest-integration> +------+-----------------+---------+--------+----------+-----------------------------------------------------------------------------------------------------------------------+-------+
  309. 141.94 s gammaloop-nextest-integration> | se1l | rls.integrated | se1l | pass | 0.0sigma | compatible within 2sigma | - |
  310. 141.94 s gammaloop-nextest-integration> +------+-----------------+---------+--------+----------+-----------------------------------------------------------------------------------------------------------------------+-------+
  311. 141.94 s gammaloop-nextest-integration> | se1l | mu_r.inspect | inspect | pass | - | best inspect relative delta 1.424e-1 >= 1000*accuracy 1.000e-7 (accuracy=1.000e-10, exponent=+2.0, seed=1, probes=10) | - |
  312. 141.94 s gammaloop-nextest-integration> +------+-----------------+---------+--------+----------+-----------------------------------------------------------------------------------------------------------------------+-------+
  313. 141.94 s gammaloop-nextest-integration> | se1l | target | - | pass | - | 2sigma | - |
  314. 141.94 s gammaloop-nextest-integration> +------+-----------------+---------+--------+----------+-----------------------------------------------------------------------------------------------------------------------+-------+
  315. 141.94 s gammaloop-nextest-integration> test se1l_uv ... FAILED
  316. 141.94 s gammaloop-nextest-integration>
  317. 141.94 s gammaloop-nextest-integration> failures:
  318. 141.94 s gammaloop-nextest-integration>
  319. 141.94 s gammaloop-nextest-integration> failures:
  320. 141.94 s gammaloop-nextest-integration> se1l_uv
  321. 141.94 s gammaloop-nextest-integration>
  322. 141.94 s gammaloop-nextest-integration> test result: FAILED. 0 passed; 1 failed; 0 ignored; 0 measured; 24 filtered out; finished in 110.75s
  323. 141.94 s gammaloop-nextest-integration> system-err
  324. 141.94 s gammaloop-nextest-integration> [2026-08-28 17:29:17.359] @gammaloop_api::se... INFO : Running command run generate
  325. 141.94 s gammaloop-nextest-integration> [2026-08-28 17:29:17.359] @gammaloop_api::se... INFO : Starting command block generate
  326. 141.94 s gammaloop-nextest-integration> [2026-08-28 17:29:17.360] @gammaloop_api::se... INFO : Running command import model sm-default
  327. 141.94 s gammaloop-nextest-integration> [2026-08-28 17:29:17.360] @import::model INFO : Loading built-in JSON model sm-default
  328. 141.94 s gammaloop-nextest-integration> [2026-08-28 17:29:17.404] @gammalooprs::model INFO : The following 11 external parameters were forced to zero by the restriction card:
  329. 141.94 s gammaloop-nextest-integration> lamWS, AWS, rhoWS, etaWS, ymc, yme, ymm, MC, Me, MM, WTau
  330. 141.94 s gammaloop-nextest-integration> [2026-08-28 17:29:17.404] @gammalooprs::model INFO : The following 34 vertex rules were removed by the restriction card:
  331. 141.94 s gammaloop-nextest-integration> V_82 -> (c~, d, G+) | V_83 -> (t~, d, G+) | V_84 -> (c~, s, G+) | V_85 -> (t~, s, G+) | V_86 -> (u~, b, G+) | V_87 -> (c~, b, G+) | V_90 -> (c~, d, W+) | V_91 -> (t~, d, W+) | V_92 -> (u~, s, W+) | V_94 -> (t~, s, W+) | V_95 -> (u~, b, W+) | V_96 -> (c~, b, W+) | V_101 -> (e+, e-, G0) | V_102 -> (mu+, mu-, G0) | V_104 -> (e+, e-, H) | V_105 -> (mu+, mu-, H) | V_110 -> (ve~, e-, G+) | V_111 -> (vm~, mu-, G+) | V_116 -> (b~, u, G-) | V_117 -> (d~, c, G-) | V_118 -> (s~, c, G-) | V_119 -> (b~, c, G-) | V_120 -> (d~, t, G-) | V_121 -> (s~, t, G-) | V_124 -> (s~, u, W-) | V_125 -> (b~, u, W-) | V_126 -> (d~, c, W-) | V_128 -> (b~, c, W-) | V_129 -> (d~, t, W-) | V_130 -> (s~, t, W-) | V_138 -> (c~, c, G0) | V_140 -> (c~, c, H) | V_145 -> (e+, ve, G-) | V_146 -> (mu+, vm, G-)
  332. 141.94 s gammaloop-nextest-integration> [2026-08-28 17:29:17.404] @gammalooprs::model INFO : The following 36 couplings were removed by the restriction card:
  333. 141.94 s gammaloop-nextest-integration> GC_13, GC_14, GC_16, GC_17, GC_18, GC_19, GC_20, GC_22, GC_23, GC_24, GC_25, GC_26, GC_28, GC_29, GC_42, GC_43, GC_44, GC_46, GC_47, GC_48, GC_84, GC_85, GC_86, GC_87, GC_88, GC_89, GC_90, GC_91, GC_92, GC_93, GC_101, GC_102, GC_103, GC_105, GC_106, GC_107
  334. 141.94 s gammaloop-nextest-integration> [2026-08-28 17:29:17.404] @gammaloop_api::se... INFO : Running command remove processes
  335. 141.94 s gammaloop-nextest-integration> [2026-08-28 17:29:17.404] @gammaloop_api::se... INFO : Running command set global kv global.generation.uv.generate_integrated=true
  336. 141.94 s gammaloop-nextest-integration> [2026-08-28 17:29:17.405] @gammaloop_api::se... INFO : Running command import graphs ./tests/resources/graphs/uv_tests/se1l.dot -p se1l -i se1l
  337. 141.94 s gammaloop-nextest-integration> [2026-08-28 17:29:17.405] @commands::import INFO : Loading graphs from '/build/source/tests/resources/graphs/uv_tests/se1l.dot'
  338. 141.94 s gammaloop-nextest-integration> [2026-08-28 17:29:17.410] @gammaloop_api::se... INFO : Running command generate existing -p se1l -i se1l
  339. 141.94 s gammaloop-nextest-integration> [2026-08-28 17:29:18.478] @commands::generate INFO :
  340. 141.94 s gammaloop-nextest-integration> Integrand generation summary
  341. 141.94 s gammaloop-nextest-integration> peak RAM 75.58 MiB | cores 1
  342. 141.94 s gammaloop-nextest-integration> ╭───────────┬───────┬─────────┬─────────────┬─────────────┬────────────────┬─────────────╮
  343. 141.94 s gammaloop-nextest-integration> │ integrand │ graph │ # evals │ expr build │ spenso │ symbolica eval │ compile │
  344. 141.94 s gammaloop-nextest-integration> ├───────────┼───────┼─────────┼─────────────┼─────────────┼────────────────┼─────────────┤
  345. 141.94 s gammaloop-nextest-integration> │ se1l │ se1l │ 5 │ 940ms (90%) │ 44ms (4.3%) │ 55ms (5.3%) │ 0ms (0.00%) │
  346. 141.94 s gammaloop-nextest-integration> ├───────────┼───────┼─────────┼─────────────┼─────────────┼────────────────┼─────────────┤
  347. 141.94 s gammaloop-nextest-integration> │ Total │ │ 5 │ 940ms (90%) │ 44ms (4.3%) │ 55ms (5.3%) │ 0ms (0.00%) │
  348. 141.94 s gammaloop-nextest-integration> ╰───────────┴───────┴─────────┴─────────────┴─────────────┴────────────────┴─────────────╯
  349. 141.94 s gammaloop-nextest-integration> [2026-08-28 17:29:18.479] @gammaloop_api::se... INFO : Running command set process -p se1l -i se1l kv general.m_uv=0.2
  350. 141.94 s gammaloop-nextest-integration> [2026-08-28 17:29:18.480] @gammaloop_api::se... INFO : Running command set process -p se1l -i se1l kv general.mu_r=0.2
  351. 141.94 s gammaloop-nextest-integration> [2026-08-28 17:29:18.480] @gammaloop_api::se... INFO : Running command set process -p se1l -i se1l kv general.renormalization_localization_scale=0.2
  352. 141.94 s gammaloop-nextest-integration> [2026-08-28 17:29:18.481] @gammaloop_api::se... INFO : Running command duplicate integrand -p se1l -i se1l --output_process_name se1l --output_integrand_name se1l_muv_shifted
  353. 141.94 s gammaloop-nextest-integration> [2026-08-28 17:29:18.483] @gammaloop_api::se... INFO : Running command set process -p se1l -i se1l_muv_shifted kv general.m_uv=0.5
  354. 141.94 s gammaloop-nextest-integration> [2026-08-28 17:29:18.483] @gammaloop_api::se... INFO : Running command duplicate integrand -p se1l -i se1l --output_process_name se1l --output_integrand_name se1l_rls_shifted
  355. 141.94 s gammaloop-nextest-integration> [2026-08-28 17:29:18.485] @gammaloop_api::se... INFO : Running command set process -p se1l -i se1l_rls_shifted kv general.renormalization_localization_scale=1
  356. 141.94 s gammaloop-nextest-integration> [2026-08-28 17:29:18.486] @gammaloop_api::se... INFO : Running command duplicate integrand -p se1l -i se1l --output_process_name se1l --output_integrand_name se1l_mur_shifted
  357. 141.94 s gammaloop-nextest-integration> [2026-08-28 17:29:18.488] @gammaloop_api::se... INFO : Running command set process -p se1l -i se1l_mur_shifted kv general.mu_r=0.8
  358. 141.94 s gammaloop-nextest-integration> [2026-08-28 17:29:18.493] @process::amplitude WARNING : External state 0 ('g', PDG 21, helicity +) is off shell: p^2 = +2.5e5, expected m^2 = +0e0 (|Δ| = +2.5e5). Fixed-helicity spinor/vector/tensor external states may be ill-defined at this kinematic point.
  359. 141.94 s gammaloop-nextest-integration> field value
  360. 141.94 s gammaloop-nextest-integration> span warm_up{integrand.name=se1l}
  361. 141.94 s gammaloop-nextest-integration> [2026-08-28 17:29:18.493] @process::amplitude WARNING : External state 1 ('g', PDG 21, helicity -) is off shell: p^2 = +2.5e5, expected m^2 = +0e0 (|Δ| = +2.5e5). Fixed-helicity spinor/vector/tensor external states may be ill-defined at this kinematic point.
  362. 141.94 s gammaloop-nextest-integration> field value
  363. 141.94 s gammaloop-nextest-integration> span warm_up{integrand.name=se1l}
  364. 141.94 s gammaloop-nextest-integration> [2026-08-28 17:29:18.493] @process::amplitude INFO : Input is above threshold: 1 existing threshold E-surfaces across 1/1 graph groups
  365. 141.94 s gammaloop-nextest-integration> field value
  366. 141.94 s gammaloop-nextest-integration> existing_esurfaces 1
  367. 141.94 s gammaloop-nextest-integration> group_count 1
  368. 141.94 s gammaloop-nextest-integration> groups_above_threshold 1
  369. 141.94 s gammaloop-nextest-integration> integrand se1l
  370. 141.94 s gammaloop-nextest-integration> span warm_up{integrand.name=se1l}
  371. 141.94 s gammaloop-nextest-integration> threshold_status above threshold
  372. 141.94 s gammaloop-nextest-integration> [2026-08-28 17:29:18.493] @process::amplitude INFO : overlap structure of group 0: [1: [0(2,3)]]
  373. 141.94 s gammaloop-nextest-integration> field value
  374. 141.94 s gammaloop-nextest-integration> span warm_up{integrand.name=se1l}
  375. 141.94 s gammaloop-nextest-integration> [2026-08-28 17:29:18.786] @commands::profile INFO :
  376. 141.94 s gammaloop-nextest-integration> ╭───────┬──────┬──────────┬───────┬─────┬──────────┬───────────╮
  377. 141.94 s gammaloop-nextest-integration> │ fixed │ → ∞ │ slope │ r2 │ DOD │ bare DOD │ inspect │
  378. 141.94 s gammaloop-nextest-integration> ├───────┼──────┼──────────┼───────┼─────┼──────────┼───────────┤
  379. 141.94 s gammaloop-nextest-integration> │ {} │ {e3} │ 1.639236 │ 0.904 │ 2 │ 2 │ arb retry │
  380. 141.94 s gammaloop-nextest-integration> │ {} │ {e2} │ 1.698834 │ 0.902 │ 2 │ 2 │ arb retry │
  381. 141.94 s gammaloop-nextest-integration> ╰───────┴──────┴──────────┴───────┴─────┴──────────┴───────────╯
  382. 141.94 s gammaloop-nextest-integration> [2026-08-28 17:29:18.786] @commands::profile INFO :
  383. 141.94 s gammaloop-nextest-integration> ╭───────┬──────┬─────────────┬──────────┬───────┬─────┬──────────┬───────────╮
  384. 141.94 s gammaloop-nextest-integration> │ fixed │ → ∞ │ orientation │ slope │ r2 │ DOD │ bare DOD │ inspect │
  385. 141.94 s gammaloop-nextest-integration> ├───────┼──────┼─────────────┼──────────┼───────┼─────┼──────────┼───────────┤
  386. 141.94 s gammaloop-nextest-integration> │ {} │ {e3} │ 00-+ │ 0.343429 │ 0.145 │ 0 │ 2 │ arb retry │
  387. 141.94 s gammaloop-nextest-integration> │ {} │ {e3} │ 00+- │ 0.342577 │ 0.135 │ 0 │ 2 │ arb retry │
  388. 141.94 s gammaloop-nextest-integration> │ {} │ {e2} │ 00-+ │ 0.385975 │ 0.161 │ 0 │ 2 │ arb retry │
  389. 141.94 s gammaloop-nextest-integration> │ {} │ {e2} │ 00+- │ 0.384920 │ 0.192 │ 0 │ 2 │ arb retry │
  390. 141.94 s gammaloop-nextest-integration> ╰───────┴──────┴─────────────┴──────────┴───────┴─────┴──────────┴───────────╯
  391. 141.94 s gammaloop-nextest-integration> [2026-08-28 17:29:18.787] @gammaloop_api::se... INFO : Running command set process kv integrator.target_relative_accuracy=0.001 integrator.n_increase=0 integrator.n_start=50000 integrator.n_max=400000 integrator.seed=1337
  392. 141.94 s gammaloop-nextest-integration> [2026-08-28 17:29:18.787] @commands::integrate INFO : Created workspace directory at /build/source/tests/artifacts/se1l/integration_workspace_se1l
  393. 141.94 s gammaloop-nextest-integration> [2026-08-28 17:29:18.809] @commands::integrate INFO : No integration state found, starting new integration
  394. 141.94 s gammaloop-nextest-integration> [2026-08-28 17:29:18.809] @commands::integrate INFO : Gammaloop now integrates se1l@se1l, se1l@se1l_muv_shifted, se1l@se1l_rls_shifted
  395. 141.94 s gammaloop-nextest-integration> [2026-08-28 17:29:18.809] @process::amplitude WARNING : External state 0 ('g', PDG 21, helicity +) is off shell: p^2 = +2.5e5, expected m^2 = +0e0 (|Δ| = +2.5e5). Fixed-helicity spinor/vector/tensor external states may be ill-defined at this kinematic point.
  396. 141.94 s gammaloop-nextest-integration> field value
  397. 141.94 s gammaloop-nextest-integration> span warm_up{integrand.name=se1l}
  398. 141.94 s gammaloop-nextest-integration> [2026-08-28 17:29:18.809] @process::amplitude WARNING : External state 1 ('g', PDG 21, helicity -) is off shell: p^2 = +2.5e5, expected m^2 = +0e0 (|Δ| = +2.5e5). Fixed-helicity spinor/vector/tensor external states may be ill-defined at this kinematic point.
  399. 141.94 s gammaloop-nextest-integration> field value
  400. 141.94 s gammaloop-nextest-integration> span warm_up{integrand.name=se1l}
  401. 141.94 s gammaloop-nextest-integration> [2026-08-28 17:29:18.809] @process::amplitude INFO : Input is above threshold: 1 existing threshold E-surfaces across 1/1 graph groups
  402. 141.94 s gammaloop-nextest-integration> field value
  403. 141.94 s gammaloop-nextest-integration> existing_esurfaces 1
  404. 141.94 s gammaloop-nextest-integration> group_count 1
  405. 141.94 s gammaloop-nextest-integration> groups_above_threshold 1
  406. 141.94 s gammaloop-nextest-integration> integrand se1l
  407. 141.94 s gammaloop-nextest-integration> span warm_up{integrand.name=se1l}
  408. 141.94 s gammaloop-nextest-integration> threshold_status above threshold
  409. 141.94 s gammaloop-nextest-integration> [2026-08-28 17:29:18.809] @process::amplitude INFO : overlap structure of group 0: [1: [0(2,3)]]
  410. 141.94 s gammaloop-nextest-integration> field value
  411. 141.94 s gammaloop-nextest-integration> span warm_up{integrand.name=se1l}
  412. 141.94 s gammaloop-nextest-integration> [2026-08-28 17:29:18.810] @process::amplitude WARNING : External state 0 ('g', PDG 21, helicity +) is off shell: p^2 = +2.5e5, expected m^2 = +0e0 (|Δ| = +2.5e5). Fixed-helicity spinor/vector/tensor external states may be ill-defined at this kinematic point.
  413. 141.94 s gammaloop-nextest-integration> field value
  414. 141.94 s gammaloop-nextest-integration> span warm_up{integrand.name=se1l_muv_shifted}
  415. 141.94 s gammaloop-nextest-integration> [2026-08-28 17:29:18.810] @process::amplitude WARNING : External state 1 ('g', PDG 21, helicity -) is off shell: p^2 = +2.5e5, expected m^2 = +0e0 (|Δ| = +2.5e5). Fixed-helicity spinor/vector/tensor external states may be ill-defined at this kinematic point.
  416. 141.94 s gammaloop-nextest-integration> field value
  417. 141.94 s gammaloop-nextest-integration> span warm_up{integrand.name=se1l_muv_shifted}
  418. 141.94 s gammaloop-nextest-integration> [2026-08-28 17:29:18.810] @process::amplitude INFO : Input is above threshold: 1 existing threshold E-surfaces across 1/1 graph groups
  419. 141.94 s gammaloop-nextest-integration> field value
  420. 141.94 s gammaloop-nextest-integration> existing_esurfaces 1
  421. 141.94 s gammaloop-nextest-integration> group_count 1
  422. 141.94 s gammaloop-nextest-integration> groups_above_threshold 1
  423. 141.94 s gammaloop-nextest-integration> integrand se1l_muv_shifted
  424. 141.94 s gammaloop-nextest-integration> span warm_up{integrand.name=se1l_muv_shifted}
  425. 141.94 s gammaloop-nextest-integration> threshold_status above threshold
  426. 141.94 s gammaloop-nextest-integration> [2026-08-28 17:29:18.810] @process::amplitude INFO : overlap structure of group 0: [1: [0(2,3)]]
  427. 141.94 s gammaloop-nextest-integration> field value
  428. 141.94 s gammaloop-nextest-integration> span warm_up{integrand.name=se1l_muv_shifted}
  429. 141.94 s gammaloop-nextest-integration> [2026-08-28 17:29:18.812] @process::amplitude WARNING : External state 0 ('g', PDG 21, helicity +) is off shell: p^2 = +2.5e5, expected m^2 = +0e0 (|Δ| = +2.5e5). Fixed-helicity spinor/vector/tensor external states may be ill-defined at this kinematic point.
  430. 141.94 s gammaloop-nextest-integration> field value
  431. 141.94 s gammaloop-nextest-integration> span warm_up{integrand.name=se1l_rls_shifted}
  432. 141.94 s gammaloop-nextest-integration> [2026-08-28 17:29:18.812] @process::amplitude WARNING : External state 1 ('g', PDG 21, helicity -) is off shell: p^2 = +2.5e5, expected m^2 = +0e0 (|Δ| = +2.5e5). Fixed-helicity spinor/vector/tensor external states may be ill-defined at this kinematic point.
  433. 141.94 s gammaloop-nextest-integration> field value
  434. 141.94 s gammaloop-nextest-integration> span warm_up{integrand.name=se1l_rls_shifted}
  435. 141.94 s gammaloop-nextest-integration> [2026-08-28 17:29:18.812] @process::amplitude INFO : Input is above threshold: 1 existing threshold E-surfaces across 1/1 graph groups
  436. 141.94 s gammaloop-nextest-integration> field value
  437. 141.94 s gammaloop-nextest-integration> existing_esurfaces 1
  438. 141.94 s gammaloop-nextest-integration> group_count 1
  439. 141.94 s gammaloop-nextest-integration> groups_above_threshold 1
  440. 141.94 s gammaloop-nextest-integration> integrand se1l_rls_shifted
  441. 141.94 s gammaloop-nextest-integration> span warm_up{integrand.name=se1l_rls_shifted}
  442. 141.94 s gammaloop-nextest-integration> threshold_status above threshold
  443. 141.94 s gammaloop-nextest-integration> ... omitted 1410 more lines; see full nextest output above
  444. 141.94 s gammaloop-nextest-integration> =========================================
  445. 142.37 s [0 built (1 failed), 0.0error: Cannot build '/nix/store/5lvckp7qh3dqs2nqf61qj4kz6kj46p4q-gammaloop-nextest-integration.drv'.
  446. 142.37 s Reason: builder failed with exit code 100.
  447. 142.37 s Output paths:
  448. 142.37 s /nix/store/q9ndadp0vb7l2ihf07rjiriv26fb03g2-gammaloop-nextest-integration
  449. 142.37 s Last 2048 log lines:
  450. 142.37 s > span warm_up{integrand.name=se1l_muv_shifted}
  451. 142.37 s > threshold_status above threshold
  452. 142.37 s > [2026-08-28 17:31:07.771] @process::amplitude INFO : overlap structure of group 0: [1: [0(2,3)]]
  453. 142.37 s > field value
  454. 142.37 s > span warm_up{integrand.name=se1l_muv_shifted}
  455. 142.37 s > [2026-08-28 17:31:07.775] @process::amplitude WARNING : External state 0 ('g', PDG 21, helicity +) is off shell: p^2 = +2.5e5, expected m^2 = +0e0 (|Δ| = +2.5e5). Fixed-helicity spinor/vector/tensor external states may be ill-defined at this kinematic point.
  456. 142.37 s > field value
  457. 142.37 s > span warm_up{integrand.name=se1l}
  458. 142.37 s > [2026-08-28 17:31:07.775] @process::amplitude WARNING : External state 1 ('g', PDG 21, helicity -) is off shell: p^2 = +2.5e5, expected m^2 = +0e0 (|Δ| = +2.5e5). Fixed-helicity spinor/vector/tensor external states may be ill-defined at this kinematic point.
  459. 142.37 s > field value
  460. 142.37 s > span warm_up{integrand.name=se1l}
  461. 142.37 s > [2026-08-28 17:31:07.775] @process::amplitude INFO : Input is above threshold: 1 existing threshold E-surfaces across 1/1 graph groups
  462. 142.37 s > field value
  463. 142.37 s > existing_esurfaces 1
  464. 142.37 s > group_count 1
  465. 142.37 s > groups_above_threshold 1
  466. 142.37 s > integrand se1l
  467. 142.37 s > span warm_up{integrand.name=se1l}
  468. 142.37 s > threshold_status above threshold
  469. 142.37 s > [2026-08-28 17:31:07.775] @process::amplitude INFO : overlap structure of group 0: [1: [0(2,3)]]
  470. 142.37 s > field value
  471. 142.37 s > span warm_up{integrand.name=se1l}
  472. 142.37 s > [2026-08-28 17:31:07.780] @process::amplitude WARNING : External state 0 ('g', PDG 21, helicity +) is off shell: p^2 = +2.5e5, expected m^2 = +0e0 (|Δ| = +2.5e5). Fixed-helicity spinor/vector/tensor external states may be ill-defined at this kinematic point.
  473. 142.37 s > field value
  474. 142.37 s > span warm_up{integrand.name=se1l_muv_shifted}
  475. 142.37 s > [2026-08-28 17:31:07.780] @process::amplitude WARNING : External state 1 ('g', PDG 21, helicity -) is off shell: p^2 = +2.5e5, expected m^2 = +0e0 (|Δ| = +2.5e5). Fixed-helicity spinor/vector/tensor external states may be ill-defined at this kinematic point.
  476. 142.37 s > field value
  477. 142.37 s > span warm_up{integrand.name=se1l_muv_shifted}
  478. 142.37 s > [2026-08-28 17:31:07.780] @process::amplitude INFO : Input is above threshold: 1 existing threshold E-surfaces across 1/1 graph groups
  479. 142.37 s > field value
  480. 142.37 s > existing_esurfaces 1
  481. 142.37 s > group_count 1
  482. 142.37 s > groups_above_threshold 1
  483. 142.37 s > integrand se1l_muv_shifted
  484. 142.37 s > span warm_up{integrand.name=se1l_muv_shifted}
  485. 142.37 s > threshold_status above threshold
  486. 142.37 s > [2026-08-28 17:31:07.780] @process::amplitude INFO : overlap structure of group 0: [1: [0(2,3)]]
  487. 142.37 s > field value
  488. 142.37 s > span warm_up{integrand.name=se1l_muv_shifted}
  489. 142.37 s > [2026-08-28 17:31:07.784] @process::amplitude WARNING : External state 0 ('g', PDG 21, helicity +) is off shell: p^2 = +2.5e5, expected m^2 = +0e0 (|Δ| = +2.5e5). Fixed-helicity spinor/vector/tensor external states may be ill-defined at this kinematic point.
  490. 142.37 s > field value
  491. 142.37 s > span warm_up{integrand.name=se1l}
  492. 142.37 s > [2026-08-28 17:31:07.784] @process::amplitude WARNING : External state 1 ('g', PDG 21, helicity -) is off shell: p^2 = +2.5e5, expected m^2 = +0e0 (|Δ| = +2.5e5). Fixed-helicity spinor/vector/tensor external states may be ill-defined at this kinematic point.
  493. 142.37 s > field value
  494. 142.37 s > span warm_up{integrand.name=se1l}
  495. 142.37 s > [2026-08-28 17:31:07.784] @process::amplitude INFO : Input is above threshold: 1 existing threshold E-surfaces across 1/1 graph groups
  496. 142.37 s > field value
  497. 142.37 s > existing_esurfaces 1
  498. 142.37 s > group_count 1
  499. 142.37 s > groups_above_threshold 1
  500. 142.37 s > integrand se1l
  501. 142.37 s > span warm_up{integrand.name=se1l}
  502. 142.37 s > threshold_status above threshold
  503. 142.37 s > [2026-08-28 17:31:07.784] @process::amplitude INFO : overlap structure of group 0: [1: [0(2,3)]]
  504. 142.37 s > field value
  505. 142.37 s > span warm_up{integrand.name=se1l}
  506. 142.37 s > [2026-08-28 17:31:07.789] @process::amplitude WARNING : External state 0 ('g', PDG 21, helicity +) is off shell: p^2 = +2.5e5, expected m^2 = +0e0 (|Δ| = +2.5e5). Fixed-helicity spinor/vector/tensor external states may be ill-defined at this kinematic point.
  507. 142.37 s > field value
  508. 142.37 s > span warm_up{integrand.name=se1l_muv_shifted}
  509. 142.37 s > [2026-08-28 17:31:07.789] @process::amplitude WARNING : External state 1 ('g', PDG 21, helicity -) is off shell: p^2 = +2.5e5, expected m^2 = +0e0 (|Δ| = +2.5e5). Fixed-helicity spinor/vector/tensor external states may be ill-defined at this kinematic point.
  510. 142.37 s > field value
  511. 142.37 s > span warm_up{integrand.name=se1l_muv_shifted}
  512. 142.37 s > [2026-08-28 17:31:07.789] @process::amplitude INFO : Input is above threshold: 1 existing threshold E-surfaces across 1/1 graph groups
  513. 142.37 s > field value
  514. 142.37 s > existing_esurfaces 1
  515. 142.37 s > group_count 1
  516. 142.37 s > groups_above_threshold 1
  517. 142.37 s > integrand se1l_muv_shifted
  518. 142.37 s > span warm_up{integrand.name=se1l_muv_shifted}
  519. 142.37 s > threshold_status above threshold
  520. 142.37 s > [2026-08-28 17:31:07.790] @process::amplitude INFO : overlap structure of group 0: [1: [0(2,3)]]
  521. 142.37 s > field value
  522. 142.37 s > span warm_up{integrand.name=se1l_muv_shifted}
  523. 142.37 s > [2026-08-28 17:31:07.795] @process::amplitude WARNING : External state 0 ('g', PDG 21, helicity +) is off shell: p^2 = +2.5e5, expected m^2 = +0e0 (|Δ| = +2.5e5). Fixed-helicity spinor/vector/tensor external states may be ill-defined at this kinematic point.
  524. 142.37 s > field value
  525. 142.37 s > span warm_up{integrand.name=se1l}
  526. 142.37 s > [2026-08-28 17:31:07.795] @process::amplitude WARNING : External state 1 ('g', PDG 21, helicity -) is off shell: p^2 = +2.5e5, expected m^2 = +0e0 (|Δ| = +2.5e5). Fixed-helicity spinor/vector/tensor external states may be ill-defined at this kinematic point.
  527. 142.37 s > field value
  528. 142.37 s > span warm_up{integrand.name=se1l}
  529. 142.37 s > [2026-08-28 17:31:07.795] @process::amplitude INFO : Input is above threshold: 1 existing threshold E-surfaces across 1/1 graph groups
  530. 142.37 s > field value
  531. 142.37 s > existing_esurfaces 1
  532. 142.37 s > group_count 1
  533. 142.37 s > groups_above_threshold 1
  534. 142.37 s > integrand se1l
  535. 142.37 s > span warm_up{integrand.name=se1l}
  536. 142.37 s > threshold_status above threshold
  537. 142.37 s > [2026-08-28 17:31:07.795] @process::amplitude INFO : overlap structure of group 0: [1: [0(2,3)]]
  538. 142.37 s > field value
  539. 142.37 s > span warm_up{integrand.name=se1l}
  540. 142.37 s > [2026-08-28 17:31:07.801] @process::amplitude WARNING : External state 0 ('g', PDG 21, helicity +) is off shell: p^2 = +2.5e5, expected m^2 = +0e0 (|Δ| = +2.5e5). Fixed-helicity spinor/vector/tensor external states may be ill-defined at this kinematic point.
  541. 142.37 s > field value
  542. 142.37 s > span warm_up{integrand.name=se1l_muv_shifted}
  543. 142.37 s > [2026-08-28 17:31:07.801] @process::amplitude WARNING : External state 1 ('g', PDG 21, helicity -) is off shell: p^2 = +2.5e5, expected m^2 = +0e0 (|Δ| = +2.5e5). Fixed-helicity spinor/vector/tensor external states may be ill-defined at this kinematic point.
  544. 142.37 s > field value
  545. 142.37 s > span warm_up{integrand.name=se1l_muv_shifted}
  546. 142.37 s > [2026-08-28 17:31:07.801] @process::amplitude INFO : Input is above threshold: 1 existing threshold E-surfaces across 1/1 graph groups
  547. 142.37 s > field value
  548. 142.37 s > existing_esurfaces 1
  549. 142.37 s > group_count 1
  550. 142.37 s > groups_above_threshold 1
  551. 142.37 s > integrand se1l_muv_shifted
  552. 142.37 s > span warm_up{integrand.name=se1l_muv_shifted}
  553. 142.37 s > threshold_status above threshold
  554. 142.37 s > [2026-08-28 17:31:07.801] @process::amplitude INFO : overlap structure of group 0: [1: [0(2,3)]]
  555. 142.37 s > field value
  556. 142.37 s > span warm_up{integrand.name=se1l_muv_shifted}
  557. 142.37 s > [2026-08-28 17:31:07.805] @process::amplitude WARNING : External state 0 ('g', PDG 21, helicity +) is off shell: p^2 = +2.5e5, expected m^2 = +0e0 (|Δ| = +2.5e5). Fixed-helicity spinor/vector/tensor external states may be ill-defined at this kinematic point.
  558. 142.37 s > field value
  559. 142.37 s > span warm_up{integrand.name=se1l}
  560. 142.37 s > [2026-08-28 17:31:07.806] @process::amplitude WARNING : External state 1 ('g', PDG 21, helicity -) is off shell: p^2 = +2.5e5, expected m^2 = +0e0 (|Δ| = +2.5e5). Fixed-helicity spinor/vector/tensor external states may be ill-defined at this kinematic point.
  561. 142.37 s > field value
  562. 142.37 s > span warm_up{integrand.name=se1l}
  563. 142.37 s > [2026-08-28 17:31:07.806] @process::amplitude INFO : Input is above threshold: 1 existing threshold E-surfaces across 1/1 graph groups
  564. 142.37 s > field value
  565. 142.37 s > existing_esurfaces 1
  566. 142.37 s > group_count 1
  567. 142.37 s > groups_above_threshold 1
  568. 142.37 s > integrand se1l
  569. 142.37 s > span warm_up{integrand.name=se1l}
  570. 142.37 s > threshold_status above threshold
  571. 142.37 s > [2026-08-28 17:31:07.806] @process::amplitude INFO : overlap structure of group 0: [1: [0(2,3)]]
  572. 142.37 s > field value
  573. 142.37 s > span warm_up{integrand.name=se1l}
  574. 142.37 s > [2026-08-28 17:31:07.811] @process::amplitude WARNING : External state 0 ('g', PDG 21, helicity +) is off shell: p^2 = +2.5e5, expected m^2 = +0e0 (|Δ| = +2.5e5). Fixed-helicity spinor/vector/tensor external states may be ill-defined at this kinematic point.
  575. 142.37 s > field value
  576. 142.37 s > span warm_up{integrand.name=se1l_rls_shifted}
  577. 142.37 s > [2026-08-28 17:31:07.811] @process::amplitude WARNING : External state 1 ('g', PDG 21, helicity -) is off shell: p^2 = +2.5e5, expected m^2 = +0e0 (|Δ| = +2.5e5). Fixed-helicity spinor/vector/tensor external states may be ill-defined at this kinematic point.
  578. 142.37 s > field value
  579. 142.37 s > span warm_up{integrand.name=se1l_rls_shifted}
  580. 142.37 s > [2026-08-28 17:31:07.812] @process::amplitude INFO : Input is above threshold: 1 existing threshold E-surfaces across 1/1 graph groups
  581. 142.37 s > field value
  582. 142.37 s > existing_esurfaces 1
  583. 142.37 s > group_count 1
  584. 142.37 s > groups_above_threshold 1
  585. 142.37 s > integrand se1l_rls_shifted
  586. 142.37 s > span warm_up{integrand.name=se1l_rls_shifted}
  587. 142.37 s > threshold_status above threshold
  588. 142.37 s > [2026-08-28 17:31:07.812] @process::amplitude INFO : overlap structure of group 0: [1: [0(2,3)]]
  589. 142.37 s > field value
  590. 142.37 s > span warm_up{integrand.name=se1l_rls_shifted}
  591. 142.37 s > [2026-08-28 17:31:07.816] @process::amplitude WARNING : External state 0 ('g', PDG 21, helicity +) is off shell: p^2 = +2.5e5, expected m^2 = +0e0 (|Δ| = +2.5e5). Fixed-helicity spinor/vector/tensor external states may be ill-defined at this kinematic point.
  592. 142.37 s > field value
  593. 142.37 s > span warm_up{integrand.name=se1l}
  594. 142.37 s > [2026-08-28 17:31:07.816] @process::amplitude WARNING : External state 1 ('g', PDG 21, helicity -) is off shell: p^2 = +2.5e5, expected m^2 = +0e0 (|Δ| = +2.5e5). Fixed-helicity spinor/vector/tensor external states may be ill-defined at this kinematic point.
  595. 142.37 s > field value
  596. 142.37 s > span warm_up{integrand.name=se1l}
  597. 142.37 s > [2026-08-28 17:31:07.817] @process::amplitude INFO : Input is above threshold: 1 existing threshold E-surfaces across 1/1 graph groups
  598. 142.37 s > field value
  599. 142.37 s > existing_esurfaces 1
  600. 142.37 s > group_count 1
  601. 142.37 s > groups_above_threshold 1
  602. 142.37 s > integrand se1l
  603. 142.37 s > span warm_up{integrand.name=se1l}
  604. 142.37 s > threshold_status above threshold
  605. 142.37 s > [2026-08-28 17:31:07.817] @process::amplitude INFO : overlap structure of group 0: [1: [0(2,3)]]
  606. 142.38 s > field value
  607. 142.38 s > span warm_up{integrand.name=se1l}
  608. 142.38 s > [2026-08-28 17:31:07.821] @process::amplitude WARNING : External state 0 ('g', PDG 21, helicity +) is off shell: p^2 = +2.5e5, expected m^2 = +0e0 (|Δ| = +2.5e5). Fixed-helicity spinor/vector/tensor external states may be ill-defined at this kinematic point.
  609. 142.38 s > field value
  610. 142.38 s > span warm_up{integrand.name=se1l_rls_shifted}
  611. 142.38 s > [2026-08-28 17:31:07.821] @process::amplitude WARNING : External state 1 ('g', PDG 21, helicity -) is off shell: p^2 = +2.5e5, expected m^2 = +0e0 (|Δ| = +2.5e5). Fixed-helicity spinor/vector/tensor external states may be ill-defined at this kinematic point.
  612. 142.38 s > field value
  613. 142.38 s > span warm_up{integrand.name=se1l_rls_shifted}
  614. 142.38 s > [2026-08-28 17:31:07.821] @process::amplitude INFO : Input is above threshold: 1 existing threshold E-surfaces across 1/1 graph groups
  615. 142.38 s > field value
  616. 142.38 s > existing_esurfaces 1
  617. 142.38 s > group_count 1
  618. 142.38 s > groups_above_threshold 1
  619. 142.38 s > integrand se1l_rls_shifted
  620. 142.38 s > span warm_up{integrand.name=se1l_rls_shifted}
  621. 142.38 s > threshold_status above threshold
  622. 142.38 s > [2026-08-28 17:31:07.821] @process::amplitude INFO : overlap structure of group 0: [1: [0(2,3)]]
  623. 142.38 s > field value
  624. 142.38 s > span warm_up{integrand.name=se1l_rls_shifted}
  625. 142.38 s > [2026-08-28 17:31:07.825] @process::amplitude WARNING : External state 0 ('g', PDG 21, helicity +) is off shell: p^2 = +2.5e5, expected m^2 = +0e0 (|Δ| = +2.5e5). Fixed-helicity spinor/vector/tensor external states may be ill-defined at this kinematic point.
  626. 142.38 s > field value
  627. 142.38 s > span warm_up{integrand.name=se1l}
  628. 142.38 s > [2026-08-28 17:31:07.825] @process::amplitude WARNING : External state 1 ('g', PDG 21, helicity -) is off shell: p^2 = +2.5e5, expected m^2 = +0e0 (|Δ| = +2.5e5). Fixed-helicity spinor/vector/tensor external states may be ill-defined at this kinematic point.
  629. 142.38 s > field value
  630. 142.38 s > span warm_up{integrand.name=se1l}
  631. 142.38 s > [2026-08-28 17:31:07.825] @process::amplitude INFO : Input is above threshold: 1 existing threshold E-surfaces across 1/1 graph groups
  632. 142.38 s > field value
  633. 142.38 s > existing_esurfaces 1
  634. 142.38 s > group_count 1
  635. 142.38 s > groups_above_threshold 1
  636. 142.38 s > integrand se1l
  637. 142.38 s > span warm_up{integrand.name=se1l}
  638. 142.38 s > threshold_status above threshold
  639. 142.38 s > [2026-08-28 17:31:07.825] @process::amplitude INFO : overlap structure of group 0: [1: [0(2,3)]]
  640. 142.38 s > field value
  641. 142.38 s > span warm_up{integrand.name=se1l}
  642. 142.38 s > [2026-08-28 17:31:07.829] @process::amplitude WARNING : External state 0 ('g', PDG 21, helicity +) is off shell: p^2 = +2.5e5, expected m^2 = +0e0 (|Δ| = +2.5e5). Fixed-helicity spinor/vector/tensor external states may be ill-defined at this kinematic point.
  643. 142.38 s > field value
  644. 142.38 s > span warm_up{integrand.name=se1l_rls_shifted}
  645. 142.38 s > [2026-08-28 17:31:07.829] @process::amplitude WARNING : External state 1 ('g', PDG 21, helicity -) is off shell: p^2 = +2.5e5, expected m^2 = +0e0 (|Δ| = +2.5e5). Fixed-helicity spinor/vector/tensor external states may be ill-defined at this kinematic point.
  646. 142.38 s > field value
  647. 142.38 s > span warm_up{integrand.name=se1l_rls_shifted}
  648. 142.38 s > [2026-08-28 17:31:07.830] @process::amplitude INFO : Input is above threshold: 1 existing threshold E-surfaces across 1/1 graph groups
  649. 142.38 s > field value
  650. 142.38 s > existing_esurfaces 1
  651. 142.38 s > group_count 1
  652. 142.38 s > groups_above_threshold 1
  653. 142.38 s > integrand se1l_rls_shifted
  654. 142.38 s > span warm_up{integrand.name=se1l_rls_shifted}
  655. 142.38 s > threshold_status above threshold
  656. 142.38 s > [2026-08-28 17:31:07.830] @process::amplitude INFO : overlap structure of group 0: [1: [0(2,3)]]
  657. 142.38 s > field value
  658. 142.38 s > span warm_up{integrand.name=se1l_rls_shifted}
  659. 142.38 s > [2026-08-28 17:31:07.834] @process::amplitude WARNING : External state 0 ('g', PDG 21, helicity +) is off shell: p^2 = +2.5e5, expected m^2 = +0e0 (|Δ| = +2.5e5). Fixed-helicity spinor/vector/tensor external states may be ill-defined at this kinematic point.
  660. 142.38 s > field value
  661. 142.38 s > span warm_up{integrand.name=se1l}
  662. 142.38 s > [2026-08-28 17:31:07.834] @process::amplitude WARNING : External state 1 ('g', PDG 21, helicity -) is off shell: p^2 = +2.5e5, expected m^2 = +0e0 (|Δ| = +2.5e5). Fixed-helicity spinor/vector/tensor external states may be ill-defined at this kinematic point.
  663. 142.38 s > field value
  664. 142.38 s > span warm_up{integrand.name=se1l}
  665. 142.38 s > [2026-08-28 17:31:07.834] @process::amplitude INFO : Input is above threshold: 1 existing threshold E-surfaces across 1/1 graph groups
  666. 142.38 s > field value
  667. 142.38 s > existing_esurfaces 1
  668. 142.38 s > group_count 1
  669. 142.38 s > groups_above_threshold 1
  670. 142.38 s > integrand se1l
  671. 142.38 s > span warm_up{integrand.name=se1l}
  672. 142.38 s > threshold_status above threshold
  673. 142.38 s > [2026-08-28 17:31:07.835] @process::amplitude INFO : overlap structure of group 0: [1: [0(2,3)]]
  674. 142.38 s > field value
  675. 142.38 s > span warm_up{integrand.name=se1l}
  676. 142.38 s > [2026-08-28 17:31:07.838] @process::amplitude WARNING : External state 0 ('g', PDG 21, helicity +) is off shell: p^2 = +2.5e5, expected m^2 = +0e0 (|Δ| = +2.5e5). Fixed-helicity spinor/vector/tensor external states may be ill-defined at this kinematic point.
  677. 142.38 s > field value
  678. 142.38 s > span warm_up{integrand.name=se1l_rls_shifted}
  679. 142.38 s > [2026-08-28 17:31:07.838] @process::amplitude WARNING : External state 1 ('g', PDG 21, helicity -) is off shell: p^2 = +2.5e5, expected m^2 = +0e0 (|Δ| = +2.5e5). Fixed-helicity spinor/vector/tensor external states may be ill-defined at this kinematic point.
  680. 142.38 s > field value
  681. 142.38 s > span warm_up{integrand.name=se1l_rls_shifted}
  682. 142.38 s > [2026-08-28 17:31:07.838] @process::amplitude INFO : Input is above threshold: 1 existing threshold E-surfaces across 1/1 graph groups
  683. 142.38 s > field value
  684. 142.38 s > existing_esurfaces 1
  685. 142.38 s > group_count 1
  686. 142.38 s > groups_above_threshold 1
  687. 142.38 s > integrand se1l_rls_shifted
  688. 142.38 s > span warm_up{integrand.name=se1l_rls_shifted}
  689. 142.38 s > threshold_status above threshold
  690. 142.38 s > [2026-08-28 17:31:07.839] @process::amplitude INFO : overlap structure of group 0: [1: [0(2,3)]]
  691. 142.38 s > field value
  692. 142.38 s > span warm_up{integrand.name=se1l_rls_shifted}
  693. 142.38 s > [2026-08-28 17:31:07.842] @process::amplitude WARNING : External state 0 ('g', PDG 21, helicity +) is off shell: p^2 = +2.5e5, expected m^2 = +0e0 (|Δ| = +2.5e5). Fixed-helicity spinor/vector/tensor external states may be ill-defined at this kinematic point.
  694. 142.38 s > field value
  695. 142.38 s > span warm_up{integrand.name=se1l}
  696. 142.38 s > [2026-08-28 17:31:07.842] @process::amplitude WARNING : External state 1 ('g', PDG 21, helicity -) is off shell: p^2 = +2.5e5, expected m^2 = +0e0 (|Δ| = +2.5e5). Fixed-helicity spinor/vector/tensor external states may be ill-defined at this kinematic point.
  697. 142.38 s > field value
  698. 142.38 s > span warm_up{integrand.name=se1l}
  699. 142.38 s > [2026-08-28 17:31:07.842] @process::amplitude INFO : Input is above threshold: 1 existing threshold E-surfaces across 1/1 graph groups
  700. 142.38 s > field value
  701. 142.38 s > existing_esurfaces 1
  702. 142.38 s > group_count 1
  703. 142.38 s > groups_above_threshold 1
  704. 142.38 s > integrand se1l
  705. 142.38 s > span warm_up{integrand.name=se1l}
  706. 142.38 s > threshold_status above threshold
  707. 142.38 s > [2026-08-28 17:31:07.843] @process::amplitude INFO : overlap structure of group 0: [1: [0(2,3)]]
  708. 142.38 s > field value
  709. 142.38 s > span warm_up{integrand.name=se1l}
  710. 142.38 s > [2026-08-28 17:31:07.846] @process::amplitude WARNING : External state 0 ('g', PDG 21, helicity +) is off shell: p^2 = +2.5e5, expected m^2 = +0e0 (|Δ| = +2.5e5). Fixed-helicity spinor/vector/tensor external states may be ill-defined at this kinematic point.
  711. 142.38 s > field value
  712. 142.38 s > span warm_up{integrand.name=se1l_rls_shifted}
  713. 142.38 s > [2026-08-28 17:31:07.846] @process::amplitude WARNING : External state 1 ('g', PDG 21, helicity -) is off shell: p^2 = +2.5e5, expected m^2 = +0e0 (|Δ| = +2.5e5). Fixed-helicity spinor/vector/tensor external states may be ill-defined at this kinematic point.
  714. 142.38 s > field value
  715. 142.38 s > span warm_up{integrand.name=se1l_rls_shifted}
  716. 142.38 s > [2026-08-28 17:31:07.846] @process::amplitude INFO : Input is above threshold: 1 existing threshold E-surfaces across 1/1 graph groups
  717. 142.38 s > field value
  718. 142.38 s > existing_esurfaces 1
  719. 142.38 s > group_count 1
  720. 142.38 s > groups_above_threshold 1
  721. 142.38 s > integrand se1l_rls_shifted
  722. 142.38 s > span warm_up{integrand.name=se1l_rls_shifted}
  723. 142.38 s > threshold_status above threshold
  724. 142.38 s > [2026-08-28 17:31:07.847] @process::amplitude INFO : overlap structure of group 0: [1: [0(2,3)]]
  725. 142.38 s > field value
  726. 142.38 s > span warm_up{integrand.name=se1l_rls_shifted}
  727. 142.38 s > [2026-08-28 17:31:07.850] @process::amplitude WARNING : External state 0 ('g', PDG 21, helicity +) is off shell: p^2 = +2.5e5, expected m^2 = +0e0 (|Δ| = +2.5e5). Fixed-helicity spinor/vector/tensor external states may be ill-defined at this kinematic point.
  728. 142.38 s > field value
  729. 142.38 s > span warm_up{integrand.name=se1l}
  730. 142.38 s > [2026-08-28 17:31:07.850] @process::amplitude WARNING : External state 1 ('g', PDG 21, helicity -) is off shell: p^2 = +2.5e5, expected m^2 = +0e0 (|Δ| = +2.5e5). Fixed-helicity spinor/vector/tensor external states may be ill-defined at this kinematic point.
  731. 142.38 s > field value
  732. 142.38 s > span warm_up{integrand.name=se1l}
  733. 142.38 s > [2026-08-28 17:31:07.850] @process::amplitude INFO : Input is above threshold: 1 existing threshold E-surfaces across 1/1 graph groups
  734. 142.38 s > field value
  735. 142.38 s > existing_esurfaces 1
  736. 142.38 s > group_count 1
  737. 142.38 s > groups_above_threshold 1
  738. 142.38 s > integrand se1l
  739. 142.38 s > span warm_up{integrand.name=se1l}
  740. 142.38 s > threshold_status above threshold
  741. 142.38 s > [2026-08-28 17:31:07.851] @process::amplitude INFO : overlap structure of group 0: [1: [0(2,3)]]
  742. 142.38 s > field value
  743. 142.38 s > span warm_up{integrand.name=se1l}
  744. 142.38 s > [2026-08-28 17:31:07.854] @process::amplitude WARNING : External state 0 ('g', PDG 21, helicity +) is off shell: p^2 = +2.5e5, expected m^2 = +0e0 (|Δ| = +2.5e5). Fixed-helicity spinor/vector/tensor external states may be ill-defined at this kinematic point.
  745. 142.38 s > field value
  746. 142.38 s > span warm_up{integrand.name=se1l_rls_shifted}
  747. 142.38 s > [2026-08-28 17:31:07.854] @process::amplitude WARNING : External state 1 ('g', PDG 21, helicity -) is off shell: p^2 = +2.5e5, expected m^2 = +0e0 (|Δ| = +2.5e5). Fixed-helicity spinor/vector/tensor external states may be ill-defined at this kinematic point.
  748. 142.38 s > field value
  749. 142.38 s > span warm_up{integrand.name=se1l_rls_shifted}
  750. 142.38 s > [2026-08-28 17:31:07.854] @process::amplitude INFO : Input is above threshold: 1 existing threshold E-surfaces across 1/1 graph groups
  751. 142.38 s > field value
  752. 142.38 s > existing_esurfaces 1
  753. 142.38 s > group_count 1
  754. 142.38 s > groups_above_threshold 1
  755. 142.38 s > integrand se1l_rls_shifted
  756. 142.38 s > span warm_up{integrand.name=se1l_rls_shifted}
  757. 142.38 s > threshold_status above threshold
  758. 142.38 s > [2026-08-28 17:31:07.855] @process::amplitude INFO : overlap structure of group 0: [1: [0(2,3)]]
  759. 142.38 s > field value
  760. 142.38 s > span warm_up{integrand.name=se1l_rls_shifted}
  761. 142.38 s > [2026-08-28 17:31:07.859] @process::amplitude WARNING : External state 0 ('g', PDG 21, helicity +) is off shell: p^2 = +2.5e5, expected m^2 = +0e0 (|Δ| = +2.5e5). Fixed-helicity spinor/vector/tensor external states may be ill-defined at this kinematic point.
  762. 142.38 s > field value
  763. 142.38 s > span warm_up{integrand.name=se1l}
  764. 142.38 s > [2026-08-28 17:31:07.859] @process::amplitude WARNING : External state 1 ('g', PDG 21, helicity -) is off shell: p^2 = +2.5e5, expected m^2 = +0e0 (|Δ| = +2.5e5). Fixed-helicity spinor/vector/tensor external states may be ill-defined at this kinematic point.
  765. 142.38 s > field value
  766. 142.38 s > span warm_up{integrand.name=se1l}
  767. 142.38 s > [2026-08-28 17:31:07.859] @process::amplitude INFO : Input is above threshold: 1 existing threshold E-surfaces across 1/1 graph groups
  768. 142.38 s > field value
  769. 142.38 s > existing_esurfaces 1
  770. 142.38 s > group_count 1
  771. 142.38 s > groups_above_threshold 1
  772. 142.38 s > integrand se1l
  773. 142.38 s > span warm_up{integrand.name=se1l}
  774. 142.38 s > threshold_status above threshold
  775. 142.38 s > [2026-08-28 17:31:07.859] @process::amplitude INFO : overlap structure of group 0: [1: [0(2,3)]]
  776. 142.38 s > field value
  777. 142.38 s > span warm_up{integrand.name=se1l}
  778. 142.38 s > [2026-08-28 17:31:07.864] @process::amplitude WARNING : External state 0 ('g', PDG 21, helicity +) is off shell: p^2 = +2.5e5, expected m^2 = +0e0 (|Δ| = +2.5e5). Fixed-helicity spinor/vector/tensor external states may be ill-defined at this kinematic point.
  779. 142.38 s > field value
  780. 142.38 s > span warm_up{integrand.name=se1l_rls_shifted}
  781. 142.38 s > [2026-08-28 17:31:07.864] @process::amplitude WARNING : External state 1 ('g', PDG 21, helicity -) is off shell: p^2 = +2.5e5, expected m^2 = +0e0 (|Δ| = +2.5e5). Fixed-helicity spinor/vector/tensor external states may be ill-defined at this kinematic point.
  782. 142.38 s > field value
  783. 142.38 s > span warm_up{integrand.name=se1l_rls_shifted}
  784. 142.38 s > [2026-08-28 17:31:07.865] @process::amplitude INFO : Input is above threshold: 1 existing threshold E-surfaces across 1/1 graph groups
  785. 142.38 s > field value
  786. 142.38 s > existing_esurfaces 1
  787. 142.38 s > group_count 1
  788. 142.38 s > groups_above_threshold 1
  789. 142.38 s > integrand se1l_rls_shifted
  790. 142.38 s > span warm_up{integrand.name=se1l_rls_shifted}
  791. 142.38 s > threshold_status above threshold
  792. 142.38 s > [2026-08-28 17:31:07.865] @process::amplitude INFO : overlap structure of group 0: [1: [0(2,3)]]
  793. 142.38 s > field value
  794. 142.38 s > span warm_up{integrand.name=se1l_rls_shifted}
  795. 142.38 s > [2026-08-28 17:31:07.869] @process::amplitude WARNING : External state 0 ('g', PDG 21, helicity +) is off shell: p^2 = +2.5e5, expected m^2 = +0e0 (|Δ| = +2.5e5). Fixed-helicity spinor/vector/tensor external states may be ill-defined at this kinematic point.
  796. 142.38 s > field value
  797. 142.38 s > span warm_up{integrand.name=se1l}
  798. 142.38 s > [2026-08-28 17:31:07.869] @process::amplitude WARNING : External state 1 ('g', PDG 21, helicity -) is off shell: p^2 = +2.5e5, expected m^2 = +0e0 (|Δ| = +2.5e5). Fixed-helicity spinor/vector/tensor external states may be ill-defined at this kinematic point.
  799. 142.38 s > field value
  800. 142.38 s > span warm_up{integrand.name=se1l}
  801. 142.38 s > [2026-08-28 17:31:07.869] @process::amplitude INFO : Input is above threshold: 1 existing threshold E-surfaces across 1/1 graph groups
  802. 142.38 s > field value
  803. 142.38 s > existing_esurfaces 1
  804. 142.38 s > group_count 1
  805. 142.38 s > groups_above_threshold 1
  806. 142.38 s > integrand se1l
  807. 142.38 s > span warm_up{integrand.name=se1l}
  808. 142.38 s > threshold_status above threshold
  809. 142.38 s > [2026-08-28 17:31:07.869] @process::amplitude INFO : overlap structure of group 0: [1: [0(2,3)]]
  810. 142.38 s > field value
  811. 142.38 s > span warm_up{integrand.name=se1l}
  812. 142.38 s > [2026-08-28 17:31:07.874] @process::amplitude WARNING : External state 0 ('g', PDG 21, helicity +) is off shell: p^2 = +2.5e5, expected m^2 = +0e0 (|Δ| = +2.5e5). Fixed-helicity spinor/vector/tensor external states may be ill-defined at this kinematic point.
  813. 142.38 s > field value
  814. 142.38 s > span warm_up{integrand.name=se1l_rls_shifted}
  815. 142.38 s > [2026-08-28 17:31:07.874] @process::amplitude WARNING : External state 1 ('g', PDG 21, helicity -) is off shell: p^2 = +2.5e5, expected m^2 = +0e0 (|Δ| = +2.5e5). Fixed-helicity spinor/vector/tensor external states may be ill-defined at this kinematic point.
  816. 142.38 s > field value
  817. 142.38 s > span warm_up{integrand.name=se1l_rls_shifted}
  818. 142.38 s > [2026-08-28 17:31:07.874] @process::amplitude INFO : Input is above threshold: 1 existing threshold E-surfaces across 1/1 graph groups
  819. 142.38 s > field value
  820. 142.38 s > existing_esurfaces 1
  821. 142.38 s > group_count 1
  822. 142.38 s > groups_above_threshold 1
  823. 142.38 s > integrand se1l_rls_shifted
  824. 142.38 s > span warm_up{integrand.name=se1l_rls_shifted}
  825. 142.38 s > threshold_status above threshold
  826. 142.38 s > [2026-08-28 17:31:07.874] @process::amplitude INFO : overlap structure of group 0: [1: [0(2,3)]]
  827. 142.38 s > field value
  828. 142.38 s > span warm_up{integrand.name=se1l_rls_shifted}
  829. 142.38 s > [2026-08-28 17:31:07.878] @process::amplitude WARNING : External state 0 ('g', PDG 21, helicity +) is off shell: p^2 = +2.5e5, expected m^2 = +0e0 (|Δ| = +2.5e5). Fixed-helicity spinor/vector/tensor external states may be ill-defined at this kinematic point.
  830. 142.38 s > field value
  831. 142.38 s > span warm_up{integrand.name=se1l}
  832. 142.38 s > [2026-08-28 17:31:07.878] @process::amplitude WARNING : External state 1 ('g', PDG 21, helicity -) is off shell: p^2 = +2.5e5, expected m^2 = +0e0 (|Δ| = +2.5e5). Fixed-helicity spinor/vector/tensor external states may be ill-defined at this kinematic point.
  833. 142.38 s > field value
  834. 142.38 s > span warm_up{integrand.name=se1l}
  835. 142.38 s > [2026-08-28 17:31:07.878] @process::amplitude INFO : Input is above threshold: 1 existing threshold E-surfaces across 1/1 graph groups
  836. 142.38 s > field value
  837. 142.38 s > existing_esurfaces 1
  838. 142.38 s > group_count 1
  839. 142.38 s > groups_above_threshold 1
  840. 142.38 s > integrand se1l
  841. 142.38 s > span warm_up{integrand.name=se1l}
  842. 142.38 s > threshold_status above threshold
  843. 142.38 s > [2026-08-28 17:31:07.878] @process::amplitude INFO : overlap structure of group 0: [1: [0(2,3)]]
  844. 142.38 s > field value
  845. 142.38 s > span warm_up{integrand.name=se1l}
  846. 142.38 s > [2026-08-28 17:31:07.882] @process::amplitude WARNING : External state 0 ('g', PDG 21, helicity +) is off shell: p^2 = +2.5e5, expected m^2 = +0e0 (|Δ| = +2.5e5). Fixed-helicity spinor/vector/tensor external states may be ill-defined at this kinematic point.
  847. 142.38 s > field value
  848. 142.38 s > span warm_up{integrand.name=se1l_rls_shifted}
  849. 142.38 s > [2026-08-28 17:31:07.882] @process::amplitude WARNING : External state 1 ('g', PDG 21, helicity -) is off shell: p^2 = +2.5e5, expected m^2 = +0e0 (|Δ| = +2.5e5). Fixed-helicity spinor/vector/tensor external states may be ill-defined at this kinematic point.
  850. 142.38 s > field value
  851. 142.38 s > span warm_up{integrand.name=se1l_rls_shifted}
  852. 142.38 s > [2026-08-28 17:31:07.882] @process::amplitude INFO : Input is above threshold: 1 existing threshold E-surfaces across 1/1 graph groups
  853. 142.38 s > field value
  854. 142.38 s > existing_esurfaces 1
  855. 142.38 s > group_count 1
  856. 142.38 s > groups_above_threshold 1
  857. 142.38 s > integrand se1l_rls_shifted
  858. 142.38 s > span warm_up{integrand.name=se1l_rls_shifted}
  859. 142.38 s > threshold_status above threshold
  860. 142.38 s > [2026-08-28 17:31:07.882] @process::amplitude INFO : overlap structure of group 0: [1: [0(2,3)]]
  861. 142.38 s > field value
  862. 142.38 s > span warm_up{integrand.name=se1l_rls_shifted}
  863. 142.38 s > [2026-08-28 17:31:07.886] @process::amplitude WARNING : External state 0 ('g', PDG 21, helicity +) is off shell: p^2 = +2.5e5, expected m^2 = +0e0 (|Δ| = +2.5e5). Fixed-helicity spinor/vector/tensor external states may be ill-defined at this kinematic point.
  864. 142.38 s > field value
  865. 142.38 s > span warm_up{integrand.name=se1l}
  866. 142.38 s > [2026-08-28 17:31:07.886] @process::amplitude WARNING : External state 1 ('g', PDG 21, helicity -) is off shell: p^2 = +2.5e5, expected m^2 = +0e0 (|Δ| = +2.5e5). Fixed-helicity spinor/vector/tensor external states may be ill-defined at this kinematic point.
  867. 142.38 s > field value
  868. 142.38 s > span warm_up{integrand.name=se1l}
  869. 142.38 s > [2026-08-28 17:31:07.886] @process::amplitude INFO : Input is above threshold: 1 existing threshold E-surfaces across 1/1 graph groups
  870. 142.38 s > field value
  871. 142.38 s > existing_esurfaces 1
  872. 142.38 s > group_count 1
  873. 142.38 s > groups_above_threshold 1
  874. 142.38 s > integrand se1l
  875. 142.38 s > span warm_up{integrand.name=se1l}
  876. 142.38 s > threshold_status above threshold
  877. 142.38 s > [2026-08-28 17:31:07.886] @process::amplitude INFO : overlap structure of group 0: [1: [0(2,3)]]
  878. 142.38 s > field value
  879. 142.38 s > span warm_up{integrand.name=se1l}
  880. 142.38 s > [2026-08-28 17:31:07.890] @process::amplitude WARNING : External state 0 ('g', PDG 21, helicity +) is off shell: p^2 = +2.5e5, expected m^2 = +0e0 (|Δ| = +2.5e5). Fixed-helicity spinor/vector/tensor external states may be ill-defined at this kinematic point.
  881. 142.38 s > field value
  882. 142.38 s > span warm_up{integrand.name=se1l_rls_shifted}
  883. 142.38 s > [2026-08-28 17:31:07.890] @process::amplitude WARNING : External state 1 ('g', PDG 21, helicity -) is off shell: p^2 = +2.5e5, expected m^2 = +0e0 (|Δ| = +2.5e5). Fixed-helicity spinor/vector/tensor external states may be ill-defined at this kinematic point.
  884. 142.38 s > field value
  885. 142.38 s > span warm_up{integrand.name=se1l_rls_shifted}
  886. 142.38 s > [2026-08-28 17:31:07.890] @process::amplitude INFO : Input is above threshold: 1 existing threshold E-surfaces across 1/1 graph groups
  887. 142.38 s > field value
  888. 142.38 s > existing_esurfaces 1
  889. 142.38 s > group_count 1
  890. 142.38 s > groups_above_threshold 1
  891. 142.38 s > integrand se1l_rls_shifted
  892. 142.38 s > span warm_up{integrand.name=se1l_rls_shifted}
  893. 142.38 s > threshold_status above threshold
  894. 142.38 s > [2026-08-28 17:31:07.890] @process::amplitude INFO : overlap structure of group 0: [1: [0(2,3)]]
  895. 142.38 s > field value
  896. 142.38 s > span warm_up{integrand.name=se1l_rls_shifted}
  897. 142.38 s > [2026-08-28 17:31:07.894] @process::amplitude WARNING : External state 0 ('g', PDG 21, helicity +) is off shell: p^2 = +2.5e5, expected m^2 = +0e0 (|Δ| = +2.5e5). Fixed-helicity spinor/vector/tensor external states may be ill-defined at this kinematic point.
  898. 142.38 s > field value
  899. 142.38 s > span warm_up{integrand.name=se1l}
  900. 142.38 s > [2026-08-28 17:31:07.894] @process::amplitude WARNING : External state 1 ('g', PDG 21, helicity -) is off shell: p^2 = +2.5e5, expected m^2 = +0e0 (|Δ| = +2.5e5). Fixed-helicity spinor/vector/tensor external states may be ill-defined at this kinematic point.
  901. 142.38 s > field value
  902. 142.38 s > span warm_up{integrand.name=se1l}
  903. 142.38 s > [2026-08-28 17:31:07.894] @process::amplitude INFO : Input is above threshold: 1 existing threshold E-surfaces across 1/1 graph groups
  904. 142.38 s > field value
  905. 142.38 s > existing_esurfaces 1
  906. 142.38 s > group_count 1
  907. 142.38 s > groups_above_threshold 1
  908. 142.38 s > integrand se1l
  909. 142.38 s > span warm_up{integrand.name=se1l}
  910. 142.38 s > threshold_status above threshold
  911. 142.38 s > [2026-08-28 17:31:07.894] @process::amplitude INFO : overlap structure of group 0: [1: [0(2,3)]]
  912. 142.38 s > field value
  913. 142.38 s > span warm_up{integrand.name=se1l}
  914. 142.38 s > [2026-08-28 17:31:07.898] @process::amplitude WARNING : External state 0 ('g', PDG 21, helicity +) is off shell: p^2 = +2.5e5, expected m^2 = +0e0 (|Δ| = +2.5e5). Fixed-helicity spinor/vector/tensor external states may be ill-defined at this kinematic point.
  915. 142.38 s > field value
  916. 142.38 s > span warm_up{integrand.name=se1l_mur_shifted}
  917. 142.38 s > [2026-08-28 17:31:07.898] @process::amplitude WARNING : External state 1 ('g', PDG 21, helicity -) is off shell: p^2 = +2.5e5, expected m^2 = +0e0 (|Δ| = +2.5e5). Fixed-helicity spinor/vector/tensor external states may be ill-defined at this kinematic point.
  918. 142.38 s > field value
  919. 142.38 s > span warm_up{integrand.name=se1l_mur_shifted}
  920. 142.38 s > [2026-08-28 17:31:07.898] @process::amplitude INFO : Input is above threshold: 1 existing threshold E-surfaces across 1/1 graph groups
  921. 142.38 s > field value
  922. 142.38 s > existing_esurfaces 1
  923. 142.38 s > group_count 1
  924. 142.38 s > groups_above_threshold 1
  925. 142.38 s > integrand se1l_mur_shifted
  926. 142.38 s > span warm_up{integrand.name=se1l_mur_shifted}
  927. 142.38 s > threshold_status above threshold
  928. 142.38 s > [2026-08-28 17:31:07.898] @process::amplitude INFO : overlap structure of group 0: [1: [0(2,3)]]
  929. 142.38 s > field value
  930. 142.38 s > span warm_up{integrand.name=se1l_mur_shifted}
  931. 142.38 s > [2026-08-28 17:31:07.902] @process::amplitude WARNING : External state 0 ('g', PDG 21, helicity +) is off shell: p^2 = +2.5e5, expected m^2 = +0e0 (|Δ| = +2.5e5). Fixed-helicity spinor/vector/tensor external states may be ill-defined at this kinematic point.
  932. 142.38 s > field value
  933. 142.38 s > span warm_up{integrand.name=se1l}
  934. 142.38 s > [2026-08-28 17:31:07.902] @process::amplitude WARNING : External state 1 ('g', PDG 21, helicity -) is off shell: p^2 = +2.5e5, expected m^2 = +0e0 (|Δ| = +2.5e5). Fixed-helicity spinor/vector/tensor external states may be ill-defined at this kinematic point.
  935. 142.38 s > field value
  936. 142.38 s > span warm_up{integrand.name=se1l}
  937. 142.38 s > [2026-08-28 17:31:07.902] @process::amplitude INFO : Input is above threshold: 1 existing threshold E-surfaces across 1/1 graph groups
  938. 142.38 s > field value
  939. 142.38 s > existing_esurfaces 1
  940. 142.38 s > group_count 1
  941. 142.38 s > groups_above_threshold 1
  942. 142.38 s > integrand se1l
  943. 142.38 s > span warm_up{integrand.name=se1l}
  944. 142.38 s > threshold_status above threshold
  945. 142.38 s > [2026-08-28 17:31:07.903] @process::amplitude INFO : overlap structure of group 0: [1: [0(2,3)]]
  946. 142.38 s > field value
  947. 142.38 s > span warm_up{integrand.name=se1l}
  948. 142.38 s > [2026-08-28 17:31:07.906] @process::amplitude WARNING : External state 0 ('g', PDG 21, helicity +) is off shell: p^2 = +2.5e5, expected m^2 = +0e0 (|Δ| = +2.5e5). Fixed-helicity spinor/vector/tensor external states may be ill-defined at this kinematic point.
  949. 142.38 s > field value
  950. 142.38 s > span warm_up{integrand.name=se1l_mur_shifted}
  951. 142.38 s > [2026-08-28 17:31:07.906] @process::amplitude WARNING : External state 1 ('g', PDG 21, helicity -) is off shell: p^2 = +2.5e5, expected m^2 = +0e0 (|Δ| = +2.5e5). Fixed-helicity spinor/vector/tensor external states may be ill-defined at this kinematic point.
  952. 142.38 s > field value
  953. 142.38 s > span warm_up{integrand.name=se1l_mur_shifted}
  954. 142.38 s > [2026-08-28 17:31:07.907] @process::amplitude INFO : Input is above threshold: 1 existing threshold E-surfaces across 1/1 graph groups
  955. 142.38 s > field value
  956. 142.38 s > existing_esurfaces 1
  957. 142.38 s > group_count 1
  958. 142.38 s > groups_above_threshold 1
  959. 142.38 s > integrand se1l_mur_shifted
  960. 142.38 s > span warm_up{integrand.name=se1l_mur_shifted}
  961. 142.38 s > threshold_status above threshold
  962. 142.38 s > [2026-08-28 17:31:07.907] @process::amplitude INFO : overlap structure of group 0: [1: [0(2,3)]]
  963. 142.38 s > field value
  964. 142.38 s > span warm_up{integrand.name=se1l_mur_shifted}
  965. 142.38 s > [2026-08-28 17:31:07.911] @process::amplitude WARNING : External state 0 ('g', PDG 21, helicity +) is off shell: p^2 = +2.5e5, expected m^2 = +0e0 (|Δ| = +2.5e5). Fixed-helicity spinor/vector/tensor external states may be ill-defined at this kinematic point.
  966. 142.38 s > field value
  967. 142.38 s > span warm_up{integrand.name=se1l}
  968. 142.38 s > [2026-08-28 17:31:07.911] @process::amplitude WARNING : External state 1 ('g', PDG 21, helicity -) is off shell: p^2 = +2.5e5, expected m^2 = +0e0 (|Δ| = +2.5e5). Fixed-helicity spinor/vector/tensor external states may be ill-defined at this kinematic point.
  969. 142.38 s > field value
  970. 142.38 s > span warm_up{integrand.name=se1l}
  971. 142.38 s > [2026-08-28 17:31:07.911] @process::amplitude INFO : Input is above threshold: 1 existing threshold E-surfaces across 1/1 graph groups
  972. 142.38 s > field value
  973. 142.38 s > existing_esurfaces 1
  974. 142.38 s > group_count 1
  975. 142.38 s > groups_above_threshold 1
  976. 142.38 s > integrand se1l
  977. 142.38 s > span warm_up{integrand.name=se1l}
  978. 142.38 s > threshold_status above threshold
  979. 142.38 s > [2026-08-28 17:31:07.911] @process::amplitude INFO : overlap structure of group 0: [1: [0(2,3)]]
  980. 142.38 s > field value
  981. 142.38 s > span warm_up{integrand.name=se1l}
  982. 142.38 s > [2026-08-28 17:31:07.915] @process::amplitude WARNING : External state 0 ('g', PDG 21, helicity +) is off shell: p^2 = +2.5e5, expected m^2 = +0e0 (|Δ| = +2.5e5). Fixed-helicity spinor/vector/tensor external states may be ill-defined at this kinematic point.
  983. 142.38 s > field value
  984. 142.38 s > span warm_up{integrand.name=se1l_mur_shifted}
  985. 142.38 s > [2026-08-28 17:31:07.915] @process::amplitude WARNING : External state 1 ('g', PDG 21, helicity -) is off shell: p^2 = +2.5e5, expected m^2 = +0e0 (|Δ| = +2.5e5). Fixed-helicity spinor/vector/tensor external states may be ill-defined at this kinematic point.
  986. 142.38 s > field value
  987. 142.38 s > span warm_up{integrand.name=se1l_mur_shifted}
  988. 142.38 s > [2026-08-28 17:31:07.915] @process::amplitude INFO : Input is above threshold: 1 existing threshold E-surfaces across 1/1 graph groups
  989. 142.38 s > field value
  990. 142.38 s > existing_esurfaces 1
  991. 142.38 s > group_count 1
  992. 142.38 s > groups_above_threshold 1
  993. 142.38 s > integrand se1l_mur_shifted
  994. 142.38 s > span warm_up{integrand.name=se1l_mur_shifted}
  995. 142.38 s > threshold_status above threshold
  996. 142.38 s > [2026-08-28 17:31:07.915] @process::amplitude INFO : overlap structure of group 0: [1: [0(2,3)]]
  997. 142.38 s > field value
  998. 142.38 s > span warm_up{integrand.name=se1l_mur_shifted}
  999. 142.38 s > [2026-08-28 17:31:07.919] @process::amplitude WARNING : External state 0 ('g', PDG 21, helicity +) is off shell: p^2 = +2.5e5, expected m^2 = +0e0 (|Δ| = +2.5e5). Fixed-helicity spinor/vector/tensor external states may be ill-defined at this kinematic point.
  1000. 142.38 s > field value
  1001. 142.38 s > span warm_up{integrand.name=se1l}
  1002. 142.38 s > [2026-08-28 17:31:07.919] @process::amplitude WARNING : External state 1 ('g', PDG 21, helicity -) is off shell: p^2 = +2.5e5, expected m^2 = +0e0 (|Δ| = +2.5e5). Fixed-helicity spinor/vector/tensor external states may be ill-defined at this kinematic point.
  1003. 142.38 s > field value
  1004. 142.38 s > span warm_up{integrand.name=se1l}
  1005. 142.38 s > [2026-08-28 17:31:07.919] @process::amplitude INFO : Input is above threshold: 1 existing threshold E-surfaces across 1/1 graph groups
  1006. 142.38 s > field value
  1007. 142.38 s > existing_esurfaces 1
  1008. 142.38 s > group_count 1
  1009. 142.38 s > groups_above_threshold 1
  1010. 142.38 s > integrand se1l
  1011. 142.38 s > span warm_up{integrand.name=se1l}
  1012. 142.38 s > threshold_status above threshold
  1013. 142.38 s > [2026-08-28 17:31:07.919] @process::amplitude INFO : overlap structure of group 0: [1: [0(2,3)]]
  1014. 142.38 s > field value
  1015. 142.38 s > span warm_up{integrand.name=se1l}
  1016. 142.38 s > [2026-08-28 17:31:07.923] @process::amplitude WARNING : External state 0 ('g', PDG 21, helicity +) is off shell: p^2 = +2.5e5, expected m^2 = +0e0 (|Δ| = +2.5e5). Fixed-helicity spinor/vector/tensor external states may be ill-defined at this kinematic point.
  1017. 142.38 s > field value
  1018. 142.38 s > span warm_up{integrand.name=se1l_mur_shifted}
  1019. 142.38 s > [2026-08-28 17:31:07.923] @process::amplitude WARNING : External state 1 ('g', PDG 21, helicity -) is off shell: p^2 = +2.5e5, expected m^2 = +0e0 (|Δ| = +2.5e5). Fixed-helicity spinor/vector/tensor external states may be ill-defined at this kinematic point.
  1020. 142.38 s > field value
  1021. 142.38 s > span warm_up{integrand.name=se1l_mur_shifted}
  1022. 142.38 s > [2026-08-28 17:31:07.923] @process::amplitude INFO : Input is above threshold: 1 existing threshold E-surfaces across 1/1 graph groups
  1023. 142.38 s > field value
  1024. 142.38 s > existing_esurfaces 1
  1025. 142.38 s > group_count 1
  1026. 142.38 s > groups_above_threshold 1
  1027. 142.38 s > integrand se1l_mur_shifted
  1028. 142.38 s > span warm_up{integrand.name=se1l_mur_shifted}
  1029. 142.38 s > threshold_status above threshold
  1030. 142.38 s > [2026-08-28 17:31:07.923] @process::amplitude INFO : overlap structure of group 0: [1: [0(2,3)]]
  1031. 142.38 s > field value
  1032. 142.38 s > span warm_up{integrand.name=se1l_mur_shifted}
  1033. 142.38 s > [2026-08-28 17:31:07.927] @process::amplitude WARNING : External state 0 ('g', PDG 21, helicity +) is off shell: p^2 = +2.5e5, expected m^2 = +0e0 (|Δ| = +2.5e5). Fixed-helicity spinor/vector/tensor external states may be ill-defined at this kinematic point.
  1034. 142.38 s > field value
  1035. 142.38 s > span warm_up{integrand.name=se1l}
  1036. 142.38 s > [2026-08-28 17:31:07.927] @process::amplitude WARNING : External state 1 ('g', PDG 21, helicity -) is off shell: p^2 = +2.5e5, expected m^2 = +0e0 (|Δ| = +2.5e5). Fixed-helicity spinor/vector/tensor external states may be ill-defined at this kinematic point.
  1037. 142.38 s > field value
  1038. 142.38 s > span warm_up{integrand.name=se1l}
  1039. 142.38 s > [2026-08-28 17:31:07.927] @process::amplitude INFO : Input is above threshold: 1 existing threshold E-surfaces across 1/1 graph groups
  1040. 142.38 s > field value
  1041. 142.38 s > existing_esurfaces 1
  1042. 142.38 s > group_count 1
  1043. 142.38 s > groups_above_threshold 1
  1044. 142.38 s > integrand se1l
  1045. 142.38 s > span warm_up{integrand.name=se1l}
  1046. 142.38 s > threshold_status above threshold
  1047. 142.38 s > [2026-08-28 17:31:07.927] @process::amplitude INFO : overlap structure of group 0: [1: [0(2,3)]]
  1048. 142.38 s > field value
  1049. 142.38 s > span warm_up{integrand.name=se1l}
  1050. 142.38 s > [2026-08-28 17:31:07.931] @process::amplitude WARNING : External state 0 ('g', PDG 21, helicity +) is off shell: p^2 = +2.5e5, expected m^2 = +0e0 (|Δ| = +2.5e5). Fixed-helicity spinor/vector/tensor external states may be ill-defined at this kinematic point.
  1051. 142.38 s > field value
  1052. 142.38 s > span warm_up{integrand.name=se1l_mur_shifted}
  1053. 142.38 s > [2026-08-28 17:31:07.931] @process::amplitude WARNING : External state 1 ('g', PDG 21, helicity -) is off shell: p^2 = +2.5e5, expected m^2 = +0e0 (|Δ| = +2.5e5). Fixed-helicity spinor/vector/tensor external states may be ill-defined at this kinematic point.
  1054. 142.38 s > field value
  1055. 142.38 s > span warm_up{integrand.name=se1l_mur_shifted}
  1056. 142.38 s > [2026-08-28 17:31:07.931] @process::amplitude INFO : Input is above threshold: 1 existing threshold E-surfaces across 1/1 graph groups
  1057. 142.38 s > field value
  1058. 142.38 s > existing_esurfaces 1
  1059. 142.38 s > group_count 1
  1060. 142.38 s > groups_above_threshold 1
  1061. 142.38 s > integrand se1l_mur_shifted
  1062. 142.38 s > span warm_up{integrand.name=se1l_mur_shifted}
  1063. 142.38 s > threshold_status above threshold
  1064. 142.38 s > [2026-08-28 17:31:07.932] @process::amplitude INFO : overlap structure of group 0: [1: [0(2,3)]]
  1065. 142.38 s > field value
  1066. 142.38 s > span warm_up{integrand.name=se1l_mur_shifted}
  1067. 142.38 s > [2026-08-28 17:31:07.935] @process::amplitude WARNING : External state 0 ('g', PDG 21, helicity +) is off shell: p^2 = +2.5e5, expected m^2 = +0e0 (|Δ| = +2.5e5). Fixed-helicity spinor/vector/tensor external states may be ill-defined at this kinematic point.
  1068. 142.38 s > field value
  1069. 142.38 s > span warm_up{integrand.name=se1l}
  1070. 142.38 s > [2026-08-28 17:31:07.935] @process::amplitude WARNING : External state 1 ('g', PDG 21, helicity -) is off shell: p^2 = +2.5e5, expected m^2 = +0e0 (|Δ| = +2.5e5). Fixed-helicity spinor/vector/tensor external states may be ill-defined at this kinematic point.
  1071. 142.38 s > field value
  1072. 142.38 s > span warm_up{integrand.name=se1l}
  1073. 142.38 s > [2026-08-28 17:31:07.935] @process::amplitude INFO : Input is above threshold: 1 existing threshold E-surfaces across 1/1 graph groups
  1074. 142.38 s > field value
  1075. 142.38 s > existing_esurfaces 1
  1076. 142.38 s > group_count 1
  1077. 142.38 s > groups_above_threshold 1
  1078. 142.38 s > integrand se1l
  1079. 142.38 s > span warm_up{integrand.name=se1l}
  1080. 142.38 s > threshold_status above threshold
  1081. 142.38 s > [2026-08-28 17:31:07.936] @process::amplitude INFO : overlap structure of group 0: [1: [0(2,3)]]
  1082. 142.38 s > field value
  1083. 142.38 s > span warm_up{integrand.name=se1l}
  1084. 142.38 s > [2026-08-28 17:31:07.939] @process::amplitude WARNING : External state 0 ('g', PDG 21, helicity +) is off shell: p^2 = +2.5e5, expected m^2 = +0e0 (|Δ| = +2.5e5). Fixed-helicity spinor/vector/tensor external states may be ill-defined at this kinematic point.
  1085. 142.38 s > field value
  1086. 142.38 s > span warm_up{integrand.name=se1l_mur_shifted}
  1087. 142.38 s > [2026-08-28 17:31:07.939] @process::amplitude WARNING : External state 1 ('g', PDG 21, helicity -) is off shell: p^2 = +2.5e5, expected m^2 = +0e0 (|Δ| = +2.5e5). Fixed-helicity spinor/vector/tensor external states may be ill-defined at this kinematic point.
  1088. 142.38 s > field value
  1089. 142.38 s > span warm_up{integrand.name=se1l_mur_shifted}
  1090. 142.38 s > [2026-08-28 17:31:07.939] @process::amplitude INFO : Input is above threshold: 1 existing threshold E-surfaces across 1/1 graph groups
  1091. 142.38 s > field value
  1092. 142.38 s > existing_esurfaces 1
  1093. 142.38 s > group_count 1
  1094. 142.38 s > groups_above_threshold 1
  1095. 142.38 s > integrand se1l_mur_shifted
  1096. 142.38 s > span warm_up{integrand.name=se1l_mur_shifted}
  1097. 142.38 s > threshold_status above threshold
  1098. 142.38 s > [2026-08-28 17:31:07.940] @process::amplitude INFO : overlap structure of group 0: [1: [0(2,3)]]
  1099. 142.38 s > field value
  1100. 142.38 s > span warm_up{integrand.name=se1l_mur_shifted}
  1101. 142.38 s > [2026-08-28 17:31:07.943] @process::amplitude WARNING : External state 0 ('g', PDG 21, helicity +) is off shell: p^2 = +2.5e5, expected m^2 = +0e0 (|Δ| = +2.5e5). Fixed-helicity spinor/vector/tensor external states may be ill-defined at this kinematic point.
  1102. 142.38 s > field value
  1103. 142.38 s > span warm_up{integrand.name=se1l}
  1104. 142.38 s > [2026-08-28 17:31:07.943] @process::amplitude WARNING : External state 1 ('g', PDG 21, helicity -) is off shell: p^2 = +2.5e5, expected m^2 = +0e0 (|Δ| = +2.5e5). Fixed-helicity spinor/vector/tensor external states may be ill-defined at this kinematic point.
  1105. 142.38 s > field value
  1106. 142.38 s > span warm_up{integrand.name=se1l}
  1107. 142.38 s > [2026-08-28 17:31:07.943] @process::amplitude INFO : Input is above threshold: 1 existing threshold E-surfaces across 1/1 graph groups
  1108. 142.38 s > field value
  1109. 142.38 s > existing_esurfaces 1
  1110. 142.38 s > group_count 1
  1111. 142.38 s > groups_above_threshold 1
  1112. 142.38 s > integrand se1l
  1113. 142.38 s > span warm_up{integrand.name=se1l}
  1114. 142.38 s > threshold_status above threshold
  1115. 142.38 s > [2026-08-28 17:31:07.943] @process::amplitude INFO : overlap structure of group 0: [1: [0(2,3)]]
  1116. 142.38 s > field value
  1117. 142.38 s > span warm_up{integrand.name=se1l}
  1118. 142.38 s > [2026-08-28 17:31:07.949] @process::amplitude WARNING : External state 0 ('g', PDG 21, helicity +) is off shell: p^2 = +2.5e5, expected m^2 = +0e0 (|Δ| = +2.5e5). Fixed-helicity spinor/vector/tensor external states may be ill-defined at this kinematic point.
  1119. 142.38 s > field value
  1120. 142.38 s > span warm_up{integrand.name=se1l_mur_shifted}
  1121. 142.38 s > [2026-08-28 17:31:07.949] @process::amplitude WARNING : External state 1 ('g', PDG 21, helicity -) is off shell: p^2 = +2.5e5, expected m^2 = +0e0 (|Δ| = +2.5e5). Fixed-helicity spinor/vector/tensor external states may be ill-defined at this kinematic point.
  1122. 142.38 s > field value
  1123. 142.38 s > span warm_up{integrand.name=se1l_mur_shifted}
  1124. 142.38 s > [2026-08-28 17:31:07.949] @process::amplitude INFO : Input is above threshold: 1 existing threshold E-surfaces across 1/1 graph groups
  1125. 142.38 s > field value
  1126. 142.38 s > existing_esurfaces 1
  1127. 142.38 s > group_count 1
  1128. 142.38 s > groups_above_threshold 1
  1129. 142.38 s > integrand se1l_mur_shifted
  1130. 142.38 s > span warm_up{integrand.name=se1l_mur_shifted}
  1131. 142.38 s > threshold_status above threshold
  1132. 142.38 s > [2026-08-28 17:31:07.950] @process::amplitude INFO : overlap structure of group 0: [1: [0(2,3)]]
  1133. 142.38 s > field value
  1134. 142.38 s > span warm_up{integrand.name=se1l_mur_shifted}
  1135. 142.38 s > [2026-08-28 17:31:07.954] @process::amplitude WARNING : External state 0 ('g', PDG 21, helicity +) is off shell: p^2 = +2.5e5, expected m^2 = +0e0 (|Δ| = +2.5e5). Fixed-helicity spinor/vector/tensor external states may be ill-defined at this kinematic point.
  1136. 142.38 s > field value
  1137. 142.38 s > span warm_up{integrand.name=se1l}
  1138. 142.38 s > [2026-08-28 17:31:07.954] @process::amplitude WARNING : External state 1 ('g', PDG 21, helicity -) is off shell: p^2 = +2.5e5, expected m^2 = +0e0 (|Δ| = +2.5e5). Fixed-helicity spinor/vector/tensor external states may be ill-defined at this kinematic point.
  1139. 142.38 s > field value
  1140. 142.38 s > span warm_up{integrand.name=se1l}
  1141. 142.38 s > [2026-08-28 17:31:07.954] @process::amplitude INFO : Input is above threshold: 1 existing threshold E-surfaces across 1/1 graph groups
  1142. 142.38 s > field value
  1143. 142.38 s > existing_esurfaces 1
  1144. 142.38 s > group_count 1
  1145. 142.38 s > groups_above_threshold 1
  1146. 142.38 s > integrand se1l
  1147. 142.38 s > span warm_up{integrand.name=se1l}
  1148. 142.38 s > threshold_status above threshold
  1149. 142.38 s > [2026-08-28 17:31:07.954] @process::amplitude INFO : overlap structure of group 0: [1: [0(2,3)]]
  1150. 142.38 s > field value
  1151. 142.38 s > span warm_up{integrand.name=se1l}
  1152. 142.38 s > [2026-08-28 17:31:07.959] @process::amplitude WARNING : External state 0 ('g', PDG 21, helicity +) is off shell: p^2 = +2.5e5, expected m^2 = +0e0 (|Δ| = +2.5e5). Fixed-helicity spinor/vector/tensor external states may be ill-defined at this kinematic point.
  1153. 142.38 s > field value
  1154. 142.38 s > span warm_up{integrand.name=se1l_mur_shifted}
  1155. 142.38 s > [2026-08-28 17:31:07.959] @process::amplitude WARNING : External state 1 ('g', PDG 21, helicity -) is off shell: p^2 = +2.5e5, expected m^2 = +0e0 (|Δ| = +2.5e5). Fixed-helicity spinor/vector/tensor external states may be ill-defined at this kinematic point.
  1156. 142.38 s > field value
  1157. 142.38 s > span warm_up{integrand.name=se1l_mur_shifted}
  1158. 142.38 s > [2026-08-28 17:31:07.959] @process::amplitude INFO : Input is above threshold: 1 existing threshold E-surfaces across 1/1 graph groups
  1159. 142.38 s > field value
  1160. 142.38 s > existing_esurfaces 1
  1161. 142.38 s > group_count 1
  1162. 142.38 s > groups_above_threshold 1
  1163. 142.38 s > integrand se1l_mur_shifted
  1164. 142.38 s > span warm_up{integrand.name=se1l_mur_shifted}
  1165. 142.38 s > threshold_status above threshold
  1166. 142.38 s > [2026-08-28 17:31:07.959] @process::amplitude INFO : overlap structure of group 0: [1: [0(2,3)]]
  1167. 142.38 s > field value
  1168. 142.38 s > span warm_up{integrand.name=se1l_mur_shifted}
  1169. 142.38 s > [2026-08-28 17:31:07.964] @process::amplitude WARNING : External state 0 ('g', PDG 21, helicity +) is off shell: p^2 = +2.5e5, expected m^2 = +0e0 (|Δ| = +2.5e5). Fixed-helicity spinor/vector/tensor external states may be ill-defined at this kinematic point.
  1170. 142.38 s > field value
  1171. 142.38 s > span warm_up{integrand.name=se1l}
  1172. 142.38 s > [2026-08-28 17:31:07.964] @process::amplitude WARNING : External state 1 ('g', PDG 21, helicity -) is off shell: p^2 = +2.5e5, expected m^2 = +0e0 (|Δ| = +2.5e5). Fixed-helicity spinor/vector/tensor external states may be ill-defined at this kinematic point.
  1173. 142.38 s > field value
  1174. 142.38 s > span warm_up{integrand.name=se1l}
  1175. 142.38 s > [2026-08-28 17:31:07.964] @process::amplitude INFO : Input is above threshold: 1 existing threshold E-surfaces across 1/1 graph groups
  1176. 142.38 s > field value
  1177. 142.38 s > existing_esurfaces 1
  1178. 142.38 s > group_count 1
  1179. 142.38 s > groups_above_threshold 1
  1180. 142.38 s > integrand se1l
  1181. 142.38 s > span warm_up{integrand.name=se1l}
  1182. 142.38 s > threshold_status above threshold
  1183. 142.38 s > [2026-08-28 17:31:07.964] @process::amplitude INFO : overlap structure of group 0: [1: [0(2,3)]]
  1184. 142.38 s > field value
  1185. 142.38 s > span warm_up{integrand.name=se1l}
  1186. 142.38 s > [2026-08-28 17:31:07.969] @process::amplitude WARNING : External state 0 ('g', PDG 21, helicity +) is off shell: p^2 = +2.5e5, expected m^2 = +0e0 (|Δ| = +2.5e5). Fixed-helicity spinor/vector/tensor external states may be ill-defined at this kinematic point.
  1187. 142.38 s > field value
  1188. 142.38 s > span warm_up{integrand.name=se1l_mur_shifted}
  1189. 142.38 s > [2026-08-28 17:31:07.969] @process::amplitude WARNING : External state 1 ('g', PDG 21, helicity -) is off shell: p^2 = +2.5e5, expected m^2 = +0e0 (|Δ| = +2.5e5). Fixed-helicity spinor/vector/tensor external states may be ill-defined at this kinematic point.
  1190. 142.38 s > field value
  1191. 142.38 s > span warm_up{integrand.name=se1l_mur_shifted}
  1192. 142.38 s > [2026-08-28 17:31:07.969] @process::amplitude INFO : Input is above threshold: 1 existing threshold E-surfaces across 1/1 graph groups
  1193. 142.38 s > field value
  1194. 142.38 s > existing_esurfaces 1
  1195. 142.38 s > group_count 1
  1196. 142.38 s > groups_above_threshold 1
  1197. 142.38 s > integrand se1l_mur_shifted
  1198. 142.38 s > span warm_up{integrand.name=se1l_mur_shifted}
  1199. 142.38 s > threshold_status above threshold
  1200. 142.38 s > [2026-08-28 17:31:07.969] @process::amplitude INFO : overlap structure of group 0: [1: [0(2,3)]]
  1201. 142.38 s > field value
  1202. 142.38 s > span warm_up{integrand.name=se1l_mur_shifted}
  1203. 142.38 s > [2026-08-28 17:31:07.974] @process::amplitude WARNING : External state 0 ('g', PDG 21, helicity +) is off shell: p^2 = +2.5e5, expected m^2 = +0e0 (|Δ| = +2.5e5). Fixed-helicity spinor/vector/tensor external states may be ill-defined at this kinematic point.
  1204. 142.38 s > field value
  1205. 142.38 s > span warm_up{integrand.name=se1l}
  1206. 142.38 s > [2026-08-28 17:31:07.974] @process::amplitude WARNING : External state 1 ('g', PDG 21, helicity -) is off shell: p^2 = +2.5e5, expected m^2 = +0e0 (|Δ| = +2.5e5). Fixed-helicity spinor/vector/tensor external states may be ill-defined at this kinematic point.
  1207. 142.38 s > field value
  1208. 142.38 s > span warm_up{integrand.name=se1l}
  1209. 142.38 s > [2026-08-28 17:31:07.974] @process::amplitude INFO : Input is above threshold: 1 existing threshold E-surfaces across 1/1 graph groups
  1210. 142.38 s > field value
  1211. 142.38 s > existing_esurfaces 1
  1212. 142.38 s > group_count 1
  1213. 142.38 s > groups_above_threshold 1
  1214. 142.38 s > integrand se1l
  1215. 142.38 s > span warm_up{integrand.name=se1l}
  1216. 142.38 s > threshold_status above threshold
  1217. 142.38 s > [2026-08-28 17:31:07.974] @process::amplitude INFO : overlap structure of group 0: [1: [0(2,3)]]
  1218. 142.38 s > field value
  1219. 142.38 s > span warm_up{integrand.name=se1l}
  1220. 142.38 s > [2026-08-28 17:31:07.979] @process::amplitude WARNING : External state 0 ('g', PDG 21, helicity +) is off shell: p^2 = +2.5e5, expected m^2 = +0e0 (|Δ| = +2.5e5). Fixed-helicity spinor/vector/tensor external states may be ill-defined at this kinematic point.
  1221. 142.38 s > field value
  1222. 142.38 s > span warm_up{integrand.name=se1l_mur_shifted}
  1223. 142.38 s > [2026-08-28 17:31:07.979] @process::amplitude WARNING : External state 1 ('g', PDG 21, helicity -) is off shell: p^2 = +2.5e5, expected m^2 = +0e0 (|Δ| = +2.5e5). Fixed-helicity spinor/vector/tensor external states may be ill-defined at this kinematic point.
  1224. 142.38 s > field value
  1225. 142.38 s > span warm_up{integrand.name=se1l_mur_shifted}
  1226. 142.38 s > [2026-08-28 17:31:07.979] @process::amplitude INFO : Input is above threshold: 1 existing threshold E-surfaces across 1/1 graph groups
  1227. 142.38 s > field value
  1228. 142.38 s > existing_esurfaces 1
  1229. 142.38 s > group_count 1
  1230. 142.38 s > groups_above_threshold 1
  1231. 142.38 s > integrand se1l_mur_shifted
  1232. 142.38 s > span warm_up{integrand.name=se1l_mur_shifted}
  1233. 142.38 s > threshold_status above threshold
  1234. 142.38 s > [2026-08-28 17:31:07.979] @process::amplitude INFO : overlap structure of group 0: [1: [0(2,3)]]
  1235. 142.38 s > field value
  1236. 142.38 s > span warm_up{integrand.name=se1l_mur_shifted}
  1237. 142.38 s > The application panicked (crashed).
  1238. 142.38 s > Message: Integrated UV case failed: se1l
  1239. 142.38 s > Location: tests/tests/uv.rs:1068
  1240. 142.38 s >
  1241. 142.38 s > ━━━━━━━━━━━━━━━━━━━━━━━━━━━━━━━━━━ BACKTRACE ━━━━━━━━━━━━━━━━━━━━━━━━━━━━━━━━━━━
  1242. 142.38 s > 1: <color_eyre[51793ea62743adbd]::config::PanicHook>::panic_report<unknown>
  1243. 142.38 s > at <unknown source file>:<unknown line>
  1244. 142.38 s > 2: <color_eyre[51793ea62743adbd]::config::PanicHook>::into_panic_hook::{closure#0}<unknown>
  1245. 142.38 s > at <unknown source file>:<unknown line>
  1246. 142.38 s > 3: std[bcb96dfbba0ab899]::panicking::panic_with_hook<unknown>
  1247. 142.38 s > at <unknown source file>:<unknown line>
  1248. 142.38 s > 4: std[bcb96dfbba0ab899]::panicking::panic_handler::{closure#0}<unknown>
  1249. 142.38 s > at <unknown source file>:<unknown line>
  1250. 142.38 s > 5: std[bcb96dfbba0ab899]::sys::backtrace::__rust_end_short_backtrace::<std[bcb96dfbba0ab899]::panicking::panic_handler::{closure#0}, !><unknown>
  1251. 142.38 s > at <unknown source file>:<unknown line>
  1252. 142.38 s > 6: __rustc[6c289b9f9c454d21]::rust_begin_unwind<unknown>
  1253. 142.38 s > at <unknown source file>:<unknown line>
  1254. 142.38 s > 7: core[940e698046960fd5]::panicking::panic_fmt<unknown>
  1255. 142.38 s > at <unknown source file>:<unknown line>
  1256. 142.38 s > 8: uv[52cf2b63f0104e31]::run_single_integrated_uv_case<unknown>
  1257. 142.38 s > at <unknown source file>:<unknown line>
  1258. 142.38 s > 9: <uv[52cf2b63f0104e31]::se1l_uv::{closure#0} as core[940e698046960fd5]::ops::function::FnOnce<()>>::call_once<unknown>
  1259. 142.38 s > at <unknown source file>:<unknown line>
  1260. 142.38 s > 10: test[75d6903177b1d7e9]::__rust_begin_short_backtrace::<core[940e698046960fd5]::result::Result<(), alloc[2ea6bcb46fca0c42]::string::String>, fn() -> core[940e698046960fd5]::result::Result<(), alloc[2ea6bcb46fca0c42]::string::String>><unknown>
  1261. 142.38 s > at <unknown source file>:<unknown line>
  1262. 142.38 s > 11: test[75d6903177b1d7e9]::run_test::{closure#0}<unknown>
  1263. 142.38 s > at <unknown source file>:<unknown line>
  1264. 142.38 s > 12: std[bcb96dfbba0ab899]::sys::backtrace::__rust_begin_short_backtrace::<test[75d6903177b1d7e9]::run_test::{closure#1}, ()><unknown>
  1265. 142.38 s > at <unknown source file>:<unknown line>
  1266. 142.38 s > 13: <std[bcb96dfbba0ab899]::thread::lifecycle::spawn_unchecked<test[75d6903177b1d7e9]::run_test::{closure#1}, ()>::{closure#1} as core[940e698046960fd5]::ops::function::FnOnce<()>>::call_once::{shim:vtable#0}<unknown>
  1267. 142.38 s > at <unknown source file>:<unknown line>
  1268. 142.38 s > 14: <std[bcb96dfbba0ab899]::sys::thread::unix::Thread>::new::thread_start<unknown>
  1269. 142.38 s > at <unknown source file>:<unknown line>
  1270. 142.38 s > 15: start_thread<unknown>
  1271. 142.38 s > at <unknown source file>:<unknown line>
  1272. 142.38 s > 16: __clone3<unknown>
  1273. 142.38 s > at <unknown source file>:<unknown line>
  1274. 142.38 s >
  1275. 142.38 s > Run with COLORBT_SHOW_HIDDEN=1 environment variable to disable frame filtering.
  1276. 142.38 s > Run with RUST_BACKTRACE=full to include source snippets.
  1277. 142.38 s >
  1278. 142.38 s > error: test run failed
  1279. 142.38 s >
  1280. 142.38 s > ========== nextest test summary ==========
  1281. 142.38 s > report: target/nextest/ci_gammaloop/junit.xml
  1282. 142.38 s > tests: 106, failures: 9, errors: 0
  1283. 142.38 s >
  1284. 142.38 s > 1. gammaloop-integration-tests::test_runs::approach::approach_momentum_space_reports_incomplete_triplet_cleanly
  1285. 142.38 s > failure: test failure with exit code 101
  1286. 142.38 s > system-out
  1287. 142.38 s > running 1 test
  1288. 142.38 s > test approach::approach_momentum_space_reports_incomplete_triplet_cleanly ... FAILED
  1289. 142.38 s >
  1290. 142.38 s > failures:
  1291. 142.38 s >
  1292. 142.38 s > failures:
  1293. 142.38 s > approach::approach_momentum_space_reports_incomplete_triplet_cleanly
  1294. 142.38 s >
  1295. 142.38 s > test result: FAILED. 0 passed; 1 failed; 0 ignored; 0 measured; 82 filtered out; finished in 0.62s
  1296. 142.38 s > system-err
  1297. 142.38 s > [2026-08-28 17:29:08.335] @gammaloop_api::se... INFO : Running command import model scalars-default.json
  1298. 142.38 s > [2026-08-28 17:29:08.335] @import::model INFO : Loading built-in JSON model scalars-default
  1299. 142.38 s > [2026-08-28 17:29:08.339] @gammalooprs::model INFO : The following 2 external parameters were forced to zero by the restriction card:
  1300. 142.38 s > width_scalar_1, width_scalar_2
  1301. 142.38 s > [2026-08-28 17:29:08.340] @gammaloop_api::se... INFO : Running command remove processes
  1302. 142.38 s > [2026-08-28 17:29:08.340] @gammaloop_api::se... INFO : Running command generate amp scalar_1 > scalar_0 scalar_0 [{1}] --allowed-vertex-interactions V_3_SCALAR_022 V_3_SCALAR_122 -p triangle -i scalar_tri
  1303. 142.38 s > [2026-08-28 17:29:08.344] @feyngen::diagram_... INFO : 0s | Δ=0s | Starting Feynman graph generation with Symbolica...
  1304. 142.38 s > [2026-08-28 17:29:08.345] @feyngen::diagram_... INFO : 0s | Δ=0s | Number of graphs resulting from Symbolica generation: 1
  1305. 142.38 s > [2026-08-28 17:29:08.347] @feyngen::diagram_... INFO : 0s | Δ=0s | Number of graphs retained after removal of vetoed topologies: 1
  1306. 142.38 s > [2026-08-28 17:29:08.349] @feyngen::diagram_... INFO : 0s | Δ=0s | Number of graphs after vertex info assignment: 1
  1307. 142.38 s > [2026-08-28 17:29:08.349] @feyngen::diagram_... INFO : 0s | Δ=0s | Number of graphs after all complete graphs filters are applied: 1
  1308. 142.38 s > [2026-08-28 17:29:08.351] @feyngen::diagram_... INFO : 0s | Δ=0s | Number of graphs after closed fermion chains analysis: 1
  1309. 142.38 s > [2026-08-28 17:29:08.351] @feyngen::diagram_... INFO : 0s | Δ=0s | Number of graphs after symmetrization of external states: 1
  1310. 142.38 s > [2026-08-28 17:29:08.351] @feyngen::diagram_... INFO : 0s | Δ=0s | Number of graphs after canonization of vertices, edges and flows (graph labels assigned here): 1
  1311. 142.38 s > [2026-08-28 17:29:08.358] @feyngen::diagram_... INFO : 0s | Δ=0s | Number of graphs after numerator-aware grouping with strategy 'up to a scalar rescaling': 1 (1 isomorphically unique graph, 0 color zero, 0 lorentz zero, 0 grouped and 0 cancellation)
  1312. 142.38 s > [2026-08-28 17:29:08.358] @feyngen::diagram_... INFO : ( Sum of the symmetry factors from each graph generated = 1 )
  1313. 142.38 s > [2026-08-28 17:29:08.358] @commands::generate INFO : Generated amplitude 1 graphs.
  1314. 142.38 s > [2026-08-28 17:29:08.403] @settings::runtime WARNING : No external kinematics were provided; using default-generated external momenta and helicities.
  1315. 142.38 s > [2026-08-28 17:29:08.476] @commands::generate INFO :
  1316. 142.38 s > Integrand generation summary
  1317. 142.38 s > peak RAM 65.54 MiB | cores 1
  1318. 142.38 s > ╭────────────┬───────┬─────────┬────────────┬────────────┬────────────────┬─────────────╮
  1319. 142.38 s > │ integrand │ graph │ # evals │ expr build │ spenso │ symbolica eval │ compile │
  1320. 142.38 s > ├────────────┼───────┼─────────┼────────────┼────────────┼────────────────┼─────────────┤
  1321. 142.38 s > │ scalar_tri │ GL0 │ 9 │ 25ms (64%) │ 1ms (4.6%) │ 12ms (32%) │ 0ms (0.00%) │
  1322. 142.38 s > ├────────────┼───────┼─────────┼────────────┼────────────┼────────────────┼─────────────┤
  1323. 142.38 s > │ Total │ │ 9 │ 25ms (64%) │ 1ms (4.6%) │ 12ms (32%) │ 0ms (0.00%) │
  1324. 142.38 s > ╰────────────┴───────┴─────────┴────────────┴────────────┴────────────────┴─────────────╯
  1325. 142.38 s > [2026-08-28 17:29:08.477] @gammaloop_api::se... INFO : Running command generate amp scalar_0 scalar_0 > scalar_0 scalar_0 [{1}] --allowed-vertex-interactions V_3_SCALAR_022 -p box -i scalar_box --select-graphs GL0
  1326. 142.38 s > [2026-08-28 17:29:08.478] @feyngen::diagram_... INFO : 0s | Δ=0s | Starting Feynman graph generation with Symbolica...
  1327. 142.38 s > [2026-08-28 17:29:08.478] @feyngen::diagram_... INFO : 0s | Δ=0s | Number of graphs resulting from Symbolica generation: 3
  1328. 142.38 s > [2026-08-28 17:29:08.478] @feyngen::diagram_... INFO : 0s | Δ=0s | Number of graphs retained after removal of vetoed topologies: 3
  1329. 142.38 s > [2026-08-28 17:29:08.482] @feyngen::diagram_... INFO : 0s | Δ=0s | Number of graphs after vertex info assignment: 3
  1330. 142.38 s > [2026-08-28 17:29:08.482] @feyngen::diagram_... INFO : 0s | Δ=0s | Number of graphs after all complete graphs filters are applied: 3
  1331. 142.38 s > [2026-08-28 17:29:08.482] @feyngen::diagram_... INFO : 0s | Δ=0s | Number of graphs after closed fermion chains analysis: 3
  1332. 142.38 s > [2026-08-28 17:29:08.482] @feyngen::diagram_... INFO : 0s | Δ=0s | Number of graphs after symmetrization of external states: 3
  1333. 142.38 s > [2026-08-28 17:29:08.485] @feyngen::diagram_... INFO : 0s | Δ=0s | Number of graphs after canonization of vertices, edges and flows (graph labels assigned here): 3
  1334. 142.38 s > [2026-08-28 17:29:08.500] @feyngen::diagram_... INFO : 0s | Δ=0s | Number of graphs after numerator-aware grouping with strategy 'up to a scalar rescaling': 1 (1 isomorphically unique graph, 0 color zero, 0 lorentz zero, 0 grouped and 0 cancellation)
  1335. 142.38 s > [2026-08-28 17:29:08.500] @feyngen::diagram_... INFO : ( Sum of the symmetry factors from each graph generated = 1 )
  1336. 142.38 s > [2026-08-28 17:29:08.500] @commands::generate INFO : Generated amplitude 1 graphs.
  1337. 142.38 s > [2026-08-28 17:29:08.592] @settings::runtime WARNING : No external kinematics were provided; using default-generated external momenta and helicities.
  1338. 142.38 s > [2026-08-28 17:29:08.611] @commands::generate INFO :
  1339. 142.38 s > Integrand generation summary
  1340. 142.38 s > peak RAM 68.26 MiB | cores 1
  1341. 142.38 s > ╭────────────┬───────┬─────────┬────────────┬────────────┬────────────────┬─────────────╮
  1342. 142.38 s > │ integrand │ graph │ # evals │ expr build │ spenso │ symbolica eval │ compile │
  1343. 142.38 s > ├────────────┼───────┼─────────┼────────────┼────────────┼────────────────┼─────────────┤
  1344. 142.38 s > │ scalar_box │ GL0 │ 13 │ 41ms (48%) │ 7ms (8.3%) │ 37ms (44%) │ 0ms (0.00%) │
  1345. 142.38 s > ├────────────┼───────┼─────────┼────────────┼────────────┼────────────────┼─────────────┤
  1346. 142.38 s > │ Total │ │ 13 │ 41ms (48%) │ 7ms (8.3%) │ 37ms (44%) │ 0ms (0.00%) │
  1347. 142.38 s > ╰────────────┴───────┴─────────┴────────────┴────────────┴────────────────┴─────────────╯
  1348. 142.38 s > [2026-08-28 17:29:08.611] @gammaloop_api::se... INFO : Running command generate
  1349. 142.38 s > [2026-08-28 17:29:08.691] @settings::runtime WARNING : No external kinematics were provided; using default-generated external momenta and helicities.
  1350. 142.38 s > [2026-08-28 17:29:08.731] @settings::runtime WARNING : No external kinematics were provided; using default-generated external momenta and helicities.
  1351. 142.38 s > [2026-08-28 17:29:08.828] @commands::generate INFO :
  1352. 142.38 s > Integrand generation summary
  1353. 142.38 s > peak RAM 72.02 MiB | cores 1
  1354. 142.38 s > ╭────────────┬───────┬─────────┬────────────┬────────────┬────────────────┬─────────────╮
  1355. 142.38 s > │ integrand │ graph │ # evals │ expr build │ spenso │ symbolica eval │ compile │
  1356. 142.38 s > ├────────────┼───────┼─────────┼────────────┼────────────┼────────────────┼─────────────┤
  1357. 142.38 s > │ scalar_tri │ GL0 │ 9 │ 10ms (58%) │ 1ms (11%) │ 5ms (32%) │ 0ms (0.00%) │
  1358. 142.38 s > │ scalar_box │ GL0 │ 13 │ 52ms (59%) │ 7ms (8.9%) │ 28ms (32%) │ 0ms (0.00%) │
  1359. 142.38 s > ├────────────┼───────┼─────────┼────────────┼────────────┼────────────────┼─────────────┤
  1360. 142.38 s > │ Total │ │ 22 │ 63ms (59%) │ 9ms (9.2%) │ 34ms (32%) │ 0ms (0.00%) │
  1361. 142.38 s > ╰────────────┴───────┴─────────┴────────────┴────────────┴────────────────┴─────────────╯
  1362. 142.38 s > [2026-08-28 17:29:08.828] @gammaloop_api::se... INFO : Running command set model mass_scalar_2=2.0
  1363. 142.38 s > [2026-08-28 17:29:08.830] @gammaloop_api::se... INFO : Running command set model mass_scalar_1=1.0
  1364. 142.38 s > [2026-08-28 17:29:08.831] @gammaloop_api::se... INFO : Running command set process -p triangle -i scalar_tri string '
  1365. 142.38 s > [kinematics.externals]
  1366. 142.38 s > type = "constant"
  1367. 142.38 s >
  1368. 142.38 s > [kinematics.externals.data]
  1369. 142.38 s > [...]
  1370. 142.38 s > [2026-08-28 17:29:08.832] @gammaloop_api::se... INFO : Running command set process -p box -i scalar_box string '
  1371. 142.38 s > [kinematics.externals]
  1372. 142.38 s > type = "constant"
  1373. 142.38 s >
  1374. 142.38 s > [kinematics.externals.data]
  1375. 142.38 s > [...]
  1376. 142.38 s > [2026-08-28 17:29:08.833] @gammaloop_api::se... INFO : Running command approach -x 1.0000000000000001e-1,2.0000000000000001e-1,2.9999999999999999e-1,4.0000000000000002e-1 --approach-axis 1.0000000000000000e-3,0.0000000000000000e0,0.0000000000000000e0,0.0000000000000000e0 --n-points 1 --n-cores 1 --output-results /build/source/tests/artifacts/scalar_box_invalid_momentum_approach/approach_momentum.json --momentum-space --graph-id 0
  1377. 142.38 s > The application panicked (crashed).
  1378. 142.38 s > Message: There are 2 processes available. Please specify a process.
  1379. 142.38 s > Location: tests/tests/test_runs/approach.rs:332
  1380. 142.38 s >
  1381. 142.38 s > ━━━━━━━━━━━━━━━━━━━━━━━━━━━━━━━━━━ BACKTRACE ━━━━━━━━━━━━━━━━━━━━━━━━━━━━━━━━━━━
  1382. 142.38 s > 1: <color_eyre[51793ea62743adbd]::config::PanicHook>::panic_report<unknown>
  1383. 142.38 s > at <unknown source file>:<unknown line>
  1384. 142.38 s > 2: <color_eyre[51793ea62743adbd]::config::PanicHook>::into_panic_hook::{closure#0}<unknown>
  1385. 142.38 s > at <unknown source file>:<unknown line>
  1386. 142.38 s > 3: std[bcb96dfbba0ab899]::panicking::panic_with_hook<unknown>
  1387. 142.38 s > at <unknown source file>:<unknown line>
  1388. 142.38 s > 4: std[bcb96dfbba0ab899]::panicking::panic_handler::{closure#0}<unknown>
  1389. 142.38 s > at <unknown source file>:<unknown line>
  1390. 142.38 s > 5: std[bcb96dfbba0ab899]::sys::backtrace::__rust_end_short_backtrace::<std[bcb96dfbba0ab899]::panicking::panic_handler::{closure#0}, !><unknown>
  1391. 142.38 s > at <unknown source file>:<unknown line>
  1392. 142.38 s > 6: __rustc[6c289b9f9c454d21]::rust_begin_unwind<unknown>
  1393. 142.38 s > at <unknown source file>:<unknown line>
  1394. 142.38 s > 7: core[940e698046960fd5]::panicking::panic_fmt<unknown>
  1395. 142.38 s > at <unknown source file>:<unknown line>
  1396. 142.38 s > 8: test_runs[3e7a390caee4e338]::approach::approach_momentum_space_reports_incomplete_triplet_cleanly<unknown>
  1397. 142.38 s > at <unknown source file>:<unknown line>
  1398. 142.38 s > 9: <test_runs[3e7a390caee4e338]::approach::approach_momentum_space_reports_incomplete_triplet_cleanly::{closure#0} as core[940e698046960fd5]::ops::function::FnOnce<()>>::call_once<unknown>
  1399. 142.38 s > at <unknown source file>:<unknown line>
  1400. 142.38 s > 10: test[75d6903177b1d7e9]::__rust_begin_short_backtrace::<core[940e698046960fd5]::result::Result<(), alloc[2ea6bcb46fca0c42]::string::String>, fn() -> core[940e698046960fd5]::result::Result<(), alloc[2ea6bcb46fca0c42]::string::String>><unknown>
  1401. 142.38 s > at <unknown source file>:<unknown line>
  1402. 142.38 s > 11: test[75d6903177b1d7e9]::run_test::{closure#0}<unknown>
  1403. 142.38 s > at <unknown source file>:<unknown line>
  1404. 142.38 s > 12: std[bcb96dfbba0ab899]::sys::backtrace::__rust_begin_short_backtrace::<test[75d6903177b1d7e9]::run_test::{closure#1}, ()><unknown>
  1405. 142.38 s > at <unknown source file>:<unknown line>
  1406. 142.38 s > 13: <std[bcb96dfbba0ab899]::thread::lifecycle::spawn_unchecked<test[75d6903177b1d7e9]::run_test::{closure#1}, ()>::{closure#1} as core[940e698046960fd5]::ops::function::FnOnce<()>>::call_once::{shim:vtable#0}<unknown>
  1407. 142.38 s > at <unknown source file>:<unknown line>
  1408. 142.38 s > 14: <std[bcb96dfbba0ab899]::sys::thread::unix::Thread>::new::thread_start<unknown>
  1409. 142.38 s > at <unknown source file>:<unknown line>
  1410. 142.38 s > 15: start_thread<unknown>
  1411. 142.38 s > at <unknown source file>:<unknown line>
  1412. 142.38 s > 16: __clone3<unknown>
  1413. 142.38 s > at <unknown source file>:<unknown line>
  1414. 142.38 s >
  1415. 142.38 s > Run with COLORBT_SHOW_HIDDEN=1 environment variable to disable frame filtering.
  1416. 142.38 s > ... omitted 1 more lines; see full nextest output above
  1417. 142.38 s >
  1418. 142.38 s > 2. gammaloop-integration-tests::test_runs::profile_bulk::box_4e_bulk_profile_passes
  1419. 142.38 s > failure: test failure with exit code 101
  1420. 142.38 s > Error:
  1421. 142.38 s > 0: IR profiling requested arbitrary precision but received a quad-precision result
  1422. 142.38 s >
  1423. 142.38 s > Location:
  1424. 142.38 s > crates/gammalooprs/src/integrands/process/ir.rs:2123
  1425. 142.38 s >
  1426. 142.38 s > ━━━━━━━━━━━━━━━━━━━━━━━━━━━━━━━━━━ BACKTRACE ━━━━━━━━━━━━━━━━━━━━━━━━━━━━━━━━━━━
  1427. 142.38 s > 1: <color_eyre[51793ea62743adbd]::config::EyreHook>::into_eyre_hook::{closure#0}<unknown>
  1428. 142.38 s > at <unknown source file>:<unknown line>
  1429. 142.38 s > 2: eyre[cb2fd339c0c40fca]::capture_handler<unknown>
  1430. 142.38 s > at <unknown source file>:<unknown line>
  1431. 142.38 s > 3: eyre[cb2fd339c0c40fca]::private::format_err<unknown>
  1432. 142.38 s > at <unknown source file>:<unknown line>
  1433. 142.38 s > 4: gammalooprs[d7a7c067ebd19583]::integrands::process::ir::evaluate_profile_momentum_point_arb::<gammalooprs[d7a7c067ebd19583]::integrands::process::amplitude::AmplitudeIntegrand><unknown>
  1434. 142.38 s > at <unknown source file>:<unknown line>
  1435. 142.38 s > 5: <gammalooprs[d7a7c067ebd19583]::integrands::process::amplitude::AmplitudeIntegrand>::test_single_ir_limit_impl<unknown>
  1436. 142.38 s > at <unknown source file>:<unknown line>
  1437. 142.38 s > 6: gammalooprs[d7a7c067ebd19583]::integrands::process::ir::run_ir_profile::<gammalooprs[d7a7c067ebd19583]::integrands::process::amplitude::AmplitudeIntegrand, <gammalooprs[d7a7c067ebd19583]::integrands::process::amplitude::AmplitudeIntegrand>::enumerate_ir_limits, <gammalooprs[d7a7c067ebd19583]::integrands::process::amplitude::AmplitudeIntegrand>::graph_cut_definitions, <gammalooprs[d7a7c067ebd19583]::integrands::process::amplitude::AmplitudeIntegrand>::test_single_ir_limit_impl><unknown>
  1438. 142.38 s > at <unknown source file>:<unknown line>
  1439. 142.38 s > 7: <gammalooprs[d7a7c067ebd19583]::integrands::process::amplitude::AmplitudeIntegrand>::test_ir<unknown>
  1440. 142.38 s > at <unknown source file>:<unknown line>
  1441. 142.38 s > 8: <gammaloop_api[92ae732909e47e14]::commands::profile::Profile>::run<unknown>
  1442. 142.38 s > at <unknown source file>:<unknown line>
  1443. 142.38 s > 9: test_runs[3e7a390caee4e338]::profile_bulk::box_4e_bulk_profile_passes<unknown>
  1444. 142.38 s > at <unknown source file>:<unknown line>
  1445. 142.38 s > 10: <test_runs[3e7a390caee4e338]::profile_bulk::box_4e_bulk_profile_passes::{closure#0} as core[940e698046960fd5]::ops::function::FnOnce<()>>::call_once<unknown>
  1446. 142.38 s > at <unknown source file>:<unknown line>
  1447. 142.38 s > 11: test[75d6903177b1d7e9]::__rust_begin_short_backtrace::<core[940e698046960fd5]::result::Result<(), alloc[2ea6bcb46fca0c42]::string::String>, fn() -> core[940e698046960fd5]::result::Result<(), alloc[2ea6bcb46fca0c42]::string::String>><unknown>
  1448. 142.38 s > at <unknown source file>:<unknown line>
  1449. 142.38 s > 12: test[75d6903177b1d7e9]::run_test::{closure#0}<unknown>
  1450. 142.38 s > at <unknown source file>:<unknown line>
  1451. 142.38 s > 13: std[bcb96dfbba0ab899]::sys::backtrace::__rust_begin_short_backtrace::<test[75d6903177b1d7e9]::run_test::{closure#1}, ()><unknown>
  1452. 142.38 s > at <unknown source file>:<unknown line>
  1453. 142.38 s > 14: <std[bcb96dfbba0ab899]::thread::lifecycle::spawn_unchecked<test[75d6903177b1d7e9]::run_test::{closure#1}, ()>::{closure#1} as core[940e698046960fd5]::ops::function::FnOnce<()>>::call_once::{shim:vtable#0}<unknown>
  1454. 142.38 s > at <unknown source file>:<unknown line>
  1455. 142.38 s > 15: <std[bcb96dfbba0ab899]::sys::thread::unix::Thread>::new::thread_start<unknown>
  1456. 142.38 s > at <unknown source file>:<unknown line>
  1457. 142.38 s > 16: start_thread<unknown>
  1458. 142.38 s > at <unknown source file>:<unknown line>
  1459. 142.38 s > 17: __clone3<unknown>
  1460. 142.38 s > at <unknown source file>:<unknown line>
  1461. 142.38 s >
  1462. 142.38 s > Run with COLORBT_SHOW_HIDDEN=1 environment variable to disable frame filtering.
  1463. 142.38 s > Run with RUST_BACKTRACE=full to include source snippets.
  1464. 142.38 s > Warning: SpanTrace capture is Unsupported.
  1465. 142.38 s > Ensure that you've setup a tracing-error ErrorLayer and the semver versions are compatible
  1466. 142.38 s > system-out
  1467. 142.38 s > running 1 test
  1468. 142.38 s > test profile_bulk::box_4e_bulk_profile_passes ... FAILED
  1469. 142.38 s >
  1470. 142.38 s > failures:
  1471. 142.38 s >
  1472. 142.38 s > failures:
  1473. 142.38 s > profile_bulk::box_4e_bulk_profile_passes
  1474. 142.38 s >
  1475. 142.38 s > test result: FAILED. 0 passed; 1 failed; 0 ignored; 0 measured; 82 filtered out; finished in 0.46s
  1476. 142.38 s > system-err
  1477. 142.38 s > [2026-08-28 17:29:10.335] @gammaloop_api::se... INFO : Running command import model ./assets/models/json/scalars/scalars.json
  1478. 142.38 s > [2026-08-28 17:29:10.335] @import::model INFO : Loading JSON model scalars-default from /build/source/assets/models/json/scalars/scalars
  1479. 142.38 s > [2026-08-28 17:29:10.349] @gammalooprs::model INFO : The following 2 external parameters were forced to zero by the restriction card:
  1480. 142.38 s > width_scalar_1, width_scalar_2
  1481. 142.38 s > [2026-08-28 17:29:10.356] @gammaloop_api::se... INFO : Running command import graphs ./tests/resources/graphs/massless_box.dot
  1482. 142.38 s > [2026-08-28 17:29:10.356] @commands::import INFO : Loading graphs from '/build/source/tests/resources/graphs/massless_box.dot'
  1483. 142.38 s > [2026-08-28 17:29:10.374] @gammaloop_api::se... INFO : Running command generate
  1484. 142.38 s > [2026-08-28 17:29:10.584] @commands::generate INFO :
  1485. 142.38 s > Integrand generation summary
  1486. 142.38 s > peak RAM 66.96 MiB | cores 1
  1487. 142.38 s > ╭───────────┬────────────────┬─────────┬────────────┬────────────┬────────────────┬─────────────╮
  1488. 142.38 s > │ integrand │ graph │ # evals │ expr build │ spenso │ symbolica eval │ compile │
  1489. 142.38 s > ├───────────┼────────────────┼─────────┼────────────┼────────────┼────────────────┼─────────────┤
  1490. 142.38 s > │ default │ massless_box_0 │ 14 │ 94ms (79%) │ 17ms (14%) │ 7ms (6.6%) │ 0ms (0.00%) │
  1491. 142.38 s > ├───────────┼────────────────┼─────────┼────────────┼────────────┼────────────────┼─────────────┤
  1492. 142.38 s > │ Total │ │ 14 │ 94ms (79%) │ 17ms (14%) │ 7ms (6.6%) │ 0ms (0.00%) │
  1493. 142.38 s > ╰───────────┴────────────────┴─────────┴────────────┴────────────┴────────────────┴─────────────╯
  1494. 142.38 s > [2026-08-28 17:29:10.586] @process::amplitude INFO : Input is above threshold: 4 existing threshold E-surfaces across 1/1 graph groups
  1495. 142.38 s > [2026-08-28 17:29:10.591] @process::amplitude INFO : overlap structure of group 0: [2: [8(4,6), 11(5,6)], 2: [4(3,4), 9(3,5)], 2: [9(3,5), 11(5,6)], 2: [4(3,4), 8(4,6)]]
  1496. 142.38 s > Error:
  1497. 142.38 s > 0: IR profiling requested arbitrary precision but received a quad-precision result
  1498. 142.38 s >
  1499. 142.38 s > Location:
  1500. 142.38 s > crates/gammalooprs/src/integrands/process/ir.rs:2123
  1501. 142.38 s >
  1502. 142.38 s > ━━━━━━━━━━━━━━━━━━━━━━━━━━━━━━━━━━ BACKTRACE ━━━━━━━━━━━━━━━━━━━━━━━━━━━━━━━━━━━
  1503. 142.38 s > 1: <color_eyre[51793ea62743adbd]::config::EyreHook>::into_eyre_hook::{closure#0}<unknown>
  1504. 142.38 s > at <unknown source file>:<unknown line>
  1505. 142.38 s > 2: eyre[cb2fd339c0c40fca]::capture_handler<unknown>
  1506. 142.38 s > at <unknown source file>:<unknown line>
  1507. 142.38 s > 3: eyre[cb2fd339c0c40fca]::private::format_err<unknown>
  1508. 142.38 s > at <unknown source file>:<unknown line>
  1509. 142.38 s > 4: gammalooprs[d7a7c067ebd19583]::integrands::process::ir::evaluate_profile_momentum_point_arb::<gammalooprs[d7a7c067ebd19583]::integrands::process::amplitude::AmplitudeIntegrand><unknown>
  1510. 142.38 s > at <unknown source file>:<unknown line>
  1511. 142.38 s > 5: <gammalooprs[d7a7c067ebd19583]::integrands::process::amplitude::AmplitudeIntegrand>::test_single_ir_limit_impl<unknown>
  1512. 142.38 s > at <unknown source file>:<unknown line>
  1513. 142.38 s > 6: gammalooprs[d7a7c067ebd19583]::integrands::process::ir::run_ir_profile::<gammalooprs[d7a7c067ebd19583]::integrands::process::amplitude::AmplitudeIntegrand, <gammalooprs[d7a7c067ebd19583]::integrands::process::amplitude::AmplitudeIntegrand>::enumerate_ir_limits, <gammalooprs[d7a7c067ebd19583]::integrands::process::amplitude::AmplitudeIntegrand>::graph_cut_definitions, <gammalooprs[d7a7c067ebd19583]::integrands::process::amplitude::AmplitudeIntegrand>::test_single_ir_limit_impl><unknown>
  1514. 142.38 s > at <unknown source file>:<unknown line>
  1515. 142.38 s > 7: <gammalooprs[d7a7c067ebd19583]::integrands::process::amplitude::AmplitudeIntegrand>::test_ir<unknown>
  1516. 142.38 s > at <unknown source file>:<unknown line>
  1517. 142.38 s > 8: <gammaloop_api[92ae732909e47e14]::commands::profile::Profile>::run<unknown>
  1518. 142.38 s > at <unknown source file>:<unknown line>
  1519. 142.38 s > 9: test_runs[3e7a390caee4e338]::profile_bulk::box_4e_bulk_profile_passes<unknown>
  1520. 142.38 s > at <unknown source file>:<unknown line>
  1521. 142.38 s > 10: <test_runs[3e7a390caee4e338]::profile_bulk::box_4e_bulk_profile_passes::{closure#0} as core[940e698046960fd5]::ops::function::FnOnce<()>>::call_once<unknown>
  1522. 142.38 s > at <unknown source file>:<unknown line>
  1523. 142.38 s > 11: test[75d6903177b1d7e9]::__rust_begin_short_backtrace::<core[940e698046960fd5]::result::Result<(), alloc[2ea6bcb46fca0c42]::string::String>, fn() -> core[940e698046960fd5]::result::Result<(), alloc[2ea6bcb46fca0c42]::string::String>><unknown>
  1524. 142.38 s > at <unknown source file>:<unknown line>
  1525. 142.38 s > 12: test[75d6903177b1d7e9]::run_test::{closure#0}<unknown>
  1526. 142.38 s > at <unknown source file>:<unknown line>
  1527. 142.38 s > 13: std[bcb96dfbba0ab899]::sys::backtrace::__rust_begin_short_backtrace::<test[75d6903177b1d7e9]::run_test::{closure#1}, ()><unknown>
  1528. 142.38 s > at <unknown source file>:<unknown line>
  1529. 142.38 s > 14: <std[bcb96dfbba0ab899]::thread::lifecycle::spawn_unchecked<test[75d6903177b1d7e9]::run_test::{closure#1}, ()>::{closure#1} as core[940e698046960fd5]::ops::function::FnOnce<()>>::call_once::{shim:vtable#0}<unknown>
  1530. 142.38 s > at <unknown source file>:<unknown line>
  1531. 142.38 s > 15: <std[bcb96dfbba0ab899]::sys::thread::unix::Thread>::new::thread_start<unknown>
  1532. 142.38 s > at <unknown source file>:<unknown line>
  1533. 142.38 s > 16: start_thread<unknown>
  1534. 142.38 s > at <unknown source file>:<unknown line>
  1535. 142.38 s > 17: __clone3<unknown>
  1536. 142.38 s > at <unknown source file>:<unknown line>
  1537. 142.38 s >
  1538. 142.38 s > Run with COLORBT_SHOW_HIDDEN=1 environment variable to disable frame filtering.
  1539. 142.38 s > Run with RUST_BACKTRACE=full to include source snippets.
  1540. 142.38 s > Warning: SpanTrace capture is Unsupported.
  1541. 142.38 s > Ensure that you've setup a tracing-error ErrorLayer and the semver versions are compatible
  1542. 142.38 s >
  1543. 142.38 s > 3. gammaloop-integration-tests::test_runs::profile_bulk::double_dotted_bubble_amp_bulk_profile_passes
  1544. 142.38 s > failure: test failure with exit code 101
  1545. 142.38 s > Error:
  1546. 142.38 s > 0: IR profiling requested arbitrary precision but received a quad-precision result
  1547. 142.38 s >
  1548. 142.38 s > Location:
  1549. 142.38 s > crates/gammalooprs/src/integrands/process/ir.rs:2123
  1550. 142.38 s >
  1551. 142.38 s > ━━━━━━━━━━━━━━━━━━━━━━━━━━━━━━━━━━ BACKTRACE ━━━━━━━━━━━━━━━━━━━━━━━━━━━━━━━━━━━
  1552. 142.38 s > 1: <color_eyre[51793ea62743adbd]::config::EyreHook>::into_eyre_hook::{closure#0}<unknown>
  1553. 142.38 s > at <unknown source file>:<unknown line>
  1554. 142.38 s > 2: eyre[cb2fd339c0c40fca]::capture_handler<unknown>
  1555. 142.38 s > at <unknown source file>:<unknown line>
  1556. 142.38 s > 3: eyre[cb2fd339c0c40fca]::private::format_err<unknown>
  1557. 142.38 s > at <unknown source file>:<unknown line>
  1558. 142.38 s > 4: gammalooprs[d7a7c067ebd19583]::integrands::process::ir::evaluate_profile_momentum_point_arb::<gammalooprs[d7a7c067ebd19583]::integrands::process::amplitude::AmplitudeIntegrand><unknown>
  1559. 142.38 s > at <unknown source file>:<unknown line>
  1560. 142.38 s > 5: <gammalooprs[d7a7c067ebd19583]::integrands::process::amplitude::AmplitudeIntegrand>::test_single_ir_limit_impl<unknown>
  1561. 142.38 s > at <unknown source file>:<unknown line>
  1562. 142.38 s > 6: gammalooprs[d7a7c067ebd19583]::integrands::process::ir::run_ir_profile::<gammalooprs[d7a7c067ebd19583]::integrands::process::amplitude::AmplitudeIntegrand, <gammalooprs[d7a7c067ebd19583]::integrands::process::amplitude::AmplitudeIntegrand>::enumerate_ir_limits, <gammalooprs[d7a7c067ebd19583]::integrands::process::amplitude::AmplitudeIntegrand>::graph_cut_definitions, <gammalooprs[d7a7c067ebd19583]::integrands::process::amplitude::AmplitudeIntegrand>::test_single_ir_limit_impl><unknown>
  1563. 142.38 s > at <unknown source file>:<unknown line>
  1564. 142.38 s > 7: <gammalooprs[d7a7c067ebd19583]::integrands::process::amplitude::AmplitudeIntegrand>::test_ir<unknown>
  1565. 142.38 s > at <unknown source file>:<unknown line>
  1566. 142.38 s > 8: <gammaloop_api[92ae732909e47e14]::commands::profile::Profile>::run<unknown>
  1567. 142.38 s > at <unknown source file>:<unknown line>
  1568. 142.38 s > 9: test_runs[3e7a390caee4e338]::profile_bulk::double_dotted_bubble_amp_bulk_profile_passes<unknown>
  1569. 142.38 s > at <unknown source file>:<unknown line>
  1570. 142.38 s > 10: <test_runs[3e7a390caee4e338]::profile_bulk::double_dotted_bubble_amp_bulk_profile_passes::{closure#0} as core[940e698046960fd5]::ops::function::FnOnce<()>>::call_once<unknown>
  1571. 142.38 s > at <unknown source file>:<unknown line>
  1572. 142.38 s > 11: test[75d6903177b1d7e9]::__rust_begin_short_backtrace::<core[940e698046960fd5]::result::Result<(), alloc[2ea6bcb46fca0c42]::string::String>, fn() -> core[940e698046960fd5]::result::Result<(), alloc[2ea6bcb46fca0c42]::string::String>><unknown>
  1573. 142.38 s > at <unknown source file>:<unknown line>
  1574. 142.38 s > 12: test[75d6903177b1d7e9]::run_test::{closure#0}<unknown>
  1575. 142.38 s > at <unknown source file>:<unknown line>
  1576. 142.38 s > 13: std[bcb96dfbba0ab899]::sys::backtrace::__rust_begin_short_backtrace::<test[75d6903177b1d7e9]::run_test::{closure#1}, ()><unknown>
  1577. 142.38 s > at <unknown source file>:<unknown line>
  1578. 142.38 s > 14: <std[bcb96dfbba0ab899]::thread::lifecycle::spawn_unchecked<test[75d6903177b1d7e9]::run_test::{closure#1}, ()>::{closure#1} as core[940e698046960fd5]::ops::function::FnOnce<()>>::call_once::{shim:vtable#0}<unknown>
  1579. 142.38 s > at <unknown source file>:<unknown line>
  1580. 142.38 s > 15: <std[bcb96dfbba0ab899]::sys::thread::unix::Thread>::new::thread_start<unknown>
  1581. 142.38 s > at <unknown source file>:<unknown line>
  1582. 142.38 s > 16: start_thread<unknown>
  1583. 142.38 s > at <unknown source file>:<unknown line>
  1584. 142.38 s > 17: __clone3<unknown>
  1585. 142.38 s > at <unknown source file>:<unknown line>
  1586. 142.38 s >
  1587. 142.38 s > Run with COLORBT_SHOW_HIDDEN=1 environment variable to disable frame filtering.
  1588. 142.38 s > Run with RUST_BACKTRACE=full to include source snippets.
  1589. 142.38 s > Warning: SpanTrace capture is Unsupported.
  1590. 142.38 s > Ensure that you've setup a tracing-error ErrorLayer and the semver versions are compatible
  1591. 142.38 s > system-out
  1592. 142.38 s > running 1 test
  1593. 142.38 s > test profile_bulk::double_dotted_bubble_amp_bulk_profile_passes ... FAILED
  1594. 142.38 s >
  1595. 142.38 s > failures:
  1596. 142.38 s >
  1597. 142.38 s > failures:
  1598. 142.38 s > profile_bulk::double_dotted_bubble_amp_bulk_profile_passes
  1599. 142.38 s >
  1600. 142.38 s > test result: FAILED. 0 passed; 1 failed; 0 ignored; 0 measured; 82 filtered out; finished in 0.31s
  1601. 142.38 s > system-err
  1602. 142.38 s > [2026-08-28 17:29:10.623] @gammaloop_api::se... INFO : Running command import model ./assets/models/json/scalars/scalars_2p_3p.json
  1603. 142.38 s > [2026-08-28 17:29:10.623] @import::model INFO : Loading JSON model scalars_2p_3p-default from /build/source/assets/models/json/scalars/scalars_2p_3p
  1604. 142.38 s > [2026-08-28 17:29:10.624] @gammaloop_api::se... INFO : Running command import graphs ./tests/resources/graphs/double_dotted_bubble_amp.dot
  1605. 142.38 s > [2026-08-28 17:29:10.624] @commands::import INFO : Loading graphs from '/build/source/tests/resources/graphs/double_dotted_bubble_amp.dot'
  1606. 142.38 s > [2026-08-28 17:29:10.627] @gammaloop_api::se... INFO : Running command generate
  1607. 142.38 s > [2026-08-28 17:29:10.774] @commands::generate INFO :
  1608. 142.38 s > Integrand generation summary
  1609. 142.38 s > peak RAM 63.93 MiB | cores 1
  1610. 142.38 s > ╭───────────┬──────────────────────────┬─────────┬────────────┬────────────┬────────────────┬─────────────╮
  1611. 142.38 s > │ integrand │ graph │ # evals │ expr build │ spenso │ symbolica eval │ compile │
  1612. 142.38 s > ├───────────┼──────────────────────────┼─────────┼────────────┼────────────┼────────────────┼─────────────┤
  1613. 142.38 s > │ default │ double_dotted_bubble_amp │ 11 │ 80ms (82%) │ 4ms (5.0%) │ 12ms (13%) │ 0ms (0.00%) │
  1614. 142.38 s > ├───────────┼──────────────────────────┼─────────┼────────────┼────────────┼────────────────┼─────────────┤
  1615. 142.38 s > │ Total │ │ 11 │ 80ms (82%) │ 4ms (5.0%) │ 12ms (13%) │ 0ms (0.00%) │
  1616. 142.38 s > ╰───────────┴──────────────────────────┴─────────┴────────────┴────────────┴────────────────┴─────────────╯
  1617. 142.38 s > [2026-08-28 17:29:10.775] @process::amplitude INFO : Input is above threshold: 1 existing threshold E-surfaces across 1/1 graph groups
  1618. 142.38 s > [2026-08-28 17:29:10.775] @process::amplitude INFO : overlap structure of group 0: [1: [1(1,4)]]
  1619. 142.38 s > Error:
  1620. 142.38 s > 0: IR profiling requested arbitrary precision but received a quad-precision result
  1621. 142.38 s >
  1622. 142.38 s > Location:
  1623. 142.38 s > crates/gammalooprs/src/integrands/process/ir.rs:2123
  1624. 142.38 s >
  1625. 142.38 s > ━━━━━━━━━━━━━━━━━━━━━━━━━━━━━━━━━━ BACKTRACE ━━━━━━━━━━━━━━━━━━━━━━━━━━━━━━━━━━━
  1626. 142.38 s > 1: <color_eyre[51793ea62743adbd]::config::EyreHook>::into_eyre_hook::{closure#0}<unknown>
  1627. 142.38 s > at <unknown source file>:<unknown line>
  1628. 142.38 s > 2: eyre[cb2fd339c0c40fca]::capture_handler<unknown>
  1629. 142.38 s > at <unknown source file>:<unknown line>
  1630. 142.38 s > 3: eyre[cb2fd339c0c40fca]::private::format_err<unknown>
  1631. 142.38 s > at <unknown source file>:<unknown line>
  1632. 142.38 s > 4: gammalooprs[d7a7c067ebd19583]::integrands::process::ir::evaluate_profile_momentum_point_arb::<gammalooprs[d7a7c067ebd19583]::integrands::process::amplitude::AmplitudeIntegrand><unknown>
  1633. 142.38 s > at <unknown source file>:<unknown line>
  1634. 142.38 s > 5: <gammalooprs[d7a7c067ebd19583]::integrands::process::amplitude::AmplitudeIntegrand>::test_single_ir_limit_impl<unknown>
  1635. 142.38 s > at <unknown source file>:<unknown line>
  1636. 142.38 s > 6: gammalooprs[d7a7c067ebd19583]::integrands::process::ir::run_ir_profile::<gammalooprs[d7a7c067ebd19583]::integrands::process::amplitude::AmplitudeIntegrand, <gammalooprs[d7a7c067ebd19583]::integrands::process::amplitude::AmplitudeIntegrand>::enumerate_ir_limits, <gammalooprs[d7a7c067ebd19583]::integrands::process::amplitude::AmplitudeIntegrand>::graph_cut_definitions, <gammalooprs[d7a7c067ebd19583]::integrands::process::amplitude::AmplitudeIntegrand>::test_single_ir_limit_impl><unknown>
  1637. 142.38 s > at <unknown source file>:<unknown line>
  1638. 142.38 s > 7: <gammalooprs[d7a7c067ebd19583]::integrands::process::amplitude::AmplitudeIntegrand>::test_ir<unknown>
  1639. 142.38 s > at <unknown source file>:<unknown line>
  1640. 142.38 s > 8: <gammaloop_api[92ae732909e47e14]::commands::profile::Profile>::run<unknown>
  1641. 142.38 s > at <unknown source file>:<unknown line>
  1642. 142.38 s > 9: test_runs[3e7a390caee4e338]::profile_bulk::double_dotted_bubble_amp_bulk_profile_passes<unknown>
  1643. 142.38 s > at <unknown source file>:<unknown line>
  1644. 142.38 s > 10: <test_runs[3e7a390caee4e338]::profile_bulk::double_dotted_bubble_amp_bulk_profile_passes::{closure#0} as core[940e698046960fd5]::ops::function::FnOnce<()>>::call_once<unknown>
  1645. 142.38 s > at <unknown source file>:<unknown line>
  1646. 142.38 s > 11: test[75d6903177b1d7e9]::__rust_begin_short_backtrace::<core[940e698046960fd5]::result::Result<(), alloc[2ea6bcb46fca0c42]::string::String>, fn() -> core[940e698046960fd5]::result::Result<(), alloc[2ea6bcb46fca0c42]::string::String>><unknown>
  1647. 142.38 s > at <unknown source file>:<unknown line>
  1648. 142.38 s > 12: test[75d6903177b1d7e9]::run_test::{closure#0}<unknown>
  1649. 142.38 s > at <unknown source file>:<unknown line>
  1650. 142.38 s > 13: std[bcb96dfbba0ab899]::sys::backtrace::__rust_begin_short_backtrace::<test[75d6903177b1d7e9]::run_test::{closure#1}, ()><unknown>
  1651. 142.38 s > at <unknown source file>:<unknown line>
  1652. 142.38 s > 14: <std[bcb96dfbba0ab899]::thread::lifecycle::spawn_unchecked<test[75d6903177b1d7e9]::run_test::{closure#1}, ()>::{closure#1} as core[940e698046960fd5]::ops::function::FnOnce<()>>::call_once::{shim:vtable#0}<unknown>
  1653. 142.38 s > at <unknown source file>:<unknown line>
  1654. 142.38 s > 15: <std[bcb96dfbba0ab899]::sys::thread::unix::Thread>::new::thread_start<unknown>
  1655. 142.38 s > at <unknown source file>:<unknown line>
  1656. 142.38 s > 16: start_thread<unknown>
  1657. 142.38 s > at <unknown source file>:<unknown line>
  1658. 142.38 s > 17: __clone3<unknown>
  1659. 142.38 s > at <unknown source file>:<unknown line>
  1660. 142.38 s >
  1661. 142.38 s > Run with COLORBT_SHOW_HIDDEN=1 environment variable to disable frame filtering.
  1662. 142.38 s > Run with RUST_BACKTRACE=full to include source snippets.
  1663. 142.38 s > Warning: SpanTrace capture is Unsupported.
  1664. 142.38 s > Ensure that you've setup a tracing-error ErrorLayer and the semver versions are compatible
  1665. 142.38 s >
  1666. 142.38 s > 4. gammaloop-integration-tests::test_runs::profile_bulk::dotted_bubble_amp_bulk_profile_passes
  1667. 142.38 s > failure: test failure with exit code 101
  1668. 142.38 s > Error:
  1669. 142.38 s > 0: IR profiling requested arbitrary precision but received a quad-precision result
  1670. 142.38 s >
  1671. 142.38 s > Location:
  1672. 142.38 s > crates/gammalooprs/src/integrands/process/ir.rs:2123
  1673. 142.38 s >
  1674. 142.38 s > ━━━━━━━━━━━━━━━━━━━━━━━━━━━━━━━━━━ BACKTRACE ━━━━━━━━━━━━━━━━━━━━━━━━━━━━━━━━━━━
  1675. 142.38 s > 1: <color_eyre[51793ea62743adbd]::config::EyreHook>::into_eyre_hook::{closure#0}<unknown>
  1676. 142.38 s > at <unknown source file>:<unknown line>
  1677. 142.38 s > 2: eyre[cb2fd339c0c40fca]::capture_handler<unknown>
  1678. 142.38 s > at <unknown source file>:<unknown line>
  1679. 142.38 s > 3: eyre[cb2fd339c0c40fca]::private::format_err<unknown>
  1680. 142.38 s > at <unknown source file>:<unknown line>
  1681. 142.38 s > 4: gammalooprs[d7a7c067ebd19583]::integrands::process::ir::evaluate_profile_momentum_point_arb::<gammalooprs[d7a7c067ebd19583]::integrands::process::amplitude::AmplitudeIntegrand><unknown>
  1682. 142.38 s > at <unknown source file>:<unknown line>
  1683. 142.38 s > 5: <gammalooprs[d7a7c067ebd19583]::integrands::process::amplitude::AmplitudeIntegrand>::test_single_ir_limit_impl<unknown>
  1684. 142.38 s > at <unknown source file>:<unknown line>
  1685. 142.38 s > 6: gammalooprs[d7a7c067ebd19583]::integrands::process::ir::run_ir_profile::<gammalooprs[d7a7c067ebd19583]::integrands::process::amplitude::AmplitudeIntegrand, <gammalooprs[d7a7c067ebd19583]::integrands::process::amplitude::AmplitudeIntegrand>::enumerate_ir_limits, <gammalooprs[d7a7c067ebd19583]::integrands::process::amplitude::AmplitudeIntegrand>::graph_cut_definitions, <gammalooprs[d7a7c067ebd19583]::integrands::process::amplitude::AmplitudeIntegrand>::test_single_ir_limit_impl><unknown>
  1686. 142.38 s > at <unknown source file>:<unknown line>
  1687. 142.38 s > 7: <gammalooprs[d7a7c067ebd19583]::integrands::process::amplitude::AmplitudeIntegrand>::test_ir<unknown>
  1688. 142.38 s > at <unknown source file>:<unknown line>
  1689. 142.38 s > 8: <gammaloop_api[92ae732909e47e14]::commands::profile::Profile>::run<unknown>
  1690. 142.38 s > at <unknown source file>:<unknown line>
  1691. 142.38 s > 9: test_runs[3e7a390caee4e338]::profile_bulk::dotted_bubble_amp_bulk_profile_passes<unknown>
  1692. 142.38 s > at <unknown source file>:<unknown line>
  1693. 142.38 s > 10: <test_runs[3e7a390caee4e338]::profile_bulk::dotted_bubble_amp_bulk_profile_passes::{closure#0} as core[940e698046960fd5]::ops::function::FnOnce<()>>::call_once<unknown>
  1694. 142.38 s > at <unknown source file>:<unknown line>
  1695. 142.38 s > 11: test[75d6903177b1d7e9]::__rust_begin_short_backtrace::<core[940e698046960fd5]::result::Result<(), alloc[2ea6bcb46fca0c42]::string::String>, fn() -> core[940e698046960fd5]::result::Result<(), alloc[2ea6bcb46fca0c42]::string::String>><unknown>
  1696. 142.38 s > at <unknown source file>:<unknown line>
  1697. 142.38 s > 12: test[75d6903177b1d7e9]::run_test::{closure#0}<unknown>
  1698. 142.38 s > at <unknown source file>:<unknown line>
  1699. 142.38 s > 13: std[bcb96dfbba0ab899]::sys::backtrace::__rust_begin_short_backtrace::<test[75d6903177b1d7e9]::run_test::{closure#1}, ()><unknown>
  1700. 142.38 s > at <unknown source file>:<unknown line>
  1701. 142.38 s > 14: <std[bcb96dfbba0ab899]::thread::lifecycle::spawn_unchecked<test[75d6903177b1d7e9]::run_test::{closure#1}, ()>::{closure#1} as core[940e698046960fd5]::ops::function::FnOnce<()>>::call_once::{shim:vtable#0}<unknown>
  1702. 142.38 s > at <unknown source file>:<unknown line>
  1703. 142.38 s > 15: <std[bcb96dfbba0ab899]::sys::thread::unix::Thread>::new::thread_start<unknown>
  1704. 142.38 s > at <unknown source file>:<unknown line>
  1705. 142.38 s > 16: start_thread<unknown>
  1706. 142.38 s > at <unknown source file>:<unknown line>
  1707. 142.38 s > 17: __clone3<unknown>
  1708. 142.38 s > at <unknown source file>:<unknown line>
  1709. 142.38 s >
  1710. 142.38 s > Run with COLORBT_SHOW_HIDDEN=1 environment variable to disable frame filtering.
  1711. 142.38 s > Run with RUST_BACKTRACE=full to include source snippets.
  1712. 142.38 s > Warning: SpanTrace capture is Unsupported.
  1713. 142.38 s > Ensure that you've setup a tracing-error ErrorLayer and the semver versions are compatible
  1714. 142.38 s > system-out
  1715. 142.38 s > running 1 test
  1716. 142.38 s > test profile_bulk::dotted_bubble_amp_bulk_profile_passes ... FAILED
  1717. 142.38 s >
  1718. 142.38 s > failures:
  1719. 142.38 s >
  1720. 142.38 s > failures:
  1721. 142.38 s > profile_bulk::dotted_bubble_amp_bulk_profile_passes
  1722. 142.38 s >
  1723. 142.38 s > test result: FAILED. 0 passed; 1 failed; 0 ignored; 0 measured; 82 filtered out; finished in 0.40s
  1724. 142.38 s > system-err
  1725. 142.38 s > [2026-08-28 17:29:10.694] @gammaloop_api::se... INFO : Running command import model ./assets/models/json/scalars/scalars_2p_3p.json
  1726. 142.38 s > [2026-08-28 17:29:10.694] @import::model INFO : Loading JSON model scalars_2p_3p-default from /build/source/assets/models/json/scalars/scalars_2p_3p
  1727. 142.38 s > [2026-08-28 17:29:10.696] @gammaloop_api::se... INFO : Running command import graphs ./tests/resources/graphs/dotted_bubble_amp.dot
  1728. 142.38 s > [2026-08-28 17:29:10.696] @commands::import INFO : Loading graphs from '/build/source/tests/resources/graphs/dotted_bubble_amp.dot'
  1729. 142.38 s > [2026-08-28 17:29:10.699] @gammaloop_api::se... INFO : Running command generate
  1730. 142.38 s > [2026-08-28 17:29:10.808] @commands::generate INFO :
  1731. 142.38 s > Integrand generation summary
  1732. 142.38 s > peak RAM 65.55 MiB | cores 1
  1733. 142.38 s > ╭───────────┬───────────────────┬─────────┬────────────┬────────────┬────────────────┬─────────────╮
  1734. 142.38 s > │ integrand │ graph │ # evals │ expr build │ spenso │ symbolica eval │ compile │
  1735. 142.38 s > ├───────────┼───────────────────┼─────────┼────────────┼────────────┼────────────────┼─────────────┤
  1736. 142.38 s > │ default │ dotted_bubble_amp │ 8 │ 12ms (56%) │ 1ms (5.7%) │ 8ms (38%) │ 0ms (0.00%) │
  1737. 142.38 s > ├───────────┼───────────────────┼─────────┼────────────┼────────────┼────────────────┼─────────────┤
  1738. 142.38 s > │ Total │ │ 8 │ 12ms (56%) │ 1ms (5.7%) │ 8ms (38%) │ 0ms (0.00%) │
  1739. 142.38 s > ╰───────────┴───────────────────┴─────────┴────────────┴────────────┴────────────────┴─────────────╯
  1740. 142.38 s > [2026-08-28 17:29:10.809] @process::amplitude INFO : Input is above threshold: 1 existing threshold E-surfaces across 1/1 graph groups
  1741. 142.38 s > [2026-08-28 17:29:10.809] @process::amplitude INFO : overlap structure of group 0: [1: [1(1,3)]]
  1742. 142.38 s > Error:
  1743. 142.38 s > 0: IR profiling requested arbitrary precision but received a quad-precision result
  1744. 142.38 s >
  1745. 142.38 s > Location:
  1746. 142.38 s > crates/gammalooprs/src/integrands/process/ir.rs:2123
  1747. 142.38 s >
  1748. 142.38 s > ━━━━━━━━━━━━━━━━━━━━━━━━━━━━━━━━━━ BACKTRACE ━━━━━━━━━━━━━━━━━━━━━━━━━━━━━━━━━━━
  1749. 142.38 s > 1: <color_eyre[51793ea62743adbd]::config::EyreHook>::into_eyre_hook::{closure#0}<unknown>
  1750. 142.38 s > at <unknown source file>:<unknown line>
  1751. 142.38 s > 2: eyre[cb2fd339c0c40fca]::capture_handler<unknown>
  1752. 142.38 s > at <unknown source file>:<unknown line>
  1753. 142.38 s > 3: eyre[cb2fd339c0c40fca]::private::format_err<unknown>
  1754. 142.38 s > at <unknown source file>:<unknown line>
  1755. 142.38 s > 4: gammalooprs[d7a7c067ebd19583]::integrands::process::ir::evaluate_profile_momentum_point_arb::<gammalooprs[d7a7c067ebd19583]::integrands::process::amplitude::AmplitudeIntegrand><unknown>
  1756. 142.38 s > at <unknown source file>:<unknown line>
  1757. 142.38 s > 5: <gammalooprs[d7a7c067ebd19583]::integrands::process::amplitude::AmplitudeIntegrand>::test_single_ir_limit_impl<unknown>
  1758. 142.38 s > at <unknown source file>:<unknown line>
  1759. 142.38 s > 6: gammalooprs[d7a7c067ebd19583]::integrands::process::ir::run_ir_profile::<gammalooprs[d7a7c067ebd19583]::integrands::process::amplitude::AmplitudeIntegrand, <gammalooprs[d7a7c067ebd19583]::integrands::process::amplitude::AmplitudeIntegrand>::enumerate_ir_limits, <gammalooprs[d7a7c067ebd19583]::integrands::process::amplitude::AmplitudeIntegrand>::graph_cut_definitions, <gammalooprs[d7a7c067ebd19583]::integrands::process::amplitude::AmplitudeIntegrand>::test_single_ir_limit_impl><unknown>
  1760. 142.38 s > at <unknown source file>:<unknown line>
  1761. 142.38 s > 7: <gammalooprs[d7a7c067ebd19583]::integrands::process::amplitude::AmplitudeIntegrand>::test_ir<unknown>
  1762. 142.38 s > at <unknown source file>:<unknown line>
  1763. 142.38 s > 8: <gammaloop_api[92ae732909e47e14]::commands::profile::Profile>::run<unknown>
  1764. 142.38 s > at <unknown source file>:<unknown line>
  1765. 142.38 s > 9: test_runs[3e7a390caee4e338]::profile_bulk::dotted_bubble_amp_bulk_profile_passes<unknown>
  1766. 142.38 s > at <unknown source file>:<unknown line>
  1767. 142.38 s > 10: <test_runs[3e7a390caee4e338]::profile_bulk::dotted_bubble_amp_bulk_profile_passes::{closure#0} as core[940e698046960fd5]::ops::function::FnOnce<()>>::call_once<unknown>
  1768. 142.38 s > at <unknown source file>:<unknown line>
  1769. 142.38 s > 11: test[75d6903177b1d7e9]::__rust_begin_short_backtrace::<core[940e698046960fd5]::result::Result<(), alloc[2ea6bcb46fca0c42]::string::String>, fn() -> core[940e698046960fd5]::result::Result<(), alloc[2ea6bcb46fca0c42]::string::String>><unknown>
  1770. 142.38 s > at <unknown source file>:<unknown line>
  1771. 142.38 s > 12: test[75d6903177b1d7e9]::run_test::{closure#0}<unknown>
  1772. 142.38 s > at <unknown source file>:<unknown line>
  1773. 142.38 s > 13: std[bcb96dfbba0ab899]::sys::backtrace::__rust_begin_short_backtrace::<test[75d6903177b1d7e9]::run_test::{closure#1}, ()><unknown>
  1774. 142.38 s > at <unknown source file>:<unknown line>
  1775. 142.38 s > 14: <std[bcb96dfbba0ab899]::thread::lifecycle::spawn_unchecked<test[75d6903177b1d7e9]::run_test::{closure#1}, ()>::{closure#1} as core[940e698046960fd5]::ops::function::FnOnce<()>>::call_once::{shim:vtable#0}<unknown>
  1776. 142.38 s > at <unknown source file>:<unknown line>
  1777. 142.38 s > 15: <std[bcb96dfbba0ab899]::sys::thread::unix::Thread>::new::thread_start<unknown>
  1778. 142.38 s > at <unknown source file>:<unknown line>
  1779. 142.38 s > 16: start_thread<unknown>
  1780. 142.38 s > at <unknown source file>:<unknown line>
  1781. 142.38 s > 17: __clone3<unknown>
  1782. 142.38 s > at <unknown source file>:<unknown line>
  1783. 142.38 s >
  1784. 142.38 s > Run with COLORBT_SHOW_HIDDEN=1 environment variable to disable frame filtering.
  1785. 142.38 s > Run with RUST_BACKTRACE=full to include source snippets.
  1786. 142.38 s > Warning: SpanTrace capture is Unsupported.
  1787. 142.38 s > Ensure that you've setup a tracing-error ErrorLayer and the semver versions are compatible
  1788. 142.38 s >
  1789. 142.38 s > 5. gammaloop-integration-tests::test_runs::profile_bulk::massless_triangle_bulk_profile_passes
  1790. 142.38 s > failure: test failure with exit code 101
  1791. 142.38 s > Error:
  1792. 142.38 s > 0: IR profiling requested arbitrary precision but received a quad-precision result
  1793. 142.38 s >
  1794. 142.38 s > Location:
  1795. 142.38 s > crates/gammalooprs/src/integrands/process/ir.rs:2123
  1796. 142.38 s >
  1797. 142.38 s > ━━━━━━━━━━━━━━━━━━━━━━━━━━━━━━━━━━ BACKTRACE ━━━━━━━━━━━━━━━━━━━━━━━━━━━━━━━━━━━
  1798. 142.38 s > 1: <color_eyre[51793ea62743adbd]::config::EyreHook>::into_eyre_hook::{closure#0}<unknown>
  1799. 142.38 s > at <unknown source file>:<unknown line>
  1800. 142.38 s > 2: eyre[cb2fd339c0c40fca]::capture_handler<unknown>
  1801. 142.38 s > at <unknown source file>:<unknown line>
  1802. 142.38 s > 3: eyre[cb2fd339c0c40fca]::private::format_err<unknown>
  1803. 142.38 s > at <unknown source file>:<unknown line>
  1804. 142.38 s > 4: gammalooprs[d7a7c067ebd19583]::integrands::process::ir::evaluate_profile_momentum_point_arb::<gammalooprs[d7a7c067ebd19583]::integrands::process::amplitude::AmplitudeIntegrand><unknown>
  1805. 142.38 s > at <unknown source file>:<unknown line>
  1806. 142.38 s > 5: <gammalooprs[d7a7c067ebd19583]::integrands::process::amplitude::AmplitudeIntegrand>::test_single_ir_limit_impl<unknown>
  1807. 142.38 s > at <unknown source file>:<unknown line>
  1808. 142.38 s > 6: gammalooprs[d7a7c067ebd19583]::integrands::process::ir::run_ir_profile::<gammalooprs[d7a7c067ebd19583]::integrands::process::amplitude::AmplitudeIntegrand, <gammalooprs[d7a7c067ebd19583]::integrands::process::amplitude::AmplitudeIntegrand>::enumerate_ir_limits, <gammalooprs[d7a7c067ebd19583]::integrands::process::amplitude::AmplitudeIntegrand>::graph_cut_definitions, <gammalooprs[d7a7c067ebd19583]::integrands::process::amplitude::AmplitudeIntegrand>::test_single_ir_limit_impl><unknown>
  1809. 142.38 s > at <unknown source file>:<unknown line>
  1810. 142.38 s > 7: <gammalooprs[d7a7c067ebd19583]::integrands::process::amplitude::AmplitudeIntegrand>::test_ir<unknown>
  1811. 142.38 s > at <unknown source file>:<unknown line>
  1812. 142.38 s > 8: <gammaloop_api[92ae732909e47e14]::commands::profile::Profile>::run<unknown>
  1813. 142.38 s > at <unknown source file>:<unknown line>
  1814. 142.38 s > 9: test_runs[3e7a390caee4e338]::profile_bulk::massless_triangle_bulk_profile_passes<unknown>
  1815. 142.38 s > at <unknown source file>:<unknown line>
  1816. 142.38 s > 10: <test_runs[3e7a390caee4e338]::profile_bulk::massless_triangle_bulk_profile_passes::{closure#0} as core[940e698046960fd5]::ops::function::FnOnce<()>>::call_once<unknown>
  1817. 142.38 s > at <unknown source file>:<unknown line>
  1818. 142.38 s > 11: test[75d6903177b1d7e9]::__rust_begin_short_backtrace::<core[940e698046960fd5]::result::Result<(), alloc[2ea6bcb46fca0c42]::string::String>, fn() -> core[940e698046960fd5]::result::Result<(), alloc[2ea6bcb46fca0c42]::string::String>><unknown>
  1819. 142.38 s > at <unknown source file>:<unknown line>
  1820. 142.38 s > 12: test[75d6903177b1d7e9]::run_test::{closure#0}<unknown>
  1821. 142.38 s > at <unknown source file>:<unknown line>
  1822. 142.38 s > 13: std[bcb96dfbba0ab899]::sys::backtrace::__rust_begin_short_backtrace::<test[75d6903177b1d7e9]::run_test::{closure#1}, ()><unknown>
  1823. 142.38 s > at <unknown source file>:<unknown line>
  1824. 142.38 s > 14: <std[bcb96dfbba0ab899]::thread::lifecycle::spawn_unchecked<test[75d6903177b1d7e9]::run_test::{closure#1}, ()>::{closure#1} as core[940e698046960fd5]::ops::function::FnOnce<()>>::call_once::{shim:vtable#0}<unknown>
  1825. 142.38 s > at <unknown source file>:<unknown line>
  1826. 142.38 s > 15: <std[bcb96dfbba0ab899]::sys::thread::unix::Thread>::new::thread_start<unknown>
  1827. 142.38 s > at <unknown source file>:<unknown line>
  1828. 142.38 s > 16: start_thread<unknown>
  1829. 142.38 s > at <unknown source file>:<unknown line>
  1830. 142.38 s > 17: __clone3<unknown>
  1831. 142.38 s > at <unknown source file>:<unknown line>
  1832. 142.38 s >
  1833. 142.38 s > Run with COLORBT_SHOW_HIDDEN=1 environment variable to disable frame filtering.
  1834. 142.38 s > Run with RUST_BACKTRACE=full to include source snippets.
  1835. 142.38 s > Warning: SpanTrace capture is Unsupported.
  1836. 142.38 s > Ensure that you've setup a tracing-error ErrorLayer and the semver versions are compatible
  1837. 142.38 s > system-out
  1838. 142.38 s > running 1 test
  1839. 142.38 s > test profile_bulk::massless_triangle_bulk_profile_passes ... FAILED
  1840. 142.38 s >
  1841. 142.38 s > failures:
  1842. 142.38 s >
  1843. 142.38 s > failures:
  1844. 142.38 s > profile_bulk::massless_triangle_bulk_profile_passes
  1845. 142.38 s >
  1846. 142.38 s > test result: FAILED. 0 passed; 1 failed; 0 ignored; 0 measured; 82 filtered out; finished in 0.39s
  1847. 142.38 s > system-err
  1848. 142.38 s > [2026-08-28 17:29:10.911] @gammaloop_api::se... INFO : Running command import model scalars
  1849. 142.38 s > [2026-08-28 17:29:10.911] @import::model INFO : Loading built-in JSON model scalars-default
  1850. 142.38 s > [2026-08-28 17:29:10.915] @gammalooprs::model INFO : The following 2 external parameters were forced to zero by the restriction card:
  1851. 142.38 s > width_scalar_1, width_scalar_2
  1852. 142.38 s > [2026-08-28 17:29:10.916] @gammaloop_api::se... INFO : Running command import graphs ./tests/resources/graphs/massless_triangle.dot
  1853. 142.38 s > [2026-08-28 17:29:10.916] @commands::import INFO : Loading graphs from '/build/source/tests/resources/graphs/massless_triangle.dot'
  1854. 142.38 s > [2026-08-28 17:29:10.922] @gammaloop_api::se... INFO : Running command generate
  1855. 142.38 s > [2026-08-28 17:29:11.032] @commands::generate INFO :
  1856. 142.38 s > Integrand generation summary
  1857. 142.38 s > peak RAM 63.79 MiB | cores 1
  1858. 142.38 s > ╭───────────┬─────────────────────┬─────────┬────────────┬────────────┬────────────────┬─────────────╮
  1859. 142.38 s > │ integrand │ graph │ # evals │ expr build │ spenso │ symbolica eval │ compile │
  1860. 142.38 s > ├───────────┼─────────────────────┼─────────┼────────────┼────────────┼────────────────┼─────────────┤
  1861. 142.38 s > │ default │ massless_triangle_0 │ 9 │ 45ms (67%) │ 11ms (18%) │ 9ms (15%) │ 0ms (0.00%) │
  1862. 142.38 s > ├───────────┼─────────────────────┼─────────┼────────────┼────────────┼────────────────┼─────────────┤
  1863. 142.38 s > │ Total │ │ 9 │ 45ms (67%) │ 11ms (18%) │ 9ms (15%) │ 0ms (0.00%) │
  1864. 142.38 s > ╰───────────┴─────────────────────┴─────────┴────────────┴────────────┴────────────────┴─────────────╯
  1865. 142.38 s > [2026-08-28 17:29:11.033] @process::amplitude INFO : Input is above threshold: 2 existing threshold E-surfaces across 1/1 graph groups
  1866. 142.38 s > [2026-08-28 17:29:11.033] @process::amplitude INFO : overlap structure of group 0: [2: [0(1,5), 1(1,3)]]
  1867. 142.38 s > Error:
  1868. 142.38 s > 0: IR profiling requested arbitrary precision but received a quad-precision result
  1869. 142.38 s >
  1870. 142.38 s > Location:
  1871. 142.38 s > crates/gammalooprs/src/integrands/process/ir.rs:2123
  1872. 142.38 s >
  1873. 142.38 s > ━━━━━━━━━━━━━━━━━━━━━━━━━━━━━━━━━━ BACKTRACE ━━━━━━━━━━━━━━━━━━━━━━━━━━━━━━━━━━━
  1874. 142.38 s > 1: <color_eyre[51793ea62743adbd]::config::EyreHook>::into_eyre_hook::{closure#0}<unknown>
  1875. 142.38 s > at <unknown source file>:<unknown line>
  1876. 142.38 s > 2: eyre[cb2fd339c0c40fca]::capture_handler<unknown>
  1877. 142.38 s > at <unknown source file>:<unknown line>
  1878. 142.38 s > 3: eyre[cb2fd339c0c40fca]::private::format_err<unknown>
  1879. 142.38 s > at <unknown source file>:<unknown line>
  1880. 142.38 s > 4: gammalooprs[d7a7c067ebd19583]::integrands::process::ir::evaluate_profile_momentum_point_arb::<gammalooprs[d7a7c067ebd19583]::integrands::process::amplitude::AmplitudeIntegrand><unknown>
  1881. 142.38 s > at <unknown source file>:<unknown line>
  1882. 142.38 s > 5: <gammalooprs[d7a7c067ebd19583]::integrands::process::amplitude::AmplitudeIntegrand>::test_single_ir_limit_impl<unknown>
  1883. 142.38 s > at <unknown source file>:<unknown line>
  1884. 142.38 s > 6: gammalooprs[d7a7c067ebd19583]::integrands::process::ir::run_ir_profile::<gammalooprs[d7a7c067ebd19583]::integrands::process::amplitude::AmplitudeIntegrand, <gammalooprs[d7a7c067ebd19583]::integrands::process::amplitude::AmplitudeIntegrand>::enumerate_ir_limits, <gammalooprs[d7a7c067ebd19583]::integrands::process::amplitude::AmplitudeIntegrand>::graph_cut_definitions, <gammalooprs[d7a7c067ebd19583]::integrands::process::amplitude::AmplitudeIntegrand>::test_single_ir_limit_impl><unknown>
  1885. 142.38 s > at <unknown source file>:<unknown line>
  1886. 142.38 s > 7: <gammalooprs[d7a7c067ebd19583]::integrands::process::amplitude::AmplitudeIntegrand>::test_ir<unknown>
  1887. 142.38 s > at <unknown source file>:<unknown line>
  1888. 142.38 s > 8: <gammaloop_api[92ae732909e47e14]::commands::profile::Profile>::run<unknown>
  1889. 142.38 s > at <unknown source file>:<unknown line>
  1890. 142.38 s > 9: test_runs[3e7a390caee4e338]::profile_bulk::massless_triangle_bulk_profile_passes<unknown>
  1891. 142.38 s > at <unknown source file>:<unknown line>
  1892. 142.38 s > 10: <test_runs[3e7a390caee4e338]::profile_bulk::massless_triangle_bulk_profile_passes::{closure#0} as core[940e698046960fd5]::ops::function::FnOnce<()>>::call_once<unknown>
  1893. 142.38 s > at <unknown source file>:<unknown line>
  1894. 142.38 s > 11: test[75d6903177b1d7e9]::__rust_begin_short_backtrace::<core[940e698046960fd5]::result::Result<(), alloc[2ea6bcb46fca0c42]::string::String>, fn() -> core[940e698046960fd5]::result::Result<(), alloc[2ea6bcb46fca0c42]::string::String>><unknown>
  1895. 142.38 s > at <unknown source file>:<unknown line>
  1896. 142.38 s > 12: test[75d6903177b1d7e9]::run_test::{closure#0}<unknown>
  1897. 142.38 s > at <unknown source file>:<unknown line>
  1898. 142.38 s > 13: std[bcb96dfbba0ab899]::sys::backtrace::__rust_begin_short_backtrace::<test[75d6903177b1d7e9]::run_test::{closure#1}, ()><unknown>
  1899. 142.38 s > at <unknown source file>:<unknown line>
  1900. 142.38 s > 14: <std[bcb96dfbba0ab899]::thread::lifecycle::spawn_unchecked<test[75d6903177b1d7e9]::run_test::{closure#1}, ()>::{closure#1} as core[940e698046960fd5]::ops::function::FnOnce<()>>::call_once::{shim:vtable#0}<unknown>
  1901. 142.38 s > at <unknown source file>:<unknown line>
  1902. 142.38 s > 15: <std[bcb96dfbba0ab899]::sys::thread::unix::Thread>::new::thread_start<unknown>
  1903. 142.38 s > at <unknown source file>:<unknown line>
  1904. 142.38 s > 16: start_thread<unknown>
  1905. 142.38 s > at <unknown source file>:<unknown line>
  1906. 142.38 s > 17: __clone3<unknown>
  1907. 142.38 s > at <unknown source file>:<unknown line>
  1908. 142.38 s >
  1909. 142.38 s > Run with COLORBT_SHOW_HIDDEN=1 environment variable to disable frame filtering.
  1910. 142.38 s > Run with RUST_BACKTRACE=full to include source snippets.
  1911. 142.38 s > Warning: SpanTrace capture is Unsupported.
  1912. 142.38 s > Ensure that you've setup a tracing-error ErrorLayer and the semver versions are compatible
  1913. 142.38 s >
  1914. 142.38 s > 6. gammaloop-integration-tests::test_runs::profile_bulk::scalar_self_energy_amp_bulk_profile_passes
  1915. 142.38 s > failure: test failure with exit code 101
  1916. 142.38 s > Error:
  1917. 142.38 s > 0: IR profiling requested arbitrary precision but received a quad-precision result
  1918. 142.38 s >
  1919. 142.38 s > Location:
  1920. 142.38 s > crates/gammalooprs/src/integrands/process/ir.rs:2123
  1921. 142.38 s >
  1922. 142.38 s > ━━━━━━━━━━━━━━━━━━━━━━━━━━━━━━━━━━ BACKTRACE ━━━━━━━━━━━━━━━━━━━━━━━━━━━━━━━━━━━
  1923. 142.38 s > 1: <color_eyre[51793ea62743adbd]::config::EyreHook>::into_eyre_hook::{closure#0}<unknown>
  1924. 142.38 s > at <unknown source file>:<unknown line>
  1925. 142.38 s > 2: eyre[cb2fd339c0c40fca]::capture_handler<unknown>
  1926. 142.38 s > at <unknown source file>:<unknown line>
  1927. 142.38 s > 3: eyre[cb2fd339c0c40fca]::private::format_err<unknown>
  1928. 142.38 s > at <unknown source file>:<unknown line>
  1929. 142.38 s > 4: gammalooprs[d7a7c067ebd19583]::integrands::process::ir::evaluate_profile_momentum_point_arb::<gammalooprs[d7a7c067ebd19583]::integrands::process::amplitude::AmplitudeIntegrand><unknown>
  1930. 142.38 s > at <unknown source file>:<unknown line>
  1931. 142.38 s > 5: <gammalooprs[d7a7c067ebd19583]::integrands::process::amplitude::AmplitudeIntegrand>::test_single_ir_limit_impl<unknown>
  1932. 142.38 s > at <unknown source file>:<unknown line>
  1933. 142.38 s > 6: gammalooprs[d7a7c067ebd19583]::integrands::process::ir::run_ir_profile::<gammalooprs[d7a7c067ebd19583]::integrands::process::amplitude::AmplitudeIntegrand, <gammalooprs[d7a7c067ebd19583]::integrands::process::amplitude::AmplitudeIntegrand>::enumerate_ir_limits, <gammalooprs[d7a7c067ebd19583]::integrands::process::amplitude::AmplitudeIntegrand>::graph_cut_definitions, <gammalooprs[d7a7c067ebd19583]::integrands::process::amplitude::AmplitudeIntegrand>::test_single_ir_limit_impl><unknown>
  1934. 142.38 s > at <unknown source file>:<unknown line>
  1935. 142.38 s > 7: <gammalooprs[d7a7c067ebd19583]::integrands::process::amplitude::AmplitudeIntegrand>::test_ir<unknown>
  1936. 142.38 s > at <unknown source file>:<unknown line>
  1937. 142.38 s > 8: <gammaloop_api[92ae732909e47e14]::commands::profile::Profile>::run<unknown>
  1938. 142.38 s > at <unknown source file>:<unknown line>
  1939. 142.38 s > 9: test_runs[3e7a390caee4e338]::profile_bulk::scalar_self_energy_amp_bulk_profile_passes<unknown>
  1940. 142.38 s > at <unknown source file>:<unknown line>
  1941. 142.38 s > 10: <test_runs[3e7a390caee4e338]::profile_bulk::scalar_self_energy_amp_bulk_profile_passes::{closure#0} as core[940e698046960fd5]::ops::function::FnOnce<()>>::call_once<unknown>
  1942. 142.38 s > at <unknown source file>:<unknown line>
  1943. 142.38 s > 11: test[75d6903177b1d7e9]::__rust_begin_short_backtrace::<core[940e698046960fd5]::result::Result<(), alloc[2ea6bcb46fca0c42]::string::String>, fn() -> core[940e698046960fd5]::result::Result<(), alloc[2ea6bcb46fca0c42]::string::String>><unknown>
  1944. 142.38 s > at <unknown source file>:<unknown line>
  1945. 142.38 s > 12: test[75d6903177b1d7e9]::run_test::{closure#0}<unknown>
  1946. 142.38 s > at <unknown source file>:<unknown line>
  1947. 142.38 s > 13: std[bcb96dfbba0ab899]::sys::backtrace::__rust_begin_short_backtrace::<test[75d6903177b1d7e9]::run_test::{closure#1}, ()><unknown>
  1948. 142.38 s > at <unknown source file>:<unknown line>
  1949. 142.38 s > 14: <std[bcb96dfbba0ab899]::thread::lifecycle::spawn_unchecked<test[75d6903177b1d7e9]::run_test::{closure#1}, ()>::{closure#1} as core[940e698046960fd5]::ops::function::FnOnce<()>>::call_once::{shim:vtable#0}<unknown>
  1950. 142.38 s > at <unknown source file>:<unknown line>
  1951. 142.38 s > 15: <std[bcb96dfbba0ab899]::sys::thread::unix::Thread>::new::thread_start<unknown>
  1952. 142.38 s > at <unknown source file>:<unknown line>
  1953. 142.38 s > 16: start_thread<unknown>
  1954. 142.38 s > at <unknown source file>:<unknown line>
  1955. 142.38 s > 17: __clone3<unknown>
  1956. 142.38 s > at <unknown source file>:<unknown line>
  1957. 142.38 s >
  1958. 142.38 s > Run with COLORBT_SHOW_HIDDEN=1 environment variable to disable frame filtering.
  1959. 142.38 s > Run with RUST_BACKTRACE=full to include source snippets.
  1960. 142.38 s > Warning: SpanTrace capture is Unsupported.
  1961. 142.38 s > Ensure that you've setup a tracing-error ErrorLayer and the semver versions are compatible
  1962. 142.38 s > system-out
  1963. 142.38 s > running 1 test
  1964. 142.38 s > test profile_bulk::scalar_self_energy_amp_bulk_profile_passes ... FAILED
  1965. 142.38 s >
  1966. 142.38 s > failures:
  1967. 142.38 s >
  1968. 142.38 s > failures:
  1969. 142.38 s > profile_bulk::scalar_self_energy_amp_bulk_profile_passes
  1970. 142.38 s >
  1971. 142.38 s > test result: FAILED. 0 passed; 1 failed; 0 ignored; 0 measured; 82 filtered out; finished in 0.61s
  1972. 142.38 s > system-err
  1973. 142.38 s > [2026-08-28 17:29:11.023] @gammaloop_api::se... INFO : Running command import model ./assets/models/json/scalars/scalars.json
  1974. 142.38 s > [2026-08-28 17:29:11.023] @import::model INFO : Loading JSON model scalars-default from /build/source/assets/models/json/scalars/scalars
  1975. 142.38 s > [2026-08-28 17:29:11.027] @gammalooprs::model INFO : The following 2 external parameters were forced to zero by the restriction card:
  1976. 142.38 s > width_scalar_1, width_scalar_2
  1977. 142.38 s > [2026-08-28 17:29:11.028] @gammaloop_api::se... INFO : Running command import graphs ./tests/resources/graphs/scalar_self_energy_amp.dot
  1978. 142.38 s > [2026-08-28 17:29:11.028] @commands::import INFO : Loading graphs from '/build/source/tests/resources/graphs/scalar_self_energy_amp.dot'
  1979. 142.38 s > [2026-08-28 17:29:11.037] @gammaloop_api::se... INFO : Running command generate
  1980. 142.38 s > [2026-08-28 17:29:11.374] @commands::generate INFO :
  1981. 142.38 s > Integrand generation summary
  1982. 142.38 s > peak RAM 71.00 MiB | cores 1
  1983. 142.38 s > ╭───────────┬────────────────────────┬─────────┬─────────────┬────────────┬────────────────┬─────────────╮
  1984. 142.38 s > │ integrand │ graph │ # evals │ expr build │ spenso │ symbolica eval │ compile │
  1985. 142.38 s > ├───────────┼────────────────────────┼─────────┼─────────────┼────────────┼────────────────┼─────────────┤
  1986. 142.38 s > │ default │ scalar_self_energy_amp │ 6 │ 278ms (93%) │ 9ms (3.1%) │ 10ms (3.7%) │ 0ms (0.00%) │
  1987. 142.38 s > ├───────────┼────────────────────────┼─────────┼─────────────┼────────────┼────────────────┼─────────────┤
  1988. 142.38 s > │ Total │ │ 6 │ 278ms (93%) │ 9ms (3.1%) │ 10ms (3.7%) │ 0ms (0.00%) │
  1989. 142.38 s > ╰───────────┴────────────────────────┴─────────┴─────────────┴────────────┴────────────────┴─────────────╯
  1990. 142.38 s > [2026-08-28 17:29:11.375] @process::amplitude INFO : Input is above threshold: 2 existing threshold E-surfaces across 1/1 graph groups
  1991. 142.38 s > [2026-08-28 17:29:11.375] @process::amplitude INFO : overlap structure of group 0: [2: [2(1,5), 4(2,3,5)]]
  1992. 142.38 s > Error:
  1993. 142.38 s > 0: IR profiling requested arbitrary precision but received a quad-precision result
  1994. 142.38 s >
  1995. 142.38 s > Location:
  1996. 142.38 s > crates/gammalooprs/src/integrands/process/ir.rs:2123
  1997. 142.38 s >
  1998. 142.38 s > ━━━━━━━━━━━━━━━━━━━━━━━━━━━━━━━━━━ BACKTRACE ━━━━━━━━━━━━━━━━━━━━━━━━━━━━━━━━━━━
  1999. 142.38 s > 1: <color_eyre[51793ea62743adbd]::config::EyreHook>::into_eyre_hook::{closure#0}<unknown>
  2000. 142.38 s > at <unknown source file>:<unknown line>
  2001. 142.38 s > 2: eyre[cb2fd339c0c40fca]::capture_handler<unknown>
  2002. 142.38 s > at <unknown source file>:<unknown line>
  2003. 142.38 s > 3: eyre[cb2fd339c0c40fca]::private::format_err<unknown>
  2004. 142.38 s > at <unknown source file>:<unknown line>
  2005. 142.38 s > 4: gammalooprs[d7a7c067ebd19583]::integrands::process::ir::evaluate_profile_momentum_point_arb::<gammalooprs[d7a7c067ebd19583]::integrands::process::amplitude::AmplitudeIntegrand><unknown>
  2006. 142.38 s > at <unknown source file>:<unknown line>
  2007. 142.38 s > 5: <gammalooprs[d7a7c067ebd19583]::integrands::process::amplitude::AmplitudeIntegrand>::test_single_ir_limit_impl<unknown>
  2008. 142.38 s > at <unknown source file>:<unknown line>
  2009. 142.38 s > 6: gammalooprs[d7a7c067ebd19583]::integrands::process::ir::run_ir_profile::<gammalooprs[d7a7c067ebd19583]::integrands::process::amplitude::AmplitudeIntegrand, <gammalooprs[d7a7c067ebd19583]::integrands::process::amplitude::AmplitudeIntegrand>::enumerate_ir_limits, <gammalooprs[d7a7c067ebd19583]::integrands::process::amplitude::AmplitudeIntegrand>::graph_cut_definitions, <gammalooprs[d7a7c067ebd19583]::integrands::process::amplitude::AmplitudeIntegrand>::test_single_ir_limit_impl><unknown>
  2010. 142.38 s > at <unknown source file>:<unknown line>
  2011. 142.38 s > 7: <gammalooprs[d7a7c067ebd19583]::integrands::process::amplitude::AmplitudeIntegrand>::test_ir<unknown>
  2012. 142.38 s > at <unknown source file>:<unknown line>
  2013. 142.38 s > 8: <gammaloop_api[92ae732909e47e14]::commands::profile::Profile>::run<unknown>
  2014. 142.38 s > at <unknown source file>:<unknown line>
  2015. 142.38 s > 9: test_runs[3e7a390caee4e338]::profile_bulk::scalar_self_energy_amp_bulk_profile_passes<unknown>
  2016. 142.38 s > at <unknown source file>:<unknown line>
  2017. 142.38 s > 10: <test_runs[3e7a390caee4e338]::profile_bulk::scalar_self_energy_amp_bulk_profile_passes::{closure#0} as core[940e698046960fd5]::ops::function::FnOnce<()>>::call_once<unknown>
  2018. 142.38 s > at <unknown source file>:<unknown line>
  2019. 142.38 s > 11: test[75d6903177b1d7e9]::__rust_begin_short_backtrace::<core[940e698046960fd5]::result::Result<(), alloc[2ea6bcb46fca0c42]::string::String>, fn() -> core[940e698046960fd5]::result::Result<(), alloc[2ea6bcb46fca0c42]::string::String>><unknown>
  2020. 142.38 s > at <unknown source file>:<unknown line>
  2021. 142.38 s > 12: test[75d6903177b1d7e9]::run_test::{closure#0}<unknown>
  2022. 142.38 s > at <unknown source file>:<unknown line>
  2023. 142.38 s > 13: std[bcb96dfbba0ab899]::sys::backtrace::__rust_begin_short_backtrace::<test[75d6903177b1d7e9]::run_test::{closure#1}, ()><unknown>
  2024. 142.38 s > at <unknown source file>:<unknown line>
  2025. 142.38 s > 14: <std[bcb96dfbba0ab899]::thread::lifecycle::spawn_unchecked<test[75d6903177b1d7e9]::run_test::{closure#1}, ()>::{closure#1} as core[940e698046960fd5]::ops::function::FnOnce<()>>::call_once::{shim:vtable#0}<unknown>
  2026. 142.38 s > at <unknown source file>:<unknown line>
  2027. 142.38 s > 15: <std[bcb96dfbba0ab899]::sys::thread::unix::Thread>::new::thread_start<unknown>
  2028. 142.38 s > at <unknown source file>:<unknown line>
  2029. 142.38 s > 16: start_thread<unknown>
  2030. 142.38 s > at <unknown source file>:<unknown line>
  2031. 142.38 s > 17: __clone3<unknown>
  2032. 142.38 s > at <unknown source file>:<unknown line>
  2033. 142.38 s >
  2034. 142.38 s > Run with COLORBT_SHOW_HIDDEN=1 environment variable to disable frame filtering.
  2035. 142.38 s > Run with RUST_BACKTRACE=full to include source snippets.
  2036. 142.38 s > Warning: SpanTrace capture is Unsupported.
  2037. 142.38 s > Ensure that you've setup a tracing-error ErrorLayer and the semver versions are compatible
  2038. 142.38 s >
  2039. 142.38 s > 7. gammaloop-integration-tests::uv::dod2_bubble_uv
  2040. 142.38 s > failure: test failure with exit code 101
  2041. 142.38 s > system-out
  2042. 142.38 s > running 1 test
  2043. 142.38 s > +-------------+-----------------+---------+--------+----------+-----------------------------------------------------------------------------------------------------------------------+-------+
  2044. 142.38 s > | case | check | graph | status | sigma | threshold | error |
  2045. 142.38 s > +-------------+-----------------+---------+--------+----------+-----------------------------------------------------------------------------------------------------------------------+-------+
  2046. 142.38 s > | dod2_bubble | uv_profile | - | FAIL | - | - | - |
  2047. 142.38 s > +-------------+-----------------+---------+--------+----------+-----------------------------------------------------------------------------------------------------------------------+-------+
  2048. 142.38 s > | dod2_bubble | m_uv.inspect | inspect | pass | - | best inspect relative delta 1.000e0 >= 1000*accuracy 1.000e-7 (accuracy=1.000e-10, exponent=+8.0, seed=0, probes=10) | - |
  2049. 142.38 s > +-------------+-----------------+---------+--------+----------+-----------------------------------------------------------------------------------------------------------------------+-------+
  2050. 142.38 s > | dod2_bubble | m_uv.integrated | GL0 | pass | 0.0sigma | compatible within 2sigma | - |
  2051. 142.38 s > +-------------+-----------------+---------+--------+----------+-----------------------------------------------------------------------------------------------------------------------+-------+
  2052. 142.38 s > | dod2_bubble | rls.inspect | inspect | pass | - | best inspect relative delta 2.822e-3 >= 1000*accuracy 1.000e-7 (accuracy=1.000e-10, exponent=+2.0, seed=1, probes=10) | - |
  2053. 142.38 s > +-------------+-----------------+---------+--------+----------+-----------------------------------------------------------------------------------------------------------------------+-------+
  2054. 142.38 s > | dod2_bubble | rls.integrated | GL0 | pass | 0.0sigma | compatible within 2sigma | - |
  2055. 142.38 s > +-------------+-----------------+---------+--------+----------+-----------------------------------------------------------------------------------------------------------------------+-------+
  2056. 142.38 s > | dod2_bubble | mu_r.inspect | inspect | pass | - | best inspect relative delta 6.951e-1 >= 1000*accuracy 1.000e-7 (accuracy=1.000e-10, exponent=+0.0, seed=0, probes=10) | - |
  2057. 142.38 s > +-------------+-----------------+---------+--------+----------+-----------------------------------------------------------------------------------------------------------------------+-------+
  2058. 142.38 s > | dod2_bubble | target | - | pass | - | 2sigma | - |
  2059. 142.38 s > +-------------+-----------------+---------+--------+----------+-----------------------------------------------------------------------------------------------------------------------+-------+
  2060. 142.38 s > test dod2_bubble_uv ... FAILED
  2061. 142.38 s >
  2062. 142.38 s > failures:
  2063. 142.38 s >
  2064. 142.38 s > failures:
  2065. 142.38 s > dod2_bubble_uv
  2066. 142.38 s >
  2067. 142.38 s > test result: FAILED. 0 passed; 1 failed; 0 ignored; 0 measured; 24 filtered out; finished in 40.35s
  2068. 142.38 s > system-err
  2069. 142.38 s > [2026-08-28 17:29:12.748] @gammaloop_api::se... INFO : Running command run generate
  2070. 142.38 s > [2026-08-28 17:29:12.748] @gammaloop_api::se... INFO : Starting command block generate
  2071. 142.38 s > [2026-08-28 17:29:12.749] @gammaloop_api::se... INFO : Running command import model scalars-default.json
  2072. 142.38 s > [2026-08-28 17:29:12.749] @import::model INFO : Loading built-in JSON model scalars-default
  2073. 142.38 s > [2026-08-28 17:29:12.752] @gammalooprs::model INFO : The following 2 external parameters were forced to zero by the restriction card:
  2074. 142.38 s > width_scalar_1, width_scalar_2
  2075. 142.38 s > [2026-08-28 17:29:12.753] @gammaloop_api::se... INFO : Running command remove processes
  2076. 142.38 s > [2026-08-28 17:29:12.753] @gammaloop_api::se... INFO : Running command set global kv global.generation.uv.generate_integrated=true
  2077. 142.38 s > [2026-08-28 17:29:12.753] @gammaloop_api::se... INFO : Running command import graphs ./tests/resources/graphs/scalar/dod2_bubble.dot -p bubble_dod2 -i scalar_bubble_below_thres
  2078. 142.38 s > [2026-08-28 17:29:12.753] @commands::import INFO : Loading graphs from '/build/source/tests/resources/graphs/scalar/dod2_bubble.dot'
  2079. 142.38 s > [2026-08-28 17:29:12.756] @gammaloop_api::se... INFO : Running command generate existing -p bubble_dod2 -i scalar_bubble_below_thres
  2080. 142.38 s > [2026-08-28 17:29:12.758] @approx::local_4d [{#uv, #inspect, #integrated}] DEBUG : Rescaled momenta expanded
  2081. 142.38 s > field value
  2082. 142.38 s > res n-terms: 1, byte size: 585,expr:
  2083. 142.38 s > -SCALAR_COUPLING²·q₀(αᵉ².¹)·q₀(αᵉ³.¹)·q₂(αᵉ².¹)·q₂(αᵉ³.¹)
  2084. 142.38 s > /(t²·denom(3,-q₀-q₂/t,mass_scalar_2²,-mass_scalar_2²+2·(q₀.q₂)/t+(q₂.q₂)/t²+(q₀.q₀))
  2085. 142.38 s > ·denom(2,q₂/t,mass_scalar_2²,-mass_scalar_2²+(q₂.q₂)/t²))
  2086. 142.38 s > [2026-08-28 17:29:12.772] @approx::local_4d [{#uv, #inspect, #integrated}] DEBUG : Rescaled momenta expanded
  2087. 142.38 s > field value
  2088. 142.38 s > res n-terms: 1, byte size: 3,expr:
  2089. 142.38 s > 1
  2090. 142.38 s > [2026-08-28 17:29:12.773] @approx::final_integrand[{#generation, #profile, #uv, #graph, #summary}] DEBUG : Computed global numerator
  2091. 142.38 s > field value
  2092. 142.38 s > global_num n-terms: 1, byte size: 4,expr:
  2093. 142.38 s > 1/2
  2094. 142.38 s > span build_3d{span_context=true graph=GL0 current=subgraph=0, topo_order=0, dod=0}
  2095. 142.38 s > [2026-08-28 17:29:12.777] @uv::approx [{#generation, #uv, #fourd}] DEBUG : Computing 4D
  2096. 142.38 s > field value
  2097. 142.38 s > simple subgraph(S_11,S_y)*Approx(subgraph(S_y,0)) of GL0
  2098. 142.38 s > span compute_4d{span_context=true graph=GL0 current=subgraph=y, topo_order=1, dod=2 given=subgraph=0, topo_order=0, dod=0 reduced=SubSet { set: BitVec<usize, bitvec::order::Lsb0> { addr: 0x7fffec00a8f0, head: 000000, bits: 6, capacity: 64 } [0, 0, 1, 1, 1, 1], id: PhantomData<linnet::half_edge::involution::Hedge> }}
  2099. 142.38 s > [2026-08-28 17:29:12.778] @approx::local_4d [{#uv, #algebra, #integrated, #start}] DEBUG :
  2100. 142.38 s > field value
  2101. 142.38 s > integrand n-terms: 1, byte size: 409,expr:
  2102. 142.38 s > SCALAR_COUPLING²·(q₀(αᵉ³.¹)+q₃(αᵉ³.¹))·q₀(αᵉ².¹)·q₀(αᵉ³.¹)·q₂(αᵉ².¹)
  2103. 142.38 s > /(denom(2,q₂,mass_scalar_2²,-mass_scalar_2²+(q₂.q₂))·denom(3,q₃,mass_scalar_2²,-mass_scalar_2²+(q₃.q₃)))
  2104. 142.38 s > reduced y
  2105. 142.38 s > span grow{span_context=true current=subgraph=y, topo_order=1, dod=2 given=subgraph=0, topo_order=0, dod=0}
  2106. 142.38 s > [2026-08-28 17:29:12.778] @approx::local_4d [{#uv, #inspect, #integrated}] DEBUG : Rescaled momenta expanded
  2107. 142.38 s > field value
  2108. 142.38 s > res n-terms: 1, byte size: 585,expr:
  2109. 142.38 s > -SCALAR_COUPLING²·q₀(αᵉ².¹)·q₀(αᵉ³.¹)·q₂(αᵉ².¹)·q₂(αᵉ³.¹)
  2110. 142.38 s > /(t²·denom(3,-q₀-q₂/t,mass_scalar_2²,-mass_scalar_2²+2·(q₀.q₂)/t+(q₂.q₂)/t²+(q₀.q₀))
  2111. 142.38 s > ·denom(2,q₂/t,mass_scalar_2²,-mass_scalar_2²+(q₂.q₂)/t²))
  2112. 142.38 s > span t{span_context=true current=subgraph=y, topo_order=1, dod=2 given=subgraph=0, topo_order=0, dod=0}
  2113. 142.38 s > [2026-08-28 17:29:12.778] @approx::local_4d [{#uv, #integrated, #rescaled}] DEBUG : Rescaled expanded
  2114. 142.38 s > field value
  2115. 142.38 s > n_loops 1
  2116. 142.38 s > res n-terms: 1, byte size: 707,expr:
  2117. 142.38 s > -SCALAR_COUPLING²·q₀(αᵉ².¹)·q₀(αᵉ³.¹)·q₂(αᵉ².¹)·q₂(αᵉ³.¹)
  2118. 142.38 s > /(t²·denom(3,-q₂,mUVexp²+t²·mass_scalar_2²,-mUV²+t²·(-mass_scalar_2²+2·(q₀.q₂)/t+(q₂.q₂)/t²+(q₀.q₀))+t²·mUVexp²)
  2119. 142.38 s > ·denom(2,q₂,mUVexp²+t²·mass_scalar_2²,-mUV²+t²·(-mass_scalar_2²+(q₂.q₂)/t²)+t²·mUVexp²))
  2120. 142.38 s > span t{span_context=true current=subgraph=y, topo_order=1, dod=2 given=subgraph=0, topo_order=0, dod=0}
  2121. 142.38 s > [2026-08-28 17:29:12.779] @approx::local_4d [{#uv, #integrated, #series}] DEBUG : Series expanded
  2122. 142.38 s > field value
  2123. 142.38 s > res n-terms: 3, byte size: 1896,expr:
  2124. 142.38 s > (1/2·SCALAR_COUPLING²·(2·mUVexp²-2·mass_scalar_2²)/(denom(2,q₂,mUVexp²,-mUV²+(q₂.q₂))²·denom(3,-q₂,mUVexp²,-mUV²+(q₂.q₂)))
  2125. 142.38 s > -SCALAR_COUPLING²
  2126. 142.38 s > ·(-1/2·(2·mUVexp²-2·mass_scalar_2²+2·(q₀.q₀))/denom(3,-q₂,mUVexp²,-mUV²+(q₂.q₂))
  2127. 142.38 s > +4·(q₀.q₂)²/denom(3,-q₂,mUVexp²,-mUV²+(q₂.q₂))²
  2128. 142.38 s > )/(denom(2,q₂,mUVexp²,-mUV²+(q₂.q₂))·denom(3,-q₂,mUVexp²,-mUV²+(q₂.q₂)))
  2129. 142.38 s > )·q₀(αᵉ².¹)·q₀(αᵉ³.¹)·q₂(αᵉ².¹)·q₂(αᵉ³.¹)
  2130. 142.38 s > +2·SCALAR_COUPLING²·(q₀.q₂)·q₀(αᵉ².¹)·q₀(αᵉ³.¹)·q₂(αᵉ².¹)·q₂(αᵉ³.¹)
  2131. 142.38 s > /(t·denom(2,q₂,mUVexp²,-mUV²+(q₂.q₂))·denom(3,-q₂,mUVexp²,-mUV²+(q₂.q₂))²)
  2132. 142.38 s > -SCALAR_COUPLING²·q₀(αᵉ².¹)·q₀(αᵉ³.¹)·q₂(αᵉ².¹)·q₂(αᵉ³.¹)
  2133. 142.38 s > /(t²·denom(2,q₂,mUVexp²,-mUV²+(q₂.q₂))·denom(3,-q₂,mUVexp²,-mUV²+(q₂.q₂)))
  2134. 142.38 s > span t{span_context=true current=subgraph=y, topo_order=1, dod=2 given=subgraph=0, topo_order=0, dod=0}
  2135. 142.38 s > [2026-08-28 17:29:12.779] @approx::local_4d [{#uv, #integrated, #series}] DEBUG : Evaluated at t = 1
  2136. 142.38 s > field value
  2137. 142.38 s > res n-terms: 3, byte size: 1880,expr:
  2138. 142.38 s > (1/2·SCALAR_COUPLING²·(2·mUVexp²-2·mass_scalar_2²)/(denom(2,q₂,mUVexp²,-mUV²+(q₂.q₂))²·denom(3,-q₂,mUVexp²,-mUV²+(q₂.q₂)))
  2139. 142.38 s > -SCALAR_COUPLING²
  2140. 142.38 s > ·(-1/2·(2·mUVexp²-2·mass_scalar_2²+2·(q₀.q₀))/denom(3,-q₂,mUVexp²,-mUV²+(q₂.q₂))
  2141. 142.38 s > +4·(q₀.q₂)²/denom(3,-q₂,mUVexp²,-mUV²+(q₂.q₂))²
  2142. 142.38 s > )/(denom(2,q₂,mUVexp²,-mUV²+(q₂.q₂))·denom(3,-q₂,mUVexp²,-mUV²+(q₂.q₂)))
  2143. 142.38 s > )·q₀(αᵉ².¹)·q₀(αᵉ³.¹)·q₂(αᵉ².¹)·q₂(αᵉ³.¹)
  2144. 142.38 s > -SCALAR_COUPLING²·q₀(αᵉ².¹)·q₀(αᵉ³.¹)·q₂(αᵉ².¹)·q₂(αᵉ³.¹)
  2145. 142.38 s > /(denom(2,q₂,mUVexp²,-mUV²+(q₂.q₂))·denom(3,-q₂,mUVexp²,-mUV²+(q₂.q₂)))
  2146. 142.38 s > +2·SCALAR_COUPLING²·(q₀.q₂)·q₀(αᵉ².¹)·q₀(αᵉ³.¹)·q₂(αᵉ².¹)·q₂(αᵉ³.¹)
  2147. 142.38 s > /(denom(2,q₂,mUVexp²,-mUV²+(q₂.q₂))·denom(3,-q₂,mUVexp²,-mUV²+(q₂.q₂))²)
  2148. 142.38 s > span t{span_context=true current=subgraph=y, topo_order=1, dod=2 given=subgraph=0, topo_order=0, dod=0}
  2149. 142.38 s > [2026-08-28 17:29:12.780] @approx::local_4d [{#uv, #collect, #integrated}] DEBUG : After gamma chain collection
  2150. 142.38 s > field value
  2151. 142.38 s > expr n-terms: 3, byte size: 1880,expr:
  2152. 142.38 s > (1/2·SCALAR_COUPLING²·(2·mUVexp²-2·mass_scalar_2²)/(denom(2,q₂,mUVexp²,-mUV²+(q₂.q₂))²·denom(3,-q₂,mUVexp²,-mUV²+(q₂.q₂)))
  2153. 142.38 s > -SCALAR_COUPLING²
  2154. 142.38 s > ·(-1/2·(2·mUVexp²-2·mass_scalar_2²+2·(q₀.q₀))/denom(3,-q₂,mUVexp²,-mUV²+(q₂.q₂))
  2155. 142.38 s > +4·(q₀.q₂)²/denom(3,-q₂,mUVexp²,-mUV²+(q₂.q₂))²
  2156. 142.38 s > )/(denom(2,q₂,mUVexp²,-mUV²+(q₂.q₂))·denom(3,-q₂,mUVexp²,-mUV²+(q₂.q₂)))
  2157. 142.38 s > )·q₀(αᵉ².¹)·q₀(αᵉ³.¹)·q₂(αᵉ².¹)·q₂(αᵉ³.¹)
  2158. 142.38 s > -SCALAR_COUPLING²·q₀(αᵉ².¹)·q₀(αᵉ³.¹)·q₂(αᵉ².¹)·q₂(αᵉ³.¹)
  2159. 142.38 s > /(denom(2,q₂,mUVexp²,-mUV²+(q₂.q₂))·denom(3,-q₂,mUVexp²,-mUV²+(q₂.q₂)))
  2160. 142.38 s > +2·SCALAR_COUPLING²·(q₀.q₂)·q₀(αᵉ².¹)·q₀(αᵉ³.¹)·q₂(αᵉ².¹)·q₂(αᵉ³.¹)
  2161. 142.38 s > /(denom(2,q₂,mUVexp²,-mUV²+(q₂.q₂))·denom(3,-q₂,mUVexp²,-mUV²+(q₂.q₂))²)
  2162. 142.38 s > span t{span_context=true current=subgraph=y, topo_order=1, dod=2 given=subgraph=0, topo_order=0, dod=0}
  2163. 142.38 s > [2026-08-28 17:29:12.782] @approx::local_4d [{#profile, #uv, #collect, #integrated, #start, #trace}] DEBUG : After gamma schoonschip
  2164. 142.38 s > field value
  2165. 142.38 s > expr n-terms: 3, byte size: 1631,expr:
  2166. 142.38 s > (1/2·SCALAR_COUPLING²·(2·mUVexp²-2·mass_scalar_2²)/(denom(2,q₂,mUVexp²,-mUV²+(q₂.q₂))²·denom(3,-q₂,mUVexp²,-mUV²+(q₂.q₂)))
  2167. 142.38 s > -SCALAR_COUPLING²
  2168. 142.38 s > ·(-1/2·(2·mUVexp²-2·mass_scalar_2²+2·(q₀.q₀))/denom(3,-q₂,mUVexp²,-mUV²+(q₂.q₂))
  2169. 142.38 s > +4·(q₀.q₂)²/denom(3,-q₂,mUVexp²,-mUV²+(q₂.q₂))²
  2170. 142.38 s > )/(denom(2,q₂,mUVexp²,-mUV²+(q₂.q₂))·denom(3,-q₂,mUVexp²,-mUV²+(q₂.q₂)))
  2171. 142.38 s > )·(q₀.q₂)²
  2172. 142.38 s > -SCALAR_COUPLING²·(q₀.q₂)²/(denom(2,q₂,mUVexp²,-mUV²+(q₂.q₂))·denom(3,-q₂,mUVexp²,-mUV²+(q₂.q₂)))
  2173. 142.38 s > +2·SCALAR_COUPLING²·(q₀.q₂)·(q₀.q₂)²
  2174. 142.38 s > /(denom(2,q₂,mUVexp²,-mUV²+(q₂.q₂))·denom(3,-q₂,mUVexp²,-mUV²+(q₂.q₂))²)
  2175. 142.38 s > span t{span_context=true current=subgraph=y, topo_order=1, dod=2 given=subgraph=0, topo_order=0, dod=0}
  2176. 142.38 s > [2026-08-28 17:29:12.783] @approx::local_4d [{#profile, #uv, #collect, #integrated, #start, #trace}] DEBUG : After gamma collection
  2177. 142.38 s > field value
  2178. 142.38 s > expr n-terms: 1, byte size: 1347,expr:
  2179. 142.38 s > SCALAR_COUPLING²
  2180. 142.38 s > ·(-denom(2,q₂,mUVexp²,-mUV²+(q₂.q₂))·denom(3,-q₂,mUVexp²,-mUV²+(q₂.q₂))²
  2181. 142.38 s > +1/2·(2·mUVexp²-2·mass_scalar_2²)·denom(3,-q₂,mUVexp²,-mUV²+(q₂.q₂))²
  2182. 142.38 s > -(-1/2·(2·mUVexp²-2·mass_scalar_2²+2·(q₀.q₀))·denom(3,-q₂,mUVexp²,-mUV²+(q₂.q₂))+4·(q₀.q₂)²)
  2183. 142.38 s > ·denom(2,q₂,mUVexp²,-mUV²+(q₂.q₂))
  2184. 142.38 s > +2·(q₀.q₂)·denom(2,q₂,mUVexp²,-mUV²+(q₂.q₂))·denom(3,-q₂,mUVexp²,-mUV²+(q₂.q₂))
  2185. 142.38 s > )·(q₀.q₂)²/(denom(2,q₂,mUVexp²,-mUV²+(q₂.q₂))²·denom(3,-q₂,mUVexp²,-mUV²+(q₂.q₂))³)
  2186. 142.38 s > span t{span_context=true current=subgraph=y, topo_order=1, dod=2 given=subgraph=0, topo_order=0, dod=0}
  2187. 142.38 s > [2026-08-28 17:29:12.784] @approx::local_4d [{#profile, #uv, #gamma, #integrated, #start, #trace, #vakint}] DEBUG : After gamma simplification
  2188. 142.38 s > ... omitted 3263 more lines; see full nextest output above
  2189. 142.38 s >
  2190. 142.38 s > 8. gammaloop-integration-tests::uv::sunrise_scalar_1_uv
  2191. 142.38 s > failure: test failure with exit code 101
  2192. 142.38 s > system-out
  2193. 142.38 s > running 1 test
  2194. 142.38 s > test sunrise_scalar_1_uv has been running for over 60 seconds
  2195. 142.38 s > +------------------+------------------------+--------------+--------+----------+----------------------------------------------------------------------------------------------------------------------+-------+
  2196. 142.38 s > | case | check | graph | status | sigma | threshold | error |
  2197. 142.38 s > +------------------+------------------------+--------------+--------+----------+----------------------------------------------------------------------------------------------------------------------+-------+
  2198. 142.38 s > | sunrise_scalar_1 | uv_profile | - | FAIL | - | - | - |
  2199. 142.38 s > +------------------+------------------------+--------------+--------+----------+----------------------------------------------------------------------------------------------------------------------+-------+
  2200. 142.38 s > | sunrise_scalar_1 | m_uv.inspect | inspect | pass | - | best inspect relative delta 1.624e0 >= 1000*accuracy 1.000e-3 (accuracy=1.000e-6, exponent=+1.0, seed=1, probes=10) | - |
  2201. 142.38 s > +------------------+------------------------+--------------+--------+----------+----------------------------------------------------------------------------------------------------------------------+-------+
  2202. 142.38 s > | sunrise_scalar_1 | m_uv.integrated | sunrise | pass | 0.1sigma | compatible within 2sigma | - |
  2203. 142.38 s > +------------------+------------------------+--------------+--------+----------+----------------------------------------------------------------------------------------------------------------------+-------+
  2204. 142.38 s > | sunrise_scalar_1 | rls.inspect | inspect | pass | - | best inspect relative delta 8.682e-1 >= 1000*accuracy 1.000e-3 (accuracy=1.000e-6, exponent=+1.0, seed=1, probes=10) | - |
  2205. 142.38 s > +------------------+------------------------+--------------+--------+----------+----------------------------------------------------------------------------------------------------------------------+-------+
  2206. 142.38 s > | sunrise_scalar_1 | rls.integrated | sunrise | pass | 0.0sigma | compatible within 2sigma | - |
  2207. 142.38 s > +------------------+------------------------+--------------+--------+----------+----------------------------------------------------------------------------------------------------------------------+-------+
  2208. 142.38 s > | sunrise_scalar_1 | mu_r.inspect | inspect | pass | - | best inspect relative delta 1.752e0 >= 1000*accuracy 1.000e-3 (accuracy=1.000e-6, exponent=+1.0, seed=1, probes=10) | - |
  2209. 142.38 s > +------------------+------------------------+--------------+--------+----------+----------------------------------------------------------------------------------------------------------------------+-------+
  2210. 142.38 s > | sunrise_scalar_1 | integrated.relerr | integrated | pass | - | relative error 9.20% <= 10.00% | - |
  2211. 142.38 s > +------------------+------------------------+--------------+--------+----------+----------------------------------------------------------------------------------------------------------------------+-------+
  2212. 142.38 s > | sunrise_scalar_1 | m_uv.integrated.relerr | m_uv-shifted | pass | - | relative error 5.89% <= 10.00% | - |
  2213. 142.38 s > +------------------+------------------------+--------------+--------+----------+----------------------------------------------------------------------------------------------------------------------+-------+
  2214. 142.38 s > | sunrise_scalar_1 | target | - | pass | - | 2sigma | - |
  2215. 142.38 s > +------------------+------------------------+--------------+--------+----------+----------------------------------------------------------------------------------------------------------------------+-------+
  2216. 142.38 s > test sunrise_scalar_1_uv ... FAILED
  2217. 142.38 s >
  2218. 142.38 s > failures:
  2219. 142.38 s >
  2220. 142.38 s > failures:
  2221. 142.38 s > sunrise_scalar_1_uv
  2222. 142.38 s >
  2223. 142.38 s > test result: FAILED. 0 passed; 1 failed; 0 ignored; 0 measured; 24 filtered out; finished in 100.86s
  2224. 142.38 s > system-err
  2225. 142.38 s > [2026-08-28 17:29:17.645] @gammaloop_api::se... INFO : Running command run generate
  2226. 142.38 s > [2026-08-28 17:29:17.645] @gammaloop_api::se... INFO : Starting command block generate
  2227. 142.38 s > [2026-08-28 17:29:17.646] @gammaloop_api::se... INFO : Running command import model scalars-default.json
  2228. 142.38 s > [2026-08-28 17:29:17.646] @import::model INFO : Loading built-in JSON model scalars-default
  2229. 142.38 s > [2026-08-28 17:29:17.650] @gammalooprs::model INFO : The following 2 external parameters were forced to zero by the restriction card:
  2230. 142.38 s > width_scalar_1, width_scalar_2
  2231. 142.38 s > [2026-08-28 17:29:17.650] @gammaloop_api::se... INFO : Running command remove processes
  2232. 142.38 s > [2026-08-28 17:29:17.650] @gammaloop_api::se... INFO : Running command set global kv global.generation.uv.generate_integrated=true
  2233. 142.38 s > [2026-08-28 17:29:17.651] @gammaloop_api::se... INFO : Running command import graphs ./tests/resources/graphs/scalar_sunrise.dot -p sunrise_scalar_1 -i scalar_sunrise
  2234. 142.38 s > [2026-08-28 17:29:17.651] @commands::import INFO : Loading graphs from '/build/source/tests/resources/graphs/scalar_sunrise.dot'
  2235. 142.38 s > [2026-08-28 17:29:17.653] @gammaloop_api::se... INFO : Running command generate existing -p sunrise_scalar_1 -i scalar_sunrise
  2236. 142.38 s > [2026-08-28 17:29:17.656] @approx::local_4d [{#uv, #inspect, #integrated}] DEBUG : Rescaled momenta expanded
  2237. 142.38 s > field value
  2238. 142.38 s > res n-terms: 1, byte size: 611,expr:
  2239. 142.38 s > 1/(denom(0,q₀/t,mass_scalar_1²,-mass_scalar_1²+(q₀.q₀)/t²)
  2240. 142.38 s > ·denom(2,-q₁+q₃-q₀/t,mass_scalar_1²,
  2241. 142.38 s > -mass_scalar_1²+2·(q₀.q₁)/t-2·(q₀.q₃)/t+(q₀.q₀)/t²+(q₁.q₁)
  2242. 142.38 s > -2·(q₁.q₃)+(q₃.q₃)
  2243. 142.38 s > ))
  2244. 142.38 s > [2026-08-28 17:29:17.660] @approx::local_4d [{#uv, #inspect, #integrated}] DEBUG : Rescaled momenta expanded
  2245. 142.38 s > field value
  2246. 142.38 s > res n-terms: 1, byte size: 3,expr:
  2247. 142.38 s > 1
  2248. 142.38 s > [2026-08-28 17:29:17.660] @approx::local_4d [{#uv, #inspect, #integrated}] DEBUG : Rescaled momenta expanded
  2249. 142.38 s > field value
  2250. 142.38 s > res n-terms: 1, byte size: 611,expr:
  2251. 142.38 s > 1/(denom(0,q₀/t,mass_scalar_1²,-mass_scalar_1²+(q₀.q₀)/t²)
  2252. 142.38 s > ·denom(1,-q₂+q₃-q₀/t,mass_scalar_1²,
  2253. 142.38 s > -mass_scalar_1²+2·(q₀.q₂)/t-2·(q₀.q₃)/t+(q₀.q₀)/t²+(q₂.q₂)
  2254. 142.38 s > -2·(q₂.q₃)+(q₃.q₃)
  2255. 142.38 s > ))
  2256. 142.38 s > [2026-08-28 17:29:17.661] @approx::local_4d [{#uv, #inspect, #integrated}] DEBUG : Rescaled momenta expanded
  2257. 142.38 s > field value
  2258. 142.38 s > res n-terms: 1, byte size: 611,expr:
  2259. 142.38 s > 1/(denom(1,q₁/t,mass_scalar_1²,-mass_scalar_1²+(q₁.q₁)/t²)
  2260. 142.38 s > ·denom(2,-q₀+q₃-q₁/t,mass_scalar_1²,
  2261. 142.38 s > -mass_scalar_1²+2·(q₀.q₁)/t-2·(q₁.q₃)/t+(q₁.q₁)/t²+(q₀.q₀)
  2262. 142.38 s > -2·(q₀.q₃)+(q₃.q₃)
  2263. 142.38 s > ))
  2264. 142.38 s > [2026-08-28 17:29:17.662] @approx::local_4d [{#uv, #inspect, #integrated}] DEBUG : Rescaled momenta expanded
  2265. 142.38 s > field value
  2266. 142.38 s > res n-terms: 1, byte size: 777,expr:
  2267. 142.39 s > 1/(denom(0,q₀/t,mass_scalar_1²,-mass_scalar_1²+(q₀.q₀)/t²)·denom(1,q₁/t,mass_scalar_1²,-mass_scalar_1²+(q₁.q₁)/t²)
  2268. 142.39 s > ·denom(2,q₄-q₀/t-q₁/t,mass_scalar_1²,
  2269. 142.39 s > -mass_scalar_1²-2·(q₀.q₄)/t-2·(q₁.q₄)/t+(q₀.q₀)/t²+2·(q₀.q₁)/t²
  2270. 142.39 s > +(q₁.q₁)/t²+(q₄.q₄)
  2271. 142.39 s > ))
  2272. 142.39 s > [2026-08-28 17:29:17.669] @approx::final_integrand[{#generation, #profile, #uv, #graph, #summary}] DEBUG : Computed global numerator
  2273. 142.39 s > field value
  2274. 142.39 s > global_num n-terms: 1, byte size: 3,expr:
  2275. 142.39 s > 1
  2276. 142.39 s > span build_3d{span_context=true graph=sunrise current=subgraph=0, topo_order=0, dod=0}
  2277. 142.39 s > [2026-08-28 17:29:17.670] @uv::approx [{#generation, #uv, #fourd}] DEBUG : Computing 4D
  2278. 142.39 s > field value
  2279. 142.39 s > simple subgraph(S_47,S_3I)*Approx(subgraph(S_3I,0)) of sunrise
  2280. 142.39 s > span compute_4d{span_context=true graph=sunrise current=subgraph=3I, topo_order=1, dod=0 given=subgraph=0, topo_order=0, dod=0 reduced=SubSet { set: BitVec<usize, bitvec::order::Lsb0> { addr: 0x7fffec0184f0, head: 000000, bits: 8, capacity: 64 } [0, 0, 1, 1, 0, 0, 1, 1], id: PhantomData<linnet::half_edge::involution::Hedge> }}
  2281. 142.39 s > [2026-08-28 17:29:17.674] @approx::local_4d [{#uv, #algebra, #integrated, #start}] DEBUG :
  2282. 142.39 s > field value
  2283. 142.39 s > integrand n-terms: 1, byte size: 217,expr:
  2284. 142.39 s > 1/(denom(0,q₀,mass_scalar_1²,-mass_scalar_1²+(q₀.q₀))·denom(2,q₂,mass_scalar_1²,-mass_scalar_1²+(q₂.q₂)))
  2285. 142.39 s > reduced 3I
  2286. 142.39 s > span grow{span_context=true current=subgraph=3I, topo_order=1, dod=0 given=subgraph=0, topo_order=0, dod=0}
  2287. 142.39 s > [2026-08-28 17:29:17.674] @approx::local_4d [{#uv, #inspect, #integrated}] DEBUG : Rescaled momenta expanded
  2288. 142.39 s > field value
  2289. 142.39 s > res n-terms: 1, byte size: 611,expr:
  2290. 142.39 s > 1/(denom(0,q₀/t,mass_scalar_1²,-mass_scalar_1²+(q₀.q₀)/t²)
  2291. 142.39 s > ·denom(2,-q₁+q₃-q₀/t,mass_scalar_1²,
  2292. 142.39 s > -mass_scalar_1²+2·(q₀.q₁)/t-2·(q₀.q₃)/t+(q₀.q₀)/t²+(q₁.q₁)
  2293. 142.39 s > -2·(q₁.q₃)+(q₃.q₃)
  2294. 142.39 s > ))
  2295. 142.39 s > span t{span_context=true current=subgraph=3I, topo_order=1, dod=0 given=subgraph=0, topo_order=0, dod=0}
  2296. 142.39 s > [2026-08-28 17:29:17.674] @approx::local_4d [{#uv, #integrated, #rescaled}] DEBUG : Rescaled expanded
  2297. 142.39 s > field value
  2298. 142.39 s > n_loops 1
  2299. 142.39 s > res n-terms: 1, byte size: 723,expr:
  2300. 142.39 s > 1/(denom(0,q₀,mUVexp²+t²·mass_scalar_1²,-mUV²+t²·(-mass_scalar_1²+(q₀.q₀)/t²)+t²·mUVexp²)
  2301. 142.39 s > ·denom(2,-q₀,mUVexp²+t²·mass_scalar_1²,
  2302. 142.39 s > -mUV²
  2303. 142.39 s > +t²
  2304. 142.39 s > ·(-mass_scalar_1²+2·(q₀.q₁)/t-2·(q₀.q₃)/t+(q₀.q₀)/t²+(q₁.q₁)
  2305. 142.39 s > -2·(q₁.q₃)+(q₃.q₃)
  2306. 142.39 s > )
  2307. 142.39 s > +t²·mUVexp²
  2308. 142.39 s > ))
  2309. 142.39 s > span t{span_context=true current=subgraph=3I, topo_order=1, dod=0 given=subgraph=0, topo_order=0, dod=0}
  2310. 142.39 s > [2026-08-28 17:29:17.675] @approx::local_4d [{#uv, #integrated, #series}] DEBUG : Series expanded
  2311. 142.39 s > field value
  2312. 142.39 s > res n-terms: 1, byte size: 223,expr:
  2313. 142.39 s > 1/(denom(0,q₀,mUVexp²,-mUV²+(q₀.q₀))·denom(2,-q₀,mUVexp²,-mUV²+(q₀.q₀)))
  2314. 142.39 s > span t{span_context=true current=subgraph=3I, topo_order=1, dod=0 given=subgraph=0, topo_order=0, dod=0}
  2315. 142.39 s > [2026-08-28 17:29:17.675] @approx::local_4d [{#uv, #integrated, #series}] DEBUG : Evaluated at t = 1
  2316. 142.39 s > field value
  2317. 142.39 s > res n-terms: 1, byte size: 223,expr:
  2318. 142.39 s > 1/(denom(0,q₀,mUVexp²,-mUV²+(q₀.q₀))·denom(2,-q₀,mUVexp²,-mUV²+(q₀.q₀)))
  2319. 142.39 s > span t{span_context=true current=subgraph=3I, topo_order=1, dod=0 given=subgraph=0, topo_order=0, dod=0}
  2320. 142.39 s > [2026-08-28 17:29:17.675] @approx::local_4d [{#uv, #collect, #integrated}] DEBUG : After gamma chain collection
  2321. 142.39 s > field value
  2322. 142.39 s > expr n-terms: 1, byte size: 223,expr:
  2323. 142.39 s > 1/(denom(0,q₀,mUVexp²,-mUV²+(q₀.q₀))·denom(2,-q₀,mUVexp²,-mUV²+(q₀.q₀)))
  2324. 142.39 s > span t{span_context=true current=subgraph=3I, topo_order=1, dod=0 given=subgraph=0, topo_order=0, dod=0}
  2325. 142.39 s > [2026-08-28 17:29:17.675] @approx::local_4d [{#profile, #uv, #collect, #integrated, #start, #trace}] DEBUG : After gamma schoonschip
  2326. 142.39 s > field value
  2327. 142.39 s > expr n-terms: 1, byte size: 223,expr:
  2328. 142.39 s > 1/(denom(0,q₀,mUVexp²,-mUV²+(q₀.q₀))·denom(2,-q₀,mUVexp²,-mUV²+(q₀.q₀)))
  2329. 142.39 s > span t{span_context=true current=subgraph=3I, topo_order=1, dod=0 given=subgraph=0, topo_order=0, dod=0}
  2330. 142.39 s > [2026-08-28 17:29:17.675] @approx::local_4d [{#profile, #uv, #collect, #integrated, #start, #trace}] DEBUG : After gamma collection
  2331. 142.39 s > field value
  2332. 142.39 s > expr n-terms: 1, byte size: 223,expr:
  2333. 142.39 s > 1/(denom(0,q₀,mUVexp²,-mUV²+(q₀.q₀))·denom(2,-q₀,mUVexp²,-mUV²+(q₀.q₀)))
  2334. 142.39 s > span t{span_context=true current=subgraph=3I, topo_order=1, dod=0 given=subgraph=0, topo_order=0, dod=0}
  2335. 142.39 s > [2026-08-28 17:29:17.676] @approx::local_4d [{#profile, #uv, #gamma, #integrated, #start, #trace, #vakint}] DEBUG : After gamma simplification
  2336. 142.39 s > field value
  2337. 142.39 s > expr n-terms: 1, byte size: 223,expr:
  2338. 142.39 s > 1/(denom(0,q₀,mUVexp²,-mUV²+(q₀.q₀))·denom(2,-q₀,mUVexp²,-mUV²+(q₀.q₀)))
  2339. 142.39 s > span t{span_context=true current=subgraph=3I, topo_order=1, dod=0 given=subgraph=0, topo_order=0, dod=0}
  2340. 142.39 s > [2026-08-28 17:29:17.676] @approx::local_4d [{#profile, #uv, #integrated, #schoonschip, #start, #trace, #vakint}] DEBUG : After Schoonschip net
  2341. 142.39 s > field value
  2342. 142.39 s > expr n-terms: 1, byte size: 223,expr:
  2343. 142.39 s > 1/(denom(0,q₀,mUVexp²,-mUV²+(q₀.q₀))·denom(2,-q₀,mUVexp²,-mUV²+(q₀.q₀)))
  2344. 142.39 s > ... omitted 20095 more lines; see full nextest output above
  2345. 142.39 s >
  2346. 142.39 s > 9. gammaloop-integration-tests::uv::se1l_uv
  2347. 142.39 s > failure: test failure with exit code 101
  2348. 142.39 s > system-out
  2349. 142.39 s > running 1 test
  2350. 142.39 s > test se1l_uv has been running for over 60 seconds
  2351. 142.39 s > +------+-----------------+---------+--------+----------+-----------------------------------------------------------------------------------------------------------------------+-------+
  2352. 142.39 s > | case | check | graph | status | sigma | threshold | error |
  2353. 142.39 s > +------+-----------------+---------+--------+----------+-----------------------------------------------------------------------------------------------------------------------+-------+
  2354. 142.39 s > | se1l | uv_profile | - | FAIL | - | - | - |
  2355. 142.39 s > +------+-----------------+---------+--------+----------+-----------------------------------------------------------------------------------------------------------------------+-------+
  2356. 142.39 s > | se1l | m_uv.inspect | inspect | pass | - | best inspect relative delta 1.097e-1 >= 1000*accuracy 1.000e-7 (accuracy=1.000e-10, exponent=+2.0, seed=1, probes=10) | - |
  2357. 142.39 s > +------+-----------------+---------+--------+----------+-----------------------------------------------------------------------------------------------------------------------+-------+
  2358. 142.39 s > | se1l | m_uv.integrated | se1l | pass | 0.1sigma | compatible within 2sigma | - |
  2359. 142.39 s > +------+-----------------+---------+--------+----------+-----------------------------------------------------------------------------------------------------------------------+-------+
  2360. 142.39 s > | se1l | rls.inspect | inspect | pass | - | best inspect relative delta 4.499e-2 >= 1000*accuracy 1.000e-7 (accuracy=1.000e-10, exponent=+2.0, seed=1, probes=10) | - |
  2361. 142.39 s > +------+-----------------+---------+--------+----------+-----------------------------------------------------------------------------------------------------------------------+-------+
  2362. 142.39 s > | se1l | rls.integrated | se1l | pass | 0.0sigma | compatible within 2sigma | - |
  2363. 142.39 s > +------+-----------------+---------+--------+----------+-----------------------------------------------------------------------------------------------------------------------+-------+
  2364. 142.39 s > | se1l | mu_r.inspect | inspect | pass | - | best inspect relative delta 1.424e-1 >= 1000*accuracy 1.000e-7 (accuracy=1.000e-10, exponent=+2.0, seed=1, probes=10) | - |
  2365. 142.39 s > +------+-----------------+---------+--------+----------+-----------------------------------------------------------------------------------------------------------------------+-------+
  2366. 142.39 s > | se1l | target | - | pass | - | 2sigma | - |
  2367. 142.39 s > +------+-----------------+---------+--------+----------+-----------------------------------------------------------------------------------------------------------------------+-------+
  2368. 142.39 s > test se1l_uv ... FAILED
  2369. 142.39 s >
  2370. 142.39 s > failures:
  2371. 142.39 s >
  2372. 142.39 s > failures:
  2373. 142.39 s > se1l_uv
  2374. 142.39 s >
  2375. 142.39 s > test result: FAILED. 0 passed; 1 failed; 0 ignored; 0 measured; 24 filtered out; finished in 110.75s
  2376. 142.39 s > system-err
  2377. 142.39 s > [2026-08-28 17:29:17.359] @gammaloop_api::se... INFO : Running command run generate
  2378. 142.39 s > [2026-08-28 17:29:17.359] @gammaloop_api::se... INFO : Starting command block generate
  2379. 142.39 s > [2026-08-28 17:29:17.360] @gammaloop_api::se... INFO : Running command import model sm-default
  2380. 142.39 s > [2026-08-28 17:29:17.360] @import::model INFO : Loading built-in JSON model sm-default
  2381. 142.39 s > [2026-08-28 17:29:17.404] @gammalooprs::model INFO : The following 11 external parameters were forced to zero by the restriction card:
  2382. 142.39 s > lamWS, AWS, rhoWS, etaWS, ymc, yme, ymm, MC, Me, MM, WTau
  2383. 142.39 s > [2026-08-28 17:29:17.404] @gammalooprs::model INFO : The following 34 vertex rules were removed by the restriction card:
  2384. 142.39 s > V_82 -> (c~, d, G+) | V_83 -> (t~, d, G+) | V_84 -> (c~, s, G+) | V_85 -> (t~, s, G+) | V_86 -> (u~, b, G+) | V_87 -> (c~, b, G+) | V_90 -> (c~, d, W+) | V_91 -> (t~, d, W+) | V_92 -> (u~, s, W+) | V_94 -> (t~, s, W+) | V_95 -> (u~, b, W+) | V_96 -> (c~, b, W+) | V_101 -> (e+, e-, G0) | V_102 -> (mu+, mu-, G0) | V_104 -> (e+, e-, H) | V_105 -> (mu+, mu-, H) | V_110 -> (ve~, e-, G+) | V_111 -> (vm~, mu-, G+) | V_116 -> (b~, u, G-) | V_117 -> (d~, c, G-) | V_118 -> (s~, c, G-) | V_119 -> (b~, c, G-) | V_120 -> (d~, t, G-) | V_121 -> (s~, t, G-) | V_124 -> (s~, u, W-) | V_125 -> (b~, u, W-) | V_126 -> (d~, c, W-) | V_128 -> (b~, c, W-) | V_129 -> (d~, t, W-) | V_130 -> (s~, t, W-) | V_138 -> (c~, c, G0) | V_140 -> (c~, c, H) | V_145 -> (e+, ve, G-) | V_146 -> (mu+, vm, G-)
  2385. 142.39 s > [2026-08-28 17:29:17.404] @gammalooprs::model INFO : The following 36 couplings were removed by the restriction card:
  2386. 142.39 s > GC_13, GC_14, GC_16, GC_17, GC_18, GC_19, GC_20, GC_22, GC_23, GC_24, GC_25, GC_26, GC_28, GC_29, GC_42, GC_43, GC_44, GC_46, GC_47, GC_48, GC_84, GC_85, GC_86, GC_87, GC_88, GC_89, GC_90, GC_91, GC_92, GC_93, GC_101, GC_102, GC_103, GC_105, GC_106, GC_107
  2387. 142.39 s > [2026-08-28 17:29:17.404] @gammaloop_api::se... INFO : Running command remove processes
  2388. 142.39 s > [2026-08-28 17:29:17.404] @gammaloop_api::se... INFO : Running command set global kv global.generation.uv.generate_integrated=true
  2389. 142.39 s > [2026-08-28 17:29:17.405] @gammaloop_api::se... INFO : Running command import graphs ./tests/resources/graphs/uv_tests/se1l.dot -p se1l -i se1l
  2390. 142.39 s > [2026-08-28 17:29:17.405] @commands::import INFO : Loading graphs from '/build/source/tests/resources/graphs/uv_tests/se1l.dot'
  2391. 142.39 s > [2026-08-28 17:29:17.410] @gammaloop_api::se... INFO : Running command generate existing -p se1l -i se1l
  2392. 142.39 s > [2026-08-28 17:29:18.478] @commands::generate INFO :
  2393. 142.39 s > Integrand generation summary
  2394. 142.39 s > peak RAM 75.58 MiB | cores 1
  2395. 142.39 s > ╭───────────┬───────┬─────────┬─────────────┬─────────────┬────────────────┬─────────────╮
  2396. 142.39 s > │ integrand │ graph │ # evals │ expr build │ spenso │ symbolica eval │ compile │
  2397. 142.39 s > ├───────────┼───────┼─────────┼─────────────┼─────────────┼────────────────┼─────────────┤
  2398. 142.39 s > │ se1l │ se1l │ 5 │ 940ms (90%) │ 44ms (4.3%) │ 55ms (5.3%) │ 0ms (0.00%) │
  2399. 142.39 s > ├───────────┼───────┼─────────┼─────────────┼─────────────┼────────────────┼─────────────┤
  2400. 142.39 s > │ Total │ │ 5 │ 940ms (90%) │ 44ms (4.3%) │ 55ms (5.3%) │ 0ms (0.00%) │
  2401. 142.39 s > ╰───────────┴───────┴─────────┴─────────────┴─────────────┴────────────────┴─────────────╯
  2402. 142.39 s > [2026-08-28 17:29:18.479] @gammaloop_api::se... INFO : Running command set process -p se1l -i se1l kv general.m_uv=0.2
  2403. 142.39 s > [2026-08-28 17:29:18.480] @gammaloop_api::se... INFO : Running command set process -p se1l -i se1l kv general.mu_r=0.2
  2404. 142.39 s > [2026-08-28 17:29:18.480] @gammaloop_api::se... INFO : Running command set process -p se1l -i se1l kv general.renormalization_localization_scale=0.2
  2405. 142.39 s > [2026-08-28 17:29:18.481] @gammaloop_api::se... INFO : Running command duplicate integrand -p se1l -i se1l --output_process_name se1l --output_integrand_name se1l_muv_shifted
  2406. 142.39 s > [2026-08-28 17:29:18.483] @gammaloop_api::se... INFO : Running command set process -p se1l -i se1l_muv_shifted kv general.m_uv=0.5
  2407. 142.39 s > [2026-08-28 17:29:18.483] @gammaloop_api::se... INFO : Running command duplicate integrand -p se1l -i se1l --output_process_name se1l --output_integrand_name se1l_rls_shifted
  2408. 142.39 s > [2026-08-28 17:29:18.485] @gammaloop_api::se... INFO : Running command set process -p se1l -i se1l_rls_shifted kv general.renormalization_localization_scale=1
  2409. 142.39 s > [2026-08-28 17:29:18.486] @gammaloop_api::se... INFO : Running command duplicate integrand -p se1l -i se1l --output_process_name se1l --output_integrand_name se1l_mur_shifted
  2410. 142.39 s > [2026-08-28 17:29:18.488] @gammaloop_api::se... INFO : Running command set process -p se1l -i se1l_mur_shifted kv general.mu_r=0.8
  2411. 142.39 s > [2026-08-28 17:29:18.493] @process::amplitude WARNING : External state 0 ('g', PDG 21, helicity +) is off shell: p^2 = +2.5e5, expected m^2 = +0e0 (|Δ| = +2.5e5). Fixed-helicity spinor/vector/tensor external states may be ill-defined at this kinematic point.
  2412. 142.39 s > field value
  2413. 142.39 s > span warm_up{integrand.name=se1l}
  2414. 142.39 s > [2026-08-28 17:29:18.493] @process::amplitude WARNING : External state 1 ('g', PDG 21, helicity -) is off shell: p^2 = +2.5e5, expected m^2 = +0e0 (|Δ| = +2.5e5). Fixed-helicity spinor/vector/tensor external states may be ill-defined at this kinematic point.
  2415. 142.39 s > field value
  2416. 142.39 s > span warm_up{integrand.name=se1l}
  2417. 142.39 s > [2026-08-28 17:29:18.493] @process::amplitude INFO : Input is above threshold: 1 existing threshold E-surfaces across 1/1 graph groups
  2418. 142.39 s > field value
  2419. 142.39 s > existing_esurfaces 1
  2420. 142.39 s > group_count 1
  2421. 142.39 s > groups_above_threshold 1
  2422. 142.39 s > integrand se1l
  2423. 142.39 s > span warm_up{integrand.name=se1l}
  2424. 142.39 s > threshold_status above threshold
  2425. 142.39 s > [2026-08-28 17:29:18.493] @process::amplitude INFO : overlap structure of group 0: [1: [0(2,3)]]
  2426. 142.39 s > field value
  2427. 142.39 s > span warm_up{integrand.name=se1l}
  2428. 142.39 s > [2026-08-28 17:29:18.786] @commands::profile INFO :
  2429. 142.39 s > ╭───────┬──────┬──────────┬───────┬─────┬──────────┬───────────╮
  2430. 142.39 s > │ fixed │ → ∞ │ slope │ r2 │ DOD │ bare DOD │ inspect │
  2431. 142.39 s > ├───────┼──────┼──────────┼───────┼─────┼──────────┼───────────┤
  2432. 142.39 s > │ {} │ {e3} │ 1.639236 │ 0.904 │ 2 │ 2 │ arb retry │
  2433. 142.39 s > │ {} │ {e2} │ 1.698834 │ 0.902 │ 2 │ 2 │ arb retry │
  2434. 142.39 s > ╰───────┴──────┴──────────┴───────┴─────┴──────────┴───────────╯
  2435. 142.39 s > [2026-08-28 17:29:18.786] @commands::profile INFO :
  2436. 142.39 s > ╭───────┬──────┬─────────────┬──────────┬───────┬─────┬──────────┬───────────╮
  2437. 142.39 s > │ fixed │ → ∞ │ orientation │ slope │ r2 │ DOD │ bare DOD │ inspect │
  2438. 142.39 s > ├───────┼──────┼─────────────┼──────────┼───────┼─────┼──────────┼───────────┤
  2439. 142.39 s > │ {} │ {e3} │ 00-+ │ 0.343429 │ 0.145 │ 0 │ 2 │ arb retry │
  2440. 142.39 s > │ {} │ {e3} │ 00+- │ 0.342577 │ 0.135 │ 0 │ 2 │ arb retry │
  2441. 142.39 s > │ {} │ {e2} │ 00-+ │ 0.385975 │ 0.161 │ 0 │ 2 │ arb retry │
  2442. 142.39 s > │ {} │ {e2} │ 00+- │ 0.384920 │ 0.192 │ 0 │ 2 │ arb retry │
  2443. 142.39 s > ╰───────┴──────┴─────────────┴──────────┴───────┴─────┴──────────┴───────────╯
  2444. 142.39 s > [2026-08-28 17:29:18.787] @gammaloop_api::se... INFO : Running command set process kv integrator.target_relative_accuracy=0.001 integrator.n_increase=0 integrator.n_start=50000 integrator.n_max=400000 integrator.seed=1337
  2445. 142.39 s > [2026-08-28 17:29:18.787] @commands::integrate INFO : Created workspace directory at /build/source/tests/artifacts/se1l/integration_workspace_se1l
  2446. 142.39 s > [2026-08-28 17:29:18.809] @commands::integrate INFO : No integration state found, starting new integration
  2447. 142.39 s > [2026-08-28 17:29:18.809] @commands::integrate INFO : Gammaloop now integrates se1l@se1l, se1l@se1l_muv_shifted, se1l@se1l_rls_shifted
  2448. 142.39 s > [2026-08-28 17:29:18.809] @process::amplitude WARNING : External state 0 ('g', PDG 21, helicity +) is off shell: p^2 = +2.5e5, expected m^2 = +0e0 (|Δ| = +2.5e5). Fixed-helicity spinor/vector/tensor external states may be ill-defined at this kinematic point.
  2449. 142.39 s > field value
  2450. 142.39 s > span warm_up{integrand.name=se1l}
  2451. 142.39 s > [2026-08-28 17:29:18.809] @process::amplitude WARNING : External state 1 ('g', PDG 21, helicity -) is off shell: p^2 = +2.5e5, expected m^2 = +0e0 (|Δ| = +2.5e5). Fixed-helicity spinor/vector/tensor external states may be ill-defined at this kinematic point.
  2452. 142.39 s > field value
  2453. 142.39 s > span warm_up{integrand.name=se1l}
  2454. 142.39 s > [2026-08-28 17:29:18.809] @process::amplitude INFO : Input is above threshold: 1 existing threshold E-surfaces across 1/1 graph groups
  2455. 142.39 s > field value
  2456. 142.39 s > existing_esurfaces 1
  2457. 142.39 s > group_count 1
  2458. 142.39 s > groups_above_threshold 1
  2459. 142.39 s > integrand se1l
  2460. 142.39 s > span warm_up{integrand.name=se1l}
  2461. 142.39 s > threshold_status above threshold
  2462. 142.39 s > [2026-08-28 17:29:18.809] @process::amplitude INFO : overlap structure of group 0: [1: [0(2,3)]]
  2463. 142.39 s > field value
  2464. 142.39 s > span warm_up{integrand.name=se1l}
  2465. 142.39 s > [2026-08-28 17:29:18.810] @process::amplitude WARNING : External state 0 ('g', PDG 21, helicity +) is off shell: p^2 = +2.5e5, expected m^2 = +0e0 (|Δ| = +2.5e5). Fixed-helicity spinor/vector/tensor external states may be ill-defined at this kinematic point.
  2466. 142.39 s > field value
  2467. 142.39 s > span warm_up{integrand.name=se1l_muv_shifted}
  2468. 142.39 s > [2026-08-28 17:29:18.810] @process::amplitude WARNING : External state 1 ('g', PDG 21, helicity -) is off shell: p^2 = +2.5e5, expected m^2 = +0e0 (|Δ| = +2.5e5). Fixed-helicity spinor/vector/tensor external states may be ill-defined at this kinematic point.
  2469. 142.39 s > field value
  2470. 142.39 s > span warm_up{integrand.name=se1l_muv_shifted}
  2471. 142.39 s > [2026-08-28 17:29:18.810] @process::amplitude INFO : Input is above threshold: 1 existing threshold E-surfaces across 1/1 graph groups
  2472. 142.39 s > field value
  2473. 142.39 s > existing_esurfaces 1
  2474. 142.39 s > group_count 1
  2475. 142.39 s > groups_above_threshold 1
  2476. 142.39 s > integrand se1l_muv_shifted
  2477. 142.39 s > span warm_up{integrand.name=se1l_muv_shifted}
  2478. 142.39 s > threshold_status above threshold
  2479. 142.39 s > [2026-08-28 17:29:18.810] @process::amplitude INFO : overlap structure of group 0: [1: [0(2,3)]]
  2480. 142.39 s > field value
  2481. 142.39 s > span warm_up{integrand.name=se1l_muv_shifted}
  2482. 142.39 s > [2026-08-28 17:29:18.812] @process::amplitude WARNING : External state 0 ('g', PDG 21, helicity +) is off shell: p^2 = +2.5e5, expected m^2 = +0e0 (|Δ| = +2.5e5). Fixed-helicity spinor/vector/tensor external states may be ill-defined at this kinematic point.
  2483. 142.39 s > field value
  2484. 142.39 s > span warm_up{integrand.name=se1l_rls_shifted}
  2485. 142.39 s > [2026-08-28 17:29:18.812] @process::amplitude WARNING : External state 1 ('g', PDG 21, helicity -) is off shell: p^2 = +2.5e5, expected m^2 = +0e0 (|Δ| = +2.5e5). Fixed-helicity spinor/vector/tensor external states may be ill-defined at this kinematic point.
  2486. 142.39 s > field value
  2487. 142.39 s > span warm_up{integrand.name=se1l_rls_shifted}
  2488. 142.39 s > [2026-08-28 17:29:18.812] @process::amplitude INFO : Input is above threshold: 1 existing threshold E-surfaces across 1/1 graph groups
  2489. 142.39 s > field value
  2490. 142.39 s > existing_esurfaces 1
  2491. 142.39 s > group_count 1
  2492. 142.39 s > groups_above_threshold 1
  2493. 142.39 s > integrand se1l_rls_shifted
  2494. 142.39 s > span warm_up{integrand.name=se1l_rls_shifted}
  2495. 142.39 s > threshold_status above threshold
  2496. 142.39 s > ... omitted 1410 more lines; see full nextest output above
  2497. 142.39 s > =========================================
  2498. 142.39 s For full logs, run:
  2499. 142.39 s nix log /nix/store/5lvckp7qh3dqs2nqf61qj4kz6kj46p4q-gammaloop-nextest-integration.drv
  2500. 142.49 s Run failed.