test packages.x86_64-linux.nix-ci-check-gammaloop-nextest-integration

Reproduce this run
Original Run
  1. 135.51 s gammaloop-nextest-integration> | dod2_bubble | rls.integrated | GL0 | pass | 0.0sigma | compatible within 2sigma | - |
  2. 135.51 s gammaloop-nextest-integration> +-------------+-----------------+---------+--------+----------+-----------------------------------------------------------------------------------------------------------------------+-------+
  3. 135.51 s gammaloop-nextest-integration> | dod2_bubble | mu_r.inspect | inspect | pass | - | best inspect relative delta 6.951e-1 >= 1000*accuracy 1.000e-7 (accuracy=1.000e-10, exponent=+0.0, seed=0, probes=10) | - |
  4. 135.51 s gammaloop-nextest-integration> +-------------+-----------------+---------+--------+----------+-----------------------------------------------------------------------------------------------------------------------+-------+
  5. 135.51 s gammaloop-nextest-integration> | dod2_bubble | target | - | pass | - | 2sigma | - |
  6. 135.51 s gammaloop-nextest-integration> +-------------+-----------------+---------+--------+----------+-----------------------------------------------------------------------------------------------------------------------+-------+
  7. 135.51 s gammaloop-nextest-integration> test dod2_bubble_uv ... FAILED
  8. 135.51 s gammaloop-nextest-integration>
  9. 135.51 s gammaloop-nextest-integration> failures:
  10. 135.51 s gammaloop-nextest-integration>
  11. 135.51 s gammaloop-nextest-integration> failures:
  12. 135.51 s gammaloop-nextest-integration> dod2_bubble_uv
  13. 135.51 s gammaloop-nextest-integration>
  14. 135.51 s gammaloop-nextest-integration> test result: FAILED. 0 passed; 1 failed; 0 ignored; 0 measured; 24 filtered out; finished in 42.62s
  15. 135.51 s gammaloop-nextest-integration> system-err
  16. 135.51 s gammaloop-nextest-integration> [2026-08-28 17:31:40.360] @gammaloop_api::se... INFO : Running command run generate
  17. 135.51 s gammaloop-nextest-integration> [2026-08-28 17:31:40.360] @gammaloop_api::se... INFO : Starting command block generate
  18. 135.51 s gammaloop-nextest-integration> [2026-08-28 17:31:40.361] @gammaloop_api::se... INFO : Running command import model scalars-default.json
  19. 135.51 s gammaloop-nextest-integration> [2026-08-28 17:31:40.361] @import::model INFO : Loading built-in JSON model scalars-default
  20. 135.51 s gammaloop-nextest-integration> [2026-08-28 17:31:40.364] @gammalooprs::model INFO : The following 2 external parameters were forced to zero by the restriction card:
  21. 135.51 s gammaloop-nextest-integration> width_scalar_1, width_scalar_2
  22. 135.51 s gammaloop-nextest-integration> [2026-08-28 17:31:40.365] @gammaloop_api::se... INFO : Running command remove processes
  23. 135.51 s gammaloop-nextest-integration> [2026-08-28 17:31:40.365] @gammaloop_api::se... INFO : Running command set global kv global.generation.uv.generate_integrated=true
  24. 135.51 s gammaloop-nextest-integration> [2026-08-28 17:31:40.365] @gammaloop_api::se... INFO : Running command import graphs ./tests/resources/graphs/scalar/dod2_bubble.dot -p bubble_dod2 -i scalar_bubble_below_thres
  25. 135.51 s gammaloop-nextest-integration> [2026-08-28 17:31:40.365] @commands::import INFO : Loading graphs from '/build/source/tests/resources/graphs/scalar/dod2_bubble.dot'
  26. 135.51 s gammaloop-nextest-integration> [2026-08-28 17:31:40.370] @gammaloop_api::se... INFO : Running command generate existing -p bubble_dod2 -i scalar_bubble_below_thres
  27. 135.51 s gammaloop-nextest-integration> [2026-08-28 17:31:40.380] @approx::local_4d [{#uv, #inspect, #integrated}] DEBUG : Rescaled momenta expanded
  28. 135.51 s gammaloop-nextest-integration> field value
  29. 135.51 s gammaloop-nextest-integration> res n-terms: 1, byte size: 585,expr:
  30. 135.51 s gammaloop-nextest-integration> -SCALAR_COUPLING²·q₀(αᵉ².¹)·q₀(αᵉ³.¹)·q₂(αᵉ².¹)·q₂(αᵉ³.¹)
  31. 135.51 s gammaloop-nextest-integration> /(t²·denom(3,-q₀-q₂/t,mass_scalar_2²,-mass_scalar_2²+2·(q₀.q₂)/t+(q₂.q₂)/t²+(q₀.q₀))
  32. 135.51 s gammaloop-nextest-integration> ·denom(2,q₂/t,mass_scalar_2²,-mass_scalar_2²+(q₂.q₂)/t²))
  33. 135.51 s gammaloop-nextest-integration> [2026-08-28 17:31:40.381] @approx::local_4d [{#uv, #inspect, #integrated}] DEBUG : Rescaled momenta expanded
  34. 135.51 s gammaloop-nextest-integration> field value
  35. 135.51 s gammaloop-nextest-integration> res n-terms: 1, byte size: 3,expr:
  36. 135.51 s gammaloop-nextest-integration> 1
  37. 135.51 s gammaloop-nextest-integration> [2026-08-28 17:31:40.381] @approx::final_integrand[{#generation, #profile, #uv, #graph, #summary}] DEBUG : Computed global numerator
  38. 135.51 s gammaloop-nextest-integration> field value
  39. 135.51 s gammaloop-nextest-integration> global_num n-terms: 1, byte size: 4,expr:
  40. 135.51 s gammaloop-nextest-integration> 1/2
  41. 135.51 s gammaloop-nextest-integration> span build_3d{span_context=true graph=GL0 current=subgraph=0, topo_order=0, dod=0}
  42. 135.51 s gammaloop-nextest-integration> [2026-08-28 17:31:40.386] @uv::approx [{#generation, #uv, #fourd}] DEBUG : Computing 4D
  43. 135.51 s gammaloop-nextest-integration> field value
  44. 135.51 s gammaloop-nextest-integration> simple subgraph(S_11,S_y)*Approx(subgraph(S_y,0)) of GL0
  45. 135.51 s gammaloop-nextest-integration> span compute_4d{span_context=true graph=GL0 current=subgraph=y, topo_order=1, dod=2 given=subgraph=0, topo_order=0, dod=0 reduced=SubSet { set: BitVec<usize, bitvec::order::Lsb0> { addr: 0x7fffd000d200, head: 000000, bits: 6, capacity: 64 } [0, 0, 1, 1, 1, 1], id: PhantomData<linnet::half_edge::involution::Hedge> }}
  46. 135.51 s gammaloop-nextest-integration> [2026-08-28 17:31:40.390] @approx::local_4d [{#uv, #algebra, #integrated, #start}] DEBUG :
  47. 135.51 s gammaloop-nextest-integration> field value
  48. 135.51 s gammaloop-nextest-integration> integrand n-terms: 1, byte size: 409,expr:
  49. 135.51 s gammaloop-nextest-integration> SCALAR_COUPLING²·(q₀(αᵉ³.¹)+q₃(αᵉ³.¹))·q₀(αᵉ².¹)·q₀(αᵉ³.¹)·q₂(αᵉ².¹)
  50. 135.51 s gammaloop-nextest-integration> /(denom(2,q₂,mass_scalar_2²,-mass_scalar_2²+(q₂.q₂))·denom(3,q₃,mass_scalar_2²,-mass_scalar_2²+(q₃.q₃)))
  51. 135.51 s gammaloop-nextest-integration> reduced y
  52. 135.51 s gammaloop-nextest-integration> span grow{span_context=true current=subgraph=y, topo_order=1, dod=2 given=subgraph=0, topo_order=0, dod=0}
  53. 135.51 s gammaloop-nextest-integration> [2026-08-28 17:31:40.390] @approx::local_4d [{#uv, #inspect, #integrated}] DEBUG : Rescaled momenta expanded
  54. 135.51 s gammaloop-nextest-integration> field value
  55. 135.51 s gammaloop-nextest-integration> res n-terms: 1, byte size: 585,expr:
  56. 135.51 s gammaloop-nextest-integration> -SCALAR_COUPLING²·q₀(αᵉ².¹)·q₀(αᵉ³.¹)·q₂(αᵉ².¹)·q₂(αᵉ³.¹)
  57. 135.51 s gammaloop-nextest-integration> /(t²·denom(3,-q₀-q₂/t,mass_scalar_2²,-mass_scalar_2²+2·(q₀.q₂)/t+(q₂.q₂)/t²+(q₀.q₀))
  58. 135.51 s gammaloop-nextest-integration> ·denom(2,q₂/t,mass_scalar_2²,-mass_scalar_2²+(q₂.q₂)/t²))
  59. 135.51 s gammaloop-nextest-integration> span t{span_context=true current=subgraph=y, topo_order=1, dod=2 given=subgraph=0, topo_order=0, dod=0}
  60. 135.51 s gammaloop-nextest-integration> [2026-08-28 17:31:40.392] @approx::local_4d [{#uv, #integrated, #rescaled}] DEBUG : Rescaled expanded
  61. 135.51 s gammaloop-nextest-integration> field value
  62. 135.51 s gammaloop-nextest-integration> n_loops 1
  63. 135.51 s gammaloop-nextest-integration> res n-terms: 1, byte size: 707,expr:
  64. 135.51 s gammaloop-nextest-integration> -SCALAR_COUPLING²·q₀(αᵉ².¹)·q₀(αᵉ³.¹)·q₂(αᵉ².¹)·q₂(αᵉ³.¹)
  65. 135.51 s gammaloop-nextest-integration> /(t²·denom(3,-q₂,mUVexp²+t²·mass_scalar_2²,-mUV²+t²·(-mass_scalar_2²+2·(q₀.q₂)/t+(q₂.q₂)/t²+(q₀.q₀))+t²·mUVexp²)
  66. 135.51 s gammaloop-nextest-integration> ·denom(2,q₂,mUVexp²+t²·mass_scalar_2²,-mUV²+t²·(-mass_scalar_2²+(q₂.q₂)/t²)+t²·mUVexp²))
  67. 135.51 s gammaloop-nextest-integration> span t{span_context=true current=subgraph=y, topo_order=1, dod=2 given=subgraph=0, topo_order=0, dod=0}
  68. 135.51 s gammaloop-nextest-integration> [2026-08-28 17:31:40.393] @approx::local_4d [{#uv, #integrated, #series}] DEBUG : Series expanded
  69. 135.51 s gammaloop-nextest-integration> field value
  70. 135.51 s gammaloop-nextest-integration> res n-terms: 3, byte size: 1896,expr:
  71. 135.51 s gammaloop-nextest-integration> (1/2·SCALAR_COUPLING²·(2·mUVexp²-2·mass_scalar_2²)/(denom(2,q₂,mUVexp²,-mUV²+(q₂.q₂))²·denom(3,-q₂,mUVexp²,-mUV²+(q₂.q₂)))
  72. 135.51 s gammaloop-nextest-integration> -SCALAR_COUPLING²
  73. 135.51 s gammaloop-nextest-integration> ·(-1/2·(2·mUVexp²-2·mass_scalar_2²+2·(q₀.q₀))/denom(3,-q₂,mUVexp²,-mUV²+(q₂.q₂))
  74. 135.51 s gammaloop-nextest-integration> +4·(q₀.q₂)²/denom(3,-q₂,mUVexp²,-mUV²+(q₂.q₂))²
  75. 135.51 s gammaloop-nextest-integration> )/(denom(2,q₂,mUVexp²,-mUV²+(q₂.q₂))·denom(3,-q₂,mUVexp²,-mUV²+(q₂.q₂)))
  76. 135.51 s gammaloop-nextest-integration> )·q₀(αᵉ².¹)·q₀(αᵉ³.¹)·q₂(αᵉ².¹)·q₂(αᵉ³.¹)
  77. 135.51 s gammaloop-nextest-integration> +2·SCALAR_COUPLING²·(q₀.q₂)·q₀(αᵉ².¹)·q₀(αᵉ³.¹)·q₂(αᵉ².¹)·q₂(αᵉ³.¹)
  78. 135.51 s gammaloop-nextest-integration> /(t·denom(2,q₂,mUVexp²,-mUV²+(q₂.q₂))·denom(3,-q₂,mUVexp²,-mUV²+(q₂.q₂))²)
  79. 135.51 s gammaloop-nextest-integration> -SCALAR_COUPLING²·q₀(αᵉ².¹)·q₀(αᵉ³.¹)·q₂(αᵉ².¹)·q₂(αᵉ³.¹)
  80. 135.51 s gammaloop-nextest-integration> /(t²·denom(2,q₂,mUVexp²,-mUV²+(q₂.q₂))·denom(3,-q₂,mUVexp²,-mUV²+(q₂.q₂)))
  81. 135.51 s gammaloop-nextest-integration> span t{span_context=true current=subgraph=y, topo_order=1, dod=2 given=subgraph=0, topo_order=0, dod=0}
  82. 135.51 s gammaloop-nextest-integration> [2026-08-28 17:31:40.393] @approx::local_4d [{#uv, #integrated, #series}] DEBUG : Evaluated at t = 1
  83. 135.51 s gammaloop-nextest-integration> field value
  84. 135.51 s gammaloop-nextest-integration> res n-terms: 3, byte size: 1880,expr:
  85. 135.51 s gammaloop-nextest-integration> (1/2·SCALAR_COUPLING²·(2·mUVexp²-2·mass_scalar_2²)/(denom(2,q₂,mUVexp²,-mUV²+(q₂.q₂))²·denom(3,-q₂,mUVexp²,-mUV²+(q₂.q₂)))
  86. 135.51 s gammaloop-nextest-integration> -SCALAR_COUPLING²
  87. 135.51 s gammaloop-nextest-integration> ·(-1/2·(2·mUVexp²-2·mass_scalar_2²+2·(q₀.q₀))/denom(3,-q₂,mUVexp²,-mUV²+(q₂.q₂))
  88. 135.51 s gammaloop-nextest-integration> +4·(q₀.q₂)²/denom(3,-q₂,mUVexp²,-mUV²+(q₂.q₂))²
  89. 135.51 s gammaloop-nextest-integration> )/(denom(2,q₂,mUVexp²,-mUV²+(q₂.q₂))·denom(3,-q₂,mUVexp²,-mUV²+(q₂.q₂)))
  90. 135.51 s gammaloop-nextest-integration> )·q₀(αᵉ².¹)·q₀(αᵉ³.¹)·q₂(αᵉ².¹)·q₂(αᵉ³.¹)
  91. 135.51 s gammaloop-nextest-integration> -SCALAR_COUPLING²·q₀(αᵉ².¹)·q₀(αᵉ³.¹)·q₂(αᵉ².¹)·q₂(αᵉ³.¹)
  92. 135.51 s gammaloop-nextest-integration> /(denom(2,q₂,mUVexp²,-mUV²+(q₂.q₂))·denom(3,-q₂,mUVexp²,-mUV²+(q₂.q₂)))
  93. 135.51 s gammaloop-nextest-integration> +2·SCALAR_COUPLING²·(q₀.q₂)·q₀(αᵉ².¹)·q₀(αᵉ³.¹)·q₂(αᵉ².¹)·q₂(αᵉ³.¹)
  94. 135.51 s gammaloop-nextest-integration> /(denom(2,q₂,mUVexp²,-mUV²+(q₂.q₂))·denom(3,-q₂,mUVexp²,-mUV²+(q₂.q₂))²)
  95. 135.51 s gammaloop-nextest-integration> span t{span_context=true current=subgraph=y, topo_order=1, dod=2 given=subgraph=0, topo_order=0, dod=0}
  96. 135.51 s gammaloop-nextest-integration> [2026-08-28 17:31:40.398] @approx::local_4d [{#uv, #collect, #integrated}] DEBUG : After gamma chain collection
  97. 135.51 s gammaloop-nextest-integration> field value
  98. 135.51 s gammaloop-nextest-integration> expr n-terms: 3, byte size: 1880,expr:
  99. 135.51 s gammaloop-nextest-integration> (1/2·SCALAR_COUPLING²·(2·mUVexp²-2·mass_scalar_2²)/(denom(2,q₂,mUVexp²,-mUV²+(q₂.q₂))²·denom(3,-q₂,mUVexp²,-mUV²+(q₂.q₂)))
  100. 135.51 s gammaloop-nextest-integration> -SCALAR_COUPLING²
  101. 135.51 s gammaloop-nextest-integration> ·(-1/2·(2·mUVexp²-2·mass_scalar_2²+2·(q₀.q₀))/denom(3,-q₂,mUVexp²,-mUV²+(q₂.q₂))
  102. 135.51 s gammaloop-nextest-integration> +4·(q₀.q₂)²/denom(3,-q₂,mUVexp²,-mUV²+(q₂.q₂))²
  103. 135.51 s gammaloop-nextest-integration> )/(denom(2,q₂,mUVexp²,-mUV²+(q₂.q₂))·denom(3,-q₂,mUVexp²,-mUV²+(q₂.q₂)))
  104. 135.51 s gammaloop-nextest-integration> )·q₀(αᵉ².¹)·q₀(αᵉ³.¹)·q₂(αᵉ².¹)·q₂(αᵉ³.¹)
  105. 135.51 s gammaloop-nextest-integration> -SCALAR_COUPLING²·q₀(αᵉ².¹)·q₀(αᵉ³.¹)·q₂(αᵉ².¹)·q₂(αᵉ³.¹)
  106. 135.51 s gammaloop-nextest-integration> /(denom(2,q₂,mUVexp²,-mUV²+(q₂.q₂))·denom(3,-q₂,mUVexp²,-mUV²+(q₂.q₂)))
  107. 135.51 s gammaloop-nextest-integration> +2·SCALAR_COUPLING²·(q₀.q₂)·q₀(αᵉ².¹)·q₀(αᵉ³.¹)·q₂(αᵉ².¹)·q₂(αᵉ³.¹)
  108. 135.51 s gammaloop-nextest-integration> /(denom(2,q₂,mUVexp²,-mUV²+(q₂.q₂))·denom(3,-q₂,mUVexp²,-mUV²+(q₂.q₂))²)
  109. 135.51 s gammaloop-nextest-integration> span t{span_context=true current=subgraph=y, topo_order=1, dod=2 given=subgraph=0, topo_order=0, dod=0}
  110. 135.51 s gammaloop-nextest-integration> [2026-08-28 17:31:40.399] @approx::local_4d [{#profile, #uv, #collect, #integrated, #start, #trace}] DEBUG : After gamma schoonschip
  111. 135.51 s gammaloop-nextest-integration> field value
  112. 135.51 s gammaloop-nextest-integration> expr n-terms: 3, byte size: 1631,expr:
  113. 135.51 s gammaloop-nextest-integration> (1/2·SCALAR_COUPLING²·(2·mUVexp²-2·mass_scalar_2²)/(denom(2,q₂,mUVexp²,-mUV²+(q₂.q₂))²·denom(3,-q₂,mUVexp²,-mUV²+(q₂.q₂)))
  114. 135.51 s gammaloop-nextest-integration> -SCALAR_COUPLING²
  115. 135.51 s gammaloop-nextest-integration> ·(-1/2·(2·mUVexp²-2·mass_scalar_2²+2·(q₀.q₀))/denom(3,-q₂,mUVexp²,-mUV²+(q₂.q₂))
  116. 135.51 s gammaloop-nextest-integration> +4·(q₀.q₂)²/denom(3,-q₂,mUVexp²,-mUV²+(q₂.q₂))²
  117. 135.51 s gammaloop-nextest-integration> )/(denom(2,q₂,mUVexp²,-mUV²+(q₂.q₂))·denom(3,-q₂,mUVexp²,-mUV²+(q₂.q₂)))
  118. 135.51 s gammaloop-nextest-integration> )·(q₀.q₂)²
  119. 135.51 s gammaloop-nextest-integration> -SCALAR_COUPLING²·(q₀.q₂)²/(denom(2,q₂,mUVexp²,-mUV²+(q₂.q₂))·denom(3,-q₂,mUVexp²,-mUV²+(q₂.q₂)))
  120. 135.51 s gammaloop-nextest-integration> +2·SCALAR_COUPLING²·(q₀.q₂)·(q₀.q₂)²
  121. 135.51 s gammaloop-nextest-integration> /(denom(2,q₂,mUVexp²,-mUV²+(q₂.q₂))·denom(3,-q₂,mUVexp²,-mUV²+(q₂.q₂))²)
  122. 135.51 s gammaloop-nextest-integration> span t{span_context=true current=subgraph=y, topo_order=1, dod=2 given=subgraph=0, topo_order=0, dod=0}
  123. 135.51 s gammaloop-nextest-integration> [2026-08-28 17:31:40.402] @approx::local_4d [{#profile, #uv, #collect, #integrated, #start, #trace}] DEBUG : After gamma collection
  124. 135.51 s gammaloop-nextest-integration> field value
  125. 135.51 s gammaloop-nextest-integration> expr n-terms: 1, byte size: 1347,expr:
  126. 135.51 s gammaloop-nextest-integration> SCALAR_COUPLING²
  127. 135.51 s gammaloop-nextest-integration> ·(-denom(2,q₂,mUVexp²,-mUV²+(q₂.q₂))·denom(3,-q₂,mUVexp²,-mUV²+(q₂.q₂))²
  128. 135.51 s gammaloop-nextest-integration> +1/2·(2·mUVexp²-2·mass_scalar_2²)·denom(3,-q₂,mUVexp²,-mUV²+(q₂.q₂))²
  129. 135.51 s gammaloop-nextest-integration> -(-1/2·(2·mUVexp²-2·mass_scalar_2²+2·(q₀.q₀))·denom(3,-q₂,mUVexp²,-mUV²+(q₂.q₂))+4·(q₀.q₂)²)
  130. 135.51 s gammaloop-nextest-integration> ·denom(2,q₂,mUVexp²,-mUV²+(q₂.q₂))
  131. 135.51 s gammaloop-nextest-integration> +2·(q₀.q₂)·denom(2,q₂,mUVexp²,-mUV²+(q₂.q₂))·denom(3,-q₂,mUVexp²,-mUV²+(q₂.q₂))
  132. 135.51 s gammaloop-nextest-integration> )·(q₀.q₂)²/(denom(2,q₂,mUVexp²,-mUV²+(q₂.q₂))²·denom(3,-q₂,mUVexp²,-mUV²+(q₂.q₂))³)
  133. 135.51 s gammaloop-nextest-integration> span t{span_context=true current=subgraph=y, topo_order=1, dod=2 given=subgraph=0, topo_order=0, dod=0}
  134. 135.51 s gammaloop-nextest-integration> [2026-08-28 17:31:40.403] @approx::local_4d [{#profile, #uv, #gamma, #integrated, #start, #trace, #vakint}] DEBUG : After gamma simplification
  135. 135.51 s gammaloop-nextest-integration> ... omitted 3263 more lines; see full nextest output above
  136. 135.51 s gammaloop-nextest-integration>
  137. 135.51 s gammaloop-nextest-integration> 8. gammaloop-integration-tests::uv::sunrise_scalar_1_uv
  138. 135.54 s gammaloop-nextest-integration> failure: test failure with exit code 101
  139. 135.54 s gammaloop-nextest-integration> system-out
  140. 135.54 s gammaloop-nextest-integration> running 1 test
  141. 135.54 s gammaloop-nextest-integration> test sunrise_scalar_1_uv has been running for over 60 seconds
  142. 135.54 s gammaloop-nextest-integration> +------------------+------------------------+--------------+--------+----------+----------------------------------------------------------------------------------------------------------------------+-------+
  143. 135.54 s gammaloop-nextest-integration> | case | check | graph | status | sigma | threshold | error |
  144. 135.54 s gammaloop-nextest-integration> +------------------+------------------------+--------------+--------+----------+----------------------------------------------------------------------------------------------------------------------+-------+
  145. 135.54 s gammaloop-nextest-integration> | sunrise_scalar_1 | uv_profile | - | FAIL | - | - | - |
  146. 135.54 s gammaloop-nextest-integration> +------------------+------------------------+--------------+--------+----------+----------------------------------------------------------------------------------------------------------------------+-------+
  147. 135.54 s gammaloop-nextest-integration> | sunrise_scalar_1 | m_uv.inspect | inspect | pass | - | best inspect relative delta 1.624e0 >= 1000*accuracy 1.000e-3 (accuracy=1.000e-6, exponent=+1.0, seed=1, probes=10) | - |
  148. 135.54 s gammaloop-nextest-integration> +------------------+------------------------+--------------+--------+----------+----------------------------------------------------------------------------------------------------------------------+-------+
  149. 135.54 s gammaloop-nextest-integration> | sunrise_scalar_1 | m_uv.integrated | sunrise | pass | 0.1sigma | compatible within 2sigma | - |
  150. 135.54 s gammaloop-nextest-integration> +------------------+------------------------+--------------+--------+----------+----------------------------------------------------------------------------------------------------------------------+-------+
  151. 135.54 s gammaloop-nextest-integration> | sunrise_scalar_1 | rls.inspect | inspect | pass | - | best inspect relative delta 8.682e-1 >= 1000*accuracy 1.000e-3 (accuracy=1.000e-6, exponent=+1.0, seed=1, probes=10) | - |
  152. 135.54 s gammaloop-nextest-integration> +------------------+------------------------+--------------+--------+----------+----------------------------------------------------------------------------------------------------------------------+-------+
  153. 135.54 s gammaloop-nextest-integration> | sunrise_scalar_1 | rls.integrated | sunrise | pass | 0.0sigma | compatible within 2sigma | - |
  154. 135.54 s gammaloop-nextest-integration> +------------------+------------------------+--------------+--------+----------+----------------------------------------------------------------------------------------------------------------------+-------+
  155. 135.54 s gammaloop-nextest-integration> | sunrise_scalar_1 | mu_r.inspect | inspect | pass | - | best inspect relative delta 1.752e0 >= 1000*accuracy 1.000e-3 (accuracy=1.000e-6, exponent=+1.0, seed=1, probes=10) | - |
  156. 135.54 s gammaloop-nextest-integration> +------------------+------------------------+--------------+--------+----------+----------------------------------------------------------------------------------------------------------------------+-------+
  157. 135.54 s gammaloop-nextest-integration> | sunrise_scalar_1 | integrated.relerr | integrated | pass | - | relative error 9.20% <= 10.00% | - |
  158. 135.54 s gammaloop-nextest-integration> +------------------+------------------------+--------------+--------+----------+----------------------------------------------------------------------------------------------------------------------+-------+
  159. 135.54 s gammaloop-nextest-integration> | sunrise_scalar_1 | m_uv.integrated.relerr | m_uv-shifted | pass | - | relative error 5.89% <= 10.00% | - |
  160. 135.54 s gammaloop-nextest-integration> +------------------+------------------------+--------------+--------+----------+----------------------------------------------------------------------------------------------------------------------+-------+
  161. 135.54 s gammaloop-nextest-integration> | sunrise_scalar_1 | target | - | pass | - | 2sigma | - |
  162. 135.54 s gammaloop-nextest-integration> +------------------+------------------------+--------------+--------+----------+----------------------------------------------------------------------------------------------------------------------+-------+
  163. 135.54 s gammaloop-nextest-integration> test sunrise_scalar_1_uv ... FAILED
  164. 135.54 s gammaloop-nextest-integration>
  165. 135.54 s gammaloop-nextest-integration> failures:
  166. 135.54 s gammaloop-nextest-integration>
  167. 135.54 s gammaloop-nextest-integration> failures:
  168. 135.54 s gammaloop-nextest-integration> sunrise_scalar_1_uv
  169. 135.54 s gammaloop-nextest-integration>
  170. 135.54 s gammaloop-nextest-integration> test result: FAILED. 0 passed; 1 failed; 0 ignored; 0 measured; 24 filtered out; finished in 97.70s
  171. 135.54 s gammaloop-nextest-integration> system-err
  172. 135.54 s gammaloop-nextest-integration> [2026-08-28 17:31:45.434] @gammaloop_api::se... INFO : Running command run generate
  173. 135.54 s gammaloop-nextest-integration> [2026-08-28 17:31:45.434] @gammaloop_api::se... INFO : Starting command block generate
  174. 135.54 s gammaloop-nextest-integration> [2026-08-28 17:31:45.434] @gammaloop_api::se... INFO : Running command import model scalars-default.json
  175. 135.54 s gammaloop-nextest-integration> [2026-08-28 17:31:45.434] @import::model INFO : Loading built-in JSON model scalars-default
  176. 135.54 s gammaloop-nextest-integration> [2026-08-28 17:31:45.438] @gammalooprs::model INFO : The following 2 external parameters were forced to zero by the restriction card:
  177. 135.54 s gammaloop-nextest-integration> width_scalar_1, width_scalar_2
  178. 135.54 s gammaloop-nextest-integration> [2026-08-28 17:31:45.438] @gammaloop_api::se... INFO : Running command remove processes
  179. 135.54 s gammaloop-nextest-integration> [2026-08-28 17:31:45.439] @gammaloop_api::se... INFO : Running command set global kv global.generation.uv.generate_integrated=true
  180. 135.54 s gammaloop-nextest-integration> [2026-08-28 17:31:45.439] @gammaloop_api::se... INFO : Running command import graphs ./tests/resources/graphs/scalar_sunrise.dot -p sunrise_scalar_1 -i scalar_sunrise
  181. 135.54 s gammaloop-nextest-integration> [2026-08-28 17:31:45.439] @commands::import INFO : Loading graphs from '/build/source/tests/resources/graphs/scalar_sunrise.dot'
  182. 135.54 s gammaloop-nextest-integration> [2026-08-28 17:31:45.441] @gammaloop_api::se... INFO : Running command generate existing -p sunrise_scalar_1 -i scalar_sunrise
  183. 135.54 s gammaloop-nextest-integration> [2026-08-28 17:31:45.444] @approx::local_4d [{#uv, #inspect, #integrated}] DEBUG : Rescaled momenta expanded
  184. 135.54 s gammaloop-nextest-integration> field value
  185. 135.54 s gammaloop-nextest-integration> res n-terms: 1, byte size: 611,expr:
  186. 135.54 s gammaloop-nextest-integration> 1/(denom(1,q₁/t,mass_scalar_1²,-mass_scalar_1²+(q₁.q₁)/t²)
  187. 135.54 s gammaloop-nextest-integration> ·denom(2,-q₀+q₃-q₁/t,mass_scalar_1²,
  188. 135.54 s gammaloop-nextest-integration> -mass_scalar_1²+2·(q₀.q₁)/t-2·(q₁.q₃)/t+(q₁.q₁)/t²+(q₀.q₀)
  189. 135.54 s gammaloop-nextest-integration> -2·(q₀.q₃)+(q₃.q₃)
  190. 135.54 s gammaloop-nextest-integration> ))
  191. 135.54 s gammaloop-nextest-integration> [2026-08-28 17:31:45.445] @approx::local_4d [{#uv, #inspect, #integrated}] DEBUG : Rescaled momenta expanded
  192. 135.54 s gammaloop-nextest-integration> field value
  193. 135.54 s gammaloop-nextest-integration> res n-terms: 1, byte size: 611,expr:
  194. 135.54 s gammaloop-nextest-integration> 1/(denom(0,q₀/t,mass_scalar_1²,-mass_scalar_1²+(q₀.q₀)/t²)
  195. 135.54 s gammaloop-nextest-integration> ·denom(2,-q₁+q₃-q₀/t,mass_scalar_1²,
  196. 135.54 s gammaloop-nextest-integration> -mass_scalar_1²+2·(q₀.q₁)/t-2·(q₀.q₃)/t+(q₀.q₀)/t²+(q₁.q₁)
  197. 135.55 s gammaloop-nextest-integration> -2·(q₁.q₃)+(q₃.q₃)
  198. 135.55 s gammaloop-nextest-integration> ))
  199. 135.55 s gammaloop-nextest-integration> [2026-08-28 17:31:45.448] @approx::local_4d [{#uv, #inspect, #integrated}] DEBUG : Rescaled momenta expanded
  200. 135.55 s gammaloop-nextest-integration> field value
  201. 135.55 s gammaloop-nextest-integration> res n-terms: 1, byte size: 3,expr:
  202. 135.55 s gammaloop-nextest-integration> 1
  203. 135.55 s gammaloop-nextest-integration> [2026-08-28 17:31:45.449] @approx::local_4d [{#uv, #inspect, #integrated}] DEBUG : Rescaled momenta expanded
  204. 135.55 s gammaloop-nextest-integration> field value
  205. 135.55 s gammaloop-nextest-integration> res n-terms: 1, byte size: 611,expr:
  206. 135.55 s gammaloop-nextest-integration> 1/(denom(0,q₀/t,mass_scalar_1²,-mass_scalar_1²+(q₀.q₀)/t²)
  207. 135.55 s gammaloop-nextest-integration> ·denom(1,-q₂+q₃-q₀/t,mass_scalar_1²,
  208. 135.55 s gammaloop-nextest-integration> -mass_scalar_1²+2·(q₀.q₂)/t-2·(q₀.q₃)/t+(q₀.q₀)/t²+(q₂.q₂)
  209. 135.55 s gammaloop-nextest-integration> -2·(q₂.q₃)+(q₃.q₃)
  210. 135.55 s gammaloop-nextest-integration> ))
  211. 135.55 s gammaloop-nextest-integration> [2026-08-28 17:31:45.450] @approx::local_4d [{#uv, #inspect, #integrated}] DEBUG : Rescaled momenta expanded
  212. 135.55 s gammaloop-nextest-integration> field value
  213. 135.55 s gammaloop-nextest-integration> res n-terms: 1, byte size: 777,expr:
  214. 135.55 s gammaloop-nextest-integration> 1/(denom(0,q₀/t,mass_scalar_1²,-mass_scalar_1²+(q₀.q₀)/t²)·denom(1,q₁/t,mass_scalar_1²,-mass_scalar_1²+(q₁.q₁)/t²)
  215. 135.55 s gammaloop-nextest-integration> ·denom(2,q₄-q₀/t-q₁/t,mass_scalar_1²,
  216. 135.55 s gammaloop-nextest-integration> -mass_scalar_1²-2·(q₀.q₄)/t-2·(q₁.q₄)/t+(q₀.q₀)/t²+2·(q₀.q₁)/t²
  217. 135.55 s gammaloop-nextest-integration> +(q₁.q₁)/t²+(q₄.q₄)
  218. 135.55 s gammaloop-nextest-integration> ))
  219. 135.55 s gammaloop-nextest-integration> [2026-08-28 17:31:45.452] @approx::final_integrand[{#generation, #profile, #uv, #graph, #summary}] DEBUG : Computed global numerator
  220. 135.55 s gammaloop-nextest-integration> field value
  221. 135.55 s gammaloop-nextest-integration> global_num n-terms: 1, byte size: 3,expr:
  222. 135.55 s gammaloop-nextest-integration> 1
  223. 135.55 s gammaloop-nextest-integration> span build_3d{span_context=true graph=sunrise current=subgraph=0, topo_order=0, dod=0}
  224. 135.55 s gammaloop-nextest-integration> [2026-08-28 17:31:45.453] @uv::approx [{#generation, #uv, #fourd}] DEBUG : Computing 4D
  225. 135.55 s gammaloop-nextest-integration> field value
  226. 135.55 s gammaloop-nextest-integration> simple subgraph(S_47,S_3s)*Approx(subgraph(S_3s,0)) of sunrise
  227. 135.55 s gammaloop-nextest-integration> span compute_4d{span_context=true graph=sunrise current=subgraph=3s, topo_order=1, dod=0 given=subgraph=0, topo_order=0, dod=0 reduced=SubSet { set: BitVec<usize, bitvec::order::Lsb0> { addr: 0x7fffec0124f0, head: 000000, bits: 8, capacity: 64 } [0, 0, 0, 0, 1, 1, 1, 1], id: PhantomData<linnet::half_edge::involution::Hedge> }}
  228. 135.55 s gammaloop-nextest-integration> [2026-08-28 17:31:45.454] @approx::local_4d [{#uv, #algebra, #integrated, #start}] DEBUG :
  229. 135.55 s gammaloop-nextest-integration> field value
  230. 135.55 s gammaloop-nextest-integration> integrand n-terms: 1, byte size: 217,expr:
  231. 135.55 s gammaloop-nextest-integration> 1/(denom(1,q₁,mass_scalar_1²,-mass_scalar_1²+(q₁.q₁))·denom(2,q₂,mass_scalar_1²,-mass_scalar_1²+(q₂.q₂)))
  232. 135.55 s gammaloop-nextest-integration> reduced 3s
  233. 135.55 s gammaloop-nextest-integration> span grow{span_context=true current=subgraph=3s, topo_order=1, dod=0 given=subgraph=0, topo_order=0, dod=0}
  234. 135.55 s gammaloop-nextest-integration> [2026-08-28 17:31:45.454] @approx::local_4d [{#uv, #inspect, #integrated}] DEBUG : Rescaled momenta expanded
  235. 135.55 s gammaloop-nextest-integration> field value
  236. 135.55 s gammaloop-nextest-integration> res n-terms: 1, byte size: 611,expr:
  237. 135.55 s gammaloop-nextest-integration> 1/(denom(1,q₁/t,mass_scalar_1²,-mass_scalar_1²+(q₁.q₁)/t²)
  238. 135.55 s gammaloop-nextest-integration> ·denom(2,-q₀+q₃-q₁/t,mass_scalar_1²,
  239. 135.55 s gammaloop-nextest-integration> -mass_scalar_1²+2·(q₀.q₁)/t-2·(q₁.q₃)/t+(q₁.q₁)/t²+(q₀.q₀)
  240. 135.55 s gammaloop-nextest-integration> -2·(q₀.q₃)+(q₃.q₃)
  241. 135.55 s gammaloop-nextest-integration> ))
  242. 135.55 s gammaloop-nextest-integration> span t{span_context=true current=subgraph=3s, topo_order=1, dod=0 given=subgraph=0, topo_order=0, dod=0}
  243. 135.55 s gammaloop-nextest-integration> [2026-08-28 17:31:45.454] @approx::local_4d [{#uv, #integrated, #rescaled}] DEBUG : Rescaled expanded
  244. 135.55 s gammaloop-nextest-integration> field value
  245. 135.55 s gammaloop-nextest-integration> n_loops 1
  246. 135.55 s gammaloop-nextest-integration> res n-terms: 1, byte size: 723,expr:
  247. 135.55 s gammaloop-nextest-integration> 1/(denom(1,q₁,mUVexp²+t²·mass_scalar_1²,-mUV²+t²·(-mass_scalar_1²+(q₁.q₁)/t²)+t²·mUVexp²)
  248. 135.55 s gammaloop-nextest-integration> ·denom(2,-q₁,mUVexp²+t²·mass_scalar_1²,
  249. 135.55 s gammaloop-nextest-integration> -mUV²
  250. 135.55 s gammaloop-nextest-integration> +t²
  251. 135.55 s gammaloop-nextest-integration> ·(-mass_scalar_1²+2·(q₀.q₁)/t-2·(q₁.q₃)/t+(q₁.q₁)/t²+(q₀.q₀)
  252. 135.55 s gammaloop-nextest-integration> -2·(q₀.q₃)+(q₃.q₃)
  253. 135.55 s gammaloop-nextest-integration> )
  254. 135.55 s gammaloop-nextest-integration> +t²·mUVexp²
  255. 135.55 s gammaloop-nextest-integration> ))
  256. 135.55 s gammaloop-nextest-integration> span t{span_context=true current=subgraph=3s, topo_order=1, dod=0 given=subgraph=0, topo_order=0, dod=0}
  257. 135.55 s gammaloop-nextest-integration> [2026-08-28 17:31:45.455] @approx::local_4d [{#uv, #integrated, #series}] DEBUG : Series expanded
  258. 135.55 s gammaloop-nextest-integration> field value
  259. 135.55 s gammaloop-nextest-integration> res n-terms: 1, byte size: 223,expr:
  260. 135.55 s gammaloop-nextest-integration> 1/(denom(1,q₁,mUVexp²,-mUV²+(q₁.q₁))·denom(2,-q₁,mUVexp²,-mUV²+(q₁.q₁)))
  261. 135.55 s gammaloop-nextest-integration> span t{span_context=true current=subgraph=3s, topo_order=1, dod=0 given=subgraph=0, topo_order=0, dod=0}
  262. 135.55 s gammaloop-nextest-integration> [2026-08-28 17:31:45.455] @approx::local_4d [{#uv, #integrated, #series}] DEBUG : Evaluated at t = 1
  263. 135.55 s gammaloop-nextest-integration> field value
  264. 135.55 s gammaloop-nextest-integration> res n-terms: 1, byte size: 223,expr:
  265. 135.55 s gammaloop-nextest-integration> 1/(denom(1,q₁,mUVexp²,-mUV²+(q₁.q₁))·denom(2,-q₁,mUVexp²,-mUV²+(q₁.q₁)))
  266. 135.55 s gammaloop-nextest-integration> span t{span_context=true current=subgraph=3s, topo_order=1, dod=0 given=subgraph=0, topo_order=0, dod=0}
  267. 135.55 s gammaloop-nextest-integration> [2026-08-28 17:31:45.455] @approx::local_4d [{#uv, #collect, #integrated}] DEBUG : After gamma chain collection
  268. 135.55 s gammaloop-nextest-integration> field value
  269. 135.55 s gammaloop-nextest-integration> expr n-terms: 1, byte size: 223,expr:
  270. 135.55 s gammaloop-nextest-integration> 1/(denom(1,q₁,mUVexp²,-mUV²+(q₁.q₁))·denom(2,-q₁,mUVexp²,-mUV²+(q₁.q₁)))
  271. 135.55 s gammaloop-nextest-integration> span t{span_context=true current=subgraph=3s, topo_order=1, dod=0 given=subgraph=0, topo_order=0, dod=0}
  272. 135.55 s gammaloop-nextest-integration> [2026-08-28 17:31:45.455] @approx::local_4d [{#profile, #uv, #collect, #integrated, #start, #trace}] DEBUG : After gamma schoonschip
  273. 135.55 s gammaloop-nextest-integration> field value
  274. 135.55 s gammaloop-nextest-integration> expr n-terms: 1, byte size: 223,expr:
  275. 135.55 s gammaloop-nextest-integration> 1/(denom(1,q₁,mUVexp²,-mUV²+(q₁.q₁))·denom(2,-q₁,mUVexp²,-mUV²+(q₁.q₁)))
  276. 135.55 s gammaloop-nextest-integration> span t{span_context=true current=subgraph=3s, topo_order=1, dod=0 given=subgraph=0, topo_order=0, dod=0}
  277. 135.55 s gammaloop-nextest-integration> [2026-08-28 17:31:45.456] @approx::local_4d [{#profile, #uv, #collect, #integrated, #start, #trace}] DEBUG : After gamma collection
  278. 135.55 s gammaloop-nextest-integration> field value
  279. 135.55 s gammaloop-nextest-integration> expr n-terms: 1, byte size: 223,expr:
  280. 135.55 s gammaloop-nextest-integration> 1/(denom(1,q₁,mUVexp²,-mUV²+(q₁.q₁))·denom(2,-q₁,mUVexp²,-mUV²+(q₁.q₁)))
  281. 135.55 s gammaloop-nextest-integration> span t{span_context=true current=subgraph=3s, topo_order=1, dod=0 given=subgraph=0, topo_order=0, dod=0}
  282. 135.55 s gammaloop-nextest-integration> [2026-08-28 17:31:45.456] @approx::local_4d [{#profile, #uv, #gamma, #integrated, #start, #trace, #vakint}] DEBUG : After gamma simplification
  283. 135.55 s gammaloop-nextest-integration> field value
  284. 135.55 s gammaloop-nextest-integration> expr n-terms: 1, byte size: 223,expr:
  285. 135.55 s gammaloop-nextest-integration> 1/(denom(1,q₁,mUVexp²,-mUV²+(q₁.q₁))·denom(2,-q₁,mUVexp²,-mUV²+(q₁.q₁)))
  286. 135.55 s gammaloop-nextest-integration> span t{span_context=true current=subgraph=3s, topo_order=1, dod=0 given=subgraph=0, topo_order=0, dod=0}
  287. 135.55 s gammaloop-nextest-integration> [2026-08-28 17:31:45.456] @approx::local_4d [{#profile, #uv, #integrated, #schoonschip, #start, #trace, #vakint}] DEBUG : After Schoonschip net
  288. 135.55 s gammaloop-nextest-integration> field value
  289. 135.55 s gammaloop-nextest-integration> expr n-terms: 1, byte size: 223,expr:
  290. 135.55 s gammaloop-nextest-integration> 1/(denom(1,q₁,mUVexp²,-mUV²+(q₁.q₁))·denom(2,-q₁,mUVexp²,-mUV²+(q₁.q₁)))
  291. 135.55 s gammaloop-nextest-integration> ... omitted 20090 more lines; see full nextest output above
  292. 135.55 s gammaloop-nextest-integration>
  293. 135.55 s gammaloop-nextest-integration> 9. gammaloop-integration-tests::uv::se1l_uv
  294. 135.55 s gammaloop-nextest-integration> failure: test failure with exit code 101
  295. 135.55 s gammaloop-nextest-integration> system-out
  296. 135.55 s gammaloop-nextest-integration> running 1 test
  297. 135.55 s gammaloop-nextest-integration> test se1l_uv has been running for over 60 seconds
  298. 135.55 s gammaloop-nextest-integration> +------+-----------------+---------+--------+----------+-----------------------------------------------------------------------------------------------------------------------+-------+
  299. 135.55 s gammaloop-nextest-integration> | case | check | graph | status | sigma | threshold | error |
  300. 135.55 s gammaloop-nextest-integration> +------+-----------------+---------+--------+----------+-----------------------------------------------------------------------------------------------------------------------+-------+
  301. 135.55 s gammaloop-nextest-integration> | se1l | uv_profile | - | FAIL | - | - | - |
  302. 135.55 s gammaloop-nextest-integration> +------+-----------------+---------+--------+----------+-----------------------------------------------------------------------------------------------------------------------+-------+
  303. 135.55 s gammaloop-nextest-integration> | se1l | m_uv.inspect | inspect | pass | - | best inspect relative delta 1.097e-1 >= 1000*accuracy 1.000e-7 (accuracy=1.000e-10, exponent=+2.0, seed=1, probes=10) | - |
  304. 135.55 s gammaloop-nextest-integration> +------+-----------------+---------+--------+----------+-----------------------------------------------------------------------------------------------------------------------+-------+
  305. 135.55 s gammaloop-nextest-integration> | se1l | m_uv.integrated | se1l | pass | 0.1sigma | compatible within 2sigma | - |
  306. 135.55 s gammaloop-nextest-integration> +------+-----------------+---------+--------+----------+-----------------------------------------------------------------------------------------------------------------------+-------+
  307. 135.55 s gammaloop-nextest-integration> | se1l | rls.inspect | inspect | pass | - | best inspect relative delta 4.499e-2 >= 1000*accuracy 1.000e-7 (accuracy=1.000e-10, exponent=+2.0, seed=1, probes=10) | - |
  308. 135.55 s gammaloop-nextest-integration> +------+-----------------+---------+--------+----------+-----------------------------------------------------------------------------------------------------------------------+-------+
  309. 135.55 s gammaloop-nextest-integration> | se1l | rls.integrated | se1l | pass | 0.0sigma | compatible within 2sigma | - |
  310. 135.55 s gammaloop-nextest-integration> +------+-----------------+---------+--------+----------+-----------------------------------------------------------------------------------------------------------------------+-------+
  311. 135.55 s gammaloop-nextest-integration> | se1l | mu_r.inspect | inspect | pass | - | best inspect relative delta 1.424e-1 >= 1000*accuracy 1.000e-7 (accuracy=1.000e-10, exponent=+2.0, seed=1, probes=10) | - |
  312. 135.55 s gammaloop-nextest-integration> +------+-----------------+---------+--------+----------+-----------------------------------------------------------------------------------------------------------------------+-------+
  313. 135.55 s gammaloop-nextest-integration> | se1l | target | - | pass | - | 2sigma | - |
  314. 135.55 s gammaloop-nextest-integration> +------+-----------------+---------+--------+----------+-----------------------------------------------------------------------------------------------------------------------+-------+
  315. 135.55 s gammaloop-nextest-integration> test se1l_uv ... FAILED
  316. 135.55 s gammaloop-nextest-integration>
  317. 135.55 s gammaloop-nextest-integration> failures:
  318. 135.55 s gammaloop-nextest-integration>
  319. 135.55 s gammaloop-nextest-integration> failures:
  320. 135.55 s gammaloop-nextest-integration> se1l_uv
  321. 135.55 s gammaloop-nextest-integration>
  322. 135.55 s gammaloop-nextest-integration> test result: FAILED. 0 passed; 1 failed; 0 ignored; 0 measured; 24 filtered out; finished in 106.23s
  323. 135.55 s gammaloop-nextest-integration> system-err
  324. 135.55 s gammaloop-nextest-integration> [2026-08-28 17:31:44.766] @gammaloop_api::se... INFO : Running command run generate
  325. 135.55 s gammaloop-nextest-integration> [2026-08-28 17:31:44.766] @gammaloop_api::se... INFO : Starting command block generate
  326. 135.55 s gammaloop-nextest-integration> [2026-08-28 17:31:44.767] @gammaloop_api::se... INFO : Running command import model sm-default
  327. 135.55 s gammaloop-nextest-integration> [2026-08-28 17:31:44.767] @import::model INFO : Loading built-in JSON model sm-default
  328. 135.55 s gammaloop-nextest-integration> [2026-08-28 17:31:44.816] @gammalooprs::model INFO : The following 11 external parameters were forced to zero by the restriction card:
  329. 135.55 s gammaloop-nextest-integration> lamWS, AWS, rhoWS, etaWS, ymc, yme, ymm, MC, Me, MM, WTau
  330. 135.55 s gammaloop-nextest-integration> [2026-08-28 17:31:44.816] @gammalooprs::model INFO : The following 34 vertex rules were removed by the restriction card:
  331. 135.55 s gammaloop-nextest-integration> V_82 -> (c~, d, G+) | V_83 -> (t~, d, G+) | V_84 -> (c~, s, G+) | V_85 -> (t~, s, G+) | V_86 -> (u~, b, G+) | V_87 -> (c~, b, G+) | V_90 -> (c~, d, W+) | V_91 -> (t~, d, W+) | V_92 -> (u~, s, W+) | V_94 -> (t~, s, W+) | V_95 -> (u~, b, W+) | V_96 -> (c~, b, W+) | V_101 -> (e+, e-, G0) | V_102 -> (mu+, mu-, G0) | V_104 -> (e+, e-, H) | V_105 -> (mu+, mu-, H) | V_110 -> (ve~, e-, G+) | V_111 -> (vm~, mu-, G+) | V_116 -> (b~, u, G-) | V_117 -> (d~, c, G-) | V_118 -> (s~, c, G-) | V_119 -> (b~, c, G-) | V_120 -> (d~, t, G-) | V_121 -> (s~, t, G-) | V_124 -> (s~, u, W-) | V_125 -> (b~, u, W-) | V_126 -> (d~, c, W-) | V_128 -> (b~, c, W-) | V_129 -> (d~, t, W-) | V_130 -> (s~, t, W-) | V_138 -> (c~, c, G0) | V_140 -> (c~, c, H) | V_145 -> (e+, ve, G-) | V_146 -> (mu+, vm, G-)
  332. 135.55 s gammaloop-nextest-integration> [2026-08-28 17:31:44.816] @gammalooprs::model INFO : The following 36 couplings were removed by the restriction card:
  333. 135.55 s gammaloop-nextest-integration> GC_13, GC_14, GC_16, GC_17, GC_18, GC_19, GC_20, GC_22, GC_23, GC_24, GC_25, GC_26, GC_28, GC_29, GC_42, GC_43, GC_44, GC_46, GC_47, GC_48, GC_84, GC_85, GC_86, GC_87, GC_88, GC_89, GC_90, GC_91, GC_92, GC_93, GC_101, GC_102, GC_103, GC_105, GC_106, GC_107
  334. 135.55 s gammaloop-nextest-integration> [2026-08-28 17:31:44.820] @gammaloop_api::se... INFO : Running command remove processes
  335. 135.55 s gammaloop-nextest-integration> [2026-08-28 17:31:44.820] @gammaloop_api::se... INFO : Running command set global kv global.generation.uv.generate_integrated=true
  336. 135.55 s gammaloop-nextest-integration> [2026-08-28 17:31:44.820] @gammaloop_api::se... INFO : Running command import graphs ./tests/resources/graphs/uv_tests/se1l.dot -p se1l -i se1l
  337. 135.55 s gammaloop-nextest-integration> [2026-08-28 17:31:44.820] @commands::import INFO : Loading graphs from '/build/source/tests/resources/graphs/uv_tests/se1l.dot'
  338. 135.55 s gammaloop-nextest-integration> [2026-08-28 17:31:44.826] @gammaloop_api::se... INFO : Running command generate existing -p se1l -i se1l
  339. 135.55 s gammaloop-nextest-integration> [2026-08-28 17:31:46.328] @commands::generate INFO :
  340. 135.55 s gammaloop-nextest-integration> Integrand generation summary
  341. 135.55 s gammaloop-nextest-integration> peak RAM 89.73 MiB | cores 1
  342. 135.55 s gammaloop-nextest-integration> ╭───────────┬───────┬─────────┬─────────────┬─────────────┬────────────────┬─────────────╮
  343. 135.55 s gammaloop-nextest-integration> │ integrand │ graph │ # evals │ expr build │ spenso │ symbolica eval │ compile │
  344. 135.55 s gammaloop-nextest-integration> ├───────────┼───────┼─────────┼─────────────┼─────────────┼────────────────┼─────────────┤
  345. 135.55 s gammaloop-nextest-integration> │ se1l │ se1l │ 5 │ 1.28s (87%) │ 73ms (5.0%) │ 117ms (8.0%) │ 0ms (0.00%) │
  346. 135.55 s gammaloop-nextest-integration> ├───────────┼───────┼─────────┼─────────────┼─────────────┼────────────────┼─────────────┤
  347. 135.55 s gammaloop-nextest-integration> │ Total │ │ 5 │ 1.28s (87%) │ 73ms (5.0%) │ 117ms (8.0%) │ 0ms (0.00%) │
  348. 135.55 s gammaloop-nextest-integration> ╰───────────┴───────┴─────────┴─────────────┴─────────────┴────────────────┴─────────────╯
  349. 135.55 s gammaloop-nextest-integration> [2026-08-28 17:31:46.329] @gammaloop_api::se... INFO : Running command set process -p se1l -i se1l kv general.m_uv=0.2
  350. 135.55 s gammaloop-nextest-integration> [2026-08-28 17:31:46.329] @gammaloop_api::se... INFO : Running command set process -p se1l -i se1l kv general.mu_r=0.2
  351. 135.55 s gammaloop-nextest-integration> [2026-08-28 17:31:46.330] @gammaloop_api::se... INFO : Running command set process -p se1l -i se1l kv general.renormalization_localization_scale=0.2
  352. 135.55 s gammaloop-nextest-integration> [2026-08-28 17:31:46.331] @gammaloop_api::se... INFO : Running command duplicate integrand -p se1l -i se1l --output_process_name se1l --output_integrand_name se1l_muv_shifted
  353. 135.55 s gammaloop-nextest-integration> [2026-08-28 17:31:46.332] @gammaloop_api::se... INFO : Running command set process -p se1l -i se1l_muv_shifted kv general.m_uv=0.5
  354. 135.55 s gammaloop-nextest-integration> [2026-08-28 17:31:46.333] @gammaloop_api::se... INFO : Running command duplicate integrand -p se1l -i se1l --output_process_name se1l --output_integrand_name se1l_rls_shifted
  355. 135.55 s gammaloop-nextest-integration> [2026-08-28 17:31:46.338] @gammaloop_api::se... INFO : Running command set process -p se1l -i se1l_rls_shifted kv general.renormalization_localization_scale=1
  356. 135.55 s gammaloop-nextest-integration> [2026-08-28 17:31:46.339] @gammaloop_api::se... INFO : Running command duplicate integrand -p se1l -i se1l --output_process_name se1l --output_integrand_name se1l_mur_shifted
  357. 135.55 s gammaloop-nextest-integration> [2026-08-28 17:31:46.344] @gammaloop_api::se... INFO : Running command set process -p se1l -i se1l_mur_shifted kv general.mu_r=0.8
  358. 135.55 s gammaloop-nextest-integration> [2026-08-28 17:31:46.356] @process::amplitude WARNING : External state 0 ('g', PDG 21, helicity +) is off shell: p^2 = +2.5e5, expected m^2 = +0e0 (|Δ| = +2.5e5). Fixed-helicity spinor/vector/tensor external states may be ill-defined at this kinematic point.
  359. 135.55 s gammaloop-nextest-integration> field value
  360. 135.55 s gammaloop-nextest-integration> span warm_up{integrand.name=se1l}
  361. 135.55 s gammaloop-nextest-integration> [2026-08-28 17:31:46.356] @process::amplitude WARNING : External state 1 ('g', PDG 21, helicity -) is off shell: p^2 = +2.5e5, expected m^2 = +0e0 (|Δ| = +2.5e5). Fixed-helicity spinor/vector/tensor external states may be ill-defined at this kinematic point.
  362. 135.55 s gammaloop-nextest-integration> field value
  363. 135.55 s gammaloop-nextest-integration> span warm_up{integrand.name=se1l}
  364. 135.55 s gammaloop-nextest-integration> [2026-08-28 17:31:46.356] @process::amplitude INFO : Input is above threshold: 1 existing threshold E-surfaces across 1/1 graph groups
  365. 135.55 s gammaloop-nextest-integration> field value
  366. 135.55 s gammaloop-nextest-integration> existing_esurfaces 1
  367. 135.55 s gammaloop-nextest-integration> group_count 1
  368. 135.55 s gammaloop-nextest-integration> groups_above_threshold 1
  369. 135.55 s gammaloop-nextest-integration> integrand se1l
  370. 135.55 s gammaloop-nextest-integration> span warm_up{integrand.name=se1l}
  371. 135.55 s gammaloop-nextest-integration> threshold_status above threshold
  372. 135.55 s gammaloop-nextest-integration> [2026-08-28 17:31:46.356] @process::amplitude INFO : overlap structure of group 0: [1: [0(2,3)]]
  373. 135.55 s gammaloop-nextest-integration> field value
  374. 135.55 s gammaloop-nextest-integration> span warm_up{integrand.name=se1l}
  375. 135.55 s gammaloop-nextest-integration> [2026-08-28 17:31:46.623] @commands::profile INFO :
  376. 135.55 s gammaloop-nextest-integration> ╭───────┬──────┬──────────┬───────┬─────┬──────────┬───────────╮
  377. 135.55 s gammaloop-nextest-integration> │ fixed │ → ∞ │ slope │ r2 │ DOD │ bare DOD │ inspect │
  378. 135.55 s gammaloop-nextest-integration> ├───────┼──────┼──────────┼───────┼─────┼──────────┼───────────┤
  379. 135.55 s gammaloop-nextest-integration> │ {} │ {e3} │ 1.639236 │ 0.904 │ 2 │ 2 │ arb retry │
  380. 135.55 s gammaloop-nextest-integration> │ {} │ {e2} │ 1.698834 │ 0.902 │ 2 │ 2 │ arb retry │
  381. 135.55 s gammaloop-nextest-integration> ╰───────┴──────┴──────────┴───────┴─────┴──────────┴───────────╯
  382. 135.55 s gammaloop-nextest-integration> [2026-08-28 17:31:46.623] @commands::profile INFO :
  383. 135.55 s gammaloop-nextest-integration> ╭───────┬──────┬─────────────┬──────────┬───────┬─────┬──────────┬───────────╮
  384. 135.55 s gammaloop-nextest-integration> │ fixed │ → ∞ │ orientation │ slope │ r2 │ DOD │ bare DOD │ inspect │
  385. 135.55 s gammaloop-nextest-integration> ├───────┼──────┼─────────────┼──────────┼───────┼─────┼──────────┼───────────┤
  386. 135.55 s gammaloop-nextest-integration> │ {} │ {e3} │ 00-+ │ 0.343429 │ 0.145 │ 0 │ 2 │ arb retry │
  387. 135.55 s gammaloop-nextest-integration> │ {} │ {e3} │ 00+- │ 0.342577 │ 0.135 │ 0 │ 2 │ arb retry │
  388. 135.55 s gammaloop-nextest-integration> │ {} │ {e2} │ 00-+ │ 0.385975 │ 0.161 │ 0 │ 2 │ arb retry │
  389. 135.55 s gammaloop-nextest-integration> │ {} │ {e2} │ 00+- │ 0.384920 │ 0.192 │ 0 │ 2 │ arb retry │
  390. 135.55 s gammaloop-nextest-integration> ╰───────┴──────┴─────────────┴──────────┴───────┴─────┴──────────┴───────────╯
  391. 135.55 s gammaloop-nextest-integration> [2026-08-28 17:31:46.624] @gammaloop_api::se... INFO : Running command set process kv integrator.target_relative_accuracy=0.001 integrator.n_increase=0 integrator.n_start=50000 integrator.n_max=400000 integrator.seed=1337
  392. 135.55 s gammaloop-nextest-integration> [2026-08-28 17:31:46.628] @commands::integrate INFO : Created workspace directory at /build/source/tests/artifacts/se1l/integration_workspace_se1l
  393. 135.55 s gammaloop-nextest-integration> [2026-08-28 17:31:46.654] @commands::integrate INFO : No integration state found, starting new integration
  394. 135.55 s gammaloop-nextest-integration> [2026-08-28 17:31:46.654] @commands::integrate INFO : Gammaloop now integrates se1l@se1l, se1l@se1l_muv_shifted, se1l@se1l_rls_shifted
  395. 135.55 s gammaloop-nextest-integration> [2026-08-28 17:31:46.655] @process::amplitude WARNING : External state 0 ('g', PDG 21, helicity +) is off shell: p^2 = +2.5e5, expected m^2 = +0e0 (|Δ| = +2.5e5). Fixed-helicity spinor/vector/tensor external states may be ill-defined at this kinematic point.
  396. 135.55 s gammaloop-nextest-integration> field value
  397. 135.55 s gammaloop-nextest-integration> span warm_up{integrand.name=se1l}
  398. 135.55 s gammaloop-nextest-integration> [2026-08-28 17:31:46.655] @process::amplitude WARNING : External state 1 ('g', PDG 21, helicity -) is off shell: p^2 = +2.5e5, expected m^2 = +0e0 (|Δ| = +2.5e5). Fixed-helicity spinor/vector/tensor external states may be ill-defined at this kinematic point.
  399. 135.55 s gammaloop-nextest-integration> field value
  400. 135.55 s gammaloop-nextest-integration> span warm_up{integrand.name=se1l}
  401. 135.55 s gammaloop-nextest-integration> [2026-08-28 17:31:46.655] @process::amplitude INFO : Input is above threshold: 1 existing threshold E-surfaces across 1/1 graph groups
  402. 135.55 s gammaloop-nextest-integration> field value
  403. 135.55 s gammaloop-nextest-integration> existing_esurfaces 1
  404. 135.55 s gammaloop-nextest-integration> group_count 1
  405. 135.55 s gammaloop-nextest-integration> groups_above_threshold 1
  406. 135.55 s gammaloop-nextest-integration> integrand se1l
  407. 135.55 s gammaloop-nextest-integration> span warm_up{integrand.name=se1l}
  408. 135.55 s gammaloop-nextest-integration> threshold_status above threshold
  409. 135.55 s gammaloop-nextest-integration> [2026-08-28 17:31:46.655] @process::amplitude INFO : overlap structure of group 0: [1: [0(2,3)]]
  410. 135.55 s gammaloop-nextest-integration> field value
  411. 135.55 s gammaloop-nextest-integration> span warm_up{integrand.name=se1l}
  412. 135.55 s gammaloop-nextest-integration> [2026-08-28 17:31:46.657] @process::amplitude WARNING : External state 0 ('g', PDG 21, helicity +) is off shell: p^2 = +2.5e5, expected m^2 = +0e0 (|Δ| = +2.5e5). Fixed-helicity spinor/vector/tensor external states may be ill-defined at this kinematic point.
  413. 135.55 s gammaloop-nextest-integration> field value
  414. 135.55 s gammaloop-nextest-integration> span warm_up{integrand.name=se1l_muv_shifted}
  415. 135.55 s gammaloop-nextest-integration> [2026-08-28 17:31:46.657] @process::amplitude WARNING : External state 1 ('g', PDG 21, helicity -) is off shell: p^2 = +2.5e5, expected m^2 = +0e0 (|Δ| = +2.5e5). Fixed-helicity spinor/vector/tensor external states may be ill-defined at this kinematic point.
  416. 135.55 s gammaloop-nextest-integration> field value
  417. 135.55 s gammaloop-nextest-integration> span warm_up{integrand.name=se1l_muv_shifted}
  418. 135.55 s gammaloop-nextest-integration> [2026-08-28 17:31:46.657] @process::amplitude INFO : Input is above threshold: 1 existing threshold E-surfaces across 1/1 graph groups
  419. 135.55 s gammaloop-nextest-integration> field value
  420. 135.55 s gammaloop-nextest-integration> existing_esurfaces 1
  421. 135.55 s gammaloop-nextest-integration> group_count 1
  422. 135.55 s gammaloop-nextest-integration> groups_above_threshold 1
  423. 135.55 s gammaloop-nextest-integration> integrand se1l_muv_shifted
  424. 135.55 s gammaloop-nextest-integration> span warm_up{integrand.name=se1l_muv_shifted}
  425. 135.55 s gammaloop-nextest-integration> threshold_status above threshold
  426. 135.55 s gammaloop-nextest-integration> [2026-08-28 17:31:46.657] @process::amplitude INFO : overlap structure of group 0: [1: [0(2,3)]]
  427. 135.55 s gammaloop-nextest-integration> field value
  428. 135.55 s gammaloop-nextest-integration> span warm_up{integrand.name=se1l_muv_shifted}
  429. 135.55 s gammaloop-nextest-integration> [2026-08-28 17:31:46.659] @process::amplitude WARNING : External state 0 ('g', PDG 21, helicity +) is off shell: p^2 = +2.5e5, expected m^2 = +0e0 (|Δ| = +2.5e5). Fixed-helicity spinor/vector/tensor external states may be ill-defined at this kinematic point.
  430. 135.55 s gammaloop-nextest-integration> field value
  431. 135.55 s gammaloop-nextest-integration> span warm_up{integrand.name=se1l_rls_shifted}
  432. 135.55 s gammaloop-nextest-integration> [2026-08-28 17:31:46.659] @process::amplitude WARNING : External state 1 ('g', PDG 21, helicity -) is off shell: p^2 = +2.5e5, expected m^2 = +0e0 (|Δ| = +2.5e5). Fixed-helicity spinor/vector/tensor external states may be ill-defined at this kinematic point.
  433. 135.55 s gammaloop-nextest-integration> field value
  434. 135.55 s gammaloop-nextest-integration> span warm_up{integrand.name=se1l_rls_shifted}
  435. 135.55 s gammaloop-nextest-integration> [2026-08-28 17:31:46.659] @process::amplitude INFO : Input is above threshold: 1 existing threshold E-surfaces across 1/1 graph groups
  436. 135.55 s gammaloop-nextest-integration> field value
  437. 135.55 s gammaloop-nextest-integration> existing_esurfaces 1
  438. 135.55 s gammaloop-nextest-integration> group_count 1
  439. 135.55 s gammaloop-nextest-integration> groups_above_threshold 1
  440. 135.55 s gammaloop-nextest-integration> integrand se1l_rls_shifted
  441. 135.55 s gammaloop-nextest-integration> span warm_up{integrand.name=se1l_rls_shifted}
  442. 135.55 s gammaloop-nextest-integration> threshold_status above threshold
  443. 135.55 s gammaloop-nextest-integration> ... omitted 1410 more lines; see full nextest output above
  444. 135.55 s gammaloop-nextest-integration> =========================================
  445. 135.92 s error: Cannot build '/nix/store/5lvckp7qh3dqs2nqf61qj4kz6kj46p4q-gammaloop-nextest-integration.drv'.
  446. 135.92 s Reason: builder failed with exit code 100.
  447. 135.92 s Output paths:
  448. 135.92 s /nix/store/q9ndadp0vb7l2ihf07rjiriv26fb03g2-gammaloop-nextest-integration
  449. 135.92 s Last 2048 log lines:
  450. 135.92 s > span warm_up{integrand.name=se1l_muv_shifted}
  451. 135.92 s > threshold_status above threshold
  452. 135.92 s > [2026-08-28 17:33:30.634] @process::amplitude INFO : overlap structure of group 0: [1: [0(2,3)]]
  453. 135.92 s > field value
  454. 135.92 s > span warm_up{integrand.name=se1l_muv_shifted}
  455. 135.92 s > [2026-08-28 17:33:30.637] @process::amplitude WARNING : External state 0 ('g', PDG 21, helicity +) is off shell: p^2 = +2.5e5, expected m^2 = +0e0 (|Δ| = +2.5e5). Fixed-helicity spinor/vector/tensor external states may be ill-defined at this kinematic point.
  456. 135.92 s > field value
  457. 135.92 s > span warm_up{integrand.name=se1l}
  458. 135.92 s > [2026-08-28 17:33:30.637] @process::amplitude WARNING : External state 1 ('g', PDG 21, helicity -) is off shell: p^2 = +2.5e5, expected m^2 = +0e0 (|Δ| = +2.5e5). Fixed-helicity spinor/vector/tensor external states may be ill-defined at this kinematic point.
  459. 135.92 s > field value
  460. 135.92 s > span warm_up{integrand.name=se1l}
  461. 135.92 s > [2026-08-28 17:33:30.638] @process::amplitude INFO : Input is above threshold: 1 existing threshold E-surfaces across 1/1 graph groups
  462. 135.92 s > field value
  463. 135.92 s > existing_esurfaces 1
  464. 135.92 s > group_count 1
  465. 135.92 s > groups_above_threshold 1
  466. 135.92 s > integrand se1l
  467. 135.92 s > span warm_up{integrand.name=se1l}
  468. 135.92 s > threshold_status above threshold
  469. 135.92 s > [2026-08-28 17:33:30.638] @process::amplitude INFO : overlap structure of group 0: [1: [0(2,3)]]
  470. 135.92 s > field value
  471. 135.92 s > span warm_up{integrand.name=se1l}
  472. 135.92 s > [2026-08-28 17:33:30.641] @process::amplitude WARNING : External state 0 ('g', PDG 21, helicity +) is off shell: p^2 = +2.5e5, expected m^2 = +0e0 (|Δ| = +2.5e5). Fixed-helicity spinor/vector/tensor external states may be ill-defined at this kinematic point.
  473. 135.92 s > field value
  474. 135.92 s > span warm_up{integrand.name=se1l_muv_shifted}
  475. 135.92 s > [2026-08-28 17:33:30.641] @process::amplitude WARNING : External state 1 ('g', PDG 21, helicity -) is off shell: p^2 = +2.5e5, expected m^2 = +0e0 (|Δ| = +2.5e5). Fixed-helicity spinor/vector/tensor external states may be ill-defined at this kinematic point.
  476. 135.92 s > field value
  477. 135.92 s > span warm_up{integrand.name=se1l_muv_shifted}
  478. 135.92 s > [2026-08-28 17:33:30.641] @process::amplitude INFO : Input is above threshold: 1 existing threshold E-surfaces across 1/1 graph groups
  479. 135.92 s > field value
  480. 135.92 s > existing_esurfaces 1
  481. 135.92 s > group_count 1
  482. 135.92 s > groups_above_threshold 1
  483. 135.92 s > integrand se1l_muv_shifted
  484. 135.92 s > span warm_up{integrand.name=se1l_muv_shifted}
  485. 135.92 s > threshold_status above threshold
  486. 135.92 s > [2026-08-28 17:33:30.641] @process::amplitude INFO : overlap structure of group 0: [1: [0(2,3)]]
  487. 135.92 s > field value
  488. 135.92 s > span warm_up{integrand.name=se1l_muv_shifted}
  489. 135.92 s > [2026-08-28 17:33:30.645] @process::amplitude WARNING : External state 0 ('g', PDG 21, helicity +) is off shell: p^2 = +2.5e5, expected m^2 = +0e0 (|Δ| = +2.5e5). Fixed-helicity spinor/vector/tensor external states may be ill-defined at this kinematic point.
  490. 135.92 s > field value
  491. 135.92 s > span warm_up{integrand.name=se1l}
  492. 135.92 s > [2026-08-28 17:33:30.645] @process::amplitude WARNING : External state 1 ('g', PDG 21, helicity -) is off shell: p^2 = +2.5e5, expected m^2 = +0e0 (|Δ| = +2.5e5). Fixed-helicity spinor/vector/tensor external states may be ill-defined at this kinematic point.
  493. 135.92 s > field value
  494. 135.92 s > span warm_up{integrand.name=se1l}
  495. 135.92 s > [2026-08-28 17:33:30.645] @process::amplitude INFO : Input is above threshold: 1 existing threshold E-surfaces across 1/1 graph groups
  496. 135.92 s > field value
  497. 135.92 s > existing_esurfaces 1
  498. 135.92 s > group_count 1
  499. 135.92 s > groups_above_threshold 1
  500. 135.92 s > integrand se1l
  501. 135.92 s > span warm_up{integrand.name=se1l}
  502. 135.92 s > threshold_status above threshold
  503. 135.92 s > [2026-08-28 17:33:30.645] @process::amplitude INFO : overlap structure of group 0: [1: [0(2,3)]]
  504. 135.92 s > field value
  505. 135.92 s > span warm_up{integrand.name=se1l}
  506. 135.92 s > [2026-08-28 17:33:30.649] @process::amplitude WARNING : External state 0 ('g', PDG 21, helicity +) is off shell: p^2 = +2.5e5, expected m^2 = +0e0 (|Δ| = +2.5e5). Fixed-helicity spinor/vector/tensor external states may be ill-defined at this kinematic point.
  507. 135.92 s > field value
  508. 135.92 s > span warm_up{integrand.name=se1l_muv_shifted}
  509. 135.92 s > [2026-08-28 17:33:30.649] @process::amplitude WARNING : External state 1 ('g', PDG 21, helicity -) is off shell: p^2 = +2.5e5, expected m^2 = +0e0 (|Δ| = +2.5e5). Fixed-helicity spinor/vector/tensor external states may be ill-defined at this kinematic point.
  510. 135.92 s > field value
  511. 135.92 s > span warm_up{integrand.name=se1l_muv_shifted}
  512. 135.92 s > [2026-08-28 17:33:30.649] @process::amplitude INFO : Input is above threshold: 1 existing threshold E-surfaces across 1/1 graph groups
  513. 135.92 s > field value
  514. 135.92 s > existing_esurfaces 1
  515. 135.92 s > group_count 1
  516. 135.92 s > groups_above_threshold 1
  517. 135.92 s > integrand se1l_muv_shifted
  518. 135.92 s > span warm_up{integrand.name=se1l_muv_shifted}
  519. 135.92 s > threshold_status above threshold
  520. 135.92 s > [2026-08-28 17:33:30.649] @process::amplitude INFO : overlap structure of group 0: [1: [0(2,3)]]
  521. 135.92 s > field value
  522. 135.92 s > span warm_up{integrand.name=se1l_muv_shifted}
  523. 135.92 s > [2026-08-28 17:33:30.652] @process::amplitude WARNING : External state 0 ('g', PDG 21, helicity +) is off shell: p^2 = +2.5e5, expected m^2 = +0e0 (|Δ| = +2.5e5). Fixed-helicity spinor/vector/tensor external states may be ill-defined at this kinematic point.
  524. 135.92 s > field value
  525. 135.92 s > span warm_up{integrand.name=se1l}
  526. 135.92 s > [2026-08-28 17:33:30.652] @process::amplitude WARNING : External state 1 ('g', PDG 21, helicity -) is off shell: p^2 = +2.5e5, expected m^2 = +0e0 (|Δ| = +2.5e5). Fixed-helicity spinor/vector/tensor external states may be ill-defined at this kinematic point.
  527. 135.92 s > field value
  528. 135.92 s > span warm_up{integrand.name=se1l}
  529. 135.92 s > [2026-08-28 17:33:30.652] @process::amplitude INFO : Input is above threshold: 1 existing threshold E-surfaces across 1/1 graph groups
  530. 135.92 s > field value
  531. 135.92 s > existing_esurfaces 1
  532. 135.92 s > group_count 1
  533. 135.92 s > groups_above_threshold 1
  534. 135.92 s > integrand se1l
  535. 135.92 s > span warm_up{integrand.name=se1l}
  536. 135.92 s > threshold_status above threshold
  537. 135.92 s > [2026-08-28 17:33:30.653] @process::amplitude INFO : overlap structure of group 0: [1: [0(2,3)]]
  538. 135.92 s > field value
  539. 135.92 s > span warm_up{integrand.name=se1l}
  540. 135.92 s > [2026-08-28 17:33:30.656] @process::amplitude WARNING : External state 0 ('g', PDG 21, helicity +) is off shell: p^2 = +2.5e5, expected m^2 = +0e0 (|Δ| = +2.5e5). Fixed-helicity spinor/vector/tensor external states may be ill-defined at this kinematic point.
  541. 135.92 s > field value
  542. 135.92 s > span warm_up{integrand.name=se1l_muv_shifted}
  543. 135.92 s > [2026-08-28 17:33:30.656] @process::amplitude WARNING : External state 1 ('g', PDG 21, helicity -) is off shell: p^2 = +2.5e5, expected m^2 = +0e0 (|Δ| = +2.5e5). Fixed-helicity spinor/vector/tensor external states may be ill-defined at this kinematic point.
  544. 135.92 s > field value
  545. 135.92 s > span warm_up{integrand.name=se1l_muv_shifted}
  546. 135.92 s > [2026-08-28 17:33:30.656] @process::amplitude INFO : Input is above threshold: 1 existing threshold E-surfaces across 1/1 graph groups
  547. 135.92 s > field value
  548. 135.92 s > existing_esurfaces 1
  549. 135.92 s > group_count 1
  550. 135.92 s > groups_above_threshold 1
  551. 135.92 s > integrand se1l_muv_shifted
  552. 135.92 s > span warm_up{integrand.name=se1l_muv_shifted}
  553. 135.92 s > threshold_status above threshold
  554. 135.92 s > [2026-08-28 17:33:30.656] @process::amplitude INFO : overlap structure of group 0: [1: [0(2,3)]]
  555. 135.92 s > field value
  556. 135.92 s > span warm_up{integrand.name=se1l_muv_shifted}
  557. 135.92 s > [2026-08-28 17:33:30.660] @process::amplitude WARNING : External state 0 ('g', PDG 21, helicity +) is off shell: p^2 = +2.5e5, expected m^2 = +0e0 (|Δ| = +2.5e5). Fixed-helicity spinor/vector/tensor external states may be ill-defined at this kinematic point.
  558. 135.92 s > field value
  559. 135.92 s > span warm_up{integrand.name=se1l}
  560. 135.92 s > [2026-08-28 17:33:30.660] @process::amplitude WARNING : External state 1 ('g', PDG 21, helicity -) is off shell: p^2 = +2.5e5, expected m^2 = +0e0 (|Δ| = +2.5e5). Fixed-helicity spinor/vector/tensor external states may be ill-defined at this kinematic point.
  561. 135.92 s > field value
  562. 135.92 s > span warm_up{integrand.name=se1l}
  563. 135.92 s > [2026-08-28 17:33:30.660] @process::amplitude INFO : Input is above threshold: 1 existing threshold E-surfaces across 1/1 graph groups
  564. 135.92 s > field value
  565. 135.92 s > existing_esurfaces 1
  566. 135.92 s > group_count 1
  567. 135.92 s > groups_above_threshold 1
  568. 135.92 s > integrand se1l
  569. 135.92 s > span warm_up{integrand.name=se1l}
  570. 135.92 s > threshold_status above threshold
  571. 135.92 s > [2026-08-28 17:33:30.660] @process::amplitude INFO : overlap structure of group 0: [1: [0(2,3)]]
  572. 135.92 s > field value
  573. 135.92 s > span warm_up{integrand.name=se1l}
  574. 135.92 s > [2026-08-28 17:33:30.663] @process::amplitude WARNING : External state 0 ('g', PDG 21, helicity +) is off shell: p^2 = +2.5e5, expected m^2 = +0e0 (|Δ| = +2.5e5). Fixed-helicity spinor/vector/tensor external states may be ill-defined at this kinematic point.
  575. 135.92 s > field value
  576. 135.92 s > span warm_up{integrand.name=se1l_rls_shifted}
  577. 135.92 s > [2026-08-28 17:33:30.663] @process::amplitude WARNING : External state 1 ('g', PDG 21, helicity -) is off shell: p^2 = +2.5e5, expected m^2 = +0e0 (|Δ| = +2.5e5). Fixed-helicity spinor/vector/tensor external states may be ill-defined at this kinematic point.
  578. 135.92 s > field value
  579. 135.92 s > span warm_up{integrand.name=se1l_rls_shifted}
  580. 135.92 s > [2026-08-28 17:33:30.664] @process::amplitude INFO : Input is above threshold: 1 existing threshold E-surfaces across 1/1 graph groups
  581. 135.92 s > field value
  582. 135.92 s > existing_esurfaces 1
  583. 135.92 s > group_count 1
  584. 135.92 s > groups_above_threshold 1
  585. 135.92 s > integrand se1l_rls_shifted
  586. 135.92 s > span warm_up{integrand.name=se1l_rls_shifted}
  587. 135.92 s > threshold_status above threshold
  588. 135.92 s > [2026-08-28 17:33:30.664] @process::amplitude INFO : overlap structure of group 0: [1: [0(2,3)]]
  589. 135.92 s > field value
  590. 135.92 s > span warm_up{integrand.name=se1l_rls_shifted}
  591. 135.92 s > [2026-08-28 17:33:30.667] @process::amplitude WARNING : External state 0 ('g', PDG 21, helicity +) is off shell: p^2 = +2.5e5, expected m^2 = +0e0 (|Δ| = +2.5e5). Fixed-helicity spinor/vector/tensor external states may be ill-defined at this kinematic point.
  592. 135.92 s > field value
  593. 135.92 s > span warm_up{integrand.name=se1l}
  594. 135.92 s > [2026-08-28 17:33:30.667] @process::amplitude WARNING : External state 1 ('g', PDG 21, helicity -) is off shell: p^2 = +2.5e5, expected m^2 = +0e0 (|Δ| = +2.5e5). Fixed-helicity spinor/vector/tensor external states may be ill-defined at this kinematic point.
  595. 135.92 s > field value
  596. 135.92 s > span warm_up{integrand.name=se1l}
  597. 135.92 s > [2026-08-28 17:33:30.667] @process::amplitude INFO : Input is above threshold: 1 existing threshold E-surfaces across 1/1 graph groups
  598. 135.92 s > field value
  599. 135.92 s > existing_esurfaces 1
  600. 135.92 s > group_count 1
  601. 135.92 s > groups_above_threshold 1
  602. 135.92 s > integrand se1l
  603. 135.92 s > span warm_up{integrand.name=se1l}
  604. 135.92 s > threshold_status above threshold
  605. 135.92 s > [2026-08-28 17:33:30.667] @process::amplitude INFO : overlap structure of group 0: [1: [0(2,3)]]
  606. 135.92 s > field value
  607. 135.92 s > span warm_up{integrand.name=se1l}
  608. 135.92 s > [2026-08-28 17:33:30.671] @process::amplitude WARNING : External state 0 ('g', PDG 21, helicity +) is off shell: p^2 = +2.5e5, expected m^2 = +0e0 (|Δ| = +2.5e5). Fixed-helicity spinor/vector/tensor external states may be ill-defined at this kinematic point.
  609. 135.92 s > field value
  610. 135.92 s > span warm_up{integrand.name=se1l_rls_shifted}
  611. 135.92 s > [2026-08-28 17:33:30.671] @process::amplitude WARNING : External state 1 ('g', PDG 21, helicity -) is off shell: p^2 = +2.5e5, expected m^2 = +0e0 (|Δ| = +2.5e5). Fixed-helicity spinor/vector/tensor external states may be ill-defined at this kinematic point.
  612. 135.92 s > field value
  613. 135.92 s > span warm_up{integrand.name=se1l_rls_shifted}
  614. 135.92 s > [2026-08-28 17:33:30.671] @process::amplitude INFO : Input is above threshold: 1 existing threshold E-surfaces across 1/1 graph groups
  615. 135.92 s > field value
  616. 135.92 s > existing_esurfaces 1
  617. 135.92 s > group_count 1
  618. 135.92 s > groups_above_threshold 1
  619. 135.92 s > integrand se1l_rls_shifted
  620. 135.92 s > span warm_up{integrand.name=se1l_rls_shifted}
  621. 135.92 s > threshold_status above threshold
  622. 135.92 s > [2026-08-28 17:33:30.671] @process::amplitude INFO : overlap structure of group 0: [1: [0(2,3)]]
  623. 135.92 s > field value
  624. 135.92 s > span warm_up{integrand.name=se1l_rls_shifted}
  625. 135.92 s > [2026-08-28 17:33:30.675] @process::amplitude WARNING : External state 0 ('g', PDG 21, helicity +) is off shell: p^2 = +2.5e5, expected m^2 = +0e0 (|Δ| = +2.5e5). Fixed-helicity spinor/vector/tensor external states may be ill-defined at this kinematic point.
  626. 135.92 s > field value
  627. 135.92 s > span warm_up{integrand.name=se1l}
  628. 135.92 s > [2026-08-28 17:33:30.675] @process::amplitude WARNING : External state 1 ('g', PDG 21, helicity -) is off shell: p^2 = +2.5e5, expected m^2 = +0e0 (|Δ| = +2.5e5). Fixed-helicity spinor/vector/tensor external states may be ill-defined at this kinematic point.
  629. 135.92 s > field value
  630. 135.92 s > span warm_up{integrand.name=se1l}
  631. 135.92 s > [2026-08-28 17:33:30.675] @process::amplitude INFO : Input is above threshold: 1 existing threshold E-surfaces across 1/1 graph groups
  632. 135.92 s > field value
  633. 135.92 s > existing_esurfaces 1
  634. 135.92 s > group_count 1
  635. 135.92 s > groups_above_threshold 1
  636. 135.92 s > integrand se1l
  637. 135.92 s > span warm_up{integrand.name=se1l}
  638. 135.92 s > threshold_status above threshold
  639. 135.92 s > [2026-08-28 17:33:30.675] @process::amplitude INFO : overlap structure of group 0: [1: [0(2,3)]]
  640. 135.92 s > field value
  641. 135.92 s > span warm_up{integrand.name=se1l}
  642. 135.92 s > [2026-08-28 17:33:30.678] @process::amplitude WARNING : External state 0 ('g', PDG 21, helicity +) is off shell: p^2 = +2.5e5, expected m^2 = +0e0 (|Δ| = +2.5e5). Fixed-helicity spinor/vector/tensor external states may be ill-defined at this kinematic point.
  643. 135.92 s > field value
  644. 135.92 s > span warm_up{integrand.name=se1l_rls_shifted}
  645. 135.92 s > [2026-08-28 17:33:30.678] @process::amplitude WARNING : External state 1 ('g', PDG 21, helicity -) is off shell: p^2 = +2.5e5, expected m^2 = +0e0 (|Δ| = +2.5e5). Fixed-helicity spinor/vector/tensor external states may be ill-defined at this kinematic point.
  646. 135.92 s > field value
  647. 135.92 s > span warm_up{integrand.name=se1l_rls_shifted}
  648. 135.92 s > [2026-08-28 17:33:30.678] @process::amplitude INFO : Input is above threshold: 1 existing threshold E-surfaces across 1/1 graph groups
  649. 135.92 s > field value
  650. 135.92 s > existing_esurfaces 1
  651. 135.92 s > group_count 1
  652. 135.92 s > groups_above_threshold 1
  653. 135.92 s > integrand se1l_rls_shifted
  654. 135.92 s > span warm_up{integrand.name=se1l_rls_shifted}
  655. 135.92 s > threshold_status above threshold
  656. 135.92 s > [2026-08-28 17:33:30.678] @process::amplitude INFO : overlap structure of group 0: [1: [0(2,3)]]
  657. 135.92 s > field value
  658. 135.92 s > span warm_up{integrand.name=se1l_rls_shifted}
  659. 135.92 s > [2026-08-28 17:33:30.682] @process::amplitude WARNING : External state 0 ('g', PDG 21, helicity +) is off shell: p^2 = +2.5e5, expected m^2 = +0e0 (|Δ| = +2.5e5). Fixed-helicity spinor/vector/tensor external states may be ill-defined at this kinematic point.
  660. 135.92 s > field value
  661. 135.92 s > span warm_up{integrand.name=se1l}
  662. 135.92 s > [2026-08-28 17:33:30.682] @process::amplitude WARNING : External state 1 ('g', PDG 21, helicity -) is off shell: p^2 = +2.5e5, expected m^2 = +0e0 (|Δ| = +2.5e5). Fixed-helicity spinor/vector/tensor external states may be ill-defined at this kinematic point.
  663. 135.92 s > field value
  664. 135.92 s > span warm_up{integrand.name=se1l}
  665. 135.92 s > [2026-08-28 17:33:30.682] @process::amplitude INFO : Input is above threshold: 1 existing threshold E-surfaces across 1/1 graph groups
  666. 135.92 s > field value
  667. 135.92 s > existing_esurfaces 1
  668. 135.92 s > group_count 1
  669. 135.92 s > groups_above_threshold 1
  670. 135.92 s > integrand se1l
  671. 135.92 s > span warm_up{integrand.name=se1l}
  672. 135.92 s > threshold_status above threshold
  673. 135.92 s > [2026-08-28 17:33:30.682] @process::amplitude INFO : overlap structure of group 0: [1: [0(2,3)]]
  674. 135.92 s > field value
  675. 135.92 s > span warm_up{integrand.name=se1l}
  676. 135.92 s > [2026-08-28 17:33:30.686] @process::amplitude WARNING : External state 0 ('g', PDG 21, helicity +) is off shell: p^2 = +2.5e5, expected m^2 = +0e0 (|Δ| = +2.5e5). Fixed-helicity spinor/vector/tensor external states may be ill-defined at this kinematic point.
  677. 135.92 s > field value
  678. 135.92 s > span warm_up{integrand.name=se1l_rls_shifted}
  679. 135.92 s > [2026-08-28 17:33:30.686] @process::amplitude WARNING : External state 1 ('g', PDG 21, helicity -) is off shell: p^2 = +2.5e5, expected m^2 = +0e0 (|Δ| = +2.5e5). Fixed-helicity spinor/vector/tensor external states may be ill-defined at this kinematic point.
  680. 135.92 s > field value
  681. 135.92 s > span warm_up{integrand.name=se1l_rls_shifted}
  682. 135.92 s > [2026-08-28 17:33:30.686] @process::amplitude INFO : Input is above threshold: 1 existing threshold E-surfaces across 1/1 graph groups
  683. 135.92 s > field value
  684. 135.92 s > existing_esurfaces 1
  685. 135.92 s > group_count 1
  686. 135.92 s > groups_above_threshold 1
  687. 135.92 s > integrand se1l_rls_shifted
  688. 135.92 s > span warm_up{integrand.name=se1l_rls_shifted}
  689. 135.92 s > threshold_status above threshold
  690. 135.92 s > [2026-08-28 17:33:30.686] @process::amplitude INFO : overlap structure of group 0: [1: [0(2,3)]]
  691. 135.92 s > field value
  692. 135.92 s > span warm_up{integrand.name=se1l_rls_shifted}
  693. 135.92 s > [2026-08-28 17:33:30.689] @process::amplitude WARNING : External state 0 ('g', PDG 21, helicity +) is off shell: p^2 = +2.5e5, expected m^2 = +0e0 (|Δ| = +2.5e5). Fixed-helicity spinor/vector/tensor external states may be ill-defined at this kinematic point.
  694. 135.92 s > field value
  695. 135.92 s > span warm_up{integrand.name=se1l}
  696. 135.92 s > [2026-08-28 17:33:30.689] @process::amplitude WARNING : External state 1 ('g', PDG 21, helicity -) is off shell: p^2 = +2.5e5, expected m^2 = +0e0 (|Δ| = +2.5e5). Fixed-helicity spinor/vector/tensor external states may be ill-defined at this kinematic point.
  697. 135.92 s > field value
  698. 135.92 s > span warm_up{integrand.name=se1l}
  699. 135.92 s > [2026-08-28 17:33:30.689] @process::amplitude INFO : Input is above threshold: 1 existing threshold E-surfaces across 1/1 graph groups
  700. 135.92 s > field value
  701. 135.92 s > existing_esurfaces 1
  702. 135.92 s > group_count 1
  703. 135.92 s > groups_above_threshold 1
  704. 135.92 s > integrand se1l
  705. 135.92 s > span warm_up{integrand.name=se1l}
  706. 135.92 s > threshold_status above threshold
  707. 135.92 s > [2026-08-28 17:33:30.690] @process::amplitude INFO : overlap structure of group 0: [1: [0(2,3)]]
  708. 135.92 s > field value
  709. 135.92 s > span warm_up{integrand.name=se1l}
  710. 135.92 s > [2026-08-28 17:33:30.693] @process::amplitude WARNING : External state 0 ('g', PDG 21, helicity +) is off shell: p^2 = +2.5e5, expected m^2 = +0e0 (|Δ| = +2.5e5). Fixed-helicity spinor/vector/tensor external states may be ill-defined at this kinematic point.
  711. 135.92 s > field value
  712. 135.92 s > span warm_up{integrand.name=se1l_rls_shifted}
  713. 135.92 s > [2026-08-28 17:33:30.693] @process::amplitude WARNING : External state 1 ('g', PDG 21, helicity -) is off shell: p^2 = +2.5e5, expected m^2 = +0e0 (|Δ| = +2.5e5). Fixed-helicity spinor/vector/tensor external states may be ill-defined at this kinematic point.
  714. 135.92 s > field value
  715. 135.92 s > span warm_up{integrand.name=se1l_rls_shifted}
  716. 135.92 s > [2026-08-28 17:33:30.693] @process::amplitude INFO : Input is above threshold: 1 existing threshold E-surfaces across 1/1 graph groups
  717. 135.92 s > field value
  718. 135.92 s > existing_esurfaces 1
  719. 135.92 s > group_count 1
  720. 135.92 s > groups_above_threshold 1
  721. 135.92 s > integrand se1l_rls_shifted
  722. 135.92 s > span warm_up{integrand.name=se1l_rls_shifted}
  723. 135.92 s > threshold_status above threshold
  724. 135.92 s > [2026-08-28 17:33:30.693] @process::amplitude INFO : overlap structure of group 0: [1: [0(2,3)]]
  725. 135.92 s > field value
  726. 135.92 s > span warm_up{integrand.name=se1l_rls_shifted}
  727. 135.92 s > [2026-08-28 17:33:30.697] @process::amplitude WARNING : External state 0 ('g', PDG 21, helicity +) is off shell: p^2 = +2.5e5, expected m^2 = +0e0 (|Δ| = +2.5e5). Fixed-helicity spinor/vector/tensor external states may be ill-defined at this kinematic point.
  728. 135.92 s > field value
  729. 135.92 s > span warm_up{integrand.name=se1l}
  730. 135.92 s > [2026-08-28 17:33:30.697] @process::amplitude WARNING : External state 1 ('g', PDG 21, helicity -) is off shell: p^2 = +2.5e5, expected m^2 = +0e0 (|Δ| = +2.5e5). Fixed-helicity spinor/vector/tensor external states may be ill-defined at this kinematic point.
  731. 135.92 s > field value
  732. 135.92 s > span warm_up{integrand.name=se1l}
  733. 135.92 s > [2026-08-28 17:33:30.697] @process::amplitude INFO : Input is above threshold: 1 existing threshold E-surfaces across 1/1 graph groups
  734. 135.92 s > field value
  735. 135.92 s > existing_esurfaces 1
  736. 135.92 s > group_count 1
  737. 135.92 s > groups_above_threshold 1
  738. 135.92 s > integrand se1l
  739. 135.92 s > span warm_up{integrand.name=se1l}
  740. 135.92 s > threshold_status above threshold
  741. 135.92 s > [2026-08-28 17:33:30.697] @process::amplitude INFO : overlap structure of group 0: [1: [0(2,3)]]
  742. 135.92 s > field value
  743. 135.92 s > span warm_up{integrand.name=se1l}
  744. 135.92 s > [2026-08-28 17:33:30.700] @process::amplitude WARNING : External state 0 ('g', PDG 21, helicity +) is off shell: p^2 = +2.5e5, expected m^2 = +0e0 (|Δ| = +2.5e5). Fixed-helicity spinor/vector/tensor external states may be ill-defined at this kinematic point.
  745. 135.92 s > field value
  746. 135.92 s > span warm_up{integrand.name=se1l_rls_shifted}
  747. 135.92 s > [2026-08-28 17:33:30.700] @process::amplitude WARNING : External state 1 ('g', PDG 21, helicity -) is off shell: p^2 = +2.5e5, expected m^2 = +0e0 (|Δ| = +2.5e5). Fixed-helicity spinor/vector/tensor external states may be ill-defined at this kinematic point.
  748. 135.92 s > field value
  749. 135.92 s > span warm_up{integrand.name=se1l_rls_shifted}
  750. 135.92 s > [2026-08-28 17:33:30.701] @process::amplitude INFO : Input is above threshold: 1 existing threshold E-surfaces across 1/1 graph groups
  751. 135.92 s > field value
  752. 135.92 s > existing_esurfaces 1
  753. 135.92 s > group_count 1
  754. 135.92 s > groups_above_threshold 1
  755. 135.92 s > integrand se1l_rls_shifted
  756. 135.92 s > span warm_up{integrand.name=se1l_rls_shifted}
  757. 135.92 s > threshold_status above threshold
  758. 135.92 s > [2026-08-28 17:33:30.701] @process::amplitude INFO : overlap structure of group 0: [1: [0(2,3)]]
  759. 135.92 s > field value
  760. 135.92 s > span warm_up{integrand.name=se1l_rls_shifted}
  761. 135.92 s > [2026-08-28 17:33:30.704] @process::amplitude WARNING : External state 0 ('g', PDG 21, helicity +) is off shell: p^2 = +2.5e5, expected m^2 = +0e0 (|Δ| = +2.5e5). Fixed-helicity spinor/vector/tensor external states may be ill-defined at this kinematic point.
  762. 135.92 s > field value
  763. 135.92 s > span warm_up{integrand.name=se1l}
  764. 135.92 s > [2026-08-28 17:33:30.704] @process::amplitude WARNING : External state 1 ('g', PDG 21, helicity -) is off shell: p^2 = +2.5e5, expected m^2 = +0e0 (|Δ| = +2.5e5). Fixed-helicity spinor/vector/tensor external states may be ill-defined at this kinematic point.
  765. 135.92 s > field value
  766. 135.92 s > span warm_up{integrand.name=se1l}
  767. 135.92 s > [2026-08-28 17:33:30.704] @process::amplitude INFO : Input is above threshold: 1 existing threshold E-surfaces across 1/1 graph groups
  768. 135.92 s > field value
  769. 135.92 s > existing_esurfaces 1
  770. 135.92 s > group_count 1
  771. 135.92 s > groups_above_threshold 1
  772. 135.92 s > integrand se1l
  773. 135.92 s > span warm_up{integrand.name=se1l}
  774. 135.92 s > threshold_status above threshold
  775. 135.92 s > [2026-08-28 17:33:30.704] @process::amplitude INFO : overlap structure of group 0: [1: [0(2,3)]]
  776. 135.92 s > field value
  777. 135.92 s > span warm_up{integrand.name=se1l}
  778. 135.92 s > [2026-08-28 17:33:30.708] @process::amplitude WARNING : External state 0 ('g', PDG 21, helicity +) is off shell: p^2 = +2.5e5, expected m^2 = +0e0 (|Δ| = +2.5e5). Fixed-helicity spinor/vector/tensor external states may be ill-defined at this kinematic point.
  779. 135.92 s > field value
  780. 135.92 s > span warm_up{integrand.name=se1l_rls_shifted}
  781. 135.92 s > [2026-08-28 17:33:30.708] @process::amplitude WARNING : External state 1 ('g', PDG 21, helicity -) is off shell: p^2 = +2.5e5, expected m^2 = +0e0 (|Δ| = +2.5e5). Fixed-helicity spinor/vector/tensor external states may be ill-defined at this kinematic point.
  782. 135.92 s > field value
  783. 135.92 s > span warm_up{integrand.name=se1l_rls_shifted}
  784. 135.92 s > [2026-08-28 17:33:30.708] @process::amplitude INFO : Input is above threshold: 1 existing threshold E-surfaces across 1/1 graph groups
  785. 135.92 s > field value
  786. 135.92 s > existing_esurfaces 1
  787. 135.92 s > group_count 1
  788. 135.92 s > groups_above_threshold 1
  789. 135.92 s > integrand se1l_rls_shifted
  790. 135.92 s > span warm_up{integrand.name=se1l_rls_shifted}
  791. 135.92 s > threshold_status above threshold
  792. 135.92 s > [2026-08-28 17:33:30.708] @process::amplitude INFO : overlap structure of group 0: [1: [0(2,3)]]
  793. 135.92 s > field value
  794. 135.92 s > span warm_up{integrand.name=se1l_rls_shifted}
  795. 135.92 s > [2026-08-28 17:33:30.712] @process::amplitude WARNING : External state 0 ('g', PDG 21, helicity +) is off shell: p^2 = +2.5e5, expected m^2 = +0e0 (|Δ| = +2.5e5). Fixed-helicity spinor/vector/tensor external states may be ill-defined at this kinematic point.
  796. 135.92 s > field value
  797. 135.92 s > span warm_up{integrand.name=se1l}
  798. 135.92 s > [2026-08-28 17:33:30.712] @process::amplitude WARNING : External state 1 ('g', PDG 21, helicity -) is off shell: p^2 = +2.5e5, expected m^2 = +0e0 (|Δ| = +2.5e5). Fixed-helicity spinor/vector/tensor external states may be ill-defined at this kinematic point.
  799. 135.92 s > field value
  800. 135.92 s > span warm_up{integrand.name=se1l}
  801. 135.92 s > [2026-08-28 17:33:30.712] @process::amplitude INFO : Input is above threshold: 1 existing threshold E-surfaces across 1/1 graph groups
  802. 135.92 s > field value
  803. 135.92 s > existing_esurfaces 1
  804. 135.92 s > group_count 1
  805. 135.92 s > groups_above_threshold 1
  806. 135.92 s > integrand se1l
  807. 135.92 s > span warm_up{integrand.name=se1l}
  808. 135.92 s > threshold_status above threshold
  809. 135.92 s > [2026-08-28 17:33:30.712] @process::amplitude INFO : overlap structure of group 0: [1: [0(2,3)]]
  810. 135.92 s > field value
  811. 135.92 s > span warm_up{integrand.name=se1l}
  812. 135.92 s > [2026-08-28 17:33:30.715] @process::amplitude WARNING : External state 0 ('g', PDG 21, helicity +) is off shell: p^2 = +2.5e5, expected m^2 = +0e0 (|Δ| = +2.5e5). Fixed-helicity spinor/vector/tensor external states may be ill-defined at this kinematic point.
  813. 135.92 s > field value
  814. 135.92 s > span warm_up{integrand.name=se1l_rls_shifted}
  815. 135.92 s > [2026-08-28 17:33:30.715] @process::amplitude WARNING : External state 1 ('g', PDG 21, helicity -) is off shell: p^2 = +2.5e5, expected m^2 = +0e0 (|Δ| = +2.5e5). Fixed-helicity spinor/vector/tensor external states may be ill-defined at this kinematic point.
  816. 135.92 s > field value
  817. 135.92 s > span warm_up{integrand.name=se1l_rls_shifted}
  818. 135.92 s > [2026-08-28 17:33:30.715] @process::amplitude INFO : Input is above threshold: 1 existing threshold E-surfaces across 1/1 graph groups
  819. 135.92 s > field value
  820. 135.92 s > existing_esurfaces 1
  821. 135.92 s > group_count 1
  822. 135.92 s > groups_above_threshold 1
  823. 135.92 s > integrand se1l_rls_shifted
  824. 135.92 s > span warm_up{integrand.name=se1l_rls_shifted}
  825. 135.92 s > threshold_status above threshold
  826. 135.92 s > [2026-08-28 17:33:30.715] @process::amplitude INFO : overlap structure of group 0: [1: [0(2,3)]]
  827. 135.92 s > field value
  828. 135.92 s > span warm_up{integrand.name=se1l_rls_shifted}
  829. 135.92 s > [2026-08-28 17:33:30.719] @process::amplitude WARNING : External state 0 ('g', PDG 21, helicity +) is off shell: p^2 = +2.5e5, expected m^2 = +0e0 (|Δ| = +2.5e5). Fixed-helicity spinor/vector/tensor external states may be ill-defined at this kinematic point.
  830. 135.92 s > field value
  831. 135.92 s > span warm_up{integrand.name=se1l}
  832. 135.92 s > [2026-08-28 17:33:30.719] @process::amplitude WARNING : External state 1 ('g', PDG 21, helicity -) is off shell: p^2 = +2.5e5, expected m^2 = +0e0 (|Δ| = +2.5e5). Fixed-helicity spinor/vector/tensor external states may be ill-defined at this kinematic point.
  833. 135.92 s > field value
  834. 135.92 s > span warm_up{integrand.name=se1l}
  835. 135.92 s > [2026-08-28 17:33:30.719] @process::amplitude INFO : Input is above threshold: 1 existing threshold E-surfaces across 1/1 graph groups
  836. 135.92 s > field value
  837. 135.92 s > existing_esurfaces 1
  838. 135.92 s > group_count 1
  839. 135.92 s > groups_above_threshold 1
  840. 135.92 s > integrand se1l
  841. 135.92 s > span warm_up{integrand.name=se1l}
  842. 135.92 s > threshold_status above threshold
  843. 135.92 s > [2026-08-28 17:33:30.719] @process::amplitude INFO : overlap structure of group 0: [1: [0(2,3)]]
  844. 135.92 s > field value
  845. 135.92 s > span warm_up{integrand.name=se1l}
  846. 135.92 s > [2026-08-28 17:33:30.723] @process::amplitude WARNING : External state 0 ('g', PDG 21, helicity +) is off shell: p^2 = +2.5e5, expected m^2 = +0e0 (|Δ| = +2.5e5). Fixed-helicity spinor/vector/tensor external states may be ill-defined at this kinematic point.
  847. 135.92 s > field value
  848. 135.92 s > span warm_up{integrand.name=se1l_rls_shifted}
  849. 135.92 s > [2026-08-28 17:33:30.723] @process::amplitude WARNING : External state 1 ('g', PDG 21, helicity -) is off shell: p^2 = +2.5e5, expected m^2 = +0e0 (|Δ| = +2.5e5). Fixed-helicity spinor/vector/tensor external states may be ill-defined at this kinematic point.
  850. 135.92 s > field value
  851. 135.92 s > span warm_up{integrand.name=se1l_rls_shifted}
  852. 135.92 s > [2026-08-28 17:33:30.723] @process::amplitude INFO : Input is above threshold: 1 existing threshold E-surfaces across 1/1 graph groups
  853. 135.92 s > field value
  854. 135.92 s > existing_esurfaces 1
  855. 135.92 s > group_count 1
  856. 135.92 s > groups_above_threshold 1
  857. 135.92 s > integrand se1l_rls_shifted
  858. 135.92 s > span warm_up{integrand.name=se1l_rls_shifted}
  859. 135.92 s > threshold_status above threshold
  860. 135.92 s > [2026-08-28 17:33:30.723] @process::amplitude INFO : overlap structure of group 0: [1: [0(2,3)]]
  861. 135.92 s > field value
  862. 135.92 s > span warm_up{integrand.name=se1l_rls_shifted}
  863. 135.92 s > [2026-08-28 17:33:30.726] @process::amplitude WARNING : External state 0 ('g', PDG 21, helicity +) is off shell: p^2 = +2.5e5, expected m^2 = +0e0 (|Δ| = +2.5e5). Fixed-helicity spinor/vector/tensor external states may be ill-defined at this kinematic point.
  864. 135.92 s > field value
  865. 135.92 s > span warm_up{integrand.name=se1l}
  866. 135.92 s > [2026-08-28 17:33:30.726] @process::amplitude WARNING : External state 1 ('g', PDG 21, helicity -) is off shell: p^2 = +2.5e5, expected m^2 = +0e0 (|Δ| = +2.5e5). Fixed-helicity spinor/vector/tensor external states may be ill-defined at this kinematic point.
  867. 135.92 s > field value
  868. 135.92 s > span warm_up{integrand.name=se1l}
  869. 135.92 s > [2026-08-28 17:33:30.726] @process::amplitude INFO : Input is above threshold: 1 existing threshold E-surfaces across 1/1 graph groups
  870. 135.92 s > field value
  871. 135.92 s > existing_esurfaces 1
  872. 135.92 s > group_count 1
  873. 135.92 s > groups_above_threshold 1
  874. 135.92 s > integrand se1l
  875. 135.92 s > span warm_up{integrand.name=se1l}
  876. 135.92 s > threshold_status above threshold
  877. 135.92 s > [2026-08-28 17:33:30.727] @process::amplitude INFO : overlap structure of group 0: [1: [0(2,3)]]
  878. 135.92 s > field value
  879. 135.92 s > span warm_up{integrand.name=se1l}
  880. 135.92 s > [2026-08-28 17:33:30.730] @process::amplitude WARNING : External state 0 ('g', PDG 21, helicity +) is off shell: p^2 = +2.5e5, expected m^2 = +0e0 (|Δ| = +2.5e5). Fixed-helicity spinor/vector/tensor external states may be ill-defined at this kinematic point.
  881. 135.92 s > field value
  882. 135.92 s > span warm_up{integrand.name=se1l_rls_shifted}
  883. 135.92 s > [2026-08-28 17:33:30.730] @process::amplitude WARNING : External state 1 ('g', PDG 21, helicity -) is off shell: p^2 = +2.5e5, expected m^2 = +0e0 (|Δ| = +2.5e5). Fixed-helicity spinor/vector/tensor external states may be ill-defined at this kinematic point.
  884. 135.92 s > field value
  885. 135.92 s > span warm_up{integrand.name=se1l_rls_shifted}
  886. 135.92 s > [2026-08-28 17:33:30.730] @process::amplitude INFO : Input is above threshold: 1 existing threshold E-surfaces across 1/1 graph groups
  887. 135.92 s > field value
  888. 135.92 s > existing_esurfaces 1
  889. 135.92 s > group_count 1
  890. 135.92 s > groups_above_threshold 1
  891. 135.92 s > integrand se1l_rls_shifted
  892. 135.92 s > span warm_up{integrand.name=se1l_rls_shifted}
  893. 135.92 s > threshold_status above threshold
  894. 135.92 s > [2026-08-28 17:33:30.730] @process::amplitude INFO : overlap structure of group 0: [1: [0(2,3)]]
  895. 135.92 s > field value
  896. 135.92 s > span warm_up{integrand.name=se1l_rls_shifted}
  897. 135.92 s > [2026-08-28 17:33:30.734] @process::amplitude WARNING : External state 0 ('g', PDG 21, helicity +) is off shell: p^2 = +2.5e5, expected m^2 = +0e0 (|Δ| = +2.5e5). Fixed-helicity spinor/vector/tensor external states may be ill-defined at this kinematic point.
  898. 135.92 s > field value
  899. 135.92 s > span warm_up{integrand.name=se1l}
  900. 135.92 s > [2026-08-28 17:33:30.734] @process::amplitude WARNING : External state 1 ('g', PDG 21, helicity -) is off shell: p^2 = +2.5e5, expected m^2 = +0e0 (|Δ| = +2.5e5). Fixed-helicity spinor/vector/tensor external states may be ill-defined at this kinematic point.
  901. 135.92 s > field value
  902. 135.92 s > span warm_up{integrand.name=se1l}
  903. 135.92 s > [2026-08-28 17:33:30.734] @process::amplitude INFO : Input is above threshold: 1 existing threshold E-surfaces across 1/1 graph groups
  904. 135.92 s > field value
  905. 135.92 s > existing_esurfaces 1
  906. 135.92 s > group_count 1
  907. 135.92 s > groups_above_threshold 1
  908. 135.92 s > integrand se1l
  909. 135.92 s > span warm_up{integrand.name=se1l}
  910. 135.92 s > threshold_status above threshold
  911. 135.92 s > [2026-08-28 17:33:30.734] @process::amplitude INFO : overlap structure of group 0: [1: [0(2,3)]]
  912. 135.92 s > field value
  913. 135.92 s > span warm_up{integrand.name=se1l}
  914. 135.92 s > [2026-08-28 17:33:30.737] @process::amplitude WARNING : External state 0 ('g', PDG 21, helicity +) is off shell: p^2 = +2.5e5, expected m^2 = +0e0 (|Δ| = +2.5e5). Fixed-helicity spinor/vector/tensor external states may be ill-defined at this kinematic point.
  915. 135.92 s > field value
  916. 135.92 s > span warm_up{integrand.name=se1l_mur_shifted}
  917. 135.92 s > [2026-08-28 17:33:30.737] @process::amplitude WARNING : External state 1 ('g', PDG 21, helicity -) is off shell: p^2 = +2.5e5, expected m^2 = +0e0 (|Δ| = +2.5e5). Fixed-helicity spinor/vector/tensor external states may be ill-defined at this kinematic point.
  918. 135.92 s > field value
  919. 135.92 s > span warm_up{integrand.name=se1l_mur_shifted}
  920. 135.92 s > [2026-08-28 17:33:30.738] @process::amplitude INFO : Input is above threshold: 1 existing threshold E-surfaces across 1/1 graph groups
  921. 135.92 s > field value
  922. 135.92 s > existing_esurfaces 1
  923. 135.92 s > group_count 1
  924. 135.92 s > groups_above_threshold 1
  925. 135.92 s > integrand se1l_mur_shifted
  926. 135.92 s > span warm_up{integrand.name=se1l_mur_shifted}
  927. 135.92 s > threshold_status above threshold
  928. 135.92 s > [2026-08-28 17:33:30.738] @process::amplitude INFO : overlap structure of group 0: [1: [0(2,3)]]
  929. 135.92 s > field value
  930. 135.92 s > span warm_up{integrand.name=se1l_mur_shifted}
  931. 135.92 s > [2026-08-28 17:33:30.741] @process::amplitude WARNING : External state 0 ('g', PDG 21, helicity +) is off shell: p^2 = +2.5e5, expected m^2 = +0e0 (|Δ| = +2.5e5). Fixed-helicity spinor/vector/tensor external states may be ill-defined at this kinematic point.
  932. 135.92 s > field value
  933. 135.92 s > span warm_up{integrand.name=se1l}
  934. 135.92 s > [2026-08-28 17:33:30.741] @process::amplitude WARNING : External state 1 ('g', PDG 21, helicity -) is off shell: p^2 = +2.5e5, expected m^2 = +0e0 (|Δ| = +2.5e5). Fixed-helicity spinor/vector/tensor external states may be ill-defined at this kinematic point.
  935. 135.92 s > field value
  936. 135.92 s > span warm_up{integrand.name=se1l}
  937. 135.92 s > [2026-08-28 17:33:30.741] @process::amplitude INFO : Input is above threshold: 1 existing threshold E-surfaces across 1/1 graph groups
  938. 135.92 s > field value
  939. 135.92 s > existing_esurfaces 1
  940. 135.92 s > group_count 1
  941. 135.92 s > groups_above_threshold 1
  942. 135.92 s > integrand se1l
  943. 135.92 s > span warm_up{integrand.name=se1l}
  944. 135.92 s > threshold_status above threshold
  945. 135.92 s > [2026-08-28 17:33:30.741] @process::amplitude INFO : overlap structure of group 0: [1: [0(2,3)]]
  946. 135.92 s > field value
  947. 135.92 s > span warm_up{integrand.name=se1l}
  948. 135.92 s > [2026-08-28 17:33:30.745] @process::amplitude WARNING : External state 0 ('g', PDG 21, helicity +) is off shell: p^2 = +2.5e5, expected m^2 = +0e0 (|Δ| = +2.5e5). Fixed-helicity spinor/vector/tensor external states may be ill-defined at this kinematic point.
  949. 135.92 s > field value
  950. 135.92 s > span warm_up{integrand.name=se1l_mur_shifted}
  951. 135.92 s > [2026-08-28 17:33:30.745] @process::amplitude WARNING : External state 1 ('g', PDG 21, helicity -) is off shell: p^2 = +2.5e5, expected m^2 = +0e0 (|Δ| = +2.5e5). Fixed-helicity spinor/vector/tensor external states may be ill-defined at this kinematic point.
  952. 135.92 s > field value
  953. 135.92 s > span warm_up{integrand.name=se1l_mur_shifted}
  954. 135.92 s > [2026-08-28 17:33:30.745] @process::amplitude INFO : Input is above threshold: 1 existing threshold E-surfaces across 1/1 graph groups
  955. 135.92 s > field value
  956. 135.92 s > existing_esurfaces 1
  957. 135.92 s > group_count 1
  958. 135.92 s > groups_above_threshold 1
  959. 135.92 s > integrand se1l_mur_shifted
  960. 135.92 s > span warm_up{integrand.name=se1l_mur_shifted}
  961. 135.92 s > threshold_status above threshold
  962. 135.92 s > [2026-08-28 17:33:30.745] @process::amplitude INFO : overlap structure of group 0: [1: [0(2,3)]]
  963. 135.92 s > field value
  964. 135.92 s > span warm_up{integrand.name=se1l_mur_shifted}
  965. 135.92 s > [2026-08-28 17:33:30.749] @process::amplitude WARNING : External state 0 ('g', PDG 21, helicity +) is off shell: p^2 = +2.5e5, expected m^2 = +0e0 (|Δ| = +2.5e5). Fixed-helicity spinor/vector/tensor external states may be ill-defined at this kinematic point.
  966. 135.92 s > field value
  967. 135.92 s > span warm_up{integrand.name=se1l}
  968. 135.92 s > [2026-08-28 17:33:30.749] @process::amplitude WARNING : External state 1 ('g', PDG 21, helicity -) is off shell: p^2 = +2.5e5, expected m^2 = +0e0 (|Δ| = +2.5e5). Fixed-helicity spinor/vector/tensor external states may be ill-defined at this kinematic point.
  969. 135.92 s > field value
  970. 135.92 s > span warm_up{integrand.name=se1l}
  971. 135.92 s > [2026-08-28 17:33:30.749] @process::amplitude INFO : Input is above threshold: 1 existing threshold E-surfaces across 1/1 graph groups
  972. 135.92 s > field value
  973. 135.92 s > existing_esurfaces 1
  974. 135.92 s > group_count 1
  975. 135.92 s > groups_above_threshold 1
  976. 135.92 s > integrand se1l
  977. 135.92 s > span warm_up{integrand.name=se1l}
  978. 135.92 s > threshold_status above threshold
  979. 135.92 s > [2026-08-28 17:33:30.749] @process::amplitude INFO : overlap structure of group 0: [1: [0(2,3)]]
  980. 135.92 s > field value
  981. 135.92 s > span warm_up{integrand.name=se1l}
  982. 135.92 s > [2026-08-28 17:33:30.752] @process::amplitude WARNING : External state 0 ('g', PDG 21, helicity +) is off shell: p^2 = +2.5e5, expected m^2 = +0e0 (|Δ| = +2.5e5). Fixed-helicity spinor/vector/tensor external states may be ill-defined at this kinematic point.
  983. 135.92 s > field value
  984. 135.92 s > span warm_up{integrand.name=se1l_mur_shifted}
  985. 135.92 s > [2026-08-28 17:33:30.752] @process::amplitude WARNING : External state 1 ('g', PDG 21, helicity -) is off shell: p^2 = +2.5e5, expected m^2 = +0e0 (|Δ| = +2.5e5). Fixed-helicity spinor/vector/tensor external states may be ill-defined at this kinematic point.
  986. 135.92 s > field value
  987. 135.92 s > span warm_up{integrand.name=se1l_mur_shifted}
  988. 135.92 s > [2026-08-28 17:33:30.752] @process::amplitude INFO : Input is above threshold: 1 existing threshold E-surfaces across 1/1 graph groups
  989. 135.92 s > field value
  990. 135.92 s > existing_esurfaces 1
  991. 135.92 s > group_count 1
  992. 135.92 s > groups_above_threshold 1
  993. 135.92 s > integrand se1l_mur_shifted
  994. 135.92 s > span warm_up{integrand.name=se1l_mur_shifted}
  995. 135.92 s > threshold_status above threshold
  996. 135.92 s > [2026-08-28 17:33:30.753] @process::amplitude INFO : overlap structure of group 0: [1: [0(2,3)]]
  997. 135.92 s > field value
  998. 135.92 s > span warm_up{integrand.name=se1l_mur_shifted}
  999. 135.92 s > [2026-08-28 17:33:30.756] @process::amplitude WARNING : External state 0 ('g', PDG 21, helicity +) is off shell: p^2 = +2.5e5, expected m^2 = +0e0 (|Δ| = +2.5e5). Fixed-helicity spinor/vector/tensor external states may be ill-defined at this kinematic point.
  1000. 135.92 s > field value
  1001. 135.92 s > span warm_up{integrand.name=se1l}
  1002. 135.92 s > [2026-08-28 17:33:30.756] @process::amplitude WARNING : External state 1 ('g', PDG 21, helicity -) is off shell: p^2 = +2.5e5, expected m^2 = +0e0 (|Δ| = +2.5e5). Fixed-helicity spinor/vector/tensor external states may be ill-defined at this kinematic point.
  1003. 135.92 s > field value
  1004. 135.92 s > span warm_up{integrand.name=se1l}
  1005. 135.92 s > [2026-08-28 17:33:30.756] @process::amplitude INFO : Input is above threshold: 1 existing threshold E-surfaces across 1/1 graph groups
  1006. 135.92 s > field value
  1007. 135.92 s > existing_esurfaces 1
  1008. 135.92 s > group_count 1
  1009. 135.92 s > groups_above_threshold 1
  1010. 135.92 s > integrand se1l
  1011. 135.92 s > span warm_up{integrand.name=se1l}
  1012. 135.92 s > threshold_status above threshold
  1013. 135.92 s > [2026-08-28 17:33:30.756] @process::amplitude INFO : overlap structure of group 0: [1: [0(2,3)]]
  1014. 135.92 s > field value
  1015. 135.92 s > span warm_up{integrand.name=se1l}
  1016. 135.92 s > [2026-08-28 17:33:30.760] @process::amplitude WARNING : External state 0 ('g', PDG 21, helicity +) is off shell: p^2 = +2.5e5, expected m^2 = +0e0 (|Δ| = +2.5e5). Fixed-helicity spinor/vector/tensor external states may be ill-defined at this kinematic point.
  1017. 135.92 s > field value
  1018. 135.92 s > span warm_up{integrand.name=se1l_mur_shifted}
  1019. 135.92 s > [2026-08-28 17:33:30.760] @process::amplitude WARNING : External state 1 ('g', PDG 21, helicity -) is off shell: p^2 = +2.5e5, expected m^2 = +0e0 (|Δ| = +2.5e5). Fixed-helicity spinor/vector/tensor external states may be ill-defined at this kinematic point.
  1020. 135.92 s > field value
  1021. 135.92 s > span warm_up{integrand.name=se1l_mur_shifted}
  1022. 135.92 s > [2026-08-28 17:33:30.760] @process::amplitude INFO : Input is above threshold: 1 existing threshold E-surfaces across 1/1 graph groups
  1023. 135.92 s > field value
  1024. 135.92 s > existing_esurfaces 1
  1025. 135.92 s > group_count 1
  1026. 135.92 s > groups_above_threshold 1
  1027. 135.92 s > integrand se1l_mur_shifted
  1028. 135.92 s > span warm_up{integrand.name=se1l_mur_shifted}
  1029. 135.92 s > threshold_status above threshold
  1030. 135.92 s > [2026-08-28 17:33:30.760] @process::amplitude INFO : overlap structure of group 0: [1: [0(2,3)]]
  1031. 135.92 s > field value
  1032. 135.92 s > span warm_up{integrand.name=se1l_mur_shifted}
  1033. 135.92 s > [2026-08-28 17:33:30.764] @process::amplitude WARNING : External state 0 ('g', PDG 21, helicity +) is off shell: p^2 = +2.5e5, expected m^2 = +0e0 (|Δ| = +2.5e5). Fixed-helicity spinor/vector/tensor external states may be ill-defined at this kinematic point.
  1034. 135.92 s > field value
  1035. 135.92 s > span warm_up{integrand.name=se1l}
  1036. 135.92 s > [2026-08-28 17:33:30.764] @process::amplitude WARNING : External state 1 ('g', PDG 21, helicity -) is off shell: p^2 = +2.5e5, expected m^2 = +0e0 (|Δ| = +2.5e5). Fixed-helicity spinor/vector/tensor external states may be ill-defined at this kinematic point.
  1037. 135.92 s > field value
  1038. 135.92 s > span warm_up{integrand.name=se1l}
  1039. 135.92 s > [2026-08-28 17:33:30.764] @process::amplitude INFO : Input is above threshold: 1 existing threshold E-surfaces across 1/1 graph groups
  1040. 135.92 s > field value
  1041. 135.92 s > existing_esurfaces 1
  1042. 135.92 s > group_count 1
  1043. 135.92 s > groups_above_threshold 1
  1044. 135.92 s > integrand se1l
  1045. 135.92 s > span warm_up{integrand.name=se1l}
  1046. 135.92 s > threshold_status above threshold
  1047. 135.92 s > [2026-08-28 17:33:30.764] @process::amplitude INFO : overlap structure of group 0: [1: [0(2,3)]]
  1048. 135.92 s > field value
  1049. 135.92 s > span warm_up{integrand.name=se1l}
  1050. 135.92 s > [2026-08-28 17:33:30.767] @process::amplitude WARNING : External state 0 ('g', PDG 21, helicity +) is off shell: p^2 = +2.5e5, expected m^2 = +0e0 (|Δ| = +2.5e5). Fixed-helicity spinor/vector/tensor external states may be ill-defined at this kinematic point.
  1051. 135.92 s > field value
  1052. 135.92 s > span warm_up{integrand.name=se1l_mur_shifted}
  1053. 135.92 s > [2026-08-28 17:33:30.767] @process::amplitude WARNING : External state 1 ('g', PDG 21, helicity -) is off shell: p^2 = +2.5e5, expected m^2 = +0e0 (|Δ| = +2.5e5). Fixed-helicity spinor/vector/tensor external states may be ill-defined at this kinematic point.
  1054. 135.92 s > field value
  1055. 135.92 s > span warm_up{integrand.name=se1l_mur_shifted}
  1056. 135.92 s > [2026-08-28 17:33:30.767] @process::amplitude INFO : Input is above threshold: 1 existing threshold E-surfaces across 1/1 graph groups
  1057. 135.92 s > field value
  1058. 135.92 s > existing_esurfaces 1
  1059. 135.92 s > group_count 1
  1060. 135.92 s > groups_above_threshold 1
  1061. 135.92 s > integrand se1l_mur_shifted
  1062. 135.92 s > span warm_up{integrand.name=se1l_mur_shifted}
  1063. 135.92 s > threshold_status above threshold
  1064. 135.92 s > [2026-08-28 17:33:30.767] @process::amplitude INFO : overlap structure of group 0: [1: [0(2,3)]]
  1065. 135.92 s > field value
  1066. 135.92 s > span warm_up{integrand.name=se1l_mur_shifted}
  1067. 135.92 s > [2026-08-28 17:33:30.771] @process::amplitude WARNING : External state 0 ('g', PDG 21, helicity +) is off shell: p^2 = +2.5e5, expected m^2 = +0e0 (|Δ| = +2.5e5). Fixed-helicity spinor/vector/tensor external states may be ill-defined at this kinematic point.
  1068. 135.92 s > field value
  1069. 135.92 s > span warm_up{integrand.name=se1l}
  1070. 135.92 s > [2026-08-28 17:33:30.771] @process::amplitude WARNING : External state 1 ('g', PDG 21, helicity -) is off shell: p^2 = +2.5e5, expected m^2 = +0e0 (|Δ| = +2.5e5). Fixed-helicity spinor/vector/tensor external states may be ill-defined at this kinematic point.
  1071. 135.92 s > field value
  1072. 135.92 s > span warm_up{integrand.name=se1l}
  1073. 135.92 s > [2026-08-28 17:33:30.771] @process::amplitude INFO : Input is above threshold: 1 existing threshold E-surfaces across 1/1 graph groups
  1074. 135.92 s > field value
  1075. 135.92 s > existing_esurfaces 1
  1076. 135.92 s > group_count 1
  1077. 135.92 s > groups_above_threshold 1
  1078. 135.92 s > integrand se1l
  1079. 135.92 s > span warm_up{integrand.name=se1l}
  1080. 135.92 s > threshold_status above threshold
  1081. 135.92 s > [2026-08-28 17:33:30.771] @process::amplitude INFO : overlap structure of group 0: [1: [0(2,3)]]
  1082. 135.92 s > field value
  1083. 135.92 s > span warm_up{integrand.name=se1l}
  1084. 135.92 s > [2026-08-28 17:33:30.775] @process::amplitude WARNING : External state 0 ('g', PDG 21, helicity +) is off shell: p^2 = +2.5e5, expected m^2 = +0e0 (|Δ| = +2.5e5). Fixed-helicity spinor/vector/tensor external states may be ill-defined at this kinematic point.
  1085. 135.92 s > field value
  1086. 135.92 s > span warm_up{integrand.name=se1l_mur_shifted}
  1087. 135.92 s > [2026-08-28 17:33:30.775] @process::amplitude WARNING : External state 1 ('g', PDG 21, helicity -) is off shell: p^2 = +2.5e5, expected m^2 = +0e0 (|Δ| = +2.5e5). Fixed-helicity spinor/vector/tensor external states may be ill-defined at this kinematic point.
  1088. 135.92 s > field value
  1089. 135.92 s > span warm_up{integrand.name=se1l_mur_shifted}
  1090. 135.92 s > [2026-08-28 17:33:30.775] @process::amplitude INFO : Input is above threshold: 1 existing threshold E-surfaces across 1/1 graph groups
  1091. 135.92 s > field value
  1092. 135.92 s > existing_esurfaces 1
  1093. 135.92 s > group_count 1
  1094. 135.92 s > groups_above_threshold 1
  1095. 135.92 s > integrand se1l_mur_shifted
  1096. 135.92 s > span warm_up{integrand.name=se1l_mur_shifted}
  1097. 135.92 s > threshold_status above threshold
  1098. 135.92 s > [2026-08-28 17:33:30.775] @process::amplitude INFO : overlap structure of group 0: [1: [0(2,3)]]
  1099. 135.92 s > field value
  1100. 135.92 s > span warm_up{integrand.name=se1l_mur_shifted}
  1101. 135.92 s > [2026-08-28 17:33:30.778] @process::amplitude WARNING : External state 0 ('g', PDG 21, helicity +) is off shell: p^2 = +2.5e5, expected m^2 = +0e0 (|Δ| = +2.5e5). Fixed-helicity spinor/vector/tensor external states may be ill-defined at this kinematic point.
  1102. 135.92 s > field value
  1103. 135.92 s > span warm_up{integrand.name=se1l}
  1104. 135.92 s > [2026-08-28 17:33:30.778] @process::amplitude WARNING : External state 1 ('g', PDG 21, helicity -) is off shell: p^2 = +2.5e5, expected m^2 = +0e0 (|Δ| = +2.5e5). Fixed-helicity spinor/vector/tensor external states may be ill-defined at this kinematic point.
  1105. 135.92 s > field value
  1106. 135.92 s > span warm_up{integrand.name=se1l}
  1107. 135.92 s > [2026-08-28 17:33:30.778] @process::amplitude INFO : Input is above threshold: 1 existing threshold E-surfaces across 1/1 graph groups
  1108. 135.92 s > field value
  1109. 135.92 s > existing_esurfaces 1
  1110. 135.92 s > group_count 1
  1111. 135.92 s > groups_above_threshold 1
  1112. 135.92 s > integrand se1l
  1113. 135.92 s > span warm_up{integrand.name=se1l}
  1114. 135.92 s > threshold_status above threshold
  1115. 135.92 s > [2026-08-28 17:33:30.779] @process::amplitude INFO : overlap structure of group 0: [1: [0(2,3)]]
  1116. 135.92 s > field value
  1117. 135.92 s > span warm_up{integrand.name=se1l}
  1118. 135.92 s > [2026-08-28 17:33:30.782] @process::amplitude WARNING : External state 0 ('g', PDG 21, helicity +) is off shell: p^2 = +2.5e5, expected m^2 = +0e0 (|Δ| = +2.5e5). Fixed-helicity spinor/vector/tensor external states may be ill-defined at this kinematic point.
  1119. 135.92 s > field value
  1120. 135.92 s > span warm_up{integrand.name=se1l_mur_shifted}
  1121. 135.92 s > [2026-08-28 17:33:30.782] @process::amplitude WARNING : External state 1 ('g', PDG 21, helicity -) is off shell: p^2 = +2.5e5, expected m^2 = +0e0 (|Δ| = +2.5e5). Fixed-helicity spinor/vector/tensor external states may be ill-defined at this kinematic point.
  1122. 135.92 s > field value
  1123. 135.92 s > span warm_up{integrand.name=se1l_mur_shifted}
  1124. 135.92 s > [2026-08-28 17:33:30.782] @process::amplitude INFO : Input is above threshold: 1 existing threshold E-surfaces across 1/1 graph groups
  1125. 135.92 s > field value
  1126. 135.92 s > existing_esurfaces 1
  1127. 135.92 s > group_count 1
  1128. 135.92 s > groups_above_threshold 1
  1129. 135.92 s > integrand se1l_mur_shifted
  1130. 135.92 s > span warm_up{integrand.name=se1l_mur_shifted}
  1131. 135.92 s > threshold_status above threshold
  1132. 135.92 s > [2026-08-28 17:33:30.782] @process::amplitude INFO : overlap structure of group 0: [1: [0(2,3)]]
  1133. 135.92 s > field value
  1134. 135.92 s > span warm_up{integrand.name=se1l_mur_shifted}
  1135. 135.92 s > [2026-08-28 17:33:30.786] @process::amplitude WARNING : External state 0 ('g', PDG 21, helicity +) is off shell: p^2 = +2.5e5, expected m^2 = +0e0 (|Δ| = +2.5e5). Fixed-helicity spinor/vector/tensor external states may be ill-defined at this kinematic point.
  1136. 135.92 s > field value
  1137. 135.92 s > span warm_up{integrand.name=se1l}
  1138. 135.92 s > [2026-08-28 17:33:30.786] @process::amplitude WARNING : External state 1 ('g', PDG 21, helicity -) is off shell: p^2 = +2.5e5, expected m^2 = +0e0 (|Δ| = +2.5e5). Fixed-helicity spinor/vector/tensor external states may be ill-defined at this kinematic point.
  1139. 135.92 s > field value
  1140. 135.92 s > span warm_up{integrand.name=se1l}
  1141. 135.92 s > [2026-08-28 17:33:30.786] @process::amplitude INFO : Input is above threshold: 1 existing threshold E-surfaces across 1/1 graph groups
  1142. 135.92 s > field value
  1143. 135.92 s > existing_esurfaces 1
  1144. 135.92 s > group_count 1
  1145. 135.92 s > groups_above_threshold 1
  1146. 135.92 s > integrand se1l
  1147. 135.92 s > span warm_up{integrand.name=se1l}
  1148. 135.92 s > threshold_status above threshold
  1149. 135.92 s > [2026-08-28 17:33:30.786] @process::amplitude INFO : overlap structure of group 0: [1: [0(2,3)]]
  1150. 135.92 s > field value
  1151. 135.92 s > span warm_up{integrand.name=se1l}
  1152. 135.92 s > [2026-08-28 17:33:30.789] @process::amplitude WARNING : External state 0 ('g', PDG 21, helicity +) is off shell: p^2 = +2.5e5, expected m^2 = +0e0 (|Δ| = +2.5e5). Fixed-helicity spinor/vector/tensor external states may be ill-defined at this kinematic point.
  1153. 135.92 s > field value
  1154. 135.92 s > span warm_up{integrand.name=se1l_mur_shifted}
  1155. 135.92 s > [2026-08-28 17:33:30.789] @process::amplitude WARNING : External state 1 ('g', PDG 21, helicity -) is off shell: p^2 = +2.5e5, expected m^2 = +0e0 (|Δ| = +2.5e5). Fixed-helicity spinor/vector/tensor external states may be ill-defined at this kinematic point.
  1156. 135.92 s > field value
  1157. 135.92 s > span warm_up{integrand.name=se1l_mur_shifted}
  1158. 135.92 s > [2026-08-28 17:33:30.790] @process::amplitude INFO : Input is above threshold: 1 existing threshold E-surfaces across 1/1 graph groups
  1159. 135.93 s > field value
  1160. 135.93 s > existing_esurfaces 1
  1161. 135.93 s > group_count 1
  1162. 135.93 s > groups_above_threshold 1
  1163. 135.93 s > integrand se1l_mur_shifted
  1164. 135.93 s > span warm_up{integrand.name=se1l_mur_shifted}
  1165. 135.93 s > threshold_status above threshold
  1166. 135.93 s > [2026-08-28 17:33:30.790] @process::amplitude INFO : overlap structure of group 0: [1: [0(2,3)]]
  1167. 135.93 s > field value
  1168. 135.93 s > span warm_up{integrand.name=se1l_mur_shifted}
  1169. 135.93 s > [2026-08-28 17:33:30.793] @process::amplitude WARNING : External state 0 ('g', PDG 21, helicity +) is off shell: p^2 = +2.5e5, expected m^2 = +0e0 (|Δ| = +2.5e5). Fixed-helicity spinor/vector/tensor external states may be ill-defined at this kinematic point.
  1170. 135.93 s > field value
  1171. 135.93 s > span warm_up{integrand.name=se1l}
  1172. 135.93 s > [2026-08-28 17:33:30.793] @process::amplitude WARNING : External state 1 ('g', PDG 21, helicity -) is off shell: p^2 = +2.5e5, expected m^2 = +0e0 (|Δ| = +2.5e5). Fixed-helicity spinor/vector/tensor external states may be ill-defined at this kinematic point.
  1173. 135.93 s > field value
  1174. 135.93 s > span warm_up{integrand.name=se1l}
  1175. 135.93 s > [2026-08-28 17:33:30.793] @process::amplitude INFO : Input is above threshold: 1 existing threshold E-surfaces across 1/1 graph groups
  1176. 135.93 s > field value
  1177. 135.93 s > existing_esurfaces 1
  1178. 135.93 s > group_count 1
  1179. 135.93 s > groups_above_threshold 1
  1180. 135.93 s > integrand se1l
  1181. 135.93 s > span warm_up{integrand.name=se1l}
  1182. 135.93 s > threshold_status above threshold
  1183. 135.93 s > [2026-08-28 17:33:30.793] @process::amplitude INFO : overlap structure of group 0: [1: [0(2,3)]]
  1184. 135.93 s > field value
  1185. 135.93 s > span warm_up{integrand.name=se1l}
  1186. 135.93 s > [2026-08-28 17:33:30.797] @process::amplitude WARNING : External state 0 ('g', PDG 21, helicity +) is off shell: p^2 = +2.5e5, expected m^2 = +0e0 (|Δ| = +2.5e5). Fixed-helicity spinor/vector/tensor external states may be ill-defined at this kinematic point.
  1187. 135.93 s > field value
  1188. 135.93 s > span warm_up{integrand.name=se1l_mur_shifted}
  1189. 135.93 s > [2026-08-28 17:33:30.797] @process::amplitude WARNING : External state 1 ('g', PDG 21, helicity -) is off shell: p^2 = +2.5e5, expected m^2 = +0e0 (|Δ| = +2.5e5). Fixed-helicity spinor/vector/tensor external states may be ill-defined at this kinematic point.
  1190. 135.93 s > field value
  1191. 135.93 s > span warm_up{integrand.name=se1l_mur_shifted}
  1192. 135.93 s > [2026-08-28 17:33:30.797] @process::amplitude INFO : Input is above threshold: 1 existing threshold E-surfaces across 1/1 graph groups
  1193. 135.93 s > field value
  1194. 135.93 s > existing_esurfaces 1
  1195. 135.93 s > group_count 1
  1196. 135.93 s > groups_above_threshold 1
  1197. 135.93 s > integrand se1l_mur_shifted
  1198. 135.93 s > span warm_up{integrand.name=se1l_mur_shifted}
  1199. 135.93 s > threshold_status above threshold
  1200. 135.93 s > [2026-08-28 17:33:30.797] @process::amplitude INFO : overlap structure of group 0: [1: [0(2,3)]]
  1201. 135.93 s > field value
  1202. 135.93 s > span warm_up{integrand.name=se1l_mur_shifted}
  1203. 135.93 s > [2026-08-28 17:33:30.800] @process::amplitude WARNING : External state 0 ('g', PDG 21, helicity +) is off shell: p^2 = +2.5e5, expected m^2 = +0e0 (|Δ| = +2.5e5). Fixed-helicity spinor/vector/tensor external states may be ill-defined at this kinematic point.
  1204. 135.93 s > field value
  1205. 135.93 s > span warm_up{integrand.name=se1l}
  1206. 135.93 s > [2026-08-28 17:33:30.801] @process::amplitude WARNING : External state 1 ('g', PDG 21, helicity -) is off shell: p^2 = +2.5e5, expected m^2 = +0e0 (|Δ| = +2.5e5). Fixed-helicity spinor/vector/tensor external states may be ill-defined at this kinematic point.
  1207. 135.93 s > field value
  1208. 135.93 s > span warm_up{integrand.name=se1l}
  1209. 135.93 s > [2026-08-28 17:33:30.801] @process::amplitude INFO : Input is above threshold: 1 existing threshold E-surfaces across 1/1 graph groups
  1210. 135.93 s > field value
  1211. 135.93 s > existing_esurfaces 1
  1212. 135.93 s > group_count 1
  1213. 135.93 s > groups_above_threshold 1
  1214. 135.93 s > integrand se1l
  1215. 135.93 s > span warm_up{integrand.name=se1l}
  1216. 135.93 s > threshold_status above threshold
  1217. 135.93 s > [2026-08-28 17:33:30.801] @process::amplitude INFO : overlap structure of group 0: [1: [0(2,3)]]
  1218. 135.93 s > field value
  1219. 135.93 s > span warm_up{integrand.name=se1l}
  1220. 135.93 s > [2026-08-28 17:33:30.804] @process::amplitude WARNING : External state 0 ('g', PDG 21, helicity +) is off shell: p^2 = +2.5e5, expected m^2 = +0e0 (|Δ| = +2.5e5). Fixed-helicity spinor/vector/tensor external states may be ill-defined at this kinematic point.
  1221. 135.93 s > field value
  1222. 135.93 s > span warm_up{integrand.name=se1l_mur_shifted}
  1223. 135.93 s > [2026-08-28 17:33:30.804] @process::amplitude WARNING : External state 1 ('g', PDG 21, helicity -) is off shell: p^2 = +2.5e5, expected m^2 = +0e0 (|Δ| = +2.5e5). Fixed-helicity spinor/vector/tensor external states may be ill-defined at this kinematic point.
  1224. 135.93 s > field value
  1225. 135.93 s > span warm_up{integrand.name=se1l_mur_shifted}
  1226. 135.93 s > [2026-08-28 17:33:30.804] @process::amplitude INFO : Input is above threshold: 1 existing threshold E-surfaces across 1/1 graph groups
  1227. 135.93 s > field value
  1228. 135.93 s > existing_esurfaces 1
  1229. 135.93 s > group_count 1
  1230. 135.93 s > groups_above_threshold 1
  1231. 135.93 s > integrand se1l_mur_shifted
  1232. 135.93 s > span warm_up{integrand.name=se1l_mur_shifted}
  1233. 135.93 s > threshold_status above threshold
  1234. 135.93 s > [2026-08-28 17:33:30.804] @process::amplitude INFO : overlap structure of group 0: [1: [0(2,3)]]
  1235. 135.93 s > field value
  1236. 135.93 s > span warm_up{integrand.name=se1l_mur_shifted}
  1237. 135.93 s > The application panicked (crashed).
  1238. 135.93 s > Message: Integrated UV case failed: se1l
  1239. 135.93 s > Location: tests/tests/uv.rs:1068
  1240. 135.93 s >
  1241. 135.93 s > ━━━━━━━━━━━━━━━━━━━━━━━━━━━━━━━━━━ BACKTRACE ━━━━━━━━━━━━━━━━━━━━━━━━━━━━━━━━━━━
  1242. 135.93 s > 1: <color_eyre[51793ea62743adbd]::config::PanicHook>::panic_report<unknown>
  1243. 135.93 s > at <unknown source file>:<unknown line>
  1244. 135.93 s > 2: <color_eyre[51793ea62743adbd]::config::PanicHook>::into_panic_hook::{closure#0}<unknown>
  1245. 135.93 s > at <unknown source file>:<unknown line>
  1246. 135.93 s > 3: std[bcb96dfbba0ab899]::panicking::panic_with_hook<unknown>
  1247. 135.93 s > at <unknown source file>:<unknown line>
  1248. 135.93 s > 4: std[bcb96dfbba0ab899]::panicking::panic_handler::{closure#0}<unknown>
  1249. 135.93 s > at <unknown source file>:<unknown line>
  1250. 135.93 s > 5: std[bcb96dfbba0ab899]::sys::backtrace::__rust_end_short_backtrace::<std[bcb96dfbba0ab899]::panicking::panic_handler::{closure#0}, !><unknown>
  1251. 135.93 s > at <unknown source file>:<unknown line>
  1252. 135.93 s > 6: __rustc[6c289b9f9c454d21]::rust_begin_unwind<unknown>
  1253. 135.93 s > at <unknown source file>:<unknown line>
  1254. 135.93 s > 7: core[940e698046960fd5]::panicking::panic_fmt<unknown>
  1255. 135.93 s > at <unknown source file>:<unknown line>
  1256. 135.93 s > 8: uv[52cf2b63f0104e31]::run_single_integrated_uv_case<unknown>
  1257. 135.93 s > at <unknown source file>:<unknown line>
  1258. 135.93 s > 9: <uv[52cf2b63f0104e31]::se1l_uv::{closure#0} as core[940e698046960fd5]::ops::function::FnOnce<()>>::call_once<unknown>
  1259. 135.93 s > at <unknown source file>:<unknown line>
  1260. 135.93 s > 10: test[75d6903177b1d7e9]::__rust_begin_short_backtrace::<core[940e698046960fd5]::result::Result<(), alloc[2ea6bcb46fca0c42]::string::String>, fn() -> core[940e698046960fd5]::result::Result<(), alloc[2ea6bcb46fca0c42]::string::String>><unknown>
  1261. 135.93 s > at <unknown source file>:<unknown line>
  1262. 135.93 s > 11: test[75d6903177b1d7e9]::run_test::{closure#0}<unknown>
  1263. 135.93 s > at <unknown source file>:<unknown line>
  1264. 135.93 s > 12: std[bcb96dfbba0ab899]::sys::backtrace::__rust_begin_short_backtrace::<test[75d6903177b1d7e9]::run_test::{closure#1}, ()><unknown>
  1265. 135.93 s > at <unknown source file>:<unknown line>
  1266. 135.93 s > 13: <std[bcb96dfbba0ab899]::thread::lifecycle::spawn_unchecked<test[75d6903177b1d7e9]::run_test::{closure#1}, ()>::{closure#1} as core[940e698046960fd5]::ops::function::FnOnce<()>>::call_once::{shim:vtable#0}<unknown>
  1267. 135.93 s > at <unknown source file>:<unknown line>
  1268. 135.93 s > 14: <std[bcb96dfbba0ab899]::sys::thread::unix::Thread>::new::thread_start<unknown>
  1269. 135.93 s > at <unknown source file>:<unknown line>
  1270. 135.93 s > 15: start_thread<unknown>
  1271. 135.93 s > at <unknown source file>:<unknown line>
  1272. 135.93 s > 16: __clone3<unknown>
  1273. 135.93 s > at <unknown source file>:<unknown line>
  1274. 135.93 s >
  1275. 135.93 s > Run with COLORBT_SHOW_HIDDEN=1 environment variable to disable frame filtering.
  1276. 135.93 s > Run with RUST_BACKTRACE=full to include source snippets.
  1277. 135.93 s >
  1278. 135.93 s > error: test run failed
  1279. 135.93 s >
  1280. 135.93 s > ========== nextest test summary ==========
  1281. 135.93 s > report: target/nextest/ci_gammaloop/junit.xml
  1282. 135.93 s > tests: 106, failures: 9, errors: 0
  1283. 135.93 s >
  1284. 135.93 s > 1. gammaloop-integration-tests::test_runs::approach::approach_momentum_space_reports_incomplete_triplet_cleanly
  1285. 135.93 s > failure: test failure with exit code 101
  1286. 135.93 s > system-out
  1287. 135.93 s > running 1 test
  1288. 135.93 s > test approach::approach_momentum_space_reports_incomplete_triplet_cleanly ... FAILED
  1289. 135.93 s >
  1290. 135.93 s > failures:
  1291. 135.93 s >
  1292. 135.93 s > failures:
  1293. 135.93 s > approach::approach_momentum_space_reports_incomplete_triplet_cleanly
  1294. 135.93 s >
  1295. 135.93 s > test result: FAILED. 0 passed; 1 failed; 0 ignored; 0 measured; 82 filtered out; finished in 1.16s
  1296. 135.93 s > system-err
  1297. 135.93 s > [2026-08-28 17:31:32.413] @gammaloop_api::se... INFO : Running command import model scalars-default.json
  1298. 135.93 s > [2026-08-28 17:31:32.413] @import::model INFO : Loading built-in JSON model scalars-default
  1299. 135.93 s > [2026-08-28 17:31:32.416] @gammalooprs::model INFO : The following 2 external parameters were forced to zero by the restriction card:
  1300. 135.93 s > width_scalar_1, width_scalar_2
  1301. 135.93 s > [2026-08-28 17:31:32.417] @gammaloop_api::se... INFO : Running command remove processes
  1302. 135.93 s > [2026-08-28 17:31:32.418] @gammaloop_api::se... INFO : Running command generate amp scalar_1 > scalar_0 scalar_0 [{1}] --allowed-vertex-interactions V_3_SCALAR_022 V_3_SCALAR_122 -p triangle -i scalar_tri
  1303. 135.93 s > [2026-08-28 17:31:32.419] @feyngen::diagram_... INFO : 0s | Δ=0s | Starting Feynman graph generation with Symbolica...
  1304. 135.93 s > [2026-08-28 17:31:32.419] @feyngen::diagram_... INFO : 0s | Δ=0s | Number of graphs resulting from Symbolica generation: 1
  1305. 135.93 s > [2026-08-28 17:31:32.419] @feyngen::diagram_... INFO : 0s | Δ=0s | Number of graphs retained after removal of vetoed topologies: 1
  1306. 135.93 s > [2026-08-28 17:31:32.420] @feyngen::diagram_... INFO : 0s | Δ=0s | Number of graphs after vertex info assignment: 1
  1307. 135.93 s > [2026-08-28 17:31:32.420] @feyngen::diagram_... INFO : 0s | Δ=0s | Number of graphs after all complete graphs filters are applied: 1
  1308. 135.93 s > [2026-08-28 17:31:32.420] @feyngen::diagram_... INFO : 0s | Δ=0s | Number of graphs after closed fermion chains analysis: 1
  1309. 135.93 s > [2026-08-28 17:31:32.420] @feyngen::diagram_... INFO : 0s | Δ=0s | Number of graphs after symmetrization of external states: 1
  1310. 135.93 s > [2026-08-28 17:31:32.420] @feyngen::diagram_... INFO : 0s | Δ=0s | Number of graphs after canonization of vertices, edges and flows (graph labels assigned here): 1
  1311. 135.93 s > [2026-08-28 17:31:32.425] @feyngen::diagram_... INFO : 0s | Δ=0s | Number of graphs after numerator-aware grouping with strategy 'up to a scalar rescaling': 1 (1 isomorphically unique graph, 0 color zero, 0 lorentz zero, 0 grouped and 0 cancellation)
  1312. 135.93 s > [2026-08-28 17:31:32.426] @feyngen::diagram_... INFO : ( Sum of the symmetry factors from each graph generated = 1 )
  1313. 135.93 s > [2026-08-28 17:31:32.426] @commands::generate INFO : Generated amplitude 1 graphs.
  1314. 135.93 s > [2026-08-28 17:31:32.452] @settings::runtime WARNING : No external kinematics were provided; using default-generated external momenta and helicities.
  1315. 135.93 s > [2026-08-28 17:31:32.559] @commands::generate INFO :
  1316. 135.93 s > Integrand generation summary
  1317. 135.93 s > peak RAM 65.25 MiB | cores 1
  1318. 135.93 s > ╭────────────┬───────┬─────────┬────────────┬────────────┬────────────────┬─────────────╮
  1319. 135.93 s > │ integrand │ graph │ # evals │ expr build │ spenso │ symbolica eval │ compile │
  1320. 135.93 s > ├────────────┼───────┼─────────┼────────────┼────────────┼────────────────┼─────────────┤
  1321. 135.93 s > │ scalar_tri │ GL0 │ 9 │ 15ms (65%) │ 1ms (8.4%) │ 6ms (26%) │ 0ms (0.00%) │
  1322. 135.93 s > ├────────────┼───────┼─────────┼────────────┼────────────┼────────────────┼─────────────┤
  1323. 135.93 s > │ Total │ │ 9 │ 15ms (65%) │ 1ms (8.4%) │ 6ms (26%) │ 0ms (0.00%) │
  1324. 135.93 s > ╰────────────┴───────┴─────────┴────────────┴────────────┴────────────────┴─────────────╯
  1325. 135.93 s > [2026-08-28 17:31:32.560] @gammaloop_api::se... INFO : Running command generate amp scalar_0 scalar_0 > scalar_0 scalar_0 [{1}] --allowed-vertex-interactions V_3_SCALAR_022 -p box -i scalar_box --select-graphs GL0
  1326. 135.93 s > [2026-08-28 17:31:32.561] @feyngen::diagram_... INFO : 0s | Δ=0s | Starting Feynman graph generation with Symbolica...
  1327. 135.93 s > [2026-08-28 17:31:32.561] @feyngen::diagram_... INFO : 0s | Δ=0s | Number of graphs resulting from Symbolica generation: 3
  1328. 135.93 s > [2026-08-28 17:31:32.564] @feyngen::diagram_... INFO : 0s | Δ=0s | Number of graphs retained after removal of vetoed topologies: 3
  1329. 135.93 s > [2026-08-28 17:31:32.568] @feyngen::diagram_... INFO : 0s | Δ=0s | Number of graphs after vertex info assignment: 3
  1330. 135.93 s > [2026-08-28 17:31:32.568] @feyngen::diagram_... INFO : 0s | Δ=0s | Number of graphs after all complete graphs filters are applied: 3
  1331. 135.93 s > [2026-08-28 17:31:32.573] @feyngen::diagram_... INFO : 0s | Δ=0s | Number of graphs after closed fermion chains analysis: 3
  1332. 135.93 s > [2026-08-28 17:31:32.573] @feyngen::diagram_... INFO : 0s | Δ=0s | Number of graphs after symmetrization of external states: 3
  1333. 135.93 s > [2026-08-28 17:31:32.578] @feyngen::diagram_... INFO : 0s | Δ=0s | Number of graphs after canonization of vertices, edges and flows (graph labels assigned here): 3
  1334. 135.93 s > [2026-08-28 17:31:32.641] @feyngen::diagram_... INFO : 0s | Δ=0s | Number of graphs after numerator-aware grouping with strategy 'up to a scalar rescaling': 1 (1 isomorphically unique graph, 0 color zero, 0 lorentz zero, 0 grouped and 0 cancellation)
  1335. 135.93 s > [2026-08-28 17:31:32.641] @feyngen::diagram_... INFO : ( Sum of the symmetry factors from each graph generated = 1 )
  1336. 135.93 s > [2026-08-28 17:31:32.641] @commands::generate INFO : Generated amplitude 1 graphs.
  1337. 135.93 s > [2026-08-28 17:31:32.937] @settings::runtime WARNING : No external kinematics were provided; using default-generated external momenta and helicities.
  1338. 135.93 s > [2026-08-28 17:31:32.995] @commands::generate INFO :
  1339. 135.93 s > Integrand generation summary
  1340. 135.93 s > peak RAM 69.06 MiB | cores 1
  1341. 135.93 s > ╭────────────┬───────┬─────────┬─────────────┬─────────────┬────────────────┬─────────────╮
  1342. 135.93 s > │ integrand │ graph │ # evals │ expr build │ spenso │ symbolica eval │ compile │
  1343. 135.93 s > ├────────────┼───────┼─────────┼─────────────┼─────────────┼────────────────┼─────────────┤
  1344. 135.93 s > │ scalar_box │ GL0 │ 13 │ 159ms (56%) │ 28ms (9.9%) │ 98ms (34%) │ 0ms (0.00%) │
  1345. 135.93 s > ├────────────┼───────┼─────────┼─────────────┼─────────────┼────────────────┼─────────────┤
  1346. 135.93 s > │ Total │ │ 13 │ 159ms (56%) │ 28ms (9.9%) │ 98ms (34%) │ 0ms (0.00%) │
  1347. 135.93 s > ╰────────────┴───────┴─────────┴─────────────┴─────────────┴────────────────┴─────────────╯
  1348. 135.93 s > [2026-08-28 17:31:32.996] @gammaloop_api::se... INFO : Running command generate
  1349. 135.93 s > [2026-08-28 17:31:33.127] @settings::runtime WARNING : No external kinematics were provided; using default-generated external momenta and helicities.
  1350. 135.93 s > [2026-08-28 17:31:33.161] @settings::runtime WARNING : No external kinematics were provided; using default-generated external momenta and helicities.
  1351. 135.93 s > [2026-08-28 17:31:33.210] @commands::generate INFO :
  1352. 135.93 s > Integrand generation summary
  1353. 135.93 s > peak RAM 70.14 MiB | cores 1
  1354. 135.93 s > ╭────────────┬───────┬─────────┬─────────────┬────────────┬────────────────┬─────────────╮
  1355. 135.93 s > │ integrand │ graph │ # evals │ expr build │ spenso │ symbolica eval │ compile │
  1356. 135.93 s > ├────────────┼───────┼─────────┼─────────────┼────────────┼────────────────┼─────────────┤
  1357. 135.93 s > │ scalar_tri │ GL0 │ 9 │ 17ms (69%) │ 1ms (7.0%) │ 5ms (24%) │ 0ms (0.00%) │
  1358. 135.93 s > │ scalar_box │ GL0 │ 13 │ 103ms (76%) │ 7ms (5.2%) │ 25ms (19%) │ 0ms (0.00%) │
  1359. 135.93 s > ├────────────┼───────┼─────────┼─────────────┼────────────┼────────────────┼─────────────┤
  1360. 135.93 s > │ Total │ │ 22 │ 120ms (75%) │ 8ms (5.4%) │ 31ms (20%) │ 0ms (0.00%) │
  1361. 135.93 s > ╰────────────┴───────┴─────────┴─────────────┴────────────┴────────────────┴─────────────╯
  1362. 135.93 s > [2026-08-28 17:31:33.210] @gammaloop_api::se... INFO : Running command set model mass_scalar_2=2.0
  1363. 135.93 s > [2026-08-28 17:31:33.214] @gammaloop_api::se... INFO : Running command set model mass_scalar_1=1.0
  1364. 135.93 s > [2026-08-28 17:31:33.214] @gammaloop_api::se... INFO : Running command set process -p triangle -i scalar_tri string '
  1365. 135.93 s > [kinematics.externals]
  1366. 135.93 s > type = "constant"
  1367. 135.93 s >
  1368. 135.93 s > [kinematics.externals.data]
  1369. 135.93 s > [...]
  1370. 135.93 s > [2026-08-28 17:31:33.231] @gammaloop_api::se... INFO : Running command set process -p box -i scalar_box string '
  1371. 135.93 s > [kinematics.externals]
  1372. 135.93 s > type = "constant"
  1373. 135.93 s >
  1374. 135.93 s > [kinematics.externals.data]
  1375. 135.93 s > [...]
  1376. 135.93 s > [2026-08-28 17:31:33.239] @gammaloop_api::se... INFO : Running command approach -x 1.0000000000000001e-1,2.0000000000000001e-1,2.9999999999999999e-1,4.0000000000000002e-1 --approach-axis 1.0000000000000000e-3,0.0000000000000000e0,0.0000000000000000e0,0.0000000000000000e0 --n-points 1 --n-cores 1 --output-results /build/source/tests/artifacts/scalar_box_invalid_momentum_approach/approach_momentum.json --momentum-space --graph-id 0
  1377. 135.93 s > The application panicked (crashed).
  1378. 135.93 s > Message: There are 2 processes available. Please specify a process.
  1379. 135.93 s > Location: tests/tests/test_runs/approach.rs:332
  1380. 135.93 s >
  1381. 135.93 s > ━━━━━━━━━━━━━━━━━━━━━━━━━━━━━━━━━━ BACKTRACE ━━━━━━━━━━━━━━━━━━━━━━━━━━━━━━━━━━━
  1382. 135.93 s > 1: <color_eyre[51793ea62743adbd]::config::PanicHook>::panic_report<unknown>
  1383. 135.93 s > at <unknown source file>:<unknown line>
  1384. 135.93 s > 2: <color_eyre[51793ea62743adbd]::config::PanicHook>::into_panic_hook::{closure#0}<unknown>
  1385. 135.93 s > at <unknown source file>:<unknown line>
  1386. 135.93 s > 3: std[bcb96dfbba0ab899]::panicking::panic_with_hook<unknown>
  1387. 135.93 s > at <unknown source file>:<unknown line>
  1388. 135.93 s > 4: std[bcb96dfbba0ab899]::panicking::panic_handler::{closure#0}<unknown>
  1389. 135.93 s > at <unknown source file>:<unknown line>
  1390. 135.93 s > 5: std[bcb96dfbba0ab899]::sys::backtrace::__rust_end_short_backtrace::<std[bcb96dfbba0ab899]::panicking::panic_handler::{closure#0}, !><unknown>
  1391. 135.93 s > at <unknown source file>:<unknown line>
  1392. 135.93 s > 6: __rustc[6c289b9f9c454d21]::rust_begin_unwind<unknown>
  1393. 135.93 s > at <unknown source file>:<unknown line>
  1394. 135.93 s > 7: core[940e698046960fd5]::panicking::panic_fmt<unknown>
  1395. 135.93 s > at <unknown source file>:<unknown line>
  1396. 135.93 s > 8: test_runs[3e7a390caee4e338]::approach::approach_momentum_space_reports_incomplete_triplet_cleanly<unknown>
  1397. 135.93 s > at <unknown source file>:<unknown line>
  1398. 135.93 s > 9: <test_runs[3e7a390caee4e338]::approach::approach_momentum_space_reports_incomplete_triplet_cleanly::{closure#0} as core[940e698046960fd5]::ops::function::FnOnce<()>>::call_once<unknown>
  1399. 135.93 s > at <unknown source file>:<unknown line>
  1400. 135.93 s > 10: test[75d6903177b1d7e9]::__rust_begin_short_backtrace::<core[940e698046960fd5]::result::Result<(), alloc[2ea6bcb46fca0c42]::string::String>, fn() -> core[940e698046960fd5]::result::Result<(), alloc[2ea6bcb46fca0c42]::string::String>><unknown>
  1401. 135.93 s > at <unknown source file>:<unknown line>
  1402. 135.93 s > 11: test[75d6903177b1d7e9]::run_test::{closure#0}<unknown>
  1403. 135.93 s > at <unknown source file>:<unknown line>
  1404. 135.93 s > 12: std[bcb96dfbba0ab899]::sys::backtrace::__rust_begin_short_backtrace::<test[75d6903177b1d7e9]::run_test::{closure#1}, ()><unknown>
  1405. 135.93 s > at <unknown source file>:<unknown line>
  1406. 135.93 s > 13: <std[bcb96dfbba0ab899]::thread::lifecycle::spawn_unchecked<test[75d6903177b1d7e9]::run_test::{closure#1}, ()>::{closure#1} as core[940e698046960fd5]::ops::function::FnOnce<()>>::call_once::{shim:vtable#0}<unknown>
  1407. 135.93 s > at <unknown source file>:<unknown line>
  1408. 135.93 s > 14: <std[bcb96dfbba0ab899]::sys::thread::unix::Thread>::new::thread_start<unknown>
  1409. 135.93 s > at <unknown source file>:<unknown line>
  1410. 135.93 s > 15: start_thread<unknown>
  1411. 135.93 s > at <unknown source file>:<unknown line>
  1412. 135.93 s > 16: __clone3<unknown>
  1413. 135.93 s > at <unknown source file>:<unknown line>
  1414. 135.93 s >
  1415. 135.93 s > Run with COLORBT_SHOW_HIDDEN=1 environment variable to disable frame filtering.
  1416. 135.93 s > ... omitted 1 more lines; see full nextest output above
  1417. 135.93 s >
  1418. 135.93 s > 2. gammaloop-integration-tests::test_runs::profile_bulk::dotted_bubble_amp_bulk_profile_passes
  1419. 135.93 s > failure: test failure with exit code 101
  1420. 135.93 s > Error:
  1421. 135.93 s > 0: IR profiling requested arbitrary precision but received a quad-precision result
  1422. 135.93 s >
  1423. 135.93 s > Location:
  1424. 135.93 s > crates/gammalooprs/src/integrands/process/ir.rs:2123
  1425. 135.93 s >
  1426. 135.93 s > ━━━━━━━━━━━━━━━━━━━━━━━━━━━━━━━━━━ BACKTRACE ━━━━━━━━━━━━━━━━━━━━━━━━━━━━━━━━━━━
  1427. 135.93 s > 1: <color_eyre[51793ea62743adbd]::config::EyreHook>::into_eyre_hook::{closure#0}<unknown>
  1428. 135.93 s > at <unknown source file>:<unknown line>
  1429. 135.93 s > 2: eyre[cb2fd339c0c40fca]::capture_handler<unknown>
  1430. 135.93 s > at <unknown source file>:<unknown line>
  1431. 135.93 s > 3: eyre[cb2fd339c0c40fca]::private::format_err<unknown>
  1432. 135.93 s > at <unknown source file>:<unknown line>
  1433. 135.93 s > 4: gammalooprs[d7a7c067ebd19583]::integrands::process::ir::evaluate_profile_momentum_point_arb::<gammalooprs[d7a7c067ebd19583]::integrands::process::amplitude::AmplitudeIntegrand><unknown>
  1434. 135.93 s > at <unknown source file>:<unknown line>
  1435. 135.93 s > 5: <gammalooprs[d7a7c067ebd19583]::integrands::process::amplitude::AmplitudeIntegrand>::test_single_ir_limit_impl<unknown>
  1436. 135.93 s > at <unknown source file>:<unknown line>
  1437. 135.93 s > 6: gammalooprs[d7a7c067ebd19583]::integrands::process::ir::run_ir_profile::<gammalooprs[d7a7c067ebd19583]::integrands::process::amplitude::AmplitudeIntegrand, <gammalooprs[d7a7c067ebd19583]::integrands::process::amplitude::AmplitudeIntegrand>::enumerate_ir_limits, <gammalooprs[d7a7c067ebd19583]::integrands::process::amplitude::AmplitudeIntegrand>::graph_cut_definitions, <gammalooprs[d7a7c067ebd19583]::integrands::process::amplitude::AmplitudeIntegrand>::test_single_ir_limit_impl><unknown>
  1438. 135.93 s > at <unknown source file>:<unknown line>
  1439. 135.93 s > 7: <gammalooprs[d7a7c067ebd19583]::integrands::process::amplitude::AmplitudeIntegrand>::test_ir<unknown>
  1440. 135.93 s > at <unknown source file>:<unknown line>
  1441. 135.93 s > 8: <gammaloop_api[92ae732909e47e14]::commands::profile::Profile>::run<unknown>
  1442. 135.93 s > at <unknown source file>:<unknown line>
  1443. 135.93 s > 9: test_runs[3e7a390caee4e338]::profile_bulk::dotted_bubble_amp_bulk_profile_passes<unknown>
  1444. 135.93 s > at <unknown source file>:<unknown line>
  1445. 135.93 s > 10: <test_runs[3e7a390caee4e338]::profile_bulk::dotted_bubble_amp_bulk_profile_passes::{closure#0} as core[940e698046960fd5]::ops::function::FnOnce<()>>::call_once<unknown>
  1446. 135.93 s > at <unknown source file>:<unknown line>
  1447. 135.93 s > 11: test[75d6903177b1d7e9]::__rust_begin_short_backtrace::<core[940e698046960fd5]::result::Result<(), alloc[2ea6bcb46fca0c42]::string::String>, fn() -> core[940e698046960fd5]::result::Result<(), alloc[2ea6bcb46fca0c42]::string::String>><unknown>
  1448. 135.93 s > at <unknown source file>:<unknown line>
  1449. 135.93 s > 12: test[75d6903177b1d7e9]::run_test::{closure#0}<unknown>
  1450. 135.93 s > at <unknown source file>:<unknown line>
  1451. 135.93 s > 13: std[bcb96dfbba0ab899]::sys::backtrace::__rust_begin_short_backtrace::<test[75d6903177b1d7e9]::run_test::{closure#1}, ()><unknown>
  1452. 135.93 s > at <unknown source file>:<unknown line>
  1453. 135.93 s > 14: <std[bcb96dfbba0ab899]::thread::lifecycle::spawn_unchecked<test[75d6903177b1d7e9]::run_test::{closure#1}, ()>::{closure#1} as core[940e698046960fd5]::ops::function::FnOnce<()>>::call_once::{shim:vtable#0}<unknown>
  1454. 135.93 s > at <unknown source file>:<unknown line>
  1455. 135.93 s > 15: <std[bcb96dfbba0ab899]::sys::thread::unix::Thread>::new::thread_start<unknown>
  1456. 135.93 s > at <unknown source file>:<unknown line>
  1457. 135.93 s > 16: start_thread<unknown>
  1458. 135.93 s > at <unknown source file>:<unknown line>
  1459. 135.93 s > 17: __clone3<unknown>
  1460. 135.93 s > at <unknown source file>:<unknown line>
  1461. 135.93 s >
  1462. 135.93 s > Run with COLORBT_SHOW_HIDDEN=1 environment variable to disable frame filtering.
  1463. 135.93 s > Run with RUST_BACKTRACE=full to include source snippets.
  1464. 135.93 s > Warning: SpanTrace capture is Unsupported.
  1465. 135.93 s > Ensure that you've setup a tracing-error ErrorLayer and the semver versions are compatible
  1466. 135.93 s > system-out
  1467. 135.93 s > running 1 test
  1468. 135.93 s > test profile_bulk::dotted_bubble_amp_bulk_profile_passes ... FAILED
  1469. 135.93 s >
  1470. 135.93 s > failures:
  1471. 135.93 s >
  1472. 135.93 s > failures:
  1473. 135.93 s > profile_bulk::dotted_bubble_amp_bulk_profile_passes
  1474. 135.93 s >
  1475. 135.93 s > test result: FAILED. 0 passed; 1 failed; 0 ignored; 0 measured; 82 filtered out; finished in 0.42s
  1476. 135.93 s > system-err
  1477. 135.93 s > [2026-08-28 17:31:35.048] @gammaloop_api::se... INFO : Running command import model ./assets/models/json/scalars/scalars_2p_3p.json
  1478. 135.93 s > [2026-08-28 17:31:35.048] @import::model INFO : Loading JSON model scalars_2p_3p-default from /build/source/assets/models/json/scalars/scalars_2p_3p
  1479. 135.93 s > [2026-08-28 17:31:35.050] @gammaloop_api::se... INFO : Running command import graphs ./tests/resources/graphs/dotted_bubble_amp.dot
  1480. 135.93 s > [2026-08-28 17:31:35.050] @commands::import INFO : Loading graphs from '/build/source/tests/resources/graphs/dotted_bubble_amp.dot'
  1481. 135.93 s > [2026-08-28 17:31:35.056] @gammaloop_api::se... INFO : Running command generate
  1482. 135.93 s > [2026-08-28 17:31:35.191] @commands::generate INFO :
  1483. 135.93 s > Integrand generation summary
  1484. 135.93 s > peak RAM 66.07 MiB | cores 1
  1485. 135.93 s > ╭───────────┬───────────────────┬─────────┬────────────┬────────────┬────────────────┬─────────────╮
  1486. 135.93 s > │ integrand │ graph │ # evals │ expr build │ spenso │ symbolica eval │ compile │
  1487. 135.93 s > ├───────────┼───────────────────┼─────────┼────────────┼────────────┼────────────────┼─────────────┤
  1488. 135.93 s > │ default │ dotted_bubble_amp │ 8 │ 25ms (67%) │ 1ms (3.3%) │ 11ms (29%) │ 0ms (0.00%) │
  1489. 135.93 s > ├───────────┼───────────────────┼─────────┼────────────┼────────────┼────────────────┼─────────────┤
  1490. 135.93 s > │ Total │ │ 8 │ 25ms (67%) │ 1ms (3.3%) │ 11ms (29%) │ 0ms (0.00%) │
  1491. 135.93 s > ╰───────────┴───────────────────┴─────────┴────────────┴────────────┴────────────────┴─────────────╯
  1492. 135.93 s > [2026-08-28 17:31:35.192] @process::amplitude INFO : Input is above threshold: 1 existing threshold E-surfaces across 1/1 graph groups
  1493. 135.93 s > [2026-08-28 17:31:35.192] @process::amplitude INFO : overlap structure of group 0: [1: [1(1,3)]]
  1494. 135.93 s > Error:
  1495. 135.93 s > 0: IR profiling requested arbitrary precision but received a quad-precision result
  1496. 135.93 s >
  1497. 135.93 s > Location:
  1498. 135.93 s > crates/gammalooprs/src/integrands/process/ir.rs:2123
  1499. 135.93 s >
  1500. 135.93 s > ━━━━━━━━━━━━━━━━━━━━━━━━━━━━━━━━━━ BACKTRACE ━━━━━━━━━━━━━━━━━━━━━━━━━━━━━━━━━━━
  1501. 135.93 s > 1: <color_eyre[51793ea62743adbd]::config::EyreHook>::into_eyre_hook::{closure#0}<unknown>
  1502. 135.93 s > at <unknown source file>:<unknown line>
  1503. 135.93 s > 2: eyre[cb2fd339c0c40fca]::capture_handler<unknown>
  1504. 135.93 s > at <unknown source file>:<unknown line>
  1505. 135.93 s > 3: eyre[cb2fd339c0c40fca]::private::format_err<unknown>
  1506. 135.93 s > at <unknown source file>:<unknown line>
  1507. 135.93 s > 4: gammalooprs[d7a7c067ebd19583]::integrands::process::ir::evaluate_profile_momentum_point_arb::<gammalooprs[d7a7c067ebd19583]::integrands::process::amplitude::AmplitudeIntegrand><unknown>
  1508. 135.93 s > at <unknown source file>:<unknown line>
  1509. 135.93 s > 5: <gammalooprs[d7a7c067ebd19583]::integrands::process::amplitude::AmplitudeIntegrand>::test_single_ir_limit_impl<unknown>
  1510. 135.93 s > at <unknown source file>:<unknown line>
  1511. 135.93 s > 6: gammalooprs[d7a7c067ebd19583]::integrands::process::ir::run_ir_profile::<gammalooprs[d7a7c067ebd19583]::integrands::process::amplitude::AmplitudeIntegrand, <gammalooprs[d7a7c067ebd19583]::integrands::process::amplitude::AmplitudeIntegrand>::enumerate_ir_limits, <gammalooprs[d7a7c067ebd19583]::integrands::process::amplitude::AmplitudeIntegrand>::graph_cut_definitions, <gammalooprs[d7a7c067ebd19583]::integrands::process::amplitude::AmplitudeIntegrand>::test_single_ir_limit_impl><unknown>
  1512. 135.93 s > at <unknown source file>:<unknown line>
  1513. 135.93 s > 7: <gammalooprs[d7a7c067ebd19583]::integrands::process::amplitude::AmplitudeIntegrand>::test_ir<unknown>
  1514. 135.93 s > at <unknown source file>:<unknown line>
  1515. 135.93 s > 8: <gammaloop_api[92ae732909e47e14]::commands::profile::Profile>::run<unknown>
  1516. 135.93 s > at <unknown source file>:<unknown line>
  1517. 135.93 s > 9: test_runs[3e7a390caee4e338]::profile_bulk::dotted_bubble_amp_bulk_profile_passes<unknown>
  1518. 135.93 s > at <unknown source file>:<unknown line>
  1519. 135.93 s > 10: <test_runs[3e7a390caee4e338]::profile_bulk::dotted_bubble_amp_bulk_profile_passes::{closure#0} as core[940e698046960fd5]::ops::function::FnOnce<()>>::call_once<unknown>
  1520. 135.93 s > at <unknown source file>:<unknown line>
  1521. 135.93 s > 11: test[75d6903177b1d7e9]::__rust_begin_short_backtrace::<core[940e698046960fd5]::result::Result<(), alloc[2ea6bcb46fca0c42]::string::String>, fn() -> core[940e698046960fd5]::result::Result<(), alloc[2ea6bcb46fca0c42]::string::String>><unknown>
  1522. 135.93 s > at <unknown source file>:<unknown line>
  1523. 135.93 s > 12: test[75d6903177b1d7e9]::run_test::{closure#0}<unknown>
  1524. 135.93 s > at <unknown source file>:<unknown line>
  1525. 135.93 s > 13: std[bcb96dfbba0ab899]::sys::backtrace::__rust_begin_short_backtrace::<test[75d6903177b1d7e9]::run_test::{closure#1}, ()><unknown>
  1526. 135.93 s > at <unknown source file>:<unknown line>
  1527. 135.93 s > 14: <std[bcb96dfbba0ab899]::thread::lifecycle::spawn_unchecked<test[75d6903177b1d7e9]::run_test::{closure#1}, ()>::{closure#1} as core[940e698046960fd5]::ops::function::FnOnce<()>>::call_once::{shim:vtable#0}<unknown>
  1528. 135.93 s > at <unknown source file>:<unknown line>
  1529. 135.93 s > 15: <std[bcb96dfbba0ab899]::sys::thread::unix::Thread>::new::thread_start<unknown>
  1530. 135.93 s > at <unknown source file>:<unknown line>
  1531. 135.93 s > 16: start_thread<unknown>
  1532. 135.93 s > at <unknown source file>:<unknown line>
  1533. 135.93 s > 17: __clone3<unknown>
  1534. 135.93 s > at <unknown source file>:<unknown line>
  1535. 135.93 s >
  1536. 135.93 s > Run with COLORBT_SHOW_HIDDEN=1 environment variable to disable frame filtering.
  1537. 135.93 s > Run with RUST_BACKTRACE=full to include source snippets.
  1538. 135.93 s > Warning: SpanTrace capture is Unsupported.
  1539. 135.93 s > Ensure that you've setup a tracing-error ErrorLayer and the semver versions are compatible
  1540. 135.93 s >
  1541. 135.93 s > 3. gammaloop-integration-tests::test_runs::profile_bulk::box_4e_bulk_profile_passes
  1542. 135.93 s > failure: test failure with exit code 101
  1543. 135.93 s > Error:
  1544. 135.93 s > 0: IR profiling requested arbitrary precision but received a quad-precision result
  1545. 135.93 s >
  1546. 135.93 s > Location:
  1547. 135.93 s > crates/gammalooprs/src/integrands/process/ir.rs:2123
  1548. 135.93 s >
  1549. 135.93 s > ━━━━━━━━━━━━━━━━━━━━━━━━━━━━━━━━━━ BACKTRACE ━━━━━━━━━━━━━━━━━━━━━━━━━━━━━━━━━━━
  1550. 135.93 s > 1: <color_eyre[51793ea62743adbd]::config::EyreHook>::into_eyre_hook::{closure#0}<unknown>
  1551. 135.93 s > at <unknown source file>:<unknown line>
  1552. 135.93 s > 2: eyre[cb2fd339c0c40fca]::capture_handler<unknown>
  1553. 135.93 s > at <unknown source file>:<unknown line>
  1554. 135.93 s > 3: eyre[cb2fd339c0c40fca]::private::format_err<unknown>
  1555. 135.93 s > at <unknown source file>:<unknown line>
  1556. 135.93 s > 4: gammalooprs[d7a7c067ebd19583]::integrands::process::ir::evaluate_profile_momentum_point_arb::<gammalooprs[d7a7c067ebd19583]::integrands::process::amplitude::AmplitudeIntegrand><unknown>
  1557. 135.93 s > at <unknown source file>:<unknown line>
  1558. 135.93 s > 5: <gammalooprs[d7a7c067ebd19583]::integrands::process::amplitude::AmplitudeIntegrand>::test_single_ir_limit_impl<unknown>
  1559. 135.93 s > at <unknown source file>:<unknown line>
  1560. 135.93 s > 6: gammalooprs[d7a7c067ebd19583]::integrands::process::ir::run_ir_profile::<gammalooprs[d7a7c067ebd19583]::integrands::process::amplitude::AmplitudeIntegrand, <gammalooprs[d7a7c067ebd19583]::integrands::process::amplitude::AmplitudeIntegrand>::enumerate_ir_limits, <gammalooprs[d7a7c067ebd19583]::integrands::process::amplitude::AmplitudeIntegrand>::graph_cut_definitions, <gammalooprs[d7a7c067ebd19583]::integrands::process::amplitude::AmplitudeIntegrand>::test_single_ir_limit_impl><unknown>
  1561. 135.93 s > at <unknown source file>:<unknown line>
  1562. 135.93 s > 7: <gammalooprs[d7a7c067ebd19583]::integrands::process::amplitude::AmplitudeIntegrand>::test_ir<unknown>
  1563. 135.93 s > at <unknown source file>:<unknown line>
  1564. 135.93 s > 8: <gammaloop_api[92ae732909e47e14]::commands::profile::Profile>::run<unknown>
  1565. 135.93 s > at <unknown source file>:<unknown line>
  1566. 135.93 s > 9: test_runs[3e7a390caee4e338]::profile_bulk::box_4e_bulk_profile_passes<unknown>
  1567. 135.93 s > at <unknown source file>:<unknown line>
  1568. 135.93 s > 10: <test_runs[3e7a390caee4e338]::profile_bulk::box_4e_bulk_profile_passes::{closure#0} as core[940e698046960fd5]::ops::function::FnOnce<()>>::call_once<unknown>
  1569. 135.93 s > at <unknown source file>:<unknown line>
  1570. 135.93 s > 11: test[75d6903177b1d7e9]::__rust_begin_short_backtrace::<core[940e698046960fd5]::result::Result<(), alloc[2ea6bcb46fca0c42]::string::String>, fn() -> core[940e698046960fd5]::result::Result<(), alloc[2ea6bcb46fca0c42]::string::String>><unknown>
  1571. 135.93 s > at <unknown source file>:<unknown line>
  1572. 135.93 s > 12: test[75d6903177b1d7e9]::run_test::{closure#0}<unknown>
  1573. 135.93 s > at <unknown source file>:<unknown line>
  1574. 135.93 s > 13: std[bcb96dfbba0ab899]::sys::backtrace::__rust_begin_short_backtrace::<test[75d6903177b1d7e9]::run_test::{closure#1}, ()><unknown>
  1575. 135.93 s > at <unknown source file>:<unknown line>
  1576. 135.93 s > 14: <std[bcb96dfbba0ab899]::thread::lifecycle::spawn_unchecked<test[75d6903177b1d7e9]::run_test::{closure#1}, ()>::{closure#1} as core[940e698046960fd5]::ops::function::FnOnce<()>>::call_once::{shim:vtable#0}<unknown>
  1577. 135.93 s > at <unknown source file>:<unknown line>
  1578. 135.93 s > 15: <std[bcb96dfbba0ab899]::sys::thread::unix::Thread>::new::thread_start<unknown>
  1579. 135.93 s > at <unknown source file>:<unknown line>
  1580. 135.93 s > 16: start_thread<unknown>
  1581. 135.93 s > at <unknown source file>:<unknown line>
  1582. 135.93 s > 17: __clone3<unknown>
  1583. 135.93 s > at <unknown source file>:<unknown line>
  1584. 135.93 s >
  1585. 135.93 s > Run with COLORBT_SHOW_HIDDEN=1 environment variable to disable frame filtering.
  1586. 135.93 s > Run with RUST_BACKTRACE=full to include source snippets.
  1587. 135.93 s > Warning: SpanTrace capture is Unsupported.
  1588. 135.93 s > Ensure that you've setup a tracing-error ErrorLayer and the semver versions are compatible
  1589. 135.93 s > system-out
  1590. 135.93 s > running 1 test
  1591. 135.93 s > test profile_bulk::box_4e_bulk_profile_passes ... FAILED
  1592. 135.93 s >
  1593. 135.93 s > failures:
  1594. 135.93 s >
  1595. 135.93 s > failures:
  1596. 135.93 s > profile_bulk::box_4e_bulk_profile_passes
  1597. 135.93 s >
  1598. 135.93 s > test result: FAILED. 0 passed; 1 failed; 0 ignored; 0 measured; 82 filtered out; finished in 0.59s
  1599. 135.93 s > system-err
  1600. 135.93 s > [2026-08-28 17:31:35.064] @gammaloop_api::se... INFO : Running command import model ./assets/models/json/scalars/scalars.json
  1601. 135.93 s > [2026-08-28 17:31:35.064] @import::model INFO : Loading JSON model scalars-default from /build/source/assets/models/json/scalars/scalars
  1602. 135.93 s > [2026-08-28 17:31:35.070] @gammalooprs::model INFO : The following 2 external parameters were forced to zero by the restriction card:
  1603. 135.93 s > width_scalar_1, width_scalar_2
  1604. 135.93 s > [2026-08-28 17:31:35.071] @gammaloop_api::se... INFO : Running command import graphs ./tests/resources/graphs/massless_box.dot
  1605. 135.93 s > [2026-08-28 17:31:35.071] @commands::import INFO : Loading graphs from '/build/source/tests/resources/graphs/massless_box.dot'
  1606. 135.93 s > [2026-08-28 17:31:35.074] @gammaloop_api::se... INFO : Running command generate
  1607. 135.93 s > [2026-08-28 17:31:35.290] @commands::generate INFO :
  1608. 135.93 s > Integrand generation summary
  1609. 135.93 s > peak RAM 66.42 MiB | cores 1
  1610. 135.93 s > ╭───────────┬────────────────┬─────────┬─────────────┬────────────┬────────────────┬─────────────╮
  1611. 135.93 s > │ integrand │ graph │ # evals │ expr build │ spenso │ symbolica eval │ compile │
  1612. 135.93 s > ├───────────┼────────────────┼─────────┼─────────────┼────────────┼────────────────┼─────────────┤
  1613. 135.93 s > │ default │ massless_box_0 │ 14 │ 132ms (74%) │ 19ms (11%) │ 25ms (14%) │ 0ms (0.00%) │
  1614. 135.93 s > ├───────────┼────────────────┼─────────┼─────────────┼────────────┼────────────────┼─────────────┤
  1615. 135.93 s > │ Total │ │ 14 │ 132ms (74%) │ 19ms (11%) │ 25ms (14%) │ 0ms (0.00%) │
  1616. 135.93 s > ╰───────────┴────────────────┴─────────┴─────────────┴────────────┴────────────────┴─────────────╯
  1617. 135.93 s > [2026-08-28 17:31:35.292] @process::amplitude INFO : Input is above threshold: 4 existing threshold E-surfaces across 1/1 graph groups
  1618. 135.93 s > [2026-08-28 17:31:35.294] @process::amplitude INFO : overlap structure of group 0: [2: [8(4,6), 11(5,6)], 2: [4(3,4), 9(3,5)], 2: [4(3,4), 8(4,6)], 2: [9(3,5), 11(5,6)]]
  1619. 135.93 s > Error:
  1620. 135.93 s > 0: IR profiling requested arbitrary precision but received a quad-precision result
  1621. 135.93 s >
  1622. 135.93 s > Location:
  1623. 135.93 s > crates/gammalooprs/src/integrands/process/ir.rs:2123
  1624. 135.93 s >
  1625. 135.93 s > ━━━━━━━━━━━━━━━━━━━━━━━━━━━━━━━━━━ BACKTRACE ━━━━━━━━━━━━━━━━━━━━━━━━━━━━━━━━━━━
  1626. 135.93 s > 1: <color_eyre[51793ea62743adbd]::config::EyreHook>::into_eyre_hook::{closure#0}<unknown>
  1627. 135.93 s > at <unknown source file>:<unknown line>
  1628. 135.93 s > 2: eyre[cb2fd339c0c40fca]::capture_handler<unknown>
  1629. 135.93 s > at <unknown source file>:<unknown line>
  1630. 135.93 s > 3: eyre[cb2fd339c0c40fca]::private::format_err<unknown>
  1631. 135.93 s > at <unknown source file>:<unknown line>
  1632. 135.93 s > 4: gammalooprs[d7a7c067ebd19583]::integrands::process::ir::evaluate_profile_momentum_point_arb::<gammalooprs[d7a7c067ebd19583]::integrands::process::amplitude::AmplitudeIntegrand><unknown>
  1633. 135.93 s > at <unknown source file>:<unknown line>
  1634. 135.93 s > 5: <gammalooprs[d7a7c067ebd19583]::integrands::process::amplitude::AmplitudeIntegrand>::test_single_ir_limit_impl<unknown>
  1635. 135.93 s > at <unknown source file>:<unknown line>
  1636. 135.93 s > 6: gammalooprs[d7a7c067ebd19583]::integrands::process::ir::run_ir_profile::<gammalooprs[d7a7c067ebd19583]::integrands::process::amplitude::AmplitudeIntegrand, <gammalooprs[d7a7c067ebd19583]::integrands::process::amplitude::AmplitudeIntegrand>::enumerate_ir_limits, <gammalooprs[d7a7c067ebd19583]::integrands::process::amplitude::AmplitudeIntegrand>::graph_cut_definitions, <gammalooprs[d7a7c067ebd19583]::integrands::process::amplitude::AmplitudeIntegrand>::test_single_ir_limit_impl><unknown>
  1637. 135.93 s > at <unknown source file>:<unknown line>
  1638. 135.93 s > 7: <gammalooprs[d7a7c067ebd19583]::integrands::process::amplitude::AmplitudeIntegrand>::test_ir<unknown>
  1639. 135.93 s > at <unknown source file>:<unknown line>
  1640. 135.93 s > 8: <gammaloop_api[92ae732909e47e14]::commands::profile::Profile>::run<unknown>
  1641. 135.93 s > at <unknown source file>:<unknown line>
  1642. 135.93 s > 9: test_runs[3e7a390caee4e338]::profile_bulk::box_4e_bulk_profile_passes<unknown>
  1643. 135.93 s > at <unknown source file>:<unknown line>
  1644. 135.93 s > 10: <test_runs[3e7a390caee4e338]::profile_bulk::box_4e_bulk_profile_passes::{closure#0} as core[940e698046960fd5]::ops::function::FnOnce<()>>::call_once<unknown>
  1645. 135.93 s > at <unknown source file>:<unknown line>
  1646. 135.93 s > 11: test[75d6903177b1d7e9]::__rust_begin_short_backtrace::<core[940e698046960fd5]::result::Result<(), alloc[2ea6bcb46fca0c42]::string::String>, fn() -> core[940e698046960fd5]::result::Result<(), alloc[2ea6bcb46fca0c42]::string::String>><unknown>
  1647. 135.93 s > at <unknown source file>:<unknown line>
  1648. 135.93 s > 12: test[75d6903177b1d7e9]::run_test::{closure#0}<unknown>
  1649. 135.93 s > at <unknown source file>:<unknown line>
  1650. 135.93 s > 13: std[bcb96dfbba0ab899]::sys::backtrace::__rust_begin_short_backtrace::<test[75d6903177b1d7e9]::run_test::{closure#1}, ()><unknown>
  1651. 135.93 s > at <unknown source file>:<unknown line>
  1652. 135.93 s > 14: <std[bcb96dfbba0ab899]::thread::lifecycle::spawn_unchecked<test[75d6903177b1d7e9]::run_test::{closure#1}, ()>::{closure#1} as core[940e698046960fd5]::ops::function::FnOnce<()>>::call_once::{shim:vtable#0}<unknown>
  1653. 135.93 s > at <unknown source file>:<unknown line>
  1654. 135.93 s > 15: <std[bcb96dfbba0ab899]::sys::thread::unix::Thread>::new::thread_start<unknown>
  1655. 135.93 s > at <unknown source file>:<unknown line>
  1656. 135.93 s > 16: start_thread<unknown>
  1657. 135.93 s > at <unknown source file>:<unknown line>
  1658. 135.93 s > 17: __clone3<unknown>
  1659. 135.93 s > at <unknown source file>:<unknown line>
  1660. 135.93 s >
  1661. 135.93 s > Run with COLORBT_SHOW_HIDDEN=1 environment variable to disable frame filtering.
  1662. 135.93 s > Run with RUST_BACKTRACE=full to include source snippets.
  1663. 135.93 s > Warning: SpanTrace capture is Unsupported.
  1664. 135.93 s > Ensure that you've setup a tracing-error ErrorLayer and the semver versions are compatible
  1665. 135.93 s >
  1666. 135.93 s > 4. gammaloop-integration-tests::test_runs::profile_bulk::massless_triangle_bulk_profile_passes
  1667. 135.93 s > failure: test failure with exit code 101
  1668. 135.93 s > Error:
  1669. 135.93 s > 0: IR profiling requested arbitrary precision but received a quad-precision result
  1670. 135.93 s >
  1671. 135.93 s > Location:
  1672. 135.93 s > crates/gammalooprs/src/integrands/process/ir.rs:2123
  1673. 135.93 s >
  1674. 135.93 s > ━━━━━━━━━━━━━━━━━━━━━━━━━━━━━━━━━━ BACKTRACE ━━━━━━━━━━━━━━━━━━━━━━━━━━━━━━━━━━━
  1675. 135.93 s > 1: <color_eyre[51793ea62743adbd]::config::EyreHook>::into_eyre_hook::{closure#0}<unknown>
  1676. 135.93 s > at <unknown source file>:<unknown line>
  1677. 135.93 s > 2: eyre[cb2fd339c0c40fca]::capture_handler<unknown>
  1678. 135.93 s > at <unknown source file>:<unknown line>
  1679. 135.93 s > 3: eyre[cb2fd339c0c40fca]::private::format_err<unknown>
  1680. 135.93 s > at <unknown source file>:<unknown line>
  1681. 135.93 s > 4: gammalooprs[d7a7c067ebd19583]::integrands::process::ir::evaluate_profile_momentum_point_arb::<gammalooprs[d7a7c067ebd19583]::integrands::process::amplitude::AmplitudeIntegrand><unknown>
  1682. 135.93 s > at <unknown source file>:<unknown line>
  1683. 135.93 s > 5: <gammalooprs[d7a7c067ebd19583]::integrands::process::amplitude::AmplitudeIntegrand>::test_single_ir_limit_impl<unknown>
  1684. 135.93 s > at <unknown source file>:<unknown line>
  1685. 135.93 s > 6: gammalooprs[d7a7c067ebd19583]::integrands::process::ir::run_ir_profile::<gammalooprs[d7a7c067ebd19583]::integrands::process::amplitude::AmplitudeIntegrand, <gammalooprs[d7a7c067ebd19583]::integrands::process::amplitude::AmplitudeIntegrand>::enumerate_ir_limits, <gammalooprs[d7a7c067ebd19583]::integrands::process::amplitude::AmplitudeIntegrand>::graph_cut_definitions, <gammalooprs[d7a7c067ebd19583]::integrands::process::amplitude::AmplitudeIntegrand>::test_single_ir_limit_impl><unknown>
  1686. 135.93 s > at <unknown source file>:<unknown line>
  1687. 135.93 s > 7: <gammalooprs[d7a7c067ebd19583]::integrands::process::amplitude::AmplitudeIntegrand>::test_ir<unknown>
  1688. 135.93 s > at <unknown source file>:<unknown line>
  1689. 135.93 s > 8: <gammaloop_api[92ae732909e47e14]::commands::profile::Profile>::run<unknown>
  1690. 135.93 s > at <unknown source file>:<unknown line>
  1691. 135.93 s > 9: test_runs[3e7a390caee4e338]::profile_bulk::massless_triangle_bulk_profile_passes<unknown>
  1692. 135.93 s > at <unknown source file>:<unknown line>
  1693. 135.93 s > 10: <test_runs[3e7a390caee4e338]::profile_bulk::massless_triangle_bulk_profile_passes::{closure#0} as core[940e698046960fd5]::ops::function::FnOnce<()>>::call_once<unknown>
  1694. 135.93 s > at <unknown source file>:<unknown line>
  1695. 135.93 s > 11: test[75d6903177b1d7e9]::__rust_begin_short_backtrace::<core[940e698046960fd5]::result::Result<(), alloc[2ea6bcb46fca0c42]::string::String>, fn() -> core[940e698046960fd5]::result::Result<(), alloc[2ea6bcb46fca0c42]::string::String>><unknown>
  1696. 135.93 s > at <unknown source file>:<unknown line>
  1697. 135.93 s > 12: test[75d6903177b1d7e9]::run_test::{closure#0}<unknown>
  1698. 135.93 s > at <unknown source file>:<unknown line>
  1699. 135.93 s > 13: std[bcb96dfbba0ab899]::sys::backtrace::__rust_begin_short_backtrace::<test[75d6903177b1d7e9]::run_test::{closure#1}, ()><unknown>
  1700. 135.93 s > at <unknown source file>:<unknown line>
  1701. 135.93 s > 14: <std[bcb96dfbba0ab899]::thread::lifecycle::spawn_unchecked<test[75d6903177b1d7e9]::run_test::{closure#1}, ()>::{closure#1} as core[940e698046960fd5]::ops::function::FnOnce<()>>::call_once::{shim:vtable#0}<unknown>
  1702. 135.93 s > at <unknown source file>:<unknown line>
  1703. 135.93 s > 15: <std[bcb96dfbba0ab899]::sys::thread::unix::Thread>::new::thread_start<unknown>
  1704. 135.93 s > at <unknown source file>:<unknown line>
  1705. 135.93 s > 16: start_thread<unknown>
  1706. 135.93 s > at <unknown source file>:<unknown line>
  1707. 135.93 s > 17: __clone3<unknown>
  1708. 135.93 s > at <unknown source file>:<unknown line>
  1709. 135.93 s >
  1710. 135.93 s > Run with COLORBT_SHOW_HIDDEN=1 environment variable to disable frame filtering.
  1711. 135.93 s > Run with RUST_BACKTRACE=full to include source snippets.
  1712. 135.93 s > Warning: SpanTrace capture is Unsupported.
  1713. 135.93 s > Ensure that you've setup a tracing-error ErrorLayer and the semver versions are compatible
  1714. 135.93 s > system-out
  1715. 135.93 s > running 1 test
  1716. 135.93 s > test profile_bulk::massless_triangle_bulk_profile_passes ... FAILED
  1717. 135.93 s >
  1718. 135.93 s > failures:
  1719. 135.93 s >
  1720. 135.93 s > failures:
  1721. 135.93 s > profile_bulk::massless_triangle_bulk_profile_passes
  1722. 135.93 s >
  1723. 135.93 s > test result: FAILED. 0 passed; 1 failed; 0 ignored; 0 measured; 82 filtered out; finished in 0.39s
  1724. 135.93 s > system-err
  1725. 135.93 s > [2026-08-28 17:31:35.462] @gammaloop_api::se... INFO : Running command import model scalars
  1726. 135.93 s > [2026-08-28 17:31:35.462] @import::model INFO : Loading built-in JSON model scalars-default
  1727. 135.93 s > [2026-08-28 17:31:35.470] @gammalooprs::model INFO : The following 2 external parameters were forced to zero by the restriction card:
  1728. 135.93 s > width_scalar_1, width_scalar_2
  1729. 135.93 s > [2026-08-28 17:31:35.472] @gammaloop_api::se... INFO : Running command import graphs ./tests/resources/graphs/massless_triangle.dot
  1730. 135.93 s > [2026-08-28 17:31:35.472] @commands::import INFO : Loading graphs from '/build/source/tests/resources/graphs/massless_triangle.dot'
  1731. 135.93 s > [2026-08-28 17:31:35.479] @gammaloop_api::se... INFO : Running command generate
  1732. 135.93 s > [2026-08-28 17:31:35.592] @commands::generate INFO :
  1733. 135.93 s > Integrand generation summary
  1734. 135.93 s > peak RAM 65.42 MiB | cores 1
  1735. 135.93 s > ╭───────────┬─────────────────────┬─────────┬────────────┬────────────┬────────────────┬─────────────╮
  1736. 135.93 s > │ integrand │ graph │ # evals │ expr build │ spenso │ symbolica eval │ compile │
  1737. 135.93 s > ├───────────┼─────────────────────┼─────────┼────────────┼────────────┼────────────────┼─────────────┤
  1738. 135.93 s > │ default │ massless_triangle_0 │ 9 │ 19ms (50%) │ 2ms (5.1%) │ 18ms (45%) │ 0ms (0.00%) │
  1739. 135.93 s > ├───────────┼─────────────────────┼─────────┼────────────┼────────────┼────────────────┼─────────────┤
  1740. 135.93 s > │ Total │ │ 9 │ 19ms (50%) │ 2ms (5.1%) │ 18ms (45%) │ 0ms (0.00%) │
  1741. 135.93 s > ╰───────────┴─────────────────────┴─────────┴────────────┴────────────┴────────────────┴─────────────╯
  1742. 135.93 s > [2026-08-28 17:31:35.594] @process::amplitude INFO : Input is above threshold: 2 existing threshold E-surfaces across 1/1 graph groups
  1743. 135.93 s > [2026-08-28 17:31:35.594] @process::amplitude INFO : overlap structure of group 0: [2: [0(1,5), 1(1,3)]]
  1744. 135.93 s > Error:
  1745. 135.93 s > 0: IR profiling requested arbitrary precision but received a quad-precision result
  1746. 135.93 s >
  1747. 135.93 s > Location:
  1748. 135.93 s > crates/gammalooprs/src/integrands/process/ir.rs:2123
  1749. 135.93 s >
  1750. 135.93 s > ━━━━━━━━━━━━━━━━━━━━━━━━━━━━━━━━━━ BACKTRACE ━━━━━━━━━━━━━━━━━━━━━━━━━━━━━━━━━━━
  1751. 135.93 s > 1: <color_eyre[51793ea62743adbd]::config::EyreHook>::into_eyre_hook::{closure#0}<unknown>
  1752. 135.93 s > at <unknown source file>:<unknown line>
  1753. 135.93 s > 2: eyre[cb2fd339c0c40fca]::capture_handler<unknown>
  1754. 135.93 s > at <unknown source file>:<unknown line>
  1755. 135.93 s > 3: eyre[cb2fd339c0c40fca]::private::format_err<unknown>
  1756. 135.93 s > at <unknown source file>:<unknown line>
  1757. 135.93 s > 4: gammalooprs[d7a7c067ebd19583]::integrands::process::ir::evaluate_profile_momentum_point_arb::<gammalooprs[d7a7c067ebd19583]::integrands::process::amplitude::AmplitudeIntegrand><unknown>
  1758. 135.93 s > at <unknown source file>:<unknown line>
  1759. 135.93 s > 5: <gammalooprs[d7a7c067ebd19583]::integrands::process::amplitude::AmplitudeIntegrand>::test_single_ir_limit_impl<unknown>
  1760. 135.93 s > at <unknown source file>:<unknown line>
  1761. 135.93 s > 6: gammalooprs[d7a7c067ebd19583]::integrands::process::ir::run_ir_profile::<gammalooprs[d7a7c067ebd19583]::integrands::process::amplitude::AmplitudeIntegrand, <gammalooprs[d7a7c067ebd19583]::integrands::process::amplitude::AmplitudeIntegrand>::enumerate_ir_limits, <gammalooprs[d7a7c067ebd19583]::integrands::process::amplitude::AmplitudeIntegrand>::graph_cut_definitions, <gammalooprs[d7a7c067ebd19583]::integrands::process::amplitude::AmplitudeIntegrand>::test_single_ir_limit_impl><unknown>
  1762. 135.93 s > at <unknown source file>:<unknown line>
  1763. 135.93 s > 7: <gammalooprs[d7a7c067ebd19583]::integrands::process::amplitude::AmplitudeIntegrand>::test_ir<unknown>
  1764. 135.93 s > at <unknown source file>:<unknown line>
  1765. 135.93 s > 8: <gammaloop_api[92ae732909e47e14]::commands::profile::Profile>::run<unknown>
  1766. 135.93 s > at <unknown source file>:<unknown line>
  1767. 135.93 s > 9: test_runs[3e7a390caee4e338]::profile_bulk::massless_triangle_bulk_profile_passes<unknown>
  1768. 135.93 s > at <unknown source file>:<unknown line>
  1769. 135.93 s > 10: <test_runs[3e7a390caee4e338]::profile_bulk::massless_triangle_bulk_profile_passes::{closure#0} as core[940e698046960fd5]::ops::function::FnOnce<()>>::call_once<unknown>
  1770. 135.93 s > at <unknown source file>:<unknown line>
  1771. 135.93 s > 11: test[75d6903177b1d7e9]::__rust_begin_short_backtrace::<core[940e698046960fd5]::result::Result<(), alloc[2ea6bcb46fca0c42]::string::String>, fn() -> core[940e698046960fd5]::result::Result<(), alloc[2ea6bcb46fca0c42]::string::String>><unknown>
  1772. 135.93 s > at <unknown source file>:<unknown line>
  1773. 135.93 s > 12: test[75d6903177b1d7e9]::run_test::{closure#0}<unknown>
  1774. 135.93 s > at <unknown source file>:<unknown line>
  1775. 135.93 s > 13: std[bcb96dfbba0ab899]::sys::backtrace::__rust_begin_short_backtrace::<test[75d6903177b1d7e9]::run_test::{closure#1}, ()><unknown>
  1776. 135.93 s > at <unknown source file>:<unknown line>
  1777. 135.93 s > 14: <std[bcb96dfbba0ab899]::thread::lifecycle::spawn_unchecked<test[75d6903177b1d7e9]::run_test::{closure#1}, ()>::{closure#1} as core[940e698046960fd5]::ops::function::FnOnce<()>>::call_once::{shim:vtable#0}<unknown>
  1778. 135.93 s > at <unknown source file>:<unknown line>
  1779. 135.93 s > 15: <std[bcb96dfbba0ab899]::sys::thread::unix::Thread>::new::thread_start<unknown>
  1780. 135.93 s > at <unknown source file>:<unknown line>
  1781. 135.93 s > 16: start_thread<unknown>
  1782. 135.93 s > at <unknown source file>:<unknown line>
  1783. 135.93 s > 17: __clone3<unknown>
  1784. 135.93 s > at <unknown source file>:<unknown line>
  1785. 135.93 s >
  1786. 135.93 s > Run with COLORBT_SHOW_HIDDEN=1 environment variable to disable frame filtering.
  1787. 135.93 s > Run with RUST_BACKTRACE=full to include source snippets.
  1788. 135.93 s > Warning: SpanTrace capture is Unsupported.
  1789. 135.93 s > Ensure that you've setup a tracing-error ErrorLayer and the semver versions are compatible
  1790. 135.93 s >
  1791. 135.93 s > 5. gammaloop-integration-tests::test_runs::profile_bulk::scalar_self_energy_amp_bulk_profile_passes
  1792. 135.93 s > failure: test failure with exit code 101
  1793. 135.93 s > Error:
  1794. 135.93 s > 0: IR profiling requested arbitrary precision but received a quad-precision result
  1795. 135.93 s >
  1796. 135.93 s > Location:
  1797. 135.93 s > crates/gammalooprs/src/integrands/process/ir.rs:2123
  1798. 135.93 s >
  1799. 135.93 s > ━━━━━━━━━━━━━━━━━━━━━━━━━━━━━━━━━━ BACKTRACE ━━━━━━━━━━━━━━━━━━━━━━━━━━━━━━━━━━━
  1800. 135.93 s > 1: <color_eyre[51793ea62743adbd]::config::EyreHook>::into_eyre_hook::{closure#0}<unknown>
  1801. 135.93 s > at <unknown source file>:<unknown line>
  1802. 135.93 s > 2: eyre[cb2fd339c0c40fca]::capture_handler<unknown>
  1803. 135.93 s > at <unknown source file>:<unknown line>
  1804. 135.93 s > 3: eyre[cb2fd339c0c40fca]::private::format_err<unknown>
  1805. 135.93 s > at <unknown source file>:<unknown line>
  1806. 135.93 s > 4: gammalooprs[d7a7c067ebd19583]::integrands::process::ir::evaluate_profile_momentum_point_arb::<gammalooprs[d7a7c067ebd19583]::integrands::process::amplitude::AmplitudeIntegrand><unknown>
  1807. 135.93 s > at <unknown source file>:<unknown line>
  1808. 135.93 s > 5: <gammalooprs[d7a7c067ebd19583]::integrands::process::amplitude::AmplitudeIntegrand>::test_single_ir_limit_impl<unknown>
  1809. 135.93 s > at <unknown source file>:<unknown line>
  1810. 135.93 s > 6: gammalooprs[d7a7c067ebd19583]::integrands::process::ir::run_ir_profile::<gammalooprs[d7a7c067ebd19583]::integrands::process::amplitude::AmplitudeIntegrand, <gammalooprs[d7a7c067ebd19583]::integrands::process::amplitude::AmplitudeIntegrand>::enumerate_ir_limits, <gammalooprs[d7a7c067ebd19583]::integrands::process::amplitude::AmplitudeIntegrand>::graph_cut_definitions, <gammalooprs[d7a7c067ebd19583]::integrands::process::amplitude::AmplitudeIntegrand>::test_single_ir_limit_impl><unknown>
  1811. 135.93 s > at <unknown source file>:<unknown line>
  1812. 135.93 s > 7: <gammalooprs[d7a7c067ebd19583]::integrands::process::amplitude::AmplitudeIntegrand>::test_ir<unknown>
  1813. 135.93 s > at <unknown source file>:<unknown line>
  1814. 135.93 s > 8: <gammaloop_api[92ae732909e47e14]::commands::profile::Profile>::run<unknown>
  1815. 135.93 s > at <unknown source file>:<unknown line>
  1816. 135.93 s > 9: test_runs[3e7a390caee4e338]::profile_bulk::scalar_self_energy_amp_bulk_profile_passes<unknown>
  1817. 135.93 s > at <unknown source file>:<unknown line>
  1818. 135.93 s > 10: <test_runs[3e7a390caee4e338]::profile_bulk::scalar_self_energy_amp_bulk_profile_passes::{closure#0} as core[940e698046960fd5]::ops::function::FnOnce<()>>::call_once<unknown>
  1819. 135.93 s > at <unknown source file>:<unknown line>
  1820. 135.93 s > 11: test[75d6903177b1d7e9]::__rust_begin_short_backtrace::<core[940e698046960fd5]::result::Result<(), alloc[2ea6bcb46fca0c42]::string::String>, fn() -> core[940e698046960fd5]::result::Result<(), alloc[2ea6bcb46fca0c42]::string::String>><unknown>
  1821. 135.93 s > at <unknown source file>:<unknown line>
  1822. 135.93 s > 12: test[75d6903177b1d7e9]::run_test::{closure#0}<unknown>
  1823. 135.93 s > at <unknown source file>:<unknown line>
  1824. 135.93 s > 13: std[bcb96dfbba0ab899]::sys::backtrace::__rust_begin_short_backtrace::<test[75d6903177b1d7e9]::run_test::{closure#1}, ()><unknown>
  1825. 135.93 s > at <unknown source file>:<unknown line>
  1826. 135.93 s > 14: <std[bcb96dfbba0ab899]::thread::lifecycle::spawn_unchecked<test[75d6903177b1d7e9]::run_test::{closure#1}, ()>::{closure#1} as core[940e698046960fd5]::ops::function::FnOnce<()>>::call_once::{shim:vtable#0}<unknown>
  1827. 135.93 s > at <unknown source file>:<unknown line>
  1828. 135.93 s > 15: <std[bcb96dfbba0ab899]::sys::thread::unix::Thread>::new::thread_start<unknown>
  1829. 135.93 s > at <unknown source file>:<unknown line>
  1830. 135.93 s > 16: start_thread<unknown>
  1831. 135.93 s > at <unknown source file>:<unknown line>
  1832. 135.93 s > 17: __clone3<unknown>
  1833. 135.93 s > at <unknown source file>:<unknown line>
  1834. 135.93 s >
  1835. 135.93 s > Run with COLORBT_SHOW_HIDDEN=1 environment variable to disable frame filtering.
  1836. 135.93 s > Run with RUST_BACKTRACE=full to include source snippets.
  1837. 135.93 s > Warning: SpanTrace capture is Unsupported.
  1838. 135.93 s > Ensure that you've setup a tracing-error ErrorLayer and the semver versions are compatible
  1839. 135.93 s > system-out
  1840. 135.93 s > running 1 test
  1841. 135.93 s > test profile_bulk::scalar_self_energy_amp_bulk_profile_passes ... FAILED
  1842. 135.93 s >
  1843. 135.93 s > failures:
  1844. 135.93 s >
  1845. 135.93 s > failures:
  1846. 135.93 s > profile_bulk::scalar_self_energy_amp_bulk_profile_passes
  1847. 135.93 s >
  1848. 135.93 s > test result: FAILED. 0 passed; 1 failed; 0 ignored; 0 measured; 82 filtered out; finished in 0.72s
  1849. 135.93 s > system-err
  1850. 135.93 s > [2026-08-28 17:31:35.587] @gammaloop_api::se... INFO : Running command import model ./assets/models/json/scalars/scalars.json
  1851. 135.93 s > [2026-08-28 17:31:35.587] @import::model INFO : Loading JSON model scalars-default from /build/source/assets/models/json/scalars/scalars
  1852. 135.93 s > [2026-08-28 17:31:35.591] @gammalooprs::model INFO : The following 2 external parameters were forced to zero by the restriction card:
  1853. 135.93 s > width_scalar_1, width_scalar_2
  1854. 135.93 s > [2026-08-28 17:31:35.592] @gammaloop_api::se... INFO : Running command import graphs ./tests/resources/graphs/scalar_self_energy_amp.dot
  1855. 135.93 s > [2026-08-28 17:31:35.596] @commands::import INFO : Loading graphs from '/build/source/tests/resources/graphs/scalar_self_energy_amp.dot'
  1856. 135.93 s > [2026-08-28 17:31:35.605] @gammaloop_api::se... INFO : Running command generate
  1857. 135.93 s > [2026-08-28 17:31:36.044] @commands::generate INFO :
  1858. 135.93 s > Integrand generation summary
  1859. 135.93 s > peak RAM 70.96 MiB | cores 1
  1860. 135.93 s > ╭───────────┬────────────────────────┬─────────┬─────────────┬─────────────┬────────────────┬─────────────╮
  1861. 135.93 s > │ integrand │ graph │ # evals │ expr build │ spenso │ symbolica eval │ compile │
  1862. 135.93 s > ├───────────┼────────────────────────┼─────────┼─────────────┼─────────────┼────────────────┼─────────────┤
  1863. 135.93 s > │ default │ scalar_self_energy_amp │ 6 │ 346ms (89%) │ 22ms (5.6%) │ 22ms (5.7%) │ 0ms (0.00%) │
  1864. 135.93 s > ├───────────┼────────────────────────┼─────────┼─────────────┼─────────────┼────────────────┼─────────────┤
  1865. 135.93 s > │ Total │ │ 6 │ 346ms (89%) │ 22ms (5.6%) │ 22ms (5.7%) │ 0ms (0.00%) │
  1866. 135.93 s > ╰───────────┴────────────────────────┴─────────┴─────────────┴─────────────┴────────────────┴─────────────╯
  1867. 135.93 s > [2026-08-28 17:31:36.045] @process::amplitude INFO : Input is above threshold: 2 existing threshold E-surfaces across 1/1 graph groups
  1868. 135.93 s > [2026-08-28 17:31:36.045] @process::amplitude INFO : overlap structure of group 0: [2: [2(1,5), 4(2,3,5)]]
  1869. 135.93 s > Error:
  1870. 135.93 s > 0: IR profiling requested arbitrary precision but received a quad-precision result
  1871. 135.93 s >
  1872. 135.93 s > Location:
  1873. 135.93 s > crates/gammalooprs/src/integrands/process/ir.rs:2123
  1874. 135.93 s >
  1875. 135.93 s > ━━━━━━━━━━━━━━━━━━━━━━━━━━━━━━━━━━ BACKTRACE ━━━━━━━━━━━━━━━━━━━━━━━━━━━━━━━━━━━
  1876. 135.93 s > 1: <color_eyre[51793ea62743adbd]::config::EyreHook>::into_eyre_hook::{closure#0}<unknown>
  1877. 135.93 s > at <unknown source file>:<unknown line>
  1878. 135.93 s > 2: eyre[cb2fd339c0c40fca]::capture_handler<unknown>
  1879. 135.93 s > at <unknown source file>:<unknown line>
  1880. 135.93 s > 3: eyre[cb2fd339c0c40fca]::private::format_err<unknown>
  1881. 135.93 s > at <unknown source file>:<unknown line>
  1882. 135.93 s > 4: gammalooprs[d7a7c067ebd19583]::integrands::process::ir::evaluate_profile_momentum_point_arb::<gammalooprs[d7a7c067ebd19583]::integrands::process::amplitude::AmplitudeIntegrand><unknown>
  1883. 135.93 s > at <unknown source file>:<unknown line>
  1884. 135.93 s > 5: <gammalooprs[d7a7c067ebd19583]::integrands::process::amplitude::AmplitudeIntegrand>::test_single_ir_limit_impl<unknown>
  1885. 135.93 s > at <unknown source file>:<unknown line>
  1886. 135.93 s > 6: gammalooprs[d7a7c067ebd19583]::integrands::process::ir::run_ir_profile::<gammalooprs[d7a7c067ebd19583]::integrands::process::amplitude::AmplitudeIntegrand, <gammalooprs[d7a7c067ebd19583]::integrands::process::amplitude::AmplitudeIntegrand>::enumerate_ir_limits, <gammalooprs[d7a7c067ebd19583]::integrands::process::amplitude::AmplitudeIntegrand>::graph_cut_definitions, <gammalooprs[d7a7c067ebd19583]::integrands::process::amplitude::AmplitudeIntegrand>::test_single_ir_limit_impl><unknown>
  1887. 135.93 s > at <unknown source file>:<unknown line>
  1888. 135.93 s > 7: <gammalooprs[d7a7c067ebd19583]::integrands::process::amplitude::AmplitudeIntegrand>::test_ir<unknown>
  1889. 135.93 s > at <unknown source file>:<unknown line>
  1890. 135.93 s > 8: <gammaloop_api[92ae732909e47e14]::commands::profile::Profile>::run<unknown>
  1891. 135.93 s > at <unknown source file>:<unknown line>
  1892. 135.93 s > 9: test_runs[3e7a390caee4e338]::profile_bulk::scalar_self_energy_amp_bulk_profile_passes<unknown>
  1893. 135.93 s > at <unknown source file>:<unknown line>
  1894. 135.93 s > 10: <test_runs[3e7a390caee4e338]::profile_bulk::scalar_self_energy_amp_bulk_profile_passes::{closure#0} as core[940e698046960fd5]::ops::function::FnOnce<()>>::call_once<unknown>
  1895. 135.93 s > at <unknown source file>:<unknown line>
  1896. 135.93 s > 11: test[75d6903177b1d7e9]::__rust_begin_short_backtrace::<core[940e698046960fd5]::result::Result<(), alloc[2ea6bcb46fca0c42]::string::String>, fn() -> core[940e698046960fd5]::result::Result<(), alloc[2ea6bcb46fca0c42]::string::String>><unknown>
  1897. 135.93 s > at <unknown source file>:<unknown line>
  1898. 135.93 s > 12: test[75d6903177b1d7e9]::run_test::{closure#0}<unknown>
  1899. 135.93 s > at <unknown source file>:<unknown line>
  1900. 135.93 s > 13: std[bcb96dfbba0ab899]::sys::backtrace::__rust_begin_short_backtrace::<test[75d6903177b1d7e9]::run_test::{closure#1}, ()><unknown>
  1901. 135.93 s > at <unknown source file>:<unknown line>
  1902. 135.93 s > 14: <std[bcb96dfbba0ab899]::thread::lifecycle::spawn_unchecked<test[75d6903177b1d7e9]::run_test::{closure#1}, ()>::{closure#1} as core[940e698046960fd5]::ops::function::FnOnce<()>>::call_once::{shim:vtable#0}<unknown>
  1903. 135.93 s > at <unknown source file>:<unknown line>
  1904. 135.93 s > 15: <std[bcb96dfbba0ab899]::sys::thread::unix::Thread>::new::thread_start<unknown>
  1905. 135.93 s > at <unknown source file>:<unknown line>
  1906. 135.93 s > 16: start_thread<unknown>
  1907. 135.93 s > at <unknown source file>:<unknown line>
  1908. 135.93 s > 17: __clone3<unknown>
  1909. 135.93 s > at <unknown source file>:<unknown line>
  1910. 135.93 s >
  1911. 135.93 s > Run with COLORBT_SHOW_HIDDEN=1 environment variable to disable frame filtering.
  1912. 135.93 s > Run with RUST_BACKTRACE=full to include source snippets.
  1913. 135.93 s > Warning: SpanTrace capture is Unsupported.
  1914. 135.93 s > Ensure that you've setup a tracing-error ErrorLayer and the semver versions are compatible
  1915. 135.93 s >
  1916. 135.93 s > 6. gammaloop-integration-tests::test_runs::profile_bulk::double_dotted_bubble_amp_bulk_profile_passes
  1917. 135.93 s > failure: test failure with exit code 101
  1918. 135.93 s > Error:
  1919. 135.93 s > 0: IR profiling requested arbitrary precision but received a quad-precision result
  1920. 135.93 s >
  1921. 135.93 s > Location:
  1922. 135.93 s > crates/gammalooprs/src/integrands/process/ir.rs:2123
  1923. 135.93 s >
  1924. 135.93 s > ━━━━━━━━━━━━━━━━━━━━━━━━━━━━━━━━━━ BACKTRACE ━━━━━━━━━━━━━━━━━━━━━━━━━━━━━━━━━━━
  1925. 135.93 s > 1: <color_eyre[51793ea62743adbd]::config::EyreHook>::into_eyre_hook::{closure#0}<unknown>
  1926. 135.93 s > at <unknown source file>:<unknown line>
  1927. 135.93 s > 2: eyre[cb2fd339c0c40fca]::capture_handler<unknown>
  1928. 135.93 s > at <unknown source file>:<unknown line>
  1929. 135.93 s > 3: eyre[cb2fd339c0c40fca]::private::format_err<unknown>
  1930. 135.93 s > at <unknown source file>:<unknown line>
  1931. 135.93 s > 4: gammalooprs[d7a7c067ebd19583]::integrands::process::ir::evaluate_profile_momentum_point_arb::<gammalooprs[d7a7c067ebd19583]::integrands::process::amplitude::AmplitudeIntegrand><unknown>
  1932. 135.93 s > at <unknown source file>:<unknown line>
  1933. 135.93 s > 5: <gammalooprs[d7a7c067ebd19583]::integrands::process::amplitude::AmplitudeIntegrand>::test_single_ir_limit_impl<unknown>
  1934. 135.93 s > at <unknown source file>:<unknown line>
  1935. 135.93 s > 6: gammalooprs[d7a7c067ebd19583]::integrands::process::ir::run_ir_profile::<gammalooprs[d7a7c067ebd19583]::integrands::process::amplitude::AmplitudeIntegrand, <gammalooprs[d7a7c067ebd19583]::integrands::process::amplitude::AmplitudeIntegrand>::enumerate_ir_limits, <gammalooprs[d7a7c067ebd19583]::integrands::process::amplitude::AmplitudeIntegrand>::graph_cut_definitions, <gammalooprs[d7a7c067ebd19583]::integrands::process::amplitude::AmplitudeIntegrand>::test_single_ir_limit_impl><unknown>
  1936. 135.93 s > at <unknown source file>:<unknown line>
  1937. 135.93 s > 7: <gammalooprs[d7a7c067ebd19583]::integrands::process::amplitude::AmplitudeIntegrand>::test_ir<unknown>
  1938. 135.93 s > at <unknown source file>:<unknown line>
  1939. 135.93 s > 8: <gammaloop_api[92ae732909e47e14]::commands::profile::Profile>::run<unknown>
  1940. 135.93 s > at <unknown source file>:<unknown line>
  1941. 135.93 s > 9: test_runs[3e7a390caee4e338]::profile_bulk::double_dotted_bubble_amp_bulk_profile_passes<unknown>
  1942. 135.93 s > at <unknown source file>:<unknown line>
  1943. 135.93 s > 10: <test_runs[3e7a390caee4e338]::profile_bulk::double_dotted_bubble_amp_bulk_profile_passes::{closure#0} as core[940e698046960fd5]::ops::function::FnOnce<()>>::call_once<unknown>
  1944. 135.93 s > at <unknown source file>:<unknown line>
  1945. 135.93 s > 11: test[75d6903177b1d7e9]::__rust_begin_short_backtrace::<core[940e698046960fd5]::result::Result<(), alloc[2ea6bcb46fca0c42]::string::String>, fn() -> core[940e698046960fd5]::result::Result<(), alloc[2ea6bcb46fca0c42]::string::String>><unknown>
  1946. 135.93 s > at <unknown source file>:<unknown line>
  1947. 135.93 s > 12: test[75d6903177b1d7e9]::run_test::{closure#0}<unknown>
  1948. 135.93 s > at <unknown source file>:<unknown line>
  1949. 135.93 s > 13: std[bcb96dfbba0ab899]::sys::backtrace::__rust_begin_short_backtrace::<test[75d6903177b1d7e9]::run_test::{closure#1}, ()><unknown>
  1950. 135.93 s > at <unknown source file>:<unknown line>
  1951. 135.93 s > 14: <std[bcb96dfbba0ab899]::thread::lifecycle::spawn_unchecked<test[75d6903177b1d7e9]::run_test::{closure#1}, ()>::{closure#1} as core[940e698046960fd5]::ops::function::FnOnce<()>>::call_once::{shim:vtable#0}<unknown>
  1952. 135.93 s > at <unknown source file>:<unknown line>
  1953. 135.93 s > 15: <std[bcb96dfbba0ab899]::sys::thread::unix::Thread>::new::thread_start<unknown>
  1954. 135.93 s > at <unknown source file>:<unknown line>
  1955. 135.93 s > 16: start_thread<unknown>
  1956. 135.93 s > at <unknown source file>:<unknown line>
  1957. 135.93 s > 17: __clone3<unknown>
  1958. 135.93 s > at <unknown source file>:<unknown line>
  1959. 135.93 s >
  1960. 135.93 s > Run with COLORBT_SHOW_HIDDEN=1 environment variable to disable frame filtering.
  1961. 135.93 s > Run with RUST_BACKTRACE=full to include source snippets.
  1962. 135.93 s > Warning: SpanTrace capture is Unsupported.
  1963. 135.93 s > Ensure that you've setup a tracing-error ErrorLayer and the semver versions are compatible
  1964. 135.93 s > system-out
  1965. 135.93 s > running 1 test
  1966. 135.93 s > test profile_bulk::double_dotted_bubble_amp_bulk_profile_passes ... FAILED
  1967. 135.93 s >
  1968. 135.93 s > failures:
  1969. 135.93 s >
  1970. 135.93 s > failures:
  1971. 135.93 s > profile_bulk::double_dotted_bubble_amp_bulk_profile_passes
  1972. 135.93 s >
  1973. 135.93 s > test result: FAILED. 0 passed; 1 failed; 0 ignored; 0 measured; 82 filtered out; finished in 1.48s
  1974. 135.93 s > system-err
  1975. 135.93 s > [2026-08-28 17:31:36.125] @gammaloop_api::se... INFO : Running command import model ./assets/models/json/scalars/scalars_2p_3p.json
  1976. 135.93 s > [2026-08-28 17:31:36.125] @import::model INFO : Loading JSON model scalars_2p_3p-default from /build/source/assets/models/json/scalars/scalars_2p_3p
  1977. 135.93 s > [2026-08-28 17:31:36.127] @gammaloop_api::se... INFO : Running command import graphs ./tests/resources/graphs/double_dotted_bubble_amp.dot
  1978. 135.93 s > [2026-08-28 17:31:36.127] @commands::import INFO : Loading graphs from '/build/source/tests/resources/graphs/double_dotted_bubble_amp.dot'
  1979. 135.93 s > [2026-08-28 17:31:36.135] @gammaloop_api::se... INFO : Running command generate
  1980. 135.93 s > [2026-08-28 17:31:36.356] @commands::generate INFO :
  1981. 135.93 s > Integrand generation summary
  1982. 135.93 s > peak RAM 67.08 MiB | cores 1
  1983. 135.93 s > ╭───────────┬──────────────────────────┬─────────┬────────────┬─────────────┬────────────────┬─────────────╮
  1984. 135.93 s > │ integrand │ graph │ # evals │ expr build │ spenso │ symbolica eval │ compile │
  1985. 135.93 s > ├───────────┼──────────────────────────┼─────────┼────────────┼─────────────┼────────────────┼─────────────┤
  1986. 135.93 s > │ default │ double_dotted_bubble_amp │ 11 │ 82ms (64%) │ 10ms (7.8%) │ 36ms (28%) │ 0ms (0.00%) │
  1987. 135.93 s > ├───────────┼──────────────────────────┼─────────┼────────────┼─────────────┼────────────────┼─────────────┤
  1988. 135.93 s > │ Total │ │ 11 │ 82ms (64%) │ 10ms (7.8%) │ 36ms (28%) │ 0ms (0.00%) │
  1989. 135.93 s > ╰───────────┴──────────────────────────┴─────────┴────────────┴─────────────┴────────────────┴─────────────╯
  1990. 135.93 s > [2026-08-28 17:31:36.357] @process::amplitude INFO : Input is above threshold: 1 existing threshold E-surfaces across 1/1 graph groups
  1991. 135.93 s > [2026-08-28 17:31:36.357] @process::amplitude INFO : overlap structure of group 0: [1: [1(1,4)]]
  1992. 135.93 s > Error:
  1993. 135.93 s > 0: IR profiling requested arbitrary precision but received a quad-precision result
  1994. 135.93 s >
  1995. 135.93 s > Location:
  1996. 135.93 s > crates/gammalooprs/src/integrands/process/ir.rs:2123
  1997. 135.93 s >
  1998. 135.93 s > ━━━━━━━━━━━━━━━━━━━━━━━━━━━━━━━━━━ BACKTRACE ━━━━━━━━━━━━━━━━━━━━━━━━━━━━━━━━━━━
  1999. 135.93 s > 1: <color_eyre[51793ea62743adbd]::config::EyreHook>::into_eyre_hook::{closure#0}<unknown>
  2000. 135.93 s > at <unknown source file>:<unknown line>
  2001. 135.93 s > 2: eyre[cb2fd339c0c40fca]::capture_handler<unknown>
  2002. 135.93 s > at <unknown source file>:<unknown line>
  2003. 135.93 s > 3: eyre[cb2fd339c0c40fca]::private::format_err<unknown>
  2004. 135.93 s > at <unknown source file>:<unknown line>
  2005. 135.93 s > 4: gammalooprs[d7a7c067ebd19583]::integrands::process::ir::evaluate_profile_momentum_point_arb::<gammalooprs[d7a7c067ebd19583]::integrands::process::amplitude::AmplitudeIntegrand><unknown>
  2006. 135.93 s > at <unknown source file>:<unknown line>
  2007. 135.93 s > 5: <gammalooprs[d7a7c067ebd19583]::integrands::process::amplitude::AmplitudeIntegrand>::test_single_ir_limit_impl<unknown>
  2008. 135.93 s > at <unknown source file>:<unknown line>
  2009. 135.93 s > 6: gammalooprs[d7a7c067ebd19583]::integrands::process::ir::run_ir_profile::<gammalooprs[d7a7c067ebd19583]::integrands::process::amplitude::AmplitudeIntegrand, <gammalooprs[d7a7c067ebd19583]::integrands::process::amplitude::AmplitudeIntegrand>::enumerate_ir_limits, <gammalooprs[d7a7c067ebd19583]::integrands::process::amplitude::AmplitudeIntegrand>::graph_cut_definitions, <gammalooprs[d7a7c067ebd19583]::integrands::process::amplitude::AmplitudeIntegrand>::test_single_ir_limit_impl><unknown>
  2010. 135.93 s > at <unknown source file>:<unknown line>
  2011. 135.93 s > 7: <gammalooprs[d7a7c067ebd19583]::integrands::process::amplitude::AmplitudeIntegrand>::test_ir<unknown>
  2012. 135.93 s > at <unknown source file>:<unknown line>
  2013. 135.93 s > 8: <gammaloop_api[92ae732909e47e14]::commands::profile::Profile>::run<unknown>
  2014. 135.93 s > at <unknown source file>:<unknown line>
  2015. 135.93 s > 9: test_runs[3e7a390caee4e338]::profile_bulk::double_dotted_bubble_amp_bulk_profile_passes<unknown>
  2016. 135.93 s > at <unknown source file>:<unknown line>
  2017. 135.93 s > 10: <test_runs[3e7a390caee4e338]::profile_bulk::double_dotted_bubble_amp_bulk_profile_passes::{closure#0} as core[940e698046960fd5]::ops::function::FnOnce<()>>::call_once<unknown>
  2018. 135.93 s > at <unknown source file>:<unknown line>
  2019. 135.93 s > 11: test[75d6903177b1d7e9]::__rust_begin_short_backtrace::<core[940e698046960fd5]::result::Result<(), alloc[2ea6bcb46fca0c42]::string::String>, fn() -> core[940e698046960fd5]::result::Result<(), alloc[2ea6bcb46fca0c42]::string::String>><unknown>
  2020. 135.93 s > at <unknown source file>:<unknown line>
  2021. 135.93 s > 12: test[75d6903177b1d7e9]::run_test::{closure#0}<unknown>
  2022. 135.93 s > at <unknown source file>:<unknown line>
  2023. 135.93 s > 13: std[bcb96dfbba0ab899]::sys::backtrace::__rust_begin_short_backtrace::<test[75d6903177b1d7e9]::run_test::{closure#1}, ()><unknown>
  2024. 135.93 s > at <unknown source file>:<unknown line>
  2025. 135.93 s > 14: <std[bcb96dfbba0ab899]::thread::lifecycle::spawn_unchecked<test[75d6903177b1d7e9]::run_test::{closure#1}, ()>::{closure#1} as core[940e698046960fd5]::ops::function::FnOnce<()>>::call_once::{shim:vtable#0}<unknown>
  2026. 135.93 s > at <unknown source file>:<unknown line>
  2027. 135.93 s > 15: <std[bcb96dfbba0ab899]::sys::thread::unix::Thread>::new::thread_start<unknown>
  2028. 135.93 s > at <unknown source file>:<unknown line>
  2029. 135.93 s > 16: start_thread<unknown>
  2030. 135.93 s > at <unknown source file>:<unknown line>
  2031. 135.93 s > 17: __clone3<unknown>
  2032. 135.93 s > at <unknown source file>:<unknown line>
  2033. 135.93 s >
  2034. 135.93 s > Run with COLORBT_SHOW_HIDDEN=1 environment variable to disable frame filtering.
  2035. 135.93 s > Run with RUST_BACKTRACE=full to include source snippets.
  2036. 135.93 s > Warning: SpanTrace capture is Unsupported.
  2037. 135.93 s > Ensure that you've setup a tracing-error ErrorLayer and the semver versions are compatible
  2038. 135.93 s >
  2039. 135.93 s > 7. gammaloop-integration-tests::uv::dod2_bubble_uv
  2040. 135.93 s > failure: test failure with exit code 101
  2041. 135.93 s > system-out
  2042. 135.93 s > running 1 test
  2043. 135.93 s > +-------------+-----------------+---------+--------+----------+-----------------------------------------------------------------------------------------------------------------------+-------+
  2044. 135.93 s > | case | check | graph | status | sigma | threshold | error |
  2045. 135.93 s > +-------------+-----------------+---------+--------+----------+-----------------------------------------------------------------------------------------------------------------------+-------+
  2046. 135.93 s > | dod2_bubble | uv_profile | - | FAIL | - | - | - |
  2047. 135.93 s > +-------------+-----------------+---------+--------+----------+-----------------------------------------------------------------------------------------------------------------------+-------+
  2048. 135.93 s > | dod2_bubble | m_uv.inspect | inspect | pass | - | best inspect relative delta 1.000e0 >= 1000*accuracy 1.000e-7 (accuracy=1.000e-10, exponent=+8.0, seed=0, probes=10) | - |
  2049. 135.93 s > +-------------+-----------------+---------+--------+----------+-----------------------------------------------------------------------------------------------------------------------+-------+
  2050. 135.93 s > | dod2_bubble | m_uv.integrated | GL0 | pass | 0.0sigma | compatible within 2sigma | - |
  2051. 135.93 s > +-------------+-----------------+---------+--------+----------+-----------------------------------------------------------------------------------------------------------------------+-------+
  2052. 135.93 s > | dod2_bubble | rls.inspect | inspect | pass | - | best inspect relative delta 2.822e-3 >= 1000*accuracy 1.000e-7 (accuracy=1.000e-10, exponent=+2.0, seed=1, probes=10) | - |
  2053. 135.93 s > +-------------+-----------------+---------+--------+----------+-----------------------------------------------------------------------------------------------------------------------+-------+
  2054. 135.93 s > | dod2_bubble | rls.integrated | GL0 | pass | 0.0sigma | compatible within 2sigma | - |
  2055. 135.93 s > +-------------+-----------------+---------+--------+----------+-----------------------------------------------------------------------------------------------------------------------+-------+
  2056. 135.93 s > | dod2_bubble | mu_r.inspect | inspect | pass | - | best inspect relative delta 6.951e-1 >= 1000*accuracy 1.000e-7 (accuracy=1.000e-10, exponent=+0.0, seed=0, probes=10) | - |
  2057. 135.93 s > +-------------+-----------------+---------+--------+----------+-----------------------------------------------------------------------------------------------------------------------+-------+
  2058. 135.93 s > | dod2_bubble | target | - | pass | - | 2sigma | - |
  2059. 135.93 s > +-------------+-----------------+---------+--------+----------+-----------------------------------------------------------------------------------------------------------------------+-------+
  2060. 135.93 s > test dod2_bubble_uv ... FAILED
  2061. 135.93 s >
  2062. 135.93 s > failures:
  2063. 135.93 s >
  2064. 135.93 s > failures:
  2065. 135.93 s > dod2_bubble_uv
  2066. 135.93 s >
  2067. 135.93 s > test result: FAILED. 0 passed; 1 failed; 0 ignored; 0 measured; 24 filtered out; finished in 42.62s
  2068. 135.93 s > system-err
  2069. 135.93 s > [2026-08-28 17:31:40.360] @gammaloop_api::se... INFO : Running command run generate
  2070. 135.93 s > [2026-08-28 17:31:40.360] @gammaloop_api::se... INFO : Starting command block generate
  2071. 135.93 s > [2026-08-28 17:31:40.361] @gammaloop_api::se... INFO : Running command import model scalars-default.json
  2072. 135.93 s > [2026-08-28 17:31:40.361] @import::model INFO : Loading built-in JSON model scalars-default
  2073. 135.93 s > [2026-08-28 17:31:40.364] @gammalooprs::model INFO : The following 2 external parameters were forced to zero by the restriction card:
  2074. 135.93 s > width_scalar_1, width_scalar_2
  2075. 135.93 s > [2026-08-28 17:31:40.365] @gammaloop_api::se... INFO : Running command remove processes
  2076. 135.93 s > [2026-08-28 17:31:40.365] @gammaloop_api::se... INFO : Running command set global kv global.generation.uv.generate_integrated=true
  2077. 135.93 s > [2026-08-28 17:31:40.365] @gammaloop_api::se... INFO : Running command import graphs ./tests/resources/graphs/scalar/dod2_bubble.dot -p bubble_dod2 -i scalar_bubble_below_thres
  2078. 135.93 s > [2026-08-28 17:31:40.365] @commands::import INFO : Loading graphs from '/build/source/tests/resources/graphs/scalar/dod2_bubble.dot'
  2079. 135.93 s > [2026-08-28 17:31:40.370] @gammaloop_api::se... INFO : Running command generate existing -p bubble_dod2 -i scalar_bubble_below_thres
  2080. 135.93 s > [2026-08-28 17:31:40.380] @approx::local_4d [{#uv, #inspect, #integrated}] DEBUG : Rescaled momenta expanded
  2081. 135.93 s > field value
  2082. 135.93 s > res n-terms: 1, byte size: 585,expr:
  2083. 135.93 s > -SCALAR_COUPLING²·q₀(αᵉ².¹)·q₀(αᵉ³.¹)·q₂(αᵉ².¹)·q₂(αᵉ³.¹)
  2084. 135.93 s > /(t²·denom(3,-q₀-q₂/t,mass_scalar_2²,-mass_scalar_2²+2·(q₀.q₂)/t+(q₂.q₂)/t²+(q₀.q₀))
  2085. 135.93 s > ·denom(2,q₂/t,mass_scalar_2²,-mass_scalar_2²+(q₂.q₂)/t²))
  2086. 135.93 s > [2026-08-28 17:31:40.381] @approx::local_4d [{#uv, #inspect, #integrated}] DEBUG : Rescaled momenta expanded
  2087. 135.93 s > field value
  2088. 135.93 s > res n-terms: 1, byte size: 3,expr:
  2089. 135.93 s > 1
  2090. 135.93 s > [2026-08-28 17:31:40.381] @approx::final_integrand[{#generation, #profile, #uv, #graph, #summary}] DEBUG : Computed global numerator
  2091. 135.93 s > field value
  2092. 135.93 s > global_num n-terms: 1, byte size: 4,expr:
  2093. 135.93 s > 1/2
  2094. 135.93 s > span build_3d{span_context=true graph=GL0 current=subgraph=0, topo_order=0, dod=0}
  2095. 135.93 s > [2026-08-28 17:31:40.386] @uv::approx [{#generation, #uv, #fourd}] DEBUG : Computing 4D
  2096. 135.93 s > field value
  2097. 135.93 s > simple subgraph(S_11,S_y)*Approx(subgraph(S_y,0)) of GL0
  2098. 135.93 s > span compute_4d{span_context=true graph=GL0 current=subgraph=y, topo_order=1, dod=2 given=subgraph=0, topo_order=0, dod=0 reduced=SubSet { set: BitVec<usize, bitvec::order::Lsb0> { addr: 0x7fffd000d200, head: 000000, bits: 6, capacity: 64 } [0, 0, 1, 1, 1, 1], id: PhantomData<linnet::half_edge::involution::Hedge> }}
  2099. 135.93 s > [2026-08-28 17:31:40.390] @approx::local_4d [{#uv, #algebra, #integrated, #start}] DEBUG :
  2100. 135.93 s > field value
  2101. 135.93 s > integrand n-terms: 1, byte size: 409,expr:
  2102. 135.93 s > SCALAR_COUPLING²·(q₀(αᵉ³.¹)+q₃(αᵉ³.¹))·q₀(αᵉ².¹)·q₀(αᵉ³.¹)·q₂(αᵉ².¹)
  2103. 135.93 s > /(denom(2,q₂,mass_scalar_2²,-mass_scalar_2²+(q₂.q₂))·denom(3,q₃,mass_scalar_2²,-mass_scalar_2²+(q₃.q₃)))
  2104. 135.93 s > reduced y
  2105. 135.93 s > span grow{span_context=true current=subgraph=y, topo_order=1, dod=2 given=subgraph=0, topo_order=0, dod=0}
  2106. 135.93 s > [2026-08-28 17:31:40.390] @approx::local_4d [{#uv, #inspect, #integrated}] DEBUG : Rescaled momenta expanded
  2107. 135.93 s > field value
  2108. 135.93 s > res n-terms: 1, byte size: 585,expr:
  2109. 135.93 s > -SCALAR_COUPLING²·q₀(αᵉ².¹)·q₀(αᵉ³.¹)·q₂(αᵉ².¹)·q₂(αᵉ³.¹)
  2110. 135.93 s > /(t²·denom(3,-q₀-q₂/t,mass_scalar_2²,-mass_scalar_2²+2·(q₀.q₂)/t+(q₂.q₂)/t²+(q₀.q₀))
  2111. 135.93 s > ·denom(2,q₂/t,mass_scalar_2²,-mass_scalar_2²+(q₂.q₂)/t²))
  2112. 135.93 s > span t{span_context=true current=subgraph=y, topo_order=1, dod=2 given=subgraph=0, topo_order=0, dod=0}
  2113. 135.93 s > [2026-08-28 17:31:40.392] @approx::local_4d [{#uv, #integrated, #rescaled}] DEBUG : Rescaled expanded
  2114. 135.93 s > field value
  2115. 135.93 s > n_loops 1
  2116. 135.93 s > res n-terms: 1, byte size: 707,expr:
  2117. 135.93 s > -SCALAR_COUPLING²·q₀(αᵉ².¹)·q₀(αᵉ³.¹)·q₂(αᵉ².¹)·q₂(αᵉ³.¹)
  2118. 135.93 s > /(t²·denom(3,-q₂,mUVexp²+t²·mass_scalar_2²,-mUV²+t²·(-mass_scalar_2²+2·(q₀.q₂)/t+(q₂.q₂)/t²+(q₀.q₀))+t²·mUVexp²)
  2119. 135.93 s > ·denom(2,q₂,mUVexp²+t²·mass_scalar_2²,-mUV²+t²·(-mass_scalar_2²+(q₂.q₂)/t²)+t²·mUVexp²))
  2120. 135.93 s > span t{span_context=true current=subgraph=y, topo_order=1, dod=2 given=subgraph=0, topo_order=0, dod=0}
  2121. 135.93 s > [2026-08-28 17:31:40.393] @approx::local_4d [{#uv, #integrated, #series}] DEBUG : Series expanded
  2122. 135.93 s > field value
  2123. 135.93 s > res n-terms: 3, byte size: 1896,expr:
  2124. 135.93 s > (1/2·SCALAR_COUPLING²·(2·mUVexp²-2·mass_scalar_2²)/(denom(2,q₂,mUVexp²,-mUV²+(q₂.q₂))²·denom(3,-q₂,mUVexp²,-mUV²+(q₂.q₂)))
  2125. 135.93 s > -SCALAR_COUPLING²
  2126. 135.93 s > ·(-1/2·(2·mUVexp²-2·mass_scalar_2²+2·(q₀.q₀))/denom(3,-q₂,mUVexp²,-mUV²+(q₂.q₂))
  2127. 135.93 s > +4·(q₀.q₂)²/denom(3,-q₂,mUVexp²,-mUV²+(q₂.q₂))²
  2128. 135.93 s > )/(denom(2,q₂,mUVexp²,-mUV²+(q₂.q₂))·denom(3,-q₂,mUVexp²,-mUV²+(q₂.q₂)))
  2129. 135.93 s > )·q₀(αᵉ².¹)·q₀(αᵉ³.¹)·q₂(αᵉ².¹)·q₂(αᵉ³.¹)
  2130. 135.93 s > +2·SCALAR_COUPLING²·(q₀.q₂)·q₀(αᵉ².¹)·q₀(αᵉ³.¹)·q₂(αᵉ².¹)·q₂(αᵉ³.¹)
  2131. 135.93 s > /(t·denom(2,q₂,mUVexp²,-mUV²+(q₂.q₂))·denom(3,-q₂,mUVexp²,-mUV²+(q₂.q₂))²)
  2132. 135.93 s > -SCALAR_COUPLING²·q₀(αᵉ².¹)·q₀(αᵉ³.¹)·q₂(αᵉ².¹)·q₂(αᵉ³.¹)
  2133. 135.93 s > /(t²·denom(2,q₂,mUVexp²,-mUV²+(q₂.q₂))·denom(3,-q₂,mUVexp²,-mUV²+(q₂.q₂)))
  2134. 135.93 s > span t{span_context=true current=subgraph=y, topo_order=1, dod=2 given=subgraph=0, topo_order=0, dod=0}
  2135. 135.93 s > [2026-08-28 17:31:40.393] @approx::local_4d [{#uv, #integrated, #series}] DEBUG : Evaluated at t = 1
  2136. 135.93 s > field value
  2137. 135.93 s > res n-terms: 3, byte size: 1880,expr:
  2138. 135.93 s > (1/2·SCALAR_COUPLING²·(2·mUVexp²-2·mass_scalar_2²)/(denom(2,q₂,mUVexp²,-mUV²+(q₂.q₂))²·denom(3,-q₂,mUVexp²,-mUV²+(q₂.q₂)))
  2139. 135.93 s > -SCALAR_COUPLING²
  2140. 135.93 s > ·(-1/2·(2·mUVexp²-2·mass_scalar_2²+2·(q₀.q₀))/denom(3,-q₂,mUVexp²,-mUV²+(q₂.q₂))
  2141. 135.93 s > +4·(q₀.q₂)²/denom(3,-q₂,mUVexp²,-mUV²+(q₂.q₂))²
  2142. 135.93 s > )/(denom(2,q₂,mUVexp²,-mUV²+(q₂.q₂))·denom(3,-q₂,mUVexp²,-mUV²+(q₂.q₂)))
  2143. 135.93 s > )·q₀(αᵉ².¹)·q₀(αᵉ³.¹)·q₂(αᵉ².¹)·q₂(αᵉ³.¹)
  2144. 135.93 s > -SCALAR_COUPLING²·q₀(αᵉ².¹)·q₀(αᵉ³.¹)·q₂(αᵉ².¹)·q₂(αᵉ³.¹)
  2145. 135.93 s > /(denom(2,q₂,mUVexp²,-mUV²+(q₂.q₂))·denom(3,-q₂,mUVexp²,-mUV²+(q₂.q₂)))
  2146. 135.93 s > +2·SCALAR_COUPLING²·(q₀.q₂)·q₀(αᵉ².¹)·q₀(αᵉ³.¹)·q₂(αᵉ².¹)·q₂(αᵉ³.¹)
  2147. 135.93 s > /(denom(2,q₂,mUVexp²,-mUV²+(q₂.q₂))·denom(3,-q₂,mUVexp²,-mUV²+(q₂.q₂))²)
  2148. 135.93 s > span t{span_context=true current=subgraph=y, topo_order=1, dod=2 given=subgraph=0, topo_order=0, dod=0}
  2149. 135.93 s > [2026-08-28 17:31:40.398] @approx::local_4d [{#uv, #collect, #integrated}] DEBUG : After gamma chain collection
  2150. 135.93 s > field value
  2151. 135.93 s > expr n-terms: 3, byte size: 1880,expr:
  2152. 135.93 s > (1/2·SCALAR_COUPLING²·(2·mUVexp²-2·mass_scalar_2²)/(denom(2,q₂,mUVexp²,-mUV²+(q₂.q₂))²·denom(3,-q₂,mUVexp²,-mUV²+(q₂.q₂)))
  2153. 135.93 s > -SCALAR_COUPLING²
  2154. 135.93 s > ·(-1/2·(2·mUVexp²-2·mass_scalar_2²+2·(q₀.q₀))/denom(3,-q₂,mUVexp²,-mUV²+(q₂.q₂))
  2155. 135.93 s > +4·(q₀.q₂)²/denom(3,-q₂,mUVexp²,-mUV²+(q₂.q₂))²
  2156. 135.93 s > )/(denom(2,q₂,mUVexp²,-mUV²+(q₂.q₂))·denom(3,-q₂,mUVexp²,-mUV²+(q₂.q₂)))
  2157. 135.93 s > )·q₀(αᵉ².¹)·q₀(αᵉ³.¹)·q₂(αᵉ².¹)·q₂(αᵉ³.¹)
  2158. 135.93 s > -SCALAR_COUPLING²·q₀(αᵉ².¹)·q₀(αᵉ³.¹)·q₂(αᵉ².¹)·q₂(αᵉ³.¹)
  2159. 135.93 s > /(denom(2,q₂,mUVexp²,-mUV²+(q₂.q₂))·denom(3,-q₂,mUVexp²,-mUV²+(q₂.q₂)))
  2160. 135.93 s > +2·SCALAR_COUPLING²·(q₀.q₂)·q₀(αᵉ².¹)·q₀(αᵉ³.¹)·q₂(αᵉ².¹)·q₂(αᵉ³.¹)
  2161. 135.93 s > /(denom(2,q₂,mUVexp²,-mUV²+(q₂.q₂))·denom(3,-q₂,mUVexp²,-mUV²+(q₂.q₂))²)
  2162. 135.93 s > span t{span_context=true current=subgraph=y, topo_order=1, dod=2 given=subgraph=0, topo_order=0, dod=0}
  2163. 135.93 s > [2026-08-28 17:31:40.399] @approx::local_4d [{#profile, #uv, #collect, #integrated, #start, #trace}] DEBUG : After gamma schoonschip
  2164. 135.93 s > field value
  2165. 135.93 s > expr n-terms: 3, byte size: 1631,expr:
  2166. 135.93 s > (1/2·SCALAR_COUPLING²·(2·mUVexp²-2·mass_scalar_2²)/(denom(2,q₂,mUVexp²,-mUV²+(q₂.q₂))²·denom(3,-q₂,mUVexp²,-mUV²+(q₂.q₂)))
  2167. 135.93 s > -SCALAR_COUPLING²
  2168. 135.93 s > ·(-1/2·(2·mUVexp²-2·mass_scalar_2²+2·(q₀.q₀))/denom(3,-q₂,mUVexp²,-mUV²+(q₂.q₂))
  2169. 135.93 s > +4·(q₀.q₂)²/denom(3,-q₂,mUVexp²,-mUV²+(q₂.q₂))²
  2170. 135.93 s > )/(denom(2,q₂,mUVexp²,-mUV²+(q₂.q₂))·denom(3,-q₂,mUVexp²,-mUV²+(q₂.q₂)))
  2171. 135.93 s > )·(q₀.q₂)²
  2172. 135.93 s > -SCALAR_COUPLING²·(q₀.q₂)²/(denom(2,q₂,mUVexp²,-mUV²+(q₂.q₂))·denom(3,-q₂,mUVexp²,-mUV²+(q₂.q₂)))
  2173. 135.93 s > +2·SCALAR_COUPLING²·(q₀.q₂)·(q₀.q₂)²
  2174. 135.93 s > /(denom(2,q₂,mUVexp²,-mUV²+(q₂.q₂))·denom(3,-q₂,mUVexp²,-mUV²+(q₂.q₂))²)
  2175. 135.93 s > span t{span_context=true current=subgraph=y, topo_order=1, dod=2 given=subgraph=0, topo_order=0, dod=0}
  2176. 135.93 s > [2026-08-28 17:31:40.402] @approx::local_4d [{#profile, #uv, #collect, #integrated, #start, #trace}] DEBUG : After gamma collection
  2177. 135.93 s > field value
  2178. 135.93 s > expr n-terms: 1, byte size: 1347,expr:
  2179. 135.93 s > SCALAR_COUPLING²
  2180. 135.93 s > ·(-denom(2,q₂,mUVexp²,-mUV²+(q₂.q₂))·denom(3,-q₂,mUVexp²,-mUV²+(q₂.q₂))²
  2181. 135.93 s > +1/2·(2·mUVexp²-2·mass_scalar_2²)·denom(3,-q₂,mUVexp²,-mUV²+(q₂.q₂))²
  2182. 135.93 s > -(-1/2·(2·mUVexp²-2·mass_scalar_2²+2·(q₀.q₀))·denom(3,-q₂,mUVexp²,-mUV²+(q₂.q₂))+4·(q₀.q₂)²)
  2183. 135.93 s > ·denom(2,q₂,mUVexp²,-mUV²+(q₂.q₂))
  2184. 135.93 s > +2·(q₀.q₂)·denom(2,q₂,mUVexp²,-mUV²+(q₂.q₂))·denom(3,-q₂,mUVexp²,-mUV²+(q₂.q₂))
  2185. 135.93 s > )·(q₀.q₂)²/(denom(2,q₂,mUVexp²,-mUV²+(q₂.q₂))²·denom(3,-q₂,mUVexp²,-mUV²+(q₂.q₂))³)
  2186. 135.93 s > span t{span_context=true current=subgraph=y, topo_order=1, dod=2 given=subgraph=0, topo_order=0, dod=0}
  2187. 135.93 s > [2026-08-28 17:31:40.403] @approx::local_4d [{#profile, #uv, #gamma, #integrated, #start, #trace, #vakint}] DEBUG : After gamma simplification
  2188. 135.93 s > ... omitted 3263 more lines; see full nextest output above
  2189. 135.93 s >
  2190. 135.93 s > 8. gammaloop-integration-tests::uv::sunrise_scalar_1_uv
  2191. 135.93 s > failure: test failure with exit code 101
  2192. 135.93 s > system-out
  2193. 135.93 s > running 1 test
  2194. 135.93 s > test sunrise_scalar_1_uv has been running for over 60 seconds
  2195. 135.93 s > +------------------+------------------------+--------------+--------+----------+----------------------------------------------------------------------------------------------------------------------+-------+
  2196. 135.93 s > | case | check | graph | status | sigma | threshold | error |
  2197. 135.93 s > +------------------+------------------------+--------------+--------+----------+----------------------------------------------------------------------------------------------------------------------+-------+
  2198. 135.93 s > | sunrise_scalar_1 | uv_profile | - | FAIL | - | - | - |
  2199. 135.93 s > +------------------+------------------------+--------------+--------+----------+----------------------------------------------------------------------------------------------------------------------+-------+
  2200. 135.93 s > | sunrise_scalar_1 | m_uv.inspect | inspect | pass | - | best inspect relative delta 1.624e0 >= 1000*accuracy 1.000e-3 (accuracy=1.000e-6, exponent=+1.0, seed=1, probes=10) | - |
  2201. 135.93 s > +------------------+------------------------+--------------+--------+----------+----------------------------------------------------------------------------------------------------------------------+-------+
  2202. 135.93 s > | sunrise_scalar_1 | m_uv.integrated | sunrise | pass | 0.1sigma | compatible within 2sigma | - |
  2203. 135.93 s > +------------------+------------------------+--------------+--------+----------+----------------------------------------------------------------------------------------------------------------------+-------+
  2204. 135.93 s > | sunrise_scalar_1 | rls.inspect | inspect | pass | - | best inspect relative delta 8.682e-1 >= 1000*accuracy 1.000e-3 (accuracy=1.000e-6, exponent=+1.0, seed=1, probes=10) | - |
  2205. 135.93 s > +------------------+------------------------+--------------+--------+----------+----------------------------------------------------------------------------------------------------------------------+-------+
  2206. 135.93 s > | sunrise_scalar_1 | rls.integrated | sunrise | pass | 0.0sigma | compatible within 2sigma | - |
  2207. 135.93 s > +------------------+------------------------+--------------+--------+----------+----------------------------------------------------------------------------------------------------------------------+-------+
  2208. 135.93 s > | sunrise_scalar_1 | mu_r.inspect | inspect | pass | - | best inspect relative delta 1.752e0 >= 1000*accuracy 1.000e-3 (accuracy=1.000e-6, exponent=+1.0, seed=1, probes=10) | - |
  2209. 135.93 s > +------------------+------------------------+--------------+--------+----------+----------------------------------------------------------------------------------------------------------------------+-------+
  2210. 135.93 s > | sunrise_scalar_1 | integrated.relerr | integrated | pass | - | relative error 9.20% <= 10.00% | - |
  2211. 135.93 s > +------------------+------------------------+--------------+--------+----------+----------------------------------------------------------------------------------------------------------------------+-------+
  2212. 135.93 s > | sunrise_scalar_1 | m_uv.integrated.relerr | m_uv-shifted | pass | - | relative error 5.89% <= 10.00% | - |
  2213. 135.93 s > +------------------+------------------------+--------------+--------+----------+----------------------------------------------------------------------------------------------------------------------+-------+
  2214. 135.93 s > | sunrise_scalar_1 | target | - | pass | - | 2sigma | - |
  2215. 135.93 s > +------------------+------------------------+--------------+--------+----------+----------------------------------------------------------------------------------------------------------------------+-------+
  2216. 135.93 s > test sunrise_scalar_1_uv ... FAILED
  2217. 135.93 s >
  2218. 135.93 s > failures:
  2219. 135.93 s >
  2220. 135.93 s > failures:
  2221. 135.93 s > sunrise_scalar_1_uv
  2222. 135.93 s >
  2223. 135.93 s > test result: FAILED. 0 passed; 1 failed; 0 ignored; 0 measured; 24 filtered out; finished in 97.70s
  2224. 135.93 s > system-err
  2225. 135.93 s > [2026-08-28 17:31:45.434] @gammaloop_api::se... INFO : Running command run generate
  2226. 135.93 s > [2026-08-28 17:31:45.434] @gammaloop_api::se... INFO : Starting command block generate
  2227. 135.93 s > [2026-08-28 17:31:45.434] @gammaloop_api::se... INFO : Running command import model scalars-default.json
  2228. 135.93 s > [2026-08-28 17:31:45.434] @import::model INFO : Loading built-in JSON model scalars-default
  2229. 135.93 s > [2026-08-28 17:31:45.438] @gammalooprs::model INFO : The following 2 external parameters were forced to zero by the restriction card:
  2230. 135.93 s > width_scalar_1, width_scalar_2
  2231. 135.93 s > [2026-08-28 17:31:45.438] @gammaloop_api::se... INFO : Running command remove processes
  2232. 135.93 s > [2026-08-28 17:31:45.439] @gammaloop_api::se... INFO : Running command set global kv global.generation.uv.generate_integrated=true
  2233. 135.93 s > [2026-08-28 17:31:45.439] @gammaloop_api::se... INFO : Running command import graphs ./tests/resources/graphs/scalar_sunrise.dot -p sunrise_scalar_1 -i scalar_sunrise
  2234. 135.93 s > [2026-08-28 17:31:45.439] @commands::import INFO : Loading graphs from '/build/source/tests/resources/graphs/scalar_sunrise.dot'
  2235. 135.93 s > [2026-08-28 17:31:45.441] @gammaloop_api::se... INFO : Running command generate existing -p sunrise_scalar_1 -i scalar_sunrise
  2236. 135.93 s > [2026-08-28 17:31:45.444] @approx::local_4d [{#uv, #inspect, #integrated}] DEBUG : Rescaled momenta expanded
  2237. 135.93 s > field value
  2238. 135.93 s > res n-terms: 1, byte size: 611,expr:
  2239. 135.93 s > 1/(denom(1,q₁/t,mass_scalar_1²,-mass_scalar_1²+(q₁.q₁)/t²)
  2240. 135.93 s > ·denom(2,-q₀+q₃-q₁/t,mass_scalar_1²,
  2241. 135.93 s > -mass_scalar_1²+2·(q₀.q₁)/t-2·(q₁.q₃)/t+(q₁.q₁)/t²+(q₀.q₀)
  2242. 135.93 s > -2·(q₀.q₃)+(q₃.q₃)
  2243. 135.93 s > ))
  2244. 135.93 s > [2026-08-28 17:31:45.445] @approx::local_4d [{#uv, #inspect, #integrated}] DEBUG : Rescaled momenta expanded
  2245. 135.93 s > field value
  2246. 135.93 s > res n-terms: 1, byte size: 611,expr:
  2247. 135.93 s > 1/(denom(0,q₀/t,mass_scalar_1²,-mass_scalar_1²+(q₀.q₀)/t²)
  2248. 135.93 s > ·denom(2,-q₁+q₃-q₀/t,mass_scalar_1²,
  2249. 135.93 s > -mass_scalar_1²+2·(q₀.q₁)/t-2·(q₀.q₃)/t+(q₀.q₀)/t²+(q₁.q₁)
  2250. 135.93 s > -2·(q₁.q₃)+(q₃.q₃)
  2251. 135.93 s > ))
  2252. 135.93 s > [2026-08-28 17:31:45.448] @approx::local_4d [{#uv, #inspect, #integrated}] DEBUG : Rescaled momenta expanded
  2253. 135.93 s > field value
  2254. 135.93 s > res n-terms: 1, byte size: 3,expr:
  2255. 135.93 s > 1
  2256. 135.93 s > [2026-08-28 17:31:45.449] @approx::local_4d [{#uv, #inspect, #integrated}] DEBUG : Rescaled momenta expanded
  2257. 135.93 s > field value
  2258. 135.93 s > res n-terms: 1, byte size: 611,expr:
  2259. 135.93 s > 1/(denom(0,q₀/t,mass_scalar_1²,-mass_scalar_1²+(q₀.q₀)/t²)
  2260. 135.93 s > ·denom(1,-q₂+q₃-q₀/t,mass_scalar_1²,
  2261. 135.93 s > -mass_scalar_1²+2·(q₀.q₂)/t-2·(q₀.q₃)/t+(q₀.q₀)/t²+(q₂.q₂)
  2262. 135.93 s > -2·(q₂.q₃)+(q₃.q₃)
  2263. 135.93 s > ))
  2264. 135.93 s > [2026-08-28 17:31:45.450] @approx::local_4d [{#uv, #inspect, #integrated}] DEBUG : Rescaled momenta expanded
  2265. 135.93 s > field value
  2266. 135.93 s > res n-terms: 1, byte size: 777,expr:
  2267. 135.93 s > 1/(denom(0,q₀/t,mass_scalar_1²,-mass_scalar_1²+(q₀.q₀)/t²)·denom(1,q₁/t,mass_scalar_1²,-mass_scalar_1²+(q₁.q₁)/t²)
  2268. 135.93 s > ·denom(2,q₄-q₀/t-q₁/t,mass_scalar_1²,
  2269. 135.93 s > -mass_scalar_1²-2·(q₀.q₄)/t-2·(q₁.q₄)/t+(q₀.q₀)/t²+2·(q₀.q₁)/t²
  2270. 135.93 s > +(q₁.q₁)/t²+(q₄.q₄)
  2271. 135.93 s > ))
  2272. 135.93 s > [2026-08-28 17:31:45.452] @approx::final_integrand[{#generation, #profile, #uv, #graph, #summary}] DEBUG : Computed global numerator
  2273. 135.93 s > field value
  2274. 135.93 s > global_num n-terms: 1, byte size: 3,expr:
  2275. 135.93 s > 1
  2276. 135.93 s > span build_3d{span_context=true graph=sunrise current=subgraph=0, topo_order=0, dod=0}
  2277. 135.93 s > [2026-08-28 17:31:45.453] @uv::approx [{#generation, #uv, #fourd}] DEBUG : Computing 4D
  2278. 135.93 s > field value
  2279. 135.93 s > simple subgraph(S_47,S_3s)*Approx(subgraph(S_3s,0)) of sunrise
  2280. 135.93 s > span compute_4d{span_context=true graph=sunrise current=subgraph=3s, topo_order=1, dod=0 given=subgraph=0, topo_order=0, dod=0 reduced=SubSet { set: BitVec<usize, bitvec::order::Lsb0> { addr: 0x7fffec0124f0, head: 000000, bits: 8, capacity: 64 } [0, 0, 0, 0, 1, 1, 1, 1], id: PhantomData<linnet::half_edge::involution::Hedge> }}
  2281. 135.93 s > [2026-08-28 17:31:45.454] @approx::local_4d [{#uv, #algebra, #integrated, #start}] DEBUG :
  2282. 135.93 s > field value
  2283. 135.93 s > integrand n-terms: 1, byte size: 217,expr:
  2284. 135.93 s > 1/(denom(1,q₁,mass_scalar_1²,-mass_scalar_1²+(q₁.q₁))·denom(2,q₂,mass_scalar_1²,-mass_scalar_1²+(q₂.q₂)))
  2285. 135.93 s > reduced 3s
  2286. 135.93 s > span grow{span_context=true current=subgraph=3s, topo_order=1, dod=0 given=subgraph=0, topo_order=0, dod=0}
  2287. 135.93 s > [2026-08-28 17:31:45.454] @approx::local_4d [{#uv, #inspect, #integrated}] DEBUG : Rescaled momenta expanded
  2288. 135.93 s > field value
  2289. 135.93 s > res n-terms: 1, byte size: 611,expr:
  2290. 135.93 s > 1/(denom(1,q₁/t,mass_scalar_1²,-mass_scalar_1²+(q₁.q₁)/t²)
  2291. 135.93 s > ·denom(2,-q₀+q₃-q₁/t,mass_scalar_1²,
  2292. 135.93 s > -mass_scalar_1²+2·(q₀.q₁)/t-2·(q₁.q₃)/t+(q₁.q₁)/t²+(q₀.q₀)
  2293. 135.93 s > -2·(q₀.q₃)+(q₃.q₃)
  2294. 135.93 s > ))
  2295. 135.93 s > span t{span_context=true current=subgraph=3s, topo_order=1, dod=0 given=subgraph=0, topo_order=0, dod=0}
  2296. 135.93 s > [2026-08-28 17:31:45.454] @approx::local_4d [{#uv, #integrated, #rescaled}] DEBUG : Rescaled expanded
  2297. 135.93 s > field value
  2298. 135.93 s > n_loops 1
  2299. 135.93 s > res n-terms: 1, byte size: 723,expr:
  2300. 135.93 s > 1/(denom(1,q₁,mUVexp²+t²·mass_scalar_1²,-mUV²+t²·(-mass_scalar_1²+(q₁.q₁)/t²)+t²·mUVexp²)
  2301. 135.93 s > ·denom(2,-q₁,mUVexp²+t²·mass_scalar_1²,
  2302. 135.93 s > -mUV²
  2303. 135.93 s > +t²
  2304. 135.93 s > ·(-mass_scalar_1²+2·(q₀.q₁)/t-2·(q₁.q₃)/t+(q₁.q₁)/t²+(q₀.q₀)
  2305. 135.93 s > -2·(q₀.q₃)+(q₃.q₃)
  2306. 135.93 s > )
  2307. 135.93 s > +t²·mUVexp²
  2308. 135.93 s > ))
  2309. 135.93 s > span t{span_context=true current=subgraph=3s, topo_order=1, dod=0 given=subgraph=0, topo_order=0, dod=0}
  2310. 135.93 s > [2026-08-28 17:31:45.455] @approx::local_4d [{#uv, #integrated, #series}] DEBUG : Series expanded
  2311. 135.93 s > field value
  2312. 135.93 s > res n-terms: 1, byte size: 223,expr:
  2313. 135.93 s > 1/(denom(1,q₁,mUVexp²,-mUV²+(q₁.q₁))·denom(2,-q₁,mUVexp²,-mUV²+(q₁.q₁)))
  2314. 135.93 s > span t{span_context=true current=subgraph=3s, topo_order=1, dod=0 given=subgraph=0, topo_order=0, dod=0}
  2315. 135.93 s > [2026-08-28 17:31:45.455] @approx::local_4d [{#uv, #integrated, #series}] DEBUG : Evaluated at t = 1
  2316. 135.93 s > field value
  2317. 135.93 s > res n-terms: 1, byte size: 223,expr:
  2318. 135.93 s > 1/(denom(1,q₁,mUVexp²,-mUV²+(q₁.q₁))·denom(2,-q₁,mUVexp²,-mUV²+(q₁.q₁)))
  2319. 135.93 s > span t{span_context=true current=subgraph=3s, topo_order=1, dod=0 given=subgraph=0, topo_order=0, dod=0}
  2320. 135.93 s > [2026-08-28 17:31:45.455] @approx::local_4d [{#uv, #collect, #integrated}] DEBUG : After gamma chain collection
  2321. 135.93 s > field value
  2322. 135.93 s > expr n-terms: 1, byte size: 223,expr:
  2323. 135.93 s > 1/(denom(1,q₁,mUVexp²,-mUV²+(q₁.q₁))·denom(2,-q₁,mUVexp²,-mUV²+(q₁.q₁)))
  2324. 135.93 s > span t{span_context=true current=subgraph=3s, topo_order=1, dod=0 given=subgraph=0, topo_order=0, dod=0}
  2325. 135.93 s > [2026-08-28 17:31:45.455] @approx::local_4d [{#profile, #uv, #collect, #integrated, #start, #trace}] DEBUG : After gamma schoonschip
  2326. 135.93 s > field value
  2327. 135.93 s > expr n-terms: 1, byte size: 223,expr:
  2328. 135.93 s > 1/(denom(1,q₁,mUVexp²,-mUV²+(q₁.q₁))·denom(2,-q₁,mUVexp²,-mUV²+(q₁.q₁)))
  2329. 135.93 s > span t{span_context=true current=subgraph=3s, topo_order=1, dod=0 given=subgraph=0, topo_order=0, dod=0}
  2330. 135.93 s > [2026-08-28 17:31:45.456] @approx::local_4d [{#profile, #uv, #collect, #integrated, #start, #trace}] DEBUG : After gamma collection
  2331. 135.93 s > field value
  2332. 135.93 s > expr n-terms: 1, byte size: 223,expr:
  2333. 135.93 s > 1/(denom(1,q₁,mUVexp²,-mUV²+(q₁.q₁))·denom(2,-q₁,mUVexp²,-mUV²+(q₁.q₁)))
  2334. 135.93 s > span t{span_context=true current=subgraph=3s, topo_order=1, dod=0 given=subgraph=0, topo_order=0, dod=0}
  2335. 135.93 s > [2026-08-28 17:31:45.456] @approx::local_4d [{#profile, #uv, #gamma, #integrated, #start, #trace, #vakint}] DEBUG : After gamma simplification
  2336. 135.93 s > field value
  2337. 135.93 s > expr n-terms: 1, byte size: 223,expr:
  2338. 135.93 s > 1/(denom(1,q₁,mUVexp²,-mUV²+(q₁.q₁))·denom(2,-q₁,mUVexp²,-mUV²+(q₁.q₁)))
  2339. 135.93 s > span t{span_context=true current=subgraph=3s, topo_order=1, dod=0 given=subgraph=0, topo_order=0, dod=0}
  2340. 135.93 s > [2026-08-28 17:31:45.456] @approx::local_4d [{#profile, #uv, #integrated, #schoonschip, #start, #trace, #vakint}] DEBUG : After Schoonschip net
  2341. 135.93 s > field value
  2342. 135.93 s > expr n-terms: 1, byte size: 223,expr:
  2343. 135.93 s > 1/(denom(1,q₁,mUVexp²,-mUV²+(q₁.q₁))·denom(2,-q₁,mUVexp²,-mUV²+(q₁.q₁)))
  2344. 135.93 s > ... omitted 20090 more lines; see full nextest output above
  2345. 135.93 s >
  2346. 135.93 s > 9. gammaloop-integration-tests::uv::se1l_uv
  2347. 135.93 s > failure: test failure with exit code 101
  2348. 135.93 s > system-out
  2349. 135.93 s > running 1 test
  2350. 135.93 s > test se1l_uv has been running for over 60 seconds
  2351. 135.93 s > +------+-----------------+---------+--------+----------+-----------------------------------------------------------------------------------------------------------------------+-------+
  2352. 135.93 s > | case | check | graph | status | sigma | threshold | error |
  2353. 135.93 s > +------+-----------------+---------+--------+----------+-----------------------------------------------------------------------------------------------------------------------+-------+
  2354. 135.93 s > | se1l | uv_profile | - | FAIL | - | - | - |
  2355. 135.93 s > +------+-----------------+---------+--------+----------+-----------------------------------------------------------------------------------------------------------------------+-------+
  2356. 135.93 s > | se1l | m_uv.inspect | inspect | pass | - | best inspect relative delta 1.097e-1 >= 1000*accuracy 1.000e-7 (accuracy=1.000e-10, exponent=+2.0, seed=1, probes=10) | - |
  2357. 135.93 s > +------+-----------------+---------+--------+----------+-----------------------------------------------------------------------------------------------------------------------+-------+
  2358. 135.93 s > | se1l | m_uv.integrated | se1l | pass | 0.1sigma | compatible within 2sigma | - |
  2359. 135.93 s > +------+-----------------+---------+--------+----------+-----------------------------------------------------------------------------------------------------------------------+-------+
  2360. 135.93 s > | se1l | rls.inspect | inspect | pass | - | best inspect relative delta 4.499e-2 >= 1000*accuracy 1.000e-7 (accuracy=1.000e-10, exponent=+2.0, seed=1, probes=10) | - |
  2361. 135.93 s > +------+-----------------+---------+--------+----------+-----------------------------------------------------------------------------------------------------------------------+-------+
  2362. 135.93 s > | se1l | rls.integrated | se1l | pass | 0.0sigma | compatible within 2sigma | - |
  2363. 135.93 s > +------+-----------------+---------+--------+----------+-----------------------------------------------------------------------------------------------------------------------+-------+
  2364. 135.93 s > | se1l | mu_r.inspect | inspect | pass | - | best inspect relative delta 1.424e-1 >= 1000*accuracy 1.000e-7 (accuracy=1.000e-10, exponent=+2.0, seed=1, probes=10) | - |
  2365. 135.93 s > +------+-----------------+---------+--------+----------+-----------------------------------------------------------------------------------------------------------------------+-------+
  2366. 135.93 s > | se1l | target | - | pass | - | 2sigma | - |
  2367. 135.93 s > +------+-----------------+---------+--------+----------+-----------------------------------------------------------------------------------------------------------------------+-------+
  2368. 135.93 s > test se1l_uv ... FAILED
  2369. 135.93 s >
  2370. 135.93 s > failures:
  2371. 135.93 s >
  2372. 135.93 s > failures:
  2373. 135.93 s > se1l_uv
  2374. 135.93 s >
  2375. 135.93 s > test result: FAILED. 0 passed; 1 failed; 0 ignored; 0 measured; 24 filtered out; finished in 106.23s
  2376. 135.93 s > system-err
  2377. 135.93 s > [2026-08-28 17:31:44.766] @gammaloop_api::se... INFO : Running command run generate
  2378. 135.93 s > [2026-08-28 17:31:44.766] @gammaloop_api::se... INFO : Starting command block generate
  2379. 135.93 s > [2026-08-28 17:31:44.767] @gammaloop_api::se... INFO : Running command import model sm-default
  2380. 135.93 s > [2026-08-28 17:31:44.767] @import::model INFO : Loading built-in JSON model sm-default
  2381. 135.93 s > [2026-08-28 17:31:44.816] @gammalooprs::model INFO : The following 11 external parameters were forced to zero by the restriction card:
  2382. 135.93 s > lamWS, AWS, rhoWS, etaWS, ymc, yme, ymm, MC, Me, MM, WTau
  2383. 135.93 s > [2026-08-28 17:31:44.816] @gammalooprs::model INFO : The following 34 vertex rules were removed by the restriction card:
  2384. 135.93 s > V_82 -> (c~, d, G+) | V_83 -> (t~, d, G+) | V_84 -> (c~, s, G+) | V_85 -> (t~, s, G+) | V_86 -> (u~, b, G+) | V_87 -> (c~, b, G+) | V_90 -> (c~, d, W+) | V_91 -> (t~, d, W+) | V_92 -> (u~, s, W+) | V_94 -> (t~, s, W+) | V_95 -> (u~, b, W+) | V_96 -> (c~, b, W+) | V_101 -> (e+, e-, G0) | V_102 -> (mu+, mu-, G0) | V_104 -> (e+, e-, H) | V_105 -> (mu+, mu-, H) | V_110 -> (ve~, e-, G+) | V_111 -> (vm~, mu-, G+) | V_116 -> (b~, u, G-) | V_117 -> (d~, c, G-) | V_118 -> (s~, c, G-) | V_119 -> (b~, c, G-) | V_120 -> (d~, t, G-) | V_121 -> (s~, t, G-) | V_124 -> (s~, u, W-) | V_125 -> (b~, u, W-) | V_126 -> (d~, c, W-) | V_128 -> (b~, c, W-) | V_129 -> (d~, t, W-) | V_130 -> (s~, t, W-) | V_138 -> (c~, c, G0) | V_140 -> (c~, c, H) | V_145 -> (e+, ve, G-) | V_146 -> (mu+, vm, G-)
  2385. 135.93 s > [2026-08-28 17:31:44.816] @gammalooprs::model INFO : The following 36 couplings were removed by the restriction card:
  2386. 135.93 s > GC_13, GC_14, GC_16, GC_17, GC_18, GC_19, GC_20, GC_22, GC_23, GC_24, GC_25, GC_26, GC_28, GC_29, GC_42, GC_43, GC_44, GC_46, GC_47, GC_48, GC_84, GC_85, GC_86, GC_87, GC_88, GC_89, GC_90, GC_91, GC_92, GC_93, GC_101, GC_102, GC_103, GC_105, GC_106, GC_107
  2387. 135.93 s > [2026-08-28 17:31:44.820] @gammaloop_api::se... INFO : Running command remove processes
  2388. 135.93 s > [2026-08-28 17:31:44.820] @gammaloop_api::se... INFO : Running command set global kv global.generation.uv.generate_integrated=true
  2389. 135.93 s > [2026-08-28 17:31:44.820] @gammaloop_api::se... INFO : Running command import graphs ./tests/resources/graphs/uv_tests/se1l.dot -p se1l -i se1l
  2390. 135.93 s > [2026-08-28 17:31:44.820] @commands::import INFO : Loading graphs from '/build/source/tests/resources/graphs/uv_tests/se1l.dot'
  2391. 135.93 s > [2026-08-28 17:31:44.826] @gammaloop_api::se... INFO : Running command generate existing -p se1l -i se1l
  2392. 135.93 s > [2026-08-28 17:31:46.328] @commands::generate INFO :
  2393. 135.93 s > Integrand generation summary
  2394. 135.93 s > peak RAM 89.73 MiB | cores 1
  2395. 135.93 s > ╭───────────┬───────┬─────────┬─────────────┬─────────────┬────────────────┬─────────────╮
  2396. 135.93 s > │ integrand │ graph │ # evals │ expr build │ spenso │ symbolica eval │ compile │
  2397. 135.93 s > ├───────────┼───────┼─────────┼─────────────┼─────────────┼────────────────┼─────────────┤
  2398. 135.93 s > │ se1l │ se1l │ 5 │ 1.28s (87%) │ 73ms (5.0%) │ 117ms (8.0%) │ 0ms (0.00%) │
  2399. 135.93 s > ├───────────┼───────┼─────────┼─────────────┼─────────────┼────────────────┼─────────────┤
  2400. 135.93 s > │ Total │ │ 5 │ 1.28s (87%) │ 73ms (5.0%) │ 117ms (8.0%) │ 0ms (0.00%) │
  2401. 135.93 s > ╰───────────┴───────┴─────────┴─────────────┴─────────────┴────────────────┴─────────────╯
  2402. 135.93 s > [2026-08-28 17:31:46.329] @gammaloop_api::se... INFO : Running command set process -p se1l -i se1l kv general.m_uv=0.2
  2403. 135.93 s > [2026-08-28 17:31:46.329] @gammaloop_api::se... INFO : Running command set process -p se1l -i se1l kv general.mu_r=0.2
  2404. 135.93 s > [2026-08-28 17:31:46.330] @gammaloop_api::se... INFO : Running command set process -p se1l -i se1l kv general.renormalization_localization_scale=0.2
  2405. 135.93 s > [2026-08-28 17:31:46.331] @gammaloop_api::se... INFO : Running command duplicate integrand -p se1l -i se1l --output_process_name se1l --output_integrand_name se1l_muv_shifted
  2406. 135.93 s > [2026-08-28 17:31:46.332] @gammaloop_api::se... INFO : Running command set process -p se1l -i se1l_muv_shifted kv general.m_uv=0.5
  2407. 135.93 s > [2026-08-28 17:31:46.333] @gammaloop_api::se... INFO : Running command duplicate integrand -p se1l -i se1l --output_process_name se1l --output_integrand_name se1l_rls_shifted
  2408. 135.93 s > [2026-08-28 17:31:46.338] @gammaloop_api::se... INFO : Running command set process -p se1l -i se1l_rls_shifted kv general.renormalization_localization_scale=1
  2409. 135.93 s > [2026-08-28 17:31:46.339] @gammaloop_api::se... INFO : Running command duplicate integrand -p se1l -i se1l --output_process_name se1l --output_integrand_name se1l_mur_shifted
  2410. 135.93 s > [2026-08-28 17:31:46.344] @gammaloop_api::se... INFO : Running command set process -p se1l -i se1l_mur_shifted kv general.mu_r=0.8
  2411. 135.93 s > [2026-08-28 17:31:46.356] @process::amplitude WARNING : External state 0 ('g', PDG 21, helicity +) is off shell: p^2 = +2.5e5, expected m^2 = +0e0 (|Δ| = +2.5e5). Fixed-helicity spinor/vector/tensor external states may be ill-defined at this kinematic point.
  2412. 135.93 s > field value
  2413. 135.93 s > span warm_up{integrand.name=se1l}
  2414. 135.93 s > [2026-08-28 17:31:46.356] @process::amplitude WARNING : External state 1 ('g', PDG 21, helicity -) is off shell: p^2 = +2.5e5, expected m^2 = +0e0 (|Δ| = +2.5e5). Fixed-helicity spinor/vector/tensor external states may be ill-defined at this kinematic point.
  2415. 135.93 s > field value
  2416. 135.93 s > span warm_up{integrand.name=se1l}
  2417. 135.93 s > [2026-08-28 17:31:46.356] @process::amplitude INFO : Input is above threshold: 1 existing threshold E-surfaces across 1/1 graph groups
  2418. 135.93 s > field value
  2419. 135.93 s > existing_esurfaces 1
  2420. 135.93 s > group_count 1
  2421. 135.93 s > groups_above_threshold 1
  2422. 135.93 s > integrand se1l
  2423. 135.93 s > span warm_up{integrand.name=se1l}
  2424. 135.93 s > threshold_status above threshold
  2425. 135.93 s > [2026-08-28 17:31:46.356] @process::amplitude INFO : overlap structure of group 0: [1: [0(2,3)]]
  2426. 135.93 s > field value
  2427. 135.93 s > span warm_up{integrand.name=se1l}
  2428. 135.93 s > [2026-08-28 17:31:46.623] @commands::profile INFO :
  2429. 135.93 s > ╭───────┬──────┬──────────┬───────┬─────┬──────────┬───────────╮
  2430. 135.93 s > │ fixed │ → ∞ │ slope │ r2 │ DOD │ bare DOD │ inspect │
  2431. 135.93 s > ├───────┼──────┼──────────┼───────┼─────┼──────────┼───────────┤
  2432. 135.93 s > │ {} │ {e3} │ 1.639236 │ 0.904 │ 2 │ 2 │ arb retry │
  2433. 135.93 s > │ {} │ {e2} │ 1.698834 │ 0.902 │ 2 │ 2 │ arb retry │
  2434. 135.93 s > ╰───────┴──────┴──────────┴───────┴─────┴──────────┴───────────╯
  2435. 135.93 s > [2026-08-28 17:31:46.623] @commands::profile INFO :
  2436. 135.93 s > ╭───────┬──────┬─────────────┬──────────┬───────┬─────┬──────────┬───────────╮
  2437. 135.93 s > │ fixed │ → ∞ │ orientation │ slope │ r2 │ DOD │ bare DOD │ inspect │
  2438. 135.93 s > ├───────┼──────┼─────────────┼──────────┼───────┼─────┼──────────┼───────────┤
  2439. 135.93 s > │ {} │ {e3} │ 00-+ │ 0.343429 │ 0.145 │ 0 │ 2 │ arb retry │
  2440. 135.93 s > │ {} │ {e3} │ 00+- │ 0.342577 │ 0.135 │ 0 │ 2 │ arb retry │
  2441. 135.93 s > │ {} │ {e2} │ 00-+ │ 0.385975 │ 0.161 │ 0 │ 2 │ arb retry │
  2442. 135.93 s > │ {} │ {e2} │ 00+- │ 0.384920 │ 0.192 │ 0 │ 2 │ arb retry │
  2443. 135.93 s > ╰───────┴──────┴─────────────┴──────────┴───────┴─────┴──────────┴───────────╯
  2444. 135.93 s > [2026-08-28 17:31:46.624] @gammaloop_api::se... INFO : Running command set process kv integrator.target_relative_accuracy=0.001 integrator.n_increase=0 integrator.n_start=50000 integrator.n_max=400000 integrator.seed=1337
  2445. 135.93 s > [2026-08-28 17:31:46.628] @commands::integrate INFO : Created workspace directory at /build/source/tests/artifacts/se1l/integration_workspace_se1l
  2446. 135.93 s > [2026-08-28 17:31:46.654] @commands::integrate INFO : No integration state found, starting new integration
  2447. 135.93 s > [2026-08-28 17:31:46.654] @commands::integrate INFO : Gammaloop now integrates se1l@se1l, se1l@se1l_muv_shifted, se1l@se1l_rls_shifted
  2448. 135.93 s > [2026-08-28 17:31:46.655] @process::amplitude WARNING : External state 0 ('g', PDG 21, helicity +) is off shell: p^2 = +2.5e5, expected m^2 = +0e0 (|Δ| = +2.5e5). Fixed-helicity spinor/vector/tensor external states may be ill-defined at this kinematic point.
  2449. 135.93 s > field value
  2450. 135.93 s > span warm_up{integrand.name=se1l}
  2451. 135.93 s > [2026-08-28 17:31:46.655] @process::amplitude WARNING : External state 1 ('g', PDG 21, helicity -) is off shell: p^2 = +2.5e5, expected m^2 = +0e0 (|Δ| = +2.5e5). Fixed-helicity spinor/vector/tensor external states may be ill-defined at this kinematic point.
  2452. 135.93 s > field value
  2453. 135.93 s > span warm_up{integrand.name=se1l}
  2454. 135.93 s > [2026-08-28 17:31:46.655] @process::amplitude INFO : Input is above threshold: 1 existing threshold E-surfaces across 1/1 graph groups
  2455. 135.93 s > field value
  2456. 135.93 s > existing_esurfaces 1
  2457. 135.93 s > group_count 1
  2458. 135.93 s > groups_above_threshold 1
  2459. 135.93 s > integrand se1l
  2460. 135.93 s > span warm_up{integrand.name=se1l}
  2461. 135.93 s > threshold_status above threshold
  2462. 135.93 s > [2026-08-28 17:31:46.655] @process::amplitude INFO : overlap structure of group 0: [1: [0(2,3)]]
  2463. 135.93 s > field value
  2464. 135.93 s > span warm_up{integrand.name=se1l}
  2465. 135.93 s > [2026-08-28 17:31:46.657] @process::amplitude WARNING : External state 0 ('g', PDG 21, helicity +) is off shell: p^2 = +2.5e5, expected m^2 = +0e0 (|Δ| = +2.5e5). Fixed-helicity spinor/vector/tensor external states may be ill-defined at this kinematic point.
  2466. 135.93 s > field value
  2467. 135.93 s > span warm_up{integrand.name=se1l_muv_shifted}
  2468. 135.93 s > [2026-08-28 17:31:46.657] @process::amplitude WARNING : External state 1 ('g', PDG 21, helicity -) is off shell: p^2 = +2.5e5, expected m^2 = +0e0 (|Δ| = +2.5e5). Fixed-helicity spinor/vector/tensor external states may be ill-defined at this kinematic point.
  2469. 135.93 s > field value
  2470. 135.93 s > span warm_up{integrand.name=se1l_muv_shifted}
  2471. 135.93 s > [2026-08-28 17:31:46.657] @process::amplitude INFO : Input is above threshold: 1 existing threshold E-surfaces across 1/1 graph groups
  2472. 135.93 s > field value
  2473. 135.93 s > existing_esurfaces 1
  2474. 135.93 s > group_count 1
  2475. 135.93 s > groups_above_threshold 1
  2476. 135.93 s > integrand se1l_muv_shifted
  2477. 135.93 s > span warm_up{integrand.name=se1l_muv_shifted}
  2478. 135.93 s > threshold_status above threshold
  2479. 135.93 s > [2026-08-28 17:31:46.657] @process::amplitude INFO : overlap structure of group 0: [1: [0(2,3)]]
  2480. 135.93 s > field value
  2481. 135.93 s > span warm_up{integrand.name=se1l_muv_shifted}
  2482. 135.93 s > [2026-08-28 17:31:46.659] @process::amplitude WARNING : External state 0 ('g', PDG 21, helicity +) is off shell: p^2 = +2.5e5, expected m^2 = +0e0 (|Δ| = +2.5e5). Fixed-helicity spinor/vector/tensor external states may be ill-defined at this kinematic point.
  2483. 135.93 s > field value
  2484. 135.93 s > span warm_up{integrand.name=se1l_rls_shifted}
  2485. 135.93 s > [2026-08-28 17:31:46.659] @process::amplitude WARNING : External state 1 ('g', PDG 21, helicity -) is off shell: p^2 = +2.5e5, expected m^2 = +0e0 (|Δ| = +2.5e5). Fixed-helicity spinor/vector/tensor external states may be ill-defined at this kinematic point.
  2486. 135.93 s > field value
  2487. 135.93 s > span warm_up{integrand.name=se1l_rls_shifted}
  2488. 135.93 s > [2026-08-28 17:31:46.659] @process::amplitude INFO : Input is above threshold: 1 existing threshold E-surfaces across 1/1 graph groups
  2489. 135.93 s > field value
  2490. 135.93 s > existing_esurfaces 1
  2491. 135.93 s > group_count 1
  2492. 135.93 s > groups_above_threshold 1
  2493. 135.93 s > integrand se1l_rls_shifted
  2494. 135.93 s > span warm_up{integrand.name=se1l_rls_shifted}
  2495. 135.93 s > threshold_status above threshold
  2496. 135.93 s > ... omitted 1410 more lines; see full nextest output above
  2497. 135.93 s > =========================================
  2498. 135.93 s For full logs, run:
  2499. 135.93 s nix log /nix/store/5lvckp7qh3dqs2nqf61qj4kz6kj46p4q-gammaloop-nextest-integration.drv
  2500. 136.03 s [0 built (1 failed)]Run failed.