test packages.x86_64-linux.nix-ci-check-gammaloop-nextest-core

Reproduce this run
Original Run
  1. 0.14 s $ /nix/store/9ypz3flqsrl5xl495mm8h645gadjsxi1-coreutils-9.11/bin/timeout --kill-after=15s 7200s /nix/store/23zk8sgzamrbmj1fday15szf7f2279s8-nix-2.34.7/bin/nix --extra-experimental-features nix-command --extra-experimental-features flakes flake clone git+https://github.com/alphal00p/gammaloop --dest /tmp/nix-ci-worker/stable-pwd/repo/
  2. 0.20 s Cloning into '/tmp/nix-ci-worker/stable-pwd/repo'...
  3. 1.03 s remote: Enumerating objects: 64182, done.
  4. 1.27 s remote: Counting objects: 0% (1/9548) remote: Counting objects: 1% (96/9548) remote: Counting objects: 2% (191/9548) remote: Counting objects: 3% (287/9548) remote: Counting objects: 4% (382/9548) remote: Counting objects: 5% (478/9548) remote: Counting objects: 6% (573/9548) remote: Counting objects: 7% (669/9548) remote: Counting objects: 8% (764/9548) remote: Counting objects: 9% (860/9548) remote: Counting objects: 10% (955/9548) remote: Counting objects: 11% (1051/9548) remote: Counting objects: 12% (1146/9548) remote: Counting objects: 13% (1242/9548) remote: Counting objects: 14% (1337/9548) remote: Counting objects: 15% (1433/9548) remote: Counting objects: 16% (1528/9548) remote: Counting objects: 17% (1624/9548) remote: Counting objects: 18% (1719/9548) remote: Counting objects: 19% (1815/9548) remote: Counting objects: 20% (1910/9548) remote: Counting objects: 21% (2006/9548) remote: Counting objects: 22% (2101/9548) remote: Counting objects: 23% (2197/9548) remote: Counting objects: 24% (2292/9548) remote: Counting objects: 25% (2387/9548) remote: Counting objects: 26% (2483/9548) remote: Counting objects: 27% (2578/9548) remote: Counting objects: 28% (2674/9548) remote: Counting objects: 29% (2769/9548) remote: Counting objects: 30% (2865/9548) remote: Counting objects: 31% (2960/9548) remote: Counting objects: 32% (3056/9548) remote: Counting objects: 33% (3151/9548) remote: Counting objects: 34% (3247/9548) remote: Counting objects: 35% (3342/9548) remote: Counting objects: 36% (3438/9548) remote: Counting objects: 37% (3533/9548) remote: Counting objects: 38% (3629/9548) remote: Counting objects: 39% (3724/9548) remote: Counting objects: 40% (3820/9548) remote: Counting objects: 41% (3915/9548) remote: Counting objects: 42% (4011/9548) remote: Counting objects: 43% (4106/9548) remote: Counting objects: 44% (4202/9548) remote: Counting objects: 45% (4297/9548) remote: Counting objects: 46% (4393/9548) remote: Counting objects: 47% (4488/9548) remote: Counting objects: 48% (4584/9548) remote: Counting objects: 49% (4679/9548) remote: Counting objects: 50% (4774/9548) remote: Counting objects: 51% (4870/9548) remote: Counting objects: 52% (4965/9548) remote: Counting objects: 53% (5061/9548) remote: Counting objects: 54% (5156/9548) remote: Counting objects: 55% (5252/9548) remote: Counting objects: 56% (5347/9548) remote: Counting objects: 57% (5443/9548) remote: Counting objects: 58% (5538/9548) remote: Counting objects: 59% (5634/9548) remote: Counting objects: 60% (5729/9548) remote: Counting objects: 61% (5825/9548) remote: Counting objects: 62% (5920/9548) remote: Counting objects: 63% (6016/9548) remote: Counting objects: 64% (6111/9548) remote: Counting objects: 65% (6207/9548) remote: Counting objects: 66% (6302/9548) remote: Counting objects: 67% (6398/9548) remote: Counting objects: 68% (6493/9548) remote: Counting objects: 69% (6589/9548) remote: Counting objects: 70% (6684/9548) remote: Counting objects: 71% (6780/9548) remote: Counting objects: 72% (6875/9548) remote: Counting objects: 73% (6971/9548) remote: Counting objects: 74% (7066/9548) remote: Counting objects: 75% (7161/9548) remote: Counting objects: 76% (7257/9548) remote: Counting objects: 77% (7352/9548) remote: Counting objects: 78% (7448/9548) remote: Counting objects: 79% (7543/9548) remote: Counting objects: 80% (7639/9548) remote: Counting objects: 81% (7734/9548) remote: Counting objects: 82% (7830/9548) remote: Counting objects: 83% (7925/9548) remote: Counting objects: 84% (8021/9548) remote: Counting objects: 85% (8116/9548) remote: Counting objects: 86% (8212/9548) remote: Counting objects: 87% (8307/9548) remote: Counting objects: 88% (8403/9548) remote: Counting objects: 89% (8498/9548) remote: Counting objects: 90% (8594/9548) remote: Counting objects: 91% (8689/9548) remote: Counting objects: 92% (8785/9548) remote: Counting objects: 93% (8880/9548) remote: Counting objects: 94% (8976/9548) remote: Counting objects: 95% (9071/9548) remote: Counting objects: 96% (9167/9548) remote: Counting objects: 97% (9262/9548) remote: Counting objects: 98% (9358/9548) remote: Counting objects: 99% (9453/9548) remote: Counting objects: 100% (9548/9548) remote: Counting objects: 100% (9548/9548), done.
  5. 3.47 s remote: Compressing objects: 0% (1/2325) remote: Compressing objects: 1% (24/2325) remote: Compressing objects: 2% (47/2325) remote: Compressing objects: 3% (70/2325) remote: Compressing objects: 4% (93/2325) remote: Compressing objects: 5% (117/2325) remote: Compressing objects: 6% (140/2325) remote: Compressing objects: 7% (163/2325) remote: Compressing objects: 8% (186/2325) remote: Compressing objects: 9% (210/2325) remote: Compressing objects: 10% (233/2325) remote: Compressing objects: 11% (256/2325) remote: Compressing objects: 12% (279/2325) remote: Compressing objects: 13% (303/2325) remote: Compressing objects: 14% (326/2325) remote: Compressing objects: 15% (349/2325) remote: Compressing objects: 16% (372/2325) remote: Compressing objects: 17% (396/2325) remote: Compressing objects: 18% (419/2325) remote: Compressing objects: 19% (442/2325) remote: Compressing objects: 20% (465/2325) remote: Compressing objects: 21% (489/2325) remote: Compressing objects: 22% (512/2325) remote: Compressing objects: 23% (535/2325) remote: Compressing objects: 23% (552/2325) remote: Compressing objects: 24% (558/2325) remote: Compressing objects: 25% (582/2325) remote: Compressing objects: 26% (605/2325) remote: Compressing objects: 27% (628/2325) remote: Compressing objects: 28% (651/2325) remote: Compressing objects: 29% (675/2325) remote: Compressing objects: 30% (698/2325) remote: Compressing objects: 31% (721/2325) remote: Compressing objects: 31% (733/2325) remote: Compressing objects: 32% (744/2325) remote: Compressing objects: 33% (768/2325) remote: Compressing objects: 34% (791/2325) remote: Compressing objects: 35% (814/2325) remote: Compressing objects: 36% (837/2325) remote: Compressing objects: 37% (861/2325) remote: Compressing objects: 38% (884/2325) remote: Compressing objects: 39% (907/2325) remote: Compressing objects: 40% (930/2325) remote: Compressing objects: 41% (954/2325) remote: Compressing objects: 42% (977/2325) remote: Compressing objects: 43% (1000/2325) remote: Compressing objects: 44% (1023/2325) remote: Compressing objects: 45% (1047/2325) remote: Compressing objects: 46% (1070/2325) remote: Compressing objects: 47% (1093/2325) remote: Compressing objects: 48% (1116/2325) remote: Compressing objects: 49% (1140/2325) remote: Compressing objects: 50% (1163/2325) remote: Compressing objects: 51% (1186/2325) remote: Compressing objects: 52% (1209/2325) remote: Compressing objects: 53% (1233/2325) remote: Compressing objects: 54% (1256/2325) remote: Compressing objects: 55% (1279/2325) remote: Compressing objects: 56% (1302/2325) remote: Compressing objects: 57% (1326/2325) remote: Compressing objects: 58% (1349/2325) remote: Compressing objects: 59% (1372/2325) remote: Compressing objects: 60% (1395/2325) remote: Compressing objects: 61% (1419/2325) remote: Compressing objects: 62% (1442/2325) remote: Compressing objects: 63% (1465/2325) remote: Compressing objects: 64% (1488/2325) remote: Compressing objects: 65% (1512/2325) remote: Compressing objects: 66% (1535/2325) remote: Compressing objects: 67% (1558/2325) remote: Compressing objects: 68% (1581/2325) remote: Compressing objects: 69% (1605/2325) remote: Compressing objects: 70% (1628/2325) remote: Compressing objects: 71% (1651/2325) remote: Compressing objects: 72% (1674/2325) remote: Compressing objects: 73% (1698/2325) remote: Compressing objects: 74% (1721/2325) remote: Compressing objects: 75% (1744/2325) remote: Compressing objects: 76% (1767/2325) remote: Compressing objects: 77% (1791/2325) remote: Compressing objects: 78% (1814/2325) remote: Compressing objects: 79% (1837/2325) remote: Compressing objects: 80% (1860/2325) remote: Compressing objects: 81% (1884/2325) remote: Compressing objects: 82% (1907/2325) remote: Compressing objects: 83% (1930/2325) remote: Compressing objects: 84% (1953/2325) remote: Compressing objects: 85% (1977/2325) remote: Compressing objects: 86% (2000/2325) remote: Compressing objects: 87% (2023/2325) remote: Compressing objects: 88% (2046/2325) remote: Compressing objects: 89% (2070/2325) remote: Compressing objects: 90% (2093/2325) remote: Compressing objects: 91% (2116/2325) remote: Compressing objects: 92% (2139/2325) remote: Compressing objects: 93% (2163/2325) remote: Compressing objects: 94% (2186/2325) remote: Compressing objects: 95% (2209/2325) remote: Compressing objects: 96% (2232/2325) remote: Compressing objects: 97% (2256/2325) remote: Compressing objects: 98% (2279/2325) remote: Compressing objects: 99% (2302/2325) remote: Compressing objects: 100% (2325/2325) remote: Compressing objects: 100% (2325/2325), done.
  6. 6.91 s Receiving objects: 0% (1/64182) Receiving objects: 1% (642/64182) Receiving objects: 2% (1284/64182) Receiving objects: 3% (1926/64182) Receiving objects: 4% (2568/64182) Receiving objects: 5% (3210/64182) Receiving objects: 6% (3851/64182) Receiving objects: 7% (4493/64182) Receiving objects: 8% (5135/64182) Receiving objects: 9% (5777/64182) Receiving objects: 10% (6419/64182), 8.31 MiB | 16.61 MiB/s Receiving objects: 11% (7061/64182), 8.31 MiB | 16.61 MiB/s Receiving objects: 12% (7702/64182), 8.31 MiB | 16.61 MiB/s Receiving objects: 13% (8344/64182), 8.31 MiB | 16.61 MiB/s Receiving objects: 14% (8986/64182), 8.31 MiB | 16.61 MiB/s Receiving objects: 15% (9628/64182), 8.31 MiB | 16.61 MiB/s Receiving objects: 16% (10270/64182), 8.31 MiB | 16.61 MiB/s Receiving objects: 17% (10911/64182), 8.31 MiB | 16.61 MiB/s Receiving objects: 18% (11553/64182), 8.31 MiB | 16.61 MiB/s Receiving objects: 19% (12195/64182), 8.31 MiB | 16.61 MiB/s Receiving objects: 20% (12837/64182), 8.31 MiB | 16.61 MiB/s Receiving objects: 21% (13479/64182), 8.31 MiB | 16.61 MiB/s Receiving objects: 22% (14121/64182), 8.31 MiB | 16.61 MiB/s Receiving objects: 23% (14762/64182), 8.31 MiB | 16.61 MiB/s Receiving objects: 24% (15404/64182), 8.31 MiB | 16.61 MiB/s Receiving objects: 25% (16046/64182), 8.31 MiB | 16.61 MiB/s Receiving objects: 26% (16688/64182), 8.31 MiB | 16.61 MiB/s Receiving objects: 27% (17330/64182), 8.31 MiB | 16.61 MiB/s Receiving objects: 28% (17971/64182), 8.31 MiB | 16.61 MiB/s Receiving objects: 29% (18613/64182), 8.31 MiB | 16.61 MiB/s Receiving objects: 30% (19255/64182), 8.31 MiB | 16.61 MiB/s Receiving objects: 31% (19897/64182), 8.31 MiB | 16.61 MiB/s Receiving objects: 32% (20539/64182), 8.31 MiB | 16.61 MiB/s Receiving objects: 33% (21181/64182), 8.31 MiB | 16.61 MiB/s Receiving objects: 33% (21409/64182), 8.31 MiB | 16.61 MiB/s Receiving objects: 34% (21822/64182), 19.79 MiB | 19.78 MiB/s Receiving objects: 35% (22464/64182), 19.79 MiB | 19.78 MiB/s Receiving objects: 36% (23106/64182), 19.79 MiB | 19.78 MiB/s Receiving objects: 37% (23748/64182), 19.79 MiB | 19.78 MiB/s Receiving objects: 38% (24390/64182), 19.79 MiB | 19.78 MiB/s Receiving objects: 39% (25031/64182), 19.79 MiB | 19.78 MiB/s Receiving objects: 40% (25673/64182), 19.79 MiB | 19.78 MiB/s Receiving objects: 41% (26315/64182), 19.79 MiB | 19.78 MiB/s Receiving objects: 42% (26957/64182), 19.79 MiB | 19.78 MiB/s Receiving objects: 43% (27599/64182), 19.79 MiB | 19.78 MiB/s Receiving objects: 44% (28241/64182), 19.79 MiB | 19.78 MiB/s Receiving objects: 45% (28882/64182), 19.79 MiB | 19.78 MiB/s Receiving objects: 46% (29524/64182), 19.79 MiB | 19.78 MiB/s Receiving objects: 47% (30166/64182), 19.79 MiB | 19.78 MiB/s Receiving objects: 48% (30808/64182), 19.79 MiB | 19.78 MiB/s Receiving objects: 49% (31450/64182), 19.79 MiB | 19.78 MiB/s Receiving objects: 50% (32091/64182), 19.79 MiB | 19.78 MiB/s Receiving objects: 51% (32733/64182), 19.79 MiB | 19.78 MiB/s Receiving objects: 52% (33375/64182), 19.79 MiB | 19.78 MiB/s Receiving objects: 53% (34017/64182), 19.79 MiB | 19.78 MiB/s Receiving objects: 54% (34659/64182), 19.79 MiB | 19.78 MiB/s Receiving objects: 55% (35301/64182), 19.79 MiB | 19.78 MiB/s Receiving objects: 56% (35942/64182), 36.01 MiB | 24.00 MiB/s Receiving objects: 57% (36584/64182), 36.01 MiB | 24.00 MiB/s Receiving objects: 58% (37226/64182), 36.01 MiB | 24.00 MiB/s Receiving objects: 59% (37868/64182), 36.01 MiB | 24.00 MiB/s Receiving objects: 60% (38510/64182), 36.01 MiB | 24.00 MiB/s Receiving objects: 61% (39152/64182), 36.01 MiB | 24.00 MiB/s Receiving objects: 62% (39793/64182), 36.01 MiB | 24.00 MiB/s Receiving objects: 63% (40435/64182), 36.01 MiB | 24.00 MiB/s Receiving objects: 64% (41077/64182), 36.01 MiB | 24.00 MiB/s Receiving objects: 65% (41719/64182), 36.01 MiB | 24.00 MiB/s Receiving objects: 66% (42361/64182), 36.01 MiB | 24.00 MiB/s Receiving objects: 67% (43002/64182), 36.01 MiB | 24.00 MiB/s Receiving objects: 67% (43482/64182), 51.97 MiB | 25.98 MiB/s Receiving objects: 68% (43644/64182), 51.97 MiB | 25.98 MiB/s Receiving objects: 69% (44286/64182), 51.97 MiB | 25.98 MiB/s Receiving objects: 70% (44928/64182), 51.97 MiB | 25.98 MiB/s Receiving objects: 71% (45570/64182), 51.97 MiB | 25.98 MiB/s Receiving objects: 72% (46212/64182), 51.97 MiB | 25.98 MiB/s Receiving objects: 73% (46853/64182), 51.97 MiB | 25.98 MiB/s Receiving objects: 74% (47495/64182), 51.97 MiB | 25.98 MiB/s Receiving objects: 75% (48137/64182), 51.97 MiB | 25.98 MiB/s Receiving objects: 76% (48779/64182), 68.48 MiB | 27.39 MiB/s Receiving objects: 77% (49421/64182), 68.48 MiB | 27.39 MiB/s Receiving objects: 78% (50062/64182), 68.48 MiB | 27.39 MiB/s Receiving objects: 79% (50704/64182), 68.48 MiB | 27.39 MiB/s Receiving objects: 80% (51346/64182), 68.48 MiB | 27.39 MiB/s Receiving objects: 81% (51988/64182), 68.48 MiB | 27.39 MiB/s Receiving objects: 82% (52630/64182), 68.48 MiB | 27.39 MiB/s Receiving objects: 83% (53272/64182), 68.48 MiB | 27.39 MiB/s Receiving objects: 83% (53292/64182), 84.45 MiB | 28.14 MiB/s Receiving objects: 84% (53913/64182), 84.45 MiB | 28.14 MiB/s Receiving objects: 85% (54555/64182), 84.45 MiB | 28.14 MiB/s Receiving objects: 86% (55197/64182), 84.45 MiB | 28.14 MiB/s Receiving objects: 87% (55839/64182), 84.45 MiB | 28.14 MiB/s Receiving objects: 88% (56481/64182), 84.45 MiB | 28.14 MiB/s Receiving objects: 89% (57122/64182), 84.45 MiB | 28.14 MiB/s Receiving objects: 90% (57764/64182), 84.45 MiB | 28.14 MiB/s Receiving objects: 91% (58406/64182), 84.45 MiB | 28.14 MiB/s Receiving objects: 92% (59048/64182), 84.45 MiB | 28.14 MiB/s Receiving objects: 93% (59690/64182), 84.45 MiB | 28.14 MiB/s Receiving objects: 94% (60332/64182), 84.45 MiB | 28.14 MiB/s Receiving objects: 95% (60973/64182), 84.45 MiB | 28.14 MiB/s Receiving objects: 96% (61615/64182), 84.45 MiB | 28.14 MiB/s Receiving objects: 97% (62257/64182), 84.45 MiB | 28.14 MiB/s Receiving objects: 98% (62899/64182), 84.45 MiB | 28.14 MiB/s Receiving objects: 99% (63541/64182), 84.45 MiB | 28.14 MiB/s remote: Total 64182 (delta 7395), reused 7772 (delta 6678), pack-reused 54634 (from 3)
  7. 6.93 s Receiving objects: 100% (64182/64182), 84.45 MiB | 28.14 MiB/s Receiving objects: 100% (64182/64182), 97.83 MiB | 28.47 MiB/s, done.
  8. 8.83 s Resolving deltas: 0% (0/44314) Resolving deltas: 1% (444/44314) Resolving deltas: 2% (888/44314) Resolving deltas: 3% (1330/44314) Resolving deltas: 4% (1773/44314) Resolving deltas: 5% (2216/44314) Resolving deltas: 6% (2659/44314) Resolving deltas: 7% (3102/44314) Resolving deltas: 8% (3546/44314) Resolving deltas: 9% (3989/44314) Resolving deltas: 10% (4432/44314) Resolving deltas: 11% (4875/44314) Resolving deltas: 12% (5318/44314) Resolving deltas: 13% (5761/44314) Resolving deltas: 14% (6204/44314) Resolving deltas: 15% (6648/44314) Resolving deltas: 16% (7091/44314) Resolving deltas: 17% (7534/44314) Resolving deltas: 18% (7977/44314) Resolving deltas: 19% (8420/44314) Resolving deltas: 20% (8863/44314) Resolving deltas: 21% (9306/44314) Resolving deltas: 22% (9750/44314) Resolving deltas: 23% (10193/44314) Resolving deltas: 24% (10636/44314) Resolving deltas: 25% (11079/44314) Resolving deltas: 26% (11522/44314) Resolving deltas: 27% (11965/44314) Resolving deltas: 28% (12408/44314) Resolving deltas: 29% (12852/44314) Resolving deltas: 30% (13295/44314) Resolving deltas: 31% (13738/44314) Resolving deltas: 32% (14181/44314) Resolving deltas: 33% (14624/44314) Resolving deltas: 34% (15067/44314) Resolving deltas: 35% (15510/44314) Resolving deltas: 36% (15954/44314) Resolving deltas: 37% (16397/44314) Resolving deltas: 38% (16840/44314) Resolving deltas: 39% (17283/44314) Resolving deltas: 40% (17726/44314) Resolving deltas: 41% (18169/44314) Resolving deltas: 42% (18612/44314) Resolving deltas: 43% (19056/44314) Resolving deltas: 44% (19499/44314) Resolving deltas: 45% (19942/44314) Resolving deltas: 46% (20385/44314) Resolving deltas: 47% (20828/44314) Resolving deltas: 48% (21271/44314) Resolving deltas: 49% (21714/44314) Resolving deltas: 50% (22157/44314) Resolving deltas: 51% (22601/44314) Resolving deltas: 52% (23044/44314) Resolving deltas: 53% (23487/44314) Resolving deltas: 54% (23930/44314) Resolving deltas: 55% (24373/44314) Resolving deltas: 56% (24816/44314) Resolving deltas: 57% (25259/44314) Resolving deltas: 58% (25703/44314) Resolving deltas: 59% (26146/44314) Resolving deltas: 60% (26589/44314) Resolving deltas: 61% (27032/44314) Resolving deltas: 62% (27476/44314) Resolving deltas: 63% (27918/44314) Resolving deltas: 63% (28314/44314) Resolving deltas: 64% (28361/44314) Resolving deltas: 65% (28805/44314) Resolving deltas: 66% (29248/44314) Resolving deltas: 67% (29691/44314) Resolving deltas: 68% (30134/44314) Resolving deltas: 69% (30577/44314) Resolving deltas: 70% (31020/44314) Resolving deltas: 71% (31463/44314) Resolving deltas: 72% (31907/44314) Resolving deltas: 73% (32350/44314) Resolving deltas: 74% (32793/44314) Resolving deltas: 75% (33236/44314) Resolving deltas: 76% (33679/44314) Resolving deltas: 77% (34124/44314) Resolving deltas: 78% (34565/44314) Resolving deltas: 79% (35009/44314) Resolving deltas: 80% (35452/44314) Resolving deltas: 81% (35896/44314) Resolving deltas: 82% (36338/44314) Resolving deltas: 83% (36781/44314) Resolving deltas: 84% (37224/44314) Resolving deltas: 85% (37667/44314) Resolving deltas: 86% (38111/44314) Resolving deltas: 87% (38554/44314) Resolving deltas: 88% (38997/44314) Resolving deltas: 89% (39440/44314) Resolving deltas: 90% (39883/44314) Resolving deltas: 91% (40326/44314) Resolving deltas: 92% (40769/44314) Resolving deltas: 93% (41213/44314) Resolving deltas: 94% (41656/44314) Resolving deltas: 95% (42099/44314) Resolving deltas: 96% (42542/44314) Resolving deltas: 97% (42985/44314) Resolving deltas: 98% (43428/44314) Resolving deltas: 99% (43871/44314) Resolving deltas: 100% (44314/44314) Resolving deltas: 100% (44314/44314), done.
  9. 9.30 s Fetching commit 94e2eb84385825c67e2d00485755754534658cdd for push-vrpyqyylypmw ...
  10. 9.31 s $ /nix/store/bcnisk3ydfgv26v2gw3zlky24g00yww2-git-2.54.0/bin/git fetch origin 94e2eb84385825c67e2d00485755754534658cdd
  11. 9.93 s From https://github.com/alphal00p/gammaloop
  12. 9.93 s * branch 94e2eb84385825c67e2d00485755754534658cdd -> FETCH_HEAD
  13. 10.00 s $ /nix/store/9ypz3flqsrl5xl495mm8h645gadjsxi1-coreutils-9.11/bin/timeout --kill-after=15s 7200s /nix/store/bcnisk3ydfgv26v2gw3zlky24g00yww2-git-2.54.0/bin/git -c advice.detachedHead=false checkout 94e2eb84385825c67e2d00485755754534658cdd
  14. 10.33 s HEAD is now at 94e2eb84 include documentation sources in catalog dependency build
  15. 10.36 s $ /nix/store/9ypz3flqsrl5xl495mm8h645gadjsxi1-coreutils-9.11/bin/timeout --kill-after=15s 7200s /nix/store/23zk8sgzamrbmj1fday15szf7f2279s8-nix-2.34.7/bin/nix --extra-experimental-features nix-command --extra-experimental-features flakes --log-format internal-json run .#packages.x86_64-linux.nix-ci-check-gammaloop-nextest-core --print-build-logs
  16. 10.84 s
  17. 18.38 s evaluating derivation 'g copying '/nix/store/fxbc evaluating derivation 'g copying '/nix/store/fxbc evaluating derivation 'g copying '/nix/store/fxbc evaluating derivation 'g copying '/nix/store/fxbc evaluating derivation 'g copying '/nix/store/fxbc evaluating derivation 'g copying '/nix/store/fxbc evaluating derivation 'g copying '/nix/store/fxbc evaluating derivation 'g copying '/nix/store/fxbc evaluating derivation 'g copying '/nix/store/fxbc evaluating derivation 'g copying '/nix/store/fxbc evaluating derivation 'g [0/1 built] [1/0/1 built] building ggammaloop-nextest-core> Extracting 3 binaries (including 1 non-test binary), 1 build script output directory, and 2 linked paths to /build/nextest-archive-s6taKa
  18. 19.00 s gammaloop-nextest-core> Extracted 18 files to /build/nextest-archive-s6taKa in 0.62s
  19. 19.03 s gammaloop-nextest-core> ------------
  20. 19.03 s gammaloop-nextest-core> Nextest run ID d57f890a-0c80-46ea-8a65-3136c8ae4f31 with nextest profile: ci_gammaloop
  21. 19.03 s gammaloop-nextest-core> Starting 339 tests across 2 binaries
  22. 19.76 s gammaloop-nextest-core> FAIL [ 0.044s] (244/339) gammaloop-api repl::tests::completion_shows_type_hint_for_non_boolean_settings_leaf
  23. 19.76 s gammaloop-nextest-core> stdout ---
  24. 19.76 s gammaloop-nextest-core>
  25. 19.76 s gammaloop-nextest-core> running 1 test
  26. 19.76 s gammaloop-nextest-core> test repl::tests::completion_shows_type_hint_for_non_boolean_settings_leaf ... FAILED
  27. 19.76 s gammaloop-nextest-core>
  28. 19.76 s gammaloop-nextest-core> failures:
  29. 19.76 s gammaloop-nextest-core>
  30. 19.76 s gammaloop-nextest-core> failures:
  31. 19.76 s gammaloop-nextest-core> repl::tests::completion_shows_type_hint_for_non_boolean_settings_leaf
  32. 19.76 s gammaloop-nextest-core>
  33. 19.76 s gammaloop-nextest-core> test result: FAILED. 0 passed; 1 failed; 0 ignored; 0 measured; 338 filtered out; finished in 0.02s
  34. 19.76 s gammaloop-nextest-core>
  35. 19.76 s gammaloop-nextest-core> stderr ---
  36. 19.76 s gammaloop-nextest-core>
  37. 19.76 s gammaloop-nextest-core> thread 'repl::tests::completion_shows_type_hint_for_non_boolean_settings_leaf' (782) panicked at crates/gammaloop-api/src/repl.rs:5778:9:
  38. 19.76 s gammaloop-nextest-core> [Suggestion { value: "", description: Some("Number of samples in the first Monte Carlo iteration."), style: None, extra: None, span: Span { start: 42, end: 42 }, append_whitespace: false }]
  39. 19.76 s gammaloop-nextest-core> stack backtrace:
  40. 19.76 s gammaloop-nextest-core> 0: __rustc::rust_begin_unwind
  41. 19.76 s gammaloop-nextest-core> 1: core::panicking::panic_fmt
  42. 19.76 s gammaloop-nextest-core> 2: gammaloop_api::repl::tests::completion_shows_type_hint_for_non_boolean_settings_leaf
  43. 19.76 s gammaloop-nextest-core> 3: <gammaloop_api::repl::tests::completion_shows_type_hint_for_non_boolean_settings_leaf::{closure#0} as core::ops::function::FnOnce<()>>::call_once
  44. 19.76 s gammaloop-nextest-core> note: Some details are omitted, run with `RUST_BACKTRACE=full` for a verbose backtrace.
  45. 19.76 s gammaloop-nextest-core>
  46. 19.85 s gammaloop-nextest-core> FAIL [ 0.043s] (279/339) gammaloop-api templates::tests::extract_templates_uses_canonical_package_layout
  47. 19.85 s gammaloop-nextest-core> stdout ---
  48. 19.85 s gammaloop-nextest-core>
  49. 19.85 s gammaloop-nextest-core> running 1 test
  50. 19.85 s gammaloop-nextest-core> test templates::tests::extract_templates_uses_canonical_package_layout ... FAILED
  51. 19.85 s gammaloop-nextest-core>
  52. 19.85 s gammaloop-nextest-core> failures:
  53. 19.85 s gammaloop-nextest-core>
  54. 19.85 s gammaloop-nextest-core> failures:
  55. 19.85 s gammaloop-nextest-core> templates::tests::extract_templates_uses_canonical_package_layout
  56. 19.85 s gammaloop-nextest-core>
  57. 19.85 s gammaloop-nextest-core> test result: FAILED. 0 passed; 1 failed; 0 ignored; 0 measured; 338 filtered out; finished in 0.03s
  58. 19.85 s gammaloop-nextest-core>
  59. 19.85 s gammaloop-nextest-core> stderr ---
  60. 19.85 s gammaloop-nextest-core>
  61. 19.85 s gammaloop-nextest-core> thread 'templates::tests::extract_templates_uses_canonical_package_layout' (874) panicked at crates/gammaloop-api/src/templates.rs:99:9:
  62. 19.85 s gammaloop-nextest-core> assertion failed: figure.contains("amplitude-mode")
  63. 19.85 s gammaloop-nextest-core> stack backtrace:
  64. 19.85 s gammaloop-nextest-core> 0: __rustc::rust_begin_unwind
  65. 19.85 s gammaloop-nextest-core> 1: core::panicking::panic_fmt
  66. 19.85 s gammaloop-nextest-core> 2: core::panicking::panic
  67. 19.85 s gammaloop-nextest-core> 3: gammaloop_api::templates::tests::extract_templates_uses_canonical_package_layout
  68. 19.85 s gammaloop-nextest-core> 4: <gammaloop_api::templates::tests::extract_templates_uses_canonical_package_layout::{closure#0} as core::ops::function::FnOnce<()>>::call_once
  69. 19.85 s gammaloop-nextest-core> note: Some details are omitted, run with `RUST_BACKTRACE=full` for a verbose backtrace.
  70. 19.85 s gammaloop-nextest-core>
  71. 20.04 s gammaloop-nextest-core> ------------
  72. 20.04 s gammaloop-nextest-core> Summary [ 1.008s] 339 tests run: 337 passed, 2 failed, 0 skipped
  73. 20.04 s gammaloop-nextest-core> FAIL [ 0.044s] (244/339) gammaloop-api repl::tests::completion_shows_type_hint_for_non_boolean_settings_leaf
  74. 20.04 s gammaloop-nextest-core> stdout ---
  75. 20.04 s gammaloop-nextest-core>
  76. 20.04 s gammaloop-nextest-core> running 1 test
  77. 20.04 s gammaloop-nextest-core> test repl::tests::completion_shows_type_hint_for_non_boolean_settings_leaf ... FAILED
  78. 20.04 s gammaloop-nextest-core>
  79. 20.04 s gammaloop-nextest-core> failures:
  80. 20.04 s gammaloop-nextest-core>
  81. 20.04 s gammaloop-nextest-core> failures:
  82. 20.04 s gammaloop-nextest-core> repl::tests::completion_shows_type_hint_for_non_boolean_settings_leaf
  83. 20.04 s gammaloop-nextest-core>
  84. 20.04 s gammaloop-nextest-core> test result: FAILED. 0 passed; 1 failed; 0 ignored; 0 measured; 338 filtered out; finished in 0.02s
  85. 20.04 s gammaloop-nextest-core>
  86. 20.04 s gammaloop-nextest-core> stderr ---
  87. 20.04 s gammaloop-nextest-core>
  88. 20.04 s gammaloop-nextest-core> thread 'repl::tests::completion_shows_type_hint_for_non_boolean_settings_leaf' (782) panicked at crates/gammaloop-api/src/repl.rs:5778:9:
  89. 20.04 s gammaloop-nextest-core> [Suggestion { value: "", description: Some("Number of samples in the first Monte Carlo iteration."), style: None, extra: None, span: Span { start: 42, end: 42 }, append_whitespace: false }]
  90. 20.04 s gammaloop-nextest-core> stack backtrace:
  91. 20.04 s gammaloop-nextest-core> 0: __rustc::rust_begin_unwind
  92. 20.04 s gammaloop-nextest-core> 1: core::panicking::panic_fmt
  93. 20.04 s gammaloop-nextest-core> 2: gammaloop_api::repl::tests::completion_shows_type_hint_for_non_boolean_settings_leaf
  94. 20.04 s gammaloop-nextest-core> 3: <gammaloop_api::repl::tests::completion_shows_type_hint_for_non_boolean_settings_leaf::{closure#0} as core::ops::function::FnOnce<()>>::call_once
  95. 20.04 s gammaloop-nextest-core> note: Some details are omitted, run with `RUST_BACKTRACE=full` for a verbose backtrace.
  96. 20.04 s gammaloop-nextest-core>
  97. 20.04 s gammaloop-nextest-core> FAIL [ 0.043s] (279/339) gammaloop-api templates::tests::extract_templates_uses_canonical_package_layout
  98. 20.04 s gammaloop-nextest-core> stdout ---
  99. 20.04 s gammaloop-nextest-core>
  100. 20.04 s gammaloop-nextest-core> running 1 test
  101. 20.04 s gammaloop-nextest-core> test templates::tests::extract_templates_uses_canonical_package_layout ... FAILED
  102. 20.04 s gammaloop-nextest-core>
  103. 20.04 s gammaloop-nextest-core> failures:
  104. 20.04 s gammaloop-nextest-core>
  105. 20.04 s gammaloop-nextest-core> failures:
  106. 20.04 s gammaloop-nextest-core> templates::tests::extract_templates_uses_canonical_package_layout
  107. 20.04 s gammaloop-nextest-core>
  108. 20.04 s gammaloop-nextest-core> test result: FAILED. 0 passed; 1 failed; 0 ignored; 0 measured; 338 filtered out; finished in 0.03s
  109. 20.04 s gammaloop-nextest-core>
  110. 20.04 s gammaloop-nextest-core> stderr ---
  111. 20.04 s gammaloop-nextest-core>
  112. 20.04 s gammaloop-nextest-core> thread 'templates::tests::extract_templates_uses_canonical_package_layout' (874) panicked at crates/gammaloop-api/src/templates.rs:99:9:
  113. 20.04 s gammaloop-nextest-core> assertion failed: figure.contains("amplitude-mode")
  114. 20.04 s gammaloop-nextest-core> stack backtrace:
  115. 20.04 s gammaloop-nextest-core> 0: __rustc::rust_begin_unwind
  116. 20.04 s gammaloop-nextest-core> 1: core::panicking::panic_fmt
  117. 20.04 s gammaloop-nextest-core> 2: core::panicking::panic
  118. 20.04 s gammaloop-nextest-core> 3: gammaloop_api::templates::tests::extract_templates_uses_canonical_package_layout
  119. 20.04 s gammaloop-nextest-core> 4: <gammaloop_api::templates::tests::extract_templates_uses_canonical_package_layout::{closure#0} as core::ops::function::FnOnce<()>>::call_once
  120. 20.04 s gammaloop-nextest-core> note: Some details are omitted, run with `RUST_BACKTRACE=full` for a verbose backtrace.
  121. 20.04 s gammaloop-nextest-core>
  122. 20.14 s gammaloop-nextest-core> error: test run failed
  123. 20.18 s gammaloop-nextest-core>
  124. 20.18 s gammaloop-nextest-core> ========== nextest test summary ==========
  125. 20.18 s gammaloop-nextest-core> report: target/nextest/ci_gammaloop/junit.xml
  126. 20.18 s gammaloop-nextest-core> tests: 339, failures: 2, errors: 0
  127. 20.18 s gammaloop-nextest-core>
  128. 20.18 s gammaloop-nextest-core> 1. gammaloop-api::repl::tests::completion_shows_type_hint_for_non_boolean_settings_leaf
  129. 20.18 s gammaloop-nextest-core> failure: test failure with exit code 101
  130. 20.18 s gammaloop-nextest-core> thread 'repl::tests::completion_shows_type_hint_for_non_boolean_settings_leaf' (782) panicked at crates/gammaloop-api/src/repl.rs:5778:9:
  131. 20.18 s gammaloop-nextest-core> [Suggestion { value: "", description: Some("Number of samples in the first Monte Carlo iteration."), style: None, extra: None, span: Span { start: 42, end: 42 }, append_whitespace: false }]
  132. 20.18 s gammaloop-nextest-core> stack backtrace:
  133. 20.18 s gammaloop-nextest-core> 0: __rustc::rust_begin_unwind
  134. 20.18 s gammaloop-nextest-core> 1: core::panicking::panic_fmt
  135. 20.18 s gammaloop-nextest-core> 2: gammaloop_api::repl::tests::completion_shows_type_hint_for_non_boolean_settings_leaf
  136. 20.18 s gammaloop-nextest-core> 3: <gammaloop_api::repl::tests::completion_shows_type_hint_for_non_boolean_settings_leaf::{closure#0} as core::ops::function::FnOnce<()>>::call_once
  137. 20.18 s gammaloop-nextest-core> note: Some details are omitted, run with `RUST_BACKTRACE=full` for a verbose backtrace.
  138. 20.18 s gammaloop-nextest-core> system-out
  139. 20.18 s gammaloop-nextest-core> running 1 test
  140. 20.18 s gammaloop-nextest-core> test repl::tests::completion_shows_type_hint_for_non_boolean_settings_leaf ... FAILED
  141. 20.18 s gammaloop-nextest-core>
  142. 20.18 s gammaloop-nextest-core> failures:
  143. 20.18 s gammaloop-nextest-core>
  144. 20.18 s gammaloop-nextest-core> failures:
  145. 20.18 s gammaloop-nextest-core> repl::tests::completion_shows_type_hint_for_non_boolean_settings_leaf
  146. 20.18 s gammaloop-nextest-core>
  147. 20.18 s gammaloop-nextest-core> test result: FAILED. 0 passed; 1 failed; 0 ignored; 0 measured; 338 filtered out; finished in 0.02s
  148. 20.18 s gammaloop-nextest-core> system-err
  149. 20.18 s gammaloop-nextest-core> thread 'repl::tests::completion_shows_type_hint_for_non_boolean_settings_leaf' (782) panicked at crates/gammaloop-api/src/repl.rs:5778:9:
  150. 20.18 s gammaloop-nextest-core> [Suggestion { value: "", description: Some("Number of samples in the first Monte Carlo iteration."), style: None, extra: None, span: Span { start: 42, end: 42 }, append_whitespace: false }]
  151. 20.18 s gammaloop-nextest-core> stack backtrace:
  152. 20.18 s gammaloop-nextest-core> 0: __rustc::rust_begin_unwind
  153. 20.18 s gammaloop-nextest-core> 1: core::panicking::panic_fmt
  154. 20.18 s gammaloop-nextest-core> 2: gammaloop_api::repl::tests::completion_shows_type_hint_for_non_boolean_settings_leaf
  155. 20.18 s gammaloop-nextest-core> 3: <gammaloop_api::repl::tests::completion_shows_type_hint_for_non_boolean_settings_leaf::{closure#0} as core::ops::function::FnOnce<()>>::call_once
  156. 20.18 s gammaloop-nextest-core> note: Some details are omitted, run with `RUST_BACKTRACE=full` for a verbose backtrace.
  157. 20.18 s gammaloop-nextest-core>
  158. 20.18 s gammaloop-nextest-core> 2. gammaloop-api::templates::tests::extract_templates_uses_canonical_package_layout
  159. 20.18 s gammaloop-nextest-core> failure: test failure with exit code 101
  160. 20.18 s gammaloop-nextest-core> thread 'templates::tests::extract_templates_uses_canonical_package_layout' (874) panicked at crates/gammaloop-api/src/templates.rs:99:9:
  161. 20.18 s gammaloop-nextest-core> assertion failed: figure.contains("amplitude-mode")
  162. 20.18 s gammaloop-nextest-core> stack backtrace:
  163. 20.18 s gammaloop-nextest-core> 0: __rustc::rust_begin_unwind
  164. 20.18 s gammaloop-nextest-core> 1: core::panicking::panic_fmt
  165. 20.18 s gammaloop-nextest-core> 2: core::panicking::panic
  166. 20.18 s gammaloop-nextest-core> 3: gammaloop_api::templates::tests::extract_templates_uses_canonical_package_layout
  167. 20.18 s gammaloop-nextest-core> 4: <gammaloop_api::templates::tests::extract_templates_uses_canonical_package_layout::{closure#0} as core::ops::function::FnOnce<()>>::call_once
  168. 20.18 s gammaloop-nextest-core> note: Some details are omitted, run with `RUST_BACKTRACE=full` for a verbose backtrace.
  169. 20.18 s gammaloop-nextest-core> system-out
  170. 20.18 s gammaloop-nextest-core> running 1 test
  171. 20.18 s gammaloop-nextest-core> test templates::tests::extract_templates_uses_canonical_package_layout ... FAILED
  172. 20.18 s gammaloop-nextest-core>
  173. 20.18 s gammaloop-nextest-core> failures:
  174. 20.18 s gammaloop-nextest-core>
  175. 20.18 s gammaloop-nextest-core> failures:
  176. 20.18 s gammaloop-nextest-core> templates::tests::extract_templates_uses_canonical_package_layout
  177. 20.18 s gammaloop-nextest-core>
  178. 20.18 s gammaloop-nextest-core> test result: FAILED. 0 passed; 1 failed; 0 ignored; 0 measured; 338 filtered out; finished in 0.03s
  179. 20.18 s gammaloop-nextest-core> system-err
  180. 20.18 s gammaloop-nextest-core> thread 'templates::tests::extract_templates_uses_canonical_package_layout' (874) panicked at crates/gammaloop-api/src/templates.rs:99:9:
  181. 20.18 s gammaloop-nextest-core> assertion failed: figure.contains("amplitude-mode")
  182. 20.18 s gammaloop-nextest-core> stack backtrace:
  183. 20.18 s gammaloop-nextest-core> 0: __rustc::rust_begin_unwind
  184. 20.18 s gammaloop-nextest-core> 1: core::panicking::panic_fmt
  185. 20.18 s gammaloop-nextest-core> 2: core::panicking::panic
  186. 20.18 s gammaloop-nextest-core> 3: gammaloop_api::templates::tests::extract_templates_uses_canonical_package_layout
  187. 20.18 s gammaloop-nextest-core> 4: <gammaloop_api::templates::tests::extract_templates_uses_canonical_package_layout::{closure#0} as core::ops::function::FnOnce<()>>::call_once
  188. 20.18 s gammaloop-nextest-core> note: Some details are omitted, run with `RUST_BACKTRACE=full` for a verbose backtrace.
  189. 20.18 s gammaloop-nextest-core> =========================================
  190. 20.20 s gammaloop-nextest-core> Extracting 1 binary and 1 linked path to /build/nextest-archive-lhiKhq
  191. 20.30 s gammaloop-nextest-core> Extracted 7 files to /build/nextest-archive-lhiKhq in 0.10s
  192. 20.32 s gammaloop-nextest-core> ------------
  193. 20.32 s gammaloop-nextest-core> Nextest run ID 7eacee3b-d0ae-47b2-97ec-9b225e95ee80 with nextest profile: ci_gammaloop
  194. 20.32 s gammaloop-nextest-core> Starting 19 tests across 1 binary
  195. 20.37 s gammaloop-nextest-core> ------------
  196. 20.37 s gammaloop-nextest-core> Summary [ 0.048s] 19 tests run: 19 passed, 0 skipped
  197. 20.42 s gammaloop-nextest-core>
  198. 20.42 s gammaloop-nextest-core> ========== nextest test summary ==========
  199. 20.42 s gammaloop-nextest-core> report: target/nextest/ci_gammaloop/junit.xml
  200. 20.42 s gammaloop-nextest-core> tests: 19, failures: 0, errors: 0
  201. 20.42 s gammaloop-nextest-core> No failing testcases found.
  202. 20.42 s gammaloop-nextest-core> =========================================
  203. 20.46 s gammaloop-nextest-core> Extracting 1 binary to /build/nextest-archive-lI8lGR
  204. 20.51 s gammaloop-nextest-core> Extracted 4 files to /build/nextest-archive-lI8lGR in 0.06s
  205. 20.54 s gammaloop-nextest-core> ------------
  206. 20.54 s gammaloop-nextest-core> Nextest run ID a2374c0c-e4f7-4d26-9b23-314843cf7719 with nextest profile: ci_gammaloop
  207. 20.54 s gammaloop-nextest-core> Starting 0 tests across 1 binary
  208. 20.55 s gammaloop-nextest-core> ------------
  209. 20.55 s gammaloop-nextest-core> Summary [ 0.002s] 0 tests run: 0 passed, 0 skipped
  210. 20.60 s gammaloop-nextest-core>
  211. 20.60 s gammaloop-nextest-core> ========== nextest test summary ==========
  212. 20.60 s gammaloop-nextest-core> report: target/nextest/ci_gammaloop/junit.xml
  213. 20.60 s gammaloop-nextest-core> tests: 0, failures: 0, errors: 0
  214. 20.60 s gammaloop-nextest-core> No failing testcases found.
  215. 20.60 s gammaloop-nextest-core> =========================================
  216. 20.62 s gammaloop-nextest-core> Extracting 4 binaries, 1 build script output directory, and 2 linked paths to /build/nextest-archive-wQWP4O
  217. 21.36 s gammaloop-nextest-core> Extracted 18 files to /build/nextest-archive-wQWP4O in 0.74s
  218. 21.40 s gammaloop-nextest-core> ------------
  219. 21.40 s gammaloop-nextest-core> Nextest run ID b9a43d33-dd01-494b-b82b-c0f4e76e2e50 with nextest profile: ci_gammaloop
  220. 21.40 s gammaloop-nextest-core> Starting 456 tests across 4 binaries (61 tests skipped, including 60 tests via profile.ci_gammaloop.default-filter)
  221. 21.98 s gammaloop-nextest-core> FAIL [ 0.333s] ( 79/456) gammalooprs graph::parse::tests::parse_lmbsetting_crossection
  222. 21.98 s gammaloop-nextest-core> stdout ---
  223. 21.98 s gammaloop-nextest-core>
  224. 21.98 s gammaloop-nextest-core> running 1 test
  225. 21.98 s gammaloop-nextest-core> ━━━━━━━━━━━━━━━━━━━━━━━━━━━━━━━ Snapshot Summary ━━━━━━━━━━━━━━━━━━━━━━━━━━━━━━━
  226. 21.98 s gammaloop-nextest-core> Snapshot: parse_lmbsetting_crossection
  227. 21.98 s gammaloop-nextest-core> Source: crates/gammalooprs/src/graph/parse/tests.rs:252
  228. 21.98 s gammaloop-nextest-core> ────────────────────────────────────────────────────────────────────────────────
  229. 21.98 s gammaloop-nextest-core> Expression: g.debug_dot()
  230. 21.98 s gammaloop-nextest-core> ────────────────────────────────────────────────────────────────────────────────
  231. 21.98 s gammaloop-nextest-core> -old snapshot
  232. 21.98 s gammaloop-nextest-core> +new results
  233. 21.98 s gammaloop-nextest-core> ────────────┬───────────────────────────────────────────────────────────────────
  234. 21.98 s gammaloop-nextest-core> 1 │-digraph G{
  235. 21.98 s gammaloop-nextest-core> 1 │+digraph G {
  236. 21.98 s gammaloop-nextest-core> 2 2 │ num = "1/2";
  237. 21.98 s gammaloop-nextest-core> 3 3 │ overall_factor = "2*x";
  238. 21.98 s gammaloop-nextest-core> 4 4 │ overall_factor_evaluated = "2*x";
  239. 21.98 s gammaloop-nextest-core> 5 5 │ projector = "spenso::t";
  240. 21.98 s gammaloop-nextest-core> ────────────┴───────────────────────────────────────────────────────────────────
  241. 21.98 s gammaloop-nextest-core> To update snapshots run `cargo insta review`
  242. 21.98 s gammaloop-nextest-core> Stopped on the first failure. Run `cargo insta test` to run all snapshots.
  243. 21.98 s gammaloop-nextest-core> test graph::parse::tests::parse_lmbsetting_crossection ... FAILED
  244. 21.98 s gammaloop-nextest-core>
  245. 21.98 s gammaloop-nextest-core> failures:
  246. 21.98 s gammaloop-nextest-core>
  247. 21.98 s gammaloop-nextest-core> failures:
  248. 21.98 s gammaloop-nextest-core> graph::parse::tests::parse_lmbsetting_crossection
  249. 21.98 s gammaloop-nextest-core>
  250. 21.98 s gammaloop-nextest-core> test result: FAILED. 0 passed; 1 failed; 0 ignored; 0 measured; 508 filtered out; finished in 0.30s
  251. 21.98 s gammaloop-nextest-core>
  252. 21.98 s gammaloop-nextest-core> stderr ---
  253. 21.98 s gammaloop-nextest-core> [20:20:47.859] @gammalooprs::graph::attribute_warnings WARNING : Unknown node attribute 'color_num' on graph 'G', node 'A'; did you mean 'num'?
  254. 21.98 s gammaloop-nextest-core> at crates/gammalooprs/src/graph/attribute_warnings.rs:198
  255. 21.98 s gammaloop-nextest-core> The application panicked (crashed).
  256. 21.98 s gammaloop-nextest-core> Message: snapshot assertion for 'parse_lmbsetting_crossection' failed in line 252
  257. 21.98 s gammaloop-nextest-core> Location: /nix/store/xdy1vvhll2bijdplvl9fcc2b9plkxhaa-vendor-cargo-deps/c19b7c6f923b580ac259164a89f2577984ad5ab09ee9d583b888f934adbbe8d0/insta-1.47.2/src/runtime.rs:719
  258. 21.98 s gammaloop-nextest-core>
  259. 21.98 s gammaloop-nextest-core> ━━━━━━━━━━━━━━━━━━━━━━━━━━━━━━━━━━ BACKTRACE ━━━━━━━━━━━━━━━━━━━━━━━━━━━━━━━━━━━
  260. 21.98 s gammaloop-nextest-core> 1: <color_eyre[b0c9e66060e883b2]::config::PanicHook>::panic_report<unknown>
  261. 21.98 s gammaloop-nextest-core> at <unknown source file>:<unknown line>
  262. 21.98 s gammaloop-nextest-core> 2: <color_eyre[b0c9e66060e883b2]::config::PanicHook>::into_panic_hook::{closure#0}<unknown>
  263. 21.98 s gammaloop-nextest-core> at <unknown source file>:<unknown line>
  264. 21.98 s gammaloop-nextest-core> 3: std[bcb96dfbba0ab899]::panicking::panic_with_hook<unknown>
  265. 21.98 s gammaloop-nextest-core> at <unknown source file>:<unknown line>
  266. 21.98 s gammaloop-nextest-core> 4: std[bcb96dfbba0ab899]::panicking::panic_handler::{closure#0}<unknown>
  267. 21.98 s gammaloop-nextest-core> at <unknown source file>:<unknown line>
  268. 21.98 s gammaloop-nextest-core> 5: std[bcb96dfbba0ab899]::sys::backtrace::__rust_end_short_backtrace::<std[bcb96dfbba0ab899]::panicking::panic_handler::{closure#0}, !><unknown>
  269. 21.98 s gammaloop-nextest-core> at <unknown source file>:<unknown line>
  270. 21.98 s gammaloop-nextest-core> 6: __rustc[6c289b9f9c454d21]::rust_begin_unwind<unknown>
  271. 21.98 s gammaloop-nextest-core> at <unknown source file>:<unknown line>
  272. 21.98 s gammaloop-nextest-core> 7: core[940e698046960fd5]::panicking::panic_fmt<unknown>
  273. 21.98 s gammaloop-nextest-core> at <unknown source file>:<unknown line>
  274. 21.98 s gammaloop-nextest-core> 8: insta[307a548ac79ef4d9]::runtime::assert_snapshot<unknown>
  275. 21.98 s gammaloop-nextest-core> at <unknown source file>:<unknown line>
  276. 21.98 s gammaloop-nextest-core> 9: gammalooprs[5490727360442cce]::graph::parse::tests::parse_lmbsetting_crossection<unknown>
  277. 21.98 s gammaloop-nextest-core> at <unknown source file>:<unknown line>
  278. 21.98 s gammaloop-nextest-core> 10: <gammalooprs[5490727360442cce]::graph::parse::tests::parse_lmbsetting_crossection::{closure#0} as core[940e698046960fd5]::ops::function::FnOnce<()>>::call_once<unknown>
  279. 21.98 s gammaloop-nextest-core> at <unknown source file>:<unknown line>
  280. 21.98 s gammaloop-nextest-core> 11: test[75d6903177b1d7e9]::__rust_begin_short_backtrace::<core[940e698046960fd5]::result::Result<(), alloc[2ea6bcb46fca0c42]::string::String>, fn() -> core[940e698046960fd5]::result::Result<(), alloc[2ea6bcb46fca0c42]::string::String>><unknown>
  281. 21.98 s gammaloop-nextest-core> at <unknown source file>:<unknown line>
  282. 21.98 s gammaloop-nextest-core> 12: test[75d6903177b1d7e9]::run_test::{closure#0}<unknown>
  283. 21.98 s gammaloop-nextest-core> at <unknown source file>:<unknown line>
  284. 21.98 s gammaloop-nextest-core> 13: std[bcb96dfbba0ab899]::sys::backtrace::__rust_begin_short_backtrace::<test[75d6903177b1d7e9]::run_test::{closure#1}, ()><unknown>
  285. 21.98 s gammaloop-nextest-core> at <unknown source file>:<unknown line>
  286. 21.98 s gammaloop-nextest-core> 14: <std[bcb96dfbba0ab899]::thread::lifecycle::spawn_unchecked<test[75d6903177b1d7e9]::run_test::{closure#1}, ()>::{closure#1} as core[940e698046960fd5]::ops::function::FnOnce<()>>::call_once::{shim:vtable#0}<unknown>
  287. 21.98 s gammaloop-nextest-core> at <unknown source file>:<unknown line>
  288. 21.98 s gammaloop-nextest-core> 15: <std[bcb96dfbba0ab899]::sys::thread::unix::Thread>::new::thread_start<unknown>
  289. 21.98 s gammaloop-nextest-core> at <unknown source file>:<unknown line>
  290. 21.98 s gammaloop-nextest-core> 16: start_thread<unknown>
  291. 21.98 s gammaloop-nextest-core> at <unknown source file>:<unknown line>
  292. 21.98 s gammaloop-nextest-core> 17: __clone3<unknown>
  293. 21.98 s gammaloop-nextest-core> at <unknown source file>:<unknown line>
  294. 21.98 s gammaloop-nextest-core>
  295. 21.98 s gammaloop-nextest-core> Run with COLORBT_SHOW_HIDDEN=1 environment variable to disable frame filtering.
  296. 21.98 s gammaloop-nextest-core> Run with RUST_BACKTRACE=full to include source snippets.
  297. 21.98 s gammaloop-nextest-core>
  298. 23.36 s gammaloop-nextest-core> FAIL [ 0.276s] (409/456) gammalooprs uv::export::tests::computed_node_full_numerator_is_a_spenso_aware_typst_fragment
  299. 23.36 s gammaloop-nextest-core> stdout ---
  300. 23.36 s gammaloop-nextest-core>
  301. 23.36 s gammaloop-nextest-core> running 1 test
  302. 23.36 s gammaloop-nextest-core> test uv::export::tests::computed_node_full_numerator_is_a_spenso_aware_typst_fragment ... FAILED
  303. 23.36 s gammaloop-nextest-core>
  304. 23.36 s gammaloop-nextest-core> failures:
  305. 23.36 s gammaloop-nextest-core>
  306. 23.36 s gammaloop-nextest-core> failures:
  307. 23.36 s gammaloop-nextest-core> uv::export::tests::computed_node_full_numerator_is_a_spenso_aware_typst_fragment
  308. 23.36 s gammaloop-nextest-core>
  309. 23.36 s gammaloop-nextest-core> test result: FAILED. 0 passed; 1 failed; 0 ignored; 0 measured; 508 filtered out; finished in 0.24s
  310. 23.36 s gammaloop-nextest-core>
  311. 23.36 s gammaloop-nextest-core> stderr ---
  312. 23.36 s gammaloop-nextest-core> The application panicked (crashed).
  313. 23.36 s gammaloop-nextest-core> Message: assertion failed: exported.dot.contains(r#"full_num = "op(\"Tr\")(1)";"#)
  314. 23.36 s gammaloop-nextest-core> Location: crates/gammalooprs/src/uv/export.rs:483
  315. 23.36 s gammaloop-nextest-core>
  316. 23.36 s gammaloop-nextest-core> ━━━━━━━━━━━━━━━━━━━━━━━━━━━━━━━━━━ BACKTRACE ━━━━━━━━━━━━━━━━━━━━━━━━━━━━━━━━━━━
  317. 23.36 s gammaloop-nextest-core> 1: <color_eyre[b0c9e66060e883b2]::config::PanicHook>::panic_report<unknown>
  318. 23.36 s gammaloop-nextest-core> at <unknown source file>:<unknown line>
  319. 23.36 s gammaloop-nextest-core> 2: <color_eyre[b0c9e66060e883b2]::config::PanicHook>::into_panic_hook::{closure#0}<unknown>
  320. 23.36 s gammaloop-nextest-core> at <unknown source file>:<unknown line>
  321. 23.36 s gammaloop-nextest-core> 3: std[bcb96dfbba0ab899]::panicking::panic_with_hook<unknown>
  322. 23.36 s gammaloop-nextest-core> at <unknown source file>:<unknown line>
  323. 23.36 s gammaloop-nextest-core> 4: std[bcb96dfbba0ab899]::panicking::panic_handler::{closure#0}<unknown>
  324. 23.36 s gammaloop-nextest-core> at <unknown source file>:<unknown line>
  325. 23.36 s gammaloop-nextest-core> 5: std[bcb96dfbba0ab899]::sys::backtrace::__rust_end_short_backtrace::<std[bcb96dfbba0ab899]::panicking::panic_handler::{closure#0}, !><unknown>
  326. 23.36 s gammaloop-nextest-core> at <unknown source file>:<unknown line>
  327. 23.36 s gammaloop-nextest-core> 6: __rustc[6c289b9f9c454d21]::rust_begin_unwind<unknown>
  328. 23.36 s gammaloop-nextest-core> at <unknown source file>:<unknown line>
  329. 23.36 s gammaloop-nextest-core> 7: core[940e698046960fd5]::panicking::panic_fmt<unknown>
  330. 23.36 s gammaloop-nextest-core> at <unknown source file>:<unknown line>
  331. 23.36 s gammaloop-nextest-core> 8: core[940e698046960fd5]::panicking::panic<unknown>
  332. 23.36 s gammaloop-nextest-core> at <unknown source file>:<unknown line>
  333. 23.36 s gammaloop-nextest-core> 9: gammalooprs[5490727360442cce]::uv::export::tests::computed_node_full_numerator_is_a_spenso_aware_typst_fragment<unknown>
  334. 23.36 s gammaloop-nextest-core> at <unknown source file>:<unknown line>
  335. 23.36 s gammaloop-nextest-core> 10: <gammalooprs[5490727360442cce]::uv::export::tests::computed_node_full_numerator_is_a_spenso_aware_typst_fragment::{closure#0} as core[940e698046960fd5]::ops::function::FnOnce<()>>::call_once<unknown>
  336. 23.36 s gammaloop-nextest-core> at <unknown source file>:<unknown line>
  337. 23.36 s gammaloop-nextest-core> 11: test[75d6903177b1d7e9]::__rust_begin_short_backtrace::<core[940e698046960fd5]::result::Result<(), alloc[2ea6bcb46fca0c42]::string::String>, fn() -> core[940e698046960fd5]::result::Result<(), alloc[2ea6bcb46fca0c42]::string::String>><unknown>
  338. 23.36 s gammaloop-nextest-core> at <unknown source file>:<unknown line>
  339. 23.36 s gammaloop-nextest-core> 12: test[75d6903177b1d7e9]::run_test::{closure#0}<unknown>
  340. 23.36 s gammaloop-nextest-core> at <unknown source file>:<unknown line>
  341. 23.36 s gammaloop-nextest-core> 13: std[bcb96dfbba0ab899]::sys::backtrace::__rust_begin_short_backtrace::<test[75d6903177b1d7e9]::run_test::{closure#1}, ()><unknown>
  342. 23.36 s gammaloop-nextest-core> at <unknown source file>:<unknown line>
  343. 23.36 s gammaloop-nextest-core> 14: <std[bcb96dfbba0ab899]::thread::lifecycle::spawn_unchecked<test[75d6903177b1d7e9]::run_test::{closure#1}, ()>::{closure#1} as core[940e698046960fd5]::ops::function::FnOnce<()>>::call_once::{shim:vtable#0}<unknown>
  344. 23.36 s gammaloop-nextest-core> at <unknown source file>:<unknown line>
  345. 23.36 s gammaloop-nextest-core> 15: <std[bcb96dfbba0ab899]::sys::thread::unix::Thread>::new::thread_start<unknown>
  346. 23.36 s gammaloop-nextest-core> at <unknown source file>:<unknown line>
  347. 23.36 s gammaloop-nextest-core> 16: start_thread<unknown>
  348. 23.36 s gammaloop-nextest-core> at <unknown source file>:<unknown line>
  349. 23.36 s gammaloop-nextest-core> 17: __clone3<unknown>
  350. 23.36 s gammaloop-nextest-core> at <unknown source file>:<unknown line>
  351. 23.36 s gammaloop-nextest-core>
  352. 23.36 s gammaloop-nextest-core> Run with COLORBT_SHOW_HIDDEN=1 environment variable to disable frame filtering.
  353. 23.36 s gammaloop-nextest-core> Run with RUST_BACKTRACE=full to include source snippets.
  354. 23.36 s gammaloop-nextest-core>
  355. 35.65 s gammaloop-nextest-core> ------------
  356. 35.66 s gammaloop-nextest-core> Summary [ 14.251s] 456 tests run: 454 passed, 2 failed, 61 skipped
  357. 35.66 s gammaloop-nextest-core> FAIL [ 0.333s] ( 79/456) gammalooprs graph::parse::tests::parse_lmbsetting_crossection
  358. 35.66 s gammaloop-nextest-core> stdout ---
  359. 35.66 s gammaloop-nextest-core>
  360. 35.66 s gammaloop-nextest-core> running 1 test
  361. 35.66 s gammaloop-nextest-core> ━━━━━━━━━━━━━━━━━━━━━━━━━━━━━━━ Snapshot Summary ━━━━━━━━━━━━━━━━━━━━━━━━━━━━━━━
  362. 35.66 s gammaloop-nextest-core> Snapshot: parse_lmbsetting_crossection
  363. 35.66 s gammaloop-nextest-core> Source: crates/gammalooprs/src/graph/parse/tests.rs:252
  364. 35.66 s gammaloop-nextest-core> ────────────────────────────────────────────────────────────────────────────────
  365. 35.66 s gammaloop-nextest-core> Expression: g.debug_dot()
  366. 35.66 s gammaloop-nextest-core> ────────────────────────────────────────────────────────────────────────────────
  367. 35.66 s gammaloop-nextest-core> -old snapshot
  368. 35.66 s gammaloop-nextest-core> +new results
  369. 35.66 s gammaloop-nextest-core> ────────────┬───────────────────────────────────────────────────────────────────
  370. 35.66 s gammaloop-nextest-core> 1 │-digraph G{
  371. 35.66 s gammaloop-nextest-core> 1 │+digraph G {
  372. 35.66 s gammaloop-nextest-core> 2 2 │ num = "1/2";
  373. 35.66 s gammaloop-nextest-core> 3 3 │ overall_factor = "2*x";
  374. 35.66 s gammaloop-nextest-core> 4 4 │ overall_factor_evaluated = "2*x";
  375. 35.66 s gammaloop-nextest-core> 5 5 │ projector = "spenso::t";
  376. 35.66 s gammaloop-nextest-core> ────────────┴───────────────────────────────────────────────────────────────────
  377. 35.66 s gammaloop-nextest-core> To update snapshots run `cargo insta review`
  378. 35.66 s gammaloop-nextest-core> Stopped on the first failure. Run `cargo insta test` to run all snapshots.
  379. 35.66 s gammaloop-nextest-core> test graph::parse::tests::parse_lmbsetting_crossection ... FAILED
  380. 35.66 s gammaloop-nextest-core>
  381. 35.66 s gammaloop-nextest-core> failures:
  382. 35.66 s gammaloop-nextest-core>
  383. 35.66 s gammaloop-nextest-core> failures:
  384. 35.66 s gammaloop-nextest-core> graph::parse::tests::parse_lmbsetting_crossection
  385. 35.66 s gammaloop-nextest-core>
  386. 35.66 s gammaloop-nextest-core> test result: FAILED. 0 passed; 1 failed; 0 ignored; 0 measured; 508 filtered out; finished in 0.30s
  387. 35.66 s gammaloop-nextest-core>
  388. 35.66 s gammaloop-nextest-core> stderr ---
  389. 35.66 s gammaloop-nextest-core> [20:20:47.859] @gammalooprs::graph::attribute_warnings WARNING : Unknown node attribute 'color_num' on graph 'G', node 'A'; did you mean 'num'?
  390. 35.66 s gammaloop-nextest-core> at crates/gammalooprs/src/graph/attribute_warnings.rs:198
  391. 35.66 s gammaloop-nextest-core> The application panicked (crashed).
  392. 35.66 s gammaloop-nextest-core> Message: snapshot assertion for 'parse_lmbsetting_crossection' failed in line 252
  393. 35.66 s gammaloop-nextest-core> Location: /nix/store/xdy1vvhll2bijdplvl9fcc2b9plkxhaa-vendor-cargo-deps/c19b7c6f923b580ac259164a89f2577984ad5ab09ee9d583b888f934adbbe8d0/insta-1.47.2/src/runtime.rs:719
  394. 35.66 s gammaloop-nextest-core>
  395. 35.66 s gammaloop-nextest-core> ━━━━━━━━━━━━━━━━━━━━━━━━━━━━━━━━━━ BACKTRACE ━━━━━━━━━━━━━━━━━━━━━━━━━━━━━━━━━━━
  396. 35.66 s gammaloop-nextest-core> 1: <color_eyre[b0c9e66060e883b2]::config::PanicHook>::panic_report<unknown>
  397. 35.66 s gammaloop-nextest-core> at <unknown source file>:<unknown line>
  398. 35.66 s gammaloop-nextest-core> 2: <color_eyre[b0c9e66060e883b2]::config::PanicHook>::into_panic_hook::{closure#0}<unknown>
  399. 35.66 s gammaloop-nextest-core> at <unknown source file>:<unknown line>
  400. 35.66 s gammaloop-nextest-core> 3: std[bcb96dfbba0ab899]::panicking::panic_with_hook<unknown>
  401. 35.66 s gammaloop-nextest-core> at <unknown source file>:<unknown line>
  402. 35.66 s gammaloop-nextest-core> 4: std[bcb96dfbba0ab899]::panicking::panic_handler::{closure#0}<unknown>
  403. 35.66 s gammaloop-nextest-core> at <unknown source file>:<unknown line>
  404. 35.66 s gammaloop-nextest-core> 5: std[bcb96dfbba0ab899]::sys::backtrace::__rust_end_short_backtrace::<std[bcb96dfbba0ab899]::panicking::panic_handler::{closure#0}, !><unknown>
  405. 35.66 s gammaloop-nextest-core> at <unknown source file>:<unknown line>
  406. 35.66 s gammaloop-nextest-core> 6: __rustc[6c289b9f9c454d21]::rust_begin_unwind<unknown>
  407. 35.66 s gammaloop-nextest-core> at <unknown source file>:<unknown line>
  408. 35.66 s gammaloop-nextest-core> 7: core[940e698046960fd5]::panicking::panic_fmt<unknown>
  409. 35.66 s gammaloop-nextest-core> at <unknown source file>:<unknown line>
  410. 35.66 s gammaloop-nextest-core> 8: insta[307a548ac79ef4d9]::runtime::assert_snapshot<unknown>
  411. 35.66 s gammaloop-nextest-core> at <unknown source file>:<unknown line>
  412. 35.66 s gammaloop-nextest-core> 9: gammalooprs[5490727360442cce]::graph::parse::tests::parse_lmbsetting_crossection<unknown>
  413. 35.66 s gammaloop-nextest-core> at <unknown source file>:<unknown line>
  414. 35.66 s gammaloop-nextest-core> 10: <gammalooprs[5490727360442cce]::graph::parse::tests::parse_lmbsetting_crossection::{closure#0} as core[940e698046960fd5]::ops::function::FnOnce<()>>::call_once<unknown>
  415. 35.66 s gammaloop-nextest-core> at <unknown source file>:<unknown line>
  416. 35.66 s gammaloop-nextest-core> 11: test[75d6903177b1d7e9]::__rust_begin_short_backtrace::<core[940e698046960fd5]::result::Result<(), alloc[2ea6bcb46fca0c42]::string::String>, fn() -> core[940e698046960fd5]::result::Result<(), alloc[2ea6bcb46fca0c42]::string::String>><unknown>
  417. 35.66 s gammaloop-nextest-core> at <unknown source file>:<unknown line>
  418. 35.66 s gammaloop-nextest-core> 12: test[75d6903177b1d7e9]::run_test::{closure#0}<unknown>
  419. 35.66 s gammaloop-nextest-core> at <unknown source file>:<unknown line>
  420. 35.66 s gammaloop-nextest-core> 13: std[bcb96dfbba0ab899]::sys::backtrace::__rust_begin_short_backtrace::<test[75d6903177b1d7e9]::run_test::{closure#1}, ()><unknown>
  421. 35.66 s gammaloop-nextest-core> at <unknown source file>:<unknown line>
  422. 35.66 s gammaloop-nextest-core> 14: <std[bcb96dfbba0ab899]::thread::lifecycle::spawn_unchecked<test[75d6903177b1d7e9]::run_test::{closure#1}, ()>::{closure#1} as core[940e698046960fd5]::ops::function::FnOnce<()>>::call_once::{shim:vtable#0}<unknown>
  423. 35.66 s gammaloop-nextest-core> at <unknown source file>:<unknown line>
  424. 35.66 s gammaloop-nextest-core> 15: <std[bcb96dfbba0ab899]::sys::thread::unix::Thread>::new::thread_start<unknown>
  425. 35.66 s gammaloop-nextest-core> at <unknown source file>:<unknown line>
  426. 35.66 s gammaloop-nextest-core> 16: start_thread<unknown>
  427. 35.66 s gammaloop-nextest-core> at <unknown source file>:<unknown line>
  428. 35.66 s gammaloop-nextest-core> 17: __clone3<unknown>
  429. 35.66 s gammaloop-nextest-core> at <unknown source file>:<unknown line>
  430. 35.66 s gammaloop-nextest-core>
  431. 35.66 s gammaloop-nextest-core> Run with COLORBT_SHOW_HIDDEN=1 environment variable to disable frame filtering.
  432. 35.66 s gammaloop-nextest-core> Run with RUST_BACKTRACE=full to include source snippets.
  433. 35.66 s gammaloop-nextest-core>
  434. 35.66 s gammaloop-nextest-core> FAIL [ 0.276s] (409/456) gammalooprs uv::export::tests::computed_node_full_numerator_is_a_spenso_aware_typst_fragment
  435. 35.66 s gammaloop-nextest-core> stdout ---
  436. 35.66 s gammaloop-nextest-core>
  437. 35.66 s gammaloop-nextest-core> running 1 test
  438. 35.66 s gammaloop-nextest-core> test uv::export::tests::computed_node_full_numerator_is_a_spenso_aware_typst_fragment ... FAILED
  439. 35.66 s gammaloop-nextest-core>
  440. 35.66 s gammaloop-nextest-core> failures:
  441. 35.66 s gammaloop-nextest-core>
  442. 35.66 s gammaloop-nextest-core> failures:
  443. 35.66 s gammaloop-nextest-core> uv::export::tests::computed_node_full_numerator_is_a_spenso_aware_typst_fragment
  444. 35.66 s gammaloop-nextest-core>
  445. 35.66 s gammaloop-nextest-core> test result: FAILED. 0 passed; 1 failed; 0 ignored; 0 measured; 508 filtered out; finished in 0.24s
  446. 35.66 s gammaloop-nextest-core>
  447. 35.66 s gammaloop-nextest-core> stderr ---
  448. 35.66 s gammaloop-nextest-core> The application panicked (crashed).
  449. 35.66 s gammaloop-nextest-core> Message: assertion failed: exported.dot.contains(r#"full_num = "op(\"Tr\")(1)";"#)
  450. 35.66 s gammaloop-nextest-core> Location: crates/gammalooprs/src/uv/export.rs:483
  451. 35.66 s gammaloop-nextest-core>
  452. 35.66 s gammaloop-nextest-core> ━━━━━━━━━━━━━━━━━━━━━━━━━━━━━━━━━━ BACKTRACE ━━━━━━━━━━━━━━━━━━━━━━━━━━━━━━━━━━━
  453. 35.66 s gammaloop-nextest-core> 1: <color_eyre[b0c9e66060e883b2]::config::PanicHook>::panic_report<unknown>
  454. 35.66 s gammaloop-nextest-core> at <unknown source file>:<unknown line>
  455. 35.66 s gammaloop-nextest-core> 2: <color_eyre[b0c9e66060e883b2]::config::PanicHook>::into_panic_hook::{closure#0}<unknown>
  456. 35.66 s gammaloop-nextest-core> at <unknown source file>:<unknown line>
  457. 35.66 s gammaloop-nextest-core> 3: std[bcb96dfbba0ab899]::panicking::panic_with_hook<unknown>
  458. 35.66 s gammaloop-nextest-core> at <unknown source file>:<unknown line>
  459. 35.66 s gammaloop-nextest-core> 4: std[bcb96dfbba0ab899]::panicking::panic_handler::{closure#0}<unknown>
  460. 35.66 s gammaloop-nextest-core> at <unknown source file>:<unknown line>
  461. 35.66 s gammaloop-nextest-core> 5: std[bcb96dfbba0ab899]::sys::backtrace::__rust_end_short_backtrace::<std[bcb96dfbba0ab899]::panicking::panic_handler::{closure#0}, !><unknown>
  462. 35.66 s gammaloop-nextest-core> at <unknown source file>:<unknown line>
  463. 35.66 s gammaloop-nextest-core> 6: __rustc[6c289b9f9c454d21]::rust_begin_unwind<unknown>
  464. 35.66 s gammaloop-nextest-core> at <unknown source file>:<unknown line>
  465. 35.66 s gammaloop-nextest-core> 7: core[940e698046960fd5]::panicking::panic_fmt<unknown>
  466. 35.66 s gammaloop-nextest-core> at <unknown source file>:<unknown line>
  467. 35.66 s gammaloop-nextest-core> 8: core[940e698046960fd5]::panicking::panic<unknown>
  468. 35.66 s gammaloop-nextest-core> at <unknown source file>:<unknown line>
  469. 35.66 s gammaloop-nextest-core> 9: gammalooprs[5490727360442cce]::uv::export::tests::computed_node_full_numerator_is_a_spenso_aware_typst_fragment<unknown>
  470. 35.66 s gammaloop-nextest-core> at <unknown source file>:<unknown line>
  471. 35.66 s gammaloop-nextest-core> 10: <gammalooprs[5490727360442cce]::uv::export::tests::computed_node_full_numerator_is_a_spenso_aware_typst_fragment::{closure#0} as core[940e698046960fd5]::ops::function::FnOnce<()>>::call_once<unknown>
  472. 35.66 s gammaloop-nextest-core> at <unknown source file>:<unknown line>
  473. 35.66 s gammaloop-nextest-core> 11: test[75d6903177b1d7e9]::__rust_begin_short_backtrace::<core[940e698046960fd5]::result::Result<(), alloc[2ea6bcb46fca0c42]::string::String>, fn() -> core[940e698046960fd5]::result::Result<(), alloc[2ea6bcb46fca0c42]::string::String>><unknown>
  474. 35.66 s gammaloop-nextest-core> at <unknown source file>:<unknown line>
  475. 35.66 s gammaloop-nextest-core> 12: test[75d6903177b1d7e9]::run_test::{closure#0}<unknown>
  476. 35.66 s gammaloop-nextest-core> at <unknown source file>:<unknown line>
  477. 35.66 s gammaloop-nextest-core> 13: std[bcb96dfbba0ab899]::sys::backtrace::__rust_begin_short_backtrace::<test[75d6903177b1d7e9]::run_test::{closure#1}, ()><unknown>
  478. 35.66 s gammaloop-nextest-core> at <unknown source file>:<unknown line>
  479. 35.66 s gammaloop-nextest-core> 14: <std[bcb96dfbba0ab899]::thread::lifecycle::spawn_unchecked<test[75d6903177b1d7e9]::run_test::{closure#1}, ()>::{closure#1} as core[940e698046960fd5]::ops::function::FnOnce<()>>::call_once::{shim:vtable#0}<unknown>
  480. 35.66 s gammaloop-nextest-core> at <unknown source file>:<unknown line>
  481. 35.66 s gammaloop-nextest-core> 15: <std[bcb96dfbba0ab899]::sys::thread::unix::Thread>::new::thread_start<unknown>
  482. 35.66 s gammaloop-nextest-core> at <unknown source file>:<unknown line>
  483. 35.66 s gammaloop-nextest-core> 16: start_thread<unknown>
  484. 35.66 s gammaloop-nextest-core> at <unknown source file>:<unknown line>
  485. 35.66 s gammaloop-nextest-core> 17: __clone3<unknown>
  486. 35.66 s gammaloop-nextest-core> at <unknown source file>:<unknown line>
  487. 35.66 s gammaloop-nextest-core>
  488. 35.66 s gammaloop-nextest-core> Run with COLORBT_SHOW_HIDDEN=1 environment variable to disable frame filtering.
  489. 35.66 s gammaloop-nextest-core> Run with RUST_BACKTRACE=full to include source snippets.
  490. 35.66 s gammaloop-nextest-core>
  491. 35.75 s gammaloop-nextest-core> error: test run failed
  492. 35.79 s gammaloop-nextest-core>
  493. 35.79 s gammaloop-nextest-core> ========== nextest test summary ==========
  494. 35.79 s gammaloop-nextest-core> report: target/nextest/ci_gammaloop/junit.xml
  495. 35.79 s gammaloop-nextest-core> tests: 456, failures: 2, errors: 0
  496. 35.79 s gammaloop-nextest-core>
  497. 35.79 s gammaloop-nextest-core> 1. gammalooprs::graph::parse::tests::parse_lmbsetting_crossection
  498. 35.79 s gammaloop-nextest-core> failure: test failure with exit code 101
  499. 35.79 s gammaloop-nextest-core> system-out
  500. 35.79 s gammaloop-nextest-core> running 1 test
  501. 35.79 s gammaloop-nextest-core> ━━━━━━━━━━━━━━━━━━━━━━━━━━━━━━━ Snapshot Summary ━━━━━━━━━━━━━━━━━━━━━━━━━━━━━━━
  502. 35.79 s gammaloop-nextest-core> Snapshot: parse_lmbsetting_crossection
  503. 35.79 s gammaloop-nextest-core> Source: crates/gammalooprs/src/graph/parse/tests.rs:252
  504. 35.79 s gammaloop-nextest-core> ────────────────────────────────────────────────────────────────────────────────
  505. 35.79 s gammaloop-nextest-core> Expression: g.debug_dot()
  506. 35.79 s gammaloop-nextest-core> ────────────────────────────────────────────────────────────────────────────────
  507. 35.79 s gammaloop-nextest-core> -old snapshot
  508. 35.79 s gammaloop-nextest-core> +new results
  509. 35.79 s gammaloop-nextest-core> ────────────┬───────────────────────────────────────────────────────────────────
  510. 35.79 s gammaloop-nextest-core> 1 │-digraph G{
  511. 35.79 s gammaloop-nextest-core> 1 │+digraph G {
  512. 35.79 s gammaloop-nextest-core> 2 2 │ num = "1/2";
  513. 35.79 s gammaloop-nextest-core> 3 3 │ overall_factor = "2*x";
  514. 35.79 s gammaloop-nextest-core> 4 4 │ overall_factor_evaluated = "2*x";
  515. 35.79 s gammaloop-nextest-core> 5 5 │ projector = "spenso::t";
  516. 35.79 s gammaloop-nextest-core> ────────────┴───────────────────────────────────────────────────────────────────
  517. 35.79 s gammaloop-nextest-core> To update snapshots run `cargo insta review`
  518. 35.79 s gammaloop-nextest-core> Stopped on the first failure. Run `cargo insta test` to run all snapshots.
  519. 35.79 s gammaloop-nextest-core> test graph::parse::tests::parse_lmbsetting_crossection ... FAILED
  520. 35.79 s gammaloop-nextest-core>
  521. 35.79 s gammaloop-nextest-core> failures:
  522. 35.79 s gammaloop-nextest-core>
  523. 35.79 s gammaloop-nextest-core> failures:
  524. 35.79 s gammaloop-nextest-core> graph::parse::tests::parse_lmbsetting_crossection
  525. 35.79 s gammaloop-nextest-core>
  526. 35.79 s gammaloop-nextest-core> test result: FAILED. 0 passed; 1 failed; 0 ignored; 0 measured; 508 filtered out; finished in 0.30s
  527. 35.79 s gammaloop-nextest-core> system-err
  528. 35.79 s gammaloop-nextest-core> [20:20:47.859] @gammalooprs::graph::attribute_warnings WARNING : Unknown node attribute 'color_num' on graph 'G', node 'A'; did you mean 'num'?
  529. 35.79 s gammaloop-nextest-core> at crates/gammalooprs/src/graph/attribute_warnings.rs:198
  530. 35.79 s gammaloop-nextest-core> The application panicked (crashed).
  531. 35.79 s gammaloop-nextest-core> Message: snapshot assertion for 'parse_lmbsetting_crossection' failed in line 252
  532. 35.79 s gammaloop-nextest-core> Location: /nix/store/xdy1vvhll2bijdplvl9fcc2b9plkxhaa-vendor-cargo-deps/c19b7c6f923b580ac259164a89f2577984ad5ab09ee9d583b888f934adbbe8d0/insta-1.47.2/src/runtime.rs:719
  533. 35.79 s gammaloop-nextest-core>
  534. 35.79 s gammaloop-nextest-core> ━━━━━━━━━━━━━━━━━━━━━━━━━━━━━━━━━━ BACKTRACE ━━━━━━━━━━━━━━━━━━━━━━━━━━━━━━━━━━━
  535. 35.79 s gammaloop-nextest-core> 1: <color_eyre[b0c9e66060e883b2]::config::PanicHook>::panic_report<unknown>
  536. 35.79 s gammaloop-nextest-core> at <unknown source file>:<unknown line>
  537. 35.79 s gammaloop-nextest-core> 2: <color_eyre[b0c9e66060e883b2]::config::PanicHook>::into_panic_hook::{closure#0}<unknown>
  538. 35.79 s gammaloop-nextest-core> at <unknown source file>:<unknown line>
  539. 35.79 s gammaloop-nextest-core> 3: std[bcb96dfbba0ab899]::panicking::panic_with_hook<unknown>
  540. 35.79 s gammaloop-nextest-core> at <unknown source file>:<unknown line>
  541. 35.79 s gammaloop-nextest-core> 4: std[bcb96dfbba0ab899]::panicking::panic_handler::{closure#0}<unknown>
  542. 35.79 s gammaloop-nextest-core> at <unknown source file>:<unknown line>
  543. 35.79 s gammaloop-nextest-core> 5: std[bcb96dfbba0ab899]::sys::backtrace::__rust_end_short_backtrace::<std[bcb96dfbba0ab899]::panicking::panic_handler::{closure#0}, !><unknown>
  544. 35.79 s gammaloop-nextest-core> at <unknown source file>:<unknown line>
  545. 35.79 s gammaloop-nextest-core> 6: __rustc[6c289b9f9c454d21]::rust_begin_unwind<unknown>
  546. 35.79 s gammaloop-nextest-core> at <unknown source file>:<unknown line>
  547. 35.79 s gammaloop-nextest-core> 7: core[940e698046960fd5]::panicking::panic_fmt<unknown>
  548. 35.79 s gammaloop-nextest-core> at <unknown source file>:<unknown line>
  549. 35.79 s gammaloop-nextest-core> 8: insta[307a548ac79ef4d9]::runtime::assert_snapshot<unknown>
  550. 35.79 s gammaloop-nextest-core> at <unknown source file>:<unknown line>
  551. 35.79 s gammaloop-nextest-core> 9: gammalooprs[5490727360442cce]::graph::parse::tests::parse_lmbsetting_crossection<unknown>
  552. 35.79 s gammaloop-nextest-core> at <unknown source file>:<unknown line>
  553. 35.79 s gammaloop-nextest-core> 10: <gammalooprs[5490727360442cce]::graph::parse::tests::parse_lmbsetting_crossection::{closure#0} as core[940e698046960fd5]::ops::function::FnOnce<()>>::call_once<unknown>
  554. 35.79 s gammaloop-nextest-core> at <unknown source file>:<unknown line>
  555. 35.79 s gammaloop-nextest-core> 11: test[75d6903177b1d7e9]::__rust_begin_short_backtrace::<core[940e698046960fd5]::result::Result<(), alloc[2ea6bcb46fca0c42]::string::String>, fn() -> core[940e698046960fd5]::result::Result<(), alloc[2ea6bcb46fca0c42]::string::String>><unknown>
  556. 35.79 s gammaloop-nextest-core> at <unknown source file>:<unknown line>
  557. 35.79 s gammaloop-nextest-core> 12: test[75d6903177b1d7e9]::run_test::{closure#0}<unknown>
  558. 35.79 s gammaloop-nextest-core> at <unknown source file>:<unknown line>
  559. 35.79 s gammaloop-nextest-core> 13: std[bcb96dfbba0ab899]::sys::backtrace::__rust_begin_short_backtrace::<test[75d6903177b1d7e9]::run_test::{closure#1}, ()><unknown>
  560. 35.79 s gammaloop-nextest-core> at <unknown source file>:<unknown line>
  561. 35.79 s gammaloop-nextest-core> 14: <std[bcb96dfbba0ab899]::thread::lifecycle::spawn_unchecked<test[75d6903177b1d7e9]::run_test::{closure#1}, ()>::{closure#1} as core[940e698046960fd5]::ops::function::FnOnce<()>>::call_once::{shim:vtable#0}<unknown>
  562. 35.79 s gammaloop-nextest-core> at <unknown source file>:<unknown line>
  563. 35.79 s gammaloop-nextest-core> 15: <std[bcb96dfbba0ab899]::sys::thread::unix::Thread>::new::thread_start<unknown>
  564. 35.79 s gammaloop-nextest-core> at <unknown source file>:<unknown line>
  565. 35.79 s gammaloop-nextest-core> 16: start_thread<unknown>
  566. 35.79 s gammaloop-nextest-core> at <unknown source file>:<unknown line>
  567. 35.79 s gammaloop-nextest-core> 17: __clone3<unknown>
  568. 35.79 s gammaloop-nextest-core> at <unknown source file>:<unknown line>
  569. 35.79 s gammaloop-nextest-core>
  570. 35.79 s gammaloop-nextest-core> Run with COLORBT_SHOW_HIDDEN=1 environment variable to disable frame filtering.
  571. 35.79 s gammaloop-nextest-core> Run with RUST_BACKTRACE=full to include source snippets.
  572. 35.79 s gammaloop-nextest-core>
  573. 35.79 s gammaloop-nextest-core> 2. gammalooprs::uv::export::tests::computed_node_full_numerator_is_a_spenso_aware_typst_fragment
  574. 35.79 s gammaloop-nextest-core> failure: test failure with exit code 101
  575. 35.79 s gammaloop-nextest-core> system-out
  576. 35.79 s gammaloop-nextest-core> running 1 test
  577. 35.79 s gammaloop-nextest-core> test uv::export::tests::computed_node_full_numerator_is_a_spenso_aware_typst_fragment ... FAILED
  578. 35.79 s gammaloop-nextest-core>
  579. 35.79 s gammaloop-nextest-core> failures:
  580. 35.79 s gammaloop-nextest-core>
  581. 35.79 s gammaloop-nextest-core> failures:
  582. 35.79 s gammaloop-nextest-core> uv::export::tests::computed_node_full_numerator_is_a_spenso_aware_typst_fragment
  583. 35.79 s gammaloop-nextest-core>
  584. 35.79 s gammaloop-nextest-core> test result: FAILED. 0 passed; 1 failed; 0 ignored; 0 measured; 508 filtered out; finished in 0.24s
  585. 35.79 s gammaloop-nextest-core> system-err
  586. 35.79 s gammaloop-nextest-core> The application panicked (crashed).
  587. 35.79 s gammaloop-nextest-core> Message: assertion failed: exported.dot.contains(r#"full_num = "op(\"Tr\")(1)";"#)
  588. 35.79 s gammaloop-nextest-core> Location: crates/gammalooprs/src/uv/export.rs:483
  589. 35.79 s gammaloop-nextest-core>
  590. 35.79 s gammaloop-nextest-core> ━━━━━━━━━━━━━━━━━━━━━━━━━━━━━━━━━━ BACKTRACE ━━━━━━━━━━━━━━━━━━━━━━━━━━━━━━━━━━━
  591. 35.79 s gammaloop-nextest-core> 1: <color_eyre[b0c9e66060e883b2]::config::PanicHook>::panic_report<unknown>
  592. 35.79 s gammaloop-nextest-core> at <unknown source file>:<unknown line>
  593. 35.79 s gammaloop-nextest-core> 2: <color_eyre[b0c9e66060e883b2]::config::PanicHook>::into_panic_hook::{closure#0}<unknown>
  594. 35.79 s gammaloop-nextest-core> at <unknown source file>:<unknown line>
  595. 35.79 s gammaloop-nextest-core> 3: std[bcb96dfbba0ab899]::panicking::panic_with_hook<unknown>
  596. 35.79 s gammaloop-nextest-core> at <unknown source file>:<unknown line>
  597. 35.79 s gammaloop-nextest-core> 4: std[bcb96dfbba0ab899]::panicking::panic_handler::{closure#0}<unknown>
  598. 35.79 s gammaloop-nextest-core> at <unknown source file>:<unknown line>
  599. 35.79 s gammaloop-nextest-core> 5: std[bcb96dfbba0ab899]::sys::backtrace::__rust_end_short_backtrace::<std[bcb96dfbba0ab899]::panicking::panic_handler::{closure#0}, !><unknown>
  600. 35.79 s gammaloop-nextest-core> at <unknown source file>:<unknown line>
  601. 35.79 s gammaloop-nextest-core> 6: __rustc[6c289b9f9c454d21]::rust_begin_unwind<unknown>
  602. 35.79 s gammaloop-nextest-core> at <unknown source file>:<unknown line>
  603. 35.79 s gammaloop-nextest-core> 7: core[940e698046960fd5]::panicking::panic_fmt<unknown>
  604. 35.79 s gammaloop-nextest-core> at <unknown source file>:<unknown line>
  605. 35.79 s gammaloop-nextest-core> 8: core[940e698046960fd5]::panicking::panic<unknown>
  606. 35.79 s gammaloop-nextest-core> at <unknown source file>:<unknown line>
  607. 35.79 s gammaloop-nextest-core> 9: gammalooprs[5490727360442cce]::uv::export::tests::computed_node_full_numerator_is_a_spenso_aware_typst_fragment<unknown>
  608. 35.79 s gammaloop-nextest-core> at <unknown source file>:<unknown line>
  609. 35.79 s gammaloop-nextest-core> 10: <gammalooprs[5490727360442cce]::uv::export::tests::computed_node_full_numerator_is_a_spenso_aware_typst_fragment::{closure#0} as core[940e698046960fd5]::ops::function::FnOnce<()>>::call_once<unknown>
  610. 35.79 s gammaloop-nextest-core> at <unknown source file>:<unknown line>
  611. 35.79 s gammaloop-nextest-core> 11: test[75d6903177b1d7e9]::__rust_begin_short_backtrace::<core[940e698046960fd5]::result::Result<(), alloc[2ea6bcb46fca0c42]::string::String>, fn() -> core[940e698046960fd5]::result::Result<(), alloc[2ea6bcb46fca0c42]::string::String>><unknown>
  612. 35.79 s gammaloop-nextest-core> at <unknown source file>:<unknown line>
  613. 35.79 s gammaloop-nextest-core> 12: test[75d6903177b1d7e9]::run_test::{closure#0}<unknown>
  614. 35.79 s gammaloop-nextest-core> at <unknown source file>:<unknown line>
  615. 35.79 s gammaloop-nextest-core> 13: std[bcb96dfbba0ab899]::sys::backtrace::__rust_begin_short_backtrace::<test[75d6903177b1d7e9]::run_test::{closure#1}, ()><unknown>
  616. 35.79 s gammaloop-nextest-core> at <unknown source file>:<unknown line>
  617. 35.79 s gammaloop-nextest-core> 14: <std[bcb96dfbba0ab899]::thread::lifecycle::spawn_unchecked<test[75d6903177b1d7e9]::run_test::{closure#1}, ()>::{closure#1} as core[940e698046960fd5]::ops::function::FnOnce<()>>::call_once::{shim:vtable#0}<unknown>
  618. 35.79 s gammaloop-nextest-core> at <unknown source file>:<unknown line>
  619. 35.79 s gammaloop-nextest-core> 15: <std[bcb96dfbba0ab899]::sys::thread::unix::Thread>::new::thread_start<unknown>
  620. 35.79 s gammaloop-nextest-core> at <unknown source file>:<unknown line>
  621. 35.79 s gammaloop-nextest-core> 16: start_thread<unknown>
  622. 35.79 s gammaloop-nextest-core> at <unknown source file>:<unknown line>
  623. 35.79 s gammaloop-nextest-core> 17: __clone3<unknown>
  624. 35.79 s gammaloop-nextest-core> at <unknown source file>:<unknown line>
  625. 35.79 s gammaloop-nextest-core>
  626. 35.79 s gammaloop-nextest-core> Run with COLORBT_SHOW_HIDDEN=1 environment variable to disable frame filtering.
  627. 35.79 s gammaloop-nextest-core> Run with RUST_BACKTRACE=full to include source snippets.
  628. 35.79 s gammaloop-nextest-core> =========================================
  629. 35.86 s [0 built (1 failed)]error: Cannot build '/nix/store/07lma8g6p1n7jxf8azmxf90ca6pqjydj-gammaloop-nextest-core.drv'.
  630. 35.86 s Reason: builder failed with exit code 100.
  631. 35.86 s Output paths:
  632. 35.86 s /nix/store/cb0qr129ypswd8fgpp9k932nrjfvk3s0-gammaloop-nextest-core
  633. 35.86 s Last 612 log lines:
  634. 35.86 s > Extracting 3 binaries (including 1 non-test binary), 1 build script output directory, and 2 linked paths to /build/nextest-archive-s6taKa
  635. 35.86 s > Extracted 18 files to /build/nextest-archive-s6taKa in 0.62s
  636. 35.86 s > ------------
  637. 35.86 s > Nextest run ID d57f890a-0c80-46ea-8a65-3136c8ae4f31 with nextest profile: ci_gammaloop
  638. 35.86 s > Starting 339 tests across 2 binaries
  639. 35.86 s > FAIL [ 0.044s] (244/339) gammaloop-api repl::tests::completion_shows_type_hint_for_non_boolean_settings_leaf
  640. 35.86 s > stdout ---
  641. 35.86 s >
  642. 35.86 s > running 1 test
  643. 35.86 s > test repl::tests::completion_shows_type_hint_for_non_boolean_settings_leaf ... FAILED
  644. 35.86 s >
  645. 35.86 s > failures:
  646. 35.86 s >
  647. 35.86 s > failures:
  648. 35.86 s > repl::tests::completion_shows_type_hint_for_non_boolean_settings_leaf
  649. 35.86 s >
  650. 35.86 s > test result: FAILED. 0 passed; 1 failed; 0 ignored; 0 measured; 338 filtered out; finished in 0.02s
  651. 35.86 s >
  652. 35.86 s > stderr ---
  653. 35.86 s >
  654. 35.86 s > thread 'repl::tests::completion_shows_type_hint_for_non_boolean_settings_leaf' (782) panicked at crates/gammaloop-api/src/repl.rs:5778:9:
  655. 35.86 s > [Suggestion { value: "", description: Some("Number of samples in the first Monte Carlo iteration."), style: None, extra: None, span: Span { start: 42, end: 42 }, append_whitespace: false }]
  656. 35.86 s > stack backtrace:
  657. 35.86 s > 0: __rustc::rust_begin_unwind
  658. 35.86 s > 1: core::panicking::panic_fmt
  659. 35.86 s > 2: gammaloop_api::repl::tests::completion_shows_type_hint_for_non_boolean_settings_leaf
  660. 35.86 s > 3: <gammaloop_api::repl::tests::completion_shows_type_hint_for_non_boolean_settings_leaf::{closure#0} as core::ops::function::FnOnce<()>>::call_once
  661. 35.86 s > note: Some details are omitted, run with `RUST_BACKTRACE=full` for a verbose backtrace.
  662. 35.86 s >
  663. 35.86 s > FAIL [ 0.043s] (279/339) gammaloop-api templates::tests::extract_templates_uses_canonical_package_layout
  664. 35.86 s > stdout ---
  665. 35.86 s >
  666. 35.86 s > running 1 test
  667. 35.86 s > test templates::tests::extract_templates_uses_canonical_package_layout ... FAILED
  668. 35.86 s >
  669. 35.86 s > failures:
  670. 35.86 s >
  671. 35.86 s > failures:
  672. 35.86 s > templates::tests::extract_templates_uses_canonical_package_layout
  673. 35.86 s >
  674. 35.86 s > test result: FAILED. 0 passed; 1 failed; 0 ignored; 0 measured; 338 filtered out; finished in 0.03s
  675. 35.86 s >
  676. 35.86 s > stderr ---
  677. 35.86 s >
  678. 35.86 s > thread 'templates::tests::extract_templates_uses_canonical_package_layout' (874) panicked at crates/gammaloop-api/src/templates.rs:99:9:
  679. 35.86 s > assertion failed: figure.contains("amplitude-mode")
  680. 35.86 s > stack backtrace:
  681. 35.86 s > 0: __rustc::rust_begin_unwind
  682. 35.86 s > 1: core::panicking::panic_fmt
  683. 35.86 s > 2: core::panicking::panic
  684. 35.86 s > 3: gammaloop_api::templates::tests::extract_templates_uses_canonical_package_layout
  685. 35.86 s > 4: <gammaloop_api::templates::tests::extract_templates_uses_canonical_package_layout::{closure#0} as core::ops::function::FnOnce<()>>::call_once
  686. 35.86 s > note: Some details are omitted, run with `RUST_BACKTRACE=full` for a verbose backtrace.
  687. 35.86 s >
  688. 35.86 s > ------------
  689. 35.86 s > Summary [ 1.008s] 339 tests run: 337 passed, 2 failed, 0 skipped
  690. 35.86 s > FAIL [ 0.044s] (244/339) gammaloop-api repl::tests::completion_shows_type_hint_for_non_boolean_settings_leaf
  691. 35.86 s > stdout ---
  692. 35.86 s >
  693. 35.86 s > running 1 test
  694. 35.86 s > test repl::tests::completion_shows_type_hint_for_non_boolean_settings_leaf ... FAILED
  695. 35.86 s >
  696. 35.86 s > failures:
  697. 35.86 s >
  698. 35.86 s > failures:
  699. 35.86 s > repl::tests::completion_shows_type_hint_for_non_boolean_settings_leaf
  700. 35.86 s >
  701. 35.86 s > test result: FAILED. 0 passed; 1 failed; 0 ignored; 0 measured; 338 filtered out; finished in 0.02s
  702. 35.86 s >
  703. 35.86 s > stderr ---
  704. 35.86 s >
  705. 35.86 s > thread 'repl::tests::completion_shows_type_hint_for_non_boolean_settings_leaf' (782) panicked at crates/gammaloop-api/src/repl.rs:5778:9:
  706. 35.86 s > [Suggestion { value: "", description: Some("Number of samples in the first Monte Carlo iteration."), style: None, extra: None, span: Span { start: 42, end: 42 }, append_whitespace: false }]
  707. 35.86 s > stack backtrace:
  708. 35.86 s > 0: __rustc::rust_begin_unwind
  709. 35.86 s > 1: core::panicking::panic_fmt
  710. 35.86 s > 2: gammaloop_api::repl::tests::completion_shows_type_hint_for_non_boolean_settings_leaf
  711. 35.86 s > 3: <gammaloop_api::repl::tests::completion_shows_type_hint_for_non_boolean_settings_leaf::{closure#0} as core::ops::function::FnOnce<()>>::call_once
  712. 35.86 s > note: Some details are omitted, run with `RUST_BACKTRACE=full` for a verbose backtrace.
  713. 35.86 s >
  714. 35.86 s > FAIL [ 0.043s] (279/339) gammaloop-api templates::tests::extract_templates_uses_canonical_package_layout
  715. 35.86 s > stdout ---
  716. 35.86 s >
  717. 35.86 s > running 1 test
  718. 35.86 s > test templates::tests::extract_templates_uses_canonical_package_layout ... FAILED
  719. 35.86 s >
  720. 35.86 s > failures:
  721. 35.86 s >
  722. 35.86 s > failures:
  723. 35.86 s > templates::tests::extract_templates_uses_canonical_package_layout
  724. 35.86 s >
  725. 35.86 s > test result: FAILED. 0 passed; 1 failed; 0 ignored; 0 measured; 338 filtered out; finished in 0.03s
  726. 35.86 s >
  727. 35.86 s > stderr ---
  728. 35.86 s >
  729. 35.86 s > thread 'templates::tests::extract_templates_uses_canonical_package_layout' (874) panicked at crates/gammaloop-api/src/templates.rs:99:9:
  730. 35.86 s > assertion failed: figure.contains("amplitude-mode")
  731. 35.86 s > stack backtrace:
  732. 35.86 s > 0: __rustc::rust_begin_unwind
  733. 35.86 s > 1: core::panicking::panic_fmt
  734. 35.86 s > 2: core::panicking::panic
  735. 35.86 s > 3: gammaloop_api::templates::tests::extract_templates_uses_canonical_package_layout
  736. 35.86 s > 4: <gammaloop_api::templates::tests::extract_templates_uses_canonical_package_layout::{closure#0} as core::ops::function::FnOnce<()>>::call_once
  737. 35.86 s > note: Some details are omitted, run with `RUST_BACKTRACE=full` for a verbose backtrace.
  738. 35.86 s >
  739. 35.86 s > error: test run failed
  740. 35.86 s >
  741. 35.86 s > ========== nextest test summary ==========
  742. 35.86 s > report: target/nextest/ci_gammaloop/junit.xml
  743. 35.86 s > tests: 339, failures: 2, errors: 0
  744. 35.86 s >
  745. 35.86 s > 1. gammaloop-api::repl::tests::completion_shows_type_hint_for_non_boolean_settings_leaf
  746. 35.86 s > failure: test failure with exit code 101
  747. 35.86 s > thread 'repl::tests::completion_shows_type_hint_for_non_boolean_settings_leaf' (782) panicked at crates/gammaloop-api/src/repl.rs:5778:9:
  748. 35.86 s > [Suggestion { value: "", description: Some("Number of samples in the first Monte Carlo iteration."), style: None, extra: None, span: Span { start: 42, end: 42 }, append_whitespace: false }]
  749. 35.86 s > stack backtrace:
  750. 35.86 s > 0: __rustc::rust_begin_unwind
  751. 35.86 s > 1: core::panicking::panic_fmt
  752. 35.86 s > 2: gammaloop_api::repl::tests::completion_shows_type_hint_for_non_boolean_settings_leaf
  753. 35.86 s > 3: <gammaloop_api::repl::tests::completion_shows_type_hint_for_non_boolean_settings_leaf::{closure#0} as core::ops::function::FnOnce<()>>::call_once
  754. 35.86 s > note: Some details are omitted, run with `RUST_BACKTRACE=full` for a verbose backtrace.
  755. 35.86 s > system-out
  756. 35.86 s > running 1 test
  757. 35.86 s > test repl::tests::completion_shows_type_hint_for_non_boolean_settings_leaf ... FAILED
  758. 35.86 s >
  759. 35.86 s > failures:
  760. 35.86 s >
  761. 35.86 s > failures:
  762. 35.86 s > repl::tests::completion_shows_type_hint_for_non_boolean_settings_leaf
  763. 35.86 s >
  764. 35.86 s > test result: FAILED. 0 passed; 1 failed; 0 ignored; 0 measured; 338 filtered out; finished in 0.02s
  765. 35.86 s > system-err
  766. 35.86 s > thread 'repl::tests::completion_shows_type_hint_for_non_boolean_settings_leaf' (782) panicked at crates/gammaloop-api/src/repl.rs:5778:9:
  767. 35.86 s > [Suggestion { value: "", description: Some("Number of samples in the first Monte Carlo iteration."), style: None, extra: None, span: Span { start: 42, end: 42 }, append_whitespace: false }]
  768. 35.86 s > stack backtrace:
  769. 35.86 s > 0: __rustc::rust_begin_unwind
  770. 35.86 s > 1: core::panicking::panic_fmt
  771. 35.86 s > 2: gammaloop_api::repl::tests::completion_shows_type_hint_for_non_boolean_settings_leaf
  772. 35.86 s > 3: <gammaloop_api::repl::tests::completion_shows_type_hint_for_non_boolean_settings_leaf::{closure#0} as core::ops::function::FnOnce<()>>::call_once
  773. 35.86 s > note: Some details are omitted, run with `RUST_BACKTRACE=full` for a verbose backtrace.
  774. 35.86 s >
  775. 35.86 s > 2. gammaloop-api::templates::tests::extract_templates_uses_canonical_package_layout
  776. 35.86 s > failure: test failure with exit code 101
  777. 35.86 s > thread 'templates::tests::extract_templates_uses_canonical_package_layout' (874) panicked at crates/gammaloop-api/src/templates.rs:99:9:
  778. 35.86 s > assertion failed: figure.contains("amplitude-mode")
  779. 35.86 s > stack backtrace:
  780. 35.86 s > 0: __rustc::rust_begin_unwind
  781. 35.86 s > 1: core::panicking::panic_fmt
  782. 35.86 s > 2: core::panicking::panic
  783. 35.86 s > 3: gammaloop_api::templates::tests::extract_templates_uses_canonical_package_layout
  784. 35.86 s > 4: <gammaloop_api::templates::tests::extract_templates_uses_canonical_package_layout::{closure#0} as core::ops::function::FnOnce<()>>::call_once
  785. 35.86 s > note: Some details are omitted, run with `RUST_BACKTRACE=full` for a verbose backtrace.
  786. 35.86 s > system-out
  787. 35.86 s > running 1 test
  788. 35.86 s > test templates::tests::extract_templates_uses_canonical_package_layout ... FAILED
  789. 35.86 s >
  790. 35.86 s > failures:
  791. 35.86 s >
  792. 35.86 s > failures:
  793. 35.86 s > templates::tests::extract_templates_uses_canonical_package_layout
  794. 35.86 s >
  795. 35.86 s > test result: FAILED. 0 passed; 1 failed; 0 ignored; 0 measured; 338 filtered out; finished in 0.03s
  796. 35.86 s > system-err
  797. 35.86 s > thread 'templates::tests::extract_templates_uses_canonical_package_layout' (874) panicked at crates/gammaloop-api/src/templates.rs:99:9:
  798. 35.86 s > assertion failed: figure.contains("amplitude-mode")
  799. 35.86 s > stack backtrace:
  800. 35.86 s > 0: __rustc::rust_begin_unwind
  801. 35.86 s > 1: core::panicking::panic_fmt
  802. 35.86 s > 2: core::panicking::panic
  803. 35.86 s > 3: gammaloop_api::templates::tests::extract_templates_uses_canonical_package_layout
  804. 35.86 s > 4: <gammaloop_api::templates::tests::extract_templates_uses_canonical_package_layout::{closure#0} as core::ops::function::FnOnce<()>>::call_once
  805. 35.86 s > note: Some details are omitted, run with `RUST_BACKTRACE=full` for a verbose backtrace.
  806. 35.86 s > =========================================
  807. 35.86 s > Extracting 1 binary and 1 linked path to /build/nextest-archive-lhiKhq
  808. 35.86 s > Extracted 7 files to /build/nextest-archive-lhiKhq in 0.10s
  809. 35.86 s > ------------
  810. 35.86 s > Nextest run ID 7eacee3b-d0ae-47b2-97ec-9b225e95ee80 with nextest profile: ci_gammaloop
  811. 35.86 s > Starting 19 tests across 1 binary
  812. 35.86 s > ------------
  813. 35.86 s > Summary [ 0.048s] 19 tests run: 19 passed, 0 skipped
  814. 35.86 s >
  815. 35.86 s > ========== nextest test summary ==========
  816. 35.86 s > report: target/nextest/ci_gammaloop/junit.xml
  817. 35.86 s > tests: 19, failures: 0, errors: 0
  818. 35.86 s > No failing testcases found.
  819. 35.86 s > =========================================
  820. 35.86 s > Extracting 1 binary to /build/nextest-archive-lI8lGR
  821. 35.86 s > Extracted 4 files to /build/nextest-archive-lI8lGR in 0.06s
  822. 35.86 s > ------------
  823. 35.86 s > Nextest run ID a2374c0c-e4f7-4d26-9b23-314843cf7719 with nextest profile: ci_gammaloop
  824. 35.86 s > Starting 0 tests across 1 binary
  825. 35.86 s > ------------
  826. 35.86 s > Summary [ 0.002s] 0 tests run: 0 passed, 0 skipped
  827. 35.86 s >
  828. 35.86 s > ========== nextest test summary ==========
  829. 35.86 s > report: target/nextest/ci_gammaloop/junit.xml
  830. 35.86 s > tests: 0, failures: 0, errors: 0
  831. 35.86 s > No failing testcases found.
  832. 35.86 s > =========================================
  833. 35.86 s > Extracting 4 binaries, 1 build script output directory, and 2 linked paths to /build/nextest-archive-wQWP4O
  834. 35.86 s > Extracted 18 files to /build/nextest-archive-wQWP4O in 0.74s
  835. 35.86 s > ------------
  836. 35.86 s > Nextest run ID b9a43d33-dd01-494b-b82b-c0f4e76e2e50 with nextest profile: ci_gammaloop
  837. 35.86 s > Starting 456 tests across 4 binaries (61 tests skipped, including 60 tests via profile.ci_gammaloop.default-filter)
  838. 35.86 s > FAIL [ 0.333s] ( 79/456) gammalooprs graph::parse::tests::parse_lmbsetting_crossection
  839. 35.86 s > stdout ---
  840. 35.86 s >
  841. 35.86 s > running 1 test
  842. 35.86 s > ━━━━━━━━━━━━━━━━━━━━━━━━━━━━━━━ Snapshot Summary ━━━━━━━━━━━━━━━━━━━━━━━━━━━━━━━
  843. 35.86 s > Snapshot: parse_lmbsetting_crossection
  844. 35.86 s > Source: crates/gammalooprs/src/graph/parse/tests.rs:252
  845. 35.86 s > ────────────────────────────────────────────────────────────────────────────────
  846. 35.86 s > Expression: g.debug_dot()
  847. 35.86 s > ────────────────────────────────────────────────────────────────────────────────
  848. 35.86 s > -old snapshot
  849. 35.86 s > +new results
  850. 35.86 s > ────────────┬───────────────────────────────────────────────────────────────────
  851. 35.86 s > 1 │-digraph G{
  852. 35.86 s > 1 │+digraph G {
  853. 35.86 s > 2 2 │ num = "1/2";
  854. 35.86 s > 3 3 │ overall_factor = "2*x";
  855. 35.86 s > 4 4 │ overall_factor_evaluated = "2*x";
  856. 35.86 s > 5 5 │ projector = "spenso::t";
  857. 35.86 s > ────────────┴───────────────────────────────────────────────────────────────────
  858. 35.86 s > To update snapshots run `cargo insta review`
  859. 35.86 s > Stopped on the first failure. Run `cargo insta test` to run all snapshots.
  860. 35.86 s > test graph::parse::tests::parse_lmbsetting_crossection ... FAILED
  861. 35.86 s >
  862. 35.86 s > failures:
  863. 35.86 s >
  864. 35.86 s > failures:
  865. 35.86 s > graph::parse::tests::parse_lmbsetting_crossection
  866. 35.86 s >
  867. 35.86 s > test result: FAILED. 0 passed; 1 failed; 0 ignored; 0 measured; 508 filtered out; finished in 0.30s
  868. 35.86 s >
  869. 35.86 s > stderr ---
  870. 35.86 s > [20:20:47.859] @gammalooprs::graph::attribute_warnings WARNING : Unknown node attribute 'color_num' on graph 'G', node 'A'; did you mean 'num'?
  871. 35.86 s > at crates/gammalooprs/src/graph/attribute_warnings.rs:198
  872. 35.86 s > The application panicked (crashed).
  873. 35.86 s > Message: snapshot assertion for 'parse_lmbsetting_crossection' failed in line 252
  874. 35.86 s > Location: /nix/store/xdy1vvhll2bijdplvl9fcc2b9plkxhaa-vendor-cargo-deps/c19b7c6f923b580ac259164a89f2577984ad5ab09ee9d583b888f934adbbe8d0/insta-1.47.2/src/runtime.rs:719
  875. 35.86 s >
  876. 35.86 s > ━━━━━━━━━━━━━━━━━━━━━━━━━━━━━━━━━━ BACKTRACE ━━━━━━━━━━━━━━━━━━━━━━━━━━━━━━━━━━━
  877. 35.86 s > 1: <color_eyre[b0c9e66060e883b2]::config::PanicHook>::panic_report<unknown>
  878. 35.86 s > at <unknown source file>:<unknown line>
  879. 35.86 s > 2: <color_eyre[b0c9e66060e883b2]::config::PanicHook>::into_panic_hook::{closure#0}<unknown>
  880. 35.86 s > at <unknown source file>:<unknown line>
  881. 35.86 s > 3: std[bcb96dfbba0ab899]::panicking::panic_with_hook<unknown>
  882. 35.86 s > at <unknown source file>:<unknown line>
  883. 35.86 s > 4: std[bcb96dfbba0ab899]::panicking::panic_handler::{closure#0}<unknown>
  884. 35.86 s > at <unknown source file>:<unknown line>
  885. 35.86 s > 5: std[bcb96dfbba0ab899]::sys::backtrace::__rust_end_short_backtrace::<std[bcb96dfbba0ab899]::panicking::panic_handler::{closure#0}, !><unknown>
  886. 35.86 s > at <unknown source file>:<unknown line>
  887. 35.86 s > 6: __rustc[6c289b9f9c454d21]::rust_begin_unwind<unknown>
  888. 35.86 s > at <unknown source file>:<unknown line>
  889. 35.86 s > 7: core[940e698046960fd5]::panicking::panic_fmt<unknown>
  890. 35.86 s > at <unknown source file>:<unknown line>
  891. 35.86 s > 8: insta[307a548ac79ef4d9]::runtime::assert_snapshot<unknown>
  892. 35.86 s > at <unknown source file>:<unknown line>
  893. 35.86 s > 9: gammalooprs[5490727360442cce]::graph::parse::tests::parse_lmbsetting_crossection<unknown>
  894. 35.86 s > at <unknown source file>:<unknown line>
  895. 35.86 s > 10: <gammalooprs[5490727360442cce]::graph::parse::tests::parse_lmbsetting_crossection::{closure#0} as core[940e698046960fd5]::ops::function::FnOnce<()>>::call_once<unknown>
  896. 35.86 s > at <unknown source file>:<unknown line>
  897. 35.86 s > 11: test[75d6903177b1d7e9]::__rust_begin_short_backtrace::<core[940e698046960fd5]::result::Result<(), alloc[2ea6bcb46fca0c42]::string::String>, fn() -> core[940e698046960fd5]::result::Result<(), alloc[2ea6bcb46fca0c42]::string::String>><unknown>
  898. 35.86 s > at <unknown source file>:<unknown line>
  899. 35.86 s > 12: test[75d6903177b1d7e9]::run_test::{closure#0}<unknown>
  900. 35.86 s > at <unknown source file>:<unknown line>
  901. 35.86 s > 13: std[bcb96dfbba0ab899]::sys::backtrace::__rust_begin_short_backtrace::<test[75d6903177b1d7e9]::run_test::{closure#1}, ()><unknown>
  902. 35.86 s > at <unknown source file>:<unknown line>
  903. 35.86 s > 14: <std[bcb96dfbba0ab899]::thread::lifecycle::spawn_unchecked<test[75d6903177b1d7e9]::run_test::{closure#1}, ()>::{closure#1} as core[940e698046960fd5]::ops::function::FnOnce<()>>::call_once::{shim:vtable#0}<unknown>
  904. 35.86 s > at <unknown source file>:<unknown line>
  905. 35.86 s > 15: <std[bcb96dfbba0ab899]::sys::thread::unix::Thread>::new::thread_start<unknown>
  906. 35.86 s > at <unknown source file>:<unknown line>
  907. 35.86 s > 16: start_thread<unknown>
  908. 35.86 s > at <unknown source file>:<unknown line>
  909. 35.86 s > 17: __clone3<unknown>
  910. 35.86 s > at <unknown source file>:<unknown line>
  911. 35.86 s >
  912. 35.86 s > Run with COLORBT_SHOW_HIDDEN=1 environment variable to disable frame filtering.
  913. 35.86 s > Run with RUST_BACKTRACE=full to include source snippets.
  914. 35.86 s >
  915. 35.86 s > FAIL [ 0.276s] (409/456) gammalooprs uv::export::tests::computed_node_full_numerator_is_a_spenso_aware_typst_fragment
  916. 35.86 s > stdout ---
  917. 35.86 s >
  918. 35.86 s > running 1 test
  919. 35.86 s > test uv::export::tests::computed_node_full_numerator_is_a_spenso_aware_typst_fragment ... FAILED
  920. 35.86 s >
  921. 35.86 s > failures:
  922. 35.86 s >
  923. 35.86 s > failures:
  924. 35.86 s > uv::export::tests::computed_node_full_numerator_is_a_spenso_aware_typst_fragment
  925. 35.86 s >
  926. 35.86 s > test result: FAILED. 0 passed; 1 failed; 0 ignored; 0 measured; 508 filtered out; finished in 0.24s
  927. 35.86 s >
  928. 35.86 s > stderr ---
  929. 35.86 s > The application panicked (crashed).
  930. 35.86 s > Message: assertion failed: exported.dot.contains(r#"full_num = "op(\"Tr\")(1)";"#)
  931. 35.86 s > Location: crates/gammalooprs/src/uv/export.rs:483
  932. 35.86 s >
  933. 35.86 s > ━━━━━━━━━━━━━━━━━━━━━━━━━━━━━━━━━━ BACKTRACE ━━━━━━━━━━━━━━━━━━━━━━━━━━━━━━━━━━━
  934. 35.86 s > 1: <color_eyre[b0c9e66060e883b2]::config::PanicHook>::panic_report<unknown>
  935. 35.86 s > at <unknown source file>:<unknown line>
  936. 35.86 s > 2: <color_eyre[b0c9e66060e883b2]::config::PanicHook>::into_panic_hook::{closure#0}<unknown>
  937. 35.86 s > at <unknown source file>:<unknown line>
  938. 35.86 s > 3: std[bcb96dfbba0ab899]::panicking::panic_with_hook<unknown>
  939. 35.86 s > at <unknown source file>:<unknown line>
  940. 35.86 s > 4: std[bcb96dfbba0ab899]::panicking::panic_handler::{closure#0}<unknown>
  941. 35.86 s > at <unknown source file>:<unknown line>
  942. 35.86 s > 5: std[bcb96dfbba0ab899]::sys::backtrace::__rust_end_short_backtrace::<std[bcb96dfbba0ab899]::panicking::panic_handler::{closure#0}, !><unknown>
  943. 35.86 s > at <unknown source file>:<unknown line>
  944. 35.86 s > 6: __rustc[6c289b9f9c454d21]::rust_begin_unwind<unknown>
  945. 35.86 s > at <unknown source file>:<unknown line>
  946. 35.86 s > 7: core[940e698046960fd5]::panicking::panic_fmt<unknown>
  947. 35.86 s > at <unknown source file>:<unknown line>
  948. 35.86 s > 8: core[940e698046960fd5]::panicking::panic<unknown>
  949. 35.86 s > at <unknown source file>:<unknown line>
  950. 35.86 s > 9: gammalooprs[5490727360442cce]::uv::export::tests::computed_node_full_numerator_is_a_spenso_aware_typst_fragment<unknown>
  951. 35.86 s > at <unknown source file>:<unknown line>
  952. 35.86 s > 10: <gammalooprs[5490727360442cce]::uv::export::tests::computed_node_full_numerator_is_a_spenso_aware_typst_fragment::{closure#0} as core[940e698046960fd5]::ops::function::FnOnce<()>>::call_once<unknown>
  953. 35.86 s > at <unknown source file>:<unknown line>
  954. 35.86 s > 11: test[75d6903177b1d7e9]::__rust_begin_short_backtrace::<core[940e698046960fd5]::result::Result<(), alloc[2ea6bcb46fca0c42]::string::String>, fn() -> core[940e698046960fd5]::result::Result<(), alloc[2ea6bcb46fca0c42]::string::String>><unknown>
  955. 35.86 s > at <unknown source file>:<unknown line>
  956. 35.86 s > 12: test[75d6903177b1d7e9]::run_test::{closure#0}<unknown>
  957. 35.86 s > at <unknown source file>:<unknown line>
  958. 35.86 s > 13: std[bcb96dfbba0ab899]::sys::backtrace::__rust_begin_short_backtrace::<test[75d6903177b1d7e9]::run_test::{closure#1}, ()><unknown>
  959. 35.86 s > at <unknown source file>:<unknown line>
  960. 35.86 s > 14: <std[bcb96dfbba0ab899]::thread::lifecycle::spawn_unchecked<test[75d6903177b1d7e9]::run_test::{closure#1}, ()>::{closure#1} as core[940e698046960fd5]::ops::function::FnOnce<()>>::call_once::{shim:vtable#0}<unknown>
  961. 35.86 s > at <unknown source file>:<unknown line>
  962. 35.86 s > 15: <std[bcb96dfbba0ab899]::sys::thread::unix::Thread>::new::thread_start<unknown>
  963. 35.86 s > at <unknown source file>:<unknown line>
  964. 35.86 s > 16: start_thread<unknown>
  965. 35.86 s > at <unknown source file>:<unknown line>
  966. 35.86 s > 17: __clone3<unknown>
  967. 35.86 s > at <unknown source file>:<unknown line>
  968. 35.86 s >
  969. 35.86 s > Run with COLORBT_SHOW_HIDDEN=1 environment variable to disable frame filtering.
  970. 35.86 s > Run with RUST_BACKTRACE=full to include source snippets.
  971. 35.86 s >
  972. 35.86 s > ------------
  973. 35.86 s > Summary [ 14.251s] 456 tests run: 454 passed, 2 failed, 61 skipped
  974. 35.86 s > FAIL [ 0.333s] ( 79/456) gammalooprs graph::parse::tests::parse_lmbsetting_crossection
  975. 35.86 s > stdout ---
  976. 35.86 s >
  977. 35.86 s > running 1 test
  978. 35.86 s > ━━━━━━━━━━━━━━━━━━━━━━━━━━━━━━━ Snapshot Summary ━━━━━━━━━━━━━━━━━━━━━━━━━━━━━━━
  979. 35.86 s > Snapshot: parse_lmbsetting_crossection
  980. 35.86 s > Source: crates/gammalooprs/src/graph/parse/tests.rs:252
  981. 35.86 s > ────────────────────────────────────────────────────────────────────────────────
  982. 35.86 s > Expression: g.debug_dot()
  983. 35.86 s > ────────────────────────────────────────────────────────────────────────────────
  984. 35.86 s > -old snapshot
  985. 35.86 s > +new results
  986. 35.86 s > ────────────┬───────────────────────────────────────────────────────────────────
  987. 35.86 s > 1 │-digraph G{
  988. 35.86 s > 1 │+digraph G {
  989. 35.86 s > 2 2 │ num = "1/2";
  990. 35.86 s > 3 3 │ overall_factor = "2*x";
  991. 35.86 s > 4 4 │ overall_factor_evaluated = "2*x";
  992. 35.86 s > 5 5 │ projector = "spenso::t";
  993. 35.86 s > ────────────┴───────────────────────────────────────────────────────────────────
  994. 35.86 s > To update snapshots run `cargo insta review`
  995. 35.86 s > Stopped on the first failure. Run `cargo insta test` to run all snapshots.
  996. 35.86 s > test graph::parse::tests::parse_lmbsetting_crossection ... FAILED
  997. 35.86 s >
  998. 35.86 s > failures:
  999. 35.86 s >
  1000. 35.86 s > failures:
  1001. 35.86 s > graph::parse::tests::parse_lmbsetting_crossection
  1002. 35.86 s >
  1003. 35.86 s > test result: FAILED. 0 passed; 1 failed; 0 ignored; 0 measured; 508 filtered out; finished in 0.30s
  1004. 35.86 s >
  1005. 35.86 s > stderr ---
  1006. 35.86 s > [20:20:47.859] @gammalooprs::graph::attribute_warnings WARNING : Unknown node attribute 'color_num' on graph 'G', node 'A'; did you mean 'num'?
  1007. 35.86 s > at crates/gammalooprs/src/graph/attribute_warnings.rs:198
  1008. 35.86 s > The application panicked (crashed).
  1009. 35.86 s > Message: snapshot assertion for 'parse_lmbsetting_crossection' failed in line 252
  1010. 35.86 s > Location: /nix/store/xdy1vvhll2bijdplvl9fcc2b9plkxhaa-vendor-cargo-deps/c19b7c6f923b580ac259164a89f2577984ad5ab09ee9d583b888f934adbbe8d0/insta-1.47.2/src/runtime.rs:719
  1011. 35.86 s >
  1012. 35.86 s > ━━━━━━━━━━━━━━━━━━━━━━━━━━━━━━━━━━ BACKTRACE ━━━━━━━━━━━━━━━━━━━━━━━━━━━━━━━━━━━
  1013. 35.86 s > 1: <color_eyre[b0c9e66060e883b2]::config::PanicHook>::panic_report<unknown>
  1014. 35.86 s > at <unknown source file>:<unknown line>
  1015. 35.86 s > 2: <color_eyre[b0c9e66060e883b2]::config::PanicHook>::into_panic_hook::{closure#0}<unknown>
  1016. 35.86 s > at <unknown source file>:<unknown line>
  1017. 35.86 s > 3: std[bcb96dfbba0ab899]::panicking::panic_with_hook<unknown>
  1018. 35.86 s > at <unknown source file>:<unknown line>
  1019. 35.86 s > 4: std[bcb96dfbba0ab899]::panicking::panic_handler::{closure#0}<unknown>
  1020. 35.86 s > at <unknown source file>:<unknown line>
  1021. 35.86 s > 5: std[bcb96dfbba0ab899]::sys::backtrace::__rust_end_short_backtrace::<std[bcb96dfbba0ab899]::panicking::panic_handler::{closure#0}, !><unknown>
  1022. 35.86 s > at <unknown source file>:<unknown line>
  1023. 35.86 s > 6: __rustc[6c289b9f9c454d21]::rust_begin_unwind<unknown>
  1024. 35.86 s > at <unknown source file>:<unknown line>
  1025. 35.86 s > 7: core[940e698046960fd5]::panicking::panic_fmt<unknown>
  1026. 35.86 s > at <unknown source file>:<unknown line>
  1027. 35.86 s > 8: insta[307a548ac79ef4d9]::runtime::assert_snapshot<unknown>
  1028. 35.86 s > at <unknown source file>:<unknown line>
  1029. 35.86 s > 9: gammalooprs[5490727360442cce]::graph::parse::tests::parse_lmbsetting_crossection<unknown>
  1030. 35.86 s > at <unknown source file>:<unknown line>
  1031. 35.86 s > 10: <gammalooprs[5490727360442cce]::graph::parse::tests::parse_lmbsetting_crossection::{closure#0} as core[940e698046960fd5]::ops::function::FnOnce<()>>::call_once<unknown>
  1032. 35.86 s > at <unknown source file>:<unknown line>
  1033. 35.86 s > 11: test[75d6903177b1d7e9]::__rust_begin_short_backtrace::<core[940e698046960fd5]::result::Result<(), alloc[2ea6bcb46fca0c42]::string::String>, fn() -> core[940e698046960fd5]::result::Result<(), alloc[2ea6bcb46fca0c42]::string::String>><unknown>
  1034. 35.86 s > at <unknown source file>:<unknown line>
  1035. 35.86 s > 12: test[75d6903177b1d7e9]::run_test::{closure#0}<unknown>
  1036. 35.86 s > at <unknown source file>:<unknown line>
  1037. 35.86 s > 13: std[bcb96dfbba0ab899]::sys::backtrace::__rust_begin_short_backtrace::<test[75d6903177b1d7e9]::run_test::{closure#1}, ()><unknown>
  1038. 35.86 s > at <unknown source file>:<unknown line>
  1039. 35.86 s > 14: <std[bcb96dfbba0ab899]::thread::lifecycle::spawn_unchecked<test[75d6903177b1d7e9]::run_test::{closure#1}, ()>::{closure#1} as core[940e698046960fd5]::ops::function::FnOnce<()>>::call_once::{shim:vtable#0}<unknown>
  1040. 35.86 s > at <unknown source file>:<unknown line>
  1041. 35.86 s > 15: <std[bcb96dfbba0ab899]::sys::thread::unix::Thread>::new::thread_start<unknown>
  1042. 35.86 s > at <unknown source file>:<unknown line>
  1043. 35.86 s > 16: start_thread<unknown>
  1044. 35.86 s > at <unknown source file>:<unknown line>
  1045. 35.86 s > 17: __clone3<unknown>
  1046. 35.86 s > at <unknown source file>:<unknown line>
  1047. 35.86 s >
  1048. 35.86 s > Run with COLORBT_SHOW_HIDDEN=1 environment variable to disable frame filtering.
  1049. 35.86 s > Run with RUST_BACKTRACE=full to include source snippets.
  1050. 35.86 s >
  1051. 35.86 s > FAIL [ 0.276s] (409/456) gammalooprs uv::export::tests::computed_node_full_numerator_is_a_spenso_aware_typst_fragment
  1052. 35.86 s > stdout ---
  1053. 35.86 s >
  1054. 35.86 s > running 1 test
  1055. 35.86 s > test uv::export::tests::computed_node_full_numerator_is_a_spenso_aware_typst_fragment ... FAILED
  1056. 35.86 s >
  1057. 35.86 s > failures:
  1058. 35.86 s >
  1059. 35.86 s > failures:
  1060. 35.86 s > uv::export::tests::computed_node_full_numerator_is_a_spenso_aware_typst_fragment
  1061. 35.86 s >
  1062. 35.86 s > test result: FAILED. 0 passed; 1 failed; 0 ignored; 0 measured; 508 filtered out; finished in 0.24s
  1063. 35.86 s >
  1064. 35.86 s > stderr ---
  1065. 35.86 s > The application panicked (crashed).
  1066. 35.86 s > Message: assertion failed: exported.dot.contains(r#"full_num = "op(\"Tr\")(1)";"#)
  1067. 35.86 s > Location: crates/gammalooprs/src/uv/export.rs:483
  1068. 35.86 s >
  1069. 35.86 s > ━━━━━━━━━━━━━━━━━━━━━━━━━━━━━━━━━━ BACKTRACE ━━━━━━━━━━━━━━━━━━━━━━━━━━━━━━━━━━━
  1070. 35.86 s > 1: <color_eyre[b0c9e66060e883b2]::config::PanicHook>::panic_report<unknown>
  1071. 35.86 s > at <unknown source file>:<unknown line>
  1072. 35.86 s > 2: <color_eyre[b0c9e66060e883b2]::config::PanicHook>::into_panic_hook::{closure#0}<unknown>
  1073. 35.86 s > at <unknown source file>:<unknown line>
  1074. 35.86 s > 3: std[bcb96dfbba0ab899]::panicking::panic_with_hook<unknown>
  1075. 35.86 s > at <unknown source file>:<unknown line>
  1076. 35.86 s > 4: std[bcb96dfbba0ab899]::panicking::panic_handler::{closure#0}<unknown>
  1077. 35.86 s > at <unknown source file>:<unknown line>
  1078. 35.86 s > 5: std[bcb96dfbba0ab899]::sys::backtrace::__rust_end_short_backtrace::<std[bcb96dfbba0ab899]::panicking::panic_handler::{closure#0}, !><unknown>
  1079. 35.86 s > at <unknown source file>:<unknown line>
  1080. 35.86 s > 6: __rustc[6c289b9f9c454d21]::rust_begin_unwind<unknown>
  1081. 35.86 s > at <unknown source file>:<unknown line>
  1082. 35.86 s > 7: core[940e698046960fd5]::panicking::panic_fmt<unknown>
  1083. 35.86 s > at <unknown source file>:<unknown line>
  1084. 35.86 s > 8: core[940e698046960fd5]::panicking::panic<unknown>
  1085. 35.86 s > at <unknown source file>:<unknown line>
  1086. 35.86 s > 9: gammalooprs[5490727360442cce]::uv::export::tests::computed_node_full_numerator_is_a_spenso_aware_typst_fragment<unknown>
  1087. 35.86 s > at <unknown source file>:<unknown line>
  1088. 35.86 s > 10: <gammalooprs[5490727360442cce]::uv::export::tests::computed_node_full_numerator_is_a_spenso_aware_typst_fragment::{closure#0} as core[940e698046960fd5]::ops::function::FnOnce<()>>::call_once<unknown>
  1089. 35.86 s > at <unknown source file>:<unknown line>
  1090. 35.86 s > 11: test[75d6903177b1d7e9]::__rust_begin_short_backtrace::<core[940e698046960fd5]::result::Result<(), alloc[2ea6bcb46fca0c42]::string::String>, fn() -> core[940e698046960fd5]::result::Result<(), alloc[2ea6bcb46fca0c42]::string::String>><unknown>
  1091. 35.86 s > at <unknown source file>:<unknown line>
  1092. 35.86 s > 12: test[75d6903177b1d7e9]::run_test::{closure#0}<unknown>
  1093. 35.86 s > at <unknown source file>:<unknown line>
  1094. 35.86 s > 13: std[bcb96dfbba0ab899]::sys::backtrace::__rust_begin_short_backtrace::<test[75d6903177b1d7e9]::run_test::{closure#1}, ()><unknown>
  1095. 35.86 s > at <unknown source file>:<unknown line>
  1096. 35.86 s > 14: <std[bcb96dfbba0ab899]::thread::lifecycle::spawn_unchecked<test[75d6903177b1d7e9]::run_test::{closure#1}, ()>::{closure#1} as core[940e698046960fd5]::ops::function::FnOnce<()>>::call_once::{shim:vtable#0}<unknown>
  1097. 35.86 s > at <unknown source file>:<unknown line>
  1098. 35.86 s > 15: <std[bcb96dfbba0ab899]::sys::thread::unix::Thread>::new::thread_start<unknown>
  1099. 35.86 s > at <unknown source file>:<unknown line>
  1100. 35.86 s > 16: start_thread<unknown>
  1101. 35.86 s > at <unknown source file>:<unknown line>
  1102. 35.86 s > 17: __clone3<unknown>
  1103. 35.86 s > at <unknown source file>:<unknown line>
  1104. 35.86 s >
  1105. 35.86 s > Run with COLORBT_SHOW_HIDDEN=1 environment variable to disable frame filtering.
  1106. 35.86 s > Run with RUST_BACKTRACE=full to include source snippets.
  1107. 35.86 s >
  1108. 35.86 s > error: test run failed
  1109. 35.86 s >
  1110. 35.86 s > ========== nextest test summary ==========
  1111. 35.86 s > report: target/nextest/ci_gammaloop/junit.xml
  1112. 35.86 s > tests: 456, failures: 2, errors: 0
  1113. 35.86 s >
  1114. 35.86 s > 1. gammalooprs::graph::parse::tests::parse_lmbsetting_crossection
  1115. 35.86 s > failure: test failure with exit code 101
  1116. 35.86 s > system-out
  1117. 35.86 s > running 1 test
  1118. 35.86 s > ━━━━━━━━━━━━━━━━━━━━━━━━━━━━━━━ Snapshot Summary ━━━━━━━━━━━━━━━━━━━━━━━━━━━━━━━
  1119. 35.86 s > Snapshot: parse_lmbsetting_crossection
  1120. 35.86 s > Source: crates/gammalooprs/src/graph/parse/tests.rs:252
  1121. 35.86 s > ────────────────────────────────────────────────────────────────────────────────
  1122. 35.86 s > Expression: g.debug_dot()
  1123. 35.86 s > ────────────────────────────────────────────────────────────────────────────────
  1124. 35.86 s > -old snapshot
  1125. 35.86 s > +new results
  1126. 35.86 s > ────────────┬───────────────────────────────────────────────────────────────────
  1127. 35.86 s > 1 │-digraph G{
  1128. 35.86 s > 1 │+digraph G {
  1129. 35.86 s > 2 2 │ num = "1/2";
  1130. 35.86 s > 3 3 │ overall_factor = "2*x";
  1131. 35.86 s > 4 4 │ overall_factor_evaluated = "2*x";
  1132. 35.86 s > 5 5 │ projector = "spenso::t";
  1133. 35.86 s > ────────────┴───────────────────────────────────────────────────────────────────
  1134. 35.86 s > To update snapshots run `cargo insta review`
  1135. 35.86 s > Stopped on the first failure. Run `cargo insta test` to run all snapshots.
  1136. 35.86 s > test graph::parse::tests::parse_lmbsetting_crossection ... FAILED
  1137. 35.86 s >
  1138. 35.86 s > failures:
  1139. 35.86 s >
  1140. 35.86 s > failures:
  1141. 35.86 s > graph::parse::tests::parse_lmbsetting_crossection
  1142. 35.86 s >
  1143. 35.86 s > test result: FAILED. 0 passed; 1 failed; 0 ignored; 0 measured; 508 filtered out; finished in 0.30s
  1144. 35.86 s > system-err
  1145. 35.86 s > [20:20:47.859] @gammalooprs::graph::attribute_warnings WARNING : Unknown node attribute 'color_num' on graph 'G', node 'A'; did you mean 'num'?
  1146. 35.86 s > at crates/gammalooprs/src/graph/attribute_warnings.rs:198
  1147. 35.86 s > The application panicked (crashed).
  1148. 35.86 s > Message: snapshot assertion for 'parse_lmbsetting_crossection' failed in line 252
  1149. 35.86 s > Location: /nix/store/xdy1vvhll2bijdplvl9fcc2b9plkxhaa-vendor-cargo-deps/c19b7c6f923b580ac259164a89f2577984ad5ab09ee9d583b888f934adbbe8d0/insta-1.47.2/src/runtime.rs:719
  1150. 35.86 s >
  1151. 35.86 s > ━━━━━━━━━━━━━━━━━━━━━━━━━━━━━━━━━━ BACKTRACE ━━━━━━━━━━━━━━━━━━━━━━━━━━━━━━━━━━━
  1152. 35.86 s > 1: <color_eyre[b0c9e66060e883b2]::config::PanicHook>::panic_report<unknown>
  1153. 35.86 s > at <unknown source file>:<unknown line>
  1154. 35.86 s > 2: <color_eyre[b0c9e66060e883b2]::config::PanicHook>::into_panic_hook::{closure#0}<unknown>
  1155. 35.86 s > at <unknown source file>:<unknown line>
  1156. 35.86 s > 3: std[bcb96dfbba0ab899]::panicking::panic_with_hook<unknown>
  1157. 35.86 s > at <unknown source file>:<unknown line>
  1158. 35.86 s > 4: std[bcb96dfbba0ab899]::panicking::panic_handler::{closure#0}<unknown>
  1159. 35.86 s > at <unknown source file>:<unknown line>
  1160. 35.86 s > 5: std[bcb96dfbba0ab899]::sys::backtrace::__rust_end_short_backtrace::<std[bcb96dfbba0ab899]::panicking::panic_handler::{closure#0}, !><unknown>
  1161. 35.86 s > at <unknown source file>:<unknown line>
  1162. 35.86 s > 6: __rustc[6c289b9f9c454d21]::rust_begin_unwind<unknown>
  1163. 35.86 s > at <unknown source file>:<unknown line>
  1164. 35.86 s > 7: core[940e698046960fd5]::panicking::panic_fmt<unknown>
  1165. 35.86 s > at <unknown source file>:<unknown line>
  1166. 35.86 s > 8: insta[307a548ac79ef4d9]::runtime::assert_snapshot<unknown>
  1167. 35.86 s > at <unknown source file>:<unknown line>
  1168. 35.86 s > 9: gammalooprs[5490727360442cce]::graph::parse::tests::parse_lmbsetting_crossection<unknown>
  1169. 35.86 s > at <unknown source file>:<unknown line>
  1170. 35.86 s > 10: <gammalooprs[5490727360442cce]::graph::parse::tests::parse_lmbsetting_crossection::{closure#0} as core[940e698046960fd5]::ops::function::FnOnce<()>>::call_once<unknown>
  1171. 35.86 s > at <unknown source file>:<unknown line>
  1172. 35.86 s > 11: test[75d6903177b1d7e9]::__rust_begin_short_backtrace::<core[940e698046960fd5]::result::Result<(), alloc[2ea6bcb46fca0c42]::string::String>, fn() -> core[940e698046960fd5]::result::Result<(), alloc[2ea6bcb46fca0c42]::string::String>><unknown>
  1173. 35.86 s > at <unknown source file>:<unknown line>
  1174. 35.86 s > 12: test[75d6903177b1d7e9]::run_test::{closure#0}<unknown>
  1175. 35.86 s > at <unknown source file>:<unknown line>
  1176. 35.86 s > 13: std[bcb96dfbba0ab899]::sys::backtrace::__rust_begin_short_backtrace::<test[75d6903177b1d7e9]::run_test::{closure#1}, ()><unknown>
  1177. 35.86 s > at <unknown source file>:<unknown line>
  1178. 35.86 s > 14: <std[bcb96dfbba0ab899]::thread::lifecycle::spawn_unchecked<test[75d6903177b1d7e9]::run_test::{closure#1}, ()>::{closure#1} as core[940e698046960fd5]::ops::function::FnOnce<()>>::call_once::{shim:vtable#0}<unknown>
  1179. 35.86 s > at <unknown source file>:<unknown line>
  1180. 35.86 s > 15: <std[bcb96dfbba0ab899]::sys::thread::unix::Thread>::new::thread_start<unknown>
  1181. 35.86 s > at <unknown source file>:<unknown line>
  1182. 35.86 s > 16: start_thread<unknown>
  1183. 35.86 s > at <unknown source file>:<unknown line>
  1184. 35.86 s > 17: __clone3<unknown>
  1185. 35.86 s > at <unknown source file>:<unknown line>
  1186. 35.86 s >
  1187. 35.86 s > Run with COLORBT_SHOW_HIDDEN=1 environment variable to disable frame filtering.
  1188. 35.86 s > Run with RUST_BACKTRACE=full to include source snippets.
  1189. 35.86 s >
  1190. 35.86 s > 2. gammalooprs::uv::export::tests::computed_node_full_numerator_is_a_spenso_aware_typst_fragment
  1191. 35.86 s > failure: test failure with exit code 101
  1192. 35.86 s > system-out
  1193. 35.86 s > running 1 test
  1194. 35.86 s > test uv::export::tests::computed_node_full_numerator_is_a_spenso_aware_typst_fragment ... FAILED
  1195. 35.86 s >
  1196. 35.86 s > failures:
  1197. 35.86 s >
  1198. 35.86 s > failures:
  1199. 35.86 s > uv::export::tests::computed_node_full_numerator_is_a_spenso_aware_typst_fragment
  1200. 35.86 s >
  1201. 35.86 s > test result: FAILED. 0 passed; 1 failed; 0 ignored; 0 measured; 508 filtered out; finished in 0.24s
  1202. 35.86 s > system-err
  1203. 35.86 s > The application panicked (crashed).
  1204. 35.86 s > Message: assertion failed: exported.dot.contains(r#"full_num = "op(\"Tr\")(1)";"#)
  1205. 35.86 s > Location: crates/gammalooprs/src/uv/export.rs:483
  1206. 35.86 s >
  1207. 35.86 s > ━━━━━━━━━━━━━━━━━━━━━━━━━━━━━━━━━━ BACKTRACE ━━━━━━━━━━━━━━━━━━━━━━━━━━━━━━━━━━━
  1208. 35.86 s > 1: <color_eyre[b0c9e66060e883b2]::config::PanicHook>::panic_report<unknown>
  1209. 35.86 s > at <unknown source file>:<unknown line>
  1210. 35.86 s > 2: <color_eyre[b0c9e66060e883b2]::config::PanicHook>::into_panic_hook::{closure#0}<unknown>
  1211. 35.86 s > at <unknown source file>:<unknown line>
  1212. 35.86 s > 3: std[bcb96dfbba0ab899]::panicking::panic_with_hook<unknown>
  1213. 35.86 s > at <unknown source file>:<unknown line>
  1214. 35.86 s > 4: std[bcb96dfbba0ab899]::panicking::panic_handler::{closure#0}<unknown>
  1215. 35.86 s > at <unknown source file>:<unknown line>
  1216. 35.86 s > 5: std[bcb96dfbba0ab899]::sys::backtrace::__rust_end_short_backtrace::<std[bcb96dfbba0ab899]::panicking::panic_handler::{closure#0}, !><unknown>
  1217. 35.86 s > at <unknown source file>:<unknown line>
  1218. 35.86 s > 6: __rustc[6c289b9f9c454d21]::rust_begin_unwind<unknown>
  1219. 35.86 s > at <unknown source file>:<unknown line>
  1220. 35.86 s > 7: core[940e698046960fd5]::panicking::panic_fmt<unknown>
  1221. 35.86 s > at <unknown source file>:<unknown line>
  1222. 35.86 s > 8: core[940e698046960fd5]::panicking::panic<unknown>
  1223. 35.86 s > at <unknown source file>:<unknown line>
  1224. 35.86 s > 9: gammalooprs[5490727360442cce]::uv::export::tests::computed_node_full_numerator_is_a_spenso_aware_typst_fragment<unknown>
  1225. 35.86 s > at <unknown source file>:<unknown line>
  1226. 35.86 s > 10: <gammalooprs[5490727360442cce]::uv::export::tests::computed_node_full_numerator_is_a_spenso_aware_typst_fragment::{closure#0} as core[940e698046960fd5]::ops::function::FnOnce<()>>::call_once<unknown>
  1227. 35.86 s > at <unknown source file>:<unknown line>
  1228. 35.86 s > 11: test[75d6903177b1d7e9]::__rust_begin_short_backtrace::<core[940e698046960fd5]::result::Result<(), alloc[2ea6bcb46fca0c42]::string::String>, fn() -> core[940e698046960fd5]::result::Result<(), alloc[2ea6bcb46fca0c42]::string::String>><unknown>
  1229. 35.86 s > at <unknown source file>:<unknown line>
  1230. 35.86 s > 12: test[75d6903177b1d7e9]::run_test::{closure#0}<unknown>
  1231. 35.86 s > at <unknown source file>:<unknown line>
  1232. 35.86 s > 13: std[bcb96dfbba0ab899]::sys::backtrace::__rust_begin_short_backtrace::<test[75d6903177b1d7e9]::run_test::{closure#1}, ()><unknown>
  1233. 35.86 s > at <unknown source file>:<unknown line>
  1234. 35.86 s > 14: <std[bcb96dfbba0ab899]::thread::lifecycle::spawn_unchecked<test[75d6903177b1d7e9]::run_test::{closure#1}, ()>::{closure#1} as core[940e698046960fd5]::ops::function::FnOnce<()>>::call_once::{shim:vtable#0}<unknown>
  1235. 35.86 s > at <unknown source file>:<unknown line>
  1236. 35.86 s > 15: <std[bcb96dfbba0ab899]::sys::thread::unix::Thread>::new::thread_start<unknown>
  1237. 35.86 s > at <unknown source file>:<unknown line>
  1238. 35.86 s > 16: start_thread<unknown>
  1239. 35.86 s > at <unknown source file>:<unknown line>
  1240. 35.86 s > 17: __clone3<unknown>
  1241. 35.86 s > at <unknown source file>:<unknown line>
  1242. 35.86 s >
  1243. 35.86 s > Run with COLORBT_SHOW_HIDDEN=1 environment variable to disable frame filtering.
  1244. 35.86 s > Run with RUST_BACKTRACE=full to include source snippets.
  1245. 35.86 s > =========================================
  1246. 35.86 s For full logs, run:
  1247. 35.86 s nix log /nix/store/07lma8g6p1n7jxf8azmxf90ca6pqjydj-gammaloop-nextest-core.drv
  1248. 36.01 s Run failed.