test packages.x86_64-linux.nix-ci-check-gammaloop-nextest-core

Reproduce this run
Retry Run
  1. 0.11 s $ /nix/store/9ypz3flqsrl5xl495mm8h645gadjsxi1-coreutils-9.11/bin/timeout --kill-after=15s 7200s /nix/store/23zk8sgzamrbmj1fday15szf7f2279s8-nix-2.34.7/bin/nix --extra-experimental-features nix-command --extra-experimental-features flakes flake clone git+https://github.com/alphal00p/gammaloop --dest /tmp/nix-ci-worker/stable-pwd/repo/
  2. 0.33 s Cloning into '/tmp/nix-ci-worker/stable-pwd/repo'...
  3. 2.23 s remote: Enumerating objects: 64182, done.
  4. 2.34 s remote: Counting objects: 0% (1/9536) remote: Counting objects: 1% (96/9536) remote: Counting objects: 2% (191/9536) remote: Counting objects: 3% (287/9536) remote: Counting objects: 4% (382/9536) remote: Counting objects: 5% (477/9536) remote: Counting objects: 6% (573/9536) remote: Counting objects: 7% (668/9536) remote: Counting objects: 8% (763/9536) remote: Counting objects: 9% (859/9536) remote: Counting objects: 10% (954/9536) remote: Counting objects: 11% (1049/9536) remote: Counting objects: 12% (1145/9536) remote: Counting objects: 13% (1240/9536) remote: Counting objects: 14% (1336/9536) remote: Counting objects: 15% (1431/9536) remote: Counting objects: 16% (1526/9536) remote: Counting objects: 17% (1622/9536) remote: Counting objects: 18% (1717/9536) remote: Counting objects: 19% (1812/9536) remote: Counting objects: 20% (1908/9536) remote: Counting objects: 21% (2003/9536) remote: Counting objects: 22% (2098/9536) remote: Counting objects: 23% (2194/9536) remote: Counting objects: 24% (2289/9536) remote: Counting objects: 25% (2384/9536) remote: Counting objects: 26% (2480/9536) remote: Counting objects: 27% (2575/9536) remote: Counting objects: 28% (2671/9536) remote: Counting objects: 29% (2766/9536) remote: Counting objects: 30% (2861/9536) remote: Counting objects: 31% (2957/9536) remote: Counting objects: 32% (3052/9536) remote: Counting objects: 33% (3147/9536) remote: Counting objects: 34% (3243/9536) remote: Counting objects: 35% (3338/9536) remote: Counting objects: 36% (3433/9536) remote: Counting objects: 37% (3529/9536) remote: Counting objects: 38% (3624/9536) remote: Counting objects: 39% (3720/9536) remote: Counting objects: 40% (3815/9536) remote: Counting objects: 41% (3910/9536) remote: Counting objects: 42% (4006/9536) remote: Counting objects: 43% (4101/9536) remote: Counting objects: 44% (4196/9536) remote: Counting objects: 45% (4292/9536) remote: Counting objects: 46% (4387/9536) remote: Counting objects: 47% (4482/9536) remote: Counting objects: 48% (4578/9536) remote: Counting objects: 49% (4673/9536) remote: Counting objects: 50% (4768/9536) remote: Counting objects: 51% (4864/9536) remote: Counting objects: 52% (4959/9536) remote: Counting objects: 53% (5055/9536) remote: Counting objects: 54% (5150/9536) remote: Counting objects: 55% (5245/9536) remote: Counting objects: 56% (5341/9536) remote: Counting objects: 57% (5436/9536) remote: Counting objects: 58% (5531/9536) remote: Counting objects: 59% (5627/9536) remote: Counting objects: 60% (5722/9536) remote: Counting objects: 61% (5817/9536) remote: Counting objects: 62% (5913/9536) remote: Counting objects: 63% (6008/9536) remote: Counting objects: 64% (6104/9536) remote: Counting objects: 65% (6199/9536) remote: Counting objects: 66% (6294/9536) remote: Counting objects: 67% (6390/9536) remote: Counting objects: 68% (6485/9536) remote: Counting objects: 69% (6580/9536) remote: Counting objects: 70% (6676/9536) remote: Counting objects: 71% (6771/9536) remote: Counting objects: 72% (6866/9536) remote: Counting objects: 73% (6962/9536) remote: Counting objects: 74% (7057/9536) remote: Counting objects: 75% (7152/9536) remote: Counting objects: 76% (7248/9536) remote: Counting objects: 77% (7343/9536) remote: Counting objects: 78% (7439/9536) remote: Counting objects: 79% (7534/9536) remote: Counting objects: 80% (7629/9536) remote: Counting objects: 81% (7725/9536) remote: Counting objects: 82% (7820/9536) remote: Counting objects: 83% (7915/9536) remote: Counting objects: 84% (8011/9536) remote: Counting objects: 85% (8106/9536) remote: Counting objects: 86% (8201/9536) remote: Counting objects: 87% (8297/9536) remote: Counting objects: 88% (8392/9536) remote: Counting objects: 89% (8488/9536) remote: Counting objects: 90% (8583/9536) remote: Counting objects: 91% (8678/9536) remote: Counting objects: 92% (8774/9536) remote: Counting objects: 93% (8869/9536) remote: Counting objects: 94% (8964/9536) remote: Counting objects: 95% (9060/9536) remote: Counting objects: 96% (9155/9536) remote: Counting objects: 97% (9250/9536) remote: Counting objects: 98% (9346/9536) remote: Counting objects: 99% (9441/9536) remote: Counting objects: 100% (9536/9536) remote: Counting objects: 100% (9536/9536), done.
  5. 5.44 s remote: Compressing objects: 0% (1/2324) remote: Compressing objects: 1% (24/2324) remote: Compressing objects: 2% (47/2324) remote: Compressing objects: 3% (70/2324) remote: Compressing objects: 4% (93/2324) remote: Compressing objects: 5% (117/2324) remote: Compressing objects: 6% (140/2324) remote: Compressing objects: 7% (163/2324) remote: Compressing objects: 8% (186/2324) remote: Compressing objects: 9% (210/2324) remote: Compressing objects: 10% (233/2324) remote: Compressing objects: 11% (256/2324) remote: Compressing objects: 12% (279/2324) remote: Compressing objects: 13% (303/2324) remote: Compressing objects: 14% (326/2324) remote: Compressing objects: 15% (349/2324) remote: Compressing objects: 16% (372/2324) remote: Compressing objects: 17% (396/2324) remote: Compressing objects: 18% (419/2324) remote: Compressing objects: 19% (442/2324) remote: Compressing objects: 20% (465/2324) remote: Compressing objects: 21% (489/2324) remote: Compressing objects: 22% (512/2324) remote: Compressing objects: 22% (530/2324) remote: Compressing objects: 23% (535/2324) remote: Compressing objects: 24% (558/2324) remote: Compressing objects: 25% (581/2324) remote: Compressing objects: 26% (605/2324) remote: Compressing objects: 26% (623/2324) remote: Compressing objects: 27% (628/2324) remote: Compressing objects: 28% (651/2324) remote: Compressing objects: 29% (674/2324) remote: Compressing objects: 30% (698/2324) remote: Compressing objects: 31% (721/2324) remote: Compressing objects: 32% (744/2324) remote: Compressing objects: 33% (767/2324) remote: Compressing objects: 34% (791/2324) remote: Compressing objects: 35% (814/2324) remote: Compressing objects: 36% (837/2324) remote: Compressing objects: 37% (860/2324) remote: Compressing objects: 37% (863/2324) remote: Compressing objects: 38% (884/2324) remote: Compressing objects: 39% (907/2324) remote: Compressing objects: 40% (930/2324) remote: Compressing objects: 41% (953/2324) remote: Compressing objects: 42% (977/2324) remote: Compressing objects: 43% (1000/2324) remote: Compressing objects: 44% (1023/2324) remote: Compressing objects: 45% (1046/2324) remote: Compressing objects: 46% (1070/2324) remote: Compressing objects: 47% (1093/2324) remote: Compressing objects: 48% (1116/2324) remote: Compressing objects: 49% (1139/2324) remote: Compressing objects: 50% (1162/2324) remote: Compressing objects: 51% (1186/2324) remote: Compressing objects: 52% (1209/2324) remote: Compressing objects: 53% (1232/2324) remote: Compressing objects: 54% (1255/2324) remote: Compressing objects: 55% (1279/2324) remote: Compressing objects: 56% (1302/2324) remote: Compressing objects: 57% (1325/2324) remote: Compressing objects: 58% (1348/2324) remote: Compressing objects: 59% (1372/2324) remote: Compressing objects: 60% (1395/2324) remote: Compressing objects: 61% (1418/2324) remote: Compressing objects: 62% (1441/2324) remote: Compressing objects: 63% (1465/2324) remote: Compressing objects: 64% (1488/2324) remote: Compressing objects: 65% (1511/2324) remote: Compressing objects: 66% (1534/2324) remote: Compressing objects: 67% (1558/2324) remote: Compressing objects: 68% (1581/2324) remote: Compressing objects: 69% (1604/2324) remote: Compressing objects: 70% (1627/2324) remote: Compressing objects: 71% (1651/2324) remote: Compressing objects: 72% (1674/2324) remote: Compressing objects: 73% (1697/2324) remote: Compressing objects: 74% (1720/2324) remote: Compressing objects: 75% (1743/2324) remote: Compressing objects: 76% (1767/2324) remote: Compressing objects: 77% (1790/2324) remote: Compressing objects: 78% (1813/2324) remote: Compressing objects: 79% (1836/2324) remote: Compressing objects: 80% (1860/2324) remote: Compressing objects: 81% (1883/2324) remote: Compressing objects: 82% (1906/2324) remote: Compressing objects: 83% (1929/2324) remote: Compressing objects: 84% (1953/2324) remote: Compressing objects: 85% (1976/2324) remote: Compressing objects: 86% (1999/2324) remote: Compressing objects: 87% (2022/2324) remote: Compressing objects: 88% (2046/2324) remote: Compressing objects: 89% (2069/2324) remote: Compressing objects: 90% (2092/2324) remote: Compressing objects: 91% (2115/2324) remote: Compressing objects: 92% (2139/2324) remote: Compressing objects: 93% (2162/2324) remote: Compressing objects: 94% (2185/2324) remote: Compressing objects: 95% (2208/2324) remote: Compressing objects: 96% (2232/2324) remote: Compressing objects: 97% (2255/2324) remote: Compressing objects: 98% (2278/2324) remote: Compressing objects: 99% (2301/2324) remote: Compressing objects: 100% (2324/2324) remote: Compressing objects: 100% (2324/2324), done.
  6. 8.51 s Receiving objects: 0% (1/64182) Receiving objects: 1% (642/64182) Receiving objects: 2% (1284/64182) Receiving objects: 3% (1926/64182) Receiving objects: 4% (2568/64182) Receiving objects: 5% (3210/64182) Receiving objects: 6% (3851/64182) Receiving objects: 7% (4493/64182) Receiving objects: 8% (5135/64182), 5.81 MiB | 11.60 MiB/s Receiving objects: 9% (5777/64182), 5.81 MiB | 11.60 MiB/s Receiving objects: 10% (6419/64182), 5.81 MiB | 11.60 MiB/s Receiving objects: 11% (7061/64182), 5.81 MiB | 11.60 MiB/s Receiving objects: 12% (7702/64182), 5.81 MiB | 11.60 MiB/s Receiving objects: 13% (8344/64182), 5.81 MiB | 11.60 MiB/s Receiving objects: 14% (8986/64182), 5.81 MiB | 11.60 MiB/s Receiving objects: 15% (9628/64182), 5.81 MiB | 11.60 MiB/s Receiving objects: 16% (10270/64182), 5.81 MiB | 11.60 MiB/s Receiving objects: 17% (10911/64182), 5.81 MiB | 11.60 MiB/s Receiving objects: 18% (11553/64182), 5.81 MiB | 11.60 MiB/s Receiving objects: 19% (12195/64182), 5.81 MiB | 11.60 MiB/s Receiving objects: 20% (12837/64182), 5.81 MiB | 11.60 MiB/s Receiving objects: 21% (13479/64182), 5.81 MiB | 11.60 MiB/s Receiving objects: 22% (14121/64182), 5.81 MiB | 11.60 MiB/s Receiving objects: 23% (14762/64182), 5.81 MiB | 11.60 MiB/s Receiving objects: 24% (15404/64182), 5.81 MiB | 11.60 MiB/s Receiving objects: 25% (16046/64182), 5.81 MiB | 11.60 MiB/s Receiving objects: 26% (16688/64182), 5.81 MiB | 11.60 MiB/s Receiving objects: 27% (17330/64182), 5.81 MiB | 11.60 MiB/s Receiving objects: 28% (17971/64182), 5.81 MiB | 11.60 MiB/s Receiving objects: 29% (18613/64182), 5.81 MiB | 11.60 MiB/s Receiving objects: 30% (19255/64182), 5.81 MiB | 11.60 MiB/s Receiving objects: 31% (19897/64182), 5.81 MiB | 11.60 MiB/s Receiving objects: 32% (20539/64182), 5.81 MiB | 11.60 MiB/s Receiving objects: 33% (21181/64182), 5.81 MiB | 11.60 MiB/s Receiving objects: 34% (21822/64182), 5.81 MiB | 11.60 MiB/s Receiving objects: 35% (22464/64182), 5.81 MiB | 11.60 MiB/s Receiving objects: 36% (23106/64182), 5.81 MiB | 11.60 MiB/s Receiving objects: 37% (23748/64182), 5.81 MiB | 11.60 MiB/s Receiving objects: 38% (24390/64182), 5.81 MiB | 11.60 MiB/s Receiving objects: 39% (25031/64182), 5.81 MiB | 11.60 MiB/s Receiving objects: 40% (25673/64182), 5.81 MiB | 11.60 MiB/s Receiving objects: 41% (26315/64182), 5.81 MiB | 11.60 MiB/s Receiving objects: 42% (26957/64182), 5.81 MiB | 11.60 MiB/s Receiving objects: 43% (27599/64182), 5.81 MiB | 11.60 MiB/s Receiving objects: 44% (28241/64182), 5.81 MiB | 11.60 MiB/s Receiving objects: 45% (28882/64182), 5.81 MiB | 11.60 MiB/s Receiving objects: 46% (29524/64182), 5.81 MiB | 11.60 MiB/s Receiving objects: 47% (30166/64182), 5.81 MiB | 11.60 MiB/s Receiving objects: 48% (30808/64182), 5.81 MiB | 11.60 MiB/s Receiving objects: 49% (31450/64182), 5.81 MiB | 11.60 MiB/s Receiving objects: 50% (32091/64182), 5.81 MiB | 11.60 MiB/s Receiving objects: 50% (32241/64182), 27.67 MiB | 27.66 MiB/s Receiving objects: 51% (32733/64182), 27.67 MiB | 27.66 MiB/s Receiving objects: 52% (33375/64182), 27.67 MiB | 27.66 MiB/s Receiving objects: 53% (34017/64182), 27.67 MiB | 27.66 MiB/s Receiving objects: 54% (34659/64182), 27.67 MiB | 27.66 MiB/s Receiving objects: 55% (35301/64182), 27.67 MiB | 27.66 MiB/s Receiving objects: 56% (35942/64182), 27.67 MiB | 27.66 MiB/s Receiving objects: 57% (36584/64182), 27.67 MiB | 27.66 MiB/s Receiving objects: 58% (37226/64182), 45.09 MiB | 30.06 MiB/s Receiving objects: 59% (37868/64182), 45.09 MiB | 30.06 MiB/s Receiving objects: 60% (38510/64182), 45.09 MiB | 30.06 MiB/s Receiving objects: 61% (39152/64182), 45.09 MiB | 30.06 MiB/s Receiving objects: 62% (39793/64182), 45.09 MiB | 30.06 MiB/s Receiving objects: 63% (40435/64182), 45.09 MiB | 30.06 MiB/s Receiving objects: 64% (41077/64182), 45.09 MiB | 30.06 MiB/s Receiving objects: 65% (41719/64182), 45.09 MiB | 30.06 MiB/s Receiving objects: 66% (42361/64182), 45.09 MiB | 30.06 MiB/s Receiving objects: 67% (43002/64182), 45.09 MiB | 30.06 MiB/s Receiving objects: 68% (43644/64182), 45.09 MiB | 30.06 MiB/s Receiving objects: 68% (43973/64182), 45.09 MiB | 30.06 MiB/s Receiving objects: 69% (44286/64182), 62.57 MiB | 31.28 MiB/s Receiving objects: 70% (44928/64182), 62.57 MiB | 31.28 MiB/s Receiving objects: 71% (45570/64182), 62.57 MiB | 31.28 MiB/s Receiving objects: 72% (46212/64182), 62.57 MiB | 31.28 MiB/s Receiving objects: 73% (46853/64182), 62.57 MiB | 31.28 MiB/s Receiving objects: 74% (47495/64182), 62.57 MiB | 31.28 MiB/s Receiving objects: 75% (48137/64182), 62.57 MiB | 31.28 MiB/s Receiving objects: 76% (48779/64182), 62.57 MiB | 31.28 MiB/s Receiving objects: 77% (49421/64182), 62.57 MiB | 31.28 MiB/s Receiving objects: 78% (50062/64182), 62.57 MiB | 31.28 MiB/s Receiving objects: 79% (50704/64182), 62.57 MiB | 31.28 MiB/s Receiving objects: 80% (51346/64182), 62.57 MiB | 31.28 MiB/s Receiving objects: 81% (51988/64182), 62.57 MiB | 31.28 MiB/s Receiving objects: 82% (52630/64182), 78.34 MiB | 31.33 MiB/s Receiving objects: 83% (53272/64182), 78.34 MiB | 31.33 MiB/s Receiving objects: 84% (53913/64182), 78.34 MiB | 31.33 MiB/s Receiving objects: 85% (54555/64182), 78.34 MiB | 31.33 MiB/s Receiving objects: 86% (55197/64182), 78.34 MiB | 31.33 MiB/s Receiving objects: 87% (55839/64182), 78.34 MiB | 31.33 MiB/s Receiving objects: 88% (56481/64182), 78.34 MiB | 31.33 MiB/s Receiving objects: 89% (57122/64182), 78.34 MiB | 31.33 MiB/s Receiving objects: 90% (57764/64182), 78.34 MiB | 31.33 MiB/s Receiving objects: 91% (58406/64182), 78.34 MiB | 31.33 MiB/s Receiving objects: 92% (59048/64182), 78.34 MiB | 31.33 MiB/s Receiving objects: 93% (59690/64182), 78.34 MiB | 31.33 MiB/s Receiving objects: 94% (60332/64182), 78.34 MiB | 31.33 MiB/s Receiving objects: 95% (60973/64182), 78.34 MiB | 31.33 MiB/s Receiving objects: 96% (61615/64182), 78.34 MiB | 31.33 MiB/s Receiving objects: 97% (62257/64182), 78.34 MiB | 31.33 MiB/s Receiving objects: 98% (62899/64182), 78.34 MiB | 31.33 MiB/s Receiving objects: 98% (63028/64182), 78.34 MiB | 31.33 MiB/s Receiving objects: 99% (63541/64182), 95.95 MiB | 31.98 MiB/s remote: Total 64182 (delta 7384), reused 7761 (delta 6667), pack-reused 54646 (from 3)
  7. 8.51 s Receiving objects: 100% (64182/64182), 95.95 MiB | 31.98 MiB/s Receiving objects: 100% (64182/64182), 97.82 MiB | 31.94 MiB/s, done.
  8. 10.32 s Resolving deltas: 0% (0/44314) Resolving deltas: 1% (444/44314) Resolving deltas: 2% (887/44314) Resolving deltas: 3% (1330/44314) Resolving deltas: 4% (1773/44314) Resolving deltas: 5% (2216/44314) Resolving deltas: 6% (2659/44314) Resolving deltas: 7% (3102/44314) Resolving deltas: 8% (3546/44314) Resolving deltas: 9% (3989/44314) Resolving deltas: 10% (4433/44314) Resolving deltas: 11% (4875/44314) Resolving deltas: 12% (5318/44314) Resolving deltas: 13% (5761/44314) Resolving deltas: 14% (6204/44314) Resolving deltas: 15% (6648/44314) Resolving deltas: 16% (7091/44314) Resolving deltas: 17% (7534/44314) Resolving deltas: 18% (7977/44314) Resolving deltas: 19% (8420/44314) Resolving deltas: 20% (8863/44314) Resolving deltas: 21% (9306/44314) Resolving deltas: 22% (9750/44314) Resolving deltas: 23% (10193/44314) Resolving deltas: 24% (10636/44314) Resolving deltas: 25% (11079/44314) Resolving deltas: 26% (11522/44314) Resolving deltas: 27% (11965/44314) Resolving deltas: 28% (12408/44314) Resolving deltas: 29% (12852/44314) Resolving deltas: 30% (13295/44314) Resolving deltas: 31% (13738/44314) Resolving deltas: 32% (14182/44314) Resolving deltas: 33% (14624/44314) Resolving deltas: 34% (15067/44314) Resolving deltas: 35% (15510/44314) Resolving deltas: 36% (15954/44314) Resolving deltas: 37% (16397/44314) Resolving deltas: 38% (16840/44314) Resolving deltas: 39% (17283/44314) Resolving deltas: 40% (17726/44314) Resolving deltas: 41% (18169/44314) Resolving deltas: 42% (18612/44314) Resolving deltas: 43% (19056/44314) Resolving deltas: 44% (19499/44314) Resolving deltas: 45% (19942/44314) Resolving deltas: 46% (20385/44314) Resolving deltas: 47% (20828/44314) Resolving deltas: 48% (21271/44314) Resolving deltas: 49% (21714/44314) Resolving deltas: 50% (22157/44314) Resolving deltas: 51% (22601/44314) Resolving deltas: 52% (23044/44314) Resolving deltas: 53% (23487/44314) Resolving deltas: 54% (23930/44314) Resolving deltas: 55% (24373/44314) Resolving deltas: 56% (24816/44314) Resolving deltas: 57% (25259/44314) Resolving deltas: 58% (25704/44314) Resolving deltas: 59% (26146/44314) Resolving deltas: 60% (26589/44314) Resolving deltas: 61% (27032/44314) Resolving deltas: 62% (27475/44314) Resolving deltas: 63% (27918/44314) Resolving deltas: 64% (28361/44314) Resolving deltas: 65% (28805/44314) Resolving deltas: 66% (29248/44314) Resolving deltas: 67% (29691/44314) Resolving deltas: 68% (30134/44314) Resolving deltas: 68% (30436/44314) Resolving deltas: 69% (30577/44314) Resolving deltas: 70% (31020/44314) Resolving deltas: 71% (31463/44314) Resolving deltas: 72% (31907/44314) Resolving deltas: 73% (32350/44314) Resolving deltas: 74% (32793/44314) Resolving deltas: 75% (33236/44314) Resolving deltas: 76% (33679/44314) Resolving deltas: 77% (34122/44314) Resolving deltas: 78% (34565/44314) Resolving deltas: 79% (35009/44314) Resolving deltas: 80% (35452/44314) Resolving deltas: 81% (35897/44314) Resolving deltas: 82% (36338/44314) Resolving deltas: 83% (36781/44314) Resolving deltas: 84% (37224/44314) Resolving deltas: 85% (37667/44314) Resolving deltas: 86% (38111/44314) Resolving deltas: 87% (38554/44314) Resolving deltas: 88% (38997/44314) Resolving deltas: 89% (39440/44314) Resolving deltas: 90% (39883/44314) Resolving deltas: 91% (40326/44314) Resolving deltas: 92% (40769/44314) Resolving deltas: 93% (41213/44314) Resolving deltas: 94% (41656/44314) Resolving deltas: 95% (42099/44314) Resolving deltas: 96% (42542/44314) Resolving deltas: 97% (42985/44314) Resolving deltas: 98% (43428/44314) Resolving deltas: 99% (43871/44314) Resolving deltas: 100% (44314/44314) Resolving deltas: 100% (44314/44314), done.
  9. 10.94 s Fetching commit 94e2eb84385825c67e2d00485755754534658cdd for push-vrpyqyylypmw ...
  10. 10.95 s $ /nix/store/bcnisk3ydfgv26v2gw3zlky24g00yww2-git-2.54.0/bin/git fetch origin 94e2eb84385825c67e2d00485755754534658cdd
  11. 11.55 s From https://github.com/alphal00p/gammaloop
  12. 11.55 s * branch 94e2eb84385825c67e2d00485755754534658cdd -> FETCH_HEAD
  13. 11.62 s $ /nix/store/9ypz3flqsrl5xl495mm8h645gadjsxi1-coreutils-9.11/bin/timeout --kill-after=15s 7200s /nix/store/bcnisk3ydfgv26v2gw3zlky24g00yww2-git-2.54.0/bin/git -c advice.detachedHead=false checkout 94e2eb84385825c67e2d00485755754534658cdd
  14. 11.97 s HEAD is now at 94e2eb84 include documentation sources in catalog dependency build
  15. 12.00 s $ /nix/store/9ypz3flqsrl5xl495mm8h645gadjsxi1-coreutils-9.11/bin/timeout --kill-after=15s 7200s /nix/store/23zk8sgzamrbmj1fday15szf7f2279s8-nix-2.34.7/bin/nix --extra-experimental-features nix-command --extra-experimental-features flakes --log-format internal-json run .#packages.x86_64-linux.nix-ci-check-gammaloop-nextest-core --print-build-logs
  16. 17.70 s
  17. 25.33 s evaluating derivation 'g copying '/nix/store/fxbc evaluating derivation 'g copying '/nix/store/fxbc evaluating derivation 'g copying '/nix/store/fxbc evaluating derivation 'g copying '/nix/store/fxbc evaluating derivation 'g copying '/nix/store/fxbc evaluating derivation 'g copying '/nix/store/fxbc evaluating derivation 'g copying '/nix/store/fxbc evaluating derivation 'g copying '/nix/store/fxbc evaluating derivation 'g copying '/nix/store/fxbc evaluating derivation 'g copying '/nix/store/fxbc evaluating derivation 'g copying '/nix/store/fxbc evaluating derivation 'g querying gammaloop-nexte [0.0 KiB DL] [0/1 built, 0.0 KiB DL] [1/0/1 built, 0.0 KiB DLgammaloop-nextest-core> Extracting 3 binaries (including 1 non-test binary), 1 build script output directory, and 2 linked paths to /build/nextest-archive-OVo6qM
  18. 25.88 s gammaloop-nextest-core> Extracted 18 files to /build/nextest-archive-OVo6qM in 0.56s
  19. 25.92 s gammaloop-nextest-core> ------------
  20. 25.92 s gammaloop-nextest-core> Nextest run ID 8c0b1aa5-f25b-4263-ad40-1545c533ffec with nextest profile: ci_gammaloop
  21. 25.92 s gammaloop-nextest-core> Starting 339 tests across 2 binaries
  22. 26.63 s gammaloop-nextest-core> FAIL [ 0.049s] (248/339) gammaloop-api repl::tests::completion_shows_type_hint_for_non_boolean_settings_leaf
  23. 26.63 s gammaloop-nextest-core> stdout ---
  24. 26.63 s gammaloop-nextest-core>
  25. 26.63 s gammaloop-nextest-core> running 1 test
  26. 26.63 s gammaloop-nextest-core> test repl::tests::completion_shows_type_hint_for_non_boolean_settings_leaf ... FAILED
  27. 26.63 s gammaloop-nextest-core>
  28. 26.63 s gammaloop-nextest-core> failures:
  29. 26.63 s gammaloop-nextest-core>
  30. 26.63 s gammaloop-nextest-core> failures:
  31. 26.63 s gammaloop-nextest-core> repl::tests::completion_shows_type_hint_for_non_boolean_settings_leaf
  32. 26.63 s gammaloop-nextest-core>
  33. 26.63 s gammaloop-nextest-core> test result: FAILED. 0 passed; 1 failed; 0 ignored; 0 measured; 338 filtered out; finished in 0.02s
  34. 26.63 s gammaloop-nextest-core>
  35. 26.63 s gammaloop-nextest-core> stderr ---
  36. 26.63 s gammaloop-nextest-core>
  37. 26.63 s gammaloop-nextest-core> thread 'repl::tests::completion_shows_type_hint_for_non_boolean_settings_leaf' (777) panicked at crates/gammaloop-api/src/repl.rs:5778:9:
  38. 26.63 s gammaloop-nextest-core> [Suggestion { value: "", description: Some("Number of samples in the first Monte Carlo iteration."), style: None, extra: None, span: Span { start: 42, end: 42 }, append_whitespace: false }]
  39. 26.63 s gammaloop-nextest-core> stack backtrace:
  40. 26.63 s gammaloop-nextest-core> 0: __rustc::rust_begin_unwind
  41. 26.63 s gammaloop-nextest-core> 1: core::panicking::panic_fmt
  42. 26.63 s gammaloop-nextest-core> 2: gammaloop_api::repl::tests::completion_shows_type_hint_for_non_boolean_settings_leaf
  43. 26.63 s gammaloop-nextest-core> 3: <gammaloop_api::repl::tests::completion_shows_type_hint_for_non_boolean_settings_leaf::{closure#0} as core::ops::function::FnOnce<()>>::call_once
  44. 26.63 s gammaloop-nextest-core> note: Some details are omitted, run with `RUST_BACKTRACE=full` for a verbose backtrace.
  45. 26.63 s gammaloop-nextest-core>
  46. 26.72 s gammaloop-nextest-core> FAIL [ 0.029s] (275/339) gammaloop-api templates::tests::extract_templates_uses_canonical_package_layout
  47. 26.72 s gammaloop-nextest-core> stdout ---
  48. 26.72 s gammaloop-nextest-core>
  49. 26.72 s gammaloop-nextest-core> running 1 test
  50. 26.72 s gammaloop-nextest-core> test templates::tests::extract_templates_uses_canonical_package_layout ... FAILED
  51. 26.72 s gammaloop-nextest-core>
  52. 26.72 s gammaloop-nextest-core> failures:
  53. 26.72 s gammaloop-nextest-core>
  54. 26.72 s gammaloop-nextest-core> failures:
  55. 26.72 s gammaloop-nextest-core> templates::tests::extract_templates_uses_canonical_package_layout
  56. 26.72 s gammaloop-nextest-core>
  57. 26.72 s gammaloop-nextest-core> test result: FAILED. 0 passed; 1 failed; 0 ignored; 0 measured; 338 filtered out; finished in 0.02s
  58. 26.72 s gammaloop-nextest-core>
  59. 26.72 s gammaloop-nextest-core> stderr ---
  60. 26.72 s gammaloop-nextest-core>
  61. 26.72 s gammaloop-nextest-core> thread 'templates::tests::extract_templates_uses_canonical_package_layout' (876) panicked at crates/gammaloop-api/src/templates.rs:99:9:
  62. 26.72 s gammaloop-nextest-core> assertion failed: figure.contains("amplitude-mode")
  63. 26.72 s gammaloop-nextest-core> stack backtrace:
  64. 26.72 s gammaloop-nextest-core> 0: __rustc::rust_begin_unwind
  65. 26.72 s gammaloop-nextest-core> 1: core::panicking::panic_fmt
  66. 26.72 s gammaloop-nextest-core> 2: core::panicking::panic
  67. 26.72 s gammaloop-nextest-core> 3: gammaloop_api::templates::tests::extract_templates_uses_canonical_package_layout
  68. 26.72 s gammaloop-nextest-core> 4: <gammaloop_api::templates::tests::extract_templates_uses_canonical_package_layout::{closure#0} as core::ops::function::FnOnce<()>>::call_once
  69. 26.72 s gammaloop-nextest-core> note: Some details are omitted, run with `RUST_BACKTRACE=full` for a verbose backtrace.
  70. 26.72 s gammaloop-nextest-core>
  71. 26.92 s gammaloop-nextest-core> ------------
  72. 26.92 s gammaloop-nextest-core> Summary [ 1.000s] 339 tests run: 337 passed, 2 failed, 0 skipped
  73. 26.92 s gammaloop-nextest-core> FAIL [ 0.049s] (248/339) gammaloop-api repl::tests::completion_shows_type_hint_for_non_boolean_settings_leaf
  74. 26.92 s gammaloop-nextest-core> stdout ---
  75. 26.92 s gammaloop-nextest-core>
  76. 26.92 s gammaloop-nextest-core> running 1 test
  77. 26.92 s gammaloop-nextest-core> test repl::tests::completion_shows_type_hint_for_non_boolean_settings_leaf ... FAILED
  78. 26.92 s gammaloop-nextest-core>
  79. 26.92 s gammaloop-nextest-core> failures:
  80. 26.92 s gammaloop-nextest-core>
  81. 26.92 s gammaloop-nextest-core> failures:
  82. 26.92 s gammaloop-nextest-core> repl::tests::completion_shows_type_hint_for_non_boolean_settings_leaf
  83. 26.92 s gammaloop-nextest-core>
  84. 26.92 s gammaloop-nextest-core> test result: FAILED. 0 passed; 1 failed; 0 ignored; 0 measured; 338 filtered out; finished in 0.02s
  85. 26.92 s gammaloop-nextest-core>
  86. 26.92 s gammaloop-nextest-core> stderr ---
  87. 26.92 s gammaloop-nextest-core>
  88. 26.92 s gammaloop-nextest-core> thread 'repl::tests::completion_shows_type_hint_for_non_boolean_settings_leaf' (777) panicked at crates/gammaloop-api/src/repl.rs:5778:9:
  89. 26.92 s gammaloop-nextest-core> [Suggestion { value: "", description: Some("Number of samples in the first Monte Carlo iteration."), style: None, extra: None, span: Span { start: 42, end: 42 }, append_whitespace: false }]
  90. 26.92 s gammaloop-nextest-core> stack backtrace:
  91. 26.92 s gammaloop-nextest-core> 0: __rustc::rust_begin_unwind
  92. 26.92 s gammaloop-nextest-core> 1: core::panicking::panic_fmt
  93. 26.92 s gammaloop-nextest-core> 2: gammaloop_api::repl::tests::completion_shows_type_hint_for_non_boolean_settings_leaf
  94. 26.92 s gammaloop-nextest-core> 3: <gammaloop_api::repl::tests::completion_shows_type_hint_for_non_boolean_settings_leaf::{closure#0} as core::ops::function::FnOnce<()>>::call_once
  95. 26.92 s gammaloop-nextest-core> note: Some details are omitted, run with `RUST_BACKTRACE=full` for a verbose backtrace.
  96. 26.92 s gammaloop-nextest-core>
  97. 26.92 s gammaloop-nextest-core> FAIL [ 0.029s] (275/339) gammaloop-api templates::tests::extract_templates_uses_canonical_package_layout
  98. 26.92 s gammaloop-nextest-core> stdout ---
  99. 26.92 s gammaloop-nextest-core>
  100. 26.92 s gammaloop-nextest-core> running 1 test
  101. 26.92 s gammaloop-nextest-core> test templates::tests::extract_templates_uses_canonical_package_layout ... FAILED
  102. 26.92 s gammaloop-nextest-core>
  103. 26.92 s gammaloop-nextest-core> failures:
  104. 26.92 s gammaloop-nextest-core>
  105. 26.92 s gammaloop-nextest-core> failures:
  106. 26.92 s gammaloop-nextest-core> templates::tests::extract_templates_uses_canonical_package_layout
  107. 26.92 s gammaloop-nextest-core>
  108. 26.92 s gammaloop-nextest-core> test result: FAILED. 0 passed; 1 failed; 0 ignored; 0 measured; 338 filtered out; finished in 0.02s
  109. 26.92 s gammaloop-nextest-core>
  110. 26.92 s gammaloop-nextest-core> stderr ---
  111. 26.92 s gammaloop-nextest-core>
  112. 26.92 s gammaloop-nextest-core> thread 'templates::tests::extract_templates_uses_canonical_package_layout' (876) panicked at crates/gammaloop-api/src/templates.rs:99:9:
  113. 26.92 s gammaloop-nextest-core> assertion failed: figure.contains("amplitude-mode")
  114. 26.92 s gammaloop-nextest-core> stack backtrace:
  115. 26.92 s gammaloop-nextest-core> 0: __rustc::rust_begin_unwind
  116. 26.92 s gammaloop-nextest-core> 1: core::panicking::panic_fmt
  117. 26.92 s gammaloop-nextest-core> 2: core::panicking::panic
  118. 26.92 s gammaloop-nextest-core> 3: gammaloop_api::templates::tests::extract_templates_uses_canonical_package_layout
  119. 26.92 s gammaloop-nextest-core> 4: <gammaloop_api::templates::tests::extract_templates_uses_canonical_package_layout::{closure#0} as core::ops::function::FnOnce<()>>::call_once
  120. 26.92 s gammaloop-nextest-core> note: Some details are omitted, run with `RUST_BACKTRACE=full` for a verbose backtrace.
  121. 26.92 s gammaloop-nextest-core>
  122. 27.02 s gammaloop-nextest-core> error: test run failed
  123. 27.17 s gammaloop-nextest-core>
  124. 27.17 s gammaloop-nextest-core> ========== nextest test summary ==========
  125. 27.17 s gammaloop-nextest-core> report: target/nextest/ci_gammaloop/junit.xml
  126. 27.17 s gammaloop-nextest-core> tests: 339, failures: 2, errors: 0
  127. 27.17 s gammaloop-nextest-core>
  128. 27.17 s gammaloop-nextest-core> 1. gammaloop-api::repl::tests::completion_shows_type_hint_for_non_boolean_settings_leaf
  129. 27.17 s gammaloop-nextest-core> failure: test failure with exit code 101
  130. 27.17 s gammaloop-nextest-core> thread 'repl::tests::completion_shows_type_hint_for_non_boolean_settings_leaf' (777) panicked at crates/gammaloop-api/src/repl.rs:5778:9:
  131. 27.17 s gammaloop-nextest-core> [Suggestion { value: "", description: Some("Number of samples in the first Monte Carlo iteration."), style: None, extra: None, span: Span { start: 42, end: 42 }, append_whitespace: false }]
  132. 27.17 s gammaloop-nextest-core> stack backtrace:
  133. 27.17 s gammaloop-nextest-core> 0: __rustc::rust_begin_unwind
  134. 27.17 s gammaloop-nextest-core> 1: core::panicking::panic_fmt
  135. 27.17 s gammaloop-nextest-core> 2: gammaloop_api::repl::tests::completion_shows_type_hint_for_non_boolean_settings_leaf
  136. 27.17 s gammaloop-nextest-core> 3: <gammaloop_api::repl::tests::completion_shows_type_hint_for_non_boolean_settings_leaf::{closure#0} as core::ops::function::FnOnce<()>>::call_once
  137. 27.17 s gammaloop-nextest-core> note: Some details are omitted, run with `RUST_BACKTRACE=full` for a verbose backtrace.
  138. 27.17 s gammaloop-nextest-core> system-out
  139. 27.17 s gammaloop-nextest-core> running 1 test
  140. 27.17 s gammaloop-nextest-core> test repl::tests::completion_shows_type_hint_for_non_boolean_settings_leaf ... FAILED
  141. 27.17 s gammaloop-nextest-core>
  142. 27.17 s gammaloop-nextest-core> failures:
  143. 27.17 s gammaloop-nextest-core>
  144. 27.17 s gammaloop-nextest-core> failures:
  145. 27.17 s gammaloop-nextest-core> repl::tests::completion_shows_type_hint_for_non_boolean_settings_leaf
  146. 27.17 s gammaloop-nextest-core>
  147. 27.17 s gammaloop-nextest-core> test result: FAILED. 0 passed; 1 failed; 0 ignored; 0 measured; 338 filtered out; finished in 0.02s
  148. 27.17 s gammaloop-nextest-core> system-err
  149. 27.17 s gammaloop-nextest-core> thread 'repl::tests::completion_shows_type_hint_for_non_boolean_settings_leaf' (777) panicked at crates/gammaloop-api/src/repl.rs:5778:9:
  150. 27.17 s gammaloop-nextest-core> [Suggestion { value: "", description: Some("Number of samples in the first Monte Carlo iteration."), style: None, extra: None, span: Span { start: 42, end: 42 }, append_whitespace: false }]
  151. 27.17 s gammaloop-nextest-core> stack backtrace:
  152. 27.17 s gammaloop-nextest-core> 0: __rustc::rust_begin_unwind
  153. 27.17 s gammaloop-nextest-core> 1: core::panicking::panic_fmt
  154. 27.17 s gammaloop-nextest-core> 2: gammaloop_api::repl::tests::completion_shows_type_hint_for_non_boolean_settings_leaf
  155. 27.17 s gammaloop-nextest-core> 3: <gammaloop_api::repl::tests::completion_shows_type_hint_for_non_boolean_settings_leaf::{closure#0} as core::ops::function::FnOnce<()>>::call_once
  156. 27.17 s gammaloop-nextest-core> note: Some details are omitted, run with `RUST_BACKTRACE=full` for a verbose backtrace.
  157. 27.17 s gammaloop-nextest-core>
  158. 27.17 s gammaloop-nextest-core> 2. gammaloop-api::templates::tests::extract_templates_uses_canonical_package_layout
  159. 27.17 s gammaloop-nextest-core> failure: test failure with exit code 101
  160. 27.17 s gammaloop-nextest-core> thread 'templates::tests::extract_templates_uses_canonical_package_layout' (876) panicked at crates/gammaloop-api/src/templates.rs:99:9:
  161. 27.17 s gammaloop-nextest-core> assertion failed: figure.contains("amplitude-mode")
  162. 27.17 s gammaloop-nextest-core> stack backtrace:
  163. 27.17 s gammaloop-nextest-core> 0: __rustc::rust_begin_unwind
  164. 27.17 s gammaloop-nextest-core> 1: core::panicking::panic_fmt
  165. 27.17 s gammaloop-nextest-core> 2: core::panicking::panic
  166. 27.17 s gammaloop-nextest-core> 3: gammaloop_api::templates::tests::extract_templates_uses_canonical_package_layout
  167. 27.17 s gammaloop-nextest-core> 4: <gammaloop_api::templates::tests::extract_templates_uses_canonical_package_layout::{closure#0} as core::ops::function::FnOnce<()>>::call_once
  168. 27.17 s gammaloop-nextest-core> note: Some details are omitted, run with `RUST_BACKTRACE=full` for a verbose backtrace.
  169. 27.17 s gammaloop-nextest-core> system-out
  170. 27.17 s gammaloop-nextest-core> running 1 test
  171. 27.17 s gammaloop-nextest-core> test templates::tests::extract_templates_uses_canonical_package_layout ... FAILED
  172. 27.17 s gammaloop-nextest-core>
  173. 27.17 s gammaloop-nextest-core> failures:
  174. 27.17 s gammaloop-nextest-core>
  175. 27.17 s gammaloop-nextest-core> failures:
  176. 27.17 s gammaloop-nextest-core> templates::tests::extract_templates_uses_canonical_package_layout
  177. 27.17 s gammaloop-nextest-core>
  178. 27.17 s gammaloop-nextest-core> test result: FAILED. 0 passed; 1 failed; 0 ignored; 0 measured; 338 filtered out; finished in 0.02s
  179. 27.17 s gammaloop-nextest-core> system-err
  180. 27.17 s gammaloop-nextest-core> thread 'templates::tests::extract_templates_uses_canonical_package_layout' (876) panicked at crates/gammaloop-api/src/templates.rs:99:9:
  181. 27.17 s gammaloop-nextest-core> assertion failed: figure.contains("amplitude-mode")
  182. 27.17 s gammaloop-nextest-core> stack backtrace:
  183. 27.17 s gammaloop-nextest-core> 0: __rustc::rust_begin_unwind
  184. 27.17 s gammaloop-nextest-core> 1: core::panicking::panic_fmt
  185. 27.17 s gammaloop-nextest-core> 2: core::panicking::panic
  186. 27.17 s gammaloop-nextest-core> 3: gammaloop_api::templates::tests::extract_templates_uses_canonical_package_layout
  187. 27.17 s gammaloop-nextest-core> 4: <gammaloop_api::templates::tests::extract_templates_uses_canonical_package_layout::{closure#0} as core::ops::function::FnOnce<()>>::call_once
  188. 27.17 s gammaloop-nextest-core> note: Some details are omitted, run with `RUST_BACKTRACE=full` for a verbose backtrace.
  189. 27.17 s gammaloop-nextest-core> =========================================
  190. 27.20 s gammaloop-nextest-core> Extracting 1 binary and 1 linked path to /build/nextest-archive-ZtiFdd
  191. 27.29 s gammaloop-nextest-core> Extracted 7 files to /build/nextest-archive-ZtiFdd in 0.10s
  192. 27.33 s gammaloop-nextest-core> ------------
  193. 27.33 s gammaloop-nextest-core> Nextest run ID 592ce6b0-6815-408d-a38e-b572d07df22d with nextest profile: ci_gammaloop
  194. 27.33 s gammaloop-nextest-core> Starting 19 tests across 1 binary
  195. 27.36 s gammaloop-nextest-core> ------------
  196. 27.36 s gammaloop-nextest-core> Summary [ 0.033s] 19 tests run: 19 passed, 0 skipped
  197. 27.45 s gammaloop-nextest-core>
  198. 27.45 s gammaloop-nextest-core> ========== nextest test summary ==========
  199. 27.45 s gammaloop-nextest-core> report: target/nextest/ci_gammaloop/junit.xml
  200. 27.45 s gammaloop-nextest-core> tests: 19, failures: 0, errors: 0
  201. 27.45 s gammaloop-nextest-core> No failing testcases found.
  202. 27.45 s gammaloop-nextest-core> =========================================
  203. 27.49 s gammaloop-nextest-core> Extracting 1 binary to /build/nextest-archive-dNTt94
  204. 27.55 s gammaloop-nextest-core> Extracted 4 files to /build/nextest-archive-dNTt94 in 0.06s
  205. 27.58 s gammaloop-nextest-core> ------------
  206. 27.58 s gammaloop-nextest-core> Nextest run ID 1c65cbae-6aa9-45c1-8059-71a920916a6e with nextest profile: ci_gammaloop
  207. 27.58 s gammaloop-nextest-core> Starting 0 tests across 1 binary
  208. 27.58 s gammaloop-nextest-core> ------------
  209. 27.58 s gammaloop-nextest-core> Summary [ 0.005s] 0 tests run: 0 passed, 0 skipped
  210. 27.65 s gammaloop-nextest-core>
  211. 27.65 s gammaloop-nextest-core> ========== nextest test summary ==========
  212. 27.65 s gammaloop-nextest-core> report: target/nextest/ci_gammaloop/junit.xml
  213. 27.65 s gammaloop-nextest-core> tests: 0, failures: 0, errors: 0
  214. 27.65 s gammaloop-nextest-core> No failing testcases found.
  215. 27.65 s gammaloop-nextest-core> =========================================
  216. 27.69 s gammaloop-nextest-core> Extracting 4 binaries, 1 build script output directory, and 2 linked paths to /build/nextest-archive-kmQ3Jp
  217. 28.27 s gammaloop-nextest-core> Extracted 18 files to /build/nextest-archive-kmQ3Jp in 0.59s
  218. 28.32 s gammaloop-nextest-core> ------------
  219. 28.32 s gammaloop-nextest-core> Nextest run ID fb959dde-2853-4425-9800-4e145098a14a with nextest profile: ci_gammaloop
  220. 28.32 s gammaloop-nextest-core> Starting 456 tests across 4 binaries (61 tests skipped, including 60 tests via profile.ci_gammaloop.default-filter)
  221. 28.99 s gammaloop-nextest-core> FAIL [ 0.417s] (126/456) gammalooprs graph::parse::tests::parse_lmbsetting_crossection
  222. 28.99 s gammaloop-nextest-core> stdout ---
  223. 28.99 s gammaloop-nextest-core>
  224. 28.99 s gammaloop-nextest-core> running 1 test
  225. 28.99 s gammaloop-nextest-core> ━━━━━━━━━━━━━━━━━━━━━━━━━━━━━━━ Snapshot Summary ━━━━━━━━━━━━━━━━━━━━━━━━━━━━━━━
  226. 28.99 s gammaloop-nextest-core> Snapshot: parse_lmbsetting_crossection
  227. 28.99 s gammaloop-nextest-core> Source: crates/gammalooprs/src/graph/parse/tests.rs:252
  228. 28.99 s gammaloop-nextest-core> ────────────────────────────────────────────────────────────────────────────────
  229. 28.99 s gammaloop-nextest-core> Expression: g.debug_dot()
  230. 28.99 s gammaloop-nextest-core> ────────────────────────────────────────────────────────────────────────────────
  231. 28.99 s gammaloop-nextest-core> -old snapshot
  232. 28.99 s gammaloop-nextest-core> +new results
  233. 28.99 s gammaloop-nextest-core> ────────────┬───────────────────────────────────────────────────────────────────
  234. 28.99 s gammaloop-nextest-core> 1 │-digraph G{
  235. 28.99 s gammaloop-nextest-core> 1 │+digraph G {
  236. 28.99 s gammaloop-nextest-core> 2 2 │ num = "1/2";
  237. 28.99 s gammaloop-nextest-core> 3 3 │ overall_factor = "2*x";
  238. 28.99 s gammaloop-nextest-core> 4 4 │ overall_factor_evaluated = "2*x";
  239. 28.99 s gammaloop-nextest-core> 5 5 │ projector = "spenso::t";
  240. 28.99 s gammaloop-nextest-core> ────────────┴───────────────────────────────────────────────────────────────────
  241. 28.99 s gammaloop-nextest-core> To update snapshots run `cargo insta review`
  242. 28.99 s gammaloop-nextest-core> Stopped on the first failure. Run `cargo insta test` to run all snapshots.
  243. 28.99 s gammaloop-nextest-core> test graph::parse::tests::parse_lmbsetting_crossection ... FAILED
  244. 28.99 s gammaloop-nextest-core>
  245. 28.99 s gammaloop-nextest-core> failures:
  246. 28.99 s gammaloop-nextest-core>
  247. 28.99 s gammaloop-nextest-core> failures:
  248. 28.99 s gammaloop-nextest-core> graph::parse::tests::parse_lmbsetting_crossection
  249. 28.99 s gammaloop-nextest-core>
  250. 28.99 s gammaloop-nextest-core> test result: FAILED. 0 passed; 1 failed; 0 ignored; 0 measured; 508 filtered out; finished in 0.30s
  251. 28.99 s gammaloop-nextest-core>
  252. 28.99 s gammaloop-nextest-core> stderr ---
  253. 28.99 s gammaloop-nextest-core> [20:20:08.931] @gammalooprs::graph::attribute_warnings WARNING : Unknown node attribute 'color_num' on graph 'G', node 'A'; did you mean 'num'?
  254. 28.99 s gammaloop-nextest-core> at crates/gammalooprs/src/graph/attribute_warnings.rs:198
  255. 28.99 s gammaloop-nextest-core> The application panicked (crashed).
  256. 28.99 s gammaloop-nextest-core> Message: snapshot assertion for 'parse_lmbsetting_crossection' failed in line 252
  257. 28.99 s gammaloop-nextest-core> Location: /nix/store/xdy1vvhll2bijdplvl9fcc2b9plkxhaa-vendor-cargo-deps/c19b7c6f923b580ac259164a89f2577984ad5ab09ee9d583b888f934adbbe8d0/insta-1.47.2/src/runtime.rs:719
  258. 28.99 s gammaloop-nextest-core>
  259. 28.99 s gammaloop-nextest-core> ━━━━━━━━━━━━━━━━━━━━━━━━━━━━━━━━━━ BACKTRACE ━━━━━━━━━━━━━━━━━━━━━━━━━━━━━━━━━━━
  260. 28.99 s gammaloop-nextest-core> 1: <color_eyre[b0c9e66060e883b2]::config::PanicHook>::panic_report<unknown>
  261. 28.99 s gammaloop-nextest-core> at <unknown source file>:<unknown line>
  262. 28.99 s gammaloop-nextest-core> 2: <color_eyre[b0c9e66060e883b2]::config::PanicHook>::into_panic_hook::{closure#0}<unknown>
  263. 28.99 s gammaloop-nextest-core> at <unknown source file>:<unknown line>
  264. 28.99 s gammaloop-nextest-core> 3: std[bcb96dfbba0ab899]::panicking::panic_with_hook<unknown>
  265. 28.99 s gammaloop-nextest-core> at <unknown source file>:<unknown line>
  266. 28.99 s gammaloop-nextest-core> 4: std[bcb96dfbba0ab899]::panicking::panic_handler::{closure#0}<unknown>
  267. 28.99 s gammaloop-nextest-core> at <unknown source file>:<unknown line>
  268. 28.99 s gammaloop-nextest-core> 5: std[bcb96dfbba0ab899]::sys::backtrace::__rust_end_short_backtrace::<std[bcb96dfbba0ab899]::panicking::panic_handler::{closure#0}, !><unknown>
  269. 28.99 s gammaloop-nextest-core> at <unknown source file>:<unknown line>
  270. 28.99 s gammaloop-nextest-core> 6: __rustc[6c289b9f9c454d21]::rust_begin_unwind<unknown>
  271. 28.99 s gammaloop-nextest-core> at <unknown source file>:<unknown line>
  272. 28.99 s gammaloop-nextest-core> 7: core[940e698046960fd5]::panicking::panic_fmt<unknown>
  273. 28.99 s gammaloop-nextest-core> at <unknown source file>:<unknown line>
  274. 28.99 s gammaloop-nextest-core> 8: insta[307a548ac79ef4d9]::runtime::assert_snapshot<unknown>
  275. 28.99 s gammaloop-nextest-core> at <unknown source file>:<unknown line>
  276. 28.99 s gammaloop-nextest-core> 9: gammalooprs[5490727360442cce]::graph::parse::tests::parse_lmbsetting_crossection<unknown>
  277. 28.99 s gammaloop-nextest-core> at <unknown source file>:<unknown line>
  278. 28.99 s gammaloop-nextest-core> 10: <gammalooprs[5490727360442cce]::graph::parse::tests::parse_lmbsetting_crossection::{closure#0} as core[940e698046960fd5]::ops::function::FnOnce<()>>::call_once<unknown>
  279. 28.99 s gammaloop-nextest-core> at <unknown source file>:<unknown line>
  280. 28.99 s gammaloop-nextest-core> 11: test[75d6903177b1d7e9]::__rust_begin_short_backtrace::<core[940e698046960fd5]::result::Result<(), alloc[2ea6bcb46fca0c42]::string::String>, fn() -> core[940e698046960fd5]::result::Result<(), alloc[2ea6bcb46fca0c42]::string::String>><unknown>
  281. 28.99 s gammaloop-nextest-core> at <unknown source file>:<unknown line>
  282. 28.99 s gammaloop-nextest-core> 12: test[75d6903177b1d7e9]::run_test::{closure#0}<unknown>
  283. 28.99 s gammaloop-nextest-core> at <unknown source file>:<unknown line>
  284. 28.99 s gammaloop-nextest-core> 13: std[bcb96dfbba0ab899]::sys::backtrace::__rust_begin_short_backtrace::<test[75d6903177b1d7e9]::run_test::{closure#1}, ()><unknown>
  285. 28.99 s gammaloop-nextest-core> at <unknown source file>:<unknown line>
  286. 28.99 s gammaloop-nextest-core> 14: <std[bcb96dfbba0ab899]::thread::lifecycle::spawn_unchecked<test[75d6903177b1d7e9]::run_test::{closure#1}, ()>::{closure#1} as core[940e698046960fd5]::ops::function::FnOnce<()>>::call_once::{shim:vtable#0}<unknown>
  287. 28.99 s gammaloop-nextest-core> at <unknown source file>:<unknown line>
  288. 28.99 s gammaloop-nextest-core> 15: <std[bcb96dfbba0ab899]::sys::thread::unix::Thread>::new::thread_start<unknown>
  289. 28.99 s gammaloop-nextest-core> at <unknown source file>:<unknown line>
  290. 28.99 s gammaloop-nextest-core> 16: start_thread<unknown>
  291. 28.99 s gammaloop-nextest-core> at <unknown source file>:<unknown line>
  292. 28.99 s gammaloop-nextest-core> 17: __clone3<unknown>
  293. 28.99 s gammaloop-nextest-core> at <unknown source file>:<unknown line>
  294. 28.99 s gammaloop-nextest-core>
  295. 28.99 s gammaloop-nextest-core> Run with COLORBT_SHOW_HIDDEN=1 environment variable to disable frame filtering.
  296. 28.99 s gammaloop-nextest-core> Run with RUST_BACKTRACE=full to include source snippets.
  297. 28.99 s gammaloop-nextest-core>
  298. 30.89 s gammaloop-nextest-core> FAIL [ 0.903s] (434/456) gammalooprs uv::export::tests::computed_node_full_numerator_is_a_spenso_aware_typst_fragment
  299. 30.92 s gammaloop-nextest-core> stdout ---
  300. 30.92 s gammaloop-nextest-core>
  301. 30.92 s gammaloop-nextest-core> running 1 test
  302. 30.92 s gammaloop-nextest-core> test uv::export::tests::computed_node_full_numerator_is_a_spenso_aware_typst_fragment ... FAILED
  303. 30.92 s gammaloop-nextest-core>
  304. 30.92 s gammaloop-nextest-core> failures:
  305. 30.92 s gammaloop-nextest-core>
  306. 30.92 s gammaloop-nextest-core> failures:
  307. 30.92 s gammaloop-nextest-core> uv::export::tests::computed_node_full_numerator_is_a_spenso_aware_typst_fragment
  308. 30.92 s gammaloop-nextest-core>
  309. 30.92 s gammaloop-nextest-core> test result: FAILED. 0 passed; 1 failed; 0 ignored; 0 measured; 508 filtered out; finished in 0.87s
  310. 30.92 s gammaloop-nextest-core>
  311. 30.92 s gammaloop-nextest-core> stderr ---
  312. 30.92 s gammaloop-nextest-core> The application panicked (crashed).
  313. 30.92 s gammaloop-nextest-core> Message: assertion failed: exported.dot.contains(r#"full_num = "op(\"Tr\")(1)";"#)
  314. 30.92 s gammaloop-nextest-core> Location: crates/gammalooprs/src/uv/export.rs:483
  315. 30.92 s gammaloop-nextest-core>
  316. 30.92 s gammaloop-nextest-core> ━━━━━━━━━━━━━━━━━━━━━━━━━━━━━━━━━━ BACKTRACE ━━━━━━━━━━━━━━━━━━━━━━━━━━━━━━━━━━━
  317. 30.92 s gammaloop-nextest-core> 1: <color_eyre[b0c9e66060e883b2]::config::PanicHook>::panic_report<unknown>
  318. 30.92 s gammaloop-nextest-core> at <unknown source file>:<unknown line>
  319. 30.92 s gammaloop-nextest-core> 2: <color_eyre[b0c9e66060e883b2]::config::PanicHook>::into_panic_hook::{closure#0}<unknown>
  320. 30.92 s gammaloop-nextest-core> at <unknown source file>:<unknown line>
  321. 30.92 s gammaloop-nextest-core> 3: std[bcb96dfbba0ab899]::panicking::panic_with_hook<unknown>
  322. 30.92 s gammaloop-nextest-core> at <unknown source file>:<unknown line>
  323. 30.92 s gammaloop-nextest-core> 4: std[bcb96dfbba0ab899]::panicking::panic_handler::{closure#0}<unknown>
  324. 30.92 s gammaloop-nextest-core> at <unknown source file>:<unknown line>
  325. 30.92 s gammaloop-nextest-core> 5: std[bcb96dfbba0ab899]::sys::backtrace::__rust_end_short_backtrace::<std[bcb96dfbba0ab899]::panicking::panic_handler::{closure#0}, !><unknown>
  326. 30.92 s gammaloop-nextest-core> at <unknown source file>:<unknown line>
  327. 30.92 s gammaloop-nextest-core> 6: __rustc[6c289b9f9c454d21]::rust_begin_unwind<unknown>
  328. 30.92 s gammaloop-nextest-core> at <unknown source file>:<unknown line>
  329. 30.92 s gammaloop-nextest-core> 7: core[940e698046960fd5]::panicking::panic_fmt<unknown>
  330. 30.92 s gammaloop-nextest-core> at <unknown source file>:<unknown line>
  331. 30.92 s gammaloop-nextest-core> 8: core[940e698046960fd5]::panicking::panic<unknown>
  332. 30.92 s gammaloop-nextest-core> at <unknown source file>:<unknown line>
  333. 30.92 s gammaloop-nextest-core> 9: gammalooprs[5490727360442cce]::uv::export::tests::computed_node_full_numerator_is_a_spenso_aware_typst_fragment<unknown>
  334. 30.92 s gammaloop-nextest-core> at <unknown source file>:<unknown line>
  335. 30.92 s gammaloop-nextest-core> 10: <gammalooprs[5490727360442cce]::uv::export::tests::computed_node_full_numerator_is_a_spenso_aware_typst_fragment::{closure#0} as core[940e698046960fd5]::ops::function::FnOnce<()>>::call_once<unknown>
  336. 30.92 s gammaloop-nextest-core> at <unknown source file>:<unknown line>
  337. 30.92 s gammaloop-nextest-core> 11: test[75d6903177b1d7e9]::__rust_begin_short_backtrace::<core[940e698046960fd5]::result::Result<(), alloc[2ea6bcb46fca0c42]::string::String>, fn() -> core[940e698046960fd5]::result::Result<(), alloc[2ea6bcb46fca0c42]::string::String>><unknown>
  338. 30.92 s gammaloop-nextest-core> at <unknown source file>:<unknown line>
  339. 30.92 s gammaloop-nextest-core> 12: test[75d6903177b1d7e9]::run_test::{closure#0}<unknown>
  340. 30.92 s gammaloop-nextest-core> at <unknown source file>:<unknown line>
  341. 30.92 s gammaloop-nextest-core> 13: std[bcb96dfbba0ab899]::sys::backtrace::__rust_begin_short_backtrace::<test[75d6903177b1d7e9]::run_test::{closure#1}, ()><unknown>
  342. 30.92 s gammaloop-nextest-core> at <unknown source file>:<unknown line>
  343. 30.92 s gammaloop-nextest-core> 14: <std[bcb96dfbba0ab899]::thread::lifecycle::spawn_unchecked<test[75d6903177b1d7e9]::run_test::{closure#1}, ()>::{closure#1} as core[940e698046960fd5]::ops::function::FnOnce<()>>::call_once::{shim:vtable#0}<unknown>
  344. 30.92 s gammaloop-nextest-core> at <unknown source file>:<unknown line>
  345. 30.92 s gammaloop-nextest-core> 15: <std[bcb96dfbba0ab899]::sys::thread::unix::Thread>::new::thread_start<unknown>
  346. 30.92 s gammaloop-nextest-core> at <unknown source file>:<unknown line>
  347. 30.92 s gammaloop-nextest-core> 16: start_thread<unknown>
  348. 30.92 s gammaloop-nextest-core> at <unknown source file>:<unknown line>
  349. 30.92 s gammaloop-nextest-core> 17: __clone3<unknown>
  350. 30.92 s gammaloop-nextest-core> at <unknown source file>:<unknown line>
  351. 30.92 s gammaloop-nextest-core>
  352. 30.92 s gammaloop-nextest-core> Run with COLORBT_SHOW_HIDDEN=1 environment variable to disable frame filtering.
  353. 30.92 s gammaloop-nextest-core> Run with RUST_BACKTRACE=full to include source snippets.
  354. 30.92 s gammaloop-nextest-core>
  355. 43.10 s gammaloop-nextest-core> ------------
  356. 43.11 s gammaloop-nextest-core> Summary [ 14.778s] 456 tests run: 454 passed, 2 failed, 61 skipped
  357. 43.11 s gammaloop-nextest-core> FAIL [ 0.417s] (126/456) gammalooprs graph::parse::tests::parse_lmbsetting_crossection
  358. 43.11 s gammaloop-nextest-core> stdout ---
  359. 43.11 s gammaloop-nextest-core>
  360. 43.11 s gammaloop-nextest-core> running 1 test
  361. 43.11 s gammaloop-nextest-core> ━━━━━━━━━━━━━━━━━━━━━━━━━━━━━━━ Snapshot Summary ━━━━━━━━━━━━━━━━━━━━━━━━━━━━━━━
  362. 43.11 s gammaloop-nextest-core> Snapshot: parse_lmbsetting_crossection
  363. 43.11 s gammaloop-nextest-core> Source: crates/gammalooprs/src/graph/parse/tests.rs:252
  364. 43.11 s gammaloop-nextest-core> ────────────────────────────────────────────────────────────────────────────────
  365. 43.11 s gammaloop-nextest-core> Expression: g.debug_dot()
  366. 43.11 s gammaloop-nextest-core> ────────────────────────────────────────────────────────────────────────────────
  367. 43.11 s gammaloop-nextest-core> -old snapshot
  368. 43.11 s gammaloop-nextest-core> +new results
  369. 43.11 s gammaloop-nextest-core> ────────────┬───────────────────────────────────────────────────────────────────
  370. 43.11 s gammaloop-nextest-core> 1 │-digraph G{
  371. 43.11 s gammaloop-nextest-core> 1 │+digraph G {
  372. 43.11 s gammaloop-nextest-core> 2 2 │ num = "1/2";
  373. 43.11 s gammaloop-nextest-core> 3 3 │ overall_factor = "2*x";
  374. 43.11 s gammaloop-nextest-core> 4 4 │ overall_factor_evaluated = "2*x";
  375. 43.11 s gammaloop-nextest-core> 5 5 │ projector = "spenso::t";
  376. 43.11 s gammaloop-nextest-core> ────────────┴───────────────────────────────────────────────────────────────────
  377. 43.11 s gammaloop-nextest-core> To update snapshots run `cargo insta review`
  378. 43.11 s gammaloop-nextest-core> Stopped on the first failure. Run `cargo insta test` to run all snapshots.
  379. 43.11 s gammaloop-nextest-core> test graph::parse::tests::parse_lmbsetting_crossection ... FAILED
  380. 43.11 s gammaloop-nextest-core>
  381. 43.11 s gammaloop-nextest-core> failures:
  382. 43.11 s gammaloop-nextest-core>
  383. 43.11 s gammaloop-nextest-core> failures:
  384. 43.11 s gammaloop-nextest-core> graph::parse::tests::parse_lmbsetting_crossection
  385. 43.11 s gammaloop-nextest-core>
  386. 43.11 s gammaloop-nextest-core> test result: FAILED. 0 passed; 1 failed; 0 ignored; 0 measured; 508 filtered out; finished in 0.30s
  387. 43.11 s gammaloop-nextest-core>
  388. 43.11 s gammaloop-nextest-core> stderr ---
  389. 43.11 s gammaloop-nextest-core> [20:20:08.931] @gammalooprs::graph::attribute_warnings WARNING : Unknown node attribute 'color_num' on graph 'G', node 'A'; did you mean 'num'?
  390. 43.11 s gammaloop-nextest-core> at crates/gammalooprs/src/graph/attribute_warnings.rs:198
  391. 43.11 s gammaloop-nextest-core> The application panicked (crashed).
  392. 43.11 s gammaloop-nextest-core> Message: snapshot assertion for 'parse_lmbsetting_crossection' failed in line 252
  393. 43.11 s gammaloop-nextest-core> Location: /nix/store/xdy1vvhll2bijdplvl9fcc2b9plkxhaa-vendor-cargo-deps/c19b7c6f923b580ac259164a89f2577984ad5ab09ee9d583b888f934adbbe8d0/insta-1.47.2/src/runtime.rs:719
  394. 43.11 s gammaloop-nextest-core>
  395. 43.11 s gammaloop-nextest-core> ━━━━━━━━━━━━━━━━━━━━━━━━━━━━━━━━━━ BACKTRACE ━━━━━━━━━━━━━━━━━━━━━━━━━━━━━━━━━━━
  396. 43.11 s gammaloop-nextest-core> 1: <color_eyre[b0c9e66060e883b2]::config::PanicHook>::panic_report<unknown>
  397. 43.11 s gammaloop-nextest-core> at <unknown source file>:<unknown line>
  398. 43.11 s gammaloop-nextest-core> 2: <color_eyre[b0c9e66060e883b2]::config::PanicHook>::into_panic_hook::{closure#0}<unknown>
  399. 43.11 s gammaloop-nextest-core> at <unknown source file>:<unknown line>
  400. 43.11 s gammaloop-nextest-core> 3: std[bcb96dfbba0ab899]::panicking::panic_with_hook<unknown>
  401. 43.11 s gammaloop-nextest-core> at <unknown source file>:<unknown line>
  402. 43.11 s gammaloop-nextest-core> 4: std[bcb96dfbba0ab899]::panicking::panic_handler::{closure#0}<unknown>
  403. 43.11 s gammaloop-nextest-core> at <unknown source file>:<unknown line>
  404. 43.11 s gammaloop-nextest-core> 5: std[bcb96dfbba0ab899]::sys::backtrace::__rust_end_short_backtrace::<std[bcb96dfbba0ab899]::panicking::panic_handler::{closure#0}, !><unknown>
  405. 43.11 s gammaloop-nextest-core> at <unknown source file>:<unknown line>
  406. 43.11 s gammaloop-nextest-core> 6: __rustc[6c289b9f9c454d21]::rust_begin_unwind<unknown>
  407. 43.11 s gammaloop-nextest-core> at <unknown source file>:<unknown line>
  408. 43.11 s gammaloop-nextest-core> 7: core[940e698046960fd5]::panicking::panic_fmt<unknown>
  409. 43.11 s gammaloop-nextest-core> at <unknown source file>:<unknown line>
  410. 43.11 s gammaloop-nextest-core> 8: insta[307a548ac79ef4d9]::runtime::assert_snapshot<unknown>
  411. 43.11 s gammaloop-nextest-core> at <unknown source file>:<unknown line>
  412. 43.11 s gammaloop-nextest-core> 9: gammalooprs[5490727360442cce]::graph::parse::tests::parse_lmbsetting_crossection<unknown>
  413. 43.11 s gammaloop-nextest-core> at <unknown source file>:<unknown line>
  414. 43.11 s gammaloop-nextest-core> 10: <gammalooprs[5490727360442cce]::graph::parse::tests::parse_lmbsetting_crossection::{closure#0} as core[940e698046960fd5]::ops::function::FnOnce<()>>::call_once<unknown>
  415. 43.11 s gammaloop-nextest-core> at <unknown source file>:<unknown line>
  416. 43.11 s gammaloop-nextest-core> 11: test[75d6903177b1d7e9]::__rust_begin_short_backtrace::<core[940e698046960fd5]::result::Result<(), alloc[2ea6bcb46fca0c42]::string::String>, fn() -> core[940e698046960fd5]::result::Result<(), alloc[2ea6bcb46fca0c42]::string::String>><unknown>
  417. 43.11 s gammaloop-nextest-core> at <unknown source file>:<unknown line>
  418. 43.11 s gammaloop-nextest-core> 12: test[75d6903177b1d7e9]::run_test::{closure#0}<unknown>
  419. 43.11 s gammaloop-nextest-core> at <unknown source file>:<unknown line>
  420. 43.11 s gammaloop-nextest-core> 13: std[bcb96dfbba0ab899]::sys::backtrace::__rust_begin_short_backtrace::<test[75d6903177b1d7e9]::run_test::{closure#1}, ()><unknown>
  421. 43.11 s gammaloop-nextest-core> at <unknown source file>:<unknown line>
  422. 43.11 s gammaloop-nextest-core> 14: <std[bcb96dfbba0ab899]::thread::lifecycle::spawn_unchecked<test[75d6903177b1d7e9]::run_test::{closure#1}, ()>::{closure#1} as core[940e698046960fd5]::ops::function::FnOnce<()>>::call_once::{shim:vtable#0}<unknown>
  423. 43.11 s gammaloop-nextest-core> at <unknown source file>:<unknown line>
  424. 43.11 s gammaloop-nextest-core> 15: <std[bcb96dfbba0ab899]::sys::thread::unix::Thread>::new::thread_start<unknown>
  425. 43.11 s gammaloop-nextest-core> at <unknown source file>:<unknown line>
  426. 43.11 s gammaloop-nextest-core> 16: start_thread<unknown>
  427. 43.11 s gammaloop-nextest-core> at <unknown source file>:<unknown line>
  428. 43.11 s gammaloop-nextest-core> 17: __clone3<unknown>
  429. 43.11 s gammaloop-nextest-core> at <unknown source file>:<unknown line>
  430. 43.11 s gammaloop-nextest-core>
  431. 43.11 s gammaloop-nextest-core> Run with COLORBT_SHOW_HIDDEN=1 environment variable to disable frame filtering.
  432. 43.11 s gammaloop-nextest-core> Run with RUST_BACKTRACE=full to include source snippets.
  433. 43.11 s gammaloop-nextest-core>
  434. 43.11 s gammaloop-nextest-core> FAIL [ 0.903s] (434/456) gammalooprs uv::export::tests::computed_node_full_numerator_is_a_spenso_aware_typst_fragment
  435. 43.11 s gammaloop-nextest-core> stdout ---
  436. 43.11 s gammaloop-nextest-core>
  437. 43.11 s gammaloop-nextest-core> running 1 test
  438. 43.11 s gammaloop-nextest-core> test uv::export::tests::computed_node_full_numerator_is_a_spenso_aware_typst_fragment ... FAILED
  439. 43.11 s gammaloop-nextest-core>
  440. 43.11 s gammaloop-nextest-core> failures:
  441. 43.11 s gammaloop-nextest-core>
  442. 43.11 s gammaloop-nextest-core> failures:
  443. 43.11 s gammaloop-nextest-core> uv::export::tests::computed_node_full_numerator_is_a_spenso_aware_typst_fragment
  444. 43.11 s gammaloop-nextest-core>
  445. 43.11 s gammaloop-nextest-core> test result: FAILED. 0 passed; 1 failed; 0 ignored; 0 measured; 508 filtered out; finished in 0.87s
  446. 43.11 s gammaloop-nextest-core>
  447. 43.11 s gammaloop-nextest-core> stderr ---
  448. 43.11 s gammaloop-nextest-core> The application panicked (crashed).
  449. 43.11 s gammaloop-nextest-core> Message: assertion failed: exported.dot.contains(r#"full_num = "op(\"Tr\")(1)";"#)
  450. 43.11 s gammaloop-nextest-core> Location: crates/gammalooprs/src/uv/export.rs:483
  451. 43.11 s gammaloop-nextest-core>
  452. 43.11 s gammaloop-nextest-core> ━━━━━━━━━━━━━━━━━━━━━━━━━━━━━━━━━━ BACKTRACE ━━━━━━━━━━━━━━━━━━━━━━━━━━━━━━━━━━━
  453. 43.11 s gammaloop-nextest-core> 1: <color_eyre[b0c9e66060e883b2]::config::PanicHook>::panic_report<unknown>
  454. 43.11 s gammaloop-nextest-core> at <unknown source file>:<unknown line>
  455. 43.11 s gammaloop-nextest-core> 2: <color_eyre[b0c9e66060e883b2]::config::PanicHook>::into_panic_hook::{closure#0}<unknown>
  456. 43.11 s gammaloop-nextest-core> at <unknown source file>:<unknown line>
  457. 43.11 s gammaloop-nextest-core> 3: std[bcb96dfbba0ab899]::panicking::panic_with_hook<unknown>
  458. 43.11 s gammaloop-nextest-core> at <unknown source file>:<unknown line>
  459. 43.11 s gammaloop-nextest-core> 4: std[bcb96dfbba0ab899]::panicking::panic_handler::{closure#0}<unknown>
  460. 43.11 s gammaloop-nextest-core> at <unknown source file>:<unknown line>
  461. 43.11 s gammaloop-nextest-core> 5: std[bcb96dfbba0ab899]::sys::backtrace::__rust_end_short_backtrace::<std[bcb96dfbba0ab899]::panicking::panic_handler::{closure#0}, !><unknown>
  462. 43.11 s gammaloop-nextest-core> at <unknown source file>:<unknown line>
  463. 43.11 s gammaloop-nextest-core> 6: __rustc[6c289b9f9c454d21]::rust_begin_unwind<unknown>
  464. 43.11 s gammaloop-nextest-core> at <unknown source file>:<unknown line>
  465. 43.11 s gammaloop-nextest-core> 7: core[940e698046960fd5]::panicking::panic_fmt<unknown>
  466. 43.11 s gammaloop-nextest-core> at <unknown source file>:<unknown line>
  467. 43.11 s gammaloop-nextest-core> 8: core[940e698046960fd5]::panicking::panic<unknown>
  468. 43.11 s gammaloop-nextest-core> at <unknown source file>:<unknown line>
  469. 43.11 s gammaloop-nextest-core> 9: gammalooprs[5490727360442cce]::uv::export::tests::computed_node_full_numerator_is_a_spenso_aware_typst_fragment<unknown>
  470. 43.11 s gammaloop-nextest-core> at <unknown source file>:<unknown line>
  471. 43.11 s gammaloop-nextest-core> 10: <gammalooprs[5490727360442cce]::uv::export::tests::computed_node_full_numerator_is_a_spenso_aware_typst_fragment::{closure#0} as core[940e698046960fd5]::ops::function::FnOnce<()>>::call_once<unknown>
  472. 43.11 s gammaloop-nextest-core> at <unknown source file>:<unknown line>
  473. 43.11 s gammaloop-nextest-core> 11: test[75d6903177b1d7e9]::__rust_begin_short_backtrace::<core[940e698046960fd5]::result::Result<(), alloc[2ea6bcb46fca0c42]::string::String>, fn() -> core[940e698046960fd5]::result::Result<(), alloc[2ea6bcb46fca0c42]::string::String>><unknown>
  474. 43.11 s gammaloop-nextest-core> at <unknown source file>:<unknown line>
  475. 43.11 s gammaloop-nextest-core> 12: test[75d6903177b1d7e9]::run_test::{closure#0}<unknown>
  476. 43.11 s gammaloop-nextest-core> at <unknown source file>:<unknown line>
  477. 43.11 s gammaloop-nextest-core> 13: std[bcb96dfbba0ab899]::sys::backtrace::__rust_begin_short_backtrace::<test[75d6903177b1d7e9]::run_test::{closure#1}, ()><unknown>
  478. 43.11 s gammaloop-nextest-core> at <unknown source file>:<unknown line>
  479. 43.11 s gammaloop-nextest-core> 14: <std[bcb96dfbba0ab899]::thread::lifecycle::spawn_unchecked<test[75d6903177b1d7e9]::run_test::{closure#1}, ()>::{closure#1} as core[940e698046960fd5]::ops::function::FnOnce<()>>::call_once::{shim:vtable#0}<unknown>
  480. 43.11 s gammaloop-nextest-core> at <unknown source file>:<unknown line>
  481. 43.11 s gammaloop-nextest-core> 15: <std[bcb96dfbba0ab899]::sys::thread::unix::Thread>::new::thread_start<unknown>
  482. 43.11 s gammaloop-nextest-core> at <unknown source file>:<unknown line>
  483. 43.11 s gammaloop-nextest-core> 16: start_thread<unknown>
  484. 43.11 s gammaloop-nextest-core> at <unknown source file>:<unknown line>
  485. 43.11 s gammaloop-nextest-core> 17: __clone3<unknown>
  486. 43.11 s gammaloop-nextest-core> at <unknown source file>:<unknown line>
  487. 43.11 s gammaloop-nextest-core>
  488. 43.11 s gammaloop-nextest-core> Run with COLORBT_SHOW_HIDDEN=1 environment variable to disable frame filtering.
  489. 43.11 s gammaloop-nextest-core> Run with RUST_BACKTRACE=full to include source snippets.
  490. 43.11 s gammaloop-nextest-core>
  491. 43.19 s gammaloop-nextest-core> error: test run failed
  492. 43.24 s gammaloop-nextest-core>
  493. 43.24 s gammaloop-nextest-core> ========== nextest test summary ==========
  494. 43.24 s gammaloop-nextest-core> report: target/nextest/ci_gammaloop/junit.xml
  495. 43.24 s gammaloop-nextest-core> tests: 456, failures: 2, errors: 0
  496. 43.24 s gammaloop-nextest-core>
  497. 43.24 s gammaloop-nextest-core> 1. gammalooprs::graph::parse::tests::parse_lmbsetting_crossection
  498. 43.24 s gammaloop-nextest-core> failure: test failure with exit code 101
  499. 43.24 s gammaloop-nextest-core> system-out
  500. 43.24 s gammaloop-nextest-core> running 1 test
  501. 43.24 s gammaloop-nextest-core> ━━━━━━━━━━━━━━━━━━━━━━━━━━━━━━━ Snapshot Summary ━━━━━━━━━━━━━━━━━━━━━━━━━━━━━━━
  502. 43.24 s gammaloop-nextest-core> Snapshot: parse_lmbsetting_crossection
  503. 43.24 s gammaloop-nextest-core> Source: crates/gammalooprs/src/graph/parse/tests.rs:252
  504. 43.24 s gammaloop-nextest-core> ────────────────────────────────────────────────────────────────────────────────
  505. 43.24 s gammaloop-nextest-core> Expression: g.debug_dot()
  506. 43.24 s gammaloop-nextest-core> ────────────────────────────────────────────────────────────────────────────────
  507. 43.24 s gammaloop-nextest-core> -old snapshot
  508. 43.24 s gammaloop-nextest-core> +new results
  509. 43.24 s gammaloop-nextest-core> ────────────┬───────────────────────────────────────────────────────────────────
  510. 43.24 s gammaloop-nextest-core> 1 │-digraph G{
  511. 43.24 s gammaloop-nextest-core> 1 │+digraph G {
  512. 43.24 s gammaloop-nextest-core> 2 2 │ num = "1/2";
  513. 43.24 s gammaloop-nextest-core> 3 3 │ overall_factor = "2*x";
  514. 43.24 s gammaloop-nextest-core> 4 4 │ overall_factor_evaluated = "2*x";
  515. 43.24 s gammaloop-nextest-core> 5 5 │ projector = "spenso::t";
  516. 43.24 s gammaloop-nextest-core> ────────────┴───────────────────────────────────────────────────────────────────
  517. 43.24 s gammaloop-nextest-core> To update snapshots run `cargo insta review`
  518. 43.24 s gammaloop-nextest-core> Stopped on the first failure. Run `cargo insta test` to run all snapshots.
  519. 43.24 s gammaloop-nextest-core> test graph::parse::tests::parse_lmbsetting_crossection ... FAILED
  520. 43.24 s gammaloop-nextest-core>
  521. 43.24 s gammaloop-nextest-core> failures:
  522. 43.24 s gammaloop-nextest-core>
  523. 43.24 s gammaloop-nextest-core> failures:
  524. 43.24 s gammaloop-nextest-core> graph::parse::tests::parse_lmbsetting_crossection
  525. 43.24 s gammaloop-nextest-core>
  526. 43.24 s gammaloop-nextest-core> test result: FAILED. 0 passed; 1 failed; 0 ignored; 0 measured; 508 filtered out; finished in 0.30s
  527. 43.24 s gammaloop-nextest-core> system-err
  528. 43.24 s gammaloop-nextest-core> [20:20:08.931] @gammalooprs::graph::attribute_warnings WARNING : Unknown node attribute 'color_num' on graph 'G', node 'A'; did you mean 'num'?
  529. 43.24 s gammaloop-nextest-core> at crates/gammalooprs/src/graph/attribute_warnings.rs:198
  530. 43.24 s gammaloop-nextest-core> The application panicked (crashed).
  531. 43.24 s gammaloop-nextest-core> Message: snapshot assertion for 'parse_lmbsetting_crossection' failed in line 252
  532. 43.24 s gammaloop-nextest-core> Location: /nix/store/xdy1vvhll2bijdplvl9fcc2b9plkxhaa-vendor-cargo-deps/c19b7c6f923b580ac259164a89f2577984ad5ab09ee9d583b888f934adbbe8d0/insta-1.47.2/src/runtime.rs:719
  533. 43.24 s gammaloop-nextest-core>
  534. 43.24 s gammaloop-nextest-core> ━━━━━━━━━━━━━━━━━━━━━━━━━━━━━━━━━━ BACKTRACE ━━━━━━━━━━━━━━━━━━━━━━━━━━━━━━━━━━━
  535. 43.24 s gammaloop-nextest-core> 1: <color_eyre[b0c9e66060e883b2]::config::PanicHook>::panic_report<unknown>
  536. 43.24 s gammaloop-nextest-core> at <unknown source file>:<unknown line>
  537. 43.24 s gammaloop-nextest-core> 2: <color_eyre[b0c9e66060e883b2]::config::PanicHook>::into_panic_hook::{closure#0}<unknown>
  538. 43.24 s gammaloop-nextest-core> at <unknown source file>:<unknown line>
  539. 43.24 s gammaloop-nextest-core> 3: std[bcb96dfbba0ab899]::panicking::panic_with_hook<unknown>
  540. 43.24 s gammaloop-nextest-core> at <unknown source file>:<unknown line>
  541. 43.24 s gammaloop-nextest-core> 4: std[bcb96dfbba0ab899]::panicking::panic_handler::{closure#0}<unknown>
  542. 43.24 s gammaloop-nextest-core> at <unknown source file>:<unknown line>
  543. 43.24 s gammaloop-nextest-core> 5: std[bcb96dfbba0ab899]::sys::backtrace::__rust_end_short_backtrace::<std[bcb96dfbba0ab899]::panicking::panic_handler::{closure#0}, !><unknown>
  544. 43.24 s gammaloop-nextest-core> at <unknown source file>:<unknown line>
  545. 43.24 s gammaloop-nextest-core> 6: __rustc[6c289b9f9c454d21]::rust_begin_unwind<unknown>
  546. 43.24 s gammaloop-nextest-core> at <unknown source file>:<unknown line>
  547. 43.24 s gammaloop-nextest-core> 7: core[940e698046960fd5]::panicking::panic_fmt<unknown>
  548. 43.24 s gammaloop-nextest-core> at <unknown source file>:<unknown line>
  549. 43.24 s gammaloop-nextest-core> 8: insta[307a548ac79ef4d9]::runtime::assert_snapshot<unknown>
  550. 43.24 s gammaloop-nextest-core> at <unknown source file>:<unknown line>
  551. 43.24 s gammaloop-nextest-core> 9: gammalooprs[5490727360442cce]::graph::parse::tests::parse_lmbsetting_crossection<unknown>
  552. 43.24 s gammaloop-nextest-core> at <unknown source file>:<unknown line>
  553. 43.24 s gammaloop-nextest-core> 10: <gammalooprs[5490727360442cce]::graph::parse::tests::parse_lmbsetting_crossection::{closure#0} as core[940e698046960fd5]::ops::function::FnOnce<()>>::call_once<unknown>
  554. 43.24 s gammaloop-nextest-core> at <unknown source file>:<unknown line>
  555. 43.24 s gammaloop-nextest-core> 11: test[75d6903177b1d7e9]::__rust_begin_short_backtrace::<core[940e698046960fd5]::result::Result<(), alloc[2ea6bcb46fca0c42]::string::String>, fn() -> core[940e698046960fd5]::result::Result<(), alloc[2ea6bcb46fca0c42]::string::String>><unknown>
  556. 43.24 s gammaloop-nextest-core> at <unknown source file>:<unknown line>
  557. 43.24 s gammaloop-nextest-core> 12: test[75d6903177b1d7e9]::run_test::{closure#0}<unknown>
  558. 43.24 s gammaloop-nextest-core> at <unknown source file>:<unknown line>
  559. 43.24 s gammaloop-nextest-core> 13: std[bcb96dfbba0ab899]::sys::backtrace::__rust_begin_short_backtrace::<test[75d6903177b1d7e9]::run_test::{closure#1}, ()><unknown>
  560. 43.24 s gammaloop-nextest-core> at <unknown source file>:<unknown line>
  561. 43.24 s gammaloop-nextest-core> 14: <std[bcb96dfbba0ab899]::thread::lifecycle::spawn_unchecked<test[75d6903177b1d7e9]::run_test::{closure#1}, ()>::{closure#1} as core[940e698046960fd5]::ops::function::FnOnce<()>>::call_once::{shim:vtable#0}<unknown>
  562. 43.24 s gammaloop-nextest-core> at <unknown source file>:<unknown line>
  563. 43.24 s gammaloop-nextest-core> 15: <std[bcb96dfbba0ab899]::sys::thread::unix::Thread>::new::thread_start<unknown>
  564. 43.24 s gammaloop-nextest-core> at <unknown source file>:<unknown line>
  565. 43.24 s gammaloop-nextest-core> 16: start_thread<unknown>
  566. 43.24 s gammaloop-nextest-core> at <unknown source file>:<unknown line>
  567. 43.24 s gammaloop-nextest-core> 17: __clone3<unknown>
  568. 43.24 s gammaloop-nextest-core> at <unknown source file>:<unknown line>
  569. 43.24 s gammaloop-nextest-core>
  570. 43.24 s gammaloop-nextest-core> Run with COLORBT_SHOW_HIDDEN=1 environment variable to disable frame filtering.
  571. 43.24 s gammaloop-nextest-core> Run with RUST_BACKTRACE=full to include source snippets.
  572. 43.24 s gammaloop-nextest-core>
  573. 43.24 s gammaloop-nextest-core> 2. gammalooprs::uv::export::tests::computed_node_full_numerator_is_a_spenso_aware_typst_fragment
  574. 43.24 s gammaloop-nextest-core> failure: test failure with exit code 101
  575. 43.24 s gammaloop-nextest-core> system-out
  576. 43.24 s gammaloop-nextest-core> running 1 test
  577. 43.24 s gammaloop-nextest-core> test uv::export::tests::computed_node_full_numerator_is_a_spenso_aware_typst_fragment ... FAILED
  578. 43.24 s gammaloop-nextest-core>
  579. 43.24 s gammaloop-nextest-core> failures:
  580. 43.24 s gammaloop-nextest-core>
  581. 43.24 s gammaloop-nextest-core> failures:
  582. 43.24 s gammaloop-nextest-core> uv::export::tests::computed_node_full_numerator_is_a_spenso_aware_typst_fragment
  583. 43.24 s gammaloop-nextest-core>
  584. 43.24 s gammaloop-nextest-core> test result: FAILED. 0 passed; 1 failed; 0 ignored; 0 measured; 508 filtered out; finished in 0.87s
  585. 43.24 s gammaloop-nextest-core> system-err
  586. 43.24 s gammaloop-nextest-core> The application panicked (crashed).
  587. 43.24 s gammaloop-nextest-core> Message: assertion failed: exported.dot.contains(r#"full_num = "op(\"Tr\")(1)";"#)
  588. 43.24 s gammaloop-nextest-core> Location: crates/gammalooprs/src/uv/export.rs:483
  589. 43.24 s gammaloop-nextest-core>
  590. 43.24 s gammaloop-nextest-core> ━━━━━━━━━━━━━━━━━━━━━━━━━━━━━━━━━━ BACKTRACE ━━━━━━━━━━━━━━━━━━━━━━━━━━━━━━━━━━━
  591. 43.24 s gammaloop-nextest-core> 1: <color_eyre[b0c9e66060e883b2]::config::PanicHook>::panic_report<unknown>
  592. 43.24 s gammaloop-nextest-core> at <unknown source file>:<unknown line>
  593. 43.24 s gammaloop-nextest-core> 2: <color_eyre[b0c9e66060e883b2]::config::PanicHook>::into_panic_hook::{closure#0}<unknown>
  594. 43.24 s gammaloop-nextest-core> at <unknown source file>:<unknown line>
  595. 43.24 s gammaloop-nextest-core> 3: std[bcb96dfbba0ab899]::panicking::panic_with_hook<unknown>
  596. 43.24 s gammaloop-nextest-core> at <unknown source file>:<unknown line>
  597. 43.24 s gammaloop-nextest-core> 4: std[bcb96dfbba0ab899]::panicking::panic_handler::{closure#0}<unknown>
  598. 43.24 s gammaloop-nextest-core> at <unknown source file>:<unknown line>
  599. 43.24 s gammaloop-nextest-core> 5: std[bcb96dfbba0ab899]::sys::backtrace::__rust_end_short_backtrace::<std[bcb96dfbba0ab899]::panicking::panic_handler::{closure#0}, !><unknown>
  600. 43.24 s gammaloop-nextest-core> at <unknown source file>:<unknown line>
  601. 43.24 s gammaloop-nextest-core> 6: __rustc[6c289b9f9c454d21]::rust_begin_unwind<unknown>
  602. 43.24 s gammaloop-nextest-core> at <unknown source file>:<unknown line>
  603. 43.24 s gammaloop-nextest-core> 7: core[940e698046960fd5]::panicking::panic_fmt<unknown>
  604. 43.24 s gammaloop-nextest-core> at <unknown source file>:<unknown line>
  605. 43.24 s gammaloop-nextest-core> 8: core[940e698046960fd5]::panicking::panic<unknown>
  606. 43.24 s gammaloop-nextest-core> at <unknown source file>:<unknown line>
  607. 43.24 s gammaloop-nextest-core> 9: gammalooprs[5490727360442cce]::uv::export::tests::computed_node_full_numerator_is_a_spenso_aware_typst_fragment<unknown>
  608. 43.24 s gammaloop-nextest-core> at <unknown source file>:<unknown line>
  609. 43.24 s gammaloop-nextest-core> 10: <gammalooprs[5490727360442cce]::uv::export::tests::computed_node_full_numerator_is_a_spenso_aware_typst_fragment::{closure#0} as core[940e698046960fd5]::ops::function::FnOnce<()>>::call_once<unknown>
  610. 43.24 s gammaloop-nextest-core> at <unknown source file>:<unknown line>
  611. 43.24 s gammaloop-nextest-core> 11: test[75d6903177b1d7e9]::__rust_begin_short_backtrace::<core[940e698046960fd5]::result::Result<(), alloc[2ea6bcb46fca0c42]::string::String>, fn() -> core[940e698046960fd5]::result::Result<(), alloc[2ea6bcb46fca0c42]::string::String>><unknown>
  612. 43.24 s gammaloop-nextest-core> at <unknown source file>:<unknown line>
  613. 43.24 s gammaloop-nextest-core> 12: test[75d6903177b1d7e9]::run_test::{closure#0}<unknown>
  614. 43.24 s gammaloop-nextest-core> at <unknown source file>:<unknown line>
  615. 43.24 s gammaloop-nextest-core> 13: std[bcb96dfbba0ab899]::sys::backtrace::__rust_begin_short_backtrace::<test[75d6903177b1d7e9]::run_test::{closure#1}, ()><unknown>
  616. 43.24 s gammaloop-nextest-core> at <unknown source file>:<unknown line>
  617. 43.24 s gammaloop-nextest-core> 14: <std[bcb96dfbba0ab899]::thread::lifecycle::spawn_unchecked<test[75d6903177b1d7e9]::run_test::{closure#1}, ()>::{closure#1} as core[940e698046960fd5]::ops::function::FnOnce<()>>::call_once::{shim:vtable#0}<unknown>
  618. 43.24 s gammaloop-nextest-core> at <unknown source file>:<unknown line>
  619. 43.24 s gammaloop-nextest-core> 15: <std[bcb96dfbba0ab899]::sys::thread::unix::Thread>::new::thread_start<unknown>
  620. 43.24 s gammaloop-nextest-core> at <unknown source file>:<unknown line>
  621. 43.24 s gammaloop-nextest-core> 16: start_thread<unknown>
  622. 43.24 s gammaloop-nextest-core> at <unknown source file>:<unknown line>
  623. 43.24 s gammaloop-nextest-core> 17: __clone3<unknown>
  624. 43.24 s gammaloop-nextest-core> at <unknown source file>:<unknown line>
  625. 43.24 s gammaloop-nextest-core>
  626. 43.24 s gammaloop-nextest-core> Run with COLORBT_SHOW_HIDDEN=1 environment variable to disable frame filtering.
  627. 43.24 s gammaloop-nextest-core> Run with RUST_BACKTRACE=full to include source snippets.
  628. 43.24 s gammaloop-nextest-core> =========================================
  629. 43.31 s [0 built (1 failed), 0.0error: Cannot build '/nix/store/07lma8g6p1n7jxf8azmxf90ca6pqjydj-gammaloop-nextest-core.drv'.
  630. 43.31 s Reason: builder failed with exit code 100.
  631. 43.31 s Output paths:
  632. 43.31 s /nix/store/cb0qr129ypswd8fgpp9k932nrjfvk3s0-gammaloop-nextest-core
  633. 43.31 s Last 612 log lines:
  634. 43.31 s > Extracting 3 binaries (including 1 non-test binary), 1 build script output directory, and 2 linked paths to /build/nextest-archive-OVo6qM
  635. 43.31 s > Extracted 18 files to /build/nextest-archive-OVo6qM in 0.56s
  636. 43.31 s > ------------
  637. 43.31 s > Nextest run ID 8c0b1aa5-f25b-4263-ad40-1545c533ffec with nextest profile: ci_gammaloop
  638. 43.31 s > Starting 339 tests across 2 binaries
  639. 43.31 s > FAIL [ 0.049s] (248/339) gammaloop-api repl::tests::completion_shows_type_hint_for_non_boolean_settings_leaf
  640. 43.31 s > stdout ---
  641. 43.31 s >
  642. 43.31 s > running 1 test
  643. 43.31 s > test repl::tests::completion_shows_type_hint_for_non_boolean_settings_leaf ... FAILED
  644. 43.31 s >
  645. 43.31 s > failures:
  646. 43.31 s >
  647. 43.31 s > failures:
  648. 43.31 s > repl::tests::completion_shows_type_hint_for_non_boolean_settings_leaf
  649. 43.31 s >
  650. 43.31 s > test result: FAILED. 0 passed; 1 failed; 0 ignored; 0 measured; 338 filtered out; finished in 0.02s
  651. 43.31 s >
  652. 43.31 s > stderr ---
  653. 43.31 s >
  654. 43.31 s > thread 'repl::tests::completion_shows_type_hint_for_non_boolean_settings_leaf' (777) panicked at crates/gammaloop-api/src/repl.rs:5778:9:
  655. 43.31 s > [Suggestion { value: "", description: Some("Number of samples in the first Monte Carlo iteration."), style: None, extra: None, span: Span { start: 42, end: 42 }, append_whitespace: false }]
  656. 43.31 s > stack backtrace:
  657. 43.31 s > 0: __rustc::rust_begin_unwind
  658. 43.31 s > 1: core::panicking::panic_fmt
  659. 43.31 s > 2: gammaloop_api::repl::tests::completion_shows_type_hint_for_non_boolean_settings_leaf
  660. 43.31 s > 3: <gammaloop_api::repl::tests::completion_shows_type_hint_for_non_boolean_settings_leaf::{closure#0} as core::ops::function::FnOnce<()>>::call_once
  661. 43.31 s > note: Some details are omitted, run with `RUST_BACKTRACE=full` for a verbose backtrace.
  662. 43.31 s >
  663. 43.31 s > FAIL [ 0.029s] (275/339) gammaloop-api templates::tests::extract_templates_uses_canonical_package_layout
  664. 43.31 s > stdout ---
  665. 43.31 s >
  666. 43.31 s > running 1 test
  667. 43.31 s > test templates::tests::extract_templates_uses_canonical_package_layout ... FAILED
  668. 43.31 s >
  669. 43.31 s > failures:
  670. 43.31 s >
  671. 43.31 s > failures:
  672. 43.31 s > templates::tests::extract_templates_uses_canonical_package_layout
  673. 43.31 s >
  674. 43.31 s > test result: FAILED. 0 passed; 1 failed; 0 ignored; 0 measured; 338 filtered out; finished in 0.02s
  675. 43.31 s >
  676. 43.31 s > stderr ---
  677. 43.31 s >
  678. 43.31 s > thread 'templates::tests::extract_templates_uses_canonical_package_layout' (876) panicked at crates/gammaloop-api/src/templates.rs:99:9:
  679. 43.31 s > assertion failed: figure.contains("amplitude-mode")
  680. 43.31 s > stack backtrace:
  681. 43.31 s > 0: __rustc::rust_begin_unwind
  682. 43.31 s > 1: core::panicking::panic_fmt
  683. 43.31 s > 2: core::panicking::panic
  684. 43.31 s > 3: gammaloop_api::templates::tests::extract_templates_uses_canonical_package_layout
  685. 43.31 s > 4: <gammaloop_api::templates::tests::extract_templates_uses_canonical_package_layout::{closure#0} as core::ops::function::FnOnce<()>>::call_once
  686. 43.31 s > note: Some details are omitted, run with `RUST_BACKTRACE=full` for a verbose backtrace.
  687. 43.31 s >
  688. 43.31 s > ------------
  689. 43.31 s > Summary [ 1.000s] 339 tests run: 337 passed, 2 failed, 0 skipped
  690. 43.31 s > FAIL [ 0.049s] (248/339) gammaloop-api repl::tests::completion_shows_type_hint_for_non_boolean_settings_leaf
  691. 43.31 s > stdout ---
  692. 43.31 s >
  693. 43.31 s > running 1 test
  694. 43.31 s > test repl::tests::completion_shows_type_hint_for_non_boolean_settings_leaf ... FAILED
  695. 43.31 s >
  696. 43.31 s > failures:
  697. 43.31 s >
  698. 43.31 s > failures:
  699. 43.31 s > repl::tests::completion_shows_type_hint_for_non_boolean_settings_leaf
  700. 43.31 s >
  701. 43.31 s > test result: FAILED. 0 passed; 1 failed; 0 ignored; 0 measured; 338 filtered out; finished in 0.02s
  702. 43.31 s >
  703. 43.31 s > stderr ---
  704. 43.31 s >
  705. 43.31 s > thread 'repl::tests::completion_shows_type_hint_for_non_boolean_settings_leaf' (777) panicked at crates/gammaloop-api/src/repl.rs:5778:9:
  706. 43.31 s > [Suggestion { value: "", description: Some("Number of samples in the first Monte Carlo iteration."), style: None, extra: None, span: Span { start: 42, end: 42 }, append_whitespace: false }]
  707. 43.31 s > stack backtrace:
  708. 43.31 s > 0: __rustc::rust_begin_unwind
  709. 43.31 s > 1: core::panicking::panic_fmt
  710. 43.31 s > 2: gammaloop_api::repl::tests::completion_shows_type_hint_for_non_boolean_settings_leaf
  711. 43.31 s > 3: <gammaloop_api::repl::tests::completion_shows_type_hint_for_non_boolean_settings_leaf::{closure#0} as core::ops::function::FnOnce<()>>::call_once
  712. 43.31 s > note: Some details are omitted, run with `RUST_BACKTRACE=full` for a verbose backtrace.
  713. 43.31 s >
  714. 43.31 s > FAIL [ 0.029s] (275/339) gammaloop-api templates::tests::extract_templates_uses_canonical_package_layout
  715. 43.31 s > stdout ---
  716. 43.31 s >
  717. 43.31 s > running 1 test
  718. 43.31 s > test templates::tests::extract_templates_uses_canonical_package_layout ... FAILED
  719. 43.31 s >
  720. 43.31 s > failures:
  721. 43.31 s >
  722. 43.31 s > failures:
  723. 43.31 s > templates::tests::extract_templates_uses_canonical_package_layout
  724. 43.31 s >
  725. 43.31 s > test result: FAILED. 0 passed; 1 failed; 0 ignored; 0 measured; 338 filtered out; finished in 0.02s
  726. 43.31 s >
  727. 43.31 s > stderr ---
  728. 43.31 s >
  729. 43.31 s > thread 'templates::tests::extract_templates_uses_canonical_package_layout' (876) panicked at crates/gammaloop-api/src/templates.rs:99:9:
  730. 43.31 s > assertion failed: figure.contains("amplitude-mode")
  731. 43.31 s > stack backtrace:
  732. 43.31 s > 0: __rustc::rust_begin_unwind
  733. 43.31 s > 1: core::panicking::panic_fmt
  734. 43.31 s > 2: core::panicking::panic
  735. 43.31 s > 3: gammaloop_api::templates::tests::extract_templates_uses_canonical_package_layout
  736. 43.31 s > 4: <gammaloop_api::templates::tests::extract_templates_uses_canonical_package_layout::{closure#0} as core::ops::function::FnOnce<()>>::call_once
  737. 43.31 s > note: Some details are omitted, run with `RUST_BACKTRACE=full` for a verbose backtrace.
  738. 43.31 s >
  739. 43.31 s > error: test run failed
  740. 43.31 s >
  741. 43.31 s > ========== nextest test summary ==========
  742. 43.31 s > report: target/nextest/ci_gammaloop/junit.xml
  743. 43.31 s > tests: 339, failures: 2, errors: 0
  744. 43.31 s >
  745. 43.31 s > 1. gammaloop-api::repl::tests::completion_shows_type_hint_for_non_boolean_settings_leaf
  746. 43.31 s > failure: test failure with exit code 101
  747. 43.31 s > thread 'repl::tests::completion_shows_type_hint_for_non_boolean_settings_leaf' (777) panicked at crates/gammaloop-api/src/repl.rs:5778:9:
  748. 43.31 s > [Suggestion { value: "", description: Some("Number of samples in the first Monte Carlo iteration."), style: None, extra: None, span: Span { start: 42, end: 42 }, append_whitespace: false }]
  749. 43.31 s > stack backtrace:
  750. 43.31 s > 0: __rustc::rust_begin_unwind
  751. 43.31 s > 1: core::panicking::panic_fmt
  752. 43.31 s > 2: gammaloop_api::repl::tests::completion_shows_type_hint_for_non_boolean_settings_leaf
  753. 43.31 s > 3: <gammaloop_api::repl::tests::completion_shows_type_hint_for_non_boolean_settings_leaf::{closure#0} as core::ops::function::FnOnce<()>>::call_once
  754. 43.31 s > note: Some details are omitted, run with `RUST_BACKTRACE=full` for a verbose backtrace.
  755. 43.31 s > system-out
  756. 43.31 s > running 1 test
  757. 43.31 s > test repl::tests::completion_shows_type_hint_for_non_boolean_settings_leaf ... FAILED
  758. 43.31 s >
  759. 43.31 s > failures:
  760. 43.31 s >
  761. 43.31 s > failures:
  762. 43.31 s > repl::tests::completion_shows_type_hint_for_non_boolean_settings_leaf
  763. 43.31 s >
  764. 43.31 s > test result: FAILED. 0 passed; 1 failed; 0 ignored; 0 measured; 338 filtered out; finished in 0.02s
  765. 43.31 s > system-err
  766. 43.31 s > thread 'repl::tests::completion_shows_type_hint_for_non_boolean_settings_leaf' (777) panicked at crates/gammaloop-api/src/repl.rs:5778:9:
  767. 43.31 s > [Suggestion { value: "", description: Some("Number of samples in the first Monte Carlo iteration."), style: None, extra: None, span: Span { start: 42, end: 42 }, append_whitespace: false }]
  768. 43.31 s > stack backtrace:
  769. 43.31 s > 0: __rustc::rust_begin_unwind
  770. 43.31 s > 1: core::panicking::panic_fmt
  771. 43.31 s > 2: gammaloop_api::repl::tests::completion_shows_type_hint_for_non_boolean_settings_leaf
  772. 43.31 s > 3: <gammaloop_api::repl::tests::completion_shows_type_hint_for_non_boolean_settings_leaf::{closure#0} as core::ops::function::FnOnce<()>>::call_once
  773. 43.31 s > note: Some details are omitted, run with `RUST_BACKTRACE=full` for a verbose backtrace.
  774. 43.31 s >
  775. 43.31 s > 2. gammaloop-api::templates::tests::extract_templates_uses_canonical_package_layout
  776. 43.31 s > failure: test failure with exit code 101
  777. 43.31 s > thread 'templates::tests::extract_templates_uses_canonical_package_layout' (876) panicked at crates/gammaloop-api/src/templates.rs:99:9:
  778. 43.31 s > assertion failed: figure.contains("amplitude-mode")
  779. 43.31 s > stack backtrace:
  780. 43.31 s > 0: __rustc::rust_begin_unwind
  781. 43.31 s > 1: core::panicking::panic_fmt
  782. 43.31 s > 2: core::panicking::panic
  783. 43.31 s > 3: gammaloop_api::templates::tests::extract_templates_uses_canonical_package_layout
  784. 43.31 s > 4: <gammaloop_api::templates::tests::extract_templates_uses_canonical_package_layout::{closure#0} as core::ops::function::FnOnce<()>>::call_once
  785. 43.31 s > note: Some details are omitted, run with `RUST_BACKTRACE=full` for a verbose backtrace.
  786. 43.31 s > system-out
  787. 43.31 s > running 1 test
  788. 43.31 s > test templates::tests::extract_templates_uses_canonical_package_layout ... FAILED
  789. 43.31 s >
  790. 43.31 s > failures:
  791. 43.31 s >
  792. 43.31 s > failures:
  793. 43.31 s > templates::tests::extract_templates_uses_canonical_package_layout
  794. 43.31 s >
  795. 43.31 s > test result: FAILED. 0 passed; 1 failed; 0 ignored; 0 measured; 338 filtered out; finished in 0.02s
  796. 43.31 s > system-err
  797. 43.31 s > thread 'templates::tests::extract_templates_uses_canonical_package_layout' (876) panicked at crates/gammaloop-api/src/templates.rs:99:9:
  798. 43.31 s > assertion failed: figure.contains("amplitude-mode")
  799. 43.31 s > stack backtrace:
  800. 43.31 s > 0: __rustc::rust_begin_unwind
  801. 43.31 s > 1: core::panicking::panic_fmt
  802. 43.31 s > 2: core::panicking::panic
  803. 43.31 s > 3: gammaloop_api::templates::tests::extract_templates_uses_canonical_package_layout
  804. 43.31 s > 4: <gammaloop_api::templates::tests::extract_templates_uses_canonical_package_layout::{closure#0} as core::ops::function::FnOnce<()>>::call_once
  805. 43.31 s > note: Some details are omitted, run with `RUST_BACKTRACE=full` for a verbose backtrace.
  806. 43.31 s > =========================================
  807. 43.31 s > Extracting 1 binary and 1 linked path to /build/nextest-archive-ZtiFdd
  808. 43.31 s > Extracted 7 files to /build/nextest-archive-ZtiFdd in 0.10s
  809. 43.31 s > ------------
  810. 43.31 s > Nextest run ID 592ce6b0-6815-408d-a38e-b572d07df22d with nextest profile: ci_gammaloop
  811. 43.31 s > Starting 19 tests across 1 binary
  812. 43.31 s > ------------
  813. 43.31 s > Summary [ 0.033s] 19 tests run: 19 passed, 0 skipped
  814. 43.31 s >
  815. 43.31 s > ========== nextest test summary ==========
  816. 43.31 s > report: target/nextest/ci_gammaloop/junit.xml
  817. 43.31 s > tests: 19, failures: 0, errors: 0
  818. 43.31 s > No failing testcases found.
  819. 43.31 s > =========================================
  820. 43.31 s > Extracting 1 binary to /build/nextest-archive-dNTt94
  821. 43.31 s > Extracted 4 files to /build/nextest-archive-dNTt94 in 0.06s
  822. 43.31 s > ------------
  823. 43.31 s > Nextest run ID 1c65cbae-6aa9-45c1-8059-71a920916a6e with nextest profile: ci_gammaloop
  824. 43.31 s > Starting 0 tests across 1 binary
  825. 43.31 s > ------------
  826. 43.31 s > Summary [ 0.005s] 0 tests run: 0 passed, 0 skipped
  827. 43.31 s >
  828. 43.31 s > ========== nextest test summary ==========
  829. 43.31 s > report: target/nextest/ci_gammaloop/junit.xml
  830. 43.31 s > tests: 0, failures: 0, errors: 0
  831. 43.31 s > No failing testcases found.
  832. 43.31 s > =========================================
  833. 43.31 s > Extracting 4 binaries, 1 build script output directory, and 2 linked paths to /build/nextest-archive-kmQ3Jp
  834. 43.31 s > Extracted 18 files to /build/nextest-archive-kmQ3Jp in 0.59s
  835. 43.31 s > ------------
  836. 43.31 s > Nextest run ID fb959dde-2853-4425-9800-4e145098a14a with nextest profile: ci_gammaloop
  837. 43.31 s > Starting 456 tests across 4 binaries (61 tests skipped, including 60 tests via profile.ci_gammaloop.default-filter)
  838. 43.31 s > FAIL [ 0.417s] (126/456) gammalooprs graph::parse::tests::parse_lmbsetting_crossection
  839. 43.31 s > stdout ---
  840. 43.31 s >
  841. 43.31 s > running 1 test
  842. 43.31 s > ━━━━━━━━━━━━━━━━━━━━━━━━━━━━━━━ Snapshot Summary ━━━━━━━━━━━━━━━━━━━━━━━━━━━━━━━
  843. 43.31 s > Snapshot: parse_lmbsetting_crossection
  844. 43.31 s > Source: crates/gammalooprs/src/graph/parse/tests.rs:252
  845. 43.31 s > ────────────────────────────────────────────────────────────────────────────────
  846. 43.31 s > Expression: g.debug_dot()
  847. 43.31 s > ────────────────────────────────────────────────────────────────────────────────
  848. 43.31 s > -old snapshot
  849. 43.31 s > +new results
  850. 43.31 s > ────────────┬───────────────────────────────────────────────────────────────────
  851. 43.31 s > 1 │-digraph G{
  852. 43.31 s > 1 │+digraph G {
  853. 43.31 s > 2 2 │ num = "1/2";
  854. 43.31 s > 3 3 │ overall_factor = "2*x";
  855. 43.31 s > 4 4 │ overall_factor_evaluated = "2*x";
  856. 43.31 s > 5 5 │ projector = "spenso::t";
  857. 43.31 s > ────────────┴───────────────────────────────────────────────────────────────────
  858. 43.31 s > To update snapshots run `cargo insta review`
  859. 43.31 s > Stopped on the first failure. Run `cargo insta test` to run all snapshots.
  860. 43.31 s > test graph::parse::tests::parse_lmbsetting_crossection ... FAILED
  861. 43.31 s >
  862. 43.31 s > failures:
  863. 43.31 s >
  864. 43.31 s > failures:
  865. 43.31 s > graph::parse::tests::parse_lmbsetting_crossection
  866. 43.31 s >
  867. 43.31 s > test result: FAILED. 0 passed; 1 failed; 0 ignored; 0 measured; 508 filtered out; finished in 0.30s
  868. 43.31 s >
  869. 43.31 s > stderr ---
  870. 43.31 s > [20:20:08.931] @gammalooprs::graph::attribute_warnings WARNING : Unknown node attribute 'color_num' on graph 'G', node 'A'; did you mean 'num'?
  871. 43.31 s > at crates/gammalooprs/src/graph/attribute_warnings.rs:198
  872. 43.31 s > The application panicked (crashed).
  873. 43.31 s > Message: snapshot assertion for 'parse_lmbsetting_crossection' failed in line 252
  874. 43.31 s > Location: /nix/store/xdy1vvhll2bijdplvl9fcc2b9plkxhaa-vendor-cargo-deps/c19b7c6f923b580ac259164a89f2577984ad5ab09ee9d583b888f934adbbe8d0/insta-1.47.2/src/runtime.rs:719
  875. 43.31 s >
  876. 43.31 s > ━━━━━━━━━━━━━━━━━━━━━━━━━━━━━━━━━━ BACKTRACE ━━━━━━━━━━━━━━━━━━━━━━━━━━━━━━━━━━━
  877. 43.31 s > 1: <color_eyre[b0c9e66060e883b2]::config::PanicHook>::panic_report<unknown>
  878. 43.31 s > at <unknown source file>:<unknown line>
  879. 43.31 s > 2: <color_eyre[b0c9e66060e883b2]::config::PanicHook>::into_panic_hook::{closure#0}<unknown>
  880. 43.31 s > at <unknown source file>:<unknown line>
  881. 43.31 s > 3: std[bcb96dfbba0ab899]::panicking::panic_with_hook<unknown>
  882. 43.31 s > at <unknown source file>:<unknown line>
  883. 43.31 s > 4: std[bcb96dfbba0ab899]::panicking::panic_handler::{closure#0}<unknown>
  884. 43.31 s > at <unknown source file>:<unknown line>
  885. 43.31 s > 5: std[bcb96dfbba0ab899]::sys::backtrace::__rust_end_short_backtrace::<std[bcb96dfbba0ab899]::panicking::panic_handler::{closure#0}, !><unknown>
  886. 43.31 s > at <unknown source file>:<unknown line>
  887. 43.31 s > 6: __rustc[6c289b9f9c454d21]::rust_begin_unwind<unknown>
  888. 43.31 s > at <unknown source file>:<unknown line>
  889. 43.31 s > 7: core[940e698046960fd5]::panicking::panic_fmt<unknown>
  890. 43.31 s > at <unknown source file>:<unknown line>
  891. 43.31 s > 8: insta[307a548ac79ef4d9]::runtime::assert_snapshot<unknown>
  892. 43.31 s > at <unknown source file>:<unknown line>
  893. 43.31 s > 9: gammalooprs[5490727360442cce]::graph::parse::tests::parse_lmbsetting_crossection<unknown>
  894. 43.31 s > at <unknown source file>:<unknown line>
  895. 43.31 s > 10: <gammalooprs[5490727360442cce]::graph::parse::tests::parse_lmbsetting_crossection::{closure#0} as core[940e698046960fd5]::ops::function::FnOnce<()>>::call_once<unknown>
  896. 43.31 s > at <unknown source file>:<unknown line>
  897. 43.31 s > 11: test[75d6903177b1d7e9]::__rust_begin_short_backtrace::<core[940e698046960fd5]::result::Result<(), alloc[2ea6bcb46fca0c42]::string::String>, fn() -> core[940e698046960fd5]::result::Result<(), alloc[2ea6bcb46fca0c42]::string::String>><unknown>
  898. 43.31 s > at <unknown source file>:<unknown line>
  899. 43.31 s > 12: test[75d6903177b1d7e9]::run_test::{closure#0}<unknown>
  900. 43.31 s > at <unknown source file>:<unknown line>
  901. 43.31 s > 13: std[bcb96dfbba0ab899]::sys::backtrace::__rust_begin_short_backtrace::<test[75d6903177b1d7e9]::run_test::{closure#1}, ()><unknown>
  902. 43.31 s > at <unknown source file>:<unknown line>
  903. 43.31 s > 14: <std[bcb96dfbba0ab899]::thread::lifecycle::spawn_unchecked<test[75d6903177b1d7e9]::run_test::{closure#1}, ()>::{closure#1} as core[940e698046960fd5]::ops::function::FnOnce<()>>::call_once::{shim:vtable#0}<unknown>
  904. 43.31 s > at <unknown source file>:<unknown line>
  905. 43.31 s > 15: <std[bcb96dfbba0ab899]::sys::thread::unix::Thread>::new::thread_start<unknown>
  906. 43.31 s > at <unknown source file>:<unknown line>
  907. 43.31 s > 16: start_thread<unknown>
  908. 43.31 s > at <unknown source file>:<unknown line>
  909. 43.31 s > 17: __clone3<unknown>
  910. 43.31 s > at <unknown source file>:<unknown line>
  911. 43.31 s >
  912. 43.31 s > Run with COLORBT_SHOW_HIDDEN=1 environment variable to disable frame filtering.
  913. 43.31 s > Run with RUST_BACKTRACE=full to include source snippets.
  914. 43.31 s >
  915. 43.31 s > FAIL [ 0.903s] (434/456) gammalooprs uv::export::tests::computed_node_full_numerator_is_a_spenso_aware_typst_fragment
  916. 43.31 s > stdout ---
  917. 43.31 s >
  918. 43.31 s > running 1 test
  919. 43.31 s > test uv::export::tests::computed_node_full_numerator_is_a_spenso_aware_typst_fragment ... FAILED
  920. 43.31 s >
  921. 43.31 s > failures:
  922. 43.31 s >
  923. 43.31 s > failures:
  924. 43.31 s > uv::export::tests::computed_node_full_numerator_is_a_spenso_aware_typst_fragment
  925. 43.31 s >
  926. 43.31 s > test result: FAILED. 0 passed; 1 failed; 0 ignored; 0 measured; 508 filtered out; finished in 0.87s
  927. 43.31 s >
  928. 43.31 s > stderr ---
  929. 43.31 s > The application panicked (crashed).
  930. 43.31 s > Message: assertion failed: exported.dot.contains(r#"full_num = "op(\"Tr\")(1)";"#)
  931. 43.31 s > Location: crates/gammalooprs/src/uv/export.rs:483
  932. 43.31 s >
  933. 43.31 s > ━━━━━━━━━━━━━━━━━━━━━━━━━━━━━━━━━━ BACKTRACE ━━━━━━━━━━━━━━━━━━━━━━━━━━━━━━━━━━━
  934. 43.31 s > 1: <color_eyre[b0c9e66060e883b2]::config::PanicHook>::panic_report<unknown>
  935. 43.31 s > at <unknown source file>:<unknown line>
  936. 43.31 s > 2: <color_eyre[b0c9e66060e883b2]::config::PanicHook>::into_panic_hook::{closure#0}<unknown>
  937. 43.31 s > at <unknown source file>:<unknown line>
  938. 43.31 s > 3: std[bcb96dfbba0ab899]::panicking::panic_with_hook<unknown>
  939. 43.31 s > at <unknown source file>:<unknown line>
  940. 43.31 s > 4: std[bcb96dfbba0ab899]::panicking::panic_handler::{closure#0}<unknown>
  941. 43.31 s > at <unknown source file>:<unknown line>
  942. 43.31 s > 5: std[bcb96dfbba0ab899]::sys::backtrace::__rust_end_short_backtrace::<std[bcb96dfbba0ab899]::panicking::panic_handler::{closure#0}, !><unknown>
  943. 43.31 s > at <unknown source file>:<unknown line>
  944. 43.31 s > 6: __rustc[6c289b9f9c454d21]::rust_begin_unwind<unknown>
  945. 43.31 s > at <unknown source file>:<unknown line>
  946. 43.31 s > 7: core[940e698046960fd5]::panicking::panic_fmt<unknown>
  947. 43.31 s > at <unknown source file>:<unknown line>
  948. 43.31 s > 8: core[940e698046960fd5]::panicking::panic<unknown>
  949. 43.31 s > at <unknown source file>:<unknown line>
  950. 43.31 s > 9: gammalooprs[5490727360442cce]::uv::export::tests::computed_node_full_numerator_is_a_spenso_aware_typst_fragment<unknown>
  951. 43.31 s > at <unknown source file>:<unknown line>
  952. 43.31 s > 10: <gammalooprs[5490727360442cce]::uv::export::tests::computed_node_full_numerator_is_a_spenso_aware_typst_fragment::{closure#0} as core[940e698046960fd5]::ops::function::FnOnce<()>>::call_once<unknown>
  953. 43.31 s > at <unknown source file>:<unknown line>
  954. 43.31 s > 11: test[75d6903177b1d7e9]::__rust_begin_short_backtrace::<core[940e698046960fd5]::result::Result<(), alloc[2ea6bcb46fca0c42]::string::String>, fn() -> core[940e698046960fd5]::result::Result<(), alloc[2ea6bcb46fca0c42]::string::String>><unknown>
  955. 43.31 s > at <unknown source file>:<unknown line>
  956. 43.31 s > 12: test[75d6903177b1d7e9]::run_test::{closure#0}<unknown>
  957. 43.31 s > at <unknown source file>:<unknown line>
  958. 43.31 s > 13: std[bcb96dfbba0ab899]::sys::backtrace::__rust_begin_short_backtrace::<test[75d6903177b1d7e9]::run_test::{closure#1}, ()><unknown>
  959. 43.31 s > at <unknown source file>:<unknown line>
  960. 43.31 s > 14: <std[bcb96dfbba0ab899]::thread::lifecycle::spawn_unchecked<test[75d6903177b1d7e9]::run_test::{closure#1}, ()>::{closure#1} as core[940e698046960fd5]::ops::function::FnOnce<()>>::call_once::{shim:vtable#0}<unknown>
  961. 43.31 s > at <unknown source file>:<unknown line>
  962. 43.31 s > 15: <std[bcb96dfbba0ab899]::sys::thread::unix::Thread>::new::thread_start<unknown>
  963. 43.31 s > at <unknown source file>:<unknown line>
  964. 43.31 s > 16: start_thread<unknown>
  965. 43.31 s > at <unknown source file>:<unknown line>
  966. 43.31 s > 17: __clone3<unknown>
  967. 43.31 s > at <unknown source file>:<unknown line>
  968. 43.31 s >
  969. 43.31 s > Run with COLORBT_SHOW_HIDDEN=1 environment variable to disable frame filtering.
  970. 43.31 s > Run with RUST_BACKTRACE=full to include source snippets.
  971. 43.31 s >
  972. 43.31 s > ------------
  973. 43.31 s > Summary [ 14.778s] 456 tests run: 454 passed, 2 failed, 61 skipped
  974. 43.31 s > FAIL [ 0.417s] (126/456) gammalooprs graph::parse::tests::parse_lmbsetting_crossection
  975. 43.31 s > stdout ---
  976. 43.31 s >
  977. 43.31 s > running 1 test
  978. 43.31 s > ━━━━━━━━━━━━━━━━━━━━━━━━━━━━━━━ Snapshot Summary ━━━━━━━━━━━━━━━━━━━━━━━━━━━━━━━
  979. 43.31 s > Snapshot: parse_lmbsetting_crossection
  980. 43.31 s > Source: crates/gammalooprs/src/graph/parse/tests.rs:252
  981. 43.31 s > ────────────────────────────────────────────────────────────────────────────────
  982. 43.31 s > Expression: g.debug_dot()
  983. 43.31 s > ────────────────────────────────────────────────────────────────────────────────
  984. 43.31 s > -old snapshot
  985. 43.31 s > +new results
  986. 43.31 s > ────────────┬───────────────────────────────────────────────────────────────────
  987. 43.31 s > 1 │-digraph G{
  988. 43.31 s > 1 │+digraph G {
  989. 43.31 s > 2 2 │ num = "1/2";
  990. 43.31 s > 3 3 │ overall_factor = "2*x";
  991. 43.31 s > 4 4 │ overall_factor_evaluated = "2*x";
  992. 43.31 s > 5 5 │ projector = "spenso::t";
  993. 43.31 s > ────────────┴───────────────────────────────────────────────────────────────────
  994. 43.31 s > To update snapshots run `cargo insta review`
  995. 43.31 s > Stopped on the first failure. Run `cargo insta test` to run all snapshots.
  996. 43.31 s > test graph::parse::tests::parse_lmbsetting_crossection ... FAILED
  997. 43.31 s >
  998. 43.31 s > failures:
  999. 43.31 s >
  1000. 43.31 s > failures:
  1001. 43.31 s > graph::parse::tests::parse_lmbsetting_crossection
  1002. 43.31 s >
  1003. 43.31 s > test result: FAILED. 0 passed; 1 failed; 0 ignored; 0 measured; 508 filtered out; finished in 0.30s
  1004. 43.31 s >
  1005. 43.31 s > stderr ---
  1006. 43.31 s > [20:20:08.931] @gammalooprs::graph::attribute_warnings WARNING : Unknown node attribute 'color_num' on graph 'G', node 'A'; did you mean 'num'?
  1007. 43.31 s > at crates/gammalooprs/src/graph/attribute_warnings.rs:198
  1008. 43.31 s > The application panicked (crashed).
  1009. 43.31 s > Message: snapshot assertion for 'parse_lmbsetting_crossection' failed in line 252
  1010. 43.31 s > Location: /nix/store/xdy1vvhll2bijdplvl9fcc2b9plkxhaa-vendor-cargo-deps/c19b7c6f923b580ac259164a89f2577984ad5ab09ee9d583b888f934adbbe8d0/insta-1.47.2/src/runtime.rs:719
  1011. 43.31 s >
  1012. 43.31 s > ━━━━━━━━━━━━━━━━━━━━━━━━━━━━━━━━━━ BACKTRACE ━━━━━━━━━━━━━━━━━━━━━━━━━━━━━━━━━━━
  1013. 43.31 s > 1: <color_eyre[b0c9e66060e883b2]::config::PanicHook>::panic_report<unknown>
  1014. 43.31 s > at <unknown source file>:<unknown line>
  1015. 43.31 s > 2: <color_eyre[b0c9e66060e883b2]::config::PanicHook>::into_panic_hook::{closure#0}<unknown>
  1016. 43.31 s > at <unknown source file>:<unknown line>
  1017. 43.31 s > 3: std[bcb96dfbba0ab899]::panicking::panic_with_hook<unknown>
  1018. 43.31 s > at <unknown source file>:<unknown line>
  1019. 43.31 s > 4: std[bcb96dfbba0ab899]::panicking::panic_handler::{closure#0}<unknown>
  1020. 43.31 s > at <unknown source file>:<unknown line>
  1021. 43.31 s > 5: std[bcb96dfbba0ab899]::sys::backtrace::__rust_end_short_backtrace::<std[bcb96dfbba0ab899]::panicking::panic_handler::{closure#0}, !><unknown>
  1022. 43.31 s > at <unknown source file>:<unknown line>
  1023. 43.31 s > 6: __rustc[6c289b9f9c454d21]::rust_begin_unwind<unknown>
  1024. 43.31 s > at <unknown source file>:<unknown line>
  1025. 43.31 s > 7: core[940e698046960fd5]::panicking::panic_fmt<unknown>
  1026. 43.31 s > at <unknown source file>:<unknown line>
  1027. 43.31 s > 8: insta[307a548ac79ef4d9]::runtime::assert_snapshot<unknown>
  1028. 43.31 s > at <unknown source file>:<unknown line>
  1029. 43.31 s > 9: gammalooprs[5490727360442cce]::graph::parse::tests::parse_lmbsetting_crossection<unknown>
  1030. 43.31 s > at <unknown source file>:<unknown line>
  1031. 43.31 s > 10: <gammalooprs[5490727360442cce]::graph::parse::tests::parse_lmbsetting_crossection::{closure#0} as core[940e698046960fd5]::ops::function::FnOnce<()>>::call_once<unknown>
  1032. 43.31 s > at <unknown source file>:<unknown line>
  1033. 43.31 s > 11: test[75d6903177b1d7e9]::__rust_begin_short_backtrace::<core[940e698046960fd5]::result::Result<(), alloc[2ea6bcb46fca0c42]::string::String>, fn() -> core[940e698046960fd5]::result::Result<(), alloc[2ea6bcb46fca0c42]::string::String>><unknown>
  1034. 43.31 s > at <unknown source file>:<unknown line>
  1035. 43.31 s > 12: test[75d6903177b1d7e9]::run_test::{closure#0}<unknown>
  1036. 43.31 s > at <unknown source file>:<unknown line>
  1037. 43.31 s > 13: std[bcb96dfbba0ab899]::sys::backtrace::__rust_begin_short_backtrace::<test[75d6903177b1d7e9]::run_test::{closure#1}, ()><unknown>
  1038. 43.31 s > at <unknown source file>:<unknown line>
  1039. 43.31 s > 14: <std[bcb96dfbba0ab899]::thread::lifecycle::spawn_unchecked<test[75d6903177b1d7e9]::run_test::{closure#1}, ()>::{closure#1} as core[940e698046960fd5]::ops::function::FnOnce<()>>::call_once::{shim:vtable#0}<unknown>
  1040. 43.31 s > at <unknown source file>:<unknown line>
  1041. 43.31 s > 15: <std[bcb96dfbba0ab899]::sys::thread::unix::Thread>::new::thread_start<unknown>
  1042. 43.31 s > at <unknown source file>:<unknown line>
  1043. 43.31 s > 16: start_thread<unknown>
  1044. 43.31 s > at <unknown source file>:<unknown line>
  1045. 43.31 s > 17: __clone3<unknown>
  1046. 43.31 s > at <unknown source file>:<unknown line>
  1047. 43.31 s >
  1048. 43.31 s > Run with COLORBT_SHOW_HIDDEN=1 environment variable to disable frame filtering.
  1049. 43.31 s > Run with RUST_BACKTRACE=full to include source snippets.
  1050. 43.31 s >
  1051. 43.31 s > FAIL [ 0.903s] (434/456) gammalooprs uv::export::tests::computed_node_full_numerator_is_a_spenso_aware_typst_fragment
  1052. 43.31 s > stdout ---
  1053. 43.31 s >
  1054. 43.31 s > running 1 test
  1055. 43.31 s > test uv::export::tests::computed_node_full_numerator_is_a_spenso_aware_typst_fragment ... FAILED
  1056. 43.31 s >
  1057. 43.31 s > failures:
  1058. 43.31 s >
  1059. 43.31 s > failures:
  1060. 43.31 s > uv::export::tests::computed_node_full_numerator_is_a_spenso_aware_typst_fragment
  1061. 43.31 s >
  1062. 43.31 s > test result: FAILED. 0 passed; 1 failed; 0 ignored; 0 measured; 508 filtered out; finished in 0.87s
  1063. 43.31 s >
  1064. 43.31 s > stderr ---
  1065. 43.31 s > The application panicked (crashed).
  1066. 43.31 s > Message: assertion failed: exported.dot.contains(r#"full_num = "op(\"Tr\")(1)";"#)
  1067. 43.31 s > Location: crates/gammalooprs/src/uv/export.rs:483
  1068. 43.31 s >
  1069. 43.31 s > ━━━━━━━━━━━━━━━━━━━━━━━━━━━━━━━━━━ BACKTRACE ━━━━━━━━━━━━━━━━━━━━━━━━━━━━━━━━━━━
  1070. 43.31 s > 1: <color_eyre[b0c9e66060e883b2]::config::PanicHook>::panic_report<unknown>
  1071. 43.31 s > at <unknown source file>:<unknown line>
  1072. 43.31 s > 2: <color_eyre[b0c9e66060e883b2]::config::PanicHook>::into_panic_hook::{closure#0}<unknown>
  1073. 43.31 s > at <unknown source file>:<unknown line>
  1074. 43.31 s > 3: std[bcb96dfbba0ab899]::panicking::panic_with_hook<unknown>
  1075. 43.31 s > at <unknown source file>:<unknown line>
  1076. 43.31 s > 4: std[bcb96dfbba0ab899]::panicking::panic_handler::{closure#0}<unknown>
  1077. 43.31 s > at <unknown source file>:<unknown line>
  1078. 43.31 s > 5: std[bcb96dfbba0ab899]::sys::backtrace::__rust_end_short_backtrace::<std[bcb96dfbba0ab899]::panicking::panic_handler::{closure#0}, !><unknown>
  1079. 43.31 s > at <unknown source file>:<unknown line>
  1080. 43.31 s > 6: __rustc[6c289b9f9c454d21]::rust_begin_unwind<unknown>
  1081. 43.31 s > at <unknown source file>:<unknown line>
  1082. 43.31 s > 7: core[940e698046960fd5]::panicking::panic_fmt<unknown>
  1083. 43.31 s > at <unknown source file>:<unknown line>
  1084. 43.31 s > 8: core[940e698046960fd5]::panicking::panic<unknown>
  1085. 43.31 s > at <unknown source file>:<unknown line>
  1086. 43.31 s > 9: gammalooprs[5490727360442cce]::uv::export::tests::computed_node_full_numerator_is_a_spenso_aware_typst_fragment<unknown>
  1087. 43.31 s > at <unknown source file>:<unknown line>
  1088. 43.31 s > 10: <gammalooprs[5490727360442cce]::uv::export::tests::computed_node_full_numerator_is_a_spenso_aware_typst_fragment::{closure#0} as core[940e698046960fd5]::ops::function::FnOnce<()>>::call_once<unknown>
  1089. 43.31 s > at <unknown source file>:<unknown line>
  1090. 43.31 s > 11: test[75d6903177b1d7e9]::__rust_begin_short_backtrace::<core[940e698046960fd5]::result::Result<(), alloc[2ea6bcb46fca0c42]::string::String>, fn() -> core[940e698046960fd5]::result::Result<(), alloc[2ea6bcb46fca0c42]::string::String>><unknown>
  1091. 43.31 s > at <unknown source file>:<unknown line>
  1092. 43.31 s > 12: test[75d6903177b1d7e9]::run_test::{closure#0}<unknown>
  1093. 43.31 s > at <unknown source file>:<unknown line>
  1094. 43.31 s > 13: std[bcb96dfbba0ab899]::sys::backtrace::__rust_begin_short_backtrace::<test[75d6903177b1d7e9]::run_test::{closure#1}, ()><unknown>
  1095. 43.31 s > at <unknown source file>:<unknown line>
  1096. 43.31 s > 14: <std[bcb96dfbba0ab899]::thread::lifecycle::spawn_unchecked<test[75d6903177b1d7e9]::run_test::{closure#1}, ()>::{closure#1} as core[940e698046960fd5]::ops::function::FnOnce<()>>::call_once::{shim:vtable#0}<unknown>
  1097. 43.31 s > at <unknown source file>:<unknown line>
  1098. 43.31 s > 15: <std[bcb96dfbba0ab899]::sys::thread::unix::Thread>::new::thread_start<unknown>
  1099. 43.31 s > at <unknown source file>:<unknown line>
  1100. 43.31 s > 16: start_thread<unknown>
  1101. 43.31 s > at <unknown source file>:<unknown line>
  1102. 43.31 s > 17: __clone3<unknown>
  1103. 43.31 s > at <unknown source file>:<unknown line>
  1104. 43.31 s >
  1105. 43.31 s > Run with COLORBT_SHOW_HIDDEN=1 environment variable to disable frame filtering.
  1106. 43.31 s > Run with RUST_BACKTRACE=full to include source snippets.
  1107. 43.31 s >
  1108. 43.31 s > error: test run failed
  1109. 43.31 s >
  1110. 43.31 s > ========== nextest test summary ==========
  1111. 43.31 s > report: target/nextest/ci_gammaloop/junit.xml
  1112. 43.31 s > tests: 456, failures: 2, errors: 0
  1113. 43.31 s >
  1114. 43.31 s > 1. gammalooprs::graph::parse::tests::parse_lmbsetting_crossection
  1115. 43.31 s > failure: test failure with exit code 101
  1116. 43.31 s > system-out
  1117. 43.31 s > running 1 test
  1118. 43.31 s > ━━━━━━━━━━━━━━━━━━━━━━━━━━━━━━━ Snapshot Summary ━━━━━━━━━━━━━━━━━━━━━━━━━━━━━━━
  1119. 43.31 s > Snapshot: parse_lmbsetting_crossection
  1120. 43.31 s > Source: crates/gammalooprs/src/graph/parse/tests.rs:252
  1121. 43.31 s > ────────────────────────────────────────────────────────────────────────────────
  1122. 43.31 s > Expression: g.debug_dot()
  1123. 43.31 s > ────────────────────────────────────────────────────────────────────────────────
  1124. 43.31 s > -old snapshot
  1125. 43.31 s > +new results
  1126. 43.31 s > ────────────┬───────────────────────────────────────────────────────────────────
  1127. 43.31 s > 1 │-digraph G{
  1128. 43.31 s > 1 │+digraph G {
  1129. 43.31 s > 2 2 │ num = "1/2";
  1130. 43.31 s > 3 3 │ overall_factor = "2*x";
  1131. 43.31 s > 4 4 │ overall_factor_evaluated = "2*x";
  1132. 43.31 s > 5 5 │ projector = "spenso::t";
  1133. 43.31 s > ────────────┴───────────────────────────────────────────────────────────────────
  1134. 43.31 s > To update snapshots run `cargo insta review`
  1135. 43.31 s > Stopped on the first failure. Run `cargo insta test` to run all snapshots.
  1136. 43.31 s > test graph::parse::tests::parse_lmbsetting_crossection ... FAILED
  1137. 43.31 s >
  1138. 43.31 s > failures:
  1139. 43.31 s >
  1140. 43.31 s > failures:
  1141. 43.31 s > graph::parse::tests::parse_lmbsetting_crossection
  1142. 43.31 s >
  1143. 43.31 s > test result: FAILED. 0 passed; 1 failed; 0 ignored; 0 measured; 508 filtered out; finished in 0.30s
  1144. 43.31 s > system-err
  1145. 43.31 s > [20:20:08.931] @gammalooprs::graph::attribute_warnings WARNING : Unknown node attribute 'color_num' on graph 'G', node 'A'; did you mean 'num'?
  1146. 43.31 s > at crates/gammalooprs/src/graph/attribute_warnings.rs:198
  1147. 43.31 s > The application panicked (crashed).
  1148. 43.31 s > Message: snapshot assertion for 'parse_lmbsetting_crossection' failed in line 252
  1149. 43.31 s > Location: /nix/store/xdy1vvhll2bijdplvl9fcc2b9plkxhaa-vendor-cargo-deps/c19b7c6f923b580ac259164a89f2577984ad5ab09ee9d583b888f934adbbe8d0/insta-1.47.2/src/runtime.rs:719
  1150. 43.31 s >
  1151. 43.31 s > ━━━━━━━━━━━━━━━━━━━━━━━━━━━━━━━━━━ BACKTRACE ━━━━━━━━━━━━━━━━━━━━━━━━━━━━━━━━━━━
  1152. 43.31 s > 1: <color_eyre[b0c9e66060e883b2]::config::PanicHook>::panic_report<unknown>
  1153. 43.31 s > at <unknown source file>:<unknown line>
  1154. 43.31 s > 2: <color_eyre[b0c9e66060e883b2]::config::PanicHook>::into_panic_hook::{closure#0}<unknown>
  1155. 43.31 s > at <unknown source file>:<unknown line>
  1156. 43.31 s > 3: std[bcb96dfbba0ab899]::panicking::panic_with_hook<unknown>
  1157. 43.31 s > at <unknown source file>:<unknown line>
  1158. 43.31 s > 4: std[bcb96dfbba0ab899]::panicking::panic_handler::{closure#0}<unknown>
  1159. 43.31 s > at <unknown source file>:<unknown line>
  1160. 43.31 s > 5: std[bcb96dfbba0ab899]::sys::backtrace::__rust_end_short_backtrace::<std[bcb96dfbba0ab899]::panicking::panic_handler::{closure#0}, !><unknown>
  1161. 43.31 s > at <unknown source file>:<unknown line>
  1162. 43.31 s > 6: __rustc[6c289b9f9c454d21]::rust_begin_unwind<unknown>
  1163. 43.31 s > at <unknown source file>:<unknown line>
  1164. 43.31 s > 7: core[940e698046960fd5]::panicking::panic_fmt<unknown>
  1165. 43.31 s > at <unknown source file>:<unknown line>
  1166. 43.31 s > 8: insta[307a548ac79ef4d9]::runtime::assert_snapshot<unknown>
  1167. 43.31 s > at <unknown source file>:<unknown line>
  1168. 43.31 s > 9: gammalooprs[5490727360442cce]::graph::parse::tests::parse_lmbsetting_crossection<unknown>
  1169. 43.31 s > at <unknown source file>:<unknown line>
  1170. 43.31 s > 10: <gammalooprs[5490727360442cce]::graph::parse::tests::parse_lmbsetting_crossection::{closure#0} as core[940e698046960fd5]::ops::function::FnOnce<()>>::call_once<unknown>
  1171. 43.31 s > at <unknown source file>:<unknown line>
  1172. 43.31 s > 11: test[75d6903177b1d7e9]::__rust_begin_short_backtrace::<core[940e698046960fd5]::result::Result<(), alloc[2ea6bcb46fca0c42]::string::String>, fn() -> core[940e698046960fd5]::result::Result<(), alloc[2ea6bcb46fca0c42]::string::String>><unknown>
  1173. 43.31 s > at <unknown source file>:<unknown line>
  1174. 43.31 s > 12: test[75d6903177b1d7e9]::run_test::{closure#0}<unknown>
  1175. 43.31 s > at <unknown source file>:<unknown line>
  1176. 43.32 s > 13: std[bcb96dfbba0ab899]::sys::backtrace::__rust_begin_short_backtrace::<test[75d6903177b1d7e9]::run_test::{closure#1}, ()><unknown>
  1177. 43.32 s > at <unknown source file>:<unknown line>
  1178. 43.32 s > 14: <std[bcb96dfbba0ab899]::thread::lifecycle::spawn_unchecked<test[75d6903177b1d7e9]::run_test::{closure#1}, ()>::{closure#1} as core[940e698046960fd5]::ops::function::FnOnce<()>>::call_once::{shim:vtable#0}<unknown>
  1179. 43.32 s > at <unknown source file>:<unknown line>
  1180. 43.32 s > 15: <std[bcb96dfbba0ab899]::sys::thread::unix::Thread>::new::thread_start<unknown>
  1181. 43.32 s > at <unknown source file>:<unknown line>
  1182. 43.32 s > 16: start_thread<unknown>
  1183. 43.32 s > at <unknown source file>:<unknown line>
  1184. 43.32 s > 17: __clone3<unknown>
  1185. 43.32 s > at <unknown source file>:<unknown line>
  1186. 43.32 s >
  1187. 43.32 s > Run with COLORBT_SHOW_HIDDEN=1 environment variable to disable frame filtering.
  1188. 43.32 s > Run with RUST_BACKTRACE=full to include source snippets.
  1189. 43.32 s >
  1190. 43.32 s > 2. gammalooprs::uv::export::tests::computed_node_full_numerator_is_a_spenso_aware_typst_fragment
  1191. 43.32 s > failure: test failure with exit code 101
  1192. 43.32 s > system-out
  1193. 43.32 s > running 1 test
  1194. 43.32 s > test uv::export::tests::computed_node_full_numerator_is_a_spenso_aware_typst_fragment ... FAILED
  1195. 43.32 s >
  1196. 43.32 s > failures:
  1197. 43.32 s >
  1198. 43.32 s > failures:
  1199. 43.32 s > uv::export::tests::computed_node_full_numerator_is_a_spenso_aware_typst_fragment
  1200. 43.32 s >
  1201. 43.32 s > test result: FAILED. 0 passed; 1 failed; 0 ignored; 0 measured; 508 filtered out; finished in 0.87s
  1202. 43.32 s > system-err
  1203. 43.32 s > The application panicked (crashed).
  1204. 43.32 s > Message: assertion failed: exported.dot.contains(r#"full_num = "op(\"Tr\")(1)";"#)
  1205. 43.32 s > Location: crates/gammalooprs/src/uv/export.rs:483
  1206. 43.32 s >
  1207. 43.32 s > ━━━━━━━━━━━━━━━━━━━━━━━━━━━━━━━━━━ BACKTRACE ━━━━━━━━━━━━━━━━━━━━━━━━━━━━━━━━━━━
  1208. 43.32 s > 1: <color_eyre[b0c9e66060e883b2]::config::PanicHook>::panic_report<unknown>
  1209. 43.32 s > at <unknown source file>:<unknown line>
  1210. 43.32 s > 2: <color_eyre[b0c9e66060e883b2]::config::PanicHook>::into_panic_hook::{closure#0}<unknown>
  1211. 43.32 s > at <unknown source file>:<unknown line>
  1212. 43.32 s > 3: std[bcb96dfbba0ab899]::panicking::panic_with_hook<unknown>
  1213. 43.32 s > at <unknown source file>:<unknown line>
  1214. 43.32 s > 4: std[bcb96dfbba0ab899]::panicking::panic_handler::{closure#0}<unknown>
  1215. 43.32 s > at <unknown source file>:<unknown line>
  1216. 43.32 s > 5: std[bcb96dfbba0ab899]::sys::backtrace::__rust_end_short_backtrace::<std[bcb96dfbba0ab899]::panicking::panic_handler::{closure#0}, !><unknown>
  1217. 43.32 s > at <unknown source file>:<unknown line>
  1218. 43.32 s > 6: __rustc[6c289b9f9c454d21]::rust_begin_unwind<unknown>
  1219. 43.32 s > at <unknown source file>:<unknown line>
  1220. 43.32 s > 7: core[940e698046960fd5]::panicking::panic_fmt<unknown>
  1221. 43.32 s > at <unknown source file>:<unknown line>
  1222. 43.32 s > 8: core[940e698046960fd5]::panicking::panic<unknown>
  1223. 43.32 s > at <unknown source file>:<unknown line>
  1224. 43.32 s > 9: gammalooprs[5490727360442cce]::uv::export::tests::computed_node_full_numerator_is_a_spenso_aware_typst_fragment<unknown>
  1225. 43.32 s > at <unknown source file>:<unknown line>
  1226. 43.32 s > 10: <gammalooprs[5490727360442cce]::uv::export::tests::computed_node_full_numerator_is_a_spenso_aware_typst_fragment::{closure#0} as core[940e698046960fd5]::ops::function::FnOnce<()>>::call_once<unknown>
  1227. 43.32 s > at <unknown source file>:<unknown line>
  1228. 43.32 s > 11: test[75d6903177b1d7e9]::__rust_begin_short_backtrace::<core[940e698046960fd5]::result::Result<(), alloc[2ea6bcb46fca0c42]::string::String>, fn() -> core[940e698046960fd5]::result::Result<(), alloc[2ea6bcb46fca0c42]::string::String>><unknown>
  1229. 43.32 s > at <unknown source file>:<unknown line>
  1230. 43.32 s > 12: test[75d6903177b1d7e9]::run_test::{closure#0}<unknown>
  1231. 43.32 s > at <unknown source file>:<unknown line>
  1232. 43.32 s > 13: std[bcb96dfbba0ab899]::sys::backtrace::__rust_begin_short_backtrace::<test[75d6903177b1d7e9]::run_test::{closure#1}, ()><unknown>
  1233. 43.32 s > at <unknown source file>:<unknown line>
  1234. 43.32 s > 14: <std[bcb96dfbba0ab899]::thread::lifecycle::spawn_unchecked<test[75d6903177b1d7e9]::run_test::{closure#1}, ()>::{closure#1} as core[940e698046960fd5]::ops::function::FnOnce<()>>::call_once::{shim:vtable#0}<unknown>
  1235. 43.32 s > at <unknown source file>:<unknown line>
  1236. 43.32 s > 15: <std[bcb96dfbba0ab899]::sys::thread::unix::Thread>::new::thread_start<unknown>
  1237. 43.32 s > at <unknown source file>:<unknown line>
  1238. 43.32 s > 16: start_thread<unknown>
  1239. 43.32 s > at <unknown source file>:<unknown line>
  1240. 43.32 s > 17: __clone3<unknown>
  1241. 43.32 s > at <unknown source file>:<unknown line>
  1242. 43.32 s >
  1243. 43.32 s > Run with COLORBT_SHOW_HIDDEN=1 environment variable to disable frame filtering.
  1244. 43.32 s > Run with RUST_BACKTRACE=full to include source snippets.
  1245. 43.32 s > =========================================
  1246. 43.32 s For full logs, run:
  1247. 43.32 s nix log /nix/store/07lma8g6p1n7jxf8azmxf90ca6pqjydj-gammaloop-nextest-core.drv
  1248. 43.51 s Run failed.