0.11 s
$ /nix/store/9ypz3flqsrl5xl495mm8h645gadjsxi1-coreutils-9.11/bin/timeout --kill-after=15s 7200s /nix/store/23zk8sgzamrbmj1fday15szf7f2279s8-nix-2.34.7/bin/nix --extra-experimental-features nix-command --extra-experimental-features flakes flake clone git+https://github.com/alphal00p/gammaloop --dest /tmp/nix-ci-worker/stable-pwd/repo/
0.33 s
Cloning into '/tmp/nix-ci-worker/stable-pwd/repo'...
2.23 s
remote: Enumerating objects: 64182, done.
2.34 s
remote: Counting objects: 0% (1/9536)
remote: Counting objects: 1% (96/9536)
remote: Counting objects: 2% (191/9536)
remote: Counting objects: 3% (287/9536)
remote: Counting objects: 4% (382/9536)
remote: Counting objects: 5% (477/9536)
remote: Counting objects: 6% (573/9536)
remote: Counting objects: 7% (668/9536)
remote: Counting objects: 8% (763/9536)
remote: Counting objects: 9% (859/9536)
remote: Counting objects: 10% (954/9536)
remote: Counting objects: 11% (1049/9536)
remote: Counting objects: 12% (1145/9536)
remote: Counting objects: 13% (1240/9536)
remote: Counting objects: 14% (1336/9536)
remote: Counting objects: 15% (1431/9536)
remote: Counting objects: 16% (1526/9536)
remote: Counting objects: 17% (1622/9536)
remote: Counting objects: 18% (1717/9536)
remote: Counting objects: 19% (1812/9536)
remote: Counting objects: 20% (1908/9536)
remote: Counting objects: 21% (2003/9536)
remote: Counting objects: 22% (2098/9536)
remote: Counting objects: 23% (2194/9536)
remote: Counting objects: 24% (2289/9536)
remote: Counting objects: 25% (2384/9536)
remote: Counting objects: 26% (2480/9536)
remote: Counting objects: 27% (2575/9536)
remote: Counting objects: 28% (2671/9536)
remote: Counting objects: 29% (2766/9536)
remote: Counting objects: 30% (2861/9536)
remote: Counting objects: 31% (2957/9536)
remote: Counting objects: 32% (3052/9536)
remote: Counting objects: 33% (3147/9536)
remote: Counting objects: 34% (3243/9536)
remote: Counting objects: 35% (3338/9536)
remote: Counting objects: 36% (3433/9536)
remote: Counting objects: 37% (3529/9536)
remote: Counting objects: 38% (3624/9536)
remote: Counting objects: 39% (3720/9536)
remote: Counting objects: 40% (3815/9536)
remote: Counting objects: 41% (3910/9536)
remote: Counting objects: 42% (4006/9536)
remote: Counting objects: 43% (4101/9536)
remote: Counting objects: 44% (4196/9536)
remote: Counting objects: 45% (4292/9536)
remote: Counting objects: 46% (4387/9536)
remote: Counting objects: 47% (4482/9536)
remote: Counting objects: 48% (4578/9536)
remote: Counting objects: 49% (4673/9536)
remote: Counting objects: 50% (4768/9536)
remote: Counting objects: 51% (4864/9536)
remote: Counting objects: 52% (4959/9536)
remote: Counting objects: 53% (5055/9536)
remote: Counting objects: 54% (5150/9536)
remote: Counting objects: 55% (5245/9536)
remote: Counting objects: 56% (5341/9536)
remote: Counting objects: 57% (5436/9536)
remote: Counting objects: 58% (5531/9536)
remote: Counting objects: 59% (5627/9536)
remote: Counting objects: 60% (5722/9536)
remote: Counting objects: 61% (5817/9536)
remote: Counting objects: 62% (5913/9536)
remote: Counting objects: 63% (6008/9536)
remote: Counting objects: 64% (6104/9536)
remote: Counting objects: 65% (6199/9536)
remote: Counting objects: 66% (6294/9536)
remote: Counting objects: 67% (6390/9536)
remote: Counting objects: 68% (6485/9536)
remote: Counting objects: 69% (6580/9536)
remote: Counting objects: 70% (6676/9536)
remote: Counting objects: 71% (6771/9536)
remote: Counting objects: 72% (6866/9536)
remote: Counting objects: 73% (6962/9536)
remote: Counting objects: 74% (7057/9536)
remote: Counting objects: 75% (7152/9536)
remote: Counting objects: 76% (7248/9536)
remote: Counting objects: 77% (7343/9536)
remote: Counting objects: 78% (7439/9536)
remote: Counting objects: 79% (7534/9536)
remote: Counting objects: 80% (7629/9536)
remote: Counting objects: 81% (7725/9536)
remote: Counting objects: 82% (7820/9536)
remote: Counting objects: 83% (7915/9536)
remote: Counting objects: 84% (8011/9536)
remote: Counting objects: 85% (8106/9536)
remote: Counting objects: 86% (8201/9536)
remote: Counting objects: 87% (8297/9536)
remote: Counting objects: 88% (8392/9536)
remote: Counting objects: 89% (8488/9536)
remote: Counting objects: 90% (8583/9536)
remote: Counting objects: 91% (8678/9536)
remote: Counting objects: 92% (8774/9536)
remote: Counting objects: 93% (8869/9536)
remote: Counting objects: 94% (8964/9536)
remote: Counting objects: 95% (9060/9536)
remote: Counting objects: 96% (9155/9536)
remote: Counting objects: 97% (9250/9536)
remote: Counting objects: 98% (9346/9536)
remote: Counting objects: 99% (9441/9536)
remote: Counting objects: 100% (9536/9536)
remote: Counting objects: 100% (9536/9536), done.
5.44 s
remote: Compressing objects: 0% (1/2324)
remote: Compressing objects: 1% (24/2324)
remote: Compressing objects: 2% (47/2324)
remote: Compressing objects: 3% (70/2324)
remote: Compressing objects: 4% (93/2324)
remote: Compressing objects: 5% (117/2324)
remote: Compressing objects: 6% (140/2324)
remote: Compressing objects: 7% (163/2324)
remote: Compressing objects: 8% (186/2324)
remote: Compressing objects: 9% (210/2324)
remote: Compressing objects: 10% (233/2324)
remote: Compressing objects: 11% (256/2324)
remote: Compressing objects: 12% (279/2324)
remote: Compressing objects: 13% (303/2324)
remote: Compressing objects: 14% (326/2324)
remote: Compressing objects: 15% (349/2324)
remote: Compressing objects: 16% (372/2324)
remote: Compressing objects: 17% (396/2324)
remote: Compressing objects: 18% (419/2324)
remote: Compressing objects: 19% (442/2324)
remote: Compressing objects: 20% (465/2324)
remote: Compressing objects: 21% (489/2324)
remote: Compressing objects: 22% (512/2324)
remote: Compressing objects: 22% (530/2324)
remote: Compressing objects: 23% (535/2324)
remote: Compressing objects: 24% (558/2324)
remote: Compressing objects: 25% (581/2324)
remote: Compressing objects: 26% (605/2324)
remote: Compressing objects: 26% (623/2324)
remote: Compressing objects: 27% (628/2324)
remote: Compressing objects: 28% (651/2324)
remote: Compressing objects: 29% (674/2324)
remote: Compressing objects: 30% (698/2324)
remote: Compressing objects: 31% (721/2324)
remote: Compressing objects: 32% (744/2324)
remote: Compressing objects: 33% (767/2324)
remote: Compressing objects: 34% (791/2324)
remote: Compressing objects: 35% (814/2324)
remote: Compressing objects: 36% (837/2324)
remote: Compressing objects: 37% (860/2324)
remote: Compressing objects: 37% (863/2324)
remote: Compressing objects: 38% (884/2324)
remote: Compressing objects: 39% (907/2324)
remote: Compressing objects: 40% (930/2324)
remote: Compressing objects: 41% (953/2324)
remote: Compressing objects: 42% (977/2324)
remote: Compressing objects: 43% (1000/2324)
remote: Compressing objects: 44% (1023/2324)
remote: Compressing objects: 45% (1046/2324)
remote: Compressing objects: 46% (1070/2324)
remote: Compressing objects: 47% (1093/2324)
remote: Compressing objects: 48% (1116/2324)
remote: Compressing objects: 49% (1139/2324)
remote: Compressing objects: 50% (1162/2324)
remote: Compressing objects: 51% (1186/2324)
remote: Compressing objects: 52% (1209/2324)
remote: Compressing objects: 53% (1232/2324)
remote: Compressing objects: 54% (1255/2324)
remote: Compressing objects: 55% (1279/2324)
remote: Compressing objects: 56% (1302/2324)
remote: Compressing objects: 57% (1325/2324)
remote: Compressing objects: 58% (1348/2324)
remote: Compressing objects: 59% (1372/2324)
remote: Compressing objects: 60% (1395/2324)
remote: Compressing objects: 61% (1418/2324)
remote: Compressing objects: 62% (1441/2324)
remote: Compressing objects: 63% (1465/2324)
remote: Compressing objects: 64% (1488/2324)
remote: Compressing objects: 65% (1511/2324)
remote: Compressing objects: 66% (1534/2324)
remote: Compressing objects: 67% (1558/2324)
remote: Compressing objects: 68% (1581/2324)
remote: Compressing objects: 69% (1604/2324)
remote: Compressing objects: 70% (1627/2324)
remote: Compressing objects: 71% (1651/2324)
remote: Compressing objects: 72% (1674/2324)
remote: Compressing objects: 73% (1697/2324)
remote: Compressing objects: 74% (1720/2324)
remote: Compressing objects: 75% (1743/2324)
remote: Compressing objects: 76% (1767/2324)
remote: Compressing objects: 77% (1790/2324)
remote: Compressing objects: 78% (1813/2324)
remote: Compressing objects: 79% (1836/2324)
remote: Compressing objects: 80% (1860/2324)
remote: Compressing objects: 81% (1883/2324)
remote: Compressing objects: 82% (1906/2324)
remote: Compressing objects: 83% (1929/2324)
remote: Compressing objects: 84% (1953/2324)
remote: Compressing objects: 85% (1976/2324)
remote: Compressing objects: 86% (1999/2324)
remote: Compressing objects: 87% (2022/2324)
remote: Compressing objects: 88% (2046/2324)
remote: Compressing objects: 89% (2069/2324)
remote: Compressing objects: 90% (2092/2324)
remote: Compressing objects: 91% (2115/2324)
remote: Compressing objects: 92% (2139/2324)
remote: Compressing objects: 93% (2162/2324)
remote: Compressing objects: 94% (2185/2324)
remote: Compressing objects: 95% (2208/2324)
remote: Compressing objects: 96% (2232/2324)
remote: Compressing objects: 97% (2255/2324)
remote: Compressing objects: 98% (2278/2324)
remote: Compressing objects: 99% (2301/2324)
remote: Compressing objects: 100% (2324/2324)
remote: Compressing objects: 100% (2324/2324), done.
8.51 s
Receiving objects: 0% (1/64182)
Receiving objects: 1% (642/64182)
Receiving objects: 2% (1284/64182)
Receiving objects: 3% (1926/64182)
Receiving objects: 4% (2568/64182)
Receiving objects: 5% (3210/64182)
Receiving objects: 6% (3851/64182)
Receiving objects: 7% (4493/64182)
Receiving objects: 8% (5135/64182), 5.81 MiB | 11.60 MiB/s
Receiving objects: 9% (5777/64182), 5.81 MiB | 11.60 MiB/s
Receiving objects: 10% (6419/64182), 5.81 MiB | 11.60 MiB/s
Receiving objects: 11% (7061/64182), 5.81 MiB | 11.60 MiB/s
Receiving objects: 12% (7702/64182), 5.81 MiB | 11.60 MiB/s
Receiving objects: 13% (8344/64182), 5.81 MiB | 11.60 MiB/s
Receiving objects: 14% (8986/64182), 5.81 MiB | 11.60 MiB/s
Receiving objects: 15% (9628/64182), 5.81 MiB | 11.60 MiB/s
Receiving objects: 16% (10270/64182), 5.81 MiB | 11.60 MiB/s
Receiving objects: 17% (10911/64182), 5.81 MiB | 11.60 MiB/s
Receiving objects: 18% (11553/64182), 5.81 MiB | 11.60 MiB/s
Receiving objects: 19% (12195/64182), 5.81 MiB | 11.60 MiB/s
Receiving objects: 20% (12837/64182), 5.81 MiB | 11.60 MiB/s
Receiving objects: 21% (13479/64182), 5.81 MiB | 11.60 MiB/s
Receiving objects: 22% (14121/64182), 5.81 MiB | 11.60 MiB/s
Receiving objects: 23% (14762/64182), 5.81 MiB | 11.60 MiB/s
Receiving objects: 24% (15404/64182), 5.81 MiB | 11.60 MiB/s
Receiving objects: 25% (16046/64182), 5.81 MiB | 11.60 MiB/s
Receiving objects: 26% (16688/64182), 5.81 MiB | 11.60 MiB/s
Receiving objects: 27% (17330/64182), 5.81 MiB | 11.60 MiB/s
Receiving objects: 28% (17971/64182), 5.81 MiB | 11.60 MiB/s
Receiving objects: 29% (18613/64182), 5.81 MiB | 11.60 MiB/s
Receiving objects: 30% (19255/64182), 5.81 MiB | 11.60 MiB/s
Receiving objects: 31% (19897/64182), 5.81 MiB | 11.60 MiB/s
Receiving objects: 32% (20539/64182), 5.81 MiB | 11.60 MiB/s
Receiving objects: 33% (21181/64182), 5.81 MiB | 11.60 MiB/s
Receiving objects: 34% (21822/64182), 5.81 MiB | 11.60 MiB/s
Receiving objects: 35% (22464/64182), 5.81 MiB | 11.60 MiB/s
Receiving objects: 36% (23106/64182), 5.81 MiB | 11.60 MiB/s
Receiving objects: 37% (23748/64182), 5.81 MiB | 11.60 MiB/s
Receiving objects: 38% (24390/64182), 5.81 MiB | 11.60 MiB/s
Receiving objects: 39% (25031/64182), 5.81 MiB | 11.60 MiB/s
Receiving objects: 40% (25673/64182), 5.81 MiB | 11.60 MiB/s
Receiving objects: 41% (26315/64182), 5.81 MiB | 11.60 MiB/s
Receiving objects: 42% (26957/64182), 5.81 MiB | 11.60 MiB/s
Receiving objects: 43% (27599/64182), 5.81 MiB | 11.60 MiB/s
Receiving objects: 44% (28241/64182), 5.81 MiB | 11.60 MiB/s
Receiving objects: 45% (28882/64182), 5.81 MiB | 11.60 MiB/s
Receiving objects: 46% (29524/64182), 5.81 MiB | 11.60 MiB/s
Receiving objects: 47% (30166/64182), 5.81 MiB | 11.60 MiB/s
Receiving objects: 48% (30808/64182), 5.81 MiB | 11.60 MiB/s
Receiving objects: 49% (31450/64182), 5.81 MiB | 11.60 MiB/s
Receiving objects: 50% (32091/64182), 5.81 MiB | 11.60 MiB/s
Receiving objects: 50% (32241/64182), 27.67 MiB | 27.66 MiB/s
Receiving objects: 51% (32733/64182), 27.67 MiB | 27.66 MiB/s
Receiving objects: 52% (33375/64182), 27.67 MiB | 27.66 MiB/s
Receiving objects: 53% (34017/64182), 27.67 MiB | 27.66 MiB/s
Receiving objects: 54% (34659/64182), 27.67 MiB | 27.66 MiB/s
Receiving objects: 55% (35301/64182), 27.67 MiB | 27.66 MiB/s
Receiving objects: 56% (35942/64182), 27.67 MiB | 27.66 MiB/s
Receiving objects: 57% (36584/64182), 27.67 MiB | 27.66 MiB/s
Receiving objects: 58% (37226/64182), 45.09 MiB | 30.06 MiB/s
Receiving objects: 59% (37868/64182), 45.09 MiB | 30.06 MiB/s
Receiving objects: 60% (38510/64182), 45.09 MiB | 30.06 MiB/s
Receiving objects: 61% (39152/64182), 45.09 MiB | 30.06 MiB/s
Receiving objects: 62% (39793/64182), 45.09 MiB | 30.06 MiB/s
Receiving objects: 63% (40435/64182), 45.09 MiB | 30.06 MiB/s
Receiving objects: 64% (41077/64182), 45.09 MiB | 30.06 MiB/s
Receiving objects: 65% (41719/64182), 45.09 MiB | 30.06 MiB/s
Receiving objects: 66% (42361/64182), 45.09 MiB | 30.06 MiB/s
Receiving objects: 67% (43002/64182), 45.09 MiB | 30.06 MiB/s
Receiving objects: 68% (43644/64182), 45.09 MiB | 30.06 MiB/s
Receiving objects: 68% (43973/64182), 45.09 MiB | 30.06 MiB/s
Receiving objects: 69% (44286/64182), 62.57 MiB | 31.28 MiB/s
Receiving objects: 70% (44928/64182), 62.57 MiB | 31.28 MiB/s
Receiving objects: 71% (45570/64182), 62.57 MiB | 31.28 MiB/s
Receiving objects: 72% (46212/64182), 62.57 MiB | 31.28 MiB/s
Receiving objects: 73% (46853/64182), 62.57 MiB | 31.28 MiB/s
Receiving objects: 74% (47495/64182), 62.57 MiB | 31.28 MiB/s
Receiving objects: 75% (48137/64182), 62.57 MiB | 31.28 MiB/s
Receiving objects: 76% (48779/64182), 62.57 MiB | 31.28 MiB/s
Receiving objects: 77% (49421/64182), 62.57 MiB | 31.28 MiB/s
Receiving objects: 78% (50062/64182), 62.57 MiB | 31.28 MiB/s
Receiving objects: 79% (50704/64182), 62.57 MiB | 31.28 MiB/s
Receiving objects: 80% (51346/64182), 62.57 MiB | 31.28 MiB/s
Receiving objects: 81% (51988/64182), 62.57 MiB | 31.28 MiB/s
Receiving objects: 82% (52630/64182), 78.34 MiB | 31.33 MiB/s
Receiving objects: 83% (53272/64182), 78.34 MiB | 31.33 MiB/s
Receiving objects: 84% (53913/64182), 78.34 MiB | 31.33 MiB/s
Receiving objects: 85% (54555/64182), 78.34 MiB | 31.33 MiB/s
Receiving objects: 86% (55197/64182), 78.34 MiB | 31.33 MiB/s
Receiving objects: 87% (55839/64182), 78.34 MiB | 31.33 MiB/s
Receiving objects: 88% (56481/64182), 78.34 MiB | 31.33 MiB/s
Receiving objects: 89% (57122/64182), 78.34 MiB | 31.33 MiB/s
Receiving objects: 90% (57764/64182), 78.34 MiB | 31.33 MiB/s
Receiving objects: 91% (58406/64182), 78.34 MiB | 31.33 MiB/s
Receiving objects: 92% (59048/64182), 78.34 MiB | 31.33 MiB/s
Receiving objects: 93% (59690/64182), 78.34 MiB | 31.33 MiB/s
Receiving objects: 94% (60332/64182), 78.34 MiB | 31.33 MiB/s
Receiving objects: 95% (60973/64182), 78.34 MiB | 31.33 MiB/s
Receiving objects: 96% (61615/64182), 78.34 MiB | 31.33 MiB/s
Receiving objects: 97% (62257/64182), 78.34 MiB | 31.33 MiB/s
Receiving objects: 98% (62899/64182), 78.34 MiB | 31.33 MiB/s
Receiving objects: 98% (63028/64182), 78.34 MiB | 31.33 MiB/s
Receiving objects: 99% (63541/64182), 95.95 MiB | 31.98 MiB/s
remote: Total 64182 (delta 7384), reused 7761 (delta 6667), pack-reused 54646 (from 3)
8.51 s
Receiving objects: 100% (64182/64182), 95.95 MiB | 31.98 MiB/s
Receiving objects: 100% (64182/64182), 97.82 MiB | 31.94 MiB/s, done.
10.32 s
Resolving deltas: 0% (0/44314)
Resolving deltas: 1% (444/44314)
Resolving deltas: 2% (887/44314)
Resolving deltas: 3% (1330/44314)
Resolving deltas: 4% (1773/44314)
Resolving deltas: 5% (2216/44314)
Resolving deltas: 6% (2659/44314)
Resolving deltas: 7% (3102/44314)
Resolving deltas: 8% (3546/44314)
Resolving deltas: 9% (3989/44314)
Resolving deltas: 10% (4433/44314)
Resolving deltas: 11% (4875/44314)
Resolving deltas: 12% (5318/44314)
Resolving deltas: 13% (5761/44314)
Resolving deltas: 14% (6204/44314)
Resolving deltas: 15% (6648/44314)
Resolving deltas: 16% (7091/44314)
Resolving deltas: 17% (7534/44314)
Resolving deltas: 18% (7977/44314)
Resolving deltas: 19% (8420/44314)
Resolving deltas: 20% (8863/44314)
Resolving deltas: 21% (9306/44314)
Resolving deltas: 22% (9750/44314)
Resolving deltas: 23% (10193/44314)
Resolving deltas: 24% (10636/44314)
Resolving deltas: 25% (11079/44314)
Resolving deltas: 26% (11522/44314)
Resolving deltas: 27% (11965/44314)
Resolving deltas: 28% (12408/44314)
Resolving deltas: 29% (12852/44314)
Resolving deltas: 30% (13295/44314)
Resolving deltas: 31% (13738/44314)
Resolving deltas: 32% (14182/44314)
Resolving deltas: 33% (14624/44314)
Resolving deltas: 34% (15067/44314)
Resolving deltas: 35% (15510/44314)
Resolving deltas: 36% (15954/44314)
Resolving deltas: 37% (16397/44314)
Resolving deltas: 38% (16840/44314)
Resolving deltas: 39% (17283/44314)
Resolving deltas: 40% (17726/44314)
Resolving deltas: 41% (18169/44314)
Resolving deltas: 42% (18612/44314)
Resolving deltas: 43% (19056/44314)
Resolving deltas: 44% (19499/44314)
Resolving deltas: 45% (19942/44314)
Resolving deltas: 46% (20385/44314)
Resolving deltas: 47% (20828/44314)
Resolving deltas: 48% (21271/44314)
Resolving deltas: 49% (21714/44314)
Resolving deltas: 50% (22157/44314)
Resolving deltas: 51% (22601/44314)
Resolving deltas: 52% (23044/44314)
Resolving deltas: 53% (23487/44314)
Resolving deltas: 54% (23930/44314)
Resolving deltas: 55% (24373/44314)
Resolving deltas: 56% (24816/44314)
Resolving deltas: 57% (25259/44314)
Resolving deltas: 58% (25704/44314)
Resolving deltas: 59% (26146/44314)
Resolving deltas: 60% (26589/44314)
Resolving deltas: 61% (27032/44314)
Resolving deltas: 62% (27475/44314)
Resolving deltas: 63% (27918/44314)
Resolving deltas: 64% (28361/44314)
Resolving deltas: 65% (28805/44314)
Resolving deltas: 66% (29248/44314)
Resolving deltas: 67% (29691/44314)
Resolving deltas: 68% (30134/44314)
Resolving deltas: 68% (30436/44314)
Resolving deltas: 69% (30577/44314)
Resolving deltas: 70% (31020/44314)
Resolving deltas: 71% (31463/44314)
Resolving deltas: 72% (31907/44314)
Resolving deltas: 73% (32350/44314)
Resolving deltas: 74% (32793/44314)
Resolving deltas: 75% (33236/44314)
Resolving deltas: 76% (33679/44314)
Resolving deltas: 77% (34122/44314)
Resolving deltas: 78% (34565/44314)
Resolving deltas: 79% (35009/44314)
Resolving deltas: 80% (35452/44314)
Resolving deltas: 81% (35897/44314)
Resolving deltas: 82% (36338/44314)
Resolving deltas: 83% (36781/44314)
Resolving deltas: 84% (37224/44314)
Resolving deltas: 85% (37667/44314)
Resolving deltas: 86% (38111/44314)
Resolving deltas: 87% (38554/44314)
Resolving deltas: 88% (38997/44314)
Resolving deltas: 89% (39440/44314)
Resolving deltas: 90% (39883/44314)
Resolving deltas: 91% (40326/44314)
Resolving deltas: 92% (40769/44314)
Resolving deltas: 93% (41213/44314)
Resolving deltas: 94% (41656/44314)
Resolving deltas: 95% (42099/44314)
Resolving deltas: 96% (42542/44314)
Resolving deltas: 97% (42985/44314)
Resolving deltas: 98% (43428/44314)
Resolving deltas: 99% (43871/44314)
Resolving deltas: 100% (44314/44314)
Resolving deltas: 100% (44314/44314), done.
10.94 s
Fetching commit 94e2eb84385825c67e2d00485755754534658cdd for push-vrpyqyylypmw ...
10.95 s
$ /nix/store/bcnisk3ydfgv26v2gw3zlky24g00yww2-git-2.54.0/bin/git fetch origin 94e2eb84385825c67e2d00485755754534658cdd
11.55 s
From https://github.com/alphal00p/gammaloop
11.55 s
* branch 94e2eb84385825c67e2d00485755754534658cdd -> FETCH_HEAD
11.62 s
$ /nix/store/9ypz3flqsrl5xl495mm8h645gadjsxi1-coreutils-9.11/bin/timeout --kill-after=15s 7200s /nix/store/bcnisk3ydfgv26v2gw3zlky24g00yww2-git-2.54.0/bin/git -c advice.detachedHead=false checkout 94e2eb84385825c67e2d00485755754534658cdd
11.97 s
HEAD is now at 94e2eb84 include documentation sources in catalog dependency build
12.00 s
$ /nix/store/9ypz3flqsrl5xl495mm8h645gadjsxi1-coreutils-9.11/bin/timeout --kill-after=15s 7200s /nix/store/23zk8sgzamrbmj1fday15szf7f2279s8-nix-2.34.7/bin/nix --extra-experimental-features nix-command --extra-experimental-features flakes --log-format internal-json run .#packages.x86_64-linux.nix-ci-check-gammaloop-nextest-core --print-build-logs
17.70 s
25.33 s
evaluating derivation 'g
copying '/nix/store/fxbc
evaluating derivation 'g
copying '/nix/store/fxbc
evaluating derivation 'g
copying '/nix/store/fxbc
evaluating derivation 'g
copying '/nix/store/fxbc
evaluating derivation 'g
copying '/nix/store/fxbc
evaluating derivation 'g
copying '/nix/store/fxbc
evaluating derivation 'g
copying '/nix/store/fxbc
evaluating derivation 'g
copying '/nix/store/fxbc
evaluating derivation 'g
copying '/nix/store/fxbc
evaluating derivation 'g
copying '/nix/store/fxbc
evaluating derivation 'g
copying '/nix/store/fxbc
evaluating derivation 'g
querying gammaloop-nexte
[0.0 KiB DL]
[0 /1 built, 0.0 KiB DL]
[1 /0 /1 built, 0.0 KiB DLgammaloop-nextest-core> Extracting 3 binaries (including 1 non-test binary), 1 build script output directory, and 2 linked paths to /build/nextest-archive-OVo6qM
25.88 s
gammaloop-nextest-core> Extracted 18 files to /build/nextest-archive-OVo6qM in 0.56s
25.92 s
gammaloop-nextest-core> ------------
25.92 s
gammaloop-nextest-core> Nextest run ID 8c0b1aa5-f25b-4263-ad40-1545c533ffec with nextest profile: ci_gammaloop
25.92 s
gammaloop-nextest-core> Starting 339 tests across 2 binaries
26.63 s
gammaloop-nextest-core> FAIL [ 0.049s] (248/339) gammaloop-api repl::tests :: completion_shows_type_hint_for_non_boolean_settings_leaf
26.63 s
gammaloop-nextest-core> stdout ---
26.63 s
gammaloop-nextest-core>
26.63 s
gammaloop-nextest-core> running 1 test
26.63 s
gammaloop-nextest-core> test repl::tests::completion_shows_type_hint_for_non_boolean_settings_leaf ... FAILED
26.63 s
gammaloop-nextest-core>
26.63 s
gammaloop-nextest-core> failures:
26.63 s
gammaloop-nextest-core>
26.63 s
gammaloop-nextest-core> failures:
26.63 s
gammaloop-nextest-core> repl::tests::completion_shows_type_hint_for_non_boolean_settings_leaf
26.63 s
gammaloop-nextest-core>
26.63 s
gammaloop-nextest-core> test result: FAILED. 0 passed; 1 failed; 0 ignored; 0 measured; 338 filtered out; finished in 0.02s
26.63 s
gammaloop-nextest-core>
26.63 s
gammaloop-nextest-core> stderr ---
26.63 s
gammaloop-nextest-core>
26.63 s
gammaloop-nextest-core> thread 'repl::tests::completion_shows_type_hint_for_non_boolean_settings_leaf' (777) panicked at crates/gammaloop-api/src/repl.rs:5778:9:
26.63 s
gammaloop-nextest-core> [Suggestion { value: "", description: Some("Number of samples in the first Monte Carlo iteration."), style: None, extra: None, span: Span { start: 42, end: 42 }, append_whitespace: false }]
26.63 s
gammaloop-nextest-core> stack backtrace:
26.63 s
gammaloop-nextest-core> 0: __rustc::rust_begin_unwind
26.63 s
gammaloop-nextest-core> 1: core::panicking::panic_fmt
26.63 s
gammaloop-nextest-core> 2: gammaloop_api::repl::tests::completion_shows_type_hint_for_non_boolean_settings_leaf
26.63 s
gammaloop-nextest-core> 3: <gammaloop_api::repl::tests::completion_shows_type_hint_for_non_boolean_settings_leaf::{closure#0} as core::ops::function::FnOnce<()>>::call_once
26.63 s
gammaloop-nextest-core> note: Some details are omitted, run with `RUST_BACKTRACE=full` for a verbose backtrace.
26.63 s
gammaloop-nextest-core>
26.72 s
gammaloop-nextest-core> FAIL [ 0.029s] (275/339) gammaloop-api templates::tests :: extract_templates_uses_canonical_package_layout
26.72 s
gammaloop-nextest-core> stdout ---
26.72 s
gammaloop-nextest-core>
26.72 s
gammaloop-nextest-core> running 1 test
26.72 s
gammaloop-nextest-core> test templates::tests::extract_templates_uses_canonical_package_layout ... FAILED
26.72 s
gammaloop-nextest-core>
26.72 s
gammaloop-nextest-core> failures:
26.72 s
gammaloop-nextest-core>
26.72 s
gammaloop-nextest-core> failures:
26.72 s
gammaloop-nextest-core> templates::tests::extract_templates_uses_canonical_package_layout
26.72 s
gammaloop-nextest-core>
26.72 s
gammaloop-nextest-core> test result: FAILED. 0 passed; 1 failed; 0 ignored; 0 measured; 338 filtered out; finished in 0.02s
26.72 s
gammaloop-nextest-core>
26.72 s
gammaloop-nextest-core> stderr ---
26.72 s
gammaloop-nextest-core>
26.72 s
gammaloop-nextest-core> thread 'templates::tests::extract_templates_uses_canonical_package_layout' (876) panicked at crates/gammaloop-api/src/templates.rs:99:9:
26.72 s
gammaloop-nextest-core> assertion failed: figure.contains("amplitude-mode")
26.72 s
gammaloop-nextest-core> stack backtrace:
26.72 s
gammaloop-nextest-core> 0: __rustc::rust_begin_unwind
26.72 s
gammaloop-nextest-core> 1: core::panicking::panic_fmt
26.72 s
gammaloop-nextest-core> 2: core::panicking::panic
26.72 s
gammaloop-nextest-core> 3: gammaloop_api::templates::tests::extract_templates_uses_canonical_package_layout
26.72 s
gammaloop-nextest-core> 4: <gammaloop_api::templates::tests::extract_templates_uses_canonical_package_layout::{closure#0} as core::ops::function::FnOnce<()>>::call_once
26.72 s
gammaloop-nextest-core> note: Some details are omitted, run with `RUST_BACKTRACE=full` for a verbose backtrace.
26.72 s
gammaloop-nextest-core>
26.92 s
gammaloop-nextest-core> ------------
26.92 s
gammaloop-nextest-core> Summary [ 1.000s] 339 tests run: 337 passed , 2 failed , 0 skipped
26.92 s
gammaloop-nextest-core> FAIL [ 0.049s] (248/339) gammaloop-api repl::tests :: completion_shows_type_hint_for_non_boolean_settings_leaf
26.92 s
gammaloop-nextest-core> stdout ---
26.92 s
gammaloop-nextest-core>
26.92 s
gammaloop-nextest-core> running 1 test
26.92 s
gammaloop-nextest-core> test repl::tests::completion_shows_type_hint_for_non_boolean_settings_leaf ... FAILED
26.92 s
gammaloop-nextest-core>
26.92 s
gammaloop-nextest-core> failures:
26.92 s
gammaloop-nextest-core>
26.92 s
gammaloop-nextest-core> failures:
26.92 s
gammaloop-nextest-core> repl::tests::completion_shows_type_hint_for_non_boolean_settings_leaf
26.92 s
gammaloop-nextest-core>
26.92 s
gammaloop-nextest-core> test result: FAILED. 0 passed; 1 failed; 0 ignored; 0 measured; 338 filtered out; finished in 0.02s
26.92 s
gammaloop-nextest-core>
26.92 s
gammaloop-nextest-core> stderr ---
26.92 s
gammaloop-nextest-core>
26.92 s
gammaloop-nextest-core> thread 'repl::tests::completion_shows_type_hint_for_non_boolean_settings_leaf' (777) panicked at crates/gammaloop-api/src/repl.rs:5778:9:
26.92 s
gammaloop-nextest-core> [Suggestion { value: "", description: Some("Number of samples in the first Monte Carlo iteration."), style: None, extra: None, span: Span { start: 42, end: 42 }, append_whitespace: false }]
26.92 s
gammaloop-nextest-core> stack backtrace:
26.92 s
gammaloop-nextest-core> 0: __rustc::rust_begin_unwind
26.92 s
gammaloop-nextest-core> 1: core::panicking::panic_fmt
26.92 s
gammaloop-nextest-core> 2: gammaloop_api::repl::tests::completion_shows_type_hint_for_non_boolean_settings_leaf
26.92 s
gammaloop-nextest-core> 3: <gammaloop_api::repl::tests::completion_shows_type_hint_for_non_boolean_settings_leaf::{closure#0} as core::ops::function::FnOnce<()>>::call_once
26.92 s
gammaloop-nextest-core> note: Some details are omitted, run with `RUST_BACKTRACE=full` for a verbose backtrace.
26.92 s
gammaloop-nextest-core>
26.92 s
gammaloop-nextest-core> FAIL [ 0.029s] (275/339) gammaloop-api templates::tests :: extract_templates_uses_canonical_package_layout
26.92 s
gammaloop-nextest-core> stdout ---
26.92 s
gammaloop-nextest-core>
26.92 s
gammaloop-nextest-core> running 1 test
26.92 s
gammaloop-nextest-core> test templates::tests::extract_templates_uses_canonical_package_layout ... FAILED
26.92 s
gammaloop-nextest-core>
26.92 s
gammaloop-nextest-core> failures:
26.92 s
gammaloop-nextest-core>
26.92 s
gammaloop-nextest-core> failures:
26.92 s
gammaloop-nextest-core> templates::tests::extract_templates_uses_canonical_package_layout
26.92 s
gammaloop-nextest-core>
26.92 s
gammaloop-nextest-core> test result: FAILED. 0 passed; 1 failed; 0 ignored; 0 measured; 338 filtered out; finished in 0.02s
26.92 s
gammaloop-nextest-core>
26.92 s
gammaloop-nextest-core> stderr ---
26.92 s
gammaloop-nextest-core>
26.92 s
gammaloop-nextest-core> thread 'templates::tests::extract_templates_uses_canonical_package_layout' (876) panicked at crates/gammaloop-api/src/templates.rs:99:9:
26.92 s
gammaloop-nextest-core> assertion failed: figure.contains("amplitude-mode")
26.92 s
gammaloop-nextest-core> stack backtrace:
26.92 s
gammaloop-nextest-core> 0: __rustc::rust_begin_unwind
26.92 s
gammaloop-nextest-core> 1: core::panicking::panic_fmt
26.92 s
gammaloop-nextest-core> 2: core::panicking::panic
26.92 s
gammaloop-nextest-core> 3: gammaloop_api::templates::tests::extract_templates_uses_canonical_package_layout
26.92 s
gammaloop-nextest-core> 4: <gammaloop_api::templates::tests::extract_templates_uses_canonical_package_layout::{closure#0} as core::ops::function::FnOnce<()>>::call_once
26.92 s
gammaloop-nextest-core> note: Some details are omitted, run with `RUST_BACKTRACE=full` for a verbose backtrace.
26.92 s
gammaloop-nextest-core>
27.02 s
gammaloop-nextest-core> error : test run failed
27.17 s
gammaloop-nextest-core>
27.17 s
gammaloop-nextest-core> ========== nextest test summary ==========
27.17 s
gammaloop-nextest-core> report: target/nextest/ci_gammaloop/junit.xml
27.17 s
gammaloop-nextest-core> tests: 339, failures: 2, errors: 0
27.17 s
gammaloop-nextest-core>
27.17 s
gammaloop-nextest-core> 1. gammaloop-api::repl::tests::completion_shows_type_hint_for_non_boolean_settings_leaf
27.17 s
gammaloop-nextest-core> failure: test failure with exit code 101
27.17 s
gammaloop-nextest-core> thread 'repl::tests::completion_shows_type_hint_for_non_boolean_settings_leaf' (777) panicked at crates/gammaloop-api/src/repl.rs:5778:9:
27.17 s
gammaloop-nextest-core> [Suggestion { value: "", description: Some("Number of samples in the first Monte Carlo iteration."), style: None, extra: None, span: Span { start: 42, end: 42 }, append_whitespace: false }]
27.17 s
gammaloop-nextest-core> stack backtrace:
27.17 s
gammaloop-nextest-core> 0: __rustc::rust_begin_unwind
27.17 s
gammaloop-nextest-core> 1: core::panicking::panic_fmt
27.17 s
gammaloop-nextest-core> 2: gammaloop_api::repl::tests::completion_shows_type_hint_for_non_boolean_settings_leaf
27.17 s
gammaloop-nextest-core> 3: <gammaloop_api::repl::tests::completion_shows_type_hint_for_non_boolean_settings_leaf::{closure#0} as core::ops::function::FnOnce<()>>::call_once
27.17 s
gammaloop-nextest-core> note: Some details are omitted, run with `RUST_BACKTRACE=full` for a verbose backtrace.
27.17 s
gammaloop-nextest-core> system-out
27.17 s
gammaloop-nextest-core> running 1 test
27.17 s
gammaloop-nextest-core> test repl::tests::completion_shows_type_hint_for_non_boolean_settings_leaf ... FAILED
27.17 s
gammaloop-nextest-core>
27.17 s
gammaloop-nextest-core> failures:
27.17 s
gammaloop-nextest-core>
27.17 s
gammaloop-nextest-core> failures:
27.17 s
gammaloop-nextest-core> repl::tests::completion_shows_type_hint_for_non_boolean_settings_leaf
27.17 s
gammaloop-nextest-core>
27.17 s
gammaloop-nextest-core> test result: FAILED. 0 passed; 1 failed; 0 ignored; 0 measured; 338 filtered out; finished in 0.02s
27.17 s
gammaloop-nextest-core> system-err
27.17 s
gammaloop-nextest-core> thread 'repl::tests::completion_shows_type_hint_for_non_boolean_settings_leaf' (777) panicked at crates/gammaloop-api/src/repl.rs:5778:9:
27.17 s
gammaloop-nextest-core> [Suggestion { value: "", description: Some("Number of samples in the first Monte Carlo iteration."), style: None, extra: None, span: Span { start: 42, end: 42 }, append_whitespace: false }]
27.17 s
gammaloop-nextest-core> stack backtrace:
27.17 s
gammaloop-nextest-core> 0: __rustc::rust_begin_unwind
27.17 s
gammaloop-nextest-core> 1: core::panicking::panic_fmt
27.17 s
gammaloop-nextest-core> 2: gammaloop_api::repl::tests::completion_shows_type_hint_for_non_boolean_settings_leaf
27.17 s
gammaloop-nextest-core> 3: <gammaloop_api::repl::tests::completion_shows_type_hint_for_non_boolean_settings_leaf::{closure#0} as core::ops::function::FnOnce<()>>::call_once
27.17 s
gammaloop-nextest-core> note: Some details are omitted, run with `RUST_BACKTRACE=full` for a verbose backtrace.
27.17 s
gammaloop-nextest-core>
27.17 s
gammaloop-nextest-core> 2. gammaloop-api::templates::tests::extract_templates_uses_canonical_package_layout
27.17 s
gammaloop-nextest-core> failure: test failure with exit code 101
27.17 s
gammaloop-nextest-core> thread 'templates::tests::extract_templates_uses_canonical_package_layout' (876) panicked at crates/gammaloop-api/src/templates.rs:99:9:
27.17 s
gammaloop-nextest-core> assertion failed: figure.contains("amplitude-mode")
27.17 s
gammaloop-nextest-core> stack backtrace:
27.17 s
gammaloop-nextest-core> 0: __rustc::rust_begin_unwind
27.17 s
gammaloop-nextest-core> 1: core::panicking::panic_fmt
27.17 s
gammaloop-nextest-core> 2: core::panicking::panic
27.17 s
gammaloop-nextest-core> 3: gammaloop_api::templates::tests::extract_templates_uses_canonical_package_layout
27.17 s
gammaloop-nextest-core> 4: <gammaloop_api::templates::tests::extract_templates_uses_canonical_package_layout::{closure#0} as core::ops::function::FnOnce<()>>::call_once
27.17 s
gammaloop-nextest-core> note: Some details are omitted, run with `RUST_BACKTRACE=full` for a verbose backtrace.
27.17 s
gammaloop-nextest-core> system-out
27.17 s
gammaloop-nextest-core> running 1 test
27.17 s
gammaloop-nextest-core> test templates::tests::extract_templates_uses_canonical_package_layout ... FAILED
27.17 s
gammaloop-nextest-core>
27.17 s
gammaloop-nextest-core> failures:
27.17 s
gammaloop-nextest-core>
27.17 s
gammaloop-nextest-core> failures:
27.17 s
gammaloop-nextest-core> templates::tests::extract_templates_uses_canonical_package_layout
27.17 s
gammaloop-nextest-core>
27.17 s
gammaloop-nextest-core> test result: FAILED. 0 passed; 1 failed; 0 ignored; 0 measured; 338 filtered out; finished in 0.02s
27.17 s
gammaloop-nextest-core> system-err
27.17 s
gammaloop-nextest-core> thread 'templates::tests::extract_templates_uses_canonical_package_layout' (876) panicked at crates/gammaloop-api/src/templates.rs:99:9:
27.17 s
gammaloop-nextest-core> assertion failed: figure.contains("amplitude-mode")
27.17 s
gammaloop-nextest-core> stack backtrace:
27.17 s
gammaloop-nextest-core> 0: __rustc::rust_begin_unwind
27.17 s
gammaloop-nextest-core> 1: core::panicking::panic_fmt
27.17 s
gammaloop-nextest-core> 2: core::panicking::panic
27.17 s
gammaloop-nextest-core> 3: gammaloop_api::templates::tests::extract_templates_uses_canonical_package_layout
27.17 s
gammaloop-nextest-core> 4: <gammaloop_api::templates::tests::extract_templates_uses_canonical_package_layout::{closure#0} as core::ops::function::FnOnce<()>>::call_once
27.17 s
gammaloop-nextest-core> note: Some details are omitted, run with `RUST_BACKTRACE=full` for a verbose backtrace.
27.17 s
gammaloop-nextest-core> =========================================
27.20 s
gammaloop-nextest-core> Extracting 1 binary and 1 linked path to /build/nextest-archive-ZtiFdd
27.29 s
gammaloop-nextest-core> Extracted 7 files to /build/nextest-archive-ZtiFdd in 0.10s
27.33 s
gammaloop-nextest-core> ------------
27.33 s
gammaloop-nextest-core> Nextest run ID 592ce6b0-6815-408d-a38e-b572d07df22d with nextest profile: ci_gammaloop
27.33 s
gammaloop-nextest-core> Starting 19 tests across 1 binary
27.36 s
gammaloop-nextest-core> ------------
27.36 s
gammaloop-nextest-core> Summary [ 0.033s] 19 tests run: 19 passed , 0 skipped
27.45 s
gammaloop-nextest-core>
27.45 s
gammaloop-nextest-core> ========== nextest test summary ==========
27.45 s
gammaloop-nextest-core> report: target/nextest/ci_gammaloop/junit.xml
27.45 s
gammaloop-nextest-core> tests: 19, failures: 0, errors: 0
27.45 s
gammaloop-nextest-core> No failing testcases found.
27.45 s
gammaloop-nextest-core> =========================================
27.49 s
gammaloop-nextest-core> Extracting 1 binary to /build/nextest-archive-dNTt94
27.55 s
gammaloop-nextest-core> Extracted 4 files to /build/nextest-archive-dNTt94 in 0.06s
27.58 s
gammaloop-nextest-core> ------------
27.58 s
gammaloop-nextest-core> Nextest run ID 1c65cbae-6aa9-45c1-8059-71a920916a6e with nextest profile: ci_gammaloop
27.58 s
gammaloop-nextest-core> Starting 0 tests across 1 binary
27.58 s
gammaloop-nextest-core> ------------
27.58 s
gammaloop-nextest-core> Summary [ 0.005s] 0 tests run: 0 passed , 0 skipped
27.65 s
gammaloop-nextest-core>
27.65 s
gammaloop-nextest-core> ========== nextest test summary ==========
27.65 s
gammaloop-nextest-core> report: target/nextest/ci_gammaloop/junit.xml
27.65 s
gammaloop-nextest-core> tests: 0, failures: 0, errors: 0
27.65 s
gammaloop-nextest-core> No failing testcases found.
27.65 s
gammaloop-nextest-core> =========================================
27.69 s
gammaloop-nextest-core> Extracting 4 binaries, 1 build script output directory, and 2 linked paths to /build/nextest-archive-kmQ3Jp
28.27 s
gammaloop-nextest-core> Extracted 18 files to /build/nextest-archive-kmQ3Jp in 0.59s
28.32 s
gammaloop-nextest-core> ------------
28.32 s
gammaloop-nextest-core> Nextest run ID fb959dde-2853-4425-9800-4e145098a14a with nextest profile: ci_gammaloop
28.32 s
gammaloop-nextest-core> Starting 456 tests across 4 binaries (61 tests skipped , including 60 tests via profile.ci_gammaloop.default-filter )
28.99 s
gammaloop-nextest-core> FAIL [ 0.417s] (126/456) gammalooprs graph::parse::tests :: parse_lmbsetting_crossection
28.99 s
gammaloop-nextest-core> stdout ---
28.99 s
gammaloop-nextest-core>
28.99 s
gammaloop-nextest-core> running 1 test
28.99 s
gammaloop-nextest-core> ━━━━━━━━━━━━━━━━━━━━━━━━━━━━━━━ Snapshot Summary ━━━━━━━━━━━━━━━━━━━━━━━━━━━━━━━
28.99 s
gammaloop-nextest-core> Snapshot: parse_lmbsetting_crossection
28.99 s
gammaloop-nextest-core> Source: crates/gammalooprs/src/graph/parse/tests.rs:252
28.99 s
gammaloop-nextest-core> ────────────────────────────────────────────────────────────────────────────────
28.99 s
gammaloop-nextest-core> Expression: g.debug_dot()
28.99 s
gammaloop-nextest-core> ────────────────────────────────────────────────────────────────────────────────
28.99 s
gammaloop-nextest-core> -old snapshot
28.99 s
gammaloop-nextest-core> +new results
28.99 s
gammaloop-nextest-core> ────────────┬───────────────────────────────────────────────────────────────────
28.99 s
gammaloop-nextest-core> 1 │-digraph G{
28.99 s
gammaloop-nextest-core> 1 │+digraph G {
28.99 s
gammaloop-nextest-core> 2 2 │ num = "1/2";
28.99 s
gammaloop-nextest-core> 3 3 │ overall_factor = "2*x";
28.99 s
gammaloop-nextest-core> 4 4 │ overall_factor_evaluated = "2*x";
28.99 s
gammaloop-nextest-core> 5 5 │ projector = "spenso::t";
28.99 s
gammaloop-nextest-core> ────────────┴───────────────────────────────────────────────────────────────────
28.99 s
gammaloop-nextest-core> To update snapshots run `cargo insta review`
28.99 s
gammaloop-nextest-core> Stopped on the first failure. Run `cargo insta test` to run all snapshots.
28.99 s
gammaloop-nextest-core> test graph::parse::tests::parse_lmbsetting_crossection ... FAILED
28.99 s
gammaloop-nextest-core>
28.99 s
gammaloop-nextest-core> failures:
28.99 s
gammaloop-nextest-core>
28.99 s
gammaloop-nextest-core> failures:
28.99 s
gammaloop-nextest-core> graph::parse::tests::parse_lmbsetting_crossection
28.99 s
gammaloop-nextest-core>
28.99 s
gammaloop-nextest-core> test result: FAILED. 0 passed; 1 failed; 0 ignored; 0 measured; 508 filtered out; finished in 0.30s
28.99 s
gammaloop-nextest-core>
28.99 s
gammaloop-nextest-core> stderr ---
28.99 s
gammaloop-nextest-core> [20:20:08.931] @gammalooprs::graph::attribute_warnings WARNING : Unknown node attribute 'color_num' on graph 'G', node 'A'; did you mean 'num'?
28.99 s
gammaloop-nextest-core> at crates/gammalooprs/src/graph/attribute_warnings.rs:198
28.99 s
gammaloop-nextest-core> The application panicked (crashed).
28.99 s
gammaloop-nextest-core> Message: snapshot assertion for 'parse_lmbsetting_crossection' failed in line 252
28.99 s
gammaloop-nextest-core> Location: /nix/store/xdy1vvhll2bijdplvl9fcc2b9plkxhaa-vendor-cargo-deps/c19b7c6f923b580ac259164a89f2577984ad5ab09ee9d583b888f934adbbe8d0/insta-1.47.2/src/runtime.rs :719
28.99 s
gammaloop-nextest-core>
28.99 s
gammaloop-nextest-core> ━━━━━━━━━━━━━━━━━━━━━━━━━━━━━━━━━━ BACKTRACE ━━━━━━━━━━━━━━━━━━━━━━━━━━━━━━━━━━━
28.99 s
gammaloop-nextest-core> 1: <color_eyre[b0c9e66060e883b2]::config::PanicHook>::panic_report <unknown>
28.99 s
gammaloop-nextest-core> at <unknown source file> :<unknown line>
28.99 s
gammaloop-nextest-core> 2: <color_eyre[b0c9e66060e883b2]::config::PanicHook>::into_panic_hook::{closure#0} <unknown>
28.99 s
gammaloop-nextest-core> at <unknown source file> :<unknown line>
28.99 s
gammaloop-nextest-core> 3: std[bcb96dfbba0ab899]::panicking::panic_with_hook <unknown>
28.99 s
gammaloop-nextest-core> at <unknown source file> :<unknown line>
28.99 s
gammaloop-nextest-core> 4: std[bcb96dfbba0ab899]::panicking::panic_handler::{closure#0} <unknown>
28.99 s
gammaloop-nextest-core> at <unknown source file> :<unknown line>
28.99 s
gammaloop-nextest-core> 5: std[bcb96dfbba0ab899]::sys::backtrace::__rust_end_short_backtrace::<std[bcb96dfbba0ab899]::panicking::panic_handler::{closure#0}, !> <unknown>
28.99 s
gammaloop-nextest-core> at <unknown source file> :<unknown line>
28.99 s
gammaloop-nextest-core> 6: __rustc[6c289b9f9c454d21]::rust_begin_unwind <unknown>
28.99 s
gammaloop-nextest-core> at <unknown source file> :<unknown line>
28.99 s
gammaloop-nextest-core> 7: core[940e698046960fd5]::panicking::panic_fmt <unknown>
28.99 s
gammaloop-nextest-core> at <unknown source file> :<unknown line>
28.99 s
gammaloop-nextest-core> 8: insta[307a548ac79ef4d9]::runtime::assert_snapshot <unknown>
28.99 s
gammaloop-nextest-core> at <unknown source file> :<unknown line>
28.99 s
gammaloop-nextest-core> 9: gammalooprs[5490727360442cce]::graph::parse::tests::parse_lmbsetting_crossection <unknown>
28.99 s
gammaloop-nextest-core> at <unknown source file> :<unknown line>
28.99 s
gammaloop-nextest-core> 10: <gammalooprs[5490727360442cce]::graph::parse::tests::parse_lmbsetting_crossection::{closure#0} as core[940e698046960fd5]::ops::function::FnOnce<()>>::call_once <unknown>
28.99 s
gammaloop-nextest-core> at <unknown source file> :<unknown line>
28.99 s
gammaloop-nextest-core> 11: test[75d6903177b1d7e9]::__rust_begin_short_backtrace::<core[940e698046960fd5]::result::Result<(), alloc[2ea6bcb46fca0c42]::string::String>, fn() -> core[940e698046960fd5]::result::Result<(), alloc[2ea6bcb46fca0c42]::string::String>> <unknown>
28.99 s
gammaloop-nextest-core> at <unknown source file> :<unknown line>
28.99 s
gammaloop-nextest-core> 12: test[75d6903177b1d7e9]::run_test::{closure#0} <unknown>
28.99 s
gammaloop-nextest-core> at <unknown source file> :<unknown line>
28.99 s
gammaloop-nextest-core> 13: std[bcb96dfbba0ab899]::sys::backtrace::__rust_begin_short_backtrace::<test[75d6903177b1d7e9]::run_test::{closure#1}, ()> <unknown>
28.99 s
gammaloop-nextest-core> at <unknown source file> :<unknown line>
28.99 s
gammaloop-nextest-core> 14: <std[bcb96dfbba0ab899]::thread::lifecycle::spawn_unchecked<test[75d6903177b1d7e9]::run_test::{closure#1}, ()>::{closure#1} as core[940e698046960fd5]::ops::function::FnOnce<()>>::call_once::{shim:vtable#0} <unknown>
28.99 s
gammaloop-nextest-core> at <unknown source file> :<unknown line>
28.99 s
gammaloop-nextest-core> 15: <std[bcb96dfbba0ab899]::sys::thread::unix::Thread>::new::thread_start <unknown>
28.99 s
gammaloop-nextest-core> at <unknown source file> :<unknown line>
28.99 s
gammaloop-nextest-core> 16: start_thread <unknown>
28.99 s
gammaloop-nextest-core> at <unknown source file> :<unknown line>
28.99 s
gammaloop-nextest-core> 17: __clone3 <unknown>
28.99 s
gammaloop-nextest-core> at <unknown source file> :<unknown line>
28.99 s
gammaloop-nextest-core>
28.99 s
gammaloop-nextest-core> Run with COLORBT_SHOW_HIDDEN=1 environment variable to disable frame filtering.
28.99 s
gammaloop-nextest-core> Run with RUST_BACKTRACE=full to include source snippets.
28.99 s
gammaloop-nextest-core>
30.89 s
gammaloop-nextest-core> FAIL [ 0.903s] (434/456) gammalooprs uv::export::tests :: computed_node_full_numerator_is_a_spenso_aware_typst_fragment
30.92 s
gammaloop-nextest-core> stdout ---
30.92 s
gammaloop-nextest-core>
30.92 s
gammaloop-nextest-core> running 1 test
30.92 s
gammaloop-nextest-core> test uv::export::tests::computed_node_full_numerator_is_a_spenso_aware_typst_fragment ... FAILED
30.92 s
gammaloop-nextest-core>
30.92 s
gammaloop-nextest-core> failures:
30.92 s
gammaloop-nextest-core>
30.92 s
gammaloop-nextest-core> failures:
30.92 s
gammaloop-nextest-core> uv::export::tests::computed_node_full_numerator_is_a_spenso_aware_typst_fragment
30.92 s
gammaloop-nextest-core>
30.92 s
gammaloop-nextest-core> test result: FAILED. 0 passed; 1 failed; 0 ignored; 0 measured; 508 filtered out; finished in 0.87s
30.92 s
gammaloop-nextest-core>
30.92 s
gammaloop-nextest-core> stderr ---
30.92 s
gammaloop-nextest-core> The application panicked (crashed).
30.92 s
gammaloop-nextest-core> Message: assertion failed: exported.dot.contains(r#"full_num = "op(\"Tr\")(1)";"#)
30.92 s
gammaloop-nextest-core> Location: crates/gammalooprs/src/uv/export.rs :483
30.92 s
gammaloop-nextest-core>
30.92 s
gammaloop-nextest-core> ━━━━━━━━━━━━━━━━━━━━━━━━━━━━━━━━━━ BACKTRACE ━━━━━━━━━━━━━━━━━━━━━━━━━━━━━━━━━━━
30.92 s
gammaloop-nextest-core> 1: <color_eyre[b0c9e66060e883b2]::config::PanicHook>::panic_report <unknown>
30.92 s
gammaloop-nextest-core> at <unknown source file> :<unknown line>
30.92 s
gammaloop-nextest-core> 2: <color_eyre[b0c9e66060e883b2]::config::PanicHook>::into_panic_hook::{closure#0} <unknown>
30.92 s
gammaloop-nextest-core> at <unknown source file> :<unknown line>
30.92 s
gammaloop-nextest-core> 3: std[bcb96dfbba0ab899]::panicking::panic_with_hook <unknown>
30.92 s
gammaloop-nextest-core> at <unknown source file> :<unknown line>
30.92 s
gammaloop-nextest-core> 4: std[bcb96dfbba0ab899]::panicking::panic_handler::{closure#0} <unknown>
30.92 s
gammaloop-nextest-core> at <unknown source file> :<unknown line>
30.92 s
gammaloop-nextest-core> 5: std[bcb96dfbba0ab899]::sys::backtrace::__rust_end_short_backtrace::<std[bcb96dfbba0ab899]::panicking::panic_handler::{closure#0}, !> <unknown>
30.92 s
gammaloop-nextest-core> at <unknown source file> :<unknown line>
30.92 s
gammaloop-nextest-core> 6: __rustc[6c289b9f9c454d21]::rust_begin_unwind <unknown>
30.92 s
gammaloop-nextest-core> at <unknown source file> :<unknown line>
30.92 s
gammaloop-nextest-core> 7: core[940e698046960fd5]::panicking::panic_fmt <unknown>
30.92 s
gammaloop-nextest-core> at <unknown source file> :<unknown line>
30.92 s
gammaloop-nextest-core> 8: core[940e698046960fd5]::panicking::panic <unknown>
30.92 s
gammaloop-nextest-core> at <unknown source file> :<unknown line>
30.92 s
gammaloop-nextest-core> 9: gammalooprs[5490727360442cce]::uv::export::tests::computed_node_full_numerator_is_a_spenso_aware_typst_fragment <unknown>
30.92 s
gammaloop-nextest-core> at <unknown source file> :<unknown line>
30.92 s
gammaloop-nextest-core> 10: <gammalooprs[5490727360442cce]::uv::export::tests::computed_node_full_numerator_is_a_spenso_aware_typst_fragment::{closure#0} as core[940e698046960fd5]::ops::function::FnOnce<()>>::call_once <unknown>
30.92 s
gammaloop-nextest-core> at <unknown source file> :<unknown line>
30.92 s
gammaloop-nextest-core> 11: test[75d6903177b1d7e9]::__rust_begin_short_backtrace::<core[940e698046960fd5]::result::Result<(), alloc[2ea6bcb46fca0c42]::string::String>, fn() -> core[940e698046960fd5]::result::Result<(), alloc[2ea6bcb46fca0c42]::string::String>> <unknown>
30.92 s
gammaloop-nextest-core> at <unknown source file> :<unknown line>
30.92 s
gammaloop-nextest-core> 12: test[75d6903177b1d7e9]::run_test::{closure#0} <unknown>
30.92 s
gammaloop-nextest-core> at <unknown source file> :<unknown line>
30.92 s
gammaloop-nextest-core> 13: std[bcb96dfbba0ab899]::sys::backtrace::__rust_begin_short_backtrace::<test[75d6903177b1d7e9]::run_test::{closure#1}, ()> <unknown>
30.92 s
gammaloop-nextest-core> at <unknown source file> :<unknown line>
30.92 s
gammaloop-nextest-core> 14: <std[bcb96dfbba0ab899]::thread::lifecycle::spawn_unchecked<test[75d6903177b1d7e9]::run_test::{closure#1}, ()>::{closure#1} as core[940e698046960fd5]::ops::function::FnOnce<()>>::call_once::{shim:vtable#0} <unknown>
30.92 s
gammaloop-nextest-core> at <unknown source file> :<unknown line>
30.92 s
gammaloop-nextest-core> 15: <std[bcb96dfbba0ab899]::sys::thread::unix::Thread>::new::thread_start <unknown>
30.92 s
gammaloop-nextest-core> at <unknown source file> :<unknown line>
30.92 s
gammaloop-nextest-core> 16: start_thread <unknown>
30.92 s
gammaloop-nextest-core> at <unknown source file> :<unknown line>
30.92 s
gammaloop-nextest-core> 17: __clone3 <unknown>
30.92 s
gammaloop-nextest-core> at <unknown source file> :<unknown line>
30.92 s
gammaloop-nextest-core>
30.92 s
gammaloop-nextest-core> Run with COLORBT_SHOW_HIDDEN=1 environment variable to disable frame filtering.
30.92 s
gammaloop-nextest-core> Run with RUST_BACKTRACE=full to include source snippets.
30.92 s
gammaloop-nextest-core>
43.10 s
gammaloop-nextest-core> ------------
43.11 s
gammaloop-nextest-core> Summary [ 14.778s] 456 tests run: 454 passed , 2 failed , 61 skipped
43.11 s
gammaloop-nextest-core> FAIL [ 0.417s] (126/456) gammalooprs graph::parse::tests :: parse_lmbsetting_crossection
43.11 s
gammaloop-nextest-core> stdout ---
43.11 s
gammaloop-nextest-core>
43.11 s
gammaloop-nextest-core> running 1 test
43.11 s
gammaloop-nextest-core> ━━━━━━━━━━━━━━━━━━━━━━━━━━━━━━━ Snapshot Summary ━━━━━━━━━━━━━━━━━━━━━━━━━━━━━━━
43.11 s
gammaloop-nextest-core> Snapshot: parse_lmbsetting_crossection
43.11 s
gammaloop-nextest-core> Source: crates/gammalooprs/src/graph/parse/tests.rs:252
43.11 s
gammaloop-nextest-core> ────────────────────────────────────────────────────────────────────────────────
43.11 s
gammaloop-nextest-core> Expression: g.debug_dot()
43.11 s
gammaloop-nextest-core> ────────────────────────────────────────────────────────────────────────────────
43.11 s
gammaloop-nextest-core> -old snapshot
43.11 s
gammaloop-nextest-core> +new results
43.11 s
gammaloop-nextest-core> ────────────┬───────────────────────────────────────────────────────────────────
43.11 s
gammaloop-nextest-core> 1 │-digraph G{
43.11 s
gammaloop-nextest-core> 1 │+digraph G {
43.11 s
gammaloop-nextest-core> 2 2 │ num = "1/2";
43.11 s
gammaloop-nextest-core> 3 3 │ overall_factor = "2*x";
43.11 s
gammaloop-nextest-core> 4 4 │ overall_factor_evaluated = "2*x";
43.11 s
gammaloop-nextest-core> 5 5 │ projector = "spenso::t";
43.11 s
gammaloop-nextest-core> ────────────┴───────────────────────────────────────────────────────────────────
43.11 s
gammaloop-nextest-core> To update snapshots run `cargo insta review`
43.11 s
gammaloop-nextest-core> Stopped on the first failure. Run `cargo insta test` to run all snapshots.
43.11 s
gammaloop-nextest-core> test graph::parse::tests::parse_lmbsetting_crossection ... FAILED
43.11 s
gammaloop-nextest-core>
43.11 s
gammaloop-nextest-core> failures:
43.11 s
gammaloop-nextest-core>
43.11 s
gammaloop-nextest-core> failures:
43.11 s
gammaloop-nextest-core> graph::parse::tests::parse_lmbsetting_crossection
43.11 s
gammaloop-nextest-core>
43.11 s
gammaloop-nextest-core> test result: FAILED. 0 passed; 1 failed; 0 ignored; 0 measured; 508 filtered out; finished in 0.30s
43.11 s
gammaloop-nextest-core>
43.11 s
gammaloop-nextest-core> stderr ---
43.11 s
gammaloop-nextest-core> [20:20:08.931] @gammalooprs::graph::attribute_warnings WARNING : Unknown node attribute 'color_num' on graph 'G', node 'A'; did you mean 'num'?
43.11 s
gammaloop-nextest-core> at crates/gammalooprs/src/graph/attribute_warnings.rs:198
43.11 s
gammaloop-nextest-core> The application panicked (crashed).
43.11 s
gammaloop-nextest-core> Message: snapshot assertion for 'parse_lmbsetting_crossection' failed in line 252
43.11 s
gammaloop-nextest-core> Location: /nix/store/xdy1vvhll2bijdplvl9fcc2b9plkxhaa-vendor-cargo-deps/c19b7c6f923b580ac259164a89f2577984ad5ab09ee9d583b888f934adbbe8d0/insta-1.47.2/src/runtime.rs :719
43.11 s
gammaloop-nextest-core>
43.11 s
gammaloop-nextest-core> ━━━━━━━━━━━━━━━━━━━━━━━━━━━━━━━━━━ BACKTRACE ━━━━━━━━━━━━━━━━━━━━━━━━━━━━━━━━━━━
43.11 s
gammaloop-nextest-core> 1: <color_eyre[b0c9e66060e883b2]::config::PanicHook>::panic_report <unknown>
43.11 s
gammaloop-nextest-core> at <unknown source file> :<unknown line>
43.11 s
gammaloop-nextest-core> 2: <color_eyre[b0c9e66060e883b2]::config::PanicHook>::into_panic_hook::{closure#0} <unknown>
43.11 s
gammaloop-nextest-core> at <unknown source file> :<unknown line>
43.11 s
gammaloop-nextest-core> 3: std[bcb96dfbba0ab899]::panicking::panic_with_hook <unknown>
43.11 s
gammaloop-nextest-core> at <unknown source file> :<unknown line>
43.11 s
gammaloop-nextest-core> 4: std[bcb96dfbba0ab899]::panicking::panic_handler::{closure#0} <unknown>
43.11 s
gammaloop-nextest-core> at <unknown source file> :<unknown line>
43.11 s
gammaloop-nextest-core> 5: std[bcb96dfbba0ab899]::sys::backtrace::__rust_end_short_backtrace::<std[bcb96dfbba0ab899]::panicking::panic_handler::{closure#0}, !> <unknown>
43.11 s
gammaloop-nextest-core> at <unknown source file> :<unknown line>
43.11 s
gammaloop-nextest-core> 6: __rustc[6c289b9f9c454d21]::rust_begin_unwind <unknown>
43.11 s
gammaloop-nextest-core> at <unknown source file> :<unknown line>
43.11 s
gammaloop-nextest-core> 7: core[940e698046960fd5]::panicking::panic_fmt <unknown>
43.11 s
gammaloop-nextest-core> at <unknown source file> :<unknown line>
43.11 s
gammaloop-nextest-core> 8: insta[307a548ac79ef4d9]::runtime::assert_snapshot <unknown>
43.11 s
gammaloop-nextest-core> at <unknown source file> :<unknown line>
43.11 s
gammaloop-nextest-core> 9: gammalooprs[5490727360442cce]::graph::parse::tests::parse_lmbsetting_crossection <unknown>
43.11 s
gammaloop-nextest-core> at <unknown source file> :<unknown line>
43.11 s
gammaloop-nextest-core> 10: <gammalooprs[5490727360442cce]::graph::parse::tests::parse_lmbsetting_crossection::{closure#0} as core[940e698046960fd5]::ops::function::FnOnce<()>>::call_once <unknown>
43.11 s
gammaloop-nextest-core> at <unknown source file> :<unknown line>
43.11 s
gammaloop-nextest-core> 11: test[75d6903177b1d7e9]::__rust_begin_short_backtrace::<core[940e698046960fd5]::result::Result<(), alloc[2ea6bcb46fca0c42]::string::String>, fn() -> core[940e698046960fd5]::result::Result<(), alloc[2ea6bcb46fca0c42]::string::String>> <unknown>
43.11 s
gammaloop-nextest-core> at <unknown source file> :<unknown line>
43.11 s
gammaloop-nextest-core> 12: test[75d6903177b1d7e9]::run_test::{closure#0} <unknown>
43.11 s
gammaloop-nextest-core> at <unknown source file> :<unknown line>
43.11 s
gammaloop-nextest-core> 13: std[bcb96dfbba0ab899]::sys::backtrace::__rust_begin_short_backtrace::<test[75d6903177b1d7e9]::run_test::{closure#1}, ()> <unknown>
43.11 s
gammaloop-nextest-core> at <unknown source file> :<unknown line>
43.11 s
gammaloop-nextest-core> 14: <std[bcb96dfbba0ab899]::thread::lifecycle::spawn_unchecked<test[75d6903177b1d7e9]::run_test::{closure#1}, ()>::{closure#1} as core[940e698046960fd5]::ops::function::FnOnce<()>>::call_once::{shim:vtable#0} <unknown>
43.11 s
gammaloop-nextest-core> at <unknown source file> :<unknown line>
43.11 s
gammaloop-nextest-core> 15: <std[bcb96dfbba0ab899]::sys::thread::unix::Thread>::new::thread_start <unknown>
43.11 s
gammaloop-nextest-core> at <unknown source file> :<unknown line>
43.11 s
gammaloop-nextest-core> 16: start_thread <unknown>
43.11 s
gammaloop-nextest-core> at <unknown source file> :<unknown line>
43.11 s
gammaloop-nextest-core> 17: __clone3 <unknown>
43.11 s
gammaloop-nextest-core> at <unknown source file> :<unknown line>
43.11 s
gammaloop-nextest-core>
43.11 s
gammaloop-nextest-core> Run with COLORBT_SHOW_HIDDEN=1 environment variable to disable frame filtering.
43.11 s
gammaloop-nextest-core> Run with RUST_BACKTRACE=full to include source snippets.
43.11 s
gammaloop-nextest-core>
43.11 s
gammaloop-nextest-core> FAIL [ 0.903s] (434/456) gammalooprs uv::export::tests :: computed_node_full_numerator_is_a_spenso_aware_typst_fragment
43.11 s
gammaloop-nextest-core> stdout ---
43.11 s
gammaloop-nextest-core>
43.11 s
gammaloop-nextest-core> running 1 test
43.11 s
gammaloop-nextest-core> test uv::export::tests::computed_node_full_numerator_is_a_spenso_aware_typst_fragment ... FAILED
43.11 s
gammaloop-nextest-core>
43.11 s
gammaloop-nextest-core> failures:
43.11 s
gammaloop-nextest-core>
43.11 s
gammaloop-nextest-core> failures:
43.11 s
gammaloop-nextest-core> uv::export::tests::computed_node_full_numerator_is_a_spenso_aware_typst_fragment
43.11 s
gammaloop-nextest-core>
43.11 s
gammaloop-nextest-core> test result: FAILED. 0 passed; 1 failed; 0 ignored; 0 measured; 508 filtered out; finished in 0.87s
43.11 s
gammaloop-nextest-core>
43.11 s
gammaloop-nextest-core> stderr ---
43.11 s
gammaloop-nextest-core> The application panicked (crashed).
43.11 s
gammaloop-nextest-core> Message: assertion failed: exported.dot.contains(r#"full_num = "op(\"Tr\")(1)";"#)
43.11 s
gammaloop-nextest-core> Location: crates/gammalooprs/src/uv/export.rs :483
43.11 s
gammaloop-nextest-core>
43.11 s
gammaloop-nextest-core> ━━━━━━━━━━━━━━━━━━━━━━━━━━━━━━━━━━ BACKTRACE ━━━━━━━━━━━━━━━━━━━━━━━━━━━━━━━━━━━
43.11 s
gammaloop-nextest-core> 1: <color_eyre[b0c9e66060e883b2]::config::PanicHook>::panic_report <unknown>
43.11 s
gammaloop-nextest-core> at <unknown source file> :<unknown line>
43.11 s
gammaloop-nextest-core> 2: <color_eyre[b0c9e66060e883b2]::config::PanicHook>::into_panic_hook::{closure#0} <unknown>
43.11 s
gammaloop-nextest-core> at <unknown source file> :<unknown line>
43.11 s
gammaloop-nextest-core> 3: std[bcb96dfbba0ab899]::panicking::panic_with_hook <unknown>
43.11 s
gammaloop-nextest-core> at <unknown source file> :<unknown line>
43.11 s
gammaloop-nextest-core> 4: std[bcb96dfbba0ab899]::panicking::panic_handler::{closure#0} <unknown>
43.11 s
gammaloop-nextest-core> at <unknown source file> :<unknown line>
43.11 s
gammaloop-nextest-core> 5: std[bcb96dfbba0ab899]::sys::backtrace::__rust_end_short_backtrace::<std[bcb96dfbba0ab899]::panicking::panic_handler::{closure#0}, !> <unknown>
43.11 s
gammaloop-nextest-core> at <unknown source file> :<unknown line>
43.11 s
gammaloop-nextest-core> 6: __rustc[6c289b9f9c454d21]::rust_begin_unwind <unknown>
43.11 s
gammaloop-nextest-core> at <unknown source file> :<unknown line>
43.11 s
gammaloop-nextest-core> 7: core[940e698046960fd5]::panicking::panic_fmt <unknown>
43.11 s
gammaloop-nextest-core> at <unknown source file> :<unknown line>
43.11 s
gammaloop-nextest-core> 8: core[940e698046960fd5]::panicking::panic <unknown>
43.11 s
gammaloop-nextest-core> at <unknown source file> :<unknown line>
43.11 s
gammaloop-nextest-core> 9: gammalooprs[5490727360442cce]::uv::export::tests::computed_node_full_numerator_is_a_spenso_aware_typst_fragment <unknown>
43.11 s
gammaloop-nextest-core> at <unknown source file> :<unknown line>
43.11 s
gammaloop-nextest-core> 10: <gammalooprs[5490727360442cce]::uv::export::tests::computed_node_full_numerator_is_a_spenso_aware_typst_fragment::{closure#0} as core[940e698046960fd5]::ops::function::FnOnce<()>>::call_once <unknown>
43.11 s
gammaloop-nextest-core> at <unknown source file> :<unknown line>
43.11 s
gammaloop-nextest-core> 11: test[75d6903177b1d7e9]::__rust_begin_short_backtrace::<core[940e698046960fd5]::result::Result<(), alloc[2ea6bcb46fca0c42]::string::String>, fn() -> core[940e698046960fd5]::result::Result<(), alloc[2ea6bcb46fca0c42]::string::String>> <unknown>
43.11 s
gammaloop-nextest-core> at <unknown source file> :<unknown line>
43.11 s
gammaloop-nextest-core> 12: test[75d6903177b1d7e9]::run_test::{closure#0} <unknown>
43.11 s
gammaloop-nextest-core> at <unknown source file> :<unknown line>
43.11 s
gammaloop-nextest-core> 13: std[bcb96dfbba0ab899]::sys::backtrace::__rust_begin_short_backtrace::<test[75d6903177b1d7e9]::run_test::{closure#1}, ()> <unknown>
43.11 s
gammaloop-nextest-core> at <unknown source file> :<unknown line>
43.11 s
gammaloop-nextest-core> 14: <std[bcb96dfbba0ab899]::thread::lifecycle::spawn_unchecked<test[75d6903177b1d7e9]::run_test::{closure#1}, ()>::{closure#1} as core[940e698046960fd5]::ops::function::FnOnce<()>>::call_once::{shim:vtable#0} <unknown>
43.11 s
gammaloop-nextest-core> at <unknown source file> :<unknown line>
43.11 s
gammaloop-nextest-core> 15: <std[bcb96dfbba0ab899]::sys::thread::unix::Thread>::new::thread_start <unknown>
43.11 s
gammaloop-nextest-core> at <unknown source file> :<unknown line>
43.11 s
gammaloop-nextest-core> 16: start_thread <unknown>
43.11 s
gammaloop-nextest-core> at <unknown source file> :<unknown line>
43.11 s
gammaloop-nextest-core> 17: __clone3 <unknown>
43.11 s
gammaloop-nextest-core> at <unknown source file> :<unknown line>
43.11 s
gammaloop-nextest-core>
43.11 s
gammaloop-nextest-core> Run with COLORBT_SHOW_HIDDEN=1 environment variable to disable frame filtering.
43.11 s
gammaloop-nextest-core> Run with RUST_BACKTRACE=full to include source snippets.
43.11 s
gammaloop-nextest-core>
43.19 s
gammaloop-nextest-core> error : test run failed
43.24 s
gammaloop-nextest-core>
43.24 s
gammaloop-nextest-core> ========== nextest test summary ==========
43.24 s
gammaloop-nextest-core> report: target/nextest/ci_gammaloop/junit.xml
43.24 s
gammaloop-nextest-core> tests: 456, failures: 2, errors: 0
43.24 s
gammaloop-nextest-core>
43.24 s
gammaloop-nextest-core> 1. gammalooprs::graph::parse::tests::parse_lmbsetting_crossection
43.24 s
gammaloop-nextest-core> failure: test failure with exit code 101
43.24 s
gammaloop-nextest-core> system-out
43.24 s
gammaloop-nextest-core> running 1 test
43.24 s
gammaloop-nextest-core> ━━━━━━━━━━━━━━━━━━━━━━━━━━━━━━━ Snapshot Summary ━━━━━━━━━━━━━━━━━━━━━━━━━━━━━━━
43.24 s
gammaloop-nextest-core> Snapshot: parse_lmbsetting_crossection
43.24 s
gammaloop-nextest-core> Source: crates/gammalooprs/src/graph/parse/tests.rs:252
43.24 s
gammaloop-nextest-core> ────────────────────────────────────────────────────────────────────────────────
43.24 s
gammaloop-nextest-core> Expression: g.debug_dot()
43.24 s
gammaloop-nextest-core> ────────────────────────────────────────────────────────────────────────────────
43.24 s
gammaloop-nextest-core> -old snapshot
43.24 s
gammaloop-nextest-core> +new results
43.24 s
gammaloop-nextest-core> ────────────┬───────────────────────────────────────────────────────────────────
43.24 s
gammaloop-nextest-core> 1 │-digraph G{
43.24 s
gammaloop-nextest-core> 1 │+digraph G {
43.24 s
gammaloop-nextest-core> 2 2 │ num = "1/2";
43.24 s
gammaloop-nextest-core> 3 3 │ overall_factor = "2*x";
43.24 s
gammaloop-nextest-core> 4 4 │ overall_factor_evaluated = "2*x";
43.24 s
gammaloop-nextest-core> 5 5 │ projector = "spenso::t";
43.24 s
gammaloop-nextest-core> ────────────┴───────────────────────────────────────────────────────────────────
43.24 s
gammaloop-nextest-core> To update snapshots run `cargo insta review`
43.24 s
gammaloop-nextest-core> Stopped on the first failure. Run `cargo insta test` to run all snapshots.
43.24 s
gammaloop-nextest-core> test graph::parse::tests::parse_lmbsetting_crossection ... FAILED
43.24 s
gammaloop-nextest-core>
43.24 s
gammaloop-nextest-core> failures:
43.24 s
gammaloop-nextest-core>
43.24 s
gammaloop-nextest-core> failures:
43.24 s
gammaloop-nextest-core> graph::parse::tests::parse_lmbsetting_crossection
43.24 s
gammaloop-nextest-core>
43.24 s
gammaloop-nextest-core> test result: FAILED. 0 passed; 1 failed; 0 ignored; 0 measured; 508 filtered out; finished in 0.30s
43.24 s
gammaloop-nextest-core> system-err
43.24 s
gammaloop-nextest-core> [20:20:08.931] @gammalooprs::graph::attribute_warnings WARNING : Unknown node attribute 'color_num' on graph 'G', node 'A'; did you mean 'num'?
43.24 s
gammaloop-nextest-core> at crates/gammalooprs/src/graph/attribute_warnings.rs:198
43.24 s
gammaloop-nextest-core> The application panicked (crashed).
43.24 s
gammaloop-nextest-core> Message: snapshot assertion for 'parse_lmbsetting_crossection' failed in line 252
43.24 s
gammaloop-nextest-core> Location: /nix/store/xdy1vvhll2bijdplvl9fcc2b9plkxhaa-vendor-cargo-deps/c19b7c6f923b580ac259164a89f2577984ad5ab09ee9d583b888f934adbbe8d0/insta-1.47.2/src/runtime.rs:719
43.24 s
gammaloop-nextest-core>
43.24 s
gammaloop-nextest-core> ━━━━━━━━━━━━━━━━━━━━━━━━━━━━━━━━━━ BACKTRACE ━━━━━━━━━━━━━━━━━━━━━━━━━━━━━━━━━━━
43.24 s
gammaloop-nextest-core> 1: <color_eyre[b0c9e66060e883b2]::config::PanicHook>::panic_report<unknown>
43.24 s
gammaloop-nextest-core> at <unknown source file>:<unknown line>
43.24 s
gammaloop-nextest-core> 2: <color_eyre[b0c9e66060e883b2]::config::PanicHook>::into_panic_hook::{closure#0}<unknown>
43.24 s
gammaloop-nextest-core> at <unknown source file>:<unknown line>
43.24 s
gammaloop-nextest-core> 3: std[bcb96dfbba0ab899]::panicking::panic_with_hook<unknown>
43.24 s
gammaloop-nextest-core> at <unknown source file>:<unknown line>
43.24 s
gammaloop-nextest-core> 4: std[bcb96dfbba0ab899]::panicking::panic_handler::{closure#0}<unknown>
43.24 s
gammaloop-nextest-core> at <unknown source file>:<unknown line>
43.24 s
gammaloop-nextest-core> 5: std[bcb96dfbba0ab899]::sys::backtrace::__rust_end_short_backtrace::<std[bcb96dfbba0ab899]::panicking::panic_handler::{closure#0}, !><unknown>
43.24 s
gammaloop-nextest-core> at <unknown source file>:<unknown line>
43.24 s
gammaloop-nextest-core> 6: __rustc[6c289b9f9c454d21]::rust_begin_unwind<unknown>
43.24 s
gammaloop-nextest-core> at <unknown source file>:<unknown line>
43.24 s
gammaloop-nextest-core> 7: core[940e698046960fd5]::panicking::panic_fmt<unknown>
43.24 s
gammaloop-nextest-core> at <unknown source file>:<unknown line>
43.24 s
gammaloop-nextest-core> 8: insta[307a548ac79ef4d9]::runtime::assert_snapshot<unknown>
43.24 s
gammaloop-nextest-core> at <unknown source file>:<unknown line>
43.24 s
gammaloop-nextest-core> 9: gammalooprs[5490727360442cce]::graph::parse::tests::parse_lmbsetting_crossection<unknown>
43.24 s
gammaloop-nextest-core> at <unknown source file>:<unknown line>
43.24 s
gammaloop-nextest-core> 10: <gammalooprs[5490727360442cce]::graph::parse::tests::parse_lmbsetting_crossection::{closure#0} as core[940e698046960fd5]::ops::function::FnOnce<()>>::call_once<unknown>
43.24 s
gammaloop-nextest-core> at <unknown source file>:<unknown line>
43.24 s
gammaloop-nextest-core> 11: test[75d6903177b1d7e9]::__rust_begin_short_backtrace::<core[940e698046960fd5]::result::Result<(), alloc[2ea6bcb46fca0c42]::string::String>, fn() -> core[940e698046960fd5]::result::Result<(), alloc[2ea6bcb46fca0c42]::string::String>><unknown>
43.24 s
gammaloop-nextest-core> at <unknown source file>:<unknown line>
43.24 s
gammaloop-nextest-core> 12: test[75d6903177b1d7e9]::run_test::{closure#0}<unknown>
43.24 s
gammaloop-nextest-core> at <unknown source file>:<unknown line>
43.24 s
gammaloop-nextest-core> 13: std[bcb96dfbba0ab899]::sys::backtrace::__rust_begin_short_backtrace::<test[75d6903177b1d7e9]::run_test::{closure#1}, ()><unknown>
43.24 s
gammaloop-nextest-core> at <unknown source file>:<unknown line>
43.24 s
gammaloop-nextest-core> 14: <std[bcb96dfbba0ab899]::thread::lifecycle::spawn_unchecked<test[75d6903177b1d7e9]::run_test::{closure#1}, ()>::{closure#1} as core[940e698046960fd5]::ops::function::FnOnce<()>>::call_once::{shim:vtable#0}<unknown>
43.24 s
gammaloop-nextest-core> at <unknown source file>:<unknown line>
43.24 s
gammaloop-nextest-core> 15: <std[bcb96dfbba0ab899]::sys::thread::unix::Thread>::new::thread_start<unknown>
43.24 s
gammaloop-nextest-core> at <unknown source file>:<unknown line>
43.24 s
gammaloop-nextest-core> 16: start_thread<unknown>
43.24 s
gammaloop-nextest-core> at <unknown source file>:<unknown line>
43.24 s
gammaloop-nextest-core> 17: __clone3<unknown>
43.24 s
gammaloop-nextest-core> at <unknown source file>:<unknown line>
43.24 s
gammaloop-nextest-core>
43.24 s
gammaloop-nextest-core> Run with COLORBT_SHOW_HIDDEN=1 environment variable to disable frame filtering.
43.24 s
gammaloop-nextest-core> Run with RUST_BACKTRACE=full to include source snippets.
43.24 s
gammaloop-nextest-core>
43.24 s
gammaloop-nextest-core> 2. gammalooprs::uv::export::tests::computed_node_full_numerator_is_a_spenso_aware_typst_fragment
43.24 s
gammaloop-nextest-core> failure: test failure with exit code 101
43.24 s
gammaloop-nextest-core> system-out
43.24 s
gammaloop-nextest-core> running 1 test
43.24 s
gammaloop-nextest-core> test uv::export::tests::computed_node_full_numerator_is_a_spenso_aware_typst_fragment ... FAILED
43.24 s
gammaloop-nextest-core>
43.24 s
gammaloop-nextest-core> failures:
43.24 s
gammaloop-nextest-core>
43.24 s
gammaloop-nextest-core> failures:
43.24 s
gammaloop-nextest-core> uv::export::tests::computed_node_full_numerator_is_a_spenso_aware_typst_fragment
43.24 s
gammaloop-nextest-core>
43.24 s
gammaloop-nextest-core> test result: FAILED. 0 passed; 1 failed; 0 ignored; 0 measured; 508 filtered out; finished in 0.87s
43.24 s
gammaloop-nextest-core> system-err
43.24 s
gammaloop-nextest-core> The application panicked (crashed).
43.24 s
gammaloop-nextest-core> Message: assertion failed: exported.dot.contains(r#"full_num = "op(\"Tr\")(1)";"#)
43.24 s
gammaloop-nextest-core> Location: crates/gammalooprs/src/uv/export.rs:483
43.24 s
gammaloop-nextest-core>
43.24 s
gammaloop-nextest-core> ━━━━━━━━━━━━━━━━━━━━━━━━━━━━━━━━━━ BACKTRACE ━━━━━━━━━━━━━━━━━━━━━━━━━━━━━━━━━━━
43.24 s
gammaloop-nextest-core> 1: <color_eyre[b0c9e66060e883b2]::config::PanicHook>::panic_report<unknown>
43.24 s
gammaloop-nextest-core> at <unknown source file>:<unknown line>
43.24 s
gammaloop-nextest-core> 2: <color_eyre[b0c9e66060e883b2]::config::PanicHook>::into_panic_hook::{closure#0}<unknown>
43.24 s
gammaloop-nextest-core> at <unknown source file>:<unknown line>
43.24 s
gammaloop-nextest-core> 3: std[bcb96dfbba0ab899]::panicking::panic_with_hook<unknown>
43.24 s
gammaloop-nextest-core> at <unknown source file>:<unknown line>
43.24 s
gammaloop-nextest-core> 4: std[bcb96dfbba0ab899]::panicking::panic_handler::{closure#0}<unknown>
43.24 s
gammaloop-nextest-core> at <unknown source file>:<unknown line>
43.24 s
gammaloop-nextest-core> 5: std[bcb96dfbba0ab899]::sys::backtrace::__rust_end_short_backtrace::<std[bcb96dfbba0ab899]::panicking::panic_handler::{closure#0}, !><unknown>
43.24 s
gammaloop-nextest-core> at <unknown source file>:<unknown line>
43.24 s
gammaloop-nextest-core> 6: __rustc[6c289b9f9c454d21]::rust_begin_unwind<unknown>
43.24 s
gammaloop-nextest-core> at <unknown source file>:<unknown line>
43.24 s
gammaloop-nextest-core> 7: core[940e698046960fd5]::panicking::panic_fmt<unknown>
43.24 s
gammaloop-nextest-core> at <unknown source file>:<unknown line>
43.24 s
gammaloop-nextest-core> 8: core[940e698046960fd5]::panicking::panic<unknown>
43.24 s
gammaloop-nextest-core> at <unknown source file>:<unknown line>
43.24 s
gammaloop-nextest-core> 9: gammalooprs[5490727360442cce]::uv::export::tests::computed_node_full_numerator_is_a_spenso_aware_typst_fragment<unknown>
43.24 s
gammaloop-nextest-core> at <unknown source file>:<unknown line>
43.24 s
gammaloop-nextest-core> 10: <gammalooprs[5490727360442cce]::uv::export::tests::computed_node_full_numerator_is_a_spenso_aware_typst_fragment::{closure#0} as core[940e698046960fd5]::ops::function::FnOnce<()>>::call_once<unknown>
43.24 s
gammaloop-nextest-core> at <unknown source file>:<unknown line>
43.24 s
gammaloop-nextest-core> 11: test[75d6903177b1d7e9]::__rust_begin_short_backtrace::<core[940e698046960fd5]::result::Result<(), alloc[2ea6bcb46fca0c42]::string::String>, fn() -> core[940e698046960fd5]::result::Result<(), alloc[2ea6bcb46fca0c42]::string::String>><unknown>
43.24 s
gammaloop-nextest-core> at <unknown source file>:<unknown line>
43.24 s
gammaloop-nextest-core> 12: test[75d6903177b1d7e9]::run_test::{closure#0}<unknown>
43.24 s
gammaloop-nextest-core> at <unknown source file>:<unknown line>
43.24 s
gammaloop-nextest-core> 13: std[bcb96dfbba0ab899]::sys::backtrace::__rust_begin_short_backtrace::<test[75d6903177b1d7e9]::run_test::{closure#1}, ()><unknown>
43.24 s
gammaloop-nextest-core> at <unknown source file>:<unknown line>
43.24 s
gammaloop-nextest-core> 14: <std[bcb96dfbba0ab899]::thread::lifecycle::spawn_unchecked<test[75d6903177b1d7e9]::run_test::{closure#1}, ()>::{closure#1} as core[940e698046960fd5]::ops::function::FnOnce<()>>::call_once::{shim:vtable#0}<unknown>
43.24 s
gammaloop-nextest-core> at <unknown source file>:<unknown line>
43.24 s
gammaloop-nextest-core> 15: <std[bcb96dfbba0ab899]::sys::thread::unix::Thread>::new::thread_start<unknown>
43.24 s
gammaloop-nextest-core> at <unknown source file>:<unknown line>
43.24 s
gammaloop-nextest-core> 16: start_thread<unknown>
43.24 s
gammaloop-nextest-core> at <unknown source file>:<unknown line>
43.24 s
gammaloop-nextest-core> 17: __clone3<unknown>
43.24 s
gammaloop-nextest-core> at <unknown source file>:<unknown line>
43.24 s
gammaloop-nextest-core>
43.24 s
gammaloop-nextest-core> Run with COLORBT_SHOW_HIDDEN=1 environment variable to disable frame filtering.
43.24 s
gammaloop-nextest-core> Run with RUST_BACKTRACE=full to include source snippets.
43.24 s
gammaloop-nextest-core> =========================================
43.31 s
[0 built (1 failed ), 0.0 error: Cannot build '/nix/store/07lma8g6p1n7jxf8azmxf90ca6pqjydj-gammaloop-nextest-core.drv '.
43.31 s
Reason: builder failed with exit code 100 .
43.31 s
Output paths:
43.31 s
/nix/store/cb0qr129ypswd8fgpp9k932nrjfvk3s0-gammaloop-nextest-core
43.31 s
Last 612 log lines:
43.31 s
> Extracting 3 binaries (including 1 non-test binary), 1 build script output directory, and 2 linked paths to /build/nextest-archive-OVo6qM
43.31 s
> Extracted 18 files to /build/nextest-archive-OVo6qM in 0.56s
43.31 s
> ------------
43.31 s
> Nextest run ID 8c0b1aa5-f25b-4263-ad40-1545c533ffec with nextest profile: ci_gammaloop
43.31 s
> Starting 339 tests across 2 binaries
43.31 s
> FAIL [ 0.049s] (248/339) gammaloop-api repl::tests :: completion_shows_type_hint_for_non_boolean_settings_leaf
43.31 s
> stdout ---
43.31 s
>
43.31 s
> running 1 test
43.31 s
> test repl::tests::completion_shows_type_hint_for_non_boolean_settings_leaf ... FAILED
43.31 s
>
43.31 s
> failures:
43.31 s
>
43.31 s
> failures:
43.31 s
> repl::tests::completion_shows_type_hint_for_non_boolean_settings_leaf
43.31 s
>
43.31 s
> test result: FAILED. 0 passed; 1 failed; 0 ignored; 0 measured; 338 filtered out; finished in 0.02s
43.31 s
>
43.31 s
> stderr ---
43.31 s
>
43.31 s
> thread 'repl::tests::completion_shows_type_hint_for_non_boolean_settings_leaf' (777) panicked at crates/gammaloop-api/src/repl.rs:5778:9:
43.31 s
> [Suggestion { value: "", description: Some("Number of samples in the first Monte Carlo iteration."), style: None, extra: None, span: Span { start: 42, end: 42 }, append_whitespace: false }]
43.31 s
> stack backtrace:
43.31 s
> 0: __rustc::rust_begin_unwind
43.31 s
> 1: core::panicking::panic_fmt
43.31 s
> 2: gammaloop_api::repl::tests::completion_shows_type_hint_for_non_boolean_settings_leaf
43.31 s
> 3: <gammaloop_api::repl::tests::completion_shows_type_hint_for_non_boolean_settings_leaf::{closure#0} as core::ops::function::FnOnce<()>>::call_once
43.31 s
> note: Some details are omitted, run with `RUST_BACKTRACE=full` for a verbose backtrace.
43.31 s
>
43.31 s
> FAIL [ 0.029s] (275/339) gammaloop-api templates::tests :: extract_templates_uses_canonical_package_layout
43.31 s
> stdout ---
43.31 s
>
43.31 s
> running 1 test
43.31 s
> test templates::tests::extract_templates_uses_canonical_package_layout ... FAILED
43.31 s
>
43.31 s
> failures:
43.31 s
>
43.31 s
> failures:
43.31 s
> templates::tests::extract_templates_uses_canonical_package_layout
43.31 s
>
43.31 s
> test result: FAILED. 0 passed; 1 failed; 0 ignored; 0 measured; 338 filtered out; finished in 0.02s
43.31 s
>
43.31 s
> stderr ---
43.31 s
>
43.31 s
> thread 'templates::tests::extract_templates_uses_canonical_package_layout' (876) panicked at crates/gammaloop-api/src/templates.rs:99:9:
43.31 s
> assertion failed: figure.contains("amplitude-mode")
43.31 s
> stack backtrace:
43.31 s
> 0: __rustc::rust_begin_unwind
43.31 s
> 1: core::panicking::panic_fmt
43.31 s
> 2: core::panicking::panic
43.31 s
> 3: gammaloop_api::templates::tests::extract_templates_uses_canonical_package_layout
43.31 s
> 4: <gammaloop_api::templates::tests::extract_templates_uses_canonical_package_layout::{closure#0} as core::ops::function::FnOnce<()>>::call_once
43.31 s
> note: Some details are omitted, run with `RUST_BACKTRACE=full` for a verbose backtrace.
43.31 s
>
43.31 s
> ------------
43.31 s
> Summary [ 1.000s] 339 tests run: 337 passed , 2 failed , 0 skipped
43.31 s
> FAIL [ 0.049s] (248/339) gammaloop-api repl::tests :: completion_shows_type_hint_for_non_boolean_settings_leaf
43.31 s
> stdout ---
43.31 s
>
43.31 s
> running 1 test
43.31 s
> test repl::tests::completion_shows_type_hint_for_non_boolean_settings_leaf ... FAILED
43.31 s
>
43.31 s
> failures:
43.31 s
>
43.31 s
> failures:
43.31 s
> repl::tests::completion_shows_type_hint_for_non_boolean_settings_leaf
43.31 s
>
43.31 s
> test result: FAILED. 0 passed; 1 failed; 0 ignored; 0 measured; 338 filtered out; finished in 0.02s
43.31 s
>
43.31 s
> stderr ---
43.31 s
>
43.31 s
> thread 'repl::tests::completion_shows_type_hint_for_non_boolean_settings_leaf' (777) panicked at crates/gammaloop-api/src/repl.rs:5778:9:
43.31 s
> [Suggestion { value: "", description: Some("Number of samples in the first Monte Carlo iteration."), style: None, extra: None, span: Span { start: 42, end: 42 }, append_whitespace: false }]
43.31 s
> stack backtrace:
43.31 s
> 0: __rustc::rust_begin_unwind
43.31 s
> 1: core::panicking::panic_fmt
43.31 s
> 2: gammaloop_api::repl::tests::completion_shows_type_hint_for_non_boolean_settings_leaf
43.31 s
> 3: <gammaloop_api::repl::tests::completion_shows_type_hint_for_non_boolean_settings_leaf::{closure#0} as core::ops::function::FnOnce<()>>::call_once
43.31 s
> note: Some details are omitted, run with `RUST_BACKTRACE=full` for a verbose backtrace.
43.31 s
>
43.31 s
> FAIL [ 0.029s] (275/339) gammaloop-api templates::tests :: extract_templates_uses_canonical_package_layout
43.31 s
> stdout ---
43.31 s
>
43.31 s
> running 1 test
43.31 s
> test templates::tests::extract_templates_uses_canonical_package_layout ... FAILED
43.31 s
>
43.31 s
> failures:
43.31 s
>
43.31 s
> failures:
43.31 s
> templates::tests::extract_templates_uses_canonical_package_layout
43.31 s
>
43.31 s
> test result: FAILED. 0 passed; 1 failed; 0 ignored; 0 measured; 338 filtered out; finished in 0.02s
43.31 s
>
43.31 s
> stderr ---
43.31 s
>
43.31 s
> thread 'templates::tests::extract_templates_uses_canonical_package_layout' (876) panicked at crates/gammaloop-api/src/templates.rs:99:9:
43.31 s
> assertion failed: figure.contains("amplitude-mode")
43.31 s
> stack backtrace:
43.31 s
> 0: __rustc::rust_begin_unwind
43.31 s
> 1: core::panicking::panic_fmt
43.31 s
> 2: core::panicking::panic
43.31 s
> 3: gammaloop_api::templates::tests::extract_templates_uses_canonical_package_layout
43.31 s
> 4: <gammaloop_api::templates::tests::extract_templates_uses_canonical_package_layout::{closure#0} as core::ops::function::FnOnce<()>>::call_once
43.31 s
> note: Some details are omitted, run with `RUST_BACKTRACE=full` for a verbose backtrace.
43.31 s
>
43.31 s
> error : test run failed
43.31 s
>
43.31 s
> ========== nextest test summary ==========
43.31 s
> report: target/nextest/ci_gammaloop/junit.xml
43.31 s
> tests: 339, failures: 2, errors: 0
43.31 s
>
43.31 s
> 1. gammaloop-api::repl::tests::completion_shows_type_hint_for_non_boolean_settings_leaf
43.31 s
> failure: test failure with exit code 101
43.31 s
> thread 'repl::tests::completion_shows_type_hint_for_non_boolean_settings_leaf' (777) panicked at crates/gammaloop-api/src/repl.rs:5778:9:
43.31 s
> [Suggestion { value: "", description: Some("Number of samples in the first Monte Carlo iteration."), style: None, extra: None, span: Span { start: 42, end: 42 }, append_whitespace: false }]
43.31 s
> stack backtrace:
43.31 s
> 0: __rustc::rust_begin_unwind
43.31 s
> 1: core::panicking::panic_fmt
43.31 s
> 2: gammaloop_api::repl::tests::completion_shows_type_hint_for_non_boolean_settings_leaf
43.31 s
> 3: <gammaloop_api::repl::tests::completion_shows_type_hint_for_non_boolean_settings_leaf::{closure#0} as core::ops::function::FnOnce<()>>::call_once
43.31 s
> note: Some details are omitted, run with `RUST_BACKTRACE=full` for a verbose backtrace.
43.31 s
> system-out
43.31 s
> running 1 test
43.31 s
> test repl::tests::completion_shows_type_hint_for_non_boolean_settings_leaf ... FAILED
43.31 s
>
43.31 s
> failures:
43.31 s
>
43.31 s
> failures:
43.31 s
> repl::tests::completion_shows_type_hint_for_non_boolean_settings_leaf
43.31 s
>
43.31 s
> test result: FAILED. 0 passed; 1 failed; 0 ignored; 0 measured; 338 filtered out; finished in 0.02s
43.31 s
> system-err
43.31 s
> thread 'repl::tests::completion_shows_type_hint_for_non_boolean_settings_leaf' (777) panicked at crates/gammaloop-api/src/repl.rs:5778:9:
43.31 s
> [Suggestion { value: "", description: Some("Number of samples in the first Monte Carlo iteration."), style: None, extra: None, span: Span { start: 42, end: 42 }, append_whitespace: false }]
43.31 s
> stack backtrace:
43.31 s
> 0: __rustc::rust_begin_unwind
43.31 s
> 1: core::panicking::panic_fmt
43.31 s
> 2: gammaloop_api::repl::tests::completion_shows_type_hint_for_non_boolean_settings_leaf
43.31 s
> 3: <gammaloop_api::repl::tests::completion_shows_type_hint_for_non_boolean_settings_leaf::{closure#0} as core::ops::function::FnOnce<()>>::call_once
43.31 s
> note: Some details are omitted, run with `RUST_BACKTRACE=full` for a verbose backtrace.
43.31 s
>
43.31 s
> 2. gammaloop-api::templates::tests::extract_templates_uses_canonical_package_layout
43.31 s
> failure: test failure with exit code 101
43.31 s
> thread 'templates::tests::extract_templates_uses_canonical_package_layout' (876) panicked at crates/gammaloop-api/src/templates.rs:99:9:
43.31 s
> assertion failed: figure.contains("amplitude-mode")
43.31 s
> stack backtrace:
43.31 s
> 0: __rustc::rust_begin_unwind
43.31 s
> 1: core::panicking::panic_fmt
43.31 s
> 2: core::panicking::panic
43.31 s
> 3: gammaloop_api::templates::tests::extract_templates_uses_canonical_package_layout
43.31 s
> 4: <gammaloop_api::templates::tests::extract_templates_uses_canonical_package_layout::{closure#0} as core::ops::function::FnOnce<()>>::call_once
43.31 s
> note: Some details are omitted, run with `RUST_BACKTRACE=full` for a verbose backtrace.
43.31 s
> system-out
43.31 s
> running 1 test
43.31 s
> test templates::tests::extract_templates_uses_canonical_package_layout ... FAILED
43.31 s
>
43.31 s
> failures:
43.31 s
>
43.31 s
> failures:
43.31 s
> templates::tests::extract_templates_uses_canonical_package_layout
43.31 s
>
43.31 s
> test result: FAILED. 0 passed; 1 failed; 0 ignored; 0 measured; 338 filtered out; finished in 0.02s
43.31 s
> system-err
43.31 s
> thread 'templates::tests::extract_templates_uses_canonical_package_layout' (876) panicked at crates/gammaloop-api/src/templates.rs:99:9:
43.31 s
> assertion failed: figure.contains("amplitude-mode")
43.31 s
> stack backtrace:
43.31 s
> 0: __rustc::rust_begin_unwind
43.31 s
> 1: core::panicking::panic_fmt
43.31 s
> 2: core::panicking::panic
43.31 s
> 3: gammaloop_api::templates::tests::extract_templates_uses_canonical_package_layout
43.31 s
> 4: <gammaloop_api::templates::tests::extract_templates_uses_canonical_package_layout::{closure#0} as core::ops::function::FnOnce<()>>::call_once
43.31 s
> note: Some details are omitted, run with `RUST_BACKTRACE=full` for a verbose backtrace.
43.31 s
> =========================================
43.31 s
> Extracting 1 binary and 1 linked path to /build/nextest-archive-ZtiFdd
43.31 s
> Extracted 7 files to /build/nextest-archive-ZtiFdd in 0.10s
43.31 s
> ------------
43.31 s
> Nextest run ID 592ce6b0-6815-408d-a38e-b572d07df22d with nextest profile: ci_gammaloop
43.31 s
> Starting 19 tests across 1 binary
43.31 s
> ------------
43.31 s
> Summary [ 0.033s] 19 tests run: 19 passed , 0 skipped
43.31 s
>
43.31 s
> ========== nextest test summary ==========
43.31 s
> report: target/nextest/ci_gammaloop/junit.xml
43.31 s
> tests: 19, failures: 0, errors: 0
43.31 s
> No failing testcases found.
43.31 s
> =========================================
43.31 s
> Extracting 1 binary to /build/nextest-archive-dNTt94
43.31 s
> Extracted 4 files to /build/nextest-archive-dNTt94 in 0.06s
43.31 s
> ------------
43.31 s
> Nextest run ID 1c65cbae-6aa9-45c1-8059-71a920916a6e with nextest profile: ci_gammaloop
43.31 s
> Starting 0 tests across 1 binary
43.31 s
> ------------
43.31 s
> Summary [ 0.005s] 0 tests run: 0 passed , 0 skipped
43.31 s
>
43.31 s
> ========== nextest test summary ==========
43.31 s
> report: target/nextest/ci_gammaloop/junit.xml
43.31 s
> tests: 0, failures: 0, errors: 0
43.31 s
> No failing testcases found.
43.31 s
> =========================================
43.31 s
> Extracting 4 binaries, 1 build script output directory, and 2 linked paths to /build/nextest-archive-kmQ3Jp
43.31 s
> Extracted 18 files to /build/nextest-archive-kmQ3Jp in 0.59s
43.31 s
> ------------
43.31 s
> Nextest run ID fb959dde-2853-4425-9800-4e145098a14a with nextest profile: ci_gammaloop
43.31 s
> Starting 456 tests across 4 binaries (61 tests skipped , including 60 tests via profile.ci_gammaloop.default-filter )
43.31 s
> FAIL [ 0.417s] (126/456) gammalooprs graph::parse::tests :: parse_lmbsetting_crossection
43.31 s
> stdout ---
43.31 s
>
43.31 s
> running 1 test
43.31 s
> ━━━━━━━━━━━━━━━━━━━━━━━━━━━━━━━ Snapshot Summary ━━━━━━━━━━━━━━━━━━━━━━━━━━━━━━━
43.31 s
> Snapshot: parse_lmbsetting_crossection
43.31 s
> Source: crates/gammalooprs/src/graph/parse/tests.rs:252
43.31 s
> ────────────────────────────────────────────────────────────────────────────────
43.31 s
> Expression: g.debug_dot()
43.31 s
> ────────────────────────────────────────────────────────────────────────────────
43.31 s
> -old snapshot
43.31 s
> +new results
43.31 s
> ────────────┬───────────────────────────────────────────────────────────────────
43.31 s
> 1 │-digraph G{
43.31 s
> 1 │+digraph G {
43.31 s
> 2 2 │ num = "1/2";
43.31 s
> 3 3 │ overall_factor = "2*x";
43.31 s
> 4 4 │ overall_factor_evaluated = "2*x";
43.31 s
> 5 5 │ projector = "spenso::t";
43.31 s
> ────────────┴───────────────────────────────────────────────────────────────────
43.31 s
> To update snapshots run `cargo insta review`
43.31 s
> Stopped on the first failure. Run `cargo insta test` to run all snapshots.
43.31 s
> test graph::parse::tests::parse_lmbsetting_crossection ... FAILED
43.31 s
>
43.31 s
> failures:
43.31 s
>
43.31 s
> failures:
43.31 s
> graph::parse::tests::parse_lmbsetting_crossection
43.31 s
>
43.31 s
> test result: FAILED. 0 passed; 1 failed; 0 ignored; 0 measured; 508 filtered out; finished in 0.30s
43.31 s
>
43.31 s
> stderr ---
43.31 s
> [20:20:08.931] @gammalooprs::graph::attribute_warnings WARNING : Unknown node attribute 'color_num' on graph 'G', node 'A'; did you mean 'num'?
43.31 s
> at crates/gammalooprs/src/graph/attribute_warnings.rs:198
43.31 s
> The application panicked (crashed).
43.31 s
> Message: snapshot assertion for 'parse_lmbsetting_crossection' failed in line 252
43.31 s
> Location: /nix/store/xdy1vvhll2bijdplvl9fcc2b9plkxhaa-vendor-cargo-deps/c19b7c6f923b580ac259164a89f2577984ad5ab09ee9d583b888f934adbbe8d0/insta-1.47.2/src/runtime.rs :719
43.31 s
>
43.31 s
> ━━━━━━━━━━━━━━━━━━━━━━━━━━━━━━━━━━ BACKTRACE ━━━━━━━━━━━━━━━━━━━━━━━━━━━━━━━━━━━
43.31 s
> 1: <color_eyre[b0c9e66060e883b2]::config::PanicHook>::panic_report <unknown>
43.31 s
> at <unknown source file> :<unknown line>
43.31 s
> 2: <color_eyre[b0c9e66060e883b2]::config::PanicHook>::into_panic_hook::{closure#0} <unknown>
43.31 s
> at <unknown source file> :<unknown line>
43.31 s
> 3: std[bcb96dfbba0ab899]::panicking::panic_with_hook <unknown>
43.31 s
> at <unknown source file> :<unknown line>
43.31 s
> 4: std[bcb96dfbba0ab899]::panicking::panic_handler::{closure#0} <unknown>
43.31 s
> at <unknown source file> :<unknown line>
43.31 s
> 5: std[bcb96dfbba0ab899]::sys::backtrace::__rust_end_short_backtrace::<std[bcb96dfbba0ab899]::panicking::panic_handler::{closure#0}, !> <unknown>
43.31 s
> at <unknown source file> :<unknown line>
43.31 s
> 6: __rustc[6c289b9f9c454d21]::rust_begin_unwind <unknown>
43.31 s
> at <unknown source file> :<unknown line>
43.31 s
> 7: core[940e698046960fd5]::panicking::panic_fmt <unknown>
43.31 s
> at <unknown source file> :<unknown line>
43.31 s
> 8: insta[307a548ac79ef4d9]::runtime::assert_snapshot <unknown>
43.31 s
> at <unknown source file> :<unknown line>
43.31 s
> 9: gammalooprs[5490727360442cce]::graph::parse::tests::parse_lmbsetting_crossection <unknown>
43.31 s
> at <unknown source file> :<unknown line>
43.31 s
> 10: <gammalooprs[5490727360442cce]::graph::parse::tests::parse_lmbsetting_crossection::{closure#0} as core[940e698046960fd5]::ops::function::FnOnce<()>>::call_once <unknown>
43.31 s
> at <unknown source file> :<unknown line>
43.31 s
> 11: test[75d6903177b1d7e9]::__rust_begin_short_backtrace::<core[940e698046960fd5]::result::Result<(), alloc[2ea6bcb46fca0c42]::string::String>, fn() -> core[940e698046960fd5]::result::Result<(), alloc[2ea6bcb46fca0c42]::string::String>> <unknown>
43.31 s
> at <unknown source file> :<unknown line>
43.31 s
> 12: test[75d6903177b1d7e9]::run_test::{closure#0} <unknown>
43.31 s
> at <unknown source file> :<unknown line>
43.31 s
> 13: std[bcb96dfbba0ab899]::sys::backtrace::__rust_begin_short_backtrace::<test[75d6903177b1d7e9]::run_test::{closure#1}, ()> <unknown>
43.31 s
> at <unknown source file> :<unknown line>
43.31 s
> 14: <std[bcb96dfbba0ab899]::thread::lifecycle::spawn_unchecked<test[75d6903177b1d7e9]::run_test::{closure#1}, ()>::{closure#1} as core[940e698046960fd5]::ops::function::FnOnce<()>>::call_once::{shim:vtable#0} <unknown>
43.31 s
> at <unknown source file> :<unknown line>
43.31 s
> 15: <std[bcb96dfbba0ab899]::sys::thread::unix::Thread>::new::thread_start <unknown>
43.31 s
> at <unknown source file> :<unknown line>
43.31 s
> 16: start_thread <unknown>
43.31 s
> at <unknown source file> :<unknown line>
43.31 s
> 17: __clone3 <unknown>
43.31 s
> at <unknown source file> :<unknown line>
43.31 s
>
43.31 s
> Run with COLORBT_SHOW_HIDDEN=1 environment variable to disable frame filtering.
43.31 s
> Run with RUST_BACKTRACE=full to include source snippets.
43.31 s
>
43.31 s
> FAIL [ 0.903s] (434/456) gammalooprs uv::export::tests :: computed_node_full_numerator_is_a_spenso_aware_typst_fragment
43.31 s
> stdout ---
43.31 s
>
43.31 s
> running 1 test
43.31 s
> test uv::export::tests::computed_node_full_numerator_is_a_spenso_aware_typst_fragment ... FAILED
43.31 s
>
43.31 s
> failures:
43.31 s
>
43.31 s
> failures:
43.31 s
> uv::export::tests::computed_node_full_numerator_is_a_spenso_aware_typst_fragment
43.31 s
>
43.31 s
> test result: FAILED. 0 passed; 1 failed; 0 ignored; 0 measured; 508 filtered out; finished in 0.87s
43.31 s
>
43.31 s
> stderr ---
43.31 s
> The application panicked (crashed).
43.31 s
> Message: assertion failed: exported.dot.contains(r#"full_num = "op(\"Tr\")(1)";"#)
43.31 s
> Location: crates/gammalooprs/src/uv/export.rs :483
43.31 s
>
43.31 s
> ━━━━━━━━━━━━━━━━━━━━━━━━━━━━━━━━━━ BACKTRACE ━━━━━━━━━━━━━━━━━━━━━━━━━━━━━━━━━━━
43.31 s
> 1: <color_eyre[b0c9e66060e883b2]::config::PanicHook>::panic_report <unknown>
43.31 s
> at <unknown source file> :<unknown line>
43.31 s
> 2: <color_eyre[b0c9e66060e883b2]::config::PanicHook>::into_panic_hook::{closure#0} <unknown>
43.31 s
> at <unknown source file> :<unknown line>
43.31 s
> 3: std[bcb96dfbba0ab899]::panicking::panic_with_hook <unknown>
43.31 s
> at <unknown source file> :<unknown line>
43.31 s
> 4: std[bcb96dfbba0ab899]::panicking::panic_handler::{closure#0} <unknown>
43.31 s
> at <unknown source file> :<unknown line>
43.31 s
> 5: std[bcb96dfbba0ab899]::sys::backtrace::__rust_end_short_backtrace::<std[bcb96dfbba0ab899]::panicking::panic_handler::{closure#0}, !> <unknown>
43.31 s
> at <unknown source file> :<unknown line>
43.31 s
> 6: __rustc[6c289b9f9c454d21]::rust_begin_unwind <unknown>
43.31 s
> at <unknown source file> :<unknown line>
43.31 s
> 7: core[940e698046960fd5]::panicking::panic_fmt <unknown>
43.31 s
> at <unknown source file> :<unknown line>
43.31 s
> 8: core[940e698046960fd5]::panicking::panic <unknown>
43.31 s
> at <unknown source file> :<unknown line>
43.31 s
> 9: gammalooprs[5490727360442cce]::uv::export::tests::computed_node_full_numerator_is_a_spenso_aware_typst_fragment <unknown>
43.31 s
> at <unknown source file> :<unknown line>
43.31 s
> 10: <gammalooprs[5490727360442cce]::uv::export::tests::computed_node_full_numerator_is_a_spenso_aware_typst_fragment::{closure#0} as core[940e698046960fd5]::ops::function::FnOnce<()>>::call_once <unknown>
43.31 s
> at <unknown source file> :<unknown line>
43.31 s
> 11: test[75d6903177b1d7e9]::__rust_begin_short_backtrace::<core[940e698046960fd5]::result::Result<(), alloc[2ea6bcb46fca0c42]::string::String>, fn() -> core[940e698046960fd5]::result::Result<(), alloc[2ea6bcb46fca0c42]::string::String>> <unknown>
43.31 s
> at <unknown source file> :<unknown line>
43.31 s
> 12: test[75d6903177b1d7e9]::run_test::{closure#0} <unknown>
43.31 s
> at <unknown source file> :<unknown line>
43.31 s
> 13: std[bcb96dfbba0ab899]::sys::backtrace::__rust_begin_short_backtrace::<test[75d6903177b1d7e9]::run_test::{closure#1}, ()> <unknown>
43.31 s
> at <unknown source file> :<unknown line>
43.31 s
> 14: <std[bcb96dfbba0ab899]::thread::lifecycle::spawn_unchecked<test[75d6903177b1d7e9]::run_test::{closure#1}, ()>::{closure#1} as core[940e698046960fd5]::ops::function::FnOnce<()>>::call_once::{shim:vtable#0} <unknown>
43.31 s
> at <unknown source file> :<unknown line>
43.31 s
> 15: <std[bcb96dfbba0ab899]::sys::thread::unix::Thread>::new::thread_start <unknown>
43.31 s
> at <unknown source file> :<unknown line>
43.31 s
> 16: start_thread <unknown>
43.31 s
> at <unknown source file> :<unknown line>
43.31 s
> 17: __clone3 <unknown>
43.31 s
> at <unknown source file> :<unknown line>
43.31 s
>
43.31 s
> Run with COLORBT_SHOW_HIDDEN=1 environment variable to disable frame filtering.
43.31 s
> Run with RUST_BACKTRACE=full to include source snippets.
43.31 s
>
43.31 s
> ------------
43.31 s
> Summary [ 14.778s] 456 tests run: 454 passed , 2 failed , 61 skipped
43.31 s
> FAIL [ 0.417s] (126/456) gammalooprs graph::parse::tests :: parse_lmbsetting_crossection
43.31 s
> stdout ---
43.31 s
>
43.31 s
> running 1 test
43.31 s
> ━━━━━━━━━━━━━━━━━━━━━━━━━━━━━━━ Snapshot Summary ━━━━━━━━━━━━━━━━━━━━━━━━━━━━━━━
43.31 s
> Snapshot: parse_lmbsetting_crossection
43.31 s
> Source: crates/gammalooprs/src/graph/parse/tests.rs:252
43.31 s
> ────────────────────────────────────────────────────────────────────────────────
43.31 s
> Expression: g.debug_dot()
43.31 s
> ────────────────────────────────────────────────────────────────────────────────
43.31 s
> -old snapshot
43.31 s
> +new results
43.31 s
> ────────────┬───────────────────────────────────────────────────────────────────
43.31 s
> 1 │-digraph G{
43.31 s
> 1 │+digraph G {
43.31 s
> 2 2 │ num = "1/2";
43.31 s
> 3 3 │ overall_factor = "2*x";
43.31 s
> 4 4 │ overall_factor_evaluated = "2*x";
43.31 s
> 5 5 │ projector = "spenso::t";
43.31 s
> ────────────┴───────────────────────────────────────────────────────────────────
43.31 s
> To update snapshots run `cargo insta review`
43.31 s
> Stopped on the first failure. Run `cargo insta test` to run all snapshots.
43.31 s
> test graph::parse::tests::parse_lmbsetting_crossection ... FAILED
43.31 s
>
43.31 s
> failures:
43.31 s
>
43.31 s
> failures:
43.31 s
> graph::parse::tests::parse_lmbsetting_crossection
43.31 s
>
43.31 s
> test result: FAILED. 0 passed; 1 failed; 0 ignored; 0 measured; 508 filtered out; finished in 0.30s
43.31 s
>
43.31 s
> stderr ---
43.31 s
> [20:20:08.931] @gammalooprs::graph::attribute_warnings WARNING : Unknown node attribute 'color_num' on graph 'G', node 'A'; did you mean 'num'?
43.31 s
> at crates/gammalooprs/src/graph/attribute_warnings.rs:198
43.31 s
> The application panicked (crashed).
43.31 s
> Message: snapshot assertion for 'parse_lmbsetting_crossection' failed in line 252
43.31 s
> Location: /nix/store/xdy1vvhll2bijdplvl9fcc2b9plkxhaa-vendor-cargo-deps/c19b7c6f923b580ac259164a89f2577984ad5ab09ee9d583b888f934adbbe8d0/insta-1.47.2/src/runtime.rs :719
43.31 s
>
43.31 s
> ━━━━━━━━━━━━━━━━━━━━━━━━━━━━━━━━━━ BACKTRACE ━━━━━━━━━━━━━━━━━━━━━━━━━━━━━━━━━━━
43.31 s
> 1: <color_eyre[b0c9e66060e883b2]::config::PanicHook>::panic_report <unknown>
43.31 s
> at <unknown source file> :<unknown line>
43.31 s
> 2: <color_eyre[b0c9e66060e883b2]::config::PanicHook>::into_panic_hook::{closure#0} <unknown>
43.31 s
> at <unknown source file> :<unknown line>
43.31 s
> 3: std[bcb96dfbba0ab899]::panicking::panic_with_hook <unknown>
43.31 s
> at <unknown source file> :<unknown line>
43.31 s
> 4: std[bcb96dfbba0ab899]::panicking::panic_handler::{closure#0} <unknown>
43.31 s
> at <unknown source file> :<unknown line>
43.31 s
> 5: std[bcb96dfbba0ab899]::sys::backtrace::__rust_end_short_backtrace::<std[bcb96dfbba0ab899]::panicking::panic_handler::{closure#0}, !> <unknown>
43.31 s
> at <unknown source file> :<unknown line>
43.31 s
> 6: __rustc[6c289b9f9c454d21]::rust_begin_unwind <unknown>
43.31 s
> at <unknown source file> :<unknown line>
43.31 s
> 7: core[940e698046960fd5]::panicking::panic_fmt <unknown>
43.31 s
> at <unknown source file> :<unknown line>
43.31 s
> 8: insta[307a548ac79ef4d9]::runtime::assert_snapshot <unknown>
43.31 s
> at <unknown source file> :<unknown line>
43.31 s
> 9: gammalooprs[5490727360442cce]::graph::parse::tests::parse_lmbsetting_crossection <unknown>
43.31 s
> at <unknown source file> :<unknown line>
43.31 s
> 10: <gammalooprs[5490727360442cce]::graph::parse::tests::parse_lmbsetting_crossection::{closure#0} as core[940e698046960fd5]::ops::function::FnOnce<()>>::call_once <unknown>
43.31 s
> at <unknown source file> :<unknown line>
43.31 s
> 11: test[75d6903177b1d7e9]::__rust_begin_short_backtrace::<core[940e698046960fd5]::result::Result<(), alloc[2ea6bcb46fca0c42]::string::String>, fn() -> core[940e698046960fd5]::result::Result<(), alloc[2ea6bcb46fca0c42]::string::String>> <unknown>
43.31 s
> at <unknown source file> :<unknown line>
43.31 s
> 12: test[75d6903177b1d7e9]::run_test::{closure#0} <unknown>
43.31 s
> at <unknown source file> :<unknown line>
43.31 s
> 13: std[bcb96dfbba0ab899]::sys::backtrace::__rust_begin_short_backtrace::<test[75d6903177b1d7e9]::run_test::{closure#1}, ()> <unknown>
43.31 s
> at <unknown source file> :<unknown line>
43.31 s
> 14: <std[bcb96dfbba0ab899]::thread::lifecycle::spawn_unchecked<test[75d6903177b1d7e9]::run_test::{closure#1}, ()>::{closure#1} as core[940e698046960fd5]::ops::function::FnOnce<()>>::call_once::{shim:vtable#0} <unknown>
43.31 s
> at <unknown source file> :<unknown line>
43.31 s
> 15: <std[bcb96dfbba0ab899]::sys::thread::unix::Thread>::new::thread_start <unknown>
43.31 s
> at <unknown source file> :<unknown line>
43.31 s
> 16: start_thread <unknown>
43.31 s
> at <unknown source file> :<unknown line>
43.31 s
> 17: __clone3 <unknown>
43.31 s
> at <unknown source file> :<unknown line>
43.31 s
>
43.31 s
> Run with COLORBT_SHOW_HIDDEN=1 environment variable to disable frame filtering.
43.31 s
> Run with RUST_BACKTRACE=full to include source snippets.
43.31 s
>
43.31 s
> FAIL [ 0.903s] (434/456) gammalooprs uv::export::tests :: computed_node_full_numerator_is_a_spenso_aware_typst_fragment
43.31 s
> stdout ---
43.31 s
>
43.31 s
> running 1 test
43.31 s
> test uv::export::tests::computed_node_full_numerator_is_a_spenso_aware_typst_fragment ... FAILED
43.31 s
>
43.31 s
> failures:
43.31 s
>
43.31 s
> failures:
43.31 s
> uv::export::tests::computed_node_full_numerator_is_a_spenso_aware_typst_fragment
43.31 s
>
43.31 s
> test result: FAILED. 0 passed; 1 failed; 0 ignored; 0 measured; 508 filtered out; finished in 0.87s
43.31 s
>
43.31 s
> stderr ---
43.31 s
> The application panicked (crashed).
43.31 s
> Message: assertion failed: exported.dot.contains(r#"full_num = "op(\"Tr\")(1)";"#)
43.31 s
> Location: crates/gammalooprs/src/uv/export.rs :483
43.31 s
>
43.31 s
> ━━━━━━━━━━━━━━━━━━━━━━━━━━━━━━━━━━ BACKTRACE ━━━━━━━━━━━━━━━━━━━━━━━━━━━━━━━━━━━
43.31 s
> 1: <color_eyre[b0c9e66060e883b2]::config::PanicHook>::panic_report <unknown>
43.31 s
> at <unknown source file> :<unknown line>
43.31 s
> 2: <color_eyre[b0c9e66060e883b2]::config::PanicHook>::into_panic_hook::{closure#0} <unknown>
43.31 s
> at <unknown source file> :<unknown line>
43.31 s
> 3: std[bcb96dfbba0ab899]::panicking::panic_with_hook <unknown>
43.31 s
> at <unknown source file> :<unknown line>
43.31 s
> 4: std[bcb96dfbba0ab899]::panicking::panic_handler::{closure#0} <unknown>
43.31 s
> at <unknown source file> :<unknown line>
43.31 s
> 5: std[bcb96dfbba0ab899]::sys::backtrace::__rust_end_short_backtrace::<std[bcb96dfbba0ab899]::panicking::panic_handler::{closure#0}, !> <unknown>
43.31 s
> at <unknown source file> :<unknown line>
43.31 s
> 6: __rustc[6c289b9f9c454d21]::rust_begin_unwind <unknown>
43.31 s
> at <unknown source file> :<unknown line>
43.31 s
> 7: core[940e698046960fd5]::panicking::panic_fmt <unknown>
43.31 s
> at <unknown source file> :<unknown line>
43.31 s
> 8: core[940e698046960fd5]::panicking::panic <unknown>
43.31 s
> at <unknown source file> :<unknown line>
43.31 s
> 9: gammalooprs[5490727360442cce]::uv::export::tests::computed_node_full_numerator_is_a_spenso_aware_typst_fragment <unknown>
43.31 s
> at <unknown source file> :<unknown line>
43.31 s
> 10: <gammalooprs[5490727360442cce]::uv::export::tests::computed_node_full_numerator_is_a_spenso_aware_typst_fragment::{closure#0} as core[940e698046960fd5]::ops::function::FnOnce<()>>::call_once <unknown>
43.31 s
> at <unknown source file> :<unknown line>
43.31 s
> 11: test[75d6903177b1d7e9]::__rust_begin_short_backtrace::<core[940e698046960fd5]::result::Result<(), alloc[2ea6bcb46fca0c42]::string::String>, fn() -> core[940e698046960fd5]::result::Result<(), alloc[2ea6bcb46fca0c42]::string::String>> <unknown>
43.31 s
> at <unknown source file> :<unknown line>
43.31 s
> 12: test[75d6903177b1d7e9]::run_test::{closure#0} <unknown>
43.31 s
> at <unknown source file> :<unknown line>
43.31 s
> 13: std[bcb96dfbba0ab899]::sys::backtrace::__rust_begin_short_backtrace::<test[75d6903177b1d7e9]::run_test::{closure#1}, ()> <unknown>
43.31 s
> at <unknown source file> :<unknown line>
43.31 s
> 14: <std[bcb96dfbba0ab899]::thread::lifecycle::spawn_unchecked<test[75d6903177b1d7e9]::run_test::{closure#1}, ()>::{closure#1} as core[940e698046960fd5]::ops::function::FnOnce<()>>::call_once::{shim:vtable#0} <unknown>
43.31 s
> at <unknown source file> :<unknown line>
43.31 s
> 15: <std[bcb96dfbba0ab899]::sys::thread::unix::Thread>::new::thread_start <unknown>
43.31 s
> at <unknown source file> :<unknown line>
43.31 s
> 16: start_thread <unknown>
43.31 s
> at <unknown source file> :<unknown line>
43.31 s
> 17: __clone3 <unknown>
43.31 s
> at <unknown source file> :<unknown line>
43.31 s
>
43.31 s
> Run with COLORBT_SHOW_HIDDEN=1 environment variable to disable frame filtering.
43.31 s
> Run with RUST_BACKTRACE=full to include source snippets.
43.31 s
>
43.31 s
> error : test run failed
43.31 s
>
43.31 s
> ========== nextest test summary ==========
43.31 s
> report: target/nextest/ci_gammaloop/junit.xml
43.31 s
> tests: 456, failures: 2, errors: 0
43.31 s
>
43.31 s
> 1. gammalooprs::graph::parse::tests::parse_lmbsetting_crossection
43.31 s
> failure: test failure with exit code 101
43.31 s
> system-out
43.31 s
> running 1 test
43.31 s
> ━━━━━━━━━━━━━━━━━━━━━━━━━━━━━━━ Snapshot Summary ━━━━━━━━━━━━━━━━━━━━━━━━━━━━━━━
43.31 s
> Snapshot: parse_lmbsetting_crossection
43.31 s
> Source: crates/gammalooprs/src/graph/parse/tests.rs:252
43.31 s
> ────────────────────────────────────────────────────────────────────────────────
43.31 s
> Expression: g.debug_dot()
43.31 s
> ────────────────────────────────────────────────────────────────────────────────
43.31 s
> -old snapshot
43.31 s
> +new results
43.31 s
> ────────────┬───────────────────────────────────────────────────────────────────
43.31 s
> 1 │-digraph G{
43.31 s
> 1 │+digraph G {
43.31 s
> 2 2 │ num = "1/2";
43.31 s
> 3 3 │ overall_factor = "2*x";
43.31 s
> 4 4 │ overall_factor_evaluated = "2*x";
43.31 s
> 5 5 │ projector = "spenso::t";
43.31 s
> ────────────┴───────────────────────────────────────────────────────────────────
43.31 s
> To update snapshots run `cargo insta review`
43.31 s
> Stopped on the first failure. Run `cargo insta test` to run all snapshots.
43.31 s
> test graph::parse::tests::parse_lmbsetting_crossection ... FAILED
43.31 s
>
43.31 s
> failures:
43.31 s
>
43.31 s
> failures:
43.31 s
> graph::parse::tests::parse_lmbsetting_crossection
43.31 s
>
43.31 s
> test result: FAILED. 0 passed; 1 failed; 0 ignored; 0 measured; 508 filtered out; finished in 0.30s
43.31 s
> system-err
43.31 s
> [20:20:08.931] @gammalooprs::graph::attribute_warnings WARNING : Unknown node attribute 'color_num' on graph 'G', node 'A'; did you mean 'num'?
43.31 s
> at crates/gammalooprs/src/graph/attribute_warnings.rs:198
43.31 s
> The application panicked (crashed).
43.31 s
> Message: snapshot assertion for 'parse_lmbsetting_crossection' failed in line 252
43.31 s
> Location: /nix/store/xdy1vvhll2bijdplvl9fcc2b9plkxhaa-vendor-cargo-deps/c19b7c6f923b580ac259164a89f2577984ad5ab09ee9d583b888f934adbbe8d0/insta-1.47.2/src/runtime.rs:719
43.31 s
>
43.31 s
> ━━━━━━━━━━━━━━━━━━━━━━━━━━━━━━━━━━ BACKTRACE ━━━━━━━━━━━━━━━━━━━━━━━━━━━━━━━━━━━
43.31 s
> 1: <color_eyre[b0c9e66060e883b2]::config::PanicHook>::panic_report<unknown>
43.31 s
> at <unknown source file>:<unknown line>
43.31 s
> 2: <color_eyre[b0c9e66060e883b2]::config::PanicHook>::into_panic_hook::{closure#0}<unknown>
43.31 s
> at <unknown source file>:<unknown line>
43.31 s
> 3: std[bcb96dfbba0ab899]::panicking::panic_with_hook<unknown>
43.31 s
> at <unknown source file>:<unknown line>
43.31 s
> 4: std[bcb96dfbba0ab899]::panicking::panic_handler::{closure#0}<unknown>
43.31 s
> at <unknown source file>:<unknown line>
43.31 s
> 5: std[bcb96dfbba0ab899]::sys::backtrace::__rust_end_short_backtrace::<std[bcb96dfbba0ab899]::panicking::panic_handler::{closure#0}, !><unknown>
43.31 s
> at <unknown source file>:<unknown line>
43.31 s
> 6: __rustc[6c289b9f9c454d21]::rust_begin_unwind<unknown>
43.31 s
> at <unknown source file>:<unknown line>
43.31 s
> 7: core[940e698046960fd5]::panicking::panic_fmt<unknown>
43.31 s
> at <unknown source file>:<unknown line>
43.31 s
> 8: insta[307a548ac79ef4d9]::runtime::assert_snapshot<unknown>
43.31 s
> at <unknown source file>:<unknown line>
43.31 s
> 9: gammalooprs[5490727360442cce]::graph::parse::tests::parse_lmbsetting_crossection<unknown>
43.31 s
> at <unknown source file>:<unknown line>
43.31 s
> 10: <gammalooprs[5490727360442cce]::graph::parse::tests::parse_lmbsetting_crossection::{closure#0} as core[940e698046960fd5]::ops::function::FnOnce<()>>::call_once<unknown>
43.31 s
> at <unknown source file>:<unknown line>
43.31 s
> 11: test[75d6903177b1d7e9]::__rust_begin_short_backtrace::<core[940e698046960fd5]::result::Result<(), alloc[2ea6bcb46fca0c42]::string::String>, fn() -> core[940e698046960fd5]::result::Result<(), alloc[2ea6bcb46fca0c42]::string::String>><unknown>
43.31 s
> at <unknown source file>:<unknown line>
43.31 s
> 12: test[75d6903177b1d7e9]::run_test::{closure#0}<unknown>
43.31 s
> at <unknown source file>:<unknown line>
43.32 s
> 13: std[bcb96dfbba0ab899]::sys::backtrace::__rust_begin_short_backtrace::<test[75d6903177b1d7e9]::run_test::{closure#1}, ()><unknown>
43.32 s
> at <unknown source file>:<unknown line>
43.32 s
> 14: <std[bcb96dfbba0ab899]::thread::lifecycle::spawn_unchecked<test[75d6903177b1d7e9]::run_test::{closure#1}, ()>::{closure#1} as core[940e698046960fd5]::ops::function::FnOnce<()>>::call_once::{shim:vtable#0}<unknown>
43.32 s
> at <unknown source file>:<unknown line>
43.32 s
> 15: <std[bcb96dfbba0ab899]::sys::thread::unix::Thread>::new::thread_start<unknown>
43.32 s
> at <unknown source file>:<unknown line>
43.32 s
> 16: start_thread<unknown>
43.32 s
> at <unknown source file>:<unknown line>
43.32 s
> 17: __clone3<unknown>
43.32 s
> at <unknown source file>:<unknown line>
43.32 s
>
43.32 s
> Run with COLORBT_SHOW_HIDDEN=1 environment variable to disable frame filtering.
43.32 s
> Run with RUST_BACKTRACE=full to include source snippets.
43.32 s
>
43.32 s
> 2. gammalooprs::uv::export::tests::computed_node_full_numerator_is_a_spenso_aware_typst_fragment
43.32 s
> failure: test failure with exit code 101
43.32 s
> system-out
43.32 s
> running 1 test
43.32 s
> test uv::export::tests::computed_node_full_numerator_is_a_spenso_aware_typst_fragment ... FAILED
43.32 s
>
43.32 s
> failures:
43.32 s
>
43.32 s
> failures:
43.32 s
> uv::export::tests::computed_node_full_numerator_is_a_spenso_aware_typst_fragment
43.32 s
>
43.32 s
> test result: FAILED. 0 passed; 1 failed; 0 ignored; 0 measured; 508 filtered out; finished in 0.87s
43.32 s
> system-err
43.32 s
> The application panicked (crashed).
43.32 s
> Message: assertion failed: exported.dot.contains(r#"full_num = "op(\"Tr\")(1)";"#)
43.32 s
> Location: crates/gammalooprs/src/uv/export.rs:483
43.32 s
>
43.32 s
> ━━━━━━━━━━━━━━━━━━━━━━━━━━━━━━━━━━ BACKTRACE ━━━━━━━━━━━━━━━━━━━━━━━━━━━━━━━━━━━
43.32 s
> 1: <color_eyre[b0c9e66060e883b2]::config::PanicHook>::panic_report<unknown>
43.32 s
> at <unknown source file>:<unknown line>
43.32 s
> 2: <color_eyre[b0c9e66060e883b2]::config::PanicHook>::into_panic_hook::{closure#0}<unknown>
43.32 s
> at <unknown source file>:<unknown line>
43.32 s
> 3: std[bcb96dfbba0ab899]::panicking::panic_with_hook<unknown>
43.32 s
> at <unknown source file>:<unknown line>
43.32 s
> 4: std[bcb96dfbba0ab899]::panicking::panic_handler::{closure#0}<unknown>
43.32 s
> at <unknown source file>:<unknown line>
43.32 s
> 5: std[bcb96dfbba0ab899]::sys::backtrace::__rust_end_short_backtrace::<std[bcb96dfbba0ab899]::panicking::panic_handler::{closure#0}, !><unknown>
43.32 s
> at <unknown source file>:<unknown line>
43.32 s
> 6: __rustc[6c289b9f9c454d21]::rust_begin_unwind<unknown>
43.32 s
> at <unknown source file>:<unknown line>
43.32 s
> 7: core[940e698046960fd5]::panicking::panic_fmt<unknown>
43.32 s
> at <unknown source file>:<unknown line>
43.32 s
> 8: core[940e698046960fd5]::panicking::panic<unknown>
43.32 s
> at <unknown source file>:<unknown line>
43.32 s
> 9: gammalooprs[5490727360442cce]::uv::export::tests::computed_node_full_numerator_is_a_spenso_aware_typst_fragment<unknown>
43.32 s
> at <unknown source file>:<unknown line>
43.32 s
> 10: <gammalooprs[5490727360442cce]::uv::export::tests::computed_node_full_numerator_is_a_spenso_aware_typst_fragment::{closure#0} as core[940e698046960fd5]::ops::function::FnOnce<()>>::call_once<unknown>
43.32 s
> at <unknown source file>:<unknown line>
43.32 s
> 11: test[75d6903177b1d7e9]::__rust_begin_short_backtrace::<core[940e698046960fd5]::result::Result<(), alloc[2ea6bcb46fca0c42]::string::String>, fn() -> core[940e698046960fd5]::result::Result<(), alloc[2ea6bcb46fca0c42]::string::String>><unknown>
43.32 s
> at <unknown source file>:<unknown line>
43.32 s
> 12: test[75d6903177b1d7e9]::run_test::{closure#0}<unknown>
43.32 s
> at <unknown source file>:<unknown line>
43.32 s
> 13: std[bcb96dfbba0ab899]::sys::backtrace::__rust_begin_short_backtrace::<test[75d6903177b1d7e9]::run_test::{closure#1}, ()><unknown>
43.32 s
> at <unknown source file>:<unknown line>
43.32 s
> 14: <std[bcb96dfbba0ab899]::thread::lifecycle::spawn_unchecked<test[75d6903177b1d7e9]::run_test::{closure#1}, ()>::{closure#1} as core[940e698046960fd5]::ops::function::FnOnce<()>>::call_once::{shim:vtable#0}<unknown>
43.32 s
> at <unknown source file>:<unknown line>
43.32 s
> 15: <std[bcb96dfbba0ab899]::sys::thread::unix::Thread>::new::thread_start<unknown>
43.32 s
> at <unknown source file>:<unknown line>
43.32 s
> 16: start_thread<unknown>
43.32 s
> at <unknown source file>:<unknown line>
43.32 s
> 17: __clone3<unknown>
43.32 s
> at <unknown source file>:<unknown line>
43.32 s
>
43.32 s
> Run with COLORBT_SHOW_HIDDEN=1 environment variable to disable frame filtering.
43.32 s
> Run with RUST_BACKTRACE=full to include source snippets.
43.32 s
> =========================================
43.32 s
For full logs, run:
43.32 s
nix log /nix/store/07lma8g6p1n7jxf8azmxf90ca6pqjydj-gammaloop-nextest-core.drv
43.51 s
Run failed.