test packages.x86_64-linux.nix-ci-check-gammaloop-doctest

Reproduce this run
Original Run
  1. 0.11 s $ /nix/store/9ypz3flqsrl5xl495mm8h645gadjsxi1-coreutils-9.11/bin/timeout --kill-after=15s 7200s /nix/store/23zk8sgzamrbmj1fday15szf7f2279s8-nix-2.34.7/bin/nix --extra-experimental-features nix-command --extra-experimental-features flakes flake clone git+https://github.com/alphal00p/gammaloop --dest /tmp/nix-ci-worker/stable-pwd/repo/
  2. 0.31 s Cloning into '/tmp/nix-ci-worker/stable-pwd/repo'...
  3. 1.99 s remote: Enumerating objects: 64182, done.
  4. 2.22 s remote: Counting objects: 0% (1/9536) remote: Counting objects: 1% (96/9536) remote: Counting objects: 2% (191/9536) remote: Counting objects: 3% (287/9536) remote: Counting objects: 4% (382/9536) remote: Counting objects: 5% (477/9536) remote: Counting objects: 6% (573/9536) remote: Counting objects: 7% (668/9536) remote: Counting objects: 8% (763/9536) remote: Counting objects: 9% (859/9536) remote: Counting objects: 10% (954/9536) remote: Counting objects: 11% (1049/9536) remote: Counting objects: 12% (1145/9536) remote: Counting objects: 13% (1240/9536) remote: Counting objects: 14% (1336/9536) remote: Counting objects: 15% (1431/9536) remote: Counting objects: 16% (1526/9536) remote: Counting objects: 17% (1622/9536) remote: Counting objects: 18% (1717/9536) remote: Counting objects: 19% (1812/9536) remote: Counting objects: 20% (1908/9536) remote: Counting objects: 21% (2003/9536) remote: Counting objects: 22% (2098/9536) remote: Counting objects: 23% (2194/9536) remote: Counting objects: 24% (2289/9536) remote: Counting objects: 25% (2384/9536) remote: Counting objects: 26% (2480/9536) remote: Counting objects: 27% (2575/9536) remote: Counting objects: 28% (2671/9536) remote: Counting objects: 29% (2766/9536) remote: Counting objects: 30% (2861/9536) remote: Counting objects: 31% (2957/9536) remote: Counting objects: 32% (3052/9536) remote: Counting objects: 33% (3147/9536) remote: Counting objects: 34% (3243/9536) remote: Counting objects: 35% (3338/9536) remote: Counting objects: 36% (3433/9536) remote: Counting objects: 37% (3529/9536) remote: Counting objects: 38% (3624/9536) remote: Counting objects: 39% (3720/9536) remote: Counting objects: 40% (3815/9536) remote: Counting objects: 41% (3910/9536) remote: Counting objects: 42% (4006/9536) remote: Counting objects: 43% (4101/9536) remote: Counting objects: 44% (4196/9536) remote: Counting objects: 45% (4292/9536) remote: Counting objects: 46% (4387/9536) remote: Counting objects: 47% (4482/9536) remote: Counting objects: 48% (4578/9536) remote: Counting objects: 49% (4673/9536) remote: Counting objects: 50% (4768/9536) remote: Counting objects: 51% (4864/9536) remote: Counting objects: 52% (4959/9536) remote: Counting objects: 53% (5055/9536) remote: Counting objects: 54% (5150/9536) remote: Counting objects: 55% (5245/9536) remote: Counting objects: 56% (5341/9536) remote: Counting objects: 57% (5436/9536) remote: Counting objects: 58% (5531/9536) remote: Counting objects: 59% (5627/9536) remote: Counting objects: 60% (5722/9536) remote: Counting objects: 61% (5817/9536) remote: Counting objects: 62% (5913/9536) remote: Counting objects: 63% (6008/9536) remote: Counting objects: 64% (6104/9536) remote: Counting objects: 65% (6199/9536) remote: Counting objects: 66% (6294/9536) remote: Counting objects: 67% (6390/9536) remote: Counting objects: 68% (6485/9536) remote: Counting objects: 69% (6580/9536) remote: Counting objects: 70% (6676/9536) remote: Counting objects: 71% (6771/9536) remote: Counting objects: 72% (6866/9536) remote: Counting objects: 73% (6962/9536) remote: Counting objects: 74% (7057/9536) remote: Counting objects: 75% (7152/9536) remote: Counting objects: 76% (7248/9536) remote: Counting objects: 77% (7343/9536) remote: Counting objects: 78% (7439/9536) remote: Counting objects: 79% (7534/9536) remote: Counting objects: 80% (7629/9536) remote: Counting objects: 81% (7725/9536) remote: Counting objects: 82% (7820/9536) remote: Counting objects: 83% (7915/9536) remote: Counting objects: 84% (8011/9536) remote: Counting objects: 85% (8106/9536) remote: Counting objects: 86% (8201/9536) remote: Counting objects: 87% (8297/9536) remote: Counting objects: 88% (8392/9536) remote: Counting objects: 89% (8488/9536) remote: Counting objects: 90% (8583/9536) remote: Counting objects: 91% (8678/9536) remote: Counting objects: 92% (8774/9536) remote: Counting objects: 93% (8869/9536) remote: Counting objects: 94% (8964/9536) remote: Counting objects: 95% (9060/9536) remote: Counting objects: 96% (9155/9536) remote: Counting objects: 97% (9250/9536) remote: Counting objects: 98% (9346/9536) remote: Counting objects: 99% (9441/9536) remote: Counting objects: 100% (9536/9536) remote: Counting objects: 100% (9536/9536), done.
  5. 4.84 s remote: Compressing objects: 0% (1/2324) remote: Compressing objects: 1% (24/2324) remote: Compressing objects: 2% (47/2324) remote: Compressing objects: 3% (70/2324) remote: Compressing objects: 4% (93/2324) remote: Compressing objects: 5% (117/2324) remote: Compressing objects: 6% (140/2324) remote: Compressing objects: 7% (163/2324) remote: Compressing objects: 8% (186/2324) remote: Compressing objects: 9% (210/2324) remote: Compressing objects: 10% (233/2324) remote: Compressing objects: 11% (256/2324) remote: Compressing objects: 12% (279/2324) remote: Compressing objects: 13% (303/2324) remote: Compressing objects: 14% (326/2324) remote: Compressing objects: 15% (349/2324) remote: Compressing objects: 16% (372/2324) remote: Compressing objects: 17% (396/2324) remote: Compressing objects: 18% (419/2324) remote: Compressing objects: 19% (442/2324) remote: Compressing objects: 20% (465/2324) remote: Compressing objects: 21% (489/2324) remote: Compressing objects: 22% (512/2324) remote: Compressing objects: 22% (531/2324) remote: Compressing objects: 23% (535/2324) remote: Compressing objects: 24% (558/2324) remote: Compressing objects: 25% (581/2324) remote: Compressing objects: 26% (605/2324) remote: Compressing objects: 27% (628/2324) remote: Compressing objects: 28% (651/2324) remote: Compressing objects: 28% (652/2324) remote: Compressing objects: 29% (674/2324) remote: Compressing objects: 30% (698/2324) remote: Compressing objects: 31% (721/2324) remote: Compressing objects: 32% (744/2324) remote: Compressing objects: 33% (767/2324) remote: Compressing objects: 34% (791/2324) remote: Compressing objects: 35% (814/2324) remote: Compressing objects: 36% (837/2324) remote: Compressing objects: 37% (860/2324) remote: Compressing objects: 38% (884/2324) remote: Compressing objects: 39% (907/2324) remote: Compressing objects: 40% (930/2324) remote: Compressing objects: 41% (953/2324) remote: Compressing objects: 42% (977/2324) remote: Compressing objects: 43% (1000/2324) remote: Compressing objects: 44% (1023/2324) remote: Compressing objects: 45% (1046/2324) remote: Compressing objects: 46% (1070/2324) remote: Compressing objects: 47% (1093/2324) remote: Compressing objects: 48% (1116/2324) remote: Compressing objects: 49% (1139/2324) remote: Compressing objects: 50% (1162/2324) remote: Compressing objects: 51% (1186/2324) remote: Compressing objects: 52% (1209/2324) remote: Compressing objects: 53% (1232/2324) remote: Compressing objects: 54% (1255/2324) remote: Compressing objects: 55% (1279/2324) remote: Compressing objects: 56% (1302/2324) remote: Compressing objects: 57% (1325/2324) remote: Compressing objects: 58% (1348/2324) remote: Compressing objects: 59% (1372/2324) remote: Compressing objects: 60% (1395/2324) remote: Compressing objects: 61% (1418/2324) remote: Compressing objects: 62% (1441/2324) remote: Compressing objects: 63% (1465/2324) remote: Compressing objects: 64% (1488/2324) remote: Compressing objects: 65% (1511/2324) remote: Compressing objects: 66% (1534/2324) remote: Compressing objects: 67% (1558/2324) remote: Compressing objects: 68% (1581/2324) remote: Compressing objects: 69% (1604/2324) remote: Compressing objects: 70% (1627/2324) remote: Compressing objects: 71% (1651/2324) remote: Compressing objects: 72% (1674/2324) remote: Compressing objects: 73% (1697/2324) remote: Compressing objects: 74% (1720/2324) remote: Compressing objects: 75% (1743/2324) remote: Compressing objects: 76% (1767/2324) remote: Compressing objects: 77% (1790/2324) remote: Compressing objects: 78% (1813/2324) remote: Compressing objects: 79% (1836/2324) remote: Compressing objects: 80% (1860/2324) remote: Compressing objects: 81% (1883/2324) remote: Compressing objects: 82% (1906/2324) remote: Compressing objects: 83% (1929/2324) remote: Compressing objects: 84% (1953/2324) remote: Compressing objects: 85% (1976/2324) remote: Compressing objects: 86% (1999/2324) remote: Compressing objects: 87% (2022/2324) remote: Compressing objects: 88% (2046/2324) remote: Compressing objects: 89% (2069/2324) remote: Compressing objects: 90% (2092/2324) remote: Compressing objects: 91% (2115/2324) remote: Compressing objects: 92% (2139/2324) remote: Compressing objects: 93% (2162/2324) remote: Compressing objects: 94% (2185/2324) remote: Compressing objects: 95% (2208/2324) remote: Compressing objects: 96% (2232/2324) remote: Compressing objects: 97% (2255/2324) remote: Compressing objects: 98% (2278/2324) remote: Compressing objects: 99% (2301/2324) remote: Compressing objects: 100% (2324/2324) remote: Compressing objects: 100% (2324/2324), done.
  6. 8.02 s Receiving objects: 0% (1/64182) Receiving objects: 1% (642/64182) Receiving objects: 2% (1284/64182) Receiving objects: 3% (1926/64182) Receiving objects: 4% (2568/64182) Receiving objects: 5% (3210/64182) Receiving objects: 6% (3851/64182) Receiving objects: 7% (4493/64182) Receiving objects: 8% (5135/64182) Receiving objects: 9% (5777/64182) Receiving objects: 10% (6419/64182), 8.05 MiB | 16.08 MiB/s Receiving objects: 11% (7061/64182), 8.05 MiB | 16.08 MiB/s Receiving objects: 12% (7702/64182), 8.05 MiB | 16.08 MiB/s Receiving objects: 13% (8344/64182), 8.05 MiB | 16.08 MiB/s Receiving objects: 14% (8986/64182), 8.05 MiB | 16.08 MiB/s Receiving objects: 15% (9628/64182), 8.05 MiB | 16.08 MiB/s Receiving objects: 16% (10270/64182), 8.05 MiB | 16.08 MiB/s Receiving objects: 17% (10911/64182), 8.05 MiB | 16.08 MiB/s Receiving objects: 18% (11553/64182), 8.05 MiB | 16.08 MiB/s Receiving objects: 19% (12195/64182), 8.05 MiB | 16.08 MiB/s Receiving objects: 20% (12837/64182), 8.05 MiB | 16.08 MiB/s Receiving objects: 21% (13479/64182), 8.05 MiB | 16.08 MiB/s Receiving objects: 22% (14121/64182), 8.05 MiB | 16.08 MiB/s Receiving objects: 23% (14762/64182), 8.05 MiB | 16.08 MiB/s Receiving objects: 24% (15404/64182), 8.05 MiB | 16.08 MiB/s Receiving objects: 25% (16046/64182), 8.05 MiB | 16.08 MiB/s Receiving objects: 26% (16688/64182), 8.05 MiB | 16.08 MiB/s Receiving objects: 27% (17330/64182), 8.05 MiB | 16.08 MiB/s Receiving objects: 28% (17971/64182), 8.05 MiB | 16.08 MiB/s Receiving objects: 29% (18613/64182), 8.05 MiB | 16.08 MiB/s Receiving objects: 30% (19255/64182), 8.05 MiB | 16.08 MiB/s Receiving objects: 31% (19897/64182), 8.05 MiB | 16.08 MiB/s Receiving objects: 32% (20539/64182), 8.05 MiB | 16.08 MiB/s Receiving objects: 33% (21181/64182), 8.05 MiB | 16.08 MiB/s Receiving objects: 34% (21822/64182), 8.05 MiB | 16.08 MiB/s Receiving objects: 35% (22464/64182), 8.05 MiB | 16.08 MiB/s Receiving objects: 36% (23106/64182), 8.05 MiB | 16.08 MiB/s Receiving objects: 37% (23748/64182), 8.05 MiB | 16.08 MiB/s Receiving objects: 38% (24390/64182), 8.05 MiB | 16.08 MiB/s Receiving objects: 39% (25031/64182), 8.05 MiB | 16.08 MiB/s Receiving objects: 40% (25673/64182), 8.05 MiB | 16.08 MiB/s Receiving objects: 41% (26315/64182), 8.05 MiB | 16.08 MiB/s Receiving objects: 42% (26957/64182), 8.05 MiB | 16.08 MiB/s Receiving objects: 43% (27599/64182), 8.05 MiB | 16.08 MiB/s Receiving objects: 43% (27904/64182), 8.05 MiB | 16.08 MiB/s Receiving objects: 44% (28241/64182), 23.01 MiB | 23.00 MiB/s Receiving objects: 45% (28882/64182), 23.01 MiB | 23.00 MiB/s Receiving objects: 46% (29524/64182), 23.01 MiB | 23.00 MiB/s Receiving objects: 47% (30166/64182), 23.01 MiB | 23.00 MiB/s Receiving objects: 48% (30808/64182), 23.01 MiB | 23.00 MiB/s Receiving objects: 49% (31450/64182), 23.01 MiB | 23.00 MiB/s Receiving objects: 50% (32091/64182), 23.01 MiB | 23.00 MiB/s Receiving objects: 51% (32733/64182), 23.01 MiB | 23.00 MiB/s Receiving objects: 52% (33375/64182), 23.01 MiB | 23.00 MiB/s Receiving objects: 53% (34017/64182), 23.01 MiB | 23.00 MiB/s Receiving objects: 54% (34659/64182), 23.01 MiB | 23.00 MiB/s Receiving objects: 55% (35301/64182), 23.01 MiB | 23.00 MiB/s Receiving objects: 56% (35942/64182), 23.01 MiB | 23.00 MiB/s Receiving objects: 57% (36584/64182), 23.01 MiB | 23.00 MiB/s Receiving objects: 58% (37226/64182), 42.26 MiB | 28.10 MiB/s Receiving objects: 59% (37868/64182), 42.26 MiB | 28.10 MiB/s Receiving objects: 60% (38510/64182), 42.26 MiB | 28.10 MiB/s Receiving objects: 61% (39152/64182), 42.26 MiB | 28.10 MiB/s Receiving objects: 62% (39793/64182), 42.26 MiB | 28.10 MiB/s Receiving objects: 63% (40435/64182), 42.26 MiB | 28.10 MiB/s Receiving objects: 64% (41077/64182), 42.26 MiB | 28.10 MiB/s Receiving objects: 65% (41719/64182), 42.26 MiB | 28.10 MiB/s Receiving objects: 66% (42361/64182), 42.26 MiB | 28.10 MiB/s Receiving objects: 66% (42653/64182), 59.16 MiB | 29.52 MiB/s Receiving objects: 67% (43002/64182), 59.16 MiB | 29.52 MiB/s Receiving objects: 68% (43644/64182), 59.16 MiB | 29.52 MiB/s Receiving objects: 69% (44286/64182), 59.16 MiB | 29.52 MiB/s Receiving objects: 70% (44928/64182), 59.16 MiB | 29.52 MiB/s Receiving objects: 71% (45570/64182), 59.16 MiB | 29.52 MiB/s Receiving objects: 72% (46212/64182), 59.16 MiB | 29.52 MiB/s Receiving objects: 73% (46853/64182), 59.16 MiB | 29.52 MiB/s Receiving objects: 74% (47495/64182), 59.16 MiB | 29.52 MiB/s Receiving objects: 75% (48137/64182), 59.16 MiB | 29.52 MiB/s Receiving objects: 76% (48779/64182), 59.16 MiB | 29.52 MiB/s Receiving objects: 77% (49421/64182), 59.16 MiB | 29.52 MiB/s Receiving objects: 78% (50062/64182), 59.16 MiB | 29.52 MiB/s Receiving objects: 79% (50704/64182), 59.16 MiB | 29.52 MiB/s Receiving objects: 80% (51346/64182), 59.16 MiB | 29.52 MiB/s Receiving objects: 81% (51988/64182), 75.62 MiB | 30.16 MiB/s Receiving objects: 82% (52630/64182), 75.62 MiB | 30.16 MiB/s Receiving objects: 83% (53272/64182), 75.62 MiB | 30.16 MiB/s Receiving objects: 84% (53913/64182), 75.62 MiB | 30.16 MiB/s Receiving objects: 85% (54555/64182), 75.62 MiB | 30.16 MiB/s Receiving objects: 86% (55197/64182), 75.62 MiB | 30.16 MiB/s Receiving objects: 87% (55839/64182), 75.62 MiB | 30.16 MiB/s Receiving objects: 88% (56481/64182), 75.62 MiB | 30.16 MiB/s Receiving objects: 89% (57122/64182), 75.62 MiB | 30.16 MiB/s Receiving objects: 90% (57764/64182), 75.62 MiB | 30.16 MiB/s Receiving objects: 91% (58406/64182), 75.62 MiB | 30.16 MiB/s Receiving objects: 92% (59048/64182), 75.62 MiB | 30.16 MiB/s Receiving objects: 93% (59690/64182), 75.62 MiB | 30.16 MiB/s Receiving objects: 94% (60332/64182), 75.62 MiB | 30.16 MiB/s Receiving objects: 95% (60973/64182), 75.62 MiB | 30.16 MiB/s Receiving objects: 96% (61615/64182), 75.62 MiB | 30.16 MiB/s Receiving objects: 96% (61880/64182), 91.71 MiB | 30.50 MiB/s Receiving objects: 97% (62257/64182), 91.71 MiB | 30.50 MiB/s Receiving objects: 98% (62899/64182), 91.71 MiB | 30.50 MiB/s Receiving objects: 99% (63541/64182), 91.71 MiB | 30.50 MiB/s remote: Total 64182 (delta 7384), reused 7761 (delta 6667), pack-reused 54646 (from 3)
  7. 8.04 s Receiving objects: 100% (64182/64182), 91.71 MiB | 30.50 MiB/s Receiving objects: 100% (64182/64182), 97.82 MiB | 30.74 MiB/s, done.
  8. 9.88 s Resolving deltas: 0% (0/44314) Resolving deltas: 1% (444/44314) Resolving deltas: 2% (887/44314) Resolving deltas: 3% (1330/44314) Resolving deltas: 4% (1773/44314) Resolving deltas: 5% (2216/44314) Resolving deltas: 6% (2659/44314) Resolving deltas: 7% (3102/44314) Resolving deltas: 8% (3546/44314) Resolving deltas: 9% (3990/44314) Resolving deltas: 10% (4432/44314) Resolving deltas: 11% (4875/44314) Resolving deltas: 12% (5318/44314) Resolving deltas: 13% (5761/44314) Resolving deltas: 14% (6204/44314) Resolving deltas: 15% (6648/44314) Resolving deltas: 16% (7091/44314) Resolving deltas: 17% (7534/44314) Resolving deltas: 18% (7977/44314) Resolving deltas: 19% (8420/44314) Resolving deltas: 20% (8863/44314) Resolving deltas: 21% (9306/44314) Resolving deltas: 22% (9751/44314) Resolving deltas: 23% (10193/44314) Resolving deltas: 24% (10636/44314) Resolving deltas: 25% (11079/44314) Resolving deltas: 26% (11522/44314) Resolving deltas: 27% (11965/44314) Resolving deltas: 28% (12408/44314) Resolving deltas: 29% (12852/44314) Resolving deltas: 30% (13295/44314) Resolving deltas: 31% (13738/44314) Resolving deltas: 32% (14181/44314) Resolving deltas: 33% (14624/44314) Resolving deltas: 34% (15067/44314) Resolving deltas: 35% (15510/44314) Resolving deltas: 36% (15954/44314) Resolving deltas: 37% (16397/44314) Resolving deltas: 38% (16843/44314) Resolving deltas: 39% (17283/44314) Resolving deltas: 40% (17726/44314) Resolving deltas: 41% (18169/44314) Resolving deltas: 42% (18612/44314) Resolving deltas: 43% (19056/44314) Resolving deltas: 44% (19499/44314) Resolving deltas: 45% (19944/44314) Resolving deltas: 46% (20385/44314) Resolving deltas: 47% (20828/44314) Resolving deltas: 48% (21271/44314) Resolving deltas: 49% (21714/44314) Resolving deltas: 50% (22157/44314) Resolving deltas: 51% (22601/44314) Resolving deltas: 52% (23044/44314) Resolving deltas: 53% (23488/44314) Resolving deltas: 54% (23930/44314) Resolving deltas: 55% (24373/44314) Resolving deltas: 56% (24816/44314) Resolving deltas: 57% (25259/44314) Resolving deltas: 58% (25703/44314) Resolving deltas: 59% (26146/44314) Resolving deltas: 60% (26589/44314) Resolving deltas: 61% (27032/44314) Resolving deltas: 62% (27475/44314) Resolving deltas: 63% (27918/44314) Resolving deltas: 64% (28361/44314) Resolving deltas: 65% (28805/44314) Resolving deltas: 66% (29248/44314) Resolving deltas: 66% (29489/44314) Resolving deltas: 67% (29691/44314) Resolving deltas: 68% (30134/44314) Resolving deltas: 69% (30577/44314) Resolving deltas: 70% (31020/44314) Resolving deltas: 71% (31463/44314) Resolving deltas: 72% (31907/44314) Resolving deltas: 73% (32350/44314) Resolving deltas: 74% (32794/44314) Resolving deltas: 75% (33236/44314) Resolving deltas: 76% (33679/44314) Resolving deltas: 77% (34123/44314) Resolving deltas: 78% (34565/44314) Resolving deltas: 79% (35009/44314) Resolving deltas: 80% (35452/44314) Resolving deltas: 81% (35895/44314) Resolving deltas: 82% (36338/44314) Resolving deltas: 83% (36781/44314) Resolving deltas: 84% (37224/44314) Resolving deltas: 85% (37667/44314) Resolving deltas: 86% (38111/44314) Resolving deltas: 87% (38554/44314) Resolving deltas: 88% (38997/44314) Resolving deltas: 89% (39440/44314) Resolving deltas: 90% (39883/44314) Resolving deltas: 91% (40326/44314) Resolving deltas: 92% (40769/44314) Resolving deltas: 93% (41213/44314) Resolving deltas: 94% (41656/44314) Resolving deltas: 95% (42099/44314) Resolving deltas: 96% (42542/44314) Resolving deltas: 97% (42985/44314) Resolving deltas: 98% (43428/44314) Resolving deltas: 99% (43871/44314) Resolving deltas: 100% (44314/44314) Resolving deltas: 100% (44314/44314), done.
  9. 10.31 s Fetching commit 94e2eb84385825c67e2d00485755754534658cdd for push-vrpyqyylypmw ...
  10. 10.31 s $ /nix/store/bcnisk3ydfgv26v2gw3zlky24g00yww2-git-2.54.0/bin/git fetch origin 94e2eb84385825c67e2d00485755754534658cdd
  11. 10.91 s From https://github.com/alphal00p/gammaloop
  12. 10.91 s * branch 94e2eb84385825c67e2d00485755754534658cdd -> FETCH_HEAD
  13. 10.95 s $ /nix/store/9ypz3flqsrl5xl495mm8h645gadjsxi1-coreutils-9.11/bin/timeout --kill-after=15s 7200s /nix/store/bcnisk3ydfgv26v2gw3zlky24g00yww2-git-2.54.0/bin/git -c advice.detachedHead=false checkout 94e2eb84385825c67e2d00485755754534658cdd
  14. 11.24 s HEAD is now at 94e2eb84 include documentation sources in catalog dependency build
  15. 11.27 s $ /nix/store/9ypz3flqsrl5xl495mm8h645gadjsxi1-coreutils-9.11/bin/timeout --kill-after=15s 7200s /nix/store/23zk8sgzamrbmj1fday15szf7f2279s8-nix-2.34.7/bin/nix --extra-experimental-features nix-command --extra-experimental-features flakes --log-format internal-json run .#packages.x86_64-linux.nix-ci-check-gammaloop-doctest --print-build-logs
  16. 14.67 s
  17. 18.91 s evaluating derivation 'g copying '/nix/store/fxbc [0/1 built] [1/0/1 built] building ggammaloop-workspace-doctest> Running phase: unpackPhase
  18. 18.92 s gammaloop-workspace-doctest> unpacking source archive /nix/store/n62xwv096bc248rr6y7qpggfdbwshkw9-source
  19. 21.87 s gammaloop-workspace-doctest> source root is source
  20. 21.92 s gammaloop-workspace-doctest> Running phase: patchPhase
  21. 21.94 s gammaloop-workspace-doctest> Executing configureCargoCommonVars
  22. 21.95 s gammaloop-workspace-doctest> decompressing cargo artifacts from /nix/store/kbgwngi7xvi54jsr0kp8rhj1b9mfja7d-gammaloop-workspace-deps-deps-0.1.0/target.tar.zst to target
  23. 24.88 s gammaloop-workspace-doctest> Running phase: updateAutotoolsGnuConfigScriptsPhase
  24. 24.94 s gammaloop-workspace-doctest> Running phase: configurePhase
  25. 24.95 s gammaloop-workspace-doctest> will append /build/source/.cargo-home/config.toml with contents of /nix/store/xdy1vvhll2bijdplvl9fcc2b9plkxhaa-vendor-cargo-deps/config.toml
  26. 25.00 s gammaloop-workspace-doctest> default configurePhase, nothing to do
  27. 25.01 s gammaloop-workspace-doctest> Running phase: buildPhase
  28. 25.03 s gammaloop-workspace-doctest> +++ command cargo --version
  29. 25.04 s gammaloop-workspace-doctest> cargo 1.97.0 (c980f4866 2026-06-30)
  30. 25.09 s gammaloop-workspace-doctest> +++ command cargo test --profile ci-optim --doc --locked --workspace --features gammaloop-api/cli,gammaloop-tracing-filter/clap,gammaloop-tracing-filter/symbolica,idenso/bincode,idenso/reference-cases,linnet/bincode,linnet/drawing,linnet/nodestore-vec,linnet/rkyv,linnet/serde,linnet/symbolica,spenso-macros/shadowing,spenso/shadowing,symbolica/tracing_max_level_info
  31. 30.52 s gammaloop-workspace-doctest> Compiling target-lexicon v0.13.5
  32. 30.53 s gammaloop-workspace-doctest> Compiling symbolica v2.2.0 (https://github.com/symbolica-dev/symbolica?branch=dev#0441bd7a)
  33. 30.53 s gammaloop-workspace-doctest> Compiling maplit v1.0.2
  34. 30.54 s gammaloop-workspace-doctest> Compiling gammaloop-tracing-filter-macros v0.1.0 (/build/source/crates/gammaloop-tracing-filter-macros)
  35. 30.55 s gammaloop-workspace-doctest> Compiling vakint v0.1.2 (/build/source/crates/vakint)
  36. 30.55 s gammaloop-workspace-doctest> Compiling gammalooprs v0.3.4 (/build/source/crates/gammalooprs)
  37. 30.56 s gammaloop-workspace-doctest> Compiling alphal00p-docs-macros v0.1.0 (/build/source/crates/alphal00p-docs-macros)
  38. 30.56 s gammaloop-workspace-doctest> Compiling alphal00p-docs-schema v0.1.0 (/build/source/crates/alphal00p-docs-schema)
  39. 30.56 s gammaloop-workspace-doctest> Compiling rustc_version v0.4.1
  40. 30.57 s gammaloop-workspace-doctest> Compiling bincode v1.3.3
  41. 30.57 s gammaloop-workspace-doctest> Compiling gungraun-runner v0.18.2
  42. 30.58 s gammaloop-workspace-doctest> Compiling iai-callgrind-runner v0.14.2
  43. 30.58 s gammaloop-workspace-doctest> Compiling target-triple v1.0.1
  44. 30.58 s gammaloop-workspace-doctest> Compiling clinnet v0.1.8 (/build/source/crates/clinnet)
  45. 30.66 s gammaloop-workspace-doctest> Compiling gammaloop-integration-tests v0.1.0 (/build/source/tests)
  46. 30.97 s gammaloop-workspace-doctest> Compiling test-log-core v0.2.20
  47. 31.18 s gammaloop-workspace-doctest> Compiling wait-timeout v0.2.1
  48. 31.19 s gammaloop-workspace-doctest> Compiling iai-callgrind v0.14.2
  49. 31.27 s gammaloop-workspace-doctest> Compiling quick-error v1.2.3
  50. 31.28 s gammaloop-workspace-doctest> Compiling bit-vec v0.8.0
  51. 31.72 s gammaloop-workspace-doctest> Compiling rusty-fork v0.3.1
  52. 31.77 s gammaloop-workspace-doctest> Compiling bit-set v0.8.0
  53. 32.16 s gammaloop-workspace-doctest> Compiling iai-callgrind-macros v0.5.1
  54. 32.25 s gammaloop-workspace-doctest> Compiling rand_xorshift v0.4.0
  55. 32.28 s gammaloop-workspace-doctest> Compiling console v0.15.11
  56. 32.41 s gammaloop-workspace-doctest> Compiling glob v0.3.4
  57. 32.47 s gammaloop-workspace-doctest> Compiling unarray v0.1.4
  58. 32.58 s gammaloop-workspace-doctest> Compiling base64 v0.21.7
  59. 32.86 s gammaloop-workspace-doctest> Compiling gungraun-macros v0.8.0
  60. 33.09 s gammaloop-workspace-doctest> Compiling termcolor v1.4.1
  61. 33.14 s gammaloop-workspace-doctest> Compiling alphal00p-docs-catalogs v0.1.0 (/build/source/crates/alphal00p-docs-catalogs)
  62. 33.34 s gammaloop-workspace-doctest> Compiling similar-asserts v1.7.0
  63. 33.64 s gammaloop-workspace-doctest> Compiling trybuild v1.0.120
  64. 33.81 s gammaloop-workspace-doctest> Compiling ron v0.8.1
  65. 33.95 s gammaloop-workspace-doctest> Compiling alphal00p-docs-builder v0.1.0 (/build/source/crates/alphal00p-docs-builder)
  66. 34.45 s gammaloop-workspace-doctest> Compiling pyo3-build-config v0.28.3
  67. 34.46 s gammaloop-workspace-doctest> Compiling proptest v1.11.0
  68. 34.65 s gammaloop-workspace-doctest> Compiling kurvst v0.1.0 (/build/source/crates/kurvst)
  69. 35.90 s gammaloop-workspace-doctest> Compiling test-log-macros v0.2.20
  70. 41.83 s gammaloop-workspace-doctest> Compiling test-log v0.2.20
  71. 42.24 s gammaloop-workspace-doctest> Compiling alphal00p-docs-examples v0.1.0 (/build/source/crates/alphal00p-docs-examples)
  72. 47.48 s gammaloop-workspace-doctest> Compiling pyo3-ffi v0.28.3
  73. 47.49 s gammaloop-workspace-doctest> Compiling pyo3-macros-backend v0.28.3
  74. 47.52 s gammaloop-workspace-doctest> Compiling pyo3 v0.28.3
  75. 47.58 s gammaloop-workspace-doctest> Compiling numpy v0.28.0
  76. 48.03 s gammaloop-workspace-doctest> Compiling gammaloop-api v0.1.0 (/build/source/crates/gammaloop-api)
  77. 49.26 s gammaloop-workspace-doctest> Compiling gungraun v0.18.2
  78. 63.41 s gammaloop-workspace-doctest> Compiling pyo3-macros v0.28.3
  79. 70.67 s gammaloop-workspace-doctest> Compiling pyo3-stub-gen v0.17.2
  80. 71.82 s gammaloop-workspace-doctest> Compiling numerica v2.2.0 (https://github.com/symbolica-dev/symbolica?branch=dev#0441bd7a)
  81. 74.89 s gammaloop-workspace-doctest> Compiling graphica v2.1.0 (https://github.com/symbolica-dev/symbolica?branch=dev#0441bd7a)
  82. 79.77 s gammaloop-workspace-doctest> Compiling symbolica-utils v0.1.0 (/build/source/crates/symbolica-utils)
  83. 344.17 s gammaloop-workspace-doctest> Compiling gammaloop-workspace-hack v0.1.0 (/build/source/crates/gammaloop-workspace-hack)
  84. 344.22 s gammaloop-workspace-doctest> Compiling spenso-macros v0.3.2 (/build/source/crates/spenso-macros)
  85. 344.32 s gammaloop-workspace-doctest> Compiling linnet v0.17.0 (/build/source/crates/linnet)
  86. 347.78 s gammaloop-workspace-doctest> Compiling spenso v0.6.0 (/build/source/crates/spenso)
  87. 357.72 s gammaloop-workspace-doctest> Compiling idenso v0.3.0 (/build/source/crates/idenso)
  88. 357.77 s gammaloop-workspace-doctest> Compiling gammaloop-tracing-filter v0.1.0 (/build/source/crates/gammaloop-tracing-filter)
  89. 359.57 s gammaloop-workspace-doctest> Compiling spenso-hep-lib v0.1.7 (/build/source/crates/spenso-hep-lib)
  90. 359.81 s gammaloop-workspace-doctest> Compiling spynso3 v0.1.2 (/build/source/crates/spynso3)
  91. 410.03 s gammaloop-workspace-doctest> Compiling linnest v0.1.0 (/build/source/crates/linnest)
  92. 410.05 s gammaloop-workspace-doctest> Compiling linnet-py v0.1.0 (/build/source/crates/linnet-py)
  93. 543.65 s gammaloop-workspace-doctest> Finished `ci-optim` profile [optimized] target(s) in 8m 38s
  94. 543.79 s gammaloop-workspace-doctest> warning: the following packages contain code that will be rejected by a future version of Rust: proc-macro-error2 v2.0.1
  95. 543.79 s gammaloop-workspace-doctest> note: to see what the problems were, use the option `--future-incompat-report`, or run `cargo report future-incompatibilities --id 1`
  96. 543.82 s gammaloop-workspace-doctest> Doc-tests alphal00p_docs_builder
  97. 544.00 s gammaloop-workspace-doctest>
  98. 544.00 s gammaloop-workspace-doctest> running 0 tests
  99. 544.00 s gammaloop-workspace-doctest>
  100. 544.00 s gammaloop-workspace-doctest> test result: ok. 0 passed; 0 failed; 0 ignored; 0 measured; 0 filtered out; finished in 0.00s
  101. 544.00 s gammaloop-workspace-doctest>
  102. 544.00 s gammaloop-workspace-doctest> Doc-tests alphal00p_docs_catalogs
  103. 545.38 s gammaloop-workspace-doctest>
  104. 545.38 s gammaloop-workspace-doctest> running 0 tests
  105. 545.38 s gammaloop-workspace-doctest>
  106. 545.38 s gammaloop-workspace-doctest> test result: ok. 0 passed; 0 failed; 0 ignored; 0 measured; 0 filtered out; finished in 0.00s
  107. 545.38 s gammaloop-workspace-doctest>
  108. 545.38 s gammaloop-workspace-doctest> Doc-tests alphal00p_docs_examples
  109. 545.40 s gammaloop-workspace-doctest>
  110. 545.40 s gammaloop-workspace-doctest> running 0 tests
  111. 545.40 s gammaloop-workspace-doctest>
  112. 545.40 s gammaloop-workspace-doctest> test result: ok. 0 passed; 0 failed; 0 ignored; 0 measured; 0 filtered out; finished in 0.00s
  113. 545.40 s gammaloop-workspace-doctest>
  114. 545.40 s gammaloop-workspace-doctest> Doc-tests alphal00p_docs
  115. 545.46 s gammaloop-workspace-doctest>
  116. 545.46 s gammaloop-workspace-doctest> running 0 tests
  117. 545.46 s gammaloop-workspace-doctest>
  118. 545.46 s gammaloop-workspace-doctest> test result: ok. 0 passed; 0 failed; 0 ignored; 0 measured; 0 filtered out; finished in 0.00s
  119. 545.46 s gammaloop-workspace-doctest>
  120. 545.46 s gammaloop-workspace-doctest> Doc-tests alphal00p_docs_schema
  121. 545.56 s gammaloop-workspace-doctest>
  122. 545.56 s gammaloop-workspace-doctest> running 0 tests
  123. 545.56 s gammaloop-workspace-doctest>
  124. 545.56 s gammaloop-workspace-doctest> test result: ok. 0 passed; 0 failed; 0 ignored; 0 measured; 0 filtered out; finished in 0.00s
  125. 545.56 s gammaloop-workspace-doctest>
  126. 545.56 s gammaloop-workspace-doctest> Doc-tests clinnet
  127. 545.60 s gammaloop-workspace-doctest>
  128. 545.60 s gammaloop-workspace-doctest> running 0 tests
  129. 545.60 s gammaloop-workspace-doctest>
  130. 545.60 s gammaloop-workspace-doctest> test result: ok. 0 passed; 0 failed; 0 ignored; 0 measured; 0 filtered out; finished in 0.00s
  131. 545.60 s gammaloop-workspace-doctest>
  132. 545.60 s gammaloop-workspace-doctest> Doc-tests gammaloop_api
  133. 546.78 s gammaloop-workspace-doctest>
  134. 546.78 s gammaloop-workspace-doctest> running 13 tests
  135. 546.80 s gammaloop-workspace-doctest> test crates/gammaloop-api/src/python.rs - python::GammaLoopAPI::get_default_runtime_settings (line 3688) ... FAILED
  136. 546.80 s gammaloop-workspace-doctest> test crates/gammaloop-api/src/python.rs - python::GammaLoopAPI::evaluate_sample (line 2926) ... FAILED
  137. 546.80 s gammaloop-workspace-doctest> test crates/gammaloop-api/src/python.rs - python::GammaLoopAPI::get_active_command_blocks (line 3652) ... FAILED
  138. 546.80 s gammaloop-workspace-doctest> test crates/gammaloop-api/src/python.rs - python::GammaLoopAPI::evaluate_samples (line 3040) ... FAILED
  139. 546.80 s gammaloop-workspace-doctest> test crates/gammaloop-api/src/python.rs - python::GammaLoopAPI::get_integrand_settings (line 3539) ... FAILED
  140. 546.81 s gammaloop-workspace-doctest> test crates/gammaloop-api/src/python.rs - python::GammaLoopAPI::get_integrand_info (line 3496) ... FAILED
  141. 546.91 s gammaloop-workspace-doctest> test crates/gammaloop-api/src/python.rs - python::GammaLoopAPI::run_command (line 3793) ... FAILED
  142. 546.92 s gammaloop-workspace-doctest> test crates/gammaloop-api/src/python.rs - python::GammaLoopAPI::get_run_history (line 3603) ... FAILED
  143. 546.93 s gammaloop-workspace-doctest> test crates/gammaloop-api/src/python.rs - python::atom_to_canonical_string (line 128) ... FAILED
  144. 546.93 s gammaloop-workspace-doctest> test crates/gammaloop-api/src/python.rs - python::evaluate_graph_overall_factor (line 95) ... FAILED
  145. 546.94 s gammaloop-workspace-doctest> test crates/gammaloop-api/src/python.rs - python::GammaLoopAPI::get_global_settings (line 3631) ... FAILED
  146. 546.95 s gammaloop-workspace-doctest> test crates/gammaloop-api/src/python.rs - python::atom_to_dots (line 157) ... FAILED
  147. 546.96 s gammaloop-workspace-doctest> test crates/gammaloop-api/src/python.rs - python::GammaLoopAPI::new_python (line 2804) ... FAILED
  148. 546.96 s gammaloop-workspace-doctest>
  149. 546.96 s gammaloop-workspace-doctest> failures:
  150. 546.96 s gammaloop-workspace-doctest>
  151. 546.96 s gammaloop-workspace-doctest> ---- crates/gammaloop-api/src/python.rs - python::GammaLoopAPI::get_default_runtime_settings (line 3688) stdout ----
  152. 546.96 s gammaloop-workspace-doctest> error: expected one of `!` or `::`, found `=`
  153. 546.96 s gammaloop-workspace-doctest> --> crates/gammaloop-api/src/python.rs:3689:9
  154. 546.96 s gammaloop-workspace-doctest> |
  155. 546.96 s gammaloop-workspace-doctest> 3689 | runtime = api.get_default_runtime_settings()
  156. 546.96 s gammaloop-workspace-doctest> | ^ expected one of `!` or `::`
  157. 546.96 s gammaloop-workspace-doctest>
  158. 546.96 s gammaloop-workspace-doctest> error: aborting due to 1 previous error
  159. 546.96 s gammaloop-workspace-doctest>
  160. 546.96 s gammaloop-workspace-doctest> Couldn't compile the test.
  161. 546.96 s gammaloop-workspace-doctest> ---- crates/gammaloop-api/src/python.rs - python::GammaLoopAPI::evaluate_sample (line 2926) stdout ----
  162. 546.96 s gammaloop-workspace-doctest> error: expected one of `!` or `::`, found `=`
  163. 546.96 s gammaloop-workspace-doctest> --> crates/gammaloop-api/src/python.rs:2927:8
  164. 546.96 s gammaloop-workspace-doctest> |
  165. 546.96 s gammaloop-workspace-doctest> 2927 | result = api.evaluate_sample(point, process_id=0, minimal_output=True)
  166. 546.96 s gammaloop-workspace-doctest> | ^ expected one of `!` or `::`
  167. 546.96 s gammaloop-workspace-doctest>
  168. 546.96 s gammaloop-workspace-doctest> error: aborting due to 1 previous error
  169. 546.96 s gammaloop-workspace-doctest>
  170. 546.96 s gammaloop-workspace-doctest> Couldn't compile the test.
  171. 546.96 s gammaloop-workspace-doctest> ---- crates/gammaloop-api/src/python.rs - python::GammaLoopAPI::get_active_command_blocks (line 3652) stdout ----
  172. 546.96 s gammaloop-workspace-doctest> error: expected item, found keyword `for`
  173. 546.96 s gammaloop-workspace-doctest> --> crates/gammaloop-api/src/python.rs:3653:1
  174. 546.96 s gammaloop-workspace-doctest> |
  175. 546.96 s gammaloop-workspace-doctest> 3653 | for name, commands in api.get_active_command_blocks().items():
  176. 546.96 s gammaloop-workspace-doctest> | ^^^ expected item
  177. 546.96 s gammaloop-workspace-doctest> |
  178. 546.96 s gammaloop-workspace-doctest> = note: for a full list of items that can appear in modules, see <https://doc.rust-lang.org/reference/items.html>
  179. 546.96 s gammaloop-workspace-doctest>
  180. 546.96 s gammaloop-workspace-doctest> error: aborting due to 1 previous error
  181. 546.96 s gammaloop-workspace-doctest>
  182. 546.96 s gammaloop-workspace-doctest> Couldn't compile the test.
  183. 546.96 s gammaloop-workspace-doctest> ---- crates/gammaloop-api/src/python.rs - python::GammaLoopAPI::evaluate_samples (line 3040) stdout ----
  184. 546.96 s gammaloop-workspace-doctest> error: expected one of `!` or `::`, found `=`
  185. 546.96 s gammaloop-workspace-doctest> --> crates/gammaloop-api/src/python.rs:3041:8
  186. 546.96 s gammaloop-workspace-doctest> |
  187. 546.96 s gammaloop-workspace-doctest> 3041 | points = numpy.asarray(points, dtype=numpy.float64)
  188. 546.96 s gammaloop-workspace-doctest> | ^ expected one of `!` or `::`
  189. 546.96 s gammaloop-workspace-doctest>
  190. 546.96 s gammaloop-workspace-doctest> error: aborting due to 1 previous error
  191. 546.96 s gammaloop-workspace-doctest>
  192. 546.96 s gammaloop-workspace-doctest> Couldn't compile the test.
  193. 546.96 s gammaloop-workspace-doctest> ---- crates/gammaloop-api/src/python.rs - python::GammaLoopAPI::get_integrand_settings (line 3539) stdout ----
  194. 546.96 s gammaloop-workspace-doctest> error: expected one of `!` or `::`, found `=`
  195. 546.96 s gammaloop-workspace-doctest> --> crates/gammaloop-api/src/python.rs:3540:10
  196. 546.96 s gammaloop-workspace-doctest> |
  197. 546.96 s gammaloop-workspace-doctest> 3540 | settings = api.get_integrand_settings(process_id=0)
  198. 546.96 s gammaloop-workspace-doctest> | ^ expected one of `!` or `::`
  199. 546.96 s gammaloop-workspace-doctest>
  200. 546.96 s gammaloop-workspace-doctest> error: aborting due to 1 previous error
  201. 546.96 s gammaloop-workspace-doctest>
  202. 546.96 s gammaloop-workspace-doctest> Couldn't compile the test.
  203. 546.96 s gammaloop-workspace-doctest> ---- crates/gammaloop-api/src/python.rs - python::GammaLoopAPI::get_integrand_info (line 3496) stdout ----
  204. 546.96 s gammaloop-workspace-doctest> error: expected one of `!` or `::`, found `=`
  205. 546.96 s gammaloop-workspace-doctest> --> crates/gammaloop-api/src/python.rs:3497:6
  206. 546.96 s gammaloop-workspace-doctest> |
  207. 546.96 s gammaloop-workspace-doctest> 3497 | info = api.get_integrand_info(process_id=0)
  208. 546.96 s gammaloop-workspace-doctest> | ^ expected one of `!` or `::`
  209. 546.96 s gammaloop-workspace-doctest>
  210. 546.96 s gammaloop-workspace-doctest> error: aborting due to 1 previous error
  211. 546.96 s gammaloop-workspace-doctest>
  212. 546.96 s gammaloop-workspace-doctest> Couldn't compile the test.
  213. 546.96 s gammaloop-workspace-doctest> ---- crates/gammaloop-api/src/python.rs - python::GammaLoopAPI::run_command (line 3793) stdout ----
  214. 546.96 s gammaloop-workspace-doctest> error[E0425]: cannot find value `api` in this scope
  215. 546.96 s gammaloop-workspace-doctest> --> crates/gammaloop-api/src/python.rs:3794:1
  216. 546.96 s gammaloop-workspace-doctest> |
  217. 546.96 s gammaloop-workspace-doctest> 3794 | api.run("display processes")
  218. 546.96 s gammaloop-workspace-doctest> | ^^^ not found in this scope
  219. 546.96 s gammaloop-workspace-doctest>
  220. 546.96 s gammaloop-workspace-doctest> error: aborting due to 1 previous error
  221. 546.96 s gammaloop-workspace-doctest>
  222. 546.96 s gammaloop-workspace-doctest> For more information about this error, try `rustc --explain E0425`.
  223. 546.96 s gammaloop-workspace-doctest> Couldn't compile the test.
  224. 546.96 s gammaloop-workspace-doctest> ---- crates/gammaloop-api/src/python.rs - python::GammaLoopAPI::get_run_history (line 3603) stdout ----
  225. 546.96 s gammaloop-workspace-doctest> error[E0425]: cannot find value `run_card_toml` in this scope
  226. 546.96 s gammaloop-workspace-doctest> --> crates/gammaloop-api/src/python.rs:3604:1
  227. 546.96 s gammaloop-workspace-doctest> |
  228. 546.96 s gammaloop-workspace-doctest> 3604 | run_card_toml = api.get_run_history()
  229. 546.96 s gammaloop-workspace-doctest> | ^^^^^^^^^^^^^
  230. 546.96 s gammaloop-workspace-doctest> |
  231. 546.96 s gammaloop-workspace-doctest> help: you might have meant to introduce a new binding
  232. 546.96 s gammaloop-workspace-doctest> |
  233. 546.96 s gammaloop-workspace-doctest> 3604 | let run_card_toml = api.get_run_history()
  234. 546.96 s gammaloop-workspace-doctest> | +++
  235. 546.96 s gammaloop-workspace-doctest>
  236. 546.96 s gammaloop-workspace-doctest> error[E0425]: cannot find value `api` in this scope
  237. 546.96 s gammaloop-workspace-doctest> --> crates/gammaloop-api/src/python.rs:3604:17
  238. 546.96 s gammaloop-workspace-doctest> |
  239. 546.96 s gammaloop-workspace-doctest> 3604 | run_card_toml = api.get_run_history()
  240. 546.96 s gammaloop-workspace-doctest> | ^^^ not found in this scope
  241. 546.96 s gammaloop-workspace-doctest>
  242. 546.96 s gammaloop-workspace-doctest> error: aborting due to 2 previous errors
  243. 546.96 s gammaloop-workspace-doctest>
  244. 546.96 s gammaloop-workspace-doctest> For more information about this error, try `rustc --explain E0425`.
  245. 546.96 s gammaloop-workspace-doctest> Couldn't compile the test.
  246. 546.96 s gammaloop-workspace-doctest> ---- crates/gammaloop-api/src/python.rs - python::atom_to_canonical_string (line 128) stdout ----
  247. 546.96 s gammaloop-workspace-doctest> error[E0425]: cannot find function `atom_to_canonical_string` in this scope
  248. 546.96 s gammaloop-workspace-doctest> --> crates/gammaloop-api/src/python.rs:129:1
  249. 546.96 s gammaloop-workspace-doctest> |
  250. 546.96 s gammaloop-workspace-doctest> 129 | atom_to_canonical_string("x + x")
  251. 546.96 s gammaloop-workspace-doctest> | ^^^^^^^^^^^^^^^^^^^^^^^^ not found in this scope
  252. 546.96 s gammaloop-workspace-doctest>
  253. 546.96 s gammaloop-workspace-doctest> error: aborting due to 1 previous error
  254. 546.96 s gammaloop-workspace-doctest>
  255. 546.96 s gammaloop-workspace-doctest> For more information about this error, try `rustc --explain E0425`.
  256. 546.96 s gammaloop-workspace-doctest> Couldn't compile the test.
  257. 546.96 s gammaloop-workspace-doctest> ---- crates/gammaloop-api/src/python.rs - python::evaluate_graph_overall_factor (line 95) stdout ----
  258. 546.96 s gammaloop-workspace-doctest> error[E0425]: cannot find function `evaluate_graph_overall_factor` in this scope
  259. 546.96 s gammaloop-workspace-doctest> --> crates/gammaloop-api/src/python.rs:96:1
  260. 546.96 s gammaloop-workspace-doctest> |
  261. 546.96 s gammaloop-workspace-doctest> 96 | evaluate_graph_overall_factor(
  262. 546.96 s gammaloop-workspace-doctest> | ^^^^^^^^^^^^^^^^^^^^^^^^^^^^^ not found in this scope
  263. 546.96 s gammaloop-workspace-doctest>
  264. 546.96 s gammaloop-workspace-doctest> error: aborting due to 1 previous error
  265. 546.96 s gammaloop-workspace-doctest>
  266. 546.96 s gammaloop-workspace-doctest> For more information about this error, try `rustc --explain E0425`.
  267. 546.96 s gammaloop-workspace-doctest> Couldn't compile the test.
  268. 546.96 s gammaloop-workspace-doctest> ---- crates/gammaloop-api/src/python.rs - python::GammaLoopAPI::get_global_settings (line 3631) stdout ----
  269. 546.96 s gammaloop-workspace-doctest> error[E0425]: cannot find value `settings_toml` in this scope
  270. 546.96 s gammaloop-workspace-doctest> --> crates/gammaloop-api/src/python.rs:3632:1
  271. 546.96 s gammaloop-workspace-doctest> |
  272. 546.96 s gammaloop-workspace-doctest> 3632 | settings_toml = api.get_global_settings()
  273. 546.96 s gammaloop-workspace-doctest> | ^^^^^^^^^^^^^
  274. 546.96 s gammaloop-workspace-doctest> |
  275. 546.96 s gammaloop-workspace-doctest> help: you might have meant to introduce a new binding
  276. 546.96 s gammaloop-workspace-doctest> |
  277. 546.96 s gammaloop-workspace-doctest> 3632 | let settings_toml = api.get_global_settings()
  278. 546.96 s gammaloop-workspace-doctest> | +++
  279. 546.96 s gammaloop-workspace-doctest>
  280. 546.96 s gammaloop-workspace-doctest> error[E0425]: cannot find value `api` in this scope
  281. 546.96 s gammaloop-workspace-doctest> --> crates/gammaloop-api/src/python.rs:3632:17
  282. 546.96 s gammaloop-workspace-doctest> |
  283. 546.96 s gammaloop-workspace-doctest> 3632 | settings_toml = api.get_global_settings()
  284. 546.96 s gammaloop-workspace-doctest> | ^^^ not found in this scope
  285. 546.96 s gammaloop-workspace-doctest>
  286. 546.96 s gammaloop-workspace-doctest> error: aborting due to 2 previous errors
  287. 546.96 s gammaloop-workspace-doctest>
  288. 546.96 s gammaloop-workspace-doctest> For more information about this error, try `rustc --explain E0425`.
  289. 546.96 s gammaloop-workspace-doctest> Couldn't compile the test.
  290. 546.96 s gammaloop-workspace-doctest> ---- crates/gammaloop-api/src/python.rs - python::atom_to_dots (line 157) stdout ----
  291. 546.96 s gammaloop-workspace-doctest> error[E0425]: cannot find function `to_dots` in this scope
  292. 546.96 s gammaloop-workspace-doctest> --> crates/gammaloop-api/src/python.rs:158:1
  293. 546.96 s gammaloop-workspace-doctest> |
  294. 546.96 s gammaloop-workspace-doctest> 158 | to_dots("p(mu) * q(mu)")
  295. 546.96 s gammaloop-workspace-doctest> | ^^^^^^^ not found in this scope
  296. 546.96 s gammaloop-workspace-doctest>
  297. 546.96 s gammaloop-workspace-doctest> error: aborting due to 1 previous error
  298. 546.96 s gammaloop-workspace-doctest>
  299. 546.96 s gammaloop-workspace-doctest> For more information about this error, try `rustc --explain E0425`.
  300. 546.96 s gammaloop-workspace-doctest> Couldn't compile the test.
  301. 546.96 s gammaloop-workspace-doctest> ---- crates/gammaloop-api/src/python.rs - python::GammaLoopAPI::new_python (line 2804) stdout ----
  302. 546.96 s gammaloop-workspace-doctest> error[E0425]: cannot find value `api` in this scope
  303. 546.96 s gammaloop-workspace-doctest> --> crates/gammaloop-api/src/python.rs:2805:1
  304. 546.96 s gammaloop-workspace-doctest> |
  305. 546.96 s gammaloop-workspace-doctest> 2805 | api = GammaLoopAPI(state_folder="./state", read_only_state=True)
  306. 546.96 s gammaloop-workspace-doctest> | ^^^
  307. 546.96 s gammaloop-workspace-doctest> |
  308. 546.96 s gammaloop-workspace-doctest> help: you might have meant to introduce a new binding
  309. 546.96 s gammaloop-workspace-doctest> |
  310. 546.96 s gammaloop-workspace-doctest> 2805 | let api = GammaLoopAPI(state_folder="./state", read_only_state=True)
  311. 546.96 s gammaloop-workspace-doctest> | +++
  312. 546.96 s gammaloop-workspace-doctest>
  313. 546.96 s gammaloop-workspace-doctest> error[E0425]: cannot find value `state_folder` in this scope
  314. 546.96 s gammaloop-workspace-doctest> --> crates/gammaloop-api/src/python.rs:2805:20
  315. 546.96 s gammaloop-workspace-doctest> |
  316. 546.96 s gammaloop-workspace-doctest> 2805 | api = GammaLoopAPI(state_folder="./state", read_only_state=True)
  317. 546.96 s gammaloop-workspace-doctest> | ^^^^^^^^^^^^ not found in this scope
  318. 546.96 s gammaloop-workspace-doctest>
  319. 546.96 s gammaloop-workspace-doctest> error[E0425]: cannot find value `read_only_state` in this scope
  320. 546.96 s gammaloop-workspace-doctest> --> crates/gammaloop-api/src/python.rs:2805:44
  321. 546.96 s gammaloop-workspace-doctest> |
  322. 546.96 s gammaloop-workspace-doctest> 2805 | api = GammaLoopAPI(state_folder="./state", read_only_state=True)
  323. 546.96 s gammaloop-workspace-doctest> | ^^^^^^^^^^^^^^^ not found in this scope
  324. 546.96 s gammaloop-workspace-doctest>
  325. 546.96 s gammaloop-workspace-doctest> error[E0425]: cannot find value `True` in this scope
  326. 546.96 s gammaloop-workspace-doctest> --> crates/gammaloop-api/src/python.rs:2805:60
  327. 546.96 s gammaloop-workspace-doctest> |
  328. 546.96 s gammaloop-workspace-doctest> 2805 | api = GammaLoopAPI(state_folder="./state", read_only_state=True)
  329. 546.96 s gammaloop-workspace-doctest> | ^^^^ not found in this scope
  330. 546.96 s gammaloop-workspace-doctest> |
  331. 546.96 s gammaloop-workspace-doctest> help: you may want to use a bool value instead
  332. 546.96 s gammaloop-workspace-doctest> |
  333. 546.96 s gammaloop-workspace-doctest> 2805 - api = GammaLoopAPI(state_folder="./state", read_only_state=True)
  334. 546.96 s gammaloop-workspace-doctest> 2805 + api = GammaLoopAPI(state_folder="./state", read_only_state=true)
  335. 546.96 s gammaloop-workspace-doctest> |
  336. 546.96 s gammaloop-workspace-doctest>
  337. 546.96 s gammaloop-workspace-doctest> error[E0425]: cannot find function, tuple struct or tuple variant `GammaLoopAPI` in this scope
  338. 546.96 s gammaloop-workspace-doctest> --> crates/gammaloop-api/src/python.rs:2805:7
  339. 546.96 s gammaloop-workspace-doctest> |
  340. 546.96 s gammaloop-workspace-doctest> 2805 | api = GammaLoopAPI(state_folder="./state", read_only_state=True)
  341. 546.96 s gammaloop-workspace-doctest> | ^^^^^^^^^^^^ not found in this scope
  342. 546.96 s gammaloop-workspace-doctest>
  343. 546.96 s gammaloop-workspace-doctest> error: aborting due to 5 previous errors
  344. 546.96 s gammaloop-workspace-doctest>
  345. 546.96 s gammaloop-workspace-doctest> For more information about this error, try `rustc --explain E0425`.
  346. 546.96 s gammaloop-workspace-doctest> Couldn't compile the test.
  347. 546.96 s gammaloop-workspace-doctest>
  348. 546.96 s gammaloop-workspace-doctest> failures:
  349. 546.96 s gammaloop-workspace-doctest> crates/gammaloop-api/src/python.rs - python::GammaLoopAPI::evaluate_sample (line 2926)
  350. 546.96 s gammaloop-workspace-doctest> crates/gammaloop-api/src/python.rs - python::GammaLoopAPI::evaluate_samples (line 3040)
  351. 546.96 s gammaloop-workspace-doctest> crates/gammaloop-api/src/python.rs - python::GammaLoopAPI::get_active_command_blocks (line 3652)
  352. 546.96 s gammaloop-workspace-doctest> crates/gammaloop-api/src/python.rs - python::GammaLoopAPI::get_default_runtime_settings (line 3688)
  353. 546.96 s gammaloop-workspace-doctest> crates/gammaloop-api/src/python.rs - python::GammaLoopAPI::get_global_settings (line 3631)
  354. 546.96 s gammaloop-workspace-doctest> crates/gammaloop-api/src/python.rs - python::GammaLoopAPI::get_integrand_info (line 3496)
  355. 546.96 s gammaloop-workspace-doctest> crates/gammaloop-api/src/python.rs - python::GammaLoopAPI::get_integrand_settings (line 3539)
  356. 546.96 s gammaloop-workspace-doctest> crates/gammaloop-api/src/python.rs - python::GammaLoopAPI::get_run_history (line 3603)
  357. 546.96 s gammaloop-workspace-doctest> crates/gammaloop-api/src/python.rs - python::GammaLoopAPI::new_python (line 2804)
  358. 546.96 s gammaloop-workspace-doctest> crates/gammaloop-api/src/python.rs - python::GammaLoopAPI::run_command (line 3793)
  359. 546.96 s gammaloop-workspace-doctest> crates/gammaloop-api/src/python.rs - python::atom_to_canonical_string (line 128)
  360. 546.96 s gammaloop-workspace-doctest> crates/gammaloop-api/src/python.rs - python::atom_to_dots (line 157)
  361. 546.96 s gammaloop-workspace-doctest> crates/gammaloop-api/src/python.rs - python::evaluate_graph_overall_factor (line 95)
  362. 546.96 s gammaloop-workspace-doctest>
  363. 546.96 s gammaloop-workspace-doctest> test result: FAILED. 0 passed; 13 failed; 0 ignored; 0 measured; 0 filtered out; finished in 0.19s
  364. 546.96 s gammaloop-workspace-doctest>
  365. 546.97 s gammaloop-workspace-doctest> error: doctest failed, to rerun pass `-p gammaloop-api --doc`
  366. 547.57 s error: Cannot build '/nix/store/d7n0kzr0ab2qmzp3m3y3jhx03bbngjym-gammaloop-workspace-doctest-0.1.0.drv'.
  367. 547.57 s Reason: builder failed with exit code 101.
  368. 547.57 s Output paths:
  369. 547.57 s /nix/store/m1rbsc5idl2jxvknq7bvqysz3ysaha7l-gammaloop-workspace-doctest-0.1.0
  370. 547.57 s Last 349 log lines:
  371. 547.57 s > Running phase: unpackPhase
  372. 547.57 s > unpacking source archive /nix/store/n62xwv096bc248rr6y7qpggfdbwshkw9-source
  373. 547.57 s > source root is source
  374. 547.57 s > Running phase: patchPhase
  375. 547.57 s > Executing configureCargoCommonVars
  376. 547.57 s > decompressing cargo artifacts from /nix/store/kbgwngi7xvi54jsr0kp8rhj1b9mfja7d-gammaloop-workspace-deps-deps-0.1.0/target.tar.zst to target
  377. 547.57 s > Running phase: updateAutotoolsGnuConfigScriptsPhase
  378. 547.57 s > Running phase: configurePhase
  379. 547.57 s > will append /build/source/.cargo-home/config.toml with contents of /nix/store/xdy1vvhll2bijdplvl9fcc2b9plkxhaa-vendor-cargo-deps/config.toml
  380. 547.57 s > default configurePhase, nothing to do
  381. 547.57 s > Running phase: buildPhase
  382. 547.57 s > +++ command cargo --version
  383. 547.57 s > cargo 1.97.0 (c980f4866 2026-06-30)
  384. 547.57 s > +++ command cargo test --profile ci-optim --doc --locked --workspace --features gammaloop-api/cli,gammaloop-tracing-filter/clap,gammaloop-tracing-filter/symbolica,idenso/bincode,idenso/reference-cases,linnet/bincode,linnet/drawing,linnet/nodestore-vec,linnet/rkyv,linnet/serde,linnet/symbolica,spenso-macros/shadowing,spenso/shadowing,symbolica/tracing_max_level_info
  385. 547.57 s > Compiling target-lexicon v0.13.5
  386. 547.57 s > Compiling symbolica v2.2.0 (https://github.com/symbolica-dev/symbolica?branch=dev#0441bd7a)
  387. 547.57 s > Compiling maplit v1.0.2
  388. 547.57 s > Compiling gammaloop-tracing-filter-macros v0.1.0 (/build/source/crates/gammaloop-tracing-filter-macros)
  389. 547.57 s > Compiling vakint v0.1.2 (/build/source/crates/vakint)
  390. 547.57 s > Compiling gammalooprs v0.3.4 (/build/source/crates/gammalooprs)
  391. 547.57 s > Compiling alphal00p-docs-macros v0.1.0 (/build/source/crates/alphal00p-docs-macros)
  392. 547.57 s > Compiling alphal00p-docs-schema v0.1.0 (/build/source/crates/alphal00p-docs-schema)
  393. 547.57 s > Compiling rustc_version v0.4.1
  394. 547.57 s > Compiling bincode v1.3.3
  395. 547.57 s > Compiling gungraun-runner v0.18.2
  396. 547.57 s > Compiling iai-callgrind-runner v0.14.2
  397. 547.57 s > Compiling target-triple v1.0.1
  398. 547.57 s > Compiling clinnet v0.1.8 (/build/source/crates/clinnet)
  399. 547.57 s > Compiling gammaloop-integration-tests v0.1.0 (/build/source/tests)
  400. 547.57 s > Compiling test-log-core v0.2.20
  401. 547.57 s > Compiling wait-timeout v0.2.1
  402. 547.57 s > Compiling iai-callgrind v0.14.2
  403. 547.57 s > Compiling quick-error v1.2.3
  404. 547.57 s > Compiling bit-vec v0.8.0
  405. 547.57 s > Compiling rusty-fork v0.3.1
  406. 547.57 s > Compiling bit-set v0.8.0
  407. 547.57 s > Compiling iai-callgrind-macros v0.5.1
  408. 547.57 s > Compiling rand_xorshift v0.4.0
  409. 547.57 s > Compiling console v0.15.11
  410. 547.57 s > Compiling glob v0.3.4
  411. 547.57 s > Compiling unarray v0.1.4
  412. 547.57 s > Compiling base64 v0.21.7
  413. 547.57 s > Compiling gungraun-macros v0.8.0
  414. 547.57 s > Compiling termcolor v1.4.1
  415. 547.57 s > Compiling alphal00p-docs-catalogs v0.1.0 (/build/source/crates/alphal00p-docs-catalogs)
  416. 547.57 s > Compiling similar-asserts v1.7.0
  417. 547.57 s > Compiling trybuild v1.0.120
  418. 547.57 s > Compiling ron v0.8.1
  419. 547.57 s > Compiling alphal00p-docs-builder v0.1.0 (/build/source/crates/alphal00p-docs-builder)
  420. 547.57 s > Compiling pyo3-build-config v0.28.3
  421. 547.57 s > Compiling proptest v1.11.0
  422. 547.57 s > Compiling kurvst v0.1.0 (/build/source/crates/kurvst)
  423. 547.57 s > Compiling test-log-macros v0.2.20
  424. 547.57 s > Compiling test-log v0.2.20
  425. 547.57 s > Compiling alphal00p-docs-examples v0.1.0 (/build/source/crates/alphal00p-docs-examples)
  426. 547.57 s > Compiling pyo3-ffi v0.28.3
  427. 547.57 s > Compiling pyo3-macros-backend v0.28.3
  428. 547.57 s > Compiling pyo3 v0.28.3
  429. 547.57 s > Compiling numpy v0.28.0
  430. 547.57 s > Compiling gammaloop-api v0.1.0 (/build/source/crates/gammaloop-api)
  431. 547.57 s > Compiling gungraun v0.18.2
  432. 547.57 s > Compiling pyo3-macros v0.28.3
  433. 547.57 s > Compiling pyo3-stub-gen v0.17.2
  434. 547.57 s > Compiling numerica v2.2.0 (https://github.com/symbolica-dev/symbolica?branch=dev#0441bd7a)
  435. 547.57 s > Compiling graphica v2.1.0 (https://github.com/symbolica-dev/symbolica?branch=dev#0441bd7a)
  436. 547.57 s > Compiling symbolica-utils v0.1.0 (/build/source/crates/symbolica-utils)
  437. 547.57 s > Compiling gammaloop-workspace-hack v0.1.0 (/build/source/crates/gammaloop-workspace-hack)
  438. 547.57 s > Compiling spenso-macros v0.3.2 (/build/source/crates/spenso-macros)
  439. 547.57 s > Compiling linnet v0.17.0 (/build/source/crates/linnet)
  440. 547.57 s > Compiling spenso v0.6.0 (/build/source/crates/spenso)
  441. 547.57 s > Compiling idenso v0.3.0 (/build/source/crates/idenso)
  442. 547.57 s > Compiling gammaloop-tracing-filter v0.1.0 (/build/source/crates/gammaloop-tracing-filter)
  443. 547.57 s > Compiling spenso-hep-lib v0.1.7 (/build/source/crates/spenso-hep-lib)
  444. 547.57 s > Compiling spynso3 v0.1.2 (/build/source/crates/spynso3)
  445. 547.57 s > Compiling linnest v0.1.0 (/build/source/crates/linnest)
  446. 547.57 s > Compiling linnet-py v0.1.0 (/build/source/crates/linnet-py)
  447. 547.57 s > Finished `ci-optim` profile [optimized] target(s) in 8m 38s
  448. 547.57 s > warning: the following packages contain code that will be rejected by a future version of Rust: proc-macro-error2 v2.0.1
  449. 547.57 s > note: to see what the problems were, use the option `--future-incompat-report`, or run `cargo report future-incompatibilities --id 1`
  450. 547.57 s > Doc-tests alphal00p_docs_builder
  451. 547.57 s >
  452. 547.57 s > running 0 tests
  453. 547.57 s >
  454. 547.57 s > test result: ok. 0 passed; 0 failed; 0 ignored; 0 measured; 0 filtered out; finished in 0.00s
  455. 547.57 s >
  456. 547.57 s > Doc-tests alphal00p_docs_catalogs
  457. 547.57 s >
  458. 547.57 s > running 0 tests
  459. 547.57 s >
  460. 547.57 s > test result: ok. 0 passed; 0 failed; 0 ignored; 0 measured; 0 filtered out; finished in 0.00s
  461. 547.57 s >
  462. 547.57 s > Doc-tests alphal00p_docs_examples
  463. 547.57 s >
  464. 547.57 s > running 0 tests
  465. 547.57 s >
  466. 547.57 s > test result: ok. 0 passed; 0 failed; 0 ignored; 0 measured; 0 filtered out; finished in 0.00s
  467. 547.57 s >
  468. 547.57 s > Doc-tests alphal00p_docs
  469. 547.57 s >
  470. 547.57 s > running 0 tests
  471. 547.57 s >
  472. 547.57 s > test result: ok. 0 passed; 0 failed; 0 ignored; 0 measured; 0 filtered out; finished in 0.00s
  473. 547.57 s >
  474. 547.57 s > Doc-tests alphal00p_docs_schema
  475. 547.57 s >
  476. 547.57 s > running 0 tests
  477. 547.57 s >
  478. 547.57 s > test result: ok. 0 passed; 0 failed; 0 ignored; 0 measured; 0 filtered out; finished in 0.00s
  479. 547.57 s >
  480. 547.57 s > Doc-tests clinnet
  481. 547.57 s >
  482. 547.57 s > running 0 tests
  483. 547.57 s >
  484. 547.57 s > test result: ok. 0 passed; 0 failed; 0 ignored; 0 measured; 0 filtered out; finished in 0.00s
  485. 547.57 s >
  486. 547.57 s > Doc-tests gammaloop_api
  487. 547.57 s >
  488. 547.57 s > running 13 tests
  489. 547.57 s > test crates/gammaloop-api/src/python.rs - python::GammaLoopAPI::get_default_runtime_settings (line 3688) ... FAILED
  490. 547.57 s > test crates/gammaloop-api/src/python.rs - python::GammaLoopAPI::evaluate_sample (line 2926) ... FAILED
  491. 547.57 s > test crates/gammaloop-api/src/python.rs - python::GammaLoopAPI::get_active_command_blocks (line 3652) ... FAILED
  492. 547.57 s > test crates/gammaloop-api/src/python.rs - python::GammaLoopAPI::evaluate_samples (line 3040) ... FAILED
  493. 547.57 s > test crates/gammaloop-api/src/python.rs - python::GammaLoopAPI::get_integrand_settings (line 3539) ... FAILED
  494. 547.57 s > test crates/gammaloop-api/src/python.rs - python::GammaLoopAPI::get_integrand_info (line 3496) ... FAILED
  495. 547.57 s > test crates/gammaloop-api/src/python.rs - python::GammaLoopAPI::run_command (line 3793) ... FAILED
  496. 547.57 s > test crates/gammaloop-api/src/python.rs - python::GammaLoopAPI::get_run_history (line 3603) ... FAILED
  497. 547.57 s > test crates/gammaloop-api/src/python.rs - python::atom_to_canonical_string (line 128) ... FAILED
  498. 547.57 s > test crates/gammaloop-api/src/python.rs - python::evaluate_graph_overall_factor (line 95) ... FAILED
  499. 547.57 s > test crates/gammaloop-api/src/python.rs - python::GammaLoopAPI::get_global_settings (line 3631) ... FAILED
  500. 547.57 s > test crates/gammaloop-api/src/python.rs - python::atom_to_dots (line 157) ... FAILED
  501. 547.57 s > test crates/gammaloop-api/src/python.rs - python::GammaLoopAPI::new_python (line 2804) ... FAILED
  502. 547.57 s >
  503. 547.57 s > failures:
  504. 547.57 s >
  505. 547.57 s > ---- crates/gammaloop-api/src/python.rs - python::GammaLoopAPI::get_default_runtime_settings (line 3688) stdout ----
  506. 547.57 s > error: expected one of `!` or `::`, found `=`
  507. 547.57 s > --> crates/gammaloop-api/src/python.rs:3689:9
  508. 547.57 s > |
  509. 547.57 s > 3689 | runtime = api.get_default_runtime_settings()
  510. 547.57 s > | ^ expected one of `!` or `::`
  511. 547.57 s >
  512. 547.57 s > error: aborting due to 1 previous error
  513. 547.57 s >
  514. 547.57 s > Couldn't compile the test.
  515. 547.57 s > ---- crates/gammaloop-api/src/python.rs - python::GammaLoopAPI::evaluate_sample (line 2926) stdout ----
  516. 547.57 s > error: expected one of `!` or `::`, found `=`
  517. 547.57 s > --> crates/gammaloop-api/src/python.rs:2927:8
  518. 547.57 s > |
  519. 547.57 s > 2927 | result = api.evaluate_sample(point, process_id=0, minimal_output=True)
  520. 547.57 s > | ^ expected one of `!` or `::`
  521. 547.57 s >
  522. 547.57 s > error: aborting due to 1 previous error
  523. 547.57 s >
  524. 547.57 s > Couldn't compile the test.
  525. 547.57 s > ---- crates/gammaloop-api/src/python.rs - python::GammaLoopAPI::get_active_command_blocks (line 3652) stdout ----
  526. 547.57 s > error: expected item, found keyword `for`
  527. 547.57 s > --> crates/gammaloop-api/src/python.rs:3653:1
  528. 547.57 s > |
  529. 547.57 s > 3653 | for name, commands in api.get_active_command_blocks().items():
  530. 547.57 s > | ^^^ expected item
  531. 547.57 s > |
  532. 547.57 s > = note: for a full list of items that can appear in modules, see <https://doc.rust-lang.org/reference/items.html>
  533. 547.57 s >
  534. 547.57 s > error: aborting due to 1 previous error
  535. 547.57 s >
  536. 547.57 s > Couldn't compile the test.
  537. 547.57 s > ---- crates/gammaloop-api/src/python.rs - python::GammaLoopAPI::evaluate_samples (line 3040) stdout ----
  538. 547.57 s > error: expected one of `!` or `::`, found `=`
  539. 547.57 s > --> crates/gammaloop-api/src/python.rs:3041:8
  540. 547.57 s > |
  541. 547.57 s > 3041 | points = numpy.asarray(points, dtype=numpy.float64)
  542. 547.57 s > | ^ expected one of `!` or `::`
  543. 547.57 s >
  544. 547.57 s > error: aborting due to 1 previous error
  545. 547.57 s >
  546. 547.57 s > Couldn't compile the test.
  547. 547.57 s > ---- crates/gammaloop-api/src/python.rs - python::GammaLoopAPI::get_integrand_settings (line 3539) stdout ----
  548. 547.57 s > error: expected one of `!` or `::`, found `=`
  549. 547.57 s > --> crates/gammaloop-api/src/python.rs:3540:10
  550. 547.57 s > |
  551. 547.57 s > 3540 | settings = api.get_integrand_settings(process_id=0)
  552. 547.57 s > | ^ expected one of `!` or `::`
  553. 547.57 s >
  554. 547.57 s > error: aborting due to 1 previous error
  555. 547.57 s >
  556. 547.57 s > Couldn't compile the test.
  557. 547.57 s > ---- crates/gammaloop-api/src/python.rs - python::GammaLoopAPI::get_integrand_info (line 3496) stdout ----
  558. 547.57 s > error: expected one of `!` or `::`, found `=`
  559. 547.57 s > --> crates/gammaloop-api/src/python.rs:3497:6
  560. 547.57 s > |
  561. 547.57 s > 3497 | info = api.get_integrand_info(process_id=0)
  562. 547.57 s > | ^ expected one of `!` or `::`
  563. 547.57 s >
  564. 547.57 s > error: aborting due to 1 previous error
  565. 547.57 s >
  566. 547.57 s > Couldn't compile the test.
  567. 547.57 s > ---- crates/gammaloop-api/src/python.rs - python::GammaLoopAPI::run_command (line 3793) stdout ----
  568. 547.57 s > error[E0425]: cannot find value `api` in this scope
  569. 547.57 s > --> crates/gammaloop-api/src/python.rs:3794:1
  570. 547.57 s > |
  571. 547.57 s > 3794 | api.run("display processes")
  572. 547.57 s > | ^^^ not found in this scope
  573. 547.57 s >
  574. 547.57 s > error: aborting due to 1 previous error
  575. 547.57 s >
  576. 547.57 s > For more information about this error, try `rustc --explain E0425`.
  577. 547.57 s > Couldn't compile the test.
  578. 547.57 s > ---- crates/gammaloop-api/src/python.rs - python::GammaLoopAPI::get_run_history (line 3603) stdout ----
  579. 547.57 s > error[E0425]: cannot find value `run_card_toml` in this scope
  580. 547.57 s > --> crates/gammaloop-api/src/python.rs:3604:1
  581. 547.57 s > |
  582. 547.57 s > 3604 | run_card_toml = api.get_run_history()
  583. 547.57 s > | ^^^^^^^^^^^^^
  584. 547.57 s > |
  585. 547.57 s > help: you might have meant to introduce a new binding
  586. 547.57 s > |
  587. 547.57 s > 3604 | let run_card_toml = api.get_run_history()
  588. 547.57 s > | +++
  589. 547.57 s >
  590. 547.57 s > error[E0425]: cannot find value `api` in this scope
  591. 547.57 s > --> crates/gammaloop-api/src/python.rs:3604:17
  592. 547.57 s > |
  593. 547.57 s > 3604 | run_card_toml = api.get_run_history()
  594. 547.57 s > | ^^^ not found in this scope
  595. 547.57 s >
  596. 547.57 s > error: aborting due to 2 previous errors
  597. 547.57 s >
  598. 547.57 s > For more information about this error, try `rustc --explain E0425`.
  599. 547.57 s > Couldn't compile the test.
  600. 547.57 s > ---- crates/gammaloop-api/src/python.rs - python::atom_to_canonical_string (line 128) stdout ----
  601. 547.58 s > error[E0425]: cannot find function `atom_to_canonical_string` in this scope
  602. 547.58 s > --> crates/gammaloop-api/src/python.rs:129:1
  603. 547.58 s > |
  604. 547.58 s > 129 | atom_to_canonical_string("x + x")
  605. 547.58 s > | ^^^^^^^^^^^^^^^^^^^^^^^^ not found in this scope
  606. 547.58 s >
  607. 547.58 s > error: aborting due to 1 previous error
  608. 547.58 s >
  609. 547.58 s > For more information about this error, try `rustc --explain E0425`.
  610. 547.58 s > Couldn't compile the test.
  611. 547.58 s > ---- crates/gammaloop-api/src/python.rs - python::evaluate_graph_overall_factor (line 95) stdout ----
  612. 547.58 s > error[E0425]: cannot find function `evaluate_graph_overall_factor` in this scope
  613. 547.58 s > --> crates/gammaloop-api/src/python.rs:96:1
  614. 547.58 s > |
  615. 547.58 s > 96 | evaluate_graph_overall_factor(
  616. 547.58 s > | ^^^^^^^^^^^^^^^^^^^^^^^^^^^^^ not found in this scope
  617. 547.58 s >
  618. 547.58 s > error: aborting due to 1 previous error
  619. 547.58 s >
  620. 547.58 s > For more information about this error, try `rustc --explain E0425`.
  621. 547.58 s > Couldn't compile the test.
  622. 547.58 s > ---- crates/gammaloop-api/src/python.rs - python::GammaLoopAPI::get_global_settings (line 3631) stdout ----
  623. 547.58 s > error[E0425]: cannot find value `settings_toml` in this scope
  624. 547.58 s > --> crates/gammaloop-api/src/python.rs:3632:1
  625. 547.58 s > |
  626. 547.58 s > 3632 | settings_toml = api.get_global_settings()
  627. 547.58 s > | ^^^^^^^^^^^^^
  628. 547.58 s > |
  629. 547.58 s > help: you might have meant to introduce a new binding
  630. 547.58 s > |
  631. 547.58 s > 3632 | let settings_toml = api.get_global_settings()
  632. 547.58 s > | +++
  633. 547.58 s >
  634. 547.58 s > error[E0425]: cannot find value `api` in this scope
  635. 547.58 s > --> crates/gammaloop-api/src/python.rs:3632:17
  636. 547.58 s > |
  637. 547.58 s > 3632 | settings_toml = api.get_global_settings()
  638. 547.58 s > | ^^^ not found in this scope
  639. 547.58 s >
  640. 547.58 s > error: aborting due to 2 previous errors
  641. 547.58 s >
  642. 547.58 s > For more information about this error, try `rustc --explain E0425`.
  643. 547.58 s > Couldn't compile the test.
  644. 547.58 s > ---- crates/gammaloop-api/src/python.rs - python::atom_to_dots (line 157) stdout ----
  645. 547.58 s > error[E0425]: cannot find function `to_dots` in this scope
  646. 547.58 s > --> crates/gammaloop-api/src/python.rs:158:1
  647. 547.58 s > |
  648. 547.58 s > 158 | to_dots("p(mu) * q(mu)")
  649. 547.58 s > | ^^^^^^^ not found in this scope
  650. 547.58 s >
  651. 547.58 s > error: aborting due to 1 previous error
  652. 547.58 s >
  653. 547.58 s > For more information about this error, try `rustc --explain E0425`.
  654. 547.58 s > Couldn't compile the test.
  655. 547.58 s > ---- crates/gammaloop-api/src/python.rs - python::GammaLoopAPI::new_python (line 2804) stdout ----
  656. 547.58 s > error[E0425]: cannot find value `api` in this scope
  657. 547.58 s > --> crates/gammaloop-api/src/python.rs:2805:1
  658. 547.58 s > |
  659. 547.58 s > 2805 | api = GammaLoopAPI(state_folder="./state", read_only_state=True)
  660. 547.58 s > | ^^^
  661. 547.58 s > |
  662. 547.58 s > help: you might have meant to introduce a new binding
  663. 547.58 s > |
  664. 547.58 s > 2805 | let api = GammaLoopAPI(state_folder="./state", read_only_state=True)
  665. 547.58 s > | +++
  666. 547.58 s >
  667. 547.58 s > error[E0425]: cannot find value `state_folder` in this scope
  668. 547.58 s > --> crates/gammaloop-api/src/python.rs:2805:20
  669. 547.58 s > |
  670. 547.58 s > 2805 | api = GammaLoopAPI(state_folder="./state", read_only_state=True)
  671. 547.58 s > | ^^^^^^^^^^^^ not found in this scope
  672. 547.58 s >
  673. 547.58 s > error[E0425]: cannot find value `read_only_state` in this scope
  674. 547.58 s > --> crates/gammaloop-api/src/python.rs:2805:44
  675. 547.58 s > |
  676. 547.58 s > 2805 | api = GammaLoopAPI(state_folder="./state", read_only_state=True)
  677. 547.58 s > | ^^^^^^^^^^^^^^^ not found in this scope
  678. 547.58 s >
  679. 547.58 s > error[E0425]: cannot find value `True` in this scope
  680. 547.58 s > --> crates/gammaloop-api/src/python.rs:2805:60
  681. 547.58 s > |
  682. 547.58 s > 2805 | api = GammaLoopAPI(state_folder="./state", read_only_state=True)
  683. 547.58 s > | ^^^^ not found in this scope
  684. 547.58 s > |
  685. 547.58 s > help: you may want to use a bool value instead
  686. 547.58 s > |
  687. 547.58 s > 2805 - api = GammaLoopAPI(state_folder="./state", read_only_state=True)
  688. 547.58 s > 2805 + api = GammaLoopAPI(state_folder="./state", read_only_state=true)
  689. 547.58 s > |
  690. 547.58 s >
  691. 547.58 s > error[E0425]: cannot find function, tuple struct or tuple variant `GammaLoopAPI` in this scope
  692. 547.58 s > --> crates/gammaloop-api/src/python.rs:2805:7
  693. 547.58 s > |
  694. 547.58 s > 2805 | api = GammaLoopAPI(state_folder="./state", read_only_state=True)
  695. 547.58 s > | ^^^^^^^^^^^^ not found in this scope
  696. 547.58 s >
  697. 547.58 s > error: aborting due to 5 previous errors
  698. 547.58 s >
  699. 547.58 s > For more information about this error, try `rustc --explain E0425`.
  700. 547.58 s > Couldn't compile the test.
  701. 547.58 s >
  702. 547.58 s > failures:
  703. 547.58 s > crates/gammaloop-api/src/python.rs - python::GammaLoopAPI::evaluate_sample (line 2926)
  704. 547.58 s > crates/gammaloop-api/src/python.rs - python::GammaLoopAPI::evaluate_samples (line 3040)
  705. 547.58 s > crates/gammaloop-api/src/python.rs - python::GammaLoopAPI::get_active_command_blocks (line 3652)
  706. 547.58 s > crates/gammaloop-api/src/python.rs - python::GammaLoopAPI::get_default_runtime_settings (line 3688)
  707. 547.58 s > crates/gammaloop-api/src/python.rs - python::GammaLoopAPI::get_global_settings (line 3631)
  708. 547.58 s > crates/gammaloop-api/src/python.rs - python::GammaLoopAPI::get_integrand_info (line 3496)
  709. 547.58 s > crates/gammaloop-api/src/python.rs - python::GammaLoopAPI::get_integrand_settings (line 3539)
  710. 547.58 s > crates/gammaloop-api/src/python.rs - python::GammaLoopAPI::get_run_history (line 3603)
  711. 547.58 s > crates/gammaloop-api/src/python.rs - python::GammaLoopAPI::new_python (line 2804)
  712. 547.58 s > crates/gammaloop-api/src/python.rs - python::GammaLoopAPI::run_command (line 3793)
  713. 547.58 s > crates/gammaloop-api/src/python.rs - python::atom_to_canonical_string (line 128)
  714. 547.58 s > crates/gammaloop-api/src/python.rs - python::atom_to_dots (line 157)
  715. 547.58 s > crates/gammaloop-api/src/python.rs - python::evaluate_graph_overall_factor (line 95)
  716. 547.58 s >
  717. 547.58 s > test result: FAILED. 0 passed; 13 failed; 0 ignored; 0 measured; 0 filtered out; finished in 0.19s
  718. 547.58 s >
  719. 547.58 s > error: doctest failed, to rerun pass `-p gammaloop-api --doc`
  720. 547.58 s For full logs, run:
  721. 547.58 s nix log /nix/store/d7n0kzr0ab2qmzp3m3y3jhx03bbngjym-gammaloop-workspace-doctest-0.1.0.drv
  722. 547.69 s [0 built (1 failed)]Run failed.