0.11 s
$ /nix/store/9ypz3flqsrl5xl495mm8h645gadjsxi1-coreutils-9.11/bin/timeout --kill-after=15s 7200s /nix/store/23zk8sgzamrbmj1fday15szf7f2279s8-nix-2.34.7/bin/nix --extra-experimental-features nix-command --extra-experimental-features flakes flake clone git+https://github.com/alphal00p/gammaloop --dest /tmp/nix-ci-worker/stable-pwd/repo/
0.31 s
Cloning into '/tmp/nix-ci-worker/stable-pwd/repo'...
1.99 s
remote: Enumerating objects: 64182, done.
2.22 s
remote: Counting objects: 0% (1/9536)
remote: Counting objects: 1% (96/9536)
remote: Counting objects: 2% (191/9536)
remote: Counting objects: 3% (287/9536)
remote: Counting objects: 4% (382/9536)
remote: Counting objects: 5% (477/9536)
remote: Counting objects: 6% (573/9536)
remote: Counting objects: 7% (668/9536)
remote: Counting objects: 8% (763/9536)
remote: Counting objects: 9% (859/9536)
remote: Counting objects: 10% (954/9536)
remote: Counting objects: 11% (1049/9536)
remote: Counting objects: 12% (1145/9536)
remote: Counting objects: 13% (1240/9536)
remote: Counting objects: 14% (1336/9536)
remote: Counting objects: 15% (1431/9536)
remote: Counting objects: 16% (1526/9536)
remote: Counting objects: 17% (1622/9536)
remote: Counting objects: 18% (1717/9536)
remote: Counting objects: 19% (1812/9536)
remote: Counting objects: 20% (1908/9536)
remote: Counting objects: 21% (2003/9536)
remote: Counting objects: 22% (2098/9536)
remote: Counting objects: 23% (2194/9536)
remote: Counting objects: 24% (2289/9536)
remote: Counting objects: 25% (2384/9536)
remote: Counting objects: 26% (2480/9536)
remote: Counting objects: 27% (2575/9536)
remote: Counting objects: 28% (2671/9536)
remote: Counting objects: 29% (2766/9536)
remote: Counting objects: 30% (2861/9536)
remote: Counting objects: 31% (2957/9536)
remote: Counting objects: 32% (3052/9536)
remote: Counting objects: 33% (3147/9536)
remote: Counting objects: 34% (3243/9536)
remote: Counting objects: 35% (3338/9536)
remote: Counting objects: 36% (3433/9536)
remote: Counting objects: 37% (3529/9536)
remote: Counting objects: 38% (3624/9536)
remote: Counting objects: 39% (3720/9536)
remote: Counting objects: 40% (3815/9536)
remote: Counting objects: 41% (3910/9536)
remote: Counting objects: 42% (4006/9536)
remote: Counting objects: 43% (4101/9536)
remote: Counting objects: 44% (4196/9536)
remote: Counting objects: 45% (4292/9536)
remote: Counting objects: 46% (4387/9536)
remote: Counting objects: 47% (4482/9536)
remote: Counting objects: 48% (4578/9536)
remote: Counting objects: 49% (4673/9536)
remote: Counting objects: 50% (4768/9536)
remote: Counting objects: 51% (4864/9536)
remote: Counting objects: 52% (4959/9536)
remote: Counting objects: 53% (5055/9536)
remote: Counting objects: 54% (5150/9536)
remote: Counting objects: 55% (5245/9536)
remote: Counting objects: 56% (5341/9536)
remote: Counting objects: 57% (5436/9536)
remote: Counting objects: 58% (5531/9536)
remote: Counting objects: 59% (5627/9536)
remote: Counting objects: 60% (5722/9536)
remote: Counting objects: 61% (5817/9536)
remote: Counting objects: 62% (5913/9536)
remote: Counting objects: 63% (6008/9536)
remote: Counting objects: 64% (6104/9536)
remote: Counting objects: 65% (6199/9536)
remote: Counting objects: 66% (6294/9536)
remote: Counting objects: 67% (6390/9536)
remote: Counting objects: 68% (6485/9536)
remote: Counting objects: 69% (6580/9536)
remote: Counting objects: 70% (6676/9536)
remote: Counting objects: 71% (6771/9536)
remote: Counting objects: 72% (6866/9536)
remote: Counting objects: 73% (6962/9536)
remote: Counting objects: 74% (7057/9536)
remote: Counting objects: 75% (7152/9536)
remote: Counting objects: 76% (7248/9536)
remote: Counting objects: 77% (7343/9536)
remote: Counting objects: 78% (7439/9536)
remote: Counting objects: 79% (7534/9536)
remote: Counting objects: 80% (7629/9536)
remote: Counting objects: 81% (7725/9536)
remote: Counting objects: 82% (7820/9536)
remote: Counting objects: 83% (7915/9536)
remote: Counting objects: 84% (8011/9536)
remote: Counting objects: 85% (8106/9536)
remote: Counting objects: 86% (8201/9536)
remote: Counting objects: 87% (8297/9536)
remote: Counting objects: 88% (8392/9536)
remote: Counting objects: 89% (8488/9536)
remote: Counting objects: 90% (8583/9536)
remote: Counting objects: 91% (8678/9536)
remote: Counting objects: 92% (8774/9536)
remote: Counting objects: 93% (8869/9536)
remote: Counting objects: 94% (8964/9536)
remote: Counting objects: 95% (9060/9536)
remote: Counting objects: 96% (9155/9536)
remote: Counting objects: 97% (9250/9536)
remote: Counting objects: 98% (9346/9536)
remote: Counting objects: 99% (9441/9536)
remote: Counting objects: 100% (9536/9536)
remote: Counting objects: 100% (9536/9536), done.
4.84 s
remote: Compressing objects: 0% (1/2324)
remote: Compressing objects: 1% (24/2324)
remote: Compressing objects: 2% (47/2324)
remote: Compressing objects: 3% (70/2324)
remote: Compressing objects: 4% (93/2324)
remote: Compressing objects: 5% (117/2324)
remote: Compressing objects: 6% (140/2324)
remote: Compressing objects: 7% (163/2324)
remote: Compressing objects: 8% (186/2324)
remote: Compressing objects: 9% (210/2324)
remote: Compressing objects: 10% (233/2324)
remote: Compressing objects: 11% (256/2324)
remote: Compressing objects: 12% (279/2324)
remote: Compressing objects: 13% (303/2324)
remote: Compressing objects: 14% (326/2324)
remote: Compressing objects: 15% (349/2324)
remote: Compressing objects: 16% (372/2324)
remote: Compressing objects: 17% (396/2324)
remote: Compressing objects: 18% (419/2324)
remote: Compressing objects: 19% (442/2324)
remote: Compressing objects: 20% (465/2324)
remote: Compressing objects: 21% (489/2324)
remote: Compressing objects: 22% (512/2324)
remote: Compressing objects: 22% (531/2324)
remote: Compressing objects: 23% (535/2324)
remote: Compressing objects: 24% (558/2324)
remote: Compressing objects: 25% (581/2324)
remote: Compressing objects: 26% (605/2324)
remote: Compressing objects: 27% (628/2324)
remote: Compressing objects: 28% (651/2324)
remote: Compressing objects: 28% (652/2324)
remote: Compressing objects: 29% (674/2324)
remote: Compressing objects: 30% (698/2324)
remote: Compressing objects: 31% (721/2324)
remote: Compressing objects: 32% (744/2324)
remote: Compressing objects: 33% (767/2324)
remote: Compressing objects: 34% (791/2324)
remote: Compressing objects: 35% (814/2324)
remote: Compressing objects: 36% (837/2324)
remote: Compressing objects: 37% (860/2324)
remote: Compressing objects: 38% (884/2324)
remote: Compressing objects: 39% (907/2324)
remote: Compressing objects: 40% (930/2324)
remote: Compressing objects: 41% (953/2324)
remote: Compressing objects: 42% (977/2324)
remote: Compressing objects: 43% (1000/2324)
remote: Compressing objects: 44% (1023/2324)
remote: Compressing objects: 45% (1046/2324)
remote: Compressing objects: 46% (1070/2324)
remote: Compressing objects: 47% (1093/2324)
remote: Compressing objects: 48% (1116/2324)
remote: Compressing objects: 49% (1139/2324)
remote: Compressing objects: 50% (1162/2324)
remote: Compressing objects: 51% (1186/2324)
remote: Compressing objects: 52% (1209/2324)
remote: Compressing objects: 53% (1232/2324)
remote: Compressing objects: 54% (1255/2324)
remote: Compressing objects: 55% (1279/2324)
remote: Compressing objects: 56% (1302/2324)
remote: Compressing objects: 57% (1325/2324)
remote: Compressing objects: 58% (1348/2324)
remote: Compressing objects: 59% (1372/2324)
remote: Compressing objects: 60% (1395/2324)
remote: Compressing objects: 61% (1418/2324)
remote: Compressing objects: 62% (1441/2324)
remote: Compressing objects: 63% (1465/2324)
remote: Compressing objects: 64% (1488/2324)
remote: Compressing objects: 65% (1511/2324)
remote: Compressing objects: 66% (1534/2324)
remote: Compressing objects: 67% (1558/2324)
remote: Compressing objects: 68% (1581/2324)
remote: Compressing objects: 69% (1604/2324)
remote: Compressing objects: 70% (1627/2324)
remote: Compressing objects: 71% (1651/2324)
remote: Compressing objects: 72% (1674/2324)
remote: Compressing objects: 73% (1697/2324)
remote: Compressing objects: 74% (1720/2324)
remote: Compressing objects: 75% (1743/2324)
remote: Compressing objects: 76% (1767/2324)
remote: Compressing objects: 77% (1790/2324)
remote: Compressing objects: 78% (1813/2324)
remote: Compressing objects: 79% (1836/2324)
remote: Compressing objects: 80% (1860/2324)
remote: Compressing objects: 81% (1883/2324)
remote: Compressing objects: 82% (1906/2324)
remote: Compressing objects: 83% (1929/2324)
remote: Compressing objects: 84% (1953/2324)
remote: Compressing objects: 85% (1976/2324)
remote: Compressing objects: 86% (1999/2324)
remote: Compressing objects: 87% (2022/2324)
remote: Compressing objects: 88% (2046/2324)
remote: Compressing objects: 89% (2069/2324)
remote: Compressing objects: 90% (2092/2324)
remote: Compressing objects: 91% (2115/2324)
remote: Compressing objects: 92% (2139/2324)
remote: Compressing objects: 93% (2162/2324)
remote: Compressing objects: 94% (2185/2324)
remote: Compressing objects: 95% (2208/2324)
remote: Compressing objects: 96% (2232/2324)
remote: Compressing objects: 97% (2255/2324)
remote: Compressing objects: 98% (2278/2324)
remote: Compressing objects: 99% (2301/2324)
remote: Compressing objects: 100% (2324/2324)
remote: Compressing objects: 100% (2324/2324), done.
8.02 s
Receiving objects: 0% (1/64182)
Receiving objects: 1% (642/64182)
Receiving objects: 2% (1284/64182)
Receiving objects: 3% (1926/64182)
Receiving objects: 4% (2568/64182)
Receiving objects: 5% (3210/64182)
Receiving objects: 6% (3851/64182)
Receiving objects: 7% (4493/64182)
Receiving objects: 8% (5135/64182)
Receiving objects: 9% (5777/64182)
Receiving objects: 10% (6419/64182), 8.05 MiB | 16.08 MiB/s
Receiving objects: 11% (7061/64182), 8.05 MiB | 16.08 MiB/s
Receiving objects: 12% (7702/64182), 8.05 MiB | 16.08 MiB/s
Receiving objects: 13% (8344/64182), 8.05 MiB | 16.08 MiB/s
Receiving objects: 14% (8986/64182), 8.05 MiB | 16.08 MiB/s
Receiving objects: 15% (9628/64182), 8.05 MiB | 16.08 MiB/s
Receiving objects: 16% (10270/64182), 8.05 MiB | 16.08 MiB/s
Receiving objects: 17% (10911/64182), 8.05 MiB | 16.08 MiB/s
Receiving objects: 18% (11553/64182), 8.05 MiB | 16.08 MiB/s
Receiving objects: 19% (12195/64182), 8.05 MiB | 16.08 MiB/s
Receiving objects: 20% (12837/64182), 8.05 MiB | 16.08 MiB/s
Receiving objects: 21% (13479/64182), 8.05 MiB | 16.08 MiB/s
Receiving objects: 22% (14121/64182), 8.05 MiB | 16.08 MiB/s
Receiving objects: 23% (14762/64182), 8.05 MiB | 16.08 MiB/s
Receiving objects: 24% (15404/64182), 8.05 MiB | 16.08 MiB/s
Receiving objects: 25% (16046/64182), 8.05 MiB | 16.08 MiB/s
Receiving objects: 26% (16688/64182), 8.05 MiB | 16.08 MiB/s
Receiving objects: 27% (17330/64182), 8.05 MiB | 16.08 MiB/s
Receiving objects: 28% (17971/64182), 8.05 MiB | 16.08 MiB/s
Receiving objects: 29% (18613/64182), 8.05 MiB | 16.08 MiB/s
Receiving objects: 30% (19255/64182), 8.05 MiB | 16.08 MiB/s
Receiving objects: 31% (19897/64182), 8.05 MiB | 16.08 MiB/s
Receiving objects: 32% (20539/64182), 8.05 MiB | 16.08 MiB/s
Receiving objects: 33% (21181/64182), 8.05 MiB | 16.08 MiB/s
Receiving objects: 34% (21822/64182), 8.05 MiB | 16.08 MiB/s
Receiving objects: 35% (22464/64182), 8.05 MiB | 16.08 MiB/s
Receiving objects: 36% (23106/64182), 8.05 MiB | 16.08 MiB/s
Receiving objects: 37% (23748/64182), 8.05 MiB | 16.08 MiB/s
Receiving objects: 38% (24390/64182), 8.05 MiB | 16.08 MiB/s
Receiving objects: 39% (25031/64182), 8.05 MiB | 16.08 MiB/s
Receiving objects: 40% (25673/64182), 8.05 MiB | 16.08 MiB/s
Receiving objects: 41% (26315/64182), 8.05 MiB | 16.08 MiB/s
Receiving objects: 42% (26957/64182), 8.05 MiB | 16.08 MiB/s
Receiving objects: 43% (27599/64182), 8.05 MiB | 16.08 MiB/s
Receiving objects: 43% (27904/64182), 8.05 MiB | 16.08 MiB/s
Receiving objects: 44% (28241/64182), 23.01 MiB | 23.00 MiB/s
Receiving objects: 45% (28882/64182), 23.01 MiB | 23.00 MiB/s
Receiving objects: 46% (29524/64182), 23.01 MiB | 23.00 MiB/s
Receiving objects: 47% (30166/64182), 23.01 MiB | 23.00 MiB/s
Receiving objects: 48% (30808/64182), 23.01 MiB | 23.00 MiB/s
Receiving objects: 49% (31450/64182), 23.01 MiB | 23.00 MiB/s
Receiving objects: 50% (32091/64182), 23.01 MiB | 23.00 MiB/s
Receiving objects: 51% (32733/64182), 23.01 MiB | 23.00 MiB/s
Receiving objects: 52% (33375/64182), 23.01 MiB | 23.00 MiB/s
Receiving objects: 53% (34017/64182), 23.01 MiB | 23.00 MiB/s
Receiving objects: 54% (34659/64182), 23.01 MiB | 23.00 MiB/s
Receiving objects: 55% (35301/64182), 23.01 MiB | 23.00 MiB/s
Receiving objects: 56% (35942/64182), 23.01 MiB | 23.00 MiB/s
Receiving objects: 57% (36584/64182), 23.01 MiB | 23.00 MiB/s
Receiving objects: 58% (37226/64182), 42.26 MiB | 28.10 MiB/s
Receiving objects: 59% (37868/64182), 42.26 MiB | 28.10 MiB/s
Receiving objects: 60% (38510/64182), 42.26 MiB | 28.10 MiB/s
Receiving objects: 61% (39152/64182), 42.26 MiB | 28.10 MiB/s
Receiving objects: 62% (39793/64182), 42.26 MiB | 28.10 MiB/s
Receiving objects: 63% (40435/64182), 42.26 MiB | 28.10 MiB/s
Receiving objects: 64% (41077/64182), 42.26 MiB | 28.10 MiB/s
Receiving objects: 65% (41719/64182), 42.26 MiB | 28.10 MiB/s
Receiving objects: 66% (42361/64182), 42.26 MiB | 28.10 MiB/s
Receiving objects: 66% (42653/64182), 59.16 MiB | 29.52 MiB/s
Receiving objects: 67% (43002/64182), 59.16 MiB | 29.52 MiB/s
Receiving objects: 68% (43644/64182), 59.16 MiB | 29.52 MiB/s
Receiving objects: 69% (44286/64182), 59.16 MiB | 29.52 MiB/s
Receiving objects: 70% (44928/64182), 59.16 MiB | 29.52 MiB/s
Receiving objects: 71% (45570/64182), 59.16 MiB | 29.52 MiB/s
Receiving objects: 72% (46212/64182), 59.16 MiB | 29.52 MiB/s
Receiving objects: 73% (46853/64182), 59.16 MiB | 29.52 MiB/s
Receiving objects: 74% (47495/64182), 59.16 MiB | 29.52 MiB/s
Receiving objects: 75% (48137/64182), 59.16 MiB | 29.52 MiB/s
Receiving objects: 76% (48779/64182), 59.16 MiB | 29.52 MiB/s
Receiving objects: 77% (49421/64182), 59.16 MiB | 29.52 MiB/s
Receiving objects: 78% (50062/64182), 59.16 MiB | 29.52 MiB/s
Receiving objects: 79% (50704/64182), 59.16 MiB | 29.52 MiB/s
Receiving objects: 80% (51346/64182), 59.16 MiB | 29.52 MiB/s
Receiving objects: 81% (51988/64182), 75.62 MiB | 30.16 MiB/s
Receiving objects: 82% (52630/64182), 75.62 MiB | 30.16 MiB/s
Receiving objects: 83% (53272/64182), 75.62 MiB | 30.16 MiB/s
Receiving objects: 84% (53913/64182), 75.62 MiB | 30.16 MiB/s
Receiving objects: 85% (54555/64182), 75.62 MiB | 30.16 MiB/s
Receiving objects: 86% (55197/64182), 75.62 MiB | 30.16 MiB/s
Receiving objects: 87% (55839/64182), 75.62 MiB | 30.16 MiB/s
Receiving objects: 88% (56481/64182), 75.62 MiB | 30.16 MiB/s
Receiving objects: 89% (57122/64182), 75.62 MiB | 30.16 MiB/s
Receiving objects: 90% (57764/64182), 75.62 MiB | 30.16 MiB/s
Receiving objects: 91% (58406/64182), 75.62 MiB | 30.16 MiB/s
Receiving objects: 92% (59048/64182), 75.62 MiB | 30.16 MiB/s
Receiving objects: 93% (59690/64182), 75.62 MiB | 30.16 MiB/s
Receiving objects: 94% (60332/64182), 75.62 MiB | 30.16 MiB/s
Receiving objects: 95% (60973/64182), 75.62 MiB | 30.16 MiB/s
Receiving objects: 96% (61615/64182), 75.62 MiB | 30.16 MiB/s
Receiving objects: 96% (61880/64182), 91.71 MiB | 30.50 MiB/s
Receiving objects: 97% (62257/64182), 91.71 MiB | 30.50 MiB/s
Receiving objects: 98% (62899/64182), 91.71 MiB | 30.50 MiB/s
Receiving objects: 99% (63541/64182), 91.71 MiB | 30.50 MiB/s
remote: Total 64182 (delta 7384), reused 7761 (delta 6667), pack-reused 54646 (from 3)
8.04 s
Receiving objects: 100% (64182/64182), 91.71 MiB | 30.50 MiB/s
Receiving objects: 100% (64182/64182), 97.82 MiB | 30.74 MiB/s, done.
9.88 s
Resolving deltas: 0% (0/44314)
Resolving deltas: 1% (444/44314)
Resolving deltas: 2% (887/44314)
Resolving deltas: 3% (1330/44314)
Resolving deltas: 4% (1773/44314)
Resolving deltas: 5% (2216/44314)
Resolving deltas: 6% (2659/44314)
Resolving deltas: 7% (3102/44314)
Resolving deltas: 8% (3546/44314)
Resolving deltas: 9% (3990/44314)
Resolving deltas: 10% (4432/44314)
Resolving deltas: 11% (4875/44314)
Resolving deltas: 12% (5318/44314)
Resolving deltas: 13% (5761/44314)
Resolving deltas: 14% (6204/44314)
Resolving deltas: 15% (6648/44314)
Resolving deltas: 16% (7091/44314)
Resolving deltas: 17% (7534/44314)
Resolving deltas: 18% (7977/44314)
Resolving deltas: 19% (8420/44314)
Resolving deltas: 20% (8863/44314)
Resolving deltas: 21% (9306/44314)
Resolving deltas: 22% (9751/44314)
Resolving deltas: 23% (10193/44314)
Resolving deltas: 24% (10636/44314)
Resolving deltas: 25% (11079/44314)
Resolving deltas: 26% (11522/44314)
Resolving deltas: 27% (11965/44314)
Resolving deltas: 28% (12408/44314)
Resolving deltas: 29% (12852/44314)
Resolving deltas: 30% (13295/44314)
Resolving deltas: 31% (13738/44314)
Resolving deltas: 32% (14181/44314)
Resolving deltas: 33% (14624/44314)
Resolving deltas: 34% (15067/44314)
Resolving deltas: 35% (15510/44314)
Resolving deltas: 36% (15954/44314)
Resolving deltas: 37% (16397/44314)
Resolving deltas: 38% (16843/44314)
Resolving deltas: 39% (17283/44314)
Resolving deltas: 40% (17726/44314)
Resolving deltas: 41% (18169/44314)
Resolving deltas: 42% (18612/44314)
Resolving deltas: 43% (19056/44314)
Resolving deltas: 44% (19499/44314)
Resolving deltas: 45% (19944/44314)
Resolving deltas: 46% (20385/44314)
Resolving deltas: 47% (20828/44314)
Resolving deltas: 48% (21271/44314)
Resolving deltas: 49% (21714/44314)
Resolving deltas: 50% (22157/44314)
Resolving deltas: 51% (22601/44314)
Resolving deltas: 52% (23044/44314)
Resolving deltas: 53% (23488/44314)
Resolving deltas: 54% (23930/44314)
Resolving deltas: 55% (24373/44314)
Resolving deltas: 56% (24816/44314)
Resolving deltas: 57% (25259/44314)
Resolving deltas: 58% (25703/44314)
Resolving deltas: 59% (26146/44314)
Resolving deltas: 60% (26589/44314)
Resolving deltas: 61% (27032/44314)
Resolving deltas: 62% (27475/44314)
Resolving deltas: 63% (27918/44314)
Resolving deltas: 64% (28361/44314)
Resolving deltas: 65% (28805/44314)
Resolving deltas: 66% (29248/44314)
Resolving deltas: 66% (29489/44314)
Resolving deltas: 67% (29691/44314)
Resolving deltas: 68% (30134/44314)
Resolving deltas: 69% (30577/44314)
Resolving deltas: 70% (31020/44314)
Resolving deltas: 71% (31463/44314)
Resolving deltas: 72% (31907/44314)
Resolving deltas: 73% (32350/44314)
Resolving deltas: 74% (32794/44314)
Resolving deltas: 75% (33236/44314)
Resolving deltas: 76% (33679/44314)
Resolving deltas: 77% (34123/44314)
Resolving deltas: 78% (34565/44314)
Resolving deltas: 79% (35009/44314)
Resolving deltas: 80% (35452/44314)
Resolving deltas: 81% (35895/44314)
Resolving deltas: 82% (36338/44314)
Resolving deltas: 83% (36781/44314)
Resolving deltas: 84% (37224/44314)
Resolving deltas: 85% (37667/44314)
Resolving deltas: 86% (38111/44314)
Resolving deltas: 87% (38554/44314)
Resolving deltas: 88% (38997/44314)
Resolving deltas: 89% (39440/44314)
Resolving deltas: 90% (39883/44314)
Resolving deltas: 91% (40326/44314)
Resolving deltas: 92% (40769/44314)
Resolving deltas: 93% (41213/44314)
Resolving deltas: 94% (41656/44314)
Resolving deltas: 95% (42099/44314)
Resolving deltas: 96% (42542/44314)
Resolving deltas: 97% (42985/44314)
Resolving deltas: 98% (43428/44314)
Resolving deltas: 99% (43871/44314)
Resolving deltas: 100% (44314/44314)
Resolving deltas: 100% (44314/44314), done.
10.31 s
Fetching commit 94e2eb84385825c67e2d00485755754534658cdd for push-vrpyqyylypmw ...
10.31 s
$ /nix/store/bcnisk3ydfgv26v2gw3zlky24g00yww2-git-2.54.0/bin/git fetch origin 94e2eb84385825c67e2d00485755754534658cdd
10.91 s
From https://github.com/alphal00p/gammaloop
10.91 s
* branch 94e2eb84385825c67e2d00485755754534658cdd -> FETCH_HEAD
10.95 s
$ /nix/store/9ypz3flqsrl5xl495mm8h645gadjsxi1-coreutils-9.11/bin/timeout --kill-after=15s 7200s /nix/store/bcnisk3ydfgv26v2gw3zlky24g00yww2-git-2.54.0/bin/git -c advice.detachedHead=false checkout 94e2eb84385825c67e2d00485755754534658cdd
11.24 s
HEAD is now at 94e2eb84 include documentation sources in catalog dependency build
11.27 s
$ /nix/store/9ypz3flqsrl5xl495mm8h645gadjsxi1-coreutils-9.11/bin/timeout --kill-after=15s 7200s /nix/store/23zk8sgzamrbmj1fday15szf7f2279s8-nix-2.34.7/bin/nix --extra-experimental-features nix-command --extra-experimental-features flakes --log-format internal-json run .#packages.x86_64-linux.nix-ci-check-gammaloop-doctest --print-build-logs
14.67 s
18.91 s
evaluating derivation 'g
copying '/nix/store/fxbc
[0 /1 built]
[1 /0 /1 built] building g gammaloop-workspace-doctest> Running phase: unpackPhase
18.92 s
gammaloop-workspace-doctest> unpacking source archive /nix/store/n62xwv096bc248rr6y7qpggfdbwshkw9-source
21.87 s
gammaloop-workspace-doctest> source root is source
21.92 s
gammaloop-workspace-doctest> Running phase: patchPhase
21.94 s
gammaloop-workspace-doctest> Executing configureCargoCommonVars
21.95 s
gammaloop-workspace-doctest> decompressing cargo artifacts from /nix/store/kbgwngi7xvi54jsr0kp8rhj1b9mfja7d-gammaloop-workspace-deps-deps-0.1.0/target.tar.zst to target
24.88 s
gammaloop-workspace-doctest> Running phase: updateAutotoolsGnuConfigScriptsPhase
24.94 s
gammaloop-workspace-doctest> Running phase: configurePhase
24.95 s
gammaloop-workspace-doctest> will append /build/source/.cargo-home/config.toml with contents of /nix/store/xdy1vvhll2bijdplvl9fcc2b9plkxhaa-vendor-cargo-deps/config.toml
25.00 s
gammaloop-workspace-doctest> default configurePhase, nothing to do
25.01 s
gammaloop-workspace-doctest> Running phase: buildPhase
25.03 s
gammaloop-workspace-doctest> +++ command cargo --version
25.04 s
gammaloop-workspace-doctest> cargo 1.97.0 (c980f4866 2026-06-30)
25.09 s
gammaloop-workspace-doctest> +++ command cargo test --profile ci-optim --doc --locked --workspace --features gammaloop-api/cli,gammaloop-tracing-filter/clap,gammaloop-tracing-filter/symbolica,idenso/bincode,idenso/reference-cases,linnet/bincode,linnet/drawing,linnet/nodestore-vec,linnet/rkyv,linnet/serde,linnet/symbolica,spenso-macros/shadowing,spenso/shadowing,symbolica/tracing_max_level_info
30.52 s
gammaloop-workspace-doctest> Compiling target-lexicon v0.13.5
30.53 s
gammaloop-workspace-doctest> Compiling symbolica v2.2.0 (https://github.com/symbolica-dev/symbolica?branch=dev#0441bd7a)
30.53 s
gammaloop-workspace-doctest> Compiling maplit v1.0.2
30.54 s
gammaloop-workspace-doctest> Compiling gammaloop-tracing-filter-macros v0.1.0 (/build/source/crates/gammaloop-tracing-filter-macros)
30.55 s
gammaloop-workspace-doctest> Compiling vakint v0.1.2 (/build/source/crates/vakint)
30.55 s
gammaloop-workspace-doctest> Compiling gammalooprs v0.3.4 (/build/source/crates/gammalooprs)
30.56 s
gammaloop-workspace-doctest> Compiling alphal00p-docs-macros v0.1.0 (/build/source/crates/alphal00p-docs-macros)
30.56 s
gammaloop-workspace-doctest> Compiling alphal00p-docs-schema v0.1.0 (/build/source/crates/alphal00p-docs-schema)
30.56 s
gammaloop-workspace-doctest> Compiling rustc_version v0.4.1
30.57 s
gammaloop-workspace-doctest> Compiling bincode v1.3.3
30.57 s
gammaloop-workspace-doctest> Compiling gungraun-runner v0.18.2
30.58 s
gammaloop-workspace-doctest> Compiling iai-callgrind-runner v0.14.2
30.58 s
gammaloop-workspace-doctest> Compiling target-triple v1.0.1
30.58 s
gammaloop-workspace-doctest> Compiling clinnet v0.1.8 (/build/source/crates/clinnet)
30.66 s
gammaloop-workspace-doctest> Compiling gammaloop-integration-tests v0.1.0 (/build/source/tests)
30.97 s
gammaloop-workspace-doctest> Compiling test-log-core v0.2.20
31.18 s
gammaloop-workspace-doctest> Compiling wait-timeout v0.2.1
31.19 s
gammaloop-workspace-doctest> Compiling iai-callgrind v0.14.2
31.27 s
gammaloop-workspace-doctest> Compiling quick-error v1.2.3
31.28 s
gammaloop-workspace-doctest> Compiling bit-vec v0.8.0
31.72 s
gammaloop-workspace-doctest> Compiling rusty-fork v0.3.1
31.77 s
gammaloop-workspace-doctest> Compiling bit-set v0.8.0
32.16 s
gammaloop-workspace-doctest> Compiling iai-callgrind-macros v0.5.1
32.25 s
gammaloop-workspace-doctest> Compiling rand_xorshift v0.4.0
32.28 s
gammaloop-workspace-doctest> Compiling console v0.15.11
32.41 s
gammaloop-workspace-doctest> Compiling glob v0.3.4
32.47 s
gammaloop-workspace-doctest> Compiling unarray v0.1.4
32.58 s
gammaloop-workspace-doctest> Compiling base64 v0.21.7
32.86 s
gammaloop-workspace-doctest> Compiling gungraun-macros v0.8.0
33.09 s
gammaloop-workspace-doctest> Compiling termcolor v1.4.1
33.14 s
gammaloop-workspace-doctest> Compiling alphal00p-docs-catalogs v0.1.0 (/build/source/crates/alphal00p-docs-catalogs)
33.34 s
gammaloop-workspace-doctest> Compiling similar-asserts v1.7.0
33.64 s
gammaloop-workspace-doctest> Compiling trybuild v1.0.120
33.81 s
gammaloop-workspace-doctest> Compiling ron v0.8.1
33.95 s
gammaloop-workspace-doctest> Compiling alphal00p-docs-builder v0.1.0 (/build/source/crates/alphal00p-docs-builder)
34.45 s
gammaloop-workspace-doctest> Compiling pyo3-build-config v0.28.3
34.46 s
gammaloop-workspace-doctest> Compiling proptest v1.11.0
34.65 s
gammaloop-workspace-doctest> Compiling kurvst v0.1.0 (/build/source/crates/kurvst)
35.90 s
gammaloop-workspace-doctest> Compiling test-log-macros v0.2.20
41.83 s
gammaloop-workspace-doctest> Compiling test-log v0.2.20
42.24 s
gammaloop-workspace-doctest> Compiling alphal00p-docs-examples v0.1.0 (/build/source/crates/alphal00p-docs-examples)
47.48 s
gammaloop-workspace-doctest> Compiling pyo3-ffi v0.28.3
47.49 s
gammaloop-workspace-doctest> Compiling pyo3-macros-backend v0.28.3
47.52 s
gammaloop-workspace-doctest> Compiling pyo3 v0.28.3
47.58 s
gammaloop-workspace-doctest> Compiling numpy v0.28.0
48.03 s
gammaloop-workspace-doctest> Compiling gammaloop-api v0.1.0 (/build/source/crates/gammaloop-api)
49.26 s
gammaloop-workspace-doctest> Compiling gungraun v0.18.2
63.41 s
gammaloop-workspace-doctest> Compiling pyo3-macros v0.28.3
70.67 s
gammaloop-workspace-doctest> Compiling pyo3-stub-gen v0.17.2
71.82 s
gammaloop-workspace-doctest> Compiling numerica v2.2.0 (https://github.com/symbolica-dev/symbolica?branch=dev#0441bd7a)
74.89 s
gammaloop-workspace-doctest> Compiling graphica v2.1.0 (https://github.com/symbolica-dev/symbolica?branch=dev#0441bd7a)
79.77 s
gammaloop-workspace-doctest> Compiling symbolica-utils v0.1.0 (/build/source/crates/symbolica-utils)
344.17 s
gammaloop-workspace-doctest> Compiling gammaloop-workspace-hack v0.1.0 (/build/source/crates/gammaloop-workspace-hack)
344.22 s
gammaloop-workspace-doctest> Compiling spenso-macros v0.3.2 (/build/source/crates/spenso-macros)
344.32 s
gammaloop-workspace-doctest> Compiling linnet v0.17.0 (/build/source/crates/linnet)
347.78 s
gammaloop-workspace-doctest> Compiling spenso v0.6.0 (/build/source/crates/spenso)
357.72 s
gammaloop-workspace-doctest> Compiling idenso v0.3.0 (/build/source/crates/idenso)
357.77 s
gammaloop-workspace-doctest> Compiling gammaloop-tracing-filter v0.1.0 (/build/source/crates/gammaloop-tracing-filter)
359.57 s
gammaloop-workspace-doctest> Compiling spenso-hep-lib v0.1.7 (/build/source/crates/spenso-hep-lib)
359.81 s
gammaloop-workspace-doctest> Compiling spynso3 v0.1.2 (/build/source/crates/spynso3)
410.03 s
gammaloop-workspace-doctest> Compiling linnest v0.1.0 (/build/source/crates/linnest)
410.05 s
gammaloop-workspace-doctest> Compiling linnet-py v0.1.0 (/build/source/crates/linnet-py)
543.65 s
gammaloop-workspace-doctest> Finished `ci-optim` profile [optimized] target(s) in 8m 38s
543.79 s
gammaloop-workspace-doctest> warning : the following packages contain code that will be rejected by a future version of Rust: proc-macro-error2 v2.0.1
543.79 s
gammaloop-workspace-doctest> note : to see what the problems were, use the option `--future-incompat-report`, or run `cargo report future-incompatibilities --id 1`
543.82 s
gammaloop-workspace-doctest> Doc-tests alphal00p_docs_builder
544.00 s
gammaloop-workspace-doctest>
544.00 s
gammaloop-workspace-doctest> running 0 tests
544.00 s
gammaloop-workspace-doctest>
544.00 s
gammaloop-workspace-doctest> test result: ok. 0 passed; 0 failed; 0 ignored; 0 measured; 0 filtered out; finished in 0.00s
544.00 s
gammaloop-workspace-doctest>
544.00 s
gammaloop-workspace-doctest> Doc-tests alphal00p_docs_catalogs
545.38 s
gammaloop-workspace-doctest>
545.38 s
gammaloop-workspace-doctest> running 0 tests
545.38 s
gammaloop-workspace-doctest>
545.38 s
gammaloop-workspace-doctest> test result: ok. 0 passed; 0 failed; 0 ignored; 0 measured; 0 filtered out; finished in 0.00s
545.38 s
gammaloop-workspace-doctest>
545.38 s
gammaloop-workspace-doctest> Doc-tests alphal00p_docs_examples
545.40 s
gammaloop-workspace-doctest>
545.40 s
gammaloop-workspace-doctest> running 0 tests
545.40 s
gammaloop-workspace-doctest>
545.40 s
gammaloop-workspace-doctest> test result: ok. 0 passed; 0 failed; 0 ignored; 0 measured; 0 filtered out; finished in 0.00s
545.40 s
gammaloop-workspace-doctest>
545.40 s
gammaloop-workspace-doctest> Doc-tests alphal00p_docs
545.46 s
gammaloop-workspace-doctest>
545.46 s
gammaloop-workspace-doctest> running 0 tests
545.46 s
gammaloop-workspace-doctest>
545.46 s
gammaloop-workspace-doctest> test result: ok. 0 passed; 0 failed; 0 ignored; 0 measured; 0 filtered out; finished in 0.00s
545.46 s
gammaloop-workspace-doctest>
545.46 s
gammaloop-workspace-doctest> Doc-tests alphal00p_docs_schema
545.56 s
gammaloop-workspace-doctest>
545.56 s
gammaloop-workspace-doctest> running 0 tests
545.56 s
gammaloop-workspace-doctest>
545.56 s
gammaloop-workspace-doctest> test result: ok. 0 passed; 0 failed; 0 ignored; 0 measured; 0 filtered out; finished in 0.00s
545.56 s
gammaloop-workspace-doctest>
545.56 s
gammaloop-workspace-doctest> Doc-tests clinnet
545.60 s
gammaloop-workspace-doctest>
545.60 s
gammaloop-workspace-doctest> running 0 tests
545.60 s
gammaloop-workspace-doctest>
545.60 s
gammaloop-workspace-doctest> test result: ok. 0 passed; 0 failed; 0 ignored; 0 measured; 0 filtered out; finished in 0.00s
545.60 s
gammaloop-workspace-doctest>
545.60 s
gammaloop-workspace-doctest> Doc-tests gammaloop_api
546.78 s
gammaloop-workspace-doctest>
546.78 s
gammaloop-workspace-doctest> running 13 tests
546.80 s
gammaloop-workspace-doctest> test crates/gammaloop-api/src/python.rs - python::GammaLoopAPI::get_default_runtime_settings (line 3688) ... FAILED
546.80 s
gammaloop-workspace-doctest> test crates/gammaloop-api/src/python.rs - python::GammaLoopAPI::evaluate_sample (line 2926) ... FAILED
546.80 s
gammaloop-workspace-doctest> test crates/gammaloop-api/src/python.rs - python::GammaLoopAPI::get_active_command_blocks (line 3652) ... FAILED
546.80 s
gammaloop-workspace-doctest> test crates/gammaloop-api/src/python.rs - python::GammaLoopAPI::evaluate_samples (line 3040) ... FAILED
546.80 s
gammaloop-workspace-doctest> test crates/gammaloop-api/src/python.rs - python::GammaLoopAPI::get_integrand_settings (line 3539) ... FAILED
546.81 s
gammaloop-workspace-doctest> test crates/gammaloop-api/src/python.rs - python::GammaLoopAPI::get_integrand_info (line 3496) ... FAILED
546.91 s
gammaloop-workspace-doctest> test crates/gammaloop-api/src/python.rs - python::GammaLoopAPI::run_command (line 3793) ... FAILED
546.92 s
gammaloop-workspace-doctest> test crates/gammaloop-api/src/python.rs - python::GammaLoopAPI::get_run_history (line 3603) ... FAILED
546.93 s
gammaloop-workspace-doctest> test crates/gammaloop-api/src/python.rs - python::atom_to_canonical_string (line 128) ... FAILED
546.93 s
gammaloop-workspace-doctest> test crates/gammaloop-api/src/python.rs - python::evaluate_graph_overall_factor (line 95) ... FAILED
546.94 s
gammaloop-workspace-doctest> test crates/gammaloop-api/src/python.rs - python::GammaLoopAPI::get_global_settings (line 3631) ... FAILED
546.95 s
gammaloop-workspace-doctest> test crates/gammaloop-api/src/python.rs - python::atom_to_dots (line 157) ... FAILED
546.96 s
gammaloop-workspace-doctest> test crates/gammaloop-api/src/python.rs - python::GammaLoopAPI::new_python (line 2804) ... FAILED
546.96 s
gammaloop-workspace-doctest>
546.96 s
gammaloop-workspace-doctest> failures:
546.96 s
gammaloop-workspace-doctest>
546.96 s
gammaloop-workspace-doctest> ---- crates/gammaloop-api/src/python.rs - python::GammaLoopAPI::get_default_runtime_settings (line 3688) stdout ----
546.96 s
gammaloop-workspace-doctest> error: expected one of `!` or `::`, found `=`
546.96 s
gammaloop-workspace-doctest> --> crates/gammaloop-api/src/python.rs:3689:9
546.96 s
gammaloop-workspace-doctest> |
546.96 s
gammaloop-workspace-doctest> 3689 | runtime = api.get_default_runtime_settings()
546.96 s
gammaloop-workspace-doctest> | ^ expected one of `!` or `::`
546.96 s
gammaloop-workspace-doctest>
546.96 s
gammaloop-workspace-doctest> error: aborting due to 1 previous error
546.96 s
gammaloop-workspace-doctest>
546.96 s
gammaloop-workspace-doctest> Couldn't compile the test.
546.96 s
gammaloop-workspace-doctest> ---- crates/gammaloop-api/src/python.rs - python::GammaLoopAPI::evaluate_sample (line 2926) stdout ----
546.96 s
gammaloop-workspace-doctest> error: expected one of `!` or `::`, found `=`
546.96 s
gammaloop-workspace-doctest> --> crates/gammaloop-api/src/python.rs:2927:8
546.96 s
gammaloop-workspace-doctest> |
546.96 s
gammaloop-workspace-doctest> 2927 | result = api.evaluate_sample(point, process_id=0, minimal_output=True)
546.96 s
gammaloop-workspace-doctest> | ^ expected one of `!` or `::`
546.96 s
gammaloop-workspace-doctest>
546.96 s
gammaloop-workspace-doctest> error: aborting due to 1 previous error
546.96 s
gammaloop-workspace-doctest>
546.96 s
gammaloop-workspace-doctest> Couldn't compile the test.
546.96 s
gammaloop-workspace-doctest> ---- crates/gammaloop-api/src/python.rs - python::GammaLoopAPI::get_active_command_blocks (line 3652) stdout ----
546.96 s
gammaloop-workspace-doctest> error: expected item, found keyword `for`
546.96 s
gammaloop-workspace-doctest> --> crates/gammaloop-api/src/python.rs:3653:1
546.96 s
gammaloop-workspace-doctest> |
546.96 s
gammaloop-workspace-doctest> 3653 | for name, commands in api.get_active_command_blocks().items():
546.96 s
gammaloop-workspace-doctest> | ^^^ expected item
546.96 s
gammaloop-workspace-doctest> |
546.96 s
gammaloop-workspace-doctest> = note: for a full list of items that can appear in modules, see <https://doc.rust-lang.org/reference/items.html>
546.96 s
gammaloop-workspace-doctest>
546.96 s
gammaloop-workspace-doctest> error: aborting due to 1 previous error
546.96 s
gammaloop-workspace-doctest>
546.96 s
gammaloop-workspace-doctest> Couldn't compile the test.
546.96 s
gammaloop-workspace-doctest> ---- crates/gammaloop-api/src/python.rs - python::GammaLoopAPI::evaluate_samples (line 3040) stdout ----
546.96 s
gammaloop-workspace-doctest> error: expected one of `!` or `::`, found `=`
546.96 s
gammaloop-workspace-doctest> --> crates/gammaloop-api/src/python.rs:3041:8
546.96 s
gammaloop-workspace-doctest> |
546.96 s
gammaloop-workspace-doctest> 3041 | points = numpy.asarray(points, dtype=numpy.float64)
546.96 s
gammaloop-workspace-doctest> | ^ expected one of `!` or `::`
546.96 s
gammaloop-workspace-doctest>
546.96 s
gammaloop-workspace-doctest> error: aborting due to 1 previous error
546.96 s
gammaloop-workspace-doctest>
546.96 s
gammaloop-workspace-doctest> Couldn't compile the test.
546.96 s
gammaloop-workspace-doctest> ---- crates/gammaloop-api/src/python.rs - python::GammaLoopAPI::get_integrand_settings (line 3539) stdout ----
546.96 s
gammaloop-workspace-doctest> error: expected one of `!` or `::`, found `=`
546.96 s
gammaloop-workspace-doctest> --> crates/gammaloop-api/src/python.rs:3540:10
546.96 s
gammaloop-workspace-doctest> |
546.96 s
gammaloop-workspace-doctest> 3540 | settings = api.get_integrand_settings(process_id=0)
546.96 s
gammaloop-workspace-doctest> | ^ expected one of `!` or `::`
546.96 s
gammaloop-workspace-doctest>
546.96 s
gammaloop-workspace-doctest> error: aborting due to 1 previous error
546.96 s
gammaloop-workspace-doctest>
546.96 s
gammaloop-workspace-doctest> Couldn't compile the test.
546.96 s
gammaloop-workspace-doctest> ---- crates/gammaloop-api/src/python.rs - python::GammaLoopAPI::get_integrand_info (line 3496) stdout ----
546.96 s
gammaloop-workspace-doctest> error: expected one of `!` or `::`, found `=`
546.96 s
gammaloop-workspace-doctest> --> crates/gammaloop-api/src/python.rs:3497:6
546.96 s
gammaloop-workspace-doctest> |
546.96 s
gammaloop-workspace-doctest> 3497 | info = api.get_integrand_info(process_id=0)
546.96 s
gammaloop-workspace-doctest> | ^ expected one of `!` or `::`
546.96 s
gammaloop-workspace-doctest>
546.96 s
gammaloop-workspace-doctest> error: aborting due to 1 previous error
546.96 s
gammaloop-workspace-doctest>
546.96 s
gammaloop-workspace-doctest> Couldn't compile the test.
546.96 s
gammaloop-workspace-doctest> ---- crates/gammaloop-api/src/python.rs - python::GammaLoopAPI::run_command (line 3793) stdout ----
546.96 s
gammaloop-workspace-doctest> error[E0425] : cannot find value `api` in this scope
546.96 s
gammaloop-workspace-doctest> --> crates/gammaloop-api/src/python.rs:3794:1
546.96 s
gammaloop-workspace-doctest> |
546.96 s
gammaloop-workspace-doctest> 3794 | api.run("display processes")
546.96 s
gammaloop-workspace-doctest> | ^^^ not found in this scope
546.96 s
gammaloop-workspace-doctest>
546.96 s
gammaloop-workspace-doctest> error : aborting due to 1 previous error
546.96 s
gammaloop-workspace-doctest>
546.96 s
gammaloop-workspace-doctest> For more information about this error, try `rustc --explain E0425`.
546.96 s
gammaloop-workspace-doctest> Couldn't compile the test.
546.96 s
gammaloop-workspace-doctest> ---- crates/gammaloop-api/src/python.rs - python::GammaLoopAPI::get_run_history (line 3603) stdout ----
546.96 s
gammaloop-workspace-doctest> error[E0425] : cannot find value `run_card_toml` in this scope
546.96 s
gammaloop-workspace-doctest> --> crates/gammaloop-api/src/python.rs:3604:1
546.96 s
gammaloop-workspace-doctest> |
546.96 s
gammaloop-workspace-doctest> 3604 | run_card_toml = api.get_run_history()
546.96 s
gammaloop-workspace-doctest> | ^^^^^^^^^^^^^
546.96 s
gammaloop-workspace-doctest> |
546.96 s
gammaloop-workspace-doctest> help : you might have meant to introduce a new binding
546.96 s
gammaloop-workspace-doctest> |
546.96 s
gammaloop-workspace-doctest> 3604 | let run_card_toml = api.get_run_history()
546.96 s
gammaloop-workspace-doctest> | +++
546.96 s
gammaloop-workspace-doctest>
546.96 s
gammaloop-workspace-doctest> error[E0425] : cannot find value `api` in this scope
546.96 s
gammaloop-workspace-doctest> --> crates/gammaloop-api/src/python.rs:3604:17
546.96 s
gammaloop-workspace-doctest> |
546.96 s
gammaloop-workspace-doctest> 3604 | run_card_toml = api.get_run_history()
546.96 s
gammaloop-workspace-doctest> | ^^^ not found in this scope
546.96 s
gammaloop-workspace-doctest>
546.96 s
gammaloop-workspace-doctest> error : aborting due to 2 previous errors
546.96 s
gammaloop-workspace-doctest>
546.96 s
gammaloop-workspace-doctest> For more information about this error, try `rustc --explain E0425`.
546.96 s
gammaloop-workspace-doctest> Couldn't compile the test.
546.96 s
gammaloop-workspace-doctest> ---- crates/gammaloop-api/src/python.rs - python::atom_to_canonical_string (line 128) stdout ----
546.96 s
gammaloop-workspace-doctest> error[E0425] : cannot find function `atom_to_canonical_string` in this scope
546.96 s
gammaloop-workspace-doctest> --> crates/gammaloop-api/src/python.rs:129:1
546.96 s
gammaloop-workspace-doctest> |
546.96 s
gammaloop-workspace-doctest> 129 | atom_to_canonical_string("x + x")
546.96 s
gammaloop-workspace-doctest> | ^^^^^^^^^^^^^^^^^^^^^^^^ not found in this scope
546.96 s
gammaloop-workspace-doctest>
546.96 s
gammaloop-workspace-doctest> error : aborting due to 1 previous error
546.96 s
gammaloop-workspace-doctest>
546.96 s
gammaloop-workspace-doctest> For more information about this error, try `rustc --explain E0425`.
546.96 s
gammaloop-workspace-doctest> Couldn't compile the test.
546.96 s
gammaloop-workspace-doctest> ---- crates/gammaloop-api/src/python.rs - python::evaluate_graph_overall_factor (line 95) stdout ----
546.96 s
gammaloop-workspace-doctest> error[E0425] : cannot find function `evaluate_graph_overall_factor` in this scope
546.96 s
gammaloop-workspace-doctest> --> crates/gammaloop-api/src/python.rs:96:1
546.96 s
gammaloop-workspace-doctest> |
546.96 s
gammaloop-workspace-doctest> 96 | evaluate_graph_overall_factor(
546.96 s
gammaloop-workspace-doctest> | ^^^^^^^^^^^^^^^^^^^^^^^^^^^^^ not found in this scope
546.96 s
gammaloop-workspace-doctest>
546.96 s
gammaloop-workspace-doctest> error : aborting due to 1 previous error
546.96 s
gammaloop-workspace-doctest>
546.96 s
gammaloop-workspace-doctest> For more information about this error, try `rustc --explain E0425`.
546.96 s
gammaloop-workspace-doctest> Couldn't compile the test.
546.96 s
gammaloop-workspace-doctest> ---- crates/gammaloop-api/src/python.rs - python::GammaLoopAPI::get_global_settings (line 3631) stdout ----
546.96 s
gammaloop-workspace-doctest> error[E0425] : cannot find value `settings_toml` in this scope
546.96 s
gammaloop-workspace-doctest> --> crates/gammaloop-api/src/python.rs:3632:1
546.96 s
gammaloop-workspace-doctest> |
546.96 s
gammaloop-workspace-doctest> 3632 | settings_toml = api.get_global_settings()
546.96 s
gammaloop-workspace-doctest> | ^^^^^^^^^^^^^
546.96 s
gammaloop-workspace-doctest> |
546.96 s
gammaloop-workspace-doctest> help : you might have meant to introduce a new binding
546.96 s
gammaloop-workspace-doctest> |
546.96 s
gammaloop-workspace-doctest> 3632 | let settings_toml = api.get_global_settings()
546.96 s
gammaloop-workspace-doctest> | +++
546.96 s
gammaloop-workspace-doctest>
546.96 s
gammaloop-workspace-doctest> error[E0425] : cannot find value `api` in this scope
546.96 s
gammaloop-workspace-doctest> --> crates/gammaloop-api/src/python.rs:3632:17
546.96 s
gammaloop-workspace-doctest> |
546.96 s
gammaloop-workspace-doctest> 3632 | settings_toml = api.get_global_settings()
546.96 s
gammaloop-workspace-doctest> | ^^^ not found in this scope
546.96 s
gammaloop-workspace-doctest>
546.96 s
gammaloop-workspace-doctest> error : aborting due to 2 previous errors
546.96 s
gammaloop-workspace-doctest>
546.96 s
gammaloop-workspace-doctest> For more information about this error, try `rustc --explain E0425`.
546.96 s
gammaloop-workspace-doctest> Couldn't compile the test.
546.96 s
gammaloop-workspace-doctest> ---- crates/gammaloop-api/src/python.rs - python::atom_to_dots (line 157) stdout ----
546.96 s
gammaloop-workspace-doctest> error[E0425] : cannot find function `to_dots` in this scope
546.96 s
gammaloop-workspace-doctest> --> crates/gammaloop-api/src/python.rs:158:1
546.96 s
gammaloop-workspace-doctest> |
546.96 s
gammaloop-workspace-doctest> 158 | to_dots("p(mu) * q(mu)")
546.96 s
gammaloop-workspace-doctest> | ^^^^^^^ not found in this scope
546.96 s
gammaloop-workspace-doctest>
546.96 s
gammaloop-workspace-doctest> error : aborting due to 1 previous error
546.96 s
gammaloop-workspace-doctest>
546.96 s
gammaloop-workspace-doctest> For more information about this error, try `rustc --explain E0425`.
546.96 s
gammaloop-workspace-doctest> Couldn't compile the test.
546.96 s
gammaloop-workspace-doctest> ---- crates/gammaloop-api/src/python.rs - python::GammaLoopAPI::new_python (line 2804) stdout ----
546.96 s
gammaloop-workspace-doctest> error[E0425] : cannot find value `api` in this scope
546.96 s
gammaloop-workspace-doctest> --> crates/gammaloop-api/src/python.rs:2805:1
546.96 s
gammaloop-workspace-doctest> |
546.96 s
gammaloop-workspace-doctest> 2805 | api = GammaLoopAPI(state_folder="./state", read_only_state=True)
546.96 s
gammaloop-workspace-doctest> | ^^^
546.96 s
gammaloop-workspace-doctest> |
546.96 s
gammaloop-workspace-doctest> help : you might have meant to introduce a new binding
546.96 s
gammaloop-workspace-doctest> |
546.96 s
gammaloop-workspace-doctest> 2805 | let api = GammaLoopAPI(state_folder="./state", read_only_state=True)
546.96 s
gammaloop-workspace-doctest> | +++
546.96 s
gammaloop-workspace-doctest>
546.96 s
gammaloop-workspace-doctest> error[E0425] : cannot find value `state_folder` in this scope
546.96 s
gammaloop-workspace-doctest> --> crates/gammaloop-api/src/python.rs:2805:20
546.96 s
gammaloop-workspace-doctest> |
546.96 s
gammaloop-workspace-doctest> 2805 | api = GammaLoopAPI(state_folder="./state", read_only_state=True)
546.96 s
gammaloop-workspace-doctest> | ^^^^^^^^^^^^ not found in this scope
546.96 s
gammaloop-workspace-doctest>
546.96 s
gammaloop-workspace-doctest> error[E0425] : cannot find value `read_only_state` in this scope
546.96 s
gammaloop-workspace-doctest> --> crates/gammaloop-api/src/python.rs:2805:44
546.96 s
gammaloop-workspace-doctest> |
546.96 s
gammaloop-workspace-doctest> 2805 | api = GammaLoopAPI(state_folder="./state", read_only_state=True)
546.96 s
gammaloop-workspace-doctest> | ^^^^^^^^^^^^^^^ not found in this scope
546.96 s
gammaloop-workspace-doctest>
546.96 s
gammaloop-workspace-doctest> error[E0425] : cannot find value `True` in this scope
546.96 s
gammaloop-workspace-doctest> --> crates/gammaloop-api/src/python.rs:2805:60
546.96 s
gammaloop-workspace-doctest> |
546.96 s
gammaloop-workspace-doctest> 2805 | api = GammaLoopAPI(state_folder="./state", read_only_state=True)
546.96 s
gammaloop-workspace-doctest> | ^^^^ not found in this scope
546.96 s
gammaloop-workspace-doctest> |
546.96 s
gammaloop-workspace-doctest> help : you may want to use a bool value instead
546.96 s
gammaloop-workspace-doctest> |
546.96 s
gammaloop-workspace-doctest> 2805 - api = GammaLoopAPI(state_folder="./state", read_only_state=True )
546.96 s
gammaloop-workspace-doctest> 2805 + api = GammaLoopAPI(state_folder="./state", read_only_state=true )
546.96 s
gammaloop-workspace-doctest> |
546.96 s
gammaloop-workspace-doctest>
546.96 s
gammaloop-workspace-doctest> error[E0425] : cannot find function, tuple struct or tuple variant `GammaLoopAPI` in this scope
546.96 s
gammaloop-workspace-doctest> --> crates/gammaloop-api/src/python.rs:2805:7
546.96 s
gammaloop-workspace-doctest> |
546.96 s
gammaloop-workspace-doctest> 2805 | api = GammaLoopAPI(state_folder="./state", read_only_state=True)
546.96 s
gammaloop-workspace-doctest> | ^^^^^^^^^^^^ not found in this scope
546.96 s
gammaloop-workspace-doctest>
546.96 s
gammaloop-workspace-doctest> error : aborting due to 5 previous errors
546.96 s
gammaloop-workspace-doctest>
546.96 s
gammaloop-workspace-doctest> For more information about this error, try `rustc --explain E0425`.
546.96 s
gammaloop-workspace-doctest> Couldn't compile the test.
546.96 s
gammaloop-workspace-doctest>
546.96 s
gammaloop-workspace-doctest> failures:
546.96 s
gammaloop-workspace-doctest> crates/gammaloop-api/src/python.rs - python::GammaLoopAPI::evaluate_sample (line 2926)
546.96 s
gammaloop-workspace-doctest> crates/gammaloop-api/src/python.rs - python::GammaLoopAPI::evaluate_samples (line 3040)
546.96 s
gammaloop-workspace-doctest> crates/gammaloop-api/src/python.rs - python::GammaLoopAPI::get_active_command_blocks (line 3652)
546.96 s
gammaloop-workspace-doctest> crates/gammaloop-api/src/python.rs - python::GammaLoopAPI::get_default_runtime_settings (line 3688)
546.96 s
gammaloop-workspace-doctest> crates/gammaloop-api/src/python.rs - python::GammaLoopAPI::get_global_settings (line 3631)
546.96 s
gammaloop-workspace-doctest> crates/gammaloop-api/src/python.rs - python::GammaLoopAPI::get_integrand_info (line 3496)
546.96 s
gammaloop-workspace-doctest> crates/gammaloop-api/src/python.rs - python::GammaLoopAPI::get_integrand_settings (line 3539)
546.96 s
gammaloop-workspace-doctest> crates/gammaloop-api/src/python.rs - python::GammaLoopAPI::get_run_history (line 3603)
546.96 s
gammaloop-workspace-doctest> crates/gammaloop-api/src/python.rs - python::GammaLoopAPI::new_python (line 2804)
546.96 s
gammaloop-workspace-doctest> crates/gammaloop-api/src/python.rs - python::GammaLoopAPI::run_command (line 3793)
546.96 s
gammaloop-workspace-doctest> crates/gammaloop-api/src/python.rs - python::atom_to_canonical_string (line 128)
546.96 s
gammaloop-workspace-doctest> crates/gammaloop-api/src/python.rs - python::atom_to_dots (line 157)
546.96 s
gammaloop-workspace-doctest> crates/gammaloop-api/src/python.rs - python::evaluate_graph_overall_factor (line 95)
546.96 s
gammaloop-workspace-doctest>
546.96 s
gammaloop-workspace-doctest> test result: FAILED. 0 passed; 13 failed; 0 ignored; 0 measured; 0 filtered out; finished in 0.19s
546.96 s
gammaloop-workspace-doctest>
546.97 s
gammaloop-workspace-doctest> error : doctest failed, to rerun pass `-p gammaloop-api --doc`
547.57 s
error: Cannot build '/nix/store/d7n0kzr0ab2qmzp3m3y3jhx03bbngjym-gammaloop-workspace-doctest-0.1.0.drv '.
547.57 s
Reason: builder failed with exit code 101 .
547.57 s
Output paths:
547.57 s
/nix/store/m1rbsc5idl2jxvknq7bvqysz3ysaha7l-gammaloop-workspace-doctest-0.1.0
547.57 s
Last 349 log lines:
547.57 s
> Running phase: unpackPhase
547.57 s
> unpacking source archive /nix/store/n62xwv096bc248rr6y7qpggfdbwshkw9-source
547.57 s
> source root is source
547.57 s
> Running phase: patchPhase
547.57 s
> Executing configureCargoCommonVars
547.57 s
> decompressing cargo artifacts from /nix/store/kbgwngi7xvi54jsr0kp8rhj1b9mfja7d-gammaloop-workspace-deps-deps-0.1.0/target.tar.zst to target
547.57 s
> Running phase: updateAutotoolsGnuConfigScriptsPhase
547.57 s
> Running phase: configurePhase
547.57 s
> will append /build/source/.cargo-home/config.toml with contents of /nix/store/xdy1vvhll2bijdplvl9fcc2b9plkxhaa-vendor-cargo-deps/config.toml
547.57 s
> default configurePhase, nothing to do
547.57 s
> Running phase: buildPhase
547.57 s
> +++ command cargo --version
547.57 s
> cargo 1.97.0 (c980f4866 2026-06-30)
547.57 s
> +++ command cargo test --profile ci-optim --doc --locked --workspace --features gammaloop-api/cli,gammaloop-tracing-filter/clap,gammaloop-tracing-filter/symbolica,idenso/bincode,idenso/reference-cases,linnet/bincode,linnet/drawing,linnet/nodestore-vec,linnet/rkyv,linnet/serde,linnet/symbolica,spenso-macros/shadowing,spenso/shadowing,symbolica/tracing_max_level_info
547.57 s
> Compiling target-lexicon v0.13.5
547.57 s
> Compiling symbolica v2.2.0 (https://github.com/symbolica-dev/symbolica?branch=dev#0441bd7a)
547.57 s
> Compiling maplit v1.0.2
547.57 s
> Compiling gammaloop-tracing-filter-macros v0.1.0 (/build/source/crates/gammaloop-tracing-filter-macros)
547.57 s
> Compiling vakint v0.1.2 (/build/source/crates/vakint)
547.57 s
> Compiling gammalooprs v0.3.4 (/build/source/crates/gammalooprs)
547.57 s
> Compiling alphal00p-docs-macros v0.1.0 (/build/source/crates/alphal00p-docs-macros)
547.57 s
> Compiling alphal00p-docs-schema v0.1.0 (/build/source/crates/alphal00p-docs-schema)
547.57 s
> Compiling rustc_version v0.4.1
547.57 s
> Compiling bincode v1.3.3
547.57 s
> Compiling gungraun-runner v0.18.2
547.57 s
> Compiling iai-callgrind-runner v0.14.2
547.57 s
> Compiling target-triple v1.0.1
547.57 s
> Compiling clinnet v0.1.8 (/build/source/crates/clinnet)
547.57 s
> Compiling gammaloop-integration-tests v0.1.0 (/build/source/tests)
547.57 s
> Compiling test-log-core v0.2.20
547.57 s
> Compiling wait-timeout v0.2.1
547.57 s
> Compiling iai-callgrind v0.14.2
547.57 s
> Compiling quick-error v1.2.3
547.57 s
> Compiling bit-vec v0.8.0
547.57 s
> Compiling rusty-fork v0.3.1
547.57 s
> Compiling bit-set v0.8.0
547.57 s
> Compiling iai-callgrind-macros v0.5.1
547.57 s
> Compiling rand_xorshift v0.4.0
547.57 s
> Compiling console v0.15.11
547.57 s
> Compiling glob v0.3.4
547.57 s
> Compiling unarray v0.1.4
547.57 s
> Compiling base64 v0.21.7
547.57 s
> Compiling gungraun-macros v0.8.0
547.57 s
> Compiling termcolor v1.4.1
547.57 s
> Compiling alphal00p-docs-catalogs v0.1.0 (/build/source/crates/alphal00p-docs-catalogs)
547.57 s
> Compiling similar-asserts v1.7.0
547.57 s
> Compiling trybuild v1.0.120
547.57 s
> Compiling ron v0.8.1
547.57 s
> Compiling alphal00p-docs-builder v0.1.0 (/build/source/crates/alphal00p-docs-builder)
547.57 s
> Compiling pyo3-build-config v0.28.3
547.57 s
> Compiling proptest v1.11.0
547.57 s
> Compiling kurvst v0.1.0 (/build/source/crates/kurvst)
547.57 s
> Compiling test-log-macros v0.2.20
547.57 s
> Compiling test-log v0.2.20
547.57 s
> Compiling alphal00p-docs-examples v0.1.0 (/build/source/crates/alphal00p-docs-examples)
547.57 s
> Compiling pyo3-ffi v0.28.3
547.57 s
> Compiling pyo3-macros-backend v0.28.3
547.57 s
> Compiling pyo3 v0.28.3
547.57 s
> Compiling numpy v0.28.0
547.57 s
> Compiling gammaloop-api v0.1.0 (/build/source/crates/gammaloop-api)
547.57 s
> Compiling gungraun v0.18.2
547.57 s
> Compiling pyo3-macros v0.28.3
547.57 s
> Compiling pyo3-stub-gen v0.17.2
547.57 s
> Compiling numerica v2.2.0 (https://github.com/symbolica-dev/symbolica?branch=dev#0441bd7a)
547.57 s
> Compiling graphica v2.1.0 (https://github.com/symbolica-dev/symbolica?branch=dev#0441bd7a)
547.57 s
> Compiling symbolica-utils v0.1.0 (/build/source/crates/symbolica-utils)
547.57 s
> Compiling gammaloop-workspace-hack v0.1.0 (/build/source/crates/gammaloop-workspace-hack)
547.57 s
> Compiling spenso-macros v0.3.2 (/build/source/crates/spenso-macros)
547.57 s
> Compiling linnet v0.17.0 (/build/source/crates/linnet)
547.57 s
> Compiling spenso v0.6.0 (/build/source/crates/spenso)
547.57 s
> Compiling idenso v0.3.0 (/build/source/crates/idenso)
547.57 s
> Compiling gammaloop-tracing-filter v0.1.0 (/build/source/crates/gammaloop-tracing-filter)
547.57 s
> Compiling spenso-hep-lib v0.1.7 (/build/source/crates/spenso-hep-lib)
547.57 s
> Compiling spynso3 v0.1.2 (/build/source/crates/spynso3)
547.57 s
> Compiling linnest v0.1.0 (/build/source/crates/linnest)
547.57 s
> Compiling linnet-py v0.1.0 (/build/source/crates/linnet-py)
547.57 s
> Finished `ci-optim` profile [optimized] target(s) in 8m 38s
547.57 s
> warning : the following packages contain code that will be rejected by a future version of Rust: proc-macro-error2 v2.0.1
547.57 s
> note : to see what the problems were, use the option `--future-incompat-report`, or run `cargo report future-incompatibilities --id 1`
547.57 s
> Doc-tests alphal00p_docs_builder
547.57 s
>
547.57 s
> running 0 tests
547.57 s
>
547.57 s
> test result: ok. 0 passed; 0 failed; 0 ignored; 0 measured; 0 filtered out; finished in 0.00s
547.57 s
>
547.57 s
> Doc-tests alphal00p_docs_catalogs
547.57 s
>
547.57 s
> running 0 tests
547.57 s
>
547.57 s
> test result: ok. 0 passed; 0 failed; 0 ignored; 0 measured; 0 filtered out; finished in 0.00s
547.57 s
>
547.57 s
> Doc-tests alphal00p_docs_examples
547.57 s
>
547.57 s
> running 0 tests
547.57 s
>
547.57 s
> test result: ok. 0 passed; 0 failed; 0 ignored; 0 measured; 0 filtered out; finished in 0.00s
547.57 s
>
547.57 s
> Doc-tests alphal00p_docs
547.57 s
>
547.57 s
> running 0 tests
547.57 s
>
547.57 s
> test result: ok. 0 passed; 0 failed; 0 ignored; 0 measured; 0 filtered out; finished in 0.00s
547.57 s
>
547.57 s
> Doc-tests alphal00p_docs_schema
547.57 s
>
547.57 s
> running 0 tests
547.57 s
>
547.57 s
> test result: ok. 0 passed; 0 failed; 0 ignored; 0 measured; 0 filtered out; finished in 0.00s
547.57 s
>
547.57 s
> Doc-tests clinnet
547.57 s
>
547.57 s
> running 0 tests
547.57 s
>
547.57 s
> test result: ok. 0 passed; 0 failed; 0 ignored; 0 measured; 0 filtered out; finished in 0.00s
547.57 s
>
547.57 s
> Doc-tests gammaloop_api
547.57 s
>
547.57 s
> running 13 tests
547.57 s
> test crates/gammaloop-api/src/python.rs - python::GammaLoopAPI::get_default_runtime_settings (line 3688) ... FAILED
547.57 s
> test crates/gammaloop-api/src/python.rs - python::GammaLoopAPI::evaluate_sample (line 2926) ... FAILED
547.57 s
> test crates/gammaloop-api/src/python.rs - python::GammaLoopAPI::get_active_command_blocks (line 3652) ... FAILED
547.57 s
> test crates/gammaloop-api/src/python.rs - python::GammaLoopAPI::evaluate_samples (line 3040) ... FAILED
547.57 s
> test crates/gammaloop-api/src/python.rs - python::GammaLoopAPI::get_integrand_settings (line 3539) ... FAILED
547.57 s
> test crates/gammaloop-api/src/python.rs - python::GammaLoopAPI::get_integrand_info (line 3496) ... FAILED
547.57 s
> test crates/gammaloop-api/src/python.rs - python::GammaLoopAPI::run_command (line 3793) ... FAILED
547.57 s
> test crates/gammaloop-api/src/python.rs - python::GammaLoopAPI::get_run_history (line 3603) ... FAILED
547.57 s
> test crates/gammaloop-api/src/python.rs - python::atom_to_canonical_string (line 128) ... FAILED
547.57 s
> test crates/gammaloop-api/src/python.rs - python::evaluate_graph_overall_factor (line 95) ... FAILED
547.57 s
> test crates/gammaloop-api/src/python.rs - python::GammaLoopAPI::get_global_settings (line 3631) ... FAILED
547.57 s
> test crates/gammaloop-api/src/python.rs - python::atom_to_dots (line 157) ... FAILED
547.57 s
> test crates/gammaloop-api/src/python.rs - python::GammaLoopAPI::new_python (line 2804) ... FAILED
547.57 s
>
547.57 s
> failures:
547.57 s
>
547.57 s
> ---- crates/gammaloop-api/src/python.rs - python::GammaLoopAPI::get_default_runtime_settings (line 3688) stdout ----
547.57 s
> error: expected one of `!` or `::`, found `=`
547.57 s
> --> crates/gammaloop-api/src/python.rs:3689:9
547.57 s
> |
547.57 s
> 3689 | runtime = api.get_default_runtime_settings()
547.57 s
> | ^ expected one of `!` or `::`
547.57 s
>
547.57 s
> error: aborting due to 1 previous error
547.57 s
>
547.57 s
> Couldn't compile the test.
547.57 s
> ---- crates/gammaloop-api/src/python.rs - python::GammaLoopAPI::evaluate_sample (line 2926) stdout ----
547.57 s
> error: expected one of `!` or `::`, found `=`
547.57 s
> --> crates/gammaloop-api/src/python.rs:2927:8
547.57 s
> |
547.57 s
> 2927 | result = api.evaluate_sample(point, process_id=0, minimal_output=True)
547.57 s
> | ^ expected one of `!` or `::`
547.57 s
>
547.57 s
> error: aborting due to 1 previous error
547.57 s
>
547.57 s
> Couldn't compile the test.
547.57 s
> ---- crates/gammaloop-api/src/python.rs - python::GammaLoopAPI::get_active_command_blocks (line 3652) stdout ----
547.57 s
> error: expected item, found keyword `for`
547.57 s
> --> crates/gammaloop-api/src/python.rs:3653:1
547.57 s
> |
547.57 s
> 3653 | for name, commands in api.get_active_command_blocks().items():
547.57 s
> | ^^^ expected item
547.57 s
> |
547.57 s
> = note: for a full list of items that can appear in modules, see <https://doc.rust-lang.org/reference/items.html>
547.57 s
>
547.57 s
> error: aborting due to 1 previous error
547.57 s
>
547.57 s
> Couldn't compile the test.
547.57 s
> ---- crates/gammaloop-api/src/python.rs - python::GammaLoopAPI::evaluate_samples (line 3040) stdout ----
547.57 s
> error: expected one of `!` or `::`, found `=`
547.57 s
> --> crates/gammaloop-api/src/python.rs:3041:8
547.57 s
> |
547.57 s
> 3041 | points = numpy.asarray(points, dtype=numpy.float64)
547.57 s
> | ^ expected one of `!` or `::`
547.57 s
>
547.57 s
> error: aborting due to 1 previous error
547.57 s
>
547.57 s
> Couldn't compile the test.
547.57 s
> ---- crates/gammaloop-api/src/python.rs - python::GammaLoopAPI::get_integrand_settings (line 3539) stdout ----
547.57 s
> error: expected one of `!` or `::`, found `=`
547.57 s
> --> crates/gammaloop-api/src/python.rs:3540:10
547.57 s
> |
547.57 s
> 3540 | settings = api.get_integrand_settings(process_id=0)
547.57 s
> | ^ expected one of `!` or `::`
547.57 s
>
547.57 s
> error: aborting due to 1 previous error
547.57 s
>
547.57 s
> Couldn't compile the test.
547.57 s
> ---- crates/gammaloop-api/src/python.rs - python::GammaLoopAPI::get_integrand_info (line 3496) stdout ----
547.57 s
> error: expected one of `!` or `::`, found `=`
547.57 s
> --> crates/gammaloop-api/src/python.rs:3497:6
547.57 s
> |
547.57 s
> 3497 | info = api.get_integrand_info(process_id=0)
547.57 s
> | ^ expected one of `!` or `::`
547.57 s
>
547.57 s
> error: aborting due to 1 previous error
547.57 s
>
547.57 s
> Couldn't compile the test.
547.57 s
> ---- crates/gammaloop-api/src/python.rs - python::GammaLoopAPI::run_command (line 3793) stdout ----
547.57 s
> error[E0425] : cannot find value `api` in this scope
547.57 s
> --> crates/gammaloop-api/src/python.rs:3794:1
547.57 s
> |
547.57 s
> 3794 | api.run("display processes")
547.57 s
> | ^^^ not found in this scope
547.57 s
>
547.57 s
> error : aborting due to 1 previous error
547.57 s
>
547.57 s
> For more information about this error, try `rustc --explain E0425`.
547.57 s
> Couldn't compile the test.
547.57 s
> ---- crates/gammaloop-api/src/python.rs - python::GammaLoopAPI::get_run_history (line 3603) stdout ----
547.57 s
> error[E0425] : cannot find value `run_card_toml` in this scope
547.57 s
> --> crates/gammaloop-api/src/python.rs:3604:1
547.57 s
> |
547.57 s
> 3604 | run_card_toml = api.get_run_history()
547.57 s
> | ^^^^^^^^^^^^^
547.57 s
> |
547.57 s
> help : you might have meant to introduce a new binding
547.57 s
> |
547.57 s
> 3604 | let run_card_toml = api.get_run_history()
547.57 s
> | +++
547.57 s
>
547.57 s
> error[E0425] : cannot find value `api` in this scope
547.57 s
> --> crates/gammaloop-api/src/python.rs:3604:17
547.57 s
> |
547.57 s
> 3604 | run_card_toml = api.get_run_history()
547.57 s
> | ^^^ not found in this scope
547.57 s
>
547.57 s
> error : aborting due to 2 previous errors
547.57 s
>
547.57 s
> For more information about this error, try `rustc --explain E0425`.
547.57 s
> Couldn't compile the test.
547.57 s
> ---- crates/gammaloop-api/src/python.rs - python::atom_to_canonical_string (line 128) stdout ----
547.58 s
> error[E0425] : cannot find function `atom_to_canonical_string` in this scope
547.58 s
> --> crates/gammaloop-api/src/python.rs:129:1
547.58 s
> |
547.58 s
> 129 | atom_to_canonical_string("x + x")
547.58 s
> | ^^^^^^^^^^^^^^^^^^^^^^^^ not found in this scope
547.58 s
>
547.58 s
> error : aborting due to 1 previous error
547.58 s
>
547.58 s
> For more information about this error, try `rustc --explain E0425`.
547.58 s
> Couldn't compile the test.
547.58 s
> ---- crates/gammaloop-api/src/python.rs - python::evaluate_graph_overall_factor (line 95) stdout ----
547.58 s
> error[E0425] : cannot find function `evaluate_graph_overall_factor` in this scope
547.58 s
> --> crates/gammaloop-api/src/python.rs:96:1
547.58 s
> |
547.58 s
> 96 | evaluate_graph_overall_factor(
547.58 s
> | ^^^^^^^^^^^^^^^^^^^^^^^^^^^^^ not found in this scope
547.58 s
>
547.58 s
> error : aborting due to 1 previous error
547.58 s
>
547.58 s
> For more information about this error, try `rustc --explain E0425`.
547.58 s
> Couldn't compile the test.
547.58 s
> ---- crates/gammaloop-api/src/python.rs - python::GammaLoopAPI::get_global_settings (line 3631) stdout ----
547.58 s
> error[E0425] : cannot find value `settings_toml` in this scope
547.58 s
> --> crates/gammaloop-api/src/python.rs:3632:1
547.58 s
> |
547.58 s
> 3632 | settings_toml = api.get_global_settings()
547.58 s
> | ^^^^^^^^^^^^^
547.58 s
> |
547.58 s
> help : you might have meant to introduce a new binding
547.58 s
> |
547.58 s
> 3632 | let settings_toml = api.get_global_settings()
547.58 s
> | +++
547.58 s
>
547.58 s
> error[E0425] : cannot find value `api` in this scope
547.58 s
> --> crates/gammaloop-api/src/python.rs:3632:17
547.58 s
> |
547.58 s
> 3632 | settings_toml = api.get_global_settings()
547.58 s
> | ^^^ not found in this scope
547.58 s
>
547.58 s
> error : aborting due to 2 previous errors
547.58 s
>
547.58 s
> For more information about this error, try `rustc --explain E0425`.
547.58 s
> Couldn't compile the test.
547.58 s
> ---- crates/gammaloop-api/src/python.rs - python::atom_to_dots (line 157) stdout ----
547.58 s
> error[E0425] : cannot find function `to_dots` in this scope
547.58 s
> --> crates/gammaloop-api/src/python.rs:158:1
547.58 s
> |
547.58 s
> 158 | to_dots("p(mu) * q(mu)")
547.58 s
> | ^^^^^^^ not found in this scope
547.58 s
>
547.58 s
> error : aborting due to 1 previous error
547.58 s
>
547.58 s
> For more information about this error, try `rustc --explain E0425`.
547.58 s
> Couldn't compile the test.
547.58 s
> ---- crates/gammaloop-api/src/python.rs - python::GammaLoopAPI::new_python (line 2804) stdout ----
547.58 s
> error[E0425] : cannot find value `api` in this scope
547.58 s
> --> crates/gammaloop-api/src/python.rs:2805:1
547.58 s
> |
547.58 s
> 2805 | api = GammaLoopAPI(state_folder="./state", read_only_state=True)
547.58 s
> | ^^^
547.58 s
> |
547.58 s
> help : you might have meant to introduce a new binding
547.58 s
> |
547.58 s
> 2805 | let api = GammaLoopAPI(state_folder="./state", read_only_state=True)
547.58 s
> | +++
547.58 s
>
547.58 s
> error[E0425] : cannot find value `state_folder` in this scope
547.58 s
> --> crates/gammaloop-api/src/python.rs:2805:20
547.58 s
> |
547.58 s
> 2805 | api = GammaLoopAPI(state_folder="./state", read_only_state=True)
547.58 s
> | ^^^^^^^^^^^^ not found in this scope
547.58 s
>
547.58 s
> error[E0425] : cannot find value `read_only_state` in this scope
547.58 s
> --> crates/gammaloop-api/src/python.rs:2805:44
547.58 s
> |
547.58 s
> 2805 | api = GammaLoopAPI(state_folder="./state", read_only_state=True)
547.58 s
> | ^^^^^^^^^^^^^^^ not found in this scope
547.58 s
>
547.58 s
> error[E0425] : cannot find value `True` in this scope
547.58 s
> --> crates/gammaloop-api/src/python.rs:2805:60
547.58 s
> |
547.58 s
> 2805 | api = GammaLoopAPI(state_folder="./state", read_only_state=True)
547.58 s
> | ^^^^ not found in this scope
547.58 s
> |
547.58 s
> help : you may want to use a bool value instead
547.58 s
> |
547.58 s
> 2805 - api = GammaLoopAPI(state_folder="./state", read_only_state=True )
547.58 s
> 2805 + api = GammaLoopAPI(state_folder="./state", read_only_state=true )
547.58 s
> |
547.58 s
>
547.58 s
> error[E0425] : cannot find function, tuple struct or tuple variant `GammaLoopAPI` in this scope
547.58 s
> --> crates/gammaloop-api/src/python.rs:2805:7
547.58 s
> |
547.58 s
> 2805 | api = GammaLoopAPI(state_folder="./state", read_only_state=True)
547.58 s
> | ^^^^^^^^^^^^ not found in this scope
547.58 s
>
547.58 s
> error : aborting due to 5 previous errors
547.58 s
>
547.58 s
> For more information about this error, try `rustc --explain E0425`.
547.58 s
> Couldn't compile the test.
547.58 s
>
547.58 s
> failures:
547.58 s
> crates/gammaloop-api/src/python.rs - python::GammaLoopAPI::evaluate_sample (line 2926)
547.58 s
> crates/gammaloop-api/src/python.rs - python::GammaLoopAPI::evaluate_samples (line 3040)
547.58 s
> crates/gammaloop-api/src/python.rs - python::GammaLoopAPI::get_active_command_blocks (line 3652)
547.58 s
> crates/gammaloop-api/src/python.rs - python::GammaLoopAPI::get_default_runtime_settings (line 3688)
547.58 s
> crates/gammaloop-api/src/python.rs - python::GammaLoopAPI::get_global_settings (line 3631)
547.58 s
> crates/gammaloop-api/src/python.rs - python::GammaLoopAPI::get_integrand_info (line 3496)
547.58 s
> crates/gammaloop-api/src/python.rs - python::GammaLoopAPI::get_integrand_settings (line 3539)
547.58 s
> crates/gammaloop-api/src/python.rs - python::GammaLoopAPI::get_run_history (line 3603)
547.58 s
> crates/gammaloop-api/src/python.rs - python::GammaLoopAPI::new_python (line 2804)
547.58 s
> crates/gammaloop-api/src/python.rs - python::GammaLoopAPI::run_command (line 3793)
547.58 s
> crates/gammaloop-api/src/python.rs - python::atom_to_canonical_string (line 128)
547.58 s
> crates/gammaloop-api/src/python.rs - python::atom_to_dots (line 157)
547.58 s
> crates/gammaloop-api/src/python.rs - python::evaluate_graph_overall_factor (line 95)
547.58 s
>
547.58 s
> test result: FAILED. 0 passed; 13 failed; 0 ignored; 0 measured; 0 filtered out; finished in 0.19s
547.58 s
>
547.58 s
> error : doctest failed, to rerun pass `-p gammaloop-api --doc`
547.58 s
For full logs, run:
547.58 s
nix log /nix/store/d7n0kzr0ab2qmzp3m3y3jhx03bbngjym-gammaloop-workspace-doctest-0.1.0.drv
547.69 s
[0 built (1 failed )]Run failed.