test packages.x86_64-linux.nix-ci-check-gammaloop-nextest-integration

Reproduce this run
Original Run
  1. 150.68 s gammaloop-nextest-integration> | dod2_bubble | rls.integrated | GL0 | pass | 0.0sigma | compatible within 2sigma | - |
  2. 150.68 s gammaloop-nextest-integration> +-------------+-----------------+---------+--------+----------+-----------------------------------------------------------------------------------------------------------------------+-------+
  3. 150.68 s gammaloop-nextest-integration> | dod2_bubble | mu_r.inspect | inspect | pass | - | best inspect relative delta 6.951e-1 >= 1000*accuracy 1.000e-7 (accuracy=1.000e-10, exponent=+0.0, seed=0, probes=10) | - |
  4. 150.68 s gammaloop-nextest-integration> +-------------+-----------------+---------+--------+----------+-----------------------------------------------------------------------------------------------------------------------+-------+
  5. 150.68 s gammaloop-nextest-integration> | dod2_bubble | target | - | pass | - | 2sigma | - |
  6. 150.68 s gammaloop-nextest-integration> +-------------+-----------------+---------+--------+----------+-----------------------------------------------------------------------------------------------------------------------+-------+
  7. 150.68 s gammaloop-nextest-integration> test dod2_bubble_uv ... FAILED
  8. 150.68 s gammaloop-nextest-integration>
  9. 150.68 s gammaloop-nextest-integration> failures:
  10. 150.68 s gammaloop-nextest-integration>
  11. 150.68 s gammaloop-nextest-integration> failures:
  12. 150.68 s gammaloop-nextest-integration> dod2_bubble_uv
  13. 150.68 s gammaloop-nextest-integration>
  14. 150.68 s gammaloop-nextest-integration> test result: FAILED. 0 passed; 1 failed; 0 ignored; 0 measured; 24 filtered out; finished in 47.31s
  15. 150.68 s gammaloop-nextest-integration> system-err
  16. 150.68 s gammaloop-nextest-integration> [2026-08-28 12:19:22.629] @gammaloop_api::se... INFO : Running command run generate
  17. 150.68 s gammaloop-nextest-integration> [2026-08-28 12:19:22.629] @gammaloop_api::se... INFO : Starting command block generate
  18. 150.68 s gammaloop-nextest-integration> [2026-08-28 12:19:22.630] @gammaloop_api::se... INFO : Running command import model scalars-default.json
  19. 150.68 s gammaloop-nextest-integration> [2026-08-28 12:19:22.630] @import::model INFO : Loading built-in JSON model scalars-default
  20. 150.68 s gammaloop-nextest-integration> [2026-08-28 12:19:22.640] @gammalooprs::model INFO : The following 2 external parameters were forced to zero by the restriction card:
  21. 150.68 s gammaloop-nextest-integration> width_scalar_1, width_scalar_2
  22. 150.68 s gammaloop-nextest-integration> [2026-08-28 12:19:22.644] @gammaloop_api::se... INFO : Running command remove processes
  23. 150.68 s gammaloop-nextest-integration> [2026-08-28 12:19:22.644] @gammaloop_api::se... INFO : Running command set global kv global.generation.uv.generate_integrated=true
  24. 150.68 s gammaloop-nextest-integration> [2026-08-28 12:19:22.645] @gammaloop_api::se... INFO : Running command import graphs ./tests/resources/graphs/scalar/dod2_bubble.dot -p bubble_dod2 -i scalar_bubble_below_thres
  25. 150.68 s gammaloop-nextest-integration> [2026-08-28 12:19:22.645] @commands::import INFO : Loading graphs from '/build/source/tests/resources/graphs/scalar/dod2_bubble.dot'
  26. 150.68 s gammaloop-nextest-integration> [2026-08-28 12:19:22.655] @gammaloop_api::se... INFO : Running command generate existing -p bubble_dod2 -i scalar_bubble_below_thres
  27. 150.68 s gammaloop-nextest-integration> [2026-08-28 12:19:22.657] @approx::local_4d [{#uv, #inspect, #integrated}] DEBUG : Rescaled momenta expanded
  28. 150.68 s gammaloop-nextest-integration> field value
  29. 150.68 s gammaloop-nextest-integration> res n-terms: 1, byte size: 3,expr:
  30. 150.68 s gammaloop-nextest-integration> 1
  31. 150.68 s gammaloop-nextest-integration> [2026-08-28 12:19:22.681] @approx::local_4d [{#uv, #inspect, #integrated}] DEBUG : Rescaled momenta expanded
  32. 150.68 s gammaloop-nextest-integration> field value
  33. 150.68 s gammaloop-nextest-integration> res n-terms: 1, byte size: 585,expr:
  34. 150.68 s gammaloop-nextest-integration> -SCALAR_COUPLING²·q₀(αᵉ².¹)·q₀(αᵉ³.¹)·q₂(αᵉ².¹)·q₂(αᵉ³.¹)
  35. 150.68 s gammaloop-nextest-integration> /(t²·denom(3,-q₀-q₂/t,mass_scalar_2²,-mass_scalar_2²+2·(q₀.q₂)/t+(q₂.q₂)/t²+(q₀.q₀))
  36. 150.68 s gammaloop-nextest-integration> ·denom(2,q₂/t,mass_scalar_2²,-mass_scalar_2²+(q₂.q₂)/t²))
  37. 150.68 s gammaloop-nextest-integration> [2026-08-28 12:19:22.697] @approx::final_integrand[{#generation, #profile, #uv, #graph, #summary}] DEBUG : Computed global numerator
  38. 150.68 s gammaloop-nextest-integration> field value
  39. 150.68 s gammaloop-nextest-integration> global_num n-terms: 1, byte size: 4,expr:
  40. 150.68 s gammaloop-nextest-integration> 1/2
  41. 150.68 s gammaloop-nextest-integration> span build_3d{span_context=true graph=GL0 current=subgraph=0, topo_order=0, dod=0}
  42. 150.68 s gammaloop-nextest-integration> [2026-08-28 12:19:22.752] @uv::approx [{#generation, #uv, #fourd}] DEBUG : Computing 4D
  43. 150.68 s gammaloop-nextest-integration> field value
  44. 150.68 s gammaloop-nextest-integration> simple subgraph(S_11,S_y)*Approx(subgraph(S_y,0)) of GL0
  45. 150.68 s gammaloop-nextest-integration> span compute_4d{span_context=true graph=GL0 current=subgraph=y, topo_order=1, dod=2 given=subgraph=0, topo_order=0, dod=0 reduced=SubSet { set: BitVec<usize, bitvec::order::Lsb0> { addr: 0x7fffe8023490, head: 000000, bits: 6, capacity: 64 } [0, 0, 1, 1, 1, 1], id: PhantomData<linnet::half_edge::involution::Hedge> }}
  46. 150.68 s gammaloop-nextest-integration> [2026-08-28 12:19:22.753] @approx::local_4d [{#uv, #algebra, #integrated, #start}] DEBUG :
  47. 150.68 s gammaloop-nextest-integration> field value
  48. 150.68 s gammaloop-nextest-integration> integrand n-terms: 1, byte size: 409,expr:
  49. 150.68 s gammaloop-nextest-integration> SCALAR_COUPLING²·(q₀(αᵉ³.¹)+q₃(αᵉ³.¹))·q₀(αᵉ².¹)·q₀(αᵉ³.¹)·q₂(αᵉ².¹)
  50. 150.68 s gammaloop-nextest-integration> /(denom(2,q₂,mass_scalar_2²,-mass_scalar_2²+(q₂.q₂))·denom(3,q₃,mass_scalar_2²,-mass_scalar_2²+(q₃.q₃)))
  51. 150.68 s gammaloop-nextest-integration> reduced y
  52. 150.68 s gammaloop-nextest-integration> span grow{span_context=true current=subgraph=y, topo_order=1, dod=2 given=subgraph=0, topo_order=0, dod=0}
  53. 150.68 s gammaloop-nextest-integration> [2026-08-28 12:19:22.753] @approx::local_4d [{#uv, #inspect, #integrated}] DEBUG : Rescaled momenta expanded
  54. 150.68 s gammaloop-nextest-integration> field value
  55. 150.68 s gammaloop-nextest-integration> res n-terms: 1, byte size: 585,expr:
  56. 150.68 s gammaloop-nextest-integration> -SCALAR_COUPLING²·q₀(αᵉ².¹)·q₀(αᵉ³.¹)·q₂(αᵉ².¹)·q₂(αᵉ³.¹)
  57. 150.68 s gammaloop-nextest-integration> /(t²·denom(3,-q₀-q₂/t,mass_scalar_2²,-mass_scalar_2²+2·(q₀.q₂)/t+(q₂.q₂)/t²+(q₀.q₀))
  58. 150.68 s gammaloop-nextest-integration> ·denom(2,q₂/t,mass_scalar_2²,-mass_scalar_2²+(q₂.q₂)/t²))
  59. 150.68 s gammaloop-nextest-integration> span t{span_context=true current=subgraph=y, topo_order=1, dod=2 given=subgraph=0, topo_order=0, dod=0}
  60. 150.68 s gammaloop-nextest-integration> [2026-08-28 12:19:22.754] @approx::local_4d [{#uv, #integrated, #rescaled}] DEBUG : Rescaled expanded
  61. 150.68 s gammaloop-nextest-integration> field value
  62. 150.68 s gammaloop-nextest-integration> n_loops 1
  63. 150.68 s gammaloop-nextest-integration> res n-terms: 1, byte size: 707,expr:
  64. 150.68 s gammaloop-nextest-integration> -SCALAR_COUPLING²·q₀(αᵉ².¹)·q₀(αᵉ³.¹)·q₂(αᵉ².¹)·q₂(αᵉ³.¹)
  65. 150.68 s gammaloop-nextest-integration> /(t²·denom(3,-q₂,mUVexp²+t²·mass_scalar_2²,-mUV²+t²·(-mass_scalar_2²+2·(q₀.q₂)/t+(q₂.q₂)/t²+(q₀.q₀))+t²·mUVexp²)
  66. 150.68 s gammaloop-nextest-integration> ·denom(2,q₂,mUVexp²+t²·mass_scalar_2²,-mUV²+t²·(-mass_scalar_2²+(q₂.q₂)/t²)+t²·mUVexp²))
  67. 150.68 s gammaloop-nextest-integration> span t{span_context=true current=subgraph=y, topo_order=1, dod=2 given=subgraph=0, topo_order=0, dod=0}
  68. 150.68 s gammaloop-nextest-integration> [2026-08-28 12:19:22.761] @approx::local_4d [{#uv, #integrated, #series}] DEBUG : Series expanded
  69. 150.68 s gammaloop-nextest-integration> field value
  70. 150.68 s gammaloop-nextest-integration> res n-terms: 3, byte size: 1896,expr:
  71. 150.68 s gammaloop-nextest-integration> (1/2·SCALAR_COUPLING²·(2·mUVexp²-2·mass_scalar_2²)/(denom(2,q₂,mUVexp²,-mUV²+(q₂.q₂))²·denom(3,-q₂,mUVexp²,-mUV²+(q₂.q₂)))
  72. 150.68 s gammaloop-nextest-integration> -SCALAR_COUPLING²
  73. 150.68 s gammaloop-nextest-integration> ·(-1/2·(2·mUVexp²-2·mass_scalar_2²+2·(q₀.q₀))/denom(3,-q₂,mUVexp²,-mUV²+(q₂.q₂))
  74. 150.68 s gammaloop-nextest-integration> +4·(q₀.q₂)²/denom(3,-q₂,mUVexp²,-mUV²+(q₂.q₂))²
  75. 150.68 s gammaloop-nextest-integration> )/(denom(2,q₂,mUVexp²,-mUV²+(q₂.q₂))·denom(3,-q₂,mUVexp²,-mUV²+(q₂.q₂)))
  76. 150.68 s gammaloop-nextest-integration> )·q₀(αᵉ².¹)·q₀(αᵉ³.¹)·q₂(αᵉ².¹)·q₂(αᵉ³.¹)
  77. 150.68 s gammaloop-nextest-integration> +2·SCALAR_COUPLING²·(q₀.q₂)·q₀(αᵉ².¹)·q₀(αᵉ³.¹)·q₂(αᵉ².¹)·q₂(αᵉ³.¹)
  78. 150.68 s gammaloop-nextest-integration> /(t·denom(2,q₂,mUVexp²,-mUV²+(q₂.q₂))·denom(3,-q₂,mUVexp²,-mUV²+(q₂.q₂))²)
  79. 150.68 s gammaloop-nextest-integration> -SCALAR_COUPLING²·q₀(αᵉ².¹)·q₀(αᵉ³.¹)·q₂(αᵉ².¹)·q₂(αᵉ³.¹)
  80. 150.68 s gammaloop-nextest-integration> /(t²·denom(2,q₂,mUVexp²,-mUV²+(q₂.q₂))·denom(3,-q₂,mUVexp²,-mUV²+(q₂.q₂)))
  81. 150.68 s gammaloop-nextest-integration> span t{span_context=true current=subgraph=y, topo_order=1, dod=2 given=subgraph=0, topo_order=0, dod=0}
  82. 150.68 s gammaloop-nextest-integration> [2026-08-28 12:19:22.762] @approx::local_4d [{#uv, #integrated, #series}] DEBUG : Evaluated at t = 1
  83. 150.68 s gammaloop-nextest-integration> field value
  84. 150.68 s gammaloop-nextest-integration> res n-terms: 3, byte size: 1880,expr:
  85. 150.68 s gammaloop-nextest-integration> (1/2·SCALAR_COUPLING²·(2·mUVexp²-2·mass_scalar_2²)/(denom(2,q₂,mUVexp²,-mUV²+(q₂.q₂))²·denom(3,-q₂,mUVexp²,-mUV²+(q₂.q₂)))
  86. 150.68 s gammaloop-nextest-integration> -SCALAR_COUPLING²
  87. 150.68 s gammaloop-nextest-integration> ·(-1/2·(2·mUVexp²-2·mass_scalar_2²+2·(q₀.q₀))/denom(3,-q₂,mUVexp²,-mUV²+(q₂.q₂))
  88. 150.68 s gammaloop-nextest-integration> +4·(q₀.q₂)²/denom(3,-q₂,mUVexp²,-mUV²+(q₂.q₂))²
  89. 150.68 s gammaloop-nextest-integration> )/(denom(2,q₂,mUVexp²,-mUV²+(q₂.q₂))·denom(3,-q₂,mUVexp²,-mUV²+(q₂.q₂)))
  90. 150.68 s gammaloop-nextest-integration> )·q₀(αᵉ².¹)·q₀(αᵉ³.¹)·q₂(αᵉ².¹)·q₂(αᵉ³.¹)
  91. 150.68 s gammaloop-nextest-integration> -SCALAR_COUPLING²·q₀(αᵉ².¹)·q₀(αᵉ³.¹)·q₂(αᵉ².¹)·q₂(αᵉ³.¹)
  92. 150.68 s gammaloop-nextest-integration> /(denom(2,q₂,mUVexp²,-mUV²+(q₂.q₂))·denom(3,-q₂,mUVexp²,-mUV²+(q₂.q₂)))
  93. 150.68 s gammaloop-nextest-integration> +2·SCALAR_COUPLING²·(q₀.q₂)·q₀(αᵉ².¹)·q₀(αᵉ³.¹)·q₂(αᵉ².¹)·q₂(αᵉ³.¹)
  94. 150.68 s gammaloop-nextest-integration> /(denom(2,q₂,mUVexp²,-mUV²+(q₂.q₂))·denom(3,-q₂,mUVexp²,-mUV²+(q₂.q₂))²)
  95. 150.68 s gammaloop-nextest-integration> span t{span_context=true current=subgraph=y, topo_order=1, dod=2 given=subgraph=0, topo_order=0, dod=0}
  96. 150.68 s gammaloop-nextest-integration> [2026-08-28 12:19:22.771] @approx::local_4d [{#uv, #collect, #integrated}] DEBUG : After gamma chain collection
  97. 150.68 s gammaloop-nextest-integration> field value
  98. 150.68 s gammaloop-nextest-integration> expr n-terms: 3, byte size: 1880,expr:
  99. 150.68 s gammaloop-nextest-integration> (1/2·SCALAR_COUPLING²·(2·mUVexp²-2·mass_scalar_2²)/(denom(2,q₂,mUVexp²,-mUV²+(q₂.q₂))²·denom(3,-q₂,mUVexp²,-mUV²+(q₂.q₂)))
  100. 150.68 s gammaloop-nextest-integration> -SCALAR_COUPLING²
  101. 150.68 s gammaloop-nextest-integration> ·(-1/2·(2·mUVexp²-2·mass_scalar_2²+2·(q₀.q₀))/denom(3,-q₂,mUVexp²,-mUV²+(q₂.q₂))
  102. 150.68 s gammaloop-nextest-integration> +4·(q₀.q₂)²/denom(3,-q₂,mUVexp²,-mUV²+(q₂.q₂))²
  103. 150.68 s gammaloop-nextest-integration> )/(denom(2,q₂,mUVexp²,-mUV²+(q₂.q₂))·denom(3,-q₂,mUVexp²,-mUV²+(q₂.q₂)))
  104. 150.68 s gammaloop-nextest-integration> )·q₀(αᵉ².¹)·q₀(αᵉ³.¹)·q₂(αᵉ².¹)·q₂(αᵉ³.¹)
  105. 150.68 s gammaloop-nextest-integration> -SCALAR_COUPLING²·q₀(αᵉ².¹)·q₀(αᵉ³.¹)·q₂(αᵉ².¹)·q₂(αᵉ³.¹)
  106. 150.68 s gammaloop-nextest-integration> /(denom(2,q₂,mUVexp²,-mUV²+(q₂.q₂))·denom(3,-q₂,mUVexp²,-mUV²+(q₂.q₂)))
  107. 150.68 s gammaloop-nextest-integration> +2·SCALAR_COUPLING²·(q₀.q₂)·q₀(αᵉ².¹)·q₀(αᵉ³.¹)·q₂(αᵉ².¹)·q₂(αᵉ³.¹)
  108. 150.68 s gammaloop-nextest-integration> /(denom(2,q₂,mUVexp²,-mUV²+(q₂.q₂))·denom(3,-q₂,mUVexp²,-mUV²+(q₂.q₂))²)
  109. 150.68 s gammaloop-nextest-integration> span t{span_context=true current=subgraph=y, topo_order=1, dod=2 given=subgraph=0, topo_order=0, dod=0}
  110. 150.68 s gammaloop-nextest-integration> [2026-08-28 12:19:22.780] @approx::local_4d [{#profile, #uv, #collect, #integrated, #start, #trace}] DEBUG : After gamma schoonschip
  111. 150.68 s gammaloop-nextest-integration> field value
  112. 150.68 s gammaloop-nextest-integration> expr n-terms: 3, byte size: 1631,expr:
  113. 150.68 s gammaloop-nextest-integration> (1/2·SCALAR_COUPLING²·(2·mUVexp²-2·mass_scalar_2²)/(denom(2,q₂,mUVexp²,-mUV²+(q₂.q₂))²·denom(3,-q₂,mUVexp²,-mUV²+(q₂.q₂)))
  114. 150.68 s gammaloop-nextest-integration> -SCALAR_COUPLING²
  115. 150.68 s gammaloop-nextest-integration> ·(-1/2·(2·mUVexp²-2·mass_scalar_2²+2·(q₀.q₀))/denom(3,-q₂,mUVexp²,-mUV²+(q₂.q₂))
  116. 150.68 s gammaloop-nextest-integration> +4·(q₀.q₂)²/denom(3,-q₂,mUVexp²,-mUV²+(q₂.q₂))²
  117. 150.68 s gammaloop-nextest-integration> )/(denom(2,q₂,mUVexp²,-mUV²+(q₂.q₂))·denom(3,-q₂,mUVexp²,-mUV²+(q₂.q₂)))
  118. 150.68 s gammaloop-nextest-integration> )·(q₀.q₂)²
  119. 150.68 s gammaloop-nextest-integration> -SCALAR_COUPLING²·(q₀.q₂)²/(denom(2,q₂,mUVexp²,-mUV²+(q₂.q₂))·denom(3,-q₂,mUVexp²,-mUV²+(q₂.q₂)))
  120. 150.68 s gammaloop-nextest-integration> +2·SCALAR_COUPLING²·(q₀.q₂)·(q₀.q₂)²
  121. 150.68 s gammaloop-nextest-integration> /(denom(2,q₂,mUVexp²,-mUV²+(q₂.q₂))·denom(3,-q₂,mUVexp²,-mUV²+(q₂.q₂))²)
  122. 150.68 s gammaloop-nextest-integration> span t{span_context=true current=subgraph=y, topo_order=1, dod=2 given=subgraph=0, topo_order=0, dod=0}
  123. 150.68 s gammaloop-nextest-integration> [2026-08-28 12:19:22.782] @approx::local_4d [{#profile, #uv, #collect, #integrated, #start, #trace}] DEBUG : After gamma collection
  124. 150.68 s gammaloop-nextest-integration> field value
  125. 150.68 s gammaloop-nextest-integration> expr n-terms: 1, byte size: 1347,expr:
  126. 150.68 s gammaloop-nextest-integration> SCALAR_COUPLING²
  127. 150.68 s gammaloop-nextest-integration> ·(-denom(2,q₂,mUVexp²,-mUV²+(q₂.q₂))·denom(3,-q₂,mUVexp²,-mUV²+(q₂.q₂))²
  128. 150.68 s gammaloop-nextest-integration> +1/2·(2·mUVexp²-2·mass_scalar_2²)·denom(3,-q₂,mUVexp²,-mUV²+(q₂.q₂))²
  129. 150.68 s gammaloop-nextest-integration> -(-1/2·(2·mUVexp²-2·mass_scalar_2²+2·(q₀.q₀))·denom(3,-q₂,mUVexp²,-mUV²+(q₂.q₂))+4·(q₀.q₂)²)
  130. 150.68 s gammaloop-nextest-integration> ·denom(2,q₂,mUVexp²,-mUV²+(q₂.q₂))
  131. 150.68 s gammaloop-nextest-integration> +2·(q₀.q₂)·denom(2,q₂,mUVexp²,-mUV²+(q₂.q₂))·denom(3,-q₂,mUVexp²,-mUV²+(q₂.q₂))
  132. 150.68 s gammaloop-nextest-integration> )·(q₀.q₂)²/(denom(2,q₂,mUVexp²,-mUV²+(q₂.q₂))²·denom(3,-q₂,mUVexp²,-mUV²+(q₂.q₂))³)
  133. 150.68 s gammaloop-nextest-integration> span t{span_context=true current=subgraph=y, topo_order=1, dod=2 given=subgraph=0, topo_order=0, dod=0}
  134. 150.68 s gammaloop-nextest-integration> [2026-08-28 12:19:22.790] @approx::local_4d [{#profile, #uv, #gamma, #integrated, #start, #trace, #vakint}] DEBUG : After gamma simplification
  135. 150.68 s gammaloop-nextest-integration> ... omitted 3263 more lines; see full nextest output above
  136. 150.68 s gammaloop-nextest-integration>
  137. 150.68 s gammaloop-nextest-integration> 8. gammaloop-integration-tests::uv::sunrise_scalar_1_uv
  138. 150.71 s gammaloop-nextest-integration> failure: test failure with exit code 101
  139. 150.71 s gammaloop-nextest-integration> system-out
  140. 150.71 s gammaloop-nextest-integration> running 1 test
  141. 150.71 s gammaloop-nextest-integration> test sunrise_scalar_1_uv has been running for over 60 seconds
  142. 150.71 s gammaloop-nextest-integration> +------------------+------------------------+--------------+--------+----------+----------------------------------------------------------------------------------------------------------------------+-------+
  143. 150.71 s gammaloop-nextest-integration> | case | check | graph | status | sigma | threshold | error |
  144. 150.71 s gammaloop-nextest-integration> +------------------+------------------------+--------------+--------+----------+----------------------------------------------------------------------------------------------------------------------+-------+
  145. 150.71 s gammaloop-nextest-integration> | sunrise_scalar_1 | uv_profile | - | FAIL | - | - | - |
  146. 150.71 s gammaloop-nextest-integration> +------------------+------------------------+--------------+--------+----------+----------------------------------------------------------------------------------------------------------------------+-------+
  147. 150.71 s gammaloop-nextest-integration> | sunrise_scalar_1 | m_uv.inspect | inspect | pass | - | best inspect relative delta 1.624e0 >= 1000*accuracy 1.000e-3 (accuracy=1.000e-6, exponent=+1.0, seed=1, probes=10) | - |
  148. 150.71 s gammaloop-nextest-integration> +------------------+------------------------+--------------+--------+----------+----------------------------------------------------------------------------------------------------------------------+-------+
  149. 150.71 s gammaloop-nextest-integration> | sunrise_scalar_1 | m_uv.integrated | sunrise | pass | 0.1sigma | compatible within 2sigma | - |
  150. 150.71 s gammaloop-nextest-integration> +------------------+------------------------+--------------+--------+----------+----------------------------------------------------------------------------------------------------------------------+-------+
  151. 150.71 s gammaloop-nextest-integration> | sunrise_scalar_1 | rls.inspect | inspect | pass | - | best inspect relative delta 8.682e-1 >= 1000*accuracy 1.000e-3 (accuracy=1.000e-6, exponent=+1.0, seed=1, probes=10) | - |
  152. 150.71 s gammaloop-nextest-integration> +------------------+------------------------+--------------+--------+----------+----------------------------------------------------------------------------------------------------------------------+-------+
  153. 150.71 s gammaloop-nextest-integration> | sunrise_scalar_1 | rls.integrated | sunrise | pass | 0.0sigma | compatible within 2sigma | - |
  154. 150.71 s gammaloop-nextest-integration> +------------------+------------------------+--------------+--------+----------+----------------------------------------------------------------------------------------------------------------------+-------+
  155. 150.71 s gammaloop-nextest-integration> | sunrise_scalar_1 | mu_r.inspect | inspect | pass | - | best inspect relative delta 1.752e0 >= 1000*accuracy 1.000e-3 (accuracy=1.000e-6, exponent=+1.0, seed=1, probes=10) | - |
  156. 150.71 s gammaloop-nextest-integration> +------------------+------------------------+--------------+--------+----------+----------------------------------------------------------------------------------------------------------------------+-------+
  157. 150.71 s gammaloop-nextest-integration> | sunrise_scalar_1 | integrated.relerr | integrated | pass | - | relative error 9.20% <= 10.00% | - |
  158. 150.71 s gammaloop-nextest-integration> +------------------+------------------------+--------------+--------+----------+----------------------------------------------------------------------------------------------------------------------+-------+
  159. 150.71 s gammaloop-nextest-integration> | sunrise_scalar_1 | m_uv.integrated.relerr | m_uv-shifted | pass | - | relative error 5.89% <= 10.00% | - |
  160. 150.71 s gammaloop-nextest-integration> +------------------+------------------------+--------------+--------+----------+----------------------------------------------------------------------------------------------------------------------+-------+
  161. 150.71 s gammaloop-nextest-integration> | sunrise_scalar_1 | target | - | pass | - | 2sigma | - |
  162. 150.71 s gammaloop-nextest-integration> +------------------+------------------------+--------------+--------+----------+----------------------------------------------------------------------------------------------------------------------+-------+
  163. 150.71 s gammaloop-nextest-integration> test sunrise_scalar_1_uv ... FAILED
  164. 150.71 s gammaloop-nextest-integration>
  165. 150.71 s gammaloop-nextest-integration> failures:
  166. 150.71 s gammaloop-nextest-integration>
  167. 150.71 s gammaloop-nextest-integration> failures:
  168. 150.71 s gammaloop-nextest-integration> sunrise_scalar_1_uv
  169. 150.71 s gammaloop-nextest-integration>
  170. 150.71 s gammaloop-nextest-integration> test result: FAILED. 0 passed; 1 failed; 0 ignored; 0 measured; 24 filtered out; finished in 104.17s
  171. 150.71 s gammaloop-nextest-integration> system-err
  172. 150.71 s gammaloop-nextest-integration> [2026-08-28 12:19:30.251] @gammaloop_api::se... INFO : Running command run generate
  173. 150.71 s gammaloop-nextest-integration> [2026-08-28 12:19:30.251] @gammaloop_api::se... INFO : Starting command block generate
  174. 150.71 s gammaloop-nextest-integration> [2026-08-28 12:19:30.251] @gammaloop_api::se... INFO : Running command import model scalars-default.json
  175. 150.71 s gammaloop-nextest-integration> [2026-08-28 12:19:30.251] @import::model INFO : Loading built-in JSON model scalars-default
  176. 150.71 s gammaloop-nextest-integration> [2026-08-28 12:19:30.255] @gammalooprs::model INFO : The following 2 external parameters were forced to zero by the restriction card:
  177. 150.71 s gammaloop-nextest-integration> width_scalar_1, width_scalar_2
  178. 150.71 s gammaloop-nextest-integration> [2026-08-28 12:19:30.255] @gammaloop_api::se... INFO : Running command remove processes
  179. 150.71 s gammaloop-nextest-integration> [2026-08-28 12:19:30.256] @gammaloop_api::se... INFO : Running command set global kv global.generation.uv.generate_integrated=true
  180. 150.71 s gammaloop-nextest-integration> [2026-08-28 12:19:30.259] @gammaloop_api::se... INFO : Running command import graphs ./tests/resources/graphs/scalar_sunrise.dot -p sunrise_scalar_1 -i scalar_sunrise
  181. 150.71 s gammaloop-nextest-integration> [2026-08-28 12:19:30.259] @commands::import INFO : Loading graphs from '/build/source/tests/resources/graphs/scalar_sunrise.dot'
  182. 150.71 s gammaloop-nextest-integration> [2026-08-28 12:19:30.262] @gammaloop_api::se... INFO : Running command generate existing -p sunrise_scalar_1 -i scalar_sunrise
  183. 150.71 s gammaloop-nextest-integration> [2026-08-28 12:19:30.267] @approx::local_4d [{#uv, #inspect, #integrated}] DEBUG : Rescaled momenta expanded
  184. 150.71 s gammaloop-nextest-integration> field value
  185. 150.71 s gammaloop-nextest-integration> res n-terms: 1, byte size: 777,expr:
  186. 150.71 s gammaloop-nextest-integration> 1/(denom(0,q₀/t,mass_scalar_1²,-mass_scalar_1²+(q₀.q₀)/t²)·denom(1,q₁/t,mass_scalar_1²,-mass_scalar_1²+(q₁.q₁)/t²)
  187. 150.71 s gammaloop-nextest-integration> ·denom(2,q₄-q₀/t-q₁/t,mass_scalar_1²,
  188. 150.71 s gammaloop-nextest-integration> -mass_scalar_1²-2·(q₀.q₄)/t-2·(q₁.q₄)/t+(q₀.q₀)/t²+2·(q₀.q₁)/t²
  189. 150.71 s gammaloop-nextest-integration> +(q₁.q₁)/t²+(q₄.q₄)
  190. 150.71 s gammaloop-nextest-integration> ))
  191. 150.71 s gammaloop-nextest-integration> [2026-08-28 12:19:30.270] @approx::local_4d [{#uv, #inspect, #integrated}] DEBUG : Rescaled momenta expanded
  192. 150.71 s gammaloop-nextest-integration> field value
  193. 150.71 s gammaloop-nextest-integration> res n-terms: 1, byte size: 3,expr:
  194. 150.71 s gammaloop-nextest-integration> 1
  195. 150.71 s gammaloop-nextest-integration> [2026-08-28 12:19:30.270] @approx::local_4d [{#uv, #inspect, #integrated}] DEBUG : Rescaled momenta expanded
  196. 150.71 s gammaloop-nextest-integration> field value
  197. 150.71 s gammaloop-nextest-integration> res n-terms: 1, byte size: 611,expr:
  198. 150.71 s gammaloop-nextest-integration> 1/(denom(1,q₁/t,mass_scalar_1²,-mass_scalar_1²+(q₁.q₁)/t²)
  199. 150.71 s gammaloop-nextest-integration> ·denom(2,-q₀+q₃-q₁/t,mass_scalar_1²,
  200. 150.71 s gammaloop-nextest-integration> -mass_scalar_1²+2·(q₀.q₁)/t-2·(q₁.q₃)/t+(q₁.q₁)/t²+(q₀.q₀)
  201. 150.71 s gammaloop-nextest-integration> -2·(q₀.q₃)+(q₃.q₃)
  202. 150.71 s gammaloop-nextest-integration> ))
  203. 150.71 s gammaloop-nextest-integration> [2026-08-28 12:19:30.271] @approx::local_4d [{#uv, #inspect, #integrated}] DEBUG : Rescaled momenta expanded
  204. 150.71 s gammaloop-nextest-integration> field value
  205. 150.71 s gammaloop-nextest-integration> res n-terms: 1, byte size: 611,expr:
  206. 150.71 s gammaloop-nextest-integration> 1/(denom(0,q₀/t,mass_scalar_1²,-mass_scalar_1²+(q₀.q₀)/t²)
  207. 150.71 s gammaloop-nextest-integration> ·denom(2,-q₁+q₃-q₀/t,mass_scalar_1²,
  208. 150.71 s gammaloop-nextest-integration> -mass_scalar_1²+2·(q₀.q₁)/t-2·(q₀.q₃)/t+(q₀.q₀)/t²+(q₁.q₁)
  209. 150.71 s gammaloop-nextest-integration> -2·(q₁.q₃)+(q₃.q₃)
  210. 150.71 s gammaloop-nextest-integration> ))
  211. 150.71 s gammaloop-nextest-integration> [2026-08-28 12:19:30.276] @approx::local_4d [{#uv, #inspect, #integrated}] DEBUG : Rescaled momenta expanded
  212. 150.71 s gammaloop-nextest-integration> field value
  213. 150.71 s gammaloop-nextest-integration> res n-terms: 1, byte size: 611,expr:
  214. 150.71 s gammaloop-nextest-integration> 1/(denom(0,q₀/t,mass_scalar_1²,-mass_scalar_1²+(q₀.q₀)/t²)
  215. 150.71 s gammaloop-nextest-integration> ·denom(1,-q₂+q₃-q₀/t,mass_scalar_1²,
  216. 150.71 s gammaloop-nextest-integration> -mass_scalar_1²+2·(q₀.q₂)/t-2·(q₀.q₃)/t+(q₀.q₀)/t²+(q₂.q₂)
  217. 150.71 s gammaloop-nextest-integration> -2·(q₂.q₃)+(q₃.q₃)
  218. 150.71 s gammaloop-nextest-integration> ))
  219. 150.71 s gammaloop-nextest-integration> [2026-08-28 12:19:30.277] @approx::final_integrand[{#generation, #profile, #uv, #graph, #summary}] DEBUG : Computed global numerator
  220. 150.71 s gammaloop-nextest-integration> field value
  221. 150.71 s gammaloop-nextest-integration> global_num n-terms: 1, byte size: 3,expr:
  222. 150.71 s gammaloop-nextest-integration> 1
  223. 150.71 s gammaloop-nextest-integration> span build_3d{span_context=true graph=sunrise current=subgraph=0, topo_order=0, dod=0}
  224. 150.71 s gammaloop-nextest-integration> [2026-08-28 12:19:30.279] @uv::approx [{#generation, #uv, #fourd}] DEBUG : Computing 4D
  225. 150.71 s gammaloop-nextest-integration> field value
  226. 150.71 s gammaloop-nextest-integration> simple subgraph(S_47,S_44)*Approx(subgraph(S_44,0)) of sunrise
  227. 150.71 s gammaloop-nextest-integration> span compute_4d{span_context=true graph=sunrise current=subgraph=44, topo_order=1, dod=2 given=subgraph=0, topo_order=0, dod=0 reduced=SubSet { set: BitVec<usize, bitvec::order::Lsb0> { addr: 0x7fffd800cb20, head: 000000, bits: 8, capacity: 64 } [0, 0, 1, 1, 1, 1, 1, 1], id: PhantomData<linnet::half_edge::involution::Hedge> }}
  228. 150.71 s gammaloop-nextest-integration> [2026-08-28 12:19:30.280] @approx::local_4d [{#uv, #algebra, #integrated, #start}] DEBUG :
  229. 150.71 s gammaloop-nextest-integration> field value
  230. 150.71 s gammaloop-nextest-integration> integrand n-terms: 1, byte size: 322,expr:
  231. 150.71 s gammaloop-nextest-integration> 1/(denom(0,q₀,mass_scalar_1²,-mass_scalar_1²+(q₀.q₀))·denom(1,q₁,mass_scalar_1²,-mass_scalar_1²+(q₁.q₁))
  232. 150.71 s gammaloop-nextest-integration> ·denom(2,q₂,mass_scalar_1²,-mass_scalar_1²+(q₂.q₂)))
  233. 150.71 s gammaloop-nextest-integration> reduced 44
  234. 150.71 s gammaloop-nextest-integration> span grow{span_context=true current=subgraph=44, topo_order=1, dod=2 given=subgraph=0, topo_order=0, dod=0}
  235. 150.71 s gammaloop-nextest-integration> [2026-08-28 12:19:30.280] @approx::local_4d [{#uv, #inspect, #integrated}] DEBUG : Rescaled momenta expanded
  236. 150.71 s gammaloop-nextest-integration> field value
  237. 150.71 s gammaloop-nextest-integration> res n-terms: 1, byte size: 777,expr:
  238. 150.71 s gammaloop-nextest-integration> 1/(denom(0,q₀/t,mass_scalar_1²,-mass_scalar_1²+(q₀.q₀)/t²)·denom(1,q₁/t,mass_scalar_1²,-mass_scalar_1²+(q₁.q₁)/t²)
  239. 150.71 s gammaloop-nextest-integration> ·denom(2,q₄-q₀/t-q₁/t,mass_scalar_1²,
  240. 150.71 s gammaloop-nextest-integration> -mass_scalar_1²-2·(q₀.q₄)/t-2·(q₁.q₄)/t+(q₀.q₀)/t²+2·(q₀.q₁)/t²
  241. 150.71 s gammaloop-nextest-integration> +(q₁.q₁)/t²+(q₄.q₄)
  242. 150.71 s gammaloop-nextest-integration> ))
  243. 150.71 s gammaloop-nextest-integration> span t{span_context=true current=subgraph=44, topo_order=1, dod=2 given=subgraph=0, topo_order=0, dod=0}
  244. 150.71 s gammaloop-nextest-integration> [2026-08-28 12:19:30.281] @approx::local_4d [{#uv, #integrated, #rescaled}] DEBUG : Rescaled expanded
  245. 150.71 s gammaloop-nextest-integration> field value
  246. 150.71 s gammaloop-nextest-integration> n_loops 2
  247. 150.71 s gammaloop-nextest-integration> res n-terms: 1, byte size: 982,expr:
  248. 150.71 s gammaloop-nextest-integration> 1/(t²
  249. 150.71 s gammaloop-nextest-integration> ·denom(2,-q₀-q₁,mUVexp²+t²·mass_scalar_1²,
  250. 150.71 s gammaloop-nextest-integration> -mUV²
  251. 150.71 s gammaloop-nextest-integration> +t²
  252. 150.71 s gammaloop-nextest-integration> ·(-mass_scalar_1²-2·(q₀.q₄)/t-2·(q₁.q₄)/t+(q₀.q₀)/t²+2·(q₀.q₁)/t²
  253. 150.71 s gammaloop-nextest-integration> +(q₁.q₁)/t²+(q₄.q₄)
  254. 150.71 s gammaloop-nextest-integration> )
  255. 150.71 s gammaloop-nextest-integration> +t²·mUVexp²
  256. 150.71 s gammaloop-nextest-integration> )
  257. 150.71 s gammaloop-nextest-integration> ·denom(0,q₀,mUVexp²+t²·mass_scalar_1²,-mUV²+t²·(-mass_scalar_1²+(q₀.q₀)/t²)+t²·mUVexp²)
  258. 150.71 s gammaloop-nextest-integration> ·denom(1,q₁,mUVexp²+t²·mass_scalar_1²,-mUV²+t²·(-mass_scalar_1²+(q₁.q₁)/t²)+t²·mUVexp²))
  259. 150.71 s gammaloop-nextest-integration> span t{span_context=true current=subgraph=44, topo_order=1, dod=2 given=subgraph=0, topo_order=0, dod=0}
  260. 150.71 s gammaloop-nextest-integration> [2026-08-28 12:19:30.286] @approx::local_4d [{#uv, #integrated, #series}] DEBUG : Series expanded
  261. 150.71 s gammaloop-nextest-integration> field value
  262. 150.71 s gammaloop-nextest-integration> res n-terms: 4, byte size: 3187,expr:
  263. 150.71 s gammaloop-nextest-integration> -1/2·(2·mUVexp²-2·mass_scalar_1²)
  264. 150.71 s gammaloop-nextest-integration> /(denom(0,q₀,mUVexp²,-mUV²+(q₀.q₀))·denom(1,q₁,mUVexp²,-mUV²+(q₁.q₁))²
  265. 150.71 s gammaloop-nextest-integration> ·denom(2,-q₀-q₁,mUVexp²,-mUV²+(q₀.q₀)+2·(q₀.q₁)+(q₁.q₁)))
  266. 150.71 s gammaloop-nextest-integration> +(-1/2·(2·mUVexp²-2·mass_scalar_1²)
  267. 150.71 s gammaloop-nextest-integration> /(denom(0,q₀,mUVexp²,-mUV²+(q₀.q₀))²
  268. 150.71 s gammaloop-nextest-integration> ·denom(2,-q₀-q₁,mUVexp²,-mUV²+(q₀.q₀)+2·(q₀.q₁)+(q₁.q₁)))
  269. 150.71 s gammaloop-nextest-integration> +(-1/2·(2·mUVexp²-2·mass_scalar_1²+2·(q₄.q₄))
  270. 150.71 s gammaloop-nextest-integration> /denom(2,-q₀-q₁,mUVexp²,-mUV²+(q₀.q₀)+2·(q₀.q₁)+(q₁.q₁))
  271. 150.71 s gammaloop-nextest-integration> +(-2·(q₀.q₄)-2·(q₁.q₄))²
  272. 150.71 s gammaloop-nextest-integration> /denom(2,-q₀-q₁,mUVexp²,-mUV²+(q₀.q₀)+2·(q₀.q₁)+(q₁.q₁))²
  273. 150.71 s gammaloop-nextest-integration> )
  274. 150.71 s gammaloop-nextest-integration> /(denom(0,q₀,mUVexp²,-mUV²+(q₀.q₀))
  275. 150.71 s gammaloop-nextest-integration> ·denom(2,-q₀-q₁,mUVexp²,-mUV²+(q₀.q₀)+2·(q₀.q₁)+(q₁.q₁)))
  276. 150.72 s gammaloop-nextest-integration> )/denom(1,q₁,mUVexp²,-mUV²+(q₁.q₁))
  277. 150.72 s gammaloop-nextest-integration> -(-2·(q₀.q₄)-2·(q₁.q₄))
  278. 150.72 s gammaloop-nextest-integration> /(t·denom(0,q₀,mUVexp²,-mUV²+(q₀.q₀))·denom(1,q₁,mUVexp²,-mUV²+(q₁.q₁))
  279. 150.72 s gammaloop-nextest-integration> ·denom(2,-q₀-q₁,mUVexp²,-mUV²+(q₀.q₀)+2·(q₀.q₁)+(q₁.q₁))²)
  280. 150.72 s gammaloop-nextest-integration> +1/(t²·denom(0,q₀,mUVexp²,-mUV²+(q₀.q₀))·denom(1,q₁,mUVexp²,-mUV²+(q₁.q₁))
  281. 150.72 s gammaloop-nextest-integration> ·denom(2,-q₀-q₁,mUVexp²,-mUV²+(q₀.q₀)+2·(q₀.q₁)+(q₁.q₁)))
  282. 150.72 s gammaloop-nextest-integration> span t{span_context=true current=subgraph=44, topo_order=1, dod=2 given=subgraph=0, topo_order=0, dod=0}
  283. 150.72 s gammaloop-nextest-integration> [2026-08-28 12:19:30.286] @approx::local_4d [{#uv, #integrated, #series}] DEBUG : Evaluated at t = 1
  284. 150.72 s gammaloop-nextest-integration> field value
  285. 150.72 s gammaloop-nextest-integration> res n-terms: 4, byte size: 3171,expr:
  286. 150.72 s gammaloop-nextest-integration> -1/2·(2·mUVexp²-2·mass_scalar_1²)
  287. 150.72 s gammaloop-nextest-integration> /(denom(0,q₀,mUVexp²,-mUV²+(q₀.q₀))·denom(1,q₁,mUVexp²,-mUV²+(q₁.q₁))²
  288. 150.72 s gammaloop-nextest-integration> ·denom(2,-q₀-q₁,mUVexp²,-mUV²+(q₀.q₀)+2·(q₀.q₁)+(q₁.q₁)))
  289. 150.72 s gammaloop-nextest-integration> -(-2·(q₀.q₄)-2·(q₁.q₄))
  290. 150.72 s gammaloop-nextest-integration> /(denom(0,q₀,mUVexp²,-mUV²+(q₀.q₀))·denom(1,q₁,mUVexp²,-mUV²+(q₁.q₁))
  291. 150.72 s gammaloop-nextest-integration> ... omitted 20090 more lines; see full nextest output above
  292. 150.72 s gammaloop-nextest-integration>
  293. 150.72 s gammaloop-nextest-integration> 9. gammaloop-integration-tests::uv::se1l_uv
  294. 150.72 s gammaloop-nextest-integration> failure: test failure with exit code 101
  295. 150.72 s gammaloop-nextest-integration> system-out
  296. 150.72 s gammaloop-nextest-integration> running 1 test
  297. 150.72 s gammaloop-nextest-integration> test se1l_uv has been running for over 60 seconds
  298. 150.72 s gammaloop-nextest-integration> +------+-----------------+---------+--------+----------+-----------------------------------------------------------------------------------------------------------------------+-------+
  299. 150.72 s gammaloop-nextest-integration> | case | check | graph | status | sigma | threshold | error |
  300. 150.72 s gammaloop-nextest-integration> +------+-----------------+---------+--------+----------+-----------------------------------------------------------------------------------------------------------------------+-------+
  301. 150.72 s gammaloop-nextest-integration> | se1l | uv_profile | - | FAIL | - | - | - |
  302. 150.72 s gammaloop-nextest-integration> +------+-----------------+---------+--------+----------+-----------------------------------------------------------------------------------------------------------------------+-------+
  303. 150.72 s gammaloop-nextest-integration> | se1l | m_uv.inspect | inspect | pass | - | best inspect relative delta 1.097e-1 >= 1000*accuracy 1.000e-7 (accuracy=1.000e-10, exponent=+2.0, seed=1, probes=10) | - |
  304. 150.72 s gammaloop-nextest-integration> +------+-----------------+---------+--------+----------+-----------------------------------------------------------------------------------------------------------------------+-------+
  305. 150.72 s gammaloop-nextest-integration> | se1l | m_uv.integrated | se1l | pass | 0.1sigma | compatible within 2sigma | - |
  306. 150.72 s gammaloop-nextest-integration> +------+-----------------+---------+--------+----------+-----------------------------------------------------------------------------------------------------------------------+-------+
  307. 150.72 s gammaloop-nextest-integration> | se1l | rls.inspect | inspect | pass | - | best inspect relative delta 4.499e-2 >= 1000*accuracy 1.000e-7 (accuracy=1.000e-10, exponent=+2.0, seed=1, probes=10) | - |
  308. 150.72 s gammaloop-nextest-integration> +------+-----------------+---------+--------+----------+-----------------------------------------------------------------------------------------------------------------------+-------+
  309. 150.72 s gammaloop-nextest-integration> | se1l | rls.integrated | se1l | pass | 0.0sigma | compatible within 2sigma | - |
  310. 150.72 s gammaloop-nextest-integration> +------+-----------------+---------+--------+----------+-----------------------------------------------------------------------------------------------------------------------+-------+
  311. 150.72 s gammaloop-nextest-integration> | se1l | mu_r.inspect | inspect | pass | - | best inspect relative delta 1.424e-1 >= 1000*accuracy 1.000e-7 (accuracy=1.000e-10, exponent=+2.0, seed=1, probes=10) | - |
  312. 150.72 s gammaloop-nextest-integration> +------+-----------------+---------+--------+----------+-----------------------------------------------------------------------------------------------------------------------+-------+
  313. 150.72 s gammaloop-nextest-integration> | se1l | target | - | pass | - | 2sigma | - |
  314. 150.72 s gammaloop-nextest-integration> +------+-----------------+---------+--------+----------+-----------------------------------------------------------------------------------------------------------------------+-------+
  315. 150.72 s gammaloop-nextest-integration> test se1l_uv ... FAILED
  316. 150.72 s gammaloop-nextest-integration>
  317. 150.72 s gammaloop-nextest-integration> failures:
  318. 150.72 s gammaloop-nextest-integration>
  319. 150.72 s gammaloop-nextest-integration> failures:
  320. 150.72 s gammaloop-nextest-integration> se1l_uv
  321. 150.72 s gammaloop-nextest-integration>
  322. 150.72 s gammaloop-nextest-integration> test result: FAILED. 0 passed; 1 failed; 0 ignored; 0 measured; 24 filtered out; finished in 113.51s
  323. 150.72 s gammaloop-nextest-integration> system-err
  324. 150.72 s gammaloop-nextest-integration> [2026-08-28 12:19:29.856] @gammaloop_api::se... INFO : Running command run generate
  325. 150.72 s gammaloop-nextest-integration> [2026-08-28 12:19:29.856] @gammaloop_api::se... INFO : Starting command block generate
  326. 150.72 s gammaloop-nextest-integration> [2026-08-28 12:19:29.856] @gammaloop_api::se... INFO : Running command import model sm-default
  327. 150.72 s gammaloop-nextest-integration> [2026-08-28 12:19:29.856] @import::model INFO : Loading built-in JSON model sm-default
  328. 150.72 s gammaloop-nextest-integration> [2026-08-28 12:19:29.912] @gammalooprs::model INFO : The following 11 external parameters were forced to zero by the restriction card:
  329. 150.72 s gammaloop-nextest-integration> lamWS, AWS, rhoWS, etaWS, ymc, yme, ymm, MC, Me, MM, WTau
  330. 150.72 s gammaloop-nextest-integration> [2026-08-28 12:19:29.912] @gammalooprs::model INFO : The following 34 vertex rules were removed by the restriction card:
  331. 150.72 s gammaloop-nextest-integration> V_82 -> (c~, d, G+) | V_83 -> (t~, d, G+) | V_84 -> (c~, s, G+) | V_85 -> (t~, s, G+) | V_86 -> (u~, b, G+) | V_87 -> (c~, b, G+) | V_90 -> (c~, d, W+) | V_91 -> (t~, d, W+) | V_92 -> (u~, s, W+) | V_94 -> (t~, s, W+) | V_95 -> (u~, b, W+) | V_96 -> (c~, b, W+) | V_101 -> (e+, e-, G0) | V_102 -> (mu+, mu-, G0) | V_104 -> (e+, e-, H) | V_105 -> (mu+, mu-, H) | V_110 -> (ve~, e-, G+) | V_111 -> (vm~, mu-, G+) | V_116 -> (b~, u, G-) | V_117 -> (d~, c, G-) | V_118 -> (s~, c, G-) | V_119 -> (b~, c, G-) | V_120 -> (d~, t, G-) | V_121 -> (s~, t, G-) | V_124 -> (s~, u, W-) | V_125 -> (b~, u, W-) | V_126 -> (d~, c, W-) | V_128 -> (b~, c, W-) | V_129 -> (d~, t, W-) | V_130 -> (s~, t, W-) | V_138 -> (c~, c, G0) | V_140 -> (c~, c, H) | V_145 -> (e+, ve, G-) | V_146 -> (mu+, vm, G-)
  332. 150.72 s gammaloop-nextest-integration> [2026-08-28 12:19:29.912] @gammalooprs::model INFO : The following 36 couplings were removed by the restriction card:
  333. 150.72 s gammaloop-nextest-integration> GC_13, GC_14, GC_16, GC_17, GC_18, GC_19, GC_20, GC_22, GC_23, GC_24, GC_25, GC_26, GC_28, GC_29, GC_42, GC_43, GC_44, GC_46, GC_47, GC_48, GC_84, GC_85, GC_86, GC_87, GC_88, GC_89, GC_90, GC_91, GC_92, GC_93, GC_101, GC_102, GC_103, GC_105, GC_106, GC_107
  334. 150.72 s gammaloop-nextest-integration> [2026-08-28 12:19:29.913] @gammaloop_api::se... INFO : Running command remove processes
  335. 150.72 s gammaloop-nextest-integration> [2026-08-28 12:19:29.916] @gammaloop_api::se... INFO : Running command set global kv global.generation.uv.generate_integrated=true
  336. 150.72 s gammaloop-nextest-integration> [2026-08-28 12:19:29.917] @gammaloop_api::se... INFO : Running command import graphs ./tests/resources/graphs/uv_tests/se1l.dot -p se1l -i se1l
  337. 150.72 s gammaloop-nextest-integration> [2026-08-28 12:19:29.917] @commands::import INFO : Loading graphs from '/build/source/tests/resources/graphs/uv_tests/se1l.dot'
  338. 150.72 s gammaloop-nextest-integration> [2026-08-28 12:19:29.922] @gammaloop_api::se... INFO : Running command generate existing -p se1l -i se1l
  339. 150.72 s gammaloop-nextest-integration> [2026-08-28 12:19:31.145] @commands::generate INFO :
  340. 150.72 s gammaloop-nextest-integration> Integrand generation summary
  341. 150.72 s gammaloop-nextest-integration> peak RAM 75.04 MiB | cores 1
  342. 150.72 s gammaloop-nextest-integration> ╭───────────┬───────┬─────────┬─────────────┬─────────────┬────────────────┬─────────────╮
  343. 150.72 s gammaloop-nextest-integration> │ integrand │ graph │ # evals │ expr build │ spenso │ symbolica eval │ compile │
  344. 150.72 s gammaloop-nextest-integration> ├───────────┼───────┼─────────┼─────────────┼─────────────┼────────────────┼─────────────┤
  345. 150.72 s gammaloop-nextest-integration> │ se1l │ se1l │ 5 │ 1.09s (90%) │ 44ms (3.7%) │ 73ms (6.1%) │ 0ms (0.00%) │
  346. 150.72 s gammaloop-nextest-integration> ├───────────┼───────┼─────────┼─────────────┼─────────────┼────────────────┼─────────────┤
  347. 150.72 s gammaloop-nextest-integration> │ Total │ │ 5 │ 1.09s (90%) │ 44ms (3.7%) │ 73ms (6.1%) │ 0ms (0.00%) │
  348. 150.72 s gammaloop-nextest-integration> ╰───────────┴───────┴─────────┴─────────────┴─────────────┴────────────────┴─────────────╯
  349. 150.72 s gammaloop-nextest-integration> [2026-08-28 12:19:31.146] @gammaloop_api::se... INFO : Running command set process -p se1l -i se1l kv general.m_uv=0.2
  350. 150.72 s gammaloop-nextest-integration> [2026-08-28 12:19:31.147] @gammaloop_api::se... INFO : Running command set process -p se1l -i se1l kv general.mu_r=0.2
  351. 150.72 s gammaloop-nextest-integration> [2026-08-28 12:19:31.148] @gammaloop_api::se... INFO : Running command set process -p se1l -i se1l kv general.renormalization_localization_scale=0.2
  352. 150.72 s gammaloop-nextest-integration> [2026-08-28 12:19:31.149] @gammaloop_api::se... INFO : Running command duplicate integrand -p se1l -i se1l --output_process_name se1l --output_integrand_name se1l_muv_shifted
  353. 150.72 s gammaloop-nextest-integration> [2026-08-28 12:19:31.151] @gammaloop_api::se... INFO : Running command set process -p se1l -i se1l_muv_shifted kv general.m_uv=0.5
  354. 150.72 s gammaloop-nextest-integration> [2026-08-28 12:19:31.152] @gammaloop_api::se... INFO : Running command duplicate integrand -p se1l -i se1l --output_process_name se1l --output_integrand_name se1l_rls_shifted
  355. 150.72 s gammaloop-nextest-integration> [2026-08-28 12:19:31.154] @gammaloop_api::se... INFO : Running command set process -p se1l -i se1l_rls_shifted kv general.renormalization_localization_scale=1
  356. 150.72 s gammaloop-nextest-integration> [2026-08-28 12:19:31.155] @gammaloop_api::se... INFO : Running command duplicate integrand -p se1l -i se1l --output_process_name se1l --output_integrand_name se1l_mur_shifted
  357. 150.72 s gammaloop-nextest-integration> [2026-08-28 12:19:31.157] @gammaloop_api::se... INFO : Running command set process -p se1l -i se1l_mur_shifted kv general.mu_r=0.8
  358. 150.72 s gammaloop-nextest-integration> [2026-08-28 12:19:31.162] @process::amplitude WARNING : External state 0 ('g', PDG 21, helicity +) is off shell: p^2 = +2.5e5, expected m^2 = +0e0 (|Δ| = +2.5e5). Fixed-helicity spinor/vector/tensor external states may be ill-defined at this kinematic point.
  359. 150.72 s gammaloop-nextest-integration> field value
  360. 150.72 s gammaloop-nextest-integration> span warm_up{integrand.name=se1l}
  361. 150.72 s gammaloop-nextest-integration> [2026-08-28 12:19:31.162] @process::amplitude WARNING : External state 1 ('g', PDG 21, helicity -) is off shell: p^2 = +2.5e5, expected m^2 = +0e0 (|Δ| = +2.5e5). Fixed-helicity spinor/vector/tensor external states may be ill-defined at this kinematic point.
  362. 150.72 s gammaloop-nextest-integration> field value
  363. 150.72 s gammaloop-nextest-integration> span warm_up{integrand.name=se1l}
  364. 150.72 s gammaloop-nextest-integration> [2026-08-28 12:19:31.163] @process::amplitude INFO : Input is above threshold: 1 existing threshold E-surfaces across 1/1 graph groups
  365. 150.72 s gammaloop-nextest-integration> field value
  366. 150.72 s gammaloop-nextest-integration> existing_esurfaces 1
  367. 150.72 s gammaloop-nextest-integration> group_count 1
  368. 150.72 s gammaloop-nextest-integration> groups_above_threshold 1
  369. 150.72 s gammaloop-nextest-integration> integrand se1l
  370. 150.72 s gammaloop-nextest-integration> span warm_up{integrand.name=se1l}
  371. 150.72 s gammaloop-nextest-integration> threshold_status above threshold
  372. 150.72 s gammaloop-nextest-integration> [2026-08-28 12:19:31.163] @process::amplitude INFO : overlap structure of group 0: [1: [0(2,3)]]
  373. 150.72 s gammaloop-nextest-integration> field value
  374. 150.72 s gammaloop-nextest-integration> span warm_up{integrand.name=se1l}
  375. 150.72 s gammaloop-nextest-integration> [2026-08-28 12:19:31.434] @commands::profile INFO :
  376. 150.72 s gammaloop-nextest-integration> ╭───────┬──────┬──────────┬───────┬─────┬──────────┬───────────╮
  377. 150.72 s gammaloop-nextest-integration> │ fixed │ → ∞ │ slope │ r2 │ DOD │ bare DOD │ inspect │
  378. 150.72 s gammaloop-nextest-integration> ├───────┼──────┼──────────┼───────┼─────┼──────────┼───────────┤
  379. 150.72 s gammaloop-nextest-integration> │ {} │ {e3} │ 1.639236 │ 0.904 │ 2 │ 2 │ arb retry │
  380. 150.72 s gammaloop-nextest-integration> │ {} │ {e2} │ 1.698834 │ 0.902 │ 2 │ 2 │ arb retry │
  381. 150.72 s gammaloop-nextest-integration> ╰───────┴──────┴──────────┴───────┴─────┴──────────┴───────────╯
  382. 150.72 s gammaloop-nextest-integration> [2026-08-28 12:19:31.434] @commands::profile INFO :
  383. 150.72 s gammaloop-nextest-integration> ╭───────┬──────┬─────────────┬──────────┬───────┬─────┬──────────┬───────────╮
  384. 150.72 s gammaloop-nextest-integration> │ fixed │ → ∞ │ orientation │ slope │ r2 │ DOD │ bare DOD │ inspect │
  385. 150.72 s gammaloop-nextest-integration> ├───────┼──────┼─────────────┼──────────┼───────┼─────┼──────────┼───────────┤
  386. 150.72 s gammaloop-nextest-integration> │ {} │ {e3} │ 00-+ │ 0.343429 │ 0.145 │ 0 │ 2 │ arb retry │
  387. 150.72 s gammaloop-nextest-integration> │ {} │ {e3} │ 00+- │ 0.342577 │ 0.135 │ 0 │ 2 │ arb retry │
  388. 150.72 s gammaloop-nextest-integration> │ {} │ {e2} │ 00-+ │ 0.385975 │ 0.161 │ 0 │ 2 │ arb retry │
  389. 150.72 s gammaloop-nextest-integration> │ {} │ {e2} │ 00+- │ 0.384920 │ 0.192 │ 0 │ 2 │ arb retry │
  390. 150.72 s gammaloop-nextest-integration> ╰───────┴──────┴─────────────┴──────────┴───────┴─────┴──────────┴───────────╯
  391. 150.72 s gammaloop-nextest-integration> [2026-08-28 12:19:31.435] @gammaloop_api::se... INFO : Running command set process kv integrator.target_relative_accuracy=0.001 integrator.n_increase=0 integrator.n_start=50000 integrator.n_max=400000 integrator.seed=1337
  392. 150.72 s gammaloop-nextest-integration> [2026-08-28 12:19:31.436] @commands::integrate INFO : Created workspace directory at /build/source/tests/artifacts/se1l/integration_workspace_se1l
  393. 150.72 s gammaloop-nextest-integration> [2026-08-28 12:19:31.461] @commands::integrate INFO : No integration state found, starting new integration
  394. 150.72 s gammaloop-nextest-integration> [2026-08-28 12:19:31.461] @commands::integrate INFO : Gammaloop now integrates se1l@se1l, se1l@se1l_muv_shifted, se1l@se1l_rls_shifted
  395. 150.72 s gammaloop-nextest-integration> [2026-08-28 12:19:31.462] @process::amplitude WARNING : External state 0 ('g', PDG 21, helicity +) is off shell: p^2 = +2.5e5, expected m^2 = +0e0 (|Δ| = +2.5e5). Fixed-helicity spinor/vector/tensor external states may be ill-defined at this kinematic point.
  396. 150.72 s gammaloop-nextest-integration> field value
  397. 150.72 s gammaloop-nextest-integration> span warm_up{integrand.name=se1l}
  398. 150.72 s gammaloop-nextest-integration> [2026-08-28 12:19:31.462] @process::amplitude WARNING : External state 1 ('g', PDG 21, helicity -) is off shell: p^2 = +2.5e5, expected m^2 = +0e0 (|Δ| = +2.5e5). Fixed-helicity spinor/vector/tensor external states may be ill-defined at this kinematic point.
  399. 150.72 s gammaloop-nextest-integration> field value
  400. 150.72 s gammaloop-nextest-integration> span warm_up{integrand.name=se1l}
  401. 150.72 s gammaloop-nextest-integration> [2026-08-28 12:19:31.462] @process::amplitude INFO : Input is above threshold: 1 existing threshold E-surfaces across 1/1 graph groups
  402. 150.72 s gammaloop-nextest-integration> field value
  403. 150.72 s gammaloop-nextest-integration> existing_esurfaces 1
  404. 150.72 s gammaloop-nextest-integration> group_count 1
  405. 150.72 s gammaloop-nextest-integration> groups_above_threshold 1
  406. 150.72 s gammaloop-nextest-integration> integrand se1l
  407. 150.72 s gammaloop-nextest-integration> span warm_up{integrand.name=se1l}
  408. 150.72 s gammaloop-nextest-integration> threshold_status above threshold
  409. 150.72 s gammaloop-nextest-integration> [2026-08-28 12:19:31.462] @process::amplitude INFO : overlap structure of group 0: [1: [0(2,3)]]
  410. 150.72 s gammaloop-nextest-integration> field value
  411. 150.72 s gammaloop-nextest-integration> span warm_up{integrand.name=se1l}
  412. 150.72 s gammaloop-nextest-integration> [2026-08-28 12:19:31.463] @process::amplitude WARNING : External state 0 ('g', PDG 21, helicity +) is off shell: p^2 = +2.5e5, expected m^2 = +0e0 (|Δ| = +2.5e5). Fixed-helicity spinor/vector/tensor external states may be ill-defined at this kinematic point.
  413. 150.72 s gammaloop-nextest-integration> field value
  414. 150.72 s gammaloop-nextest-integration> span warm_up{integrand.name=se1l_muv_shifted}
  415. 150.72 s gammaloop-nextest-integration> [2026-08-28 12:19:31.463] @process::amplitude WARNING : External state 1 ('g', PDG 21, helicity -) is off shell: p^2 = +2.5e5, expected m^2 = +0e0 (|Δ| = +2.5e5). Fixed-helicity spinor/vector/tensor external states may be ill-defined at this kinematic point.
  416. 150.72 s gammaloop-nextest-integration> field value
  417. 150.72 s gammaloop-nextest-integration> span warm_up{integrand.name=se1l_muv_shifted}
  418. 150.72 s gammaloop-nextest-integration> [2026-08-28 12:19:31.464] @process::amplitude INFO : Input is above threshold: 1 existing threshold E-surfaces across 1/1 graph groups
  419. 150.72 s gammaloop-nextest-integration> field value
  420. 150.72 s gammaloop-nextest-integration> existing_esurfaces 1
  421. 150.72 s gammaloop-nextest-integration> group_count 1
  422. 150.72 s gammaloop-nextest-integration> groups_above_threshold 1
  423. 150.72 s gammaloop-nextest-integration> integrand se1l_muv_shifted
  424. 150.72 s gammaloop-nextest-integration> span warm_up{integrand.name=se1l_muv_shifted}
  425. 150.72 s gammaloop-nextest-integration> threshold_status above threshold
  426. 150.72 s gammaloop-nextest-integration> [2026-08-28 12:19:31.464] @process::amplitude INFO : overlap structure of group 0: [1: [0(2,3)]]
  427. 150.72 s gammaloop-nextest-integration> field value
  428. 150.72 s gammaloop-nextest-integration> span warm_up{integrand.name=se1l_muv_shifted}
  429. 150.72 s gammaloop-nextest-integration> [2026-08-28 12:19:31.465] @process::amplitude WARNING : External state 0 ('g', PDG 21, helicity +) is off shell: p^2 = +2.5e5, expected m^2 = +0e0 (|Δ| = +2.5e5). Fixed-helicity spinor/vector/tensor external states may be ill-defined at this kinematic point.
  430. 150.72 s gammaloop-nextest-integration> field value
  431. 150.72 s gammaloop-nextest-integration> span warm_up{integrand.name=se1l_rls_shifted}
  432. 150.72 s gammaloop-nextest-integration> [2026-08-28 12:19:31.465] @process::amplitude WARNING : External state 1 ('g', PDG 21, helicity -) is off shell: p^2 = +2.5e5, expected m^2 = +0e0 (|Δ| = +2.5e5). Fixed-helicity spinor/vector/tensor external states may be ill-defined at this kinematic point.
  433. 150.72 s gammaloop-nextest-integration> field value
  434. 150.72 s gammaloop-nextest-integration> span warm_up{integrand.name=se1l_rls_shifted}
  435. 150.72 s gammaloop-nextest-integration> [2026-08-28 12:19:31.466] @process::amplitude INFO : Input is above threshold: 1 existing threshold E-surfaces across 1/1 graph groups
  436. 150.72 s gammaloop-nextest-integration> field value
  437. 150.72 s gammaloop-nextest-integration> existing_esurfaces 1
  438. 150.72 s gammaloop-nextest-integration> group_count 1
  439. 150.72 s gammaloop-nextest-integration> groups_above_threshold 1
  440. 150.72 s gammaloop-nextest-integration> integrand se1l_rls_shifted
  441. 150.72 s gammaloop-nextest-integration> span warm_up{integrand.name=se1l_rls_shifted}
  442. 150.72 s gammaloop-nextest-integration> threshold_status above threshold
  443. 150.72 s gammaloop-nextest-integration> ... omitted 1410 more lines; see full nextest output above
  444. 150.72 s gammaloop-nextest-integration> =========================================
  445. 151.15 s error: Cannot build '/nix/store/ifx25i75mrp4mx011vk3kpahjasmfqfi-gammaloop-nextest-integration.drv'.
  446. 151.15 s Reason: builder failed with exit code 100.
  447. 151.15 s Output paths:
  448. 151.15 s /nix/store/zp6pznmk8m5zpqbw5hmcyg91mpp8x0kf-gammaloop-nextest-integration
  449. 151.15 s Last 2048 log lines:
  450. 151.15 s > span warm_up{integrand.name=se1l_muv_shifted}
  451. 151.15 s > threshold_status above threshold
  452. 151.15 s > [2026-08-28 12:21:22.859] @process::amplitude INFO : overlap structure of group 0: [1: [0(2,3)]]
  453. 151.15 s > field value
  454. 151.15 s > span warm_up{integrand.name=se1l_muv_shifted}
  455. 151.15 s > [2026-08-28 12:21:22.863] @process::amplitude WARNING : External state 0 ('g', PDG 21, helicity +) is off shell: p^2 = +2.5e5, expected m^2 = +0e0 (|Δ| = +2.5e5). Fixed-helicity spinor/vector/tensor external states may be ill-defined at this kinematic point.
  456. 151.15 s > field value
  457. 151.15 s > span warm_up{integrand.name=se1l}
  458. 151.15 s > [2026-08-28 12:21:22.863] @process::amplitude WARNING : External state 1 ('g', PDG 21, helicity -) is off shell: p^2 = +2.5e5, expected m^2 = +0e0 (|Δ| = +2.5e5). Fixed-helicity spinor/vector/tensor external states may be ill-defined at this kinematic point.
  459. 151.15 s > field value
  460. 151.15 s > span warm_up{integrand.name=se1l}
  461. 151.15 s > [2026-08-28 12:21:22.863] @process::amplitude INFO : Input is above threshold: 1 existing threshold E-surfaces across 1/1 graph groups
  462. 151.15 s > field value
  463. 151.15 s > existing_esurfaces 1
  464. 151.15 s > group_count 1
  465. 151.15 s > groups_above_threshold 1
  466. 151.15 s > integrand se1l
  467. 151.15 s > span warm_up{integrand.name=se1l}
  468. 151.15 s > threshold_status above threshold
  469. 151.15 s > [2026-08-28 12:21:22.863] @process::amplitude INFO : overlap structure of group 0: [1: [0(2,3)]]
  470. 151.15 s > field value
  471. 151.15 s > span warm_up{integrand.name=se1l}
  472. 151.15 s > [2026-08-28 12:21:22.867] @process::amplitude WARNING : External state 0 ('g', PDG 21, helicity +) is off shell: p^2 = +2.5e5, expected m^2 = +0e0 (|Δ| = +2.5e5). Fixed-helicity spinor/vector/tensor external states may be ill-defined at this kinematic point.
  473. 151.15 s > field value
  474. 151.15 s > span warm_up{integrand.name=se1l_muv_shifted}
  475. 151.15 s > [2026-08-28 12:21:22.867] @process::amplitude WARNING : External state 1 ('g', PDG 21, helicity -) is off shell: p^2 = +2.5e5, expected m^2 = +0e0 (|Δ| = +2.5e5). Fixed-helicity spinor/vector/tensor external states may be ill-defined at this kinematic point.
  476. 151.15 s > field value
  477. 151.15 s > span warm_up{integrand.name=se1l_muv_shifted}
  478. 151.15 s > [2026-08-28 12:21:22.867] @process::amplitude INFO : Input is above threshold: 1 existing threshold E-surfaces across 1/1 graph groups
  479. 151.15 s > field value
  480. 151.15 s > existing_esurfaces 1
  481. 151.15 s > group_count 1
  482. 151.15 s > groups_above_threshold 1
  483. 151.15 s > integrand se1l_muv_shifted
  484. 151.15 s > span warm_up{integrand.name=se1l_muv_shifted}
  485. 151.15 s > threshold_status above threshold
  486. 151.15 s > [2026-08-28 12:21:22.867] @process::amplitude INFO : overlap structure of group 0: [1: [0(2,3)]]
  487. 151.15 s > field value
  488. 151.15 s > span warm_up{integrand.name=se1l_muv_shifted}
  489. 151.15 s > [2026-08-28 12:21:22.871] @process::amplitude WARNING : External state 0 ('g', PDG 21, helicity +) is off shell: p^2 = +2.5e5, expected m^2 = +0e0 (|Δ| = +2.5e5). Fixed-helicity spinor/vector/tensor external states may be ill-defined at this kinematic point.
  490. 151.15 s > field value
  491. 151.15 s > span warm_up{integrand.name=se1l}
  492. 151.15 s > [2026-08-28 12:21:22.871] @process::amplitude WARNING : External state 1 ('g', PDG 21, helicity -) is off shell: p^2 = +2.5e5, expected m^2 = +0e0 (|Δ| = +2.5e5). Fixed-helicity spinor/vector/tensor external states may be ill-defined at this kinematic point.
  493. 151.15 s > field value
  494. 151.15 s > span warm_up{integrand.name=se1l}
  495. 151.15 s > [2026-08-28 12:21:22.871] @process::amplitude INFO : Input is above threshold: 1 existing threshold E-surfaces across 1/1 graph groups
  496. 151.15 s > field value
  497. 151.15 s > existing_esurfaces 1
  498. 151.15 s > group_count 1
  499. 151.15 s > groups_above_threshold 1
  500. 151.15 s > integrand se1l
  501. 151.15 s > span warm_up{integrand.name=se1l}
  502. 151.15 s > threshold_status above threshold
  503. 151.15 s > [2026-08-28 12:21:22.871] @process::amplitude INFO : overlap structure of group 0: [1: [0(2,3)]]
  504. 151.15 s > field value
  505. 151.15 s > span warm_up{integrand.name=se1l}
  506. 151.15 s > [2026-08-28 12:21:22.875] @process::amplitude WARNING : External state 0 ('g', PDG 21, helicity +) is off shell: p^2 = +2.5e5, expected m^2 = +0e0 (|Δ| = +2.5e5). Fixed-helicity spinor/vector/tensor external states may be ill-defined at this kinematic point.
  507. 151.15 s > field value
  508. 151.15 s > span warm_up{integrand.name=se1l_muv_shifted}
  509. 151.15 s > [2026-08-28 12:21:22.875] @process::amplitude WARNING : External state 1 ('g', PDG 21, helicity -) is off shell: p^2 = +2.5e5, expected m^2 = +0e0 (|Δ| = +2.5e5). Fixed-helicity spinor/vector/tensor external states may be ill-defined at this kinematic point.
  510. 151.15 s > field value
  511. 151.15 s > span warm_up{integrand.name=se1l_muv_shifted}
  512. 151.15 s > [2026-08-28 12:21:22.876] @process::amplitude INFO : Input is above threshold: 1 existing threshold E-surfaces across 1/1 graph groups
  513. 151.15 s > field value
  514. 151.15 s > existing_esurfaces 1
  515. 151.15 s > group_count 1
  516. 151.15 s > groups_above_threshold 1
  517. 151.15 s > integrand se1l_muv_shifted
  518. 151.15 s > span warm_up{integrand.name=se1l_muv_shifted}
  519. 151.15 s > threshold_status above threshold
  520. 151.15 s > [2026-08-28 12:21:22.876] @process::amplitude INFO : overlap structure of group 0: [1: [0(2,3)]]
  521. 151.15 s > field value
  522. 151.15 s > span warm_up{integrand.name=se1l_muv_shifted}
  523. 151.15 s > [2026-08-28 12:21:22.880] @process::amplitude WARNING : External state 0 ('g', PDG 21, helicity +) is off shell: p^2 = +2.5e5, expected m^2 = +0e0 (|Δ| = +2.5e5). Fixed-helicity spinor/vector/tensor external states may be ill-defined at this kinematic point.
  524. 151.15 s > field value
  525. 151.15 s > span warm_up{integrand.name=se1l}
  526. 151.15 s > [2026-08-28 12:21:22.880] @process::amplitude WARNING : External state 1 ('g', PDG 21, helicity -) is off shell: p^2 = +2.5e5, expected m^2 = +0e0 (|Δ| = +2.5e5). Fixed-helicity spinor/vector/tensor external states may be ill-defined at this kinematic point.
  527. 151.15 s > field value
  528. 151.15 s > span warm_up{integrand.name=se1l}
  529. 151.15 s > [2026-08-28 12:21:22.880] @process::amplitude INFO : Input is above threshold: 1 existing threshold E-surfaces across 1/1 graph groups
  530. 151.15 s > field value
  531. 151.15 s > existing_esurfaces 1
  532. 151.15 s > group_count 1
  533. 151.15 s > groups_above_threshold 1
  534. 151.15 s > integrand se1l
  535. 151.15 s > span warm_up{integrand.name=se1l}
  536. 151.15 s > threshold_status above threshold
  537. 151.15 s > [2026-08-28 12:21:22.880] @process::amplitude INFO : overlap structure of group 0: [1: [0(2,3)]]
  538. 151.15 s > field value
  539. 151.15 s > span warm_up{integrand.name=se1l}
  540. 151.15 s > [2026-08-28 12:21:22.884] @process::amplitude WARNING : External state 0 ('g', PDG 21, helicity +) is off shell: p^2 = +2.5e5, expected m^2 = +0e0 (|Δ| = +2.5e5). Fixed-helicity spinor/vector/tensor external states may be ill-defined at this kinematic point.
  541. 151.15 s > field value
  542. 151.15 s > span warm_up{integrand.name=se1l_muv_shifted}
  543. 151.15 s > [2026-08-28 12:21:22.884] @process::amplitude WARNING : External state 1 ('g', PDG 21, helicity -) is off shell: p^2 = +2.5e5, expected m^2 = +0e0 (|Δ| = +2.5e5). Fixed-helicity spinor/vector/tensor external states may be ill-defined at this kinematic point.
  544. 151.15 s > field value
  545. 151.15 s > span warm_up{integrand.name=se1l_muv_shifted}
  546. 151.15 s > [2026-08-28 12:21:22.884] @process::amplitude INFO : Input is above threshold: 1 existing threshold E-surfaces across 1/1 graph groups
  547. 151.15 s > field value
  548. 151.15 s > existing_esurfaces 1
  549. 151.15 s > group_count 1
  550. 151.15 s > groups_above_threshold 1
  551. 151.15 s > integrand se1l_muv_shifted
  552. 151.15 s > span warm_up{integrand.name=se1l_muv_shifted}
  553. 151.15 s > threshold_status above threshold
  554. 151.15 s > [2026-08-28 12:21:22.884] @process::amplitude INFO : overlap structure of group 0: [1: [0(2,3)]]
  555. 151.15 s > field value
  556. 151.15 s > span warm_up{integrand.name=se1l_muv_shifted}
  557. 151.15 s > [2026-08-28 12:21:22.888] @process::amplitude WARNING : External state 0 ('g', PDG 21, helicity +) is off shell: p^2 = +2.5e5, expected m^2 = +0e0 (|Δ| = +2.5e5). Fixed-helicity spinor/vector/tensor external states may be ill-defined at this kinematic point.
  558. 151.15 s > field value
  559. 151.15 s > span warm_up{integrand.name=se1l}
  560. 151.15 s > [2026-08-28 12:21:22.888] @process::amplitude WARNING : External state 1 ('g', PDG 21, helicity -) is off shell: p^2 = +2.5e5, expected m^2 = +0e0 (|Δ| = +2.5e5). Fixed-helicity spinor/vector/tensor external states may be ill-defined at this kinematic point.
  561. 151.15 s > field value
  562. 151.15 s > span warm_up{integrand.name=se1l}
  563. 151.15 s > [2026-08-28 12:21:22.889] @process::amplitude INFO : Input is above threshold: 1 existing threshold E-surfaces across 1/1 graph groups
  564. 151.15 s > field value
  565. 151.15 s > existing_esurfaces 1
  566. 151.15 s > group_count 1
  567. 151.15 s > groups_above_threshold 1
  568. 151.15 s > integrand se1l
  569. 151.15 s > span warm_up{integrand.name=se1l}
  570. 151.15 s > threshold_status above threshold
  571. 151.15 s > [2026-08-28 12:21:22.889] @process::amplitude INFO : overlap structure of group 0: [1: [0(2,3)]]
  572. 151.15 s > field value
  573. 151.15 s > span warm_up{integrand.name=se1l}
  574. 151.15 s > [2026-08-28 12:21:22.893] @process::amplitude WARNING : External state 0 ('g', PDG 21, helicity +) is off shell: p^2 = +2.5e5, expected m^2 = +0e0 (|Δ| = +2.5e5). Fixed-helicity spinor/vector/tensor external states may be ill-defined at this kinematic point.
  575. 151.15 s > field value
  576. 151.15 s > span warm_up{integrand.name=se1l_rls_shifted}
  577. 151.15 s > [2026-08-28 12:21:22.893] @process::amplitude WARNING : External state 1 ('g', PDG 21, helicity -) is off shell: p^2 = +2.5e5, expected m^2 = +0e0 (|Δ| = +2.5e5). Fixed-helicity spinor/vector/tensor external states may be ill-defined at this kinematic point.
  578. 151.15 s > field value
  579. 151.15 s > span warm_up{integrand.name=se1l_rls_shifted}
  580. 151.15 s > [2026-08-28 12:21:22.893] @process::amplitude INFO : Input is above threshold: 1 existing threshold E-surfaces across 1/1 graph groups
  581. 151.15 s > field value
  582. 151.15 s > existing_esurfaces 1
  583. 151.15 s > group_count 1
  584. 151.15 s > groups_above_threshold 1
  585. 151.15 s > integrand se1l_rls_shifted
  586. 151.15 s > span warm_up{integrand.name=se1l_rls_shifted}
  587. 151.15 s > threshold_status above threshold
  588. 151.15 s > [2026-08-28 12:21:22.893] @process::amplitude INFO : overlap structure of group 0: [1: [0(2,3)]]
  589. 151.15 s > field value
  590. 151.15 s > span warm_up{integrand.name=se1l_rls_shifted}
  591. 151.15 s > [2026-08-28 12:21:22.897] @process::amplitude WARNING : External state 0 ('g', PDG 21, helicity +) is off shell: p^2 = +2.5e5, expected m^2 = +0e0 (|Δ| = +2.5e5). Fixed-helicity spinor/vector/tensor external states may be ill-defined at this kinematic point.
  592. 151.15 s > field value
  593. 151.15 s > span warm_up{integrand.name=se1l}
  594. 151.15 s > [2026-08-28 12:21:22.897] @process::amplitude WARNING : External state 1 ('g', PDG 21, helicity -) is off shell: p^2 = +2.5e5, expected m^2 = +0e0 (|Δ| = +2.5e5). Fixed-helicity spinor/vector/tensor external states may be ill-defined at this kinematic point.
  595. 151.15 s > field value
  596. 151.15 s > span warm_up{integrand.name=se1l}
  597. 151.15 s > [2026-08-28 12:21:22.897] @process::amplitude INFO : Input is above threshold: 1 existing threshold E-surfaces across 1/1 graph groups
  598. 151.15 s > field value
  599. 151.15 s > existing_esurfaces 1
  600. 151.15 s > group_count 1
  601. 151.15 s > groups_above_threshold 1
  602. 151.15 s > integrand se1l
  603. 151.15 s > span warm_up{integrand.name=se1l}
  604. 151.15 s > threshold_status above threshold
  605. 151.15 s > [2026-08-28 12:21:22.897] @process::amplitude INFO : overlap structure of group 0: [1: [0(2,3)]]
  606. 151.15 s > field value
  607. 151.15 s > span warm_up{integrand.name=se1l}
  608. 151.15 s > [2026-08-28 12:21:22.901] @process::amplitude WARNING : External state 0 ('g', PDG 21, helicity +) is off shell: p^2 = +2.5e5, expected m^2 = +0e0 (|Δ| = +2.5e5). Fixed-helicity spinor/vector/tensor external states may be ill-defined at this kinematic point.
  609. 151.15 s > field value
  610. 151.15 s > span warm_up{integrand.name=se1l_rls_shifted}
  611. 151.15 s > [2026-08-28 12:21:22.901] @process::amplitude WARNING : External state 1 ('g', PDG 21, helicity -) is off shell: p^2 = +2.5e5, expected m^2 = +0e0 (|Δ| = +2.5e5). Fixed-helicity spinor/vector/tensor external states may be ill-defined at this kinematic point.
  612. 151.15 s > field value
  613. 151.15 s > span warm_up{integrand.name=se1l_rls_shifted}
  614. 151.15 s > [2026-08-28 12:21:22.901] @process::amplitude INFO : Input is above threshold: 1 existing threshold E-surfaces across 1/1 graph groups
  615. 151.15 s > field value
  616. 151.15 s > existing_esurfaces 1
  617. 151.15 s > group_count 1
  618. 151.15 s > groups_above_threshold 1
  619. 151.15 s > integrand se1l_rls_shifted
  620. 151.15 s > span warm_up{integrand.name=se1l_rls_shifted}
  621. 151.15 s > threshold_status above threshold
  622. 151.15 s > [2026-08-28 12:21:22.901] @process::amplitude INFO : overlap structure of group 0: [1: [0(2,3)]]
  623. 151.15 s > field value
  624. 151.15 s > span warm_up{integrand.name=se1l_rls_shifted}
  625. 151.15 s > [2026-08-28 12:21:22.905] @process::amplitude WARNING : External state 0 ('g', PDG 21, helicity +) is off shell: p^2 = +2.5e5, expected m^2 = +0e0 (|Δ| = +2.5e5). Fixed-helicity spinor/vector/tensor external states may be ill-defined at this kinematic point.
  626. 151.15 s > field value
  627. 151.15 s > span warm_up{integrand.name=se1l}
  628. 151.15 s > [2026-08-28 12:21:22.905] @process::amplitude WARNING : External state 1 ('g', PDG 21, helicity -) is off shell: p^2 = +2.5e5, expected m^2 = +0e0 (|Δ| = +2.5e5). Fixed-helicity spinor/vector/tensor external states may be ill-defined at this kinematic point.
  629. 151.15 s > field value
  630. 151.15 s > span warm_up{integrand.name=se1l}
  631. 151.15 s > [2026-08-28 12:21:22.906] @process::amplitude INFO : Input is above threshold: 1 existing threshold E-surfaces across 1/1 graph groups
  632. 151.15 s > field value
  633. 151.15 s > existing_esurfaces 1
  634. 151.15 s > group_count 1
  635. 151.15 s > groups_above_threshold 1
  636. 151.15 s > integrand se1l
  637. 151.15 s > span warm_up{integrand.name=se1l}
  638. 151.15 s > threshold_status above threshold
  639. 151.15 s > [2026-08-28 12:21:22.906] @process::amplitude INFO : overlap structure of group 0: [1: [0(2,3)]]
  640. 151.15 s > field value
  641. 151.15 s > span warm_up{integrand.name=se1l}
  642. 151.15 s > [2026-08-28 12:21:22.910] @process::amplitude WARNING : External state 0 ('g', PDG 21, helicity +) is off shell: p^2 = +2.5e5, expected m^2 = +0e0 (|Δ| = +2.5e5). Fixed-helicity spinor/vector/tensor external states may be ill-defined at this kinematic point.
  643. 151.15 s > field value
  644. 151.15 s > span warm_up{integrand.name=se1l_rls_shifted}
  645. 151.15 s > [2026-08-28 12:21:22.910] @process::amplitude WARNING : External state 1 ('g', PDG 21, helicity -) is off shell: p^2 = +2.5e5, expected m^2 = +0e0 (|Δ| = +2.5e5). Fixed-helicity spinor/vector/tensor external states may be ill-defined at this kinematic point.
  646. 151.15 s > field value
  647. 151.15 s > span warm_up{integrand.name=se1l_rls_shifted}
  648. 151.15 s > [2026-08-28 12:21:22.910] @process::amplitude INFO : Input is above threshold: 1 existing threshold E-surfaces across 1/1 graph groups
  649. 151.15 s > field value
  650. 151.15 s > existing_esurfaces 1
  651. 151.15 s > group_count 1
  652. 151.15 s > groups_above_threshold 1
  653. 151.15 s > integrand se1l_rls_shifted
  654. 151.15 s > span warm_up{integrand.name=se1l_rls_shifted}
  655. 151.15 s > threshold_status above threshold
  656. 151.15 s > [2026-08-28 12:21:22.910] @process::amplitude INFO : overlap structure of group 0: [1: [0(2,3)]]
  657. 151.15 s > field value
  658. 151.15 s > span warm_up{integrand.name=se1l_rls_shifted}
  659. 151.15 s > [2026-08-28 12:21:22.914] @process::amplitude WARNING : External state 0 ('g', PDG 21, helicity +) is off shell: p^2 = +2.5e5, expected m^2 = +0e0 (|Δ| = +2.5e5). Fixed-helicity spinor/vector/tensor external states may be ill-defined at this kinematic point.
  660. 151.15 s > field value
  661. 151.15 s > span warm_up{integrand.name=se1l}
  662. 151.15 s > [2026-08-28 12:21:22.914] @process::amplitude WARNING : External state 1 ('g', PDG 21, helicity -) is off shell: p^2 = +2.5e5, expected m^2 = +0e0 (|Δ| = +2.5e5). Fixed-helicity spinor/vector/tensor external states may be ill-defined at this kinematic point.
  663. 151.15 s > field value
  664. 151.15 s > span warm_up{integrand.name=se1l}
  665. 151.15 s > [2026-08-28 12:21:22.914] @process::amplitude INFO : Input is above threshold: 1 existing threshold E-surfaces across 1/1 graph groups
  666. 151.15 s > field value
  667. 151.15 s > existing_esurfaces 1
  668. 151.15 s > group_count 1
  669. 151.15 s > groups_above_threshold 1
  670. 151.15 s > integrand se1l
  671. 151.15 s > span warm_up{integrand.name=se1l}
  672. 151.15 s > threshold_status above threshold
  673. 151.15 s > [2026-08-28 12:21:22.914] @process::amplitude INFO : overlap structure of group 0: [1: [0(2,3)]]
  674. 151.15 s > field value
  675. 151.15 s > span warm_up{integrand.name=se1l}
  676. 151.15 s > [2026-08-28 12:21:22.918] @process::amplitude WARNING : External state 0 ('g', PDG 21, helicity +) is off shell: p^2 = +2.5e5, expected m^2 = +0e0 (|Δ| = +2.5e5). Fixed-helicity spinor/vector/tensor external states may be ill-defined at this kinematic point.
  677. 151.15 s > field value
  678. 151.15 s > span warm_up{integrand.name=se1l_rls_shifted}
  679. 151.15 s > [2026-08-28 12:21:22.918] @process::amplitude WARNING : External state 1 ('g', PDG 21, helicity -) is off shell: p^2 = +2.5e5, expected m^2 = +0e0 (|Δ| = +2.5e5). Fixed-helicity spinor/vector/tensor external states may be ill-defined at this kinematic point.
  680. 151.15 s > field value
  681. 151.15 s > span warm_up{integrand.name=se1l_rls_shifted}
  682. 151.15 s > [2026-08-28 12:21:22.918] @process::amplitude INFO : Input is above threshold: 1 existing threshold E-surfaces across 1/1 graph groups
  683. 151.15 s > field value
  684. 151.15 s > existing_esurfaces 1
  685. 151.15 s > group_count 1
  686. 151.15 s > groups_above_threshold 1
  687. 151.15 s > integrand se1l_rls_shifted
  688. 151.15 s > span warm_up{integrand.name=se1l_rls_shifted}
  689. 151.15 s > threshold_status above threshold
  690. 151.15 s > [2026-08-28 12:21:22.918] @process::amplitude INFO : overlap structure of group 0: [1: [0(2,3)]]
  691. 151.15 s > field value
  692. 151.15 s > span warm_up{integrand.name=se1l_rls_shifted}
  693. 151.15 s > [2026-08-28 12:21:22.922] @process::amplitude WARNING : External state 0 ('g', PDG 21, helicity +) is off shell: p^2 = +2.5e5, expected m^2 = +0e0 (|Δ| = +2.5e5). Fixed-helicity spinor/vector/tensor external states may be ill-defined at this kinematic point.
  694. 151.15 s > field value
  695. 151.15 s > span warm_up{integrand.name=se1l}
  696. 151.15 s > [2026-08-28 12:21:22.922] @process::amplitude WARNING : External state 1 ('g', PDG 21, helicity -) is off shell: p^2 = +2.5e5, expected m^2 = +0e0 (|Δ| = +2.5e5). Fixed-helicity spinor/vector/tensor external states may be ill-defined at this kinematic point.
  697. 151.15 s > field value
  698. 151.15 s > span warm_up{integrand.name=se1l}
  699. 151.15 s > [2026-08-28 12:21:22.922] @process::amplitude INFO : Input is above threshold: 1 existing threshold E-surfaces across 1/1 graph groups
  700. 151.15 s > field value
  701. 151.15 s > existing_esurfaces 1
  702. 151.15 s > group_count 1
  703. 151.15 s > groups_above_threshold 1
  704. 151.15 s > integrand se1l
  705. 151.15 s > span warm_up{integrand.name=se1l}
  706. 151.15 s > threshold_status above threshold
  707. 151.15 s > [2026-08-28 12:21:22.923] @process::amplitude INFO : overlap structure of group 0: [1: [0(2,3)]]
  708. 151.15 s > field value
  709. 151.15 s > span warm_up{integrand.name=se1l}
  710. 151.15 s > [2026-08-28 12:21:22.926] @process::amplitude WARNING : External state 0 ('g', PDG 21, helicity +) is off shell: p^2 = +2.5e5, expected m^2 = +0e0 (|Δ| = +2.5e5). Fixed-helicity spinor/vector/tensor external states may be ill-defined at this kinematic point.
  711. 151.15 s > field value
  712. 151.15 s > span warm_up{integrand.name=se1l_rls_shifted}
  713. 151.15 s > [2026-08-28 12:21:22.926] @process::amplitude WARNING : External state 1 ('g', PDG 21, helicity -) is off shell: p^2 = +2.5e5, expected m^2 = +0e0 (|Δ| = +2.5e5). Fixed-helicity spinor/vector/tensor external states may be ill-defined at this kinematic point.
  714. 151.15 s > field value
  715. 151.15 s > span warm_up{integrand.name=se1l_rls_shifted}
  716. 151.15 s > [2026-08-28 12:21:22.927] @process::amplitude INFO : Input is above threshold: 1 existing threshold E-surfaces across 1/1 graph groups
  717. 151.15 s > field value
  718. 151.15 s > existing_esurfaces 1
  719. 151.15 s > group_count 1
  720. 151.15 s > groups_above_threshold 1
  721. 151.15 s > integrand se1l_rls_shifted
  722. 151.15 s > span warm_up{integrand.name=se1l_rls_shifted}
  723. 151.15 s > threshold_status above threshold
  724. 151.15 s > [2026-08-28 12:21:22.927] @process::amplitude INFO : overlap structure of group 0: [1: [0(2,3)]]
  725. 151.15 s > field value
  726. 151.15 s > span warm_up{integrand.name=se1l_rls_shifted}
  727. 151.15 s > [2026-08-28 12:21:22.931] @process::amplitude WARNING : External state 0 ('g', PDG 21, helicity +) is off shell: p^2 = +2.5e5, expected m^2 = +0e0 (|Δ| = +2.5e5). Fixed-helicity spinor/vector/tensor external states may be ill-defined at this kinematic point.
  728. 151.15 s > field value
  729. 151.15 s > span warm_up{integrand.name=se1l}
  730. 151.15 s > [2026-08-28 12:21:22.931] @process::amplitude WARNING : External state 1 ('g', PDG 21, helicity -) is off shell: p^2 = +2.5e5, expected m^2 = +0e0 (|Δ| = +2.5e5). Fixed-helicity spinor/vector/tensor external states may be ill-defined at this kinematic point.
  731. 151.15 s > field value
  732. 151.15 s > span warm_up{integrand.name=se1l}
  733. 151.15 s > [2026-08-28 12:21:22.931] @process::amplitude INFO : Input is above threshold: 1 existing threshold E-surfaces across 1/1 graph groups
  734. 151.15 s > field value
  735. 151.15 s > existing_esurfaces 1
  736. 151.15 s > group_count 1
  737. 151.15 s > groups_above_threshold 1
  738. 151.15 s > integrand se1l
  739. 151.15 s > span warm_up{integrand.name=se1l}
  740. 151.15 s > threshold_status above threshold
  741. 151.15 s > [2026-08-28 12:21:22.931] @process::amplitude INFO : overlap structure of group 0: [1: [0(2,3)]]
  742. 151.15 s > field value
  743. 151.15 s > span warm_up{integrand.name=se1l}
  744. 151.15 s > [2026-08-28 12:21:22.935] @process::amplitude WARNING : External state 0 ('g', PDG 21, helicity +) is off shell: p^2 = +2.5e5, expected m^2 = +0e0 (|Δ| = +2.5e5). Fixed-helicity spinor/vector/tensor external states may be ill-defined at this kinematic point.
  745. 151.15 s > field value
  746. 151.15 s > span warm_up{integrand.name=se1l_rls_shifted}
  747. 151.15 s > [2026-08-28 12:21:22.935] @process::amplitude WARNING : External state 1 ('g', PDG 21, helicity -) is off shell: p^2 = +2.5e5, expected m^2 = +0e0 (|Δ| = +2.5e5). Fixed-helicity spinor/vector/tensor external states may be ill-defined at this kinematic point.
  748. 151.15 s > field value
  749. 151.15 s > span warm_up{integrand.name=se1l_rls_shifted}
  750. 151.15 s > [2026-08-28 12:21:22.935] @process::amplitude INFO : Input is above threshold: 1 existing threshold E-surfaces across 1/1 graph groups
  751. 151.15 s > field value
  752. 151.15 s > existing_esurfaces 1
  753. 151.15 s > group_count 1
  754. 151.15 s > groups_above_threshold 1
  755. 151.15 s > integrand se1l_rls_shifted
  756. 151.15 s > span warm_up{integrand.name=se1l_rls_shifted}
  757. 151.15 s > threshold_status above threshold
  758. 151.15 s > [2026-08-28 12:21:22.935] @process::amplitude INFO : overlap structure of group 0: [1: [0(2,3)]]
  759. 151.15 s > field value
  760. 151.15 s > span warm_up{integrand.name=se1l_rls_shifted}
  761. 151.15 s > [2026-08-28 12:21:22.939] @process::amplitude WARNING : External state 0 ('g', PDG 21, helicity +) is off shell: p^2 = +2.5e5, expected m^2 = +0e0 (|Δ| = +2.5e5). Fixed-helicity spinor/vector/tensor external states may be ill-defined at this kinematic point.
  762. 151.15 s > field value
  763. 151.15 s > span warm_up{integrand.name=se1l}
  764. 151.15 s > [2026-08-28 12:21:22.939] @process::amplitude WARNING : External state 1 ('g', PDG 21, helicity -) is off shell: p^2 = +2.5e5, expected m^2 = +0e0 (|Δ| = +2.5e5). Fixed-helicity spinor/vector/tensor external states may be ill-defined at this kinematic point.
  765. 151.15 s > field value
  766. 151.15 s > span warm_up{integrand.name=se1l}
  767. 151.15 s > [2026-08-28 12:21:22.939] @process::amplitude INFO : Input is above threshold: 1 existing threshold E-surfaces across 1/1 graph groups
  768. 151.15 s > field value
  769. 151.15 s > existing_esurfaces 1
  770. 151.15 s > group_count 1
  771. 151.15 s > groups_above_threshold 1
  772. 151.15 s > integrand se1l
  773. 151.15 s > span warm_up{integrand.name=se1l}
  774. 151.15 s > threshold_status above threshold
  775. 151.15 s > [2026-08-28 12:21:22.939] @process::amplitude INFO : overlap structure of group 0: [1: [0(2,3)]]
  776. 151.15 s > field value
  777. 151.15 s > span warm_up{integrand.name=se1l}
  778. 151.15 s > [2026-08-28 12:21:22.943] @process::amplitude WARNING : External state 0 ('g', PDG 21, helicity +) is off shell: p^2 = +2.5e5, expected m^2 = +0e0 (|Δ| = +2.5e5). Fixed-helicity spinor/vector/tensor external states may be ill-defined at this kinematic point.
  779. 151.15 s > field value
  780. 151.15 s > span warm_up{integrand.name=se1l_rls_shifted}
  781. 151.15 s > [2026-08-28 12:21:22.943] @process::amplitude WARNING : External state 1 ('g', PDG 21, helicity -) is off shell: p^2 = +2.5e5, expected m^2 = +0e0 (|Δ| = +2.5e5). Fixed-helicity spinor/vector/tensor external states may be ill-defined at this kinematic point.
  782. 151.15 s > field value
  783. 151.15 s > span warm_up{integrand.name=se1l_rls_shifted}
  784. 151.15 s > [2026-08-28 12:21:22.943] @process::amplitude INFO : Input is above threshold: 1 existing threshold E-surfaces across 1/1 graph groups
  785. 151.15 s > field value
  786. 151.15 s > existing_esurfaces 1
  787. 151.15 s > group_count 1
  788. 151.15 s > groups_above_threshold 1
  789. 151.15 s > integrand se1l_rls_shifted
  790. 151.15 s > span warm_up{integrand.name=se1l_rls_shifted}
  791. 151.15 s > threshold_status above threshold
  792. 151.15 s > [2026-08-28 12:21:22.943] @process::amplitude INFO : overlap structure of group 0: [1: [0(2,3)]]
  793. 151.15 s > field value
  794. 151.15 s > span warm_up{integrand.name=se1l_rls_shifted}
  795. 151.15 s > [2026-08-28 12:21:22.947] @process::amplitude WARNING : External state 0 ('g', PDG 21, helicity +) is off shell: p^2 = +2.5e5, expected m^2 = +0e0 (|Δ| = +2.5e5). Fixed-helicity spinor/vector/tensor external states may be ill-defined at this kinematic point.
  796. 151.15 s > field value
  797. 151.15 s > span warm_up{integrand.name=se1l}
  798. 151.15 s > [2026-08-28 12:21:22.947] @process::amplitude WARNING : External state 1 ('g', PDG 21, helicity -) is off shell: p^2 = +2.5e5, expected m^2 = +0e0 (|Δ| = +2.5e5). Fixed-helicity spinor/vector/tensor external states may be ill-defined at this kinematic point.
  799. 151.15 s > field value
  800. 151.15 s > span warm_up{integrand.name=se1l}
  801. 151.15 s > [2026-08-28 12:21:22.948] @process::amplitude INFO : Input is above threshold: 1 existing threshold E-surfaces across 1/1 graph groups
  802. 151.15 s > field value
  803. 151.15 s > existing_esurfaces 1
  804. 151.15 s > group_count 1
  805. 151.15 s > groups_above_threshold 1
  806. 151.15 s > integrand se1l
  807. 151.15 s > span warm_up{integrand.name=se1l}
  808. 151.15 s > threshold_status above threshold
  809. 151.15 s > [2026-08-28 12:21:22.948] @process::amplitude INFO : overlap structure of group 0: [1: [0(2,3)]]
  810. 151.15 s > field value
  811. 151.15 s > span warm_up{integrand.name=se1l}
  812. 151.15 s > [2026-08-28 12:21:22.952] @process::amplitude WARNING : External state 0 ('g', PDG 21, helicity +) is off shell: p^2 = +2.5e5, expected m^2 = +0e0 (|Δ| = +2.5e5). Fixed-helicity spinor/vector/tensor external states may be ill-defined at this kinematic point.
  813. 151.15 s > field value
  814. 151.15 s > span warm_up{integrand.name=se1l_rls_shifted}
  815. 151.15 s > [2026-08-28 12:21:22.952] @process::amplitude WARNING : External state 1 ('g', PDG 21, helicity -) is off shell: p^2 = +2.5e5, expected m^2 = +0e0 (|Δ| = +2.5e5). Fixed-helicity spinor/vector/tensor external states may be ill-defined at this kinematic point.
  816. 151.15 s > field value
  817. 151.15 s > span warm_up{integrand.name=se1l_rls_shifted}
  818. 151.15 s > [2026-08-28 12:21:22.952] @process::amplitude INFO : Input is above threshold: 1 existing threshold E-surfaces across 1/1 graph groups
  819. 151.15 s > field value
  820. 151.15 s > existing_esurfaces 1
  821. 151.15 s > group_count 1
  822. 151.15 s > groups_above_threshold 1
  823. 151.15 s > integrand se1l_rls_shifted
  824. 151.15 s > span warm_up{integrand.name=se1l_rls_shifted}
  825. 151.15 s > threshold_status above threshold
  826. 151.15 s > [2026-08-28 12:21:22.952] @process::amplitude INFO : overlap structure of group 0: [1: [0(2,3)]]
  827. 151.15 s > field value
  828. 151.15 s > span warm_up{integrand.name=se1l_rls_shifted}
  829. 151.15 s > [2026-08-28 12:21:22.956] @process::amplitude WARNING : External state 0 ('g', PDG 21, helicity +) is off shell: p^2 = +2.5e5, expected m^2 = +0e0 (|Δ| = +2.5e5). Fixed-helicity spinor/vector/tensor external states may be ill-defined at this kinematic point.
  830. 151.15 s > field value
  831. 151.15 s > span warm_up{integrand.name=se1l}
  832. 151.15 s > [2026-08-28 12:21:22.956] @process::amplitude WARNING : External state 1 ('g', PDG 21, helicity -) is off shell: p^2 = +2.5e5, expected m^2 = +0e0 (|Δ| = +2.5e5). Fixed-helicity spinor/vector/tensor external states may be ill-defined at this kinematic point.
  833. 151.15 s > field value
  834. 151.15 s > span warm_up{integrand.name=se1l}
  835. 151.15 s > [2026-08-28 12:21:22.956] @process::amplitude INFO : Input is above threshold: 1 existing threshold E-surfaces across 1/1 graph groups
  836. 151.15 s > field value
  837. 151.15 s > existing_esurfaces 1
  838. 151.15 s > group_count 1
  839. 151.15 s > groups_above_threshold 1
  840. 151.15 s > integrand se1l
  841. 151.15 s > span warm_up{integrand.name=se1l}
  842. 151.15 s > threshold_status above threshold
  843. 151.15 s > [2026-08-28 12:21:22.956] @process::amplitude INFO : overlap structure of group 0: [1: [0(2,3)]]
  844. 151.15 s > field value
  845. 151.15 s > span warm_up{integrand.name=se1l}
  846. 151.15 s > [2026-08-28 12:21:22.960] @process::amplitude WARNING : External state 0 ('g', PDG 21, helicity +) is off shell: p^2 = +2.5e5, expected m^2 = +0e0 (|Δ| = +2.5e5). Fixed-helicity spinor/vector/tensor external states may be ill-defined at this kinematic point.
  847. 151.15 s > field value
  848. 151.15 s > span warm_up{integrand.name=se1l_rls_shifted}
  849. 151.15 s > [2026-08-28 12:21:22.960] @process::amplitude WARNING : External state 1 ('g', PDG 21, helicity -) is off shell: p^2 = +2.5e5, expected m^2 = +0e0 (|Δ| = +2.5e5). Fixed-helicity spinor/vector/tensor external states may be ill-defined at this kinematic point.
  850. 151.15 s > field value
  851. 151.15 s > span warm_up{integrand.name=se1l_rls_shifted}
  852. 151.15 s > [2026-08-28 12:21:22.960] @process::amplitude INFO : Input is above threshold: 1 existing threshold E-surfaces across 1/1 graph groups
  853. 151.15 s > field value
  854. 151.15 s > existing_esurfaces 1
  855. 151.15 s > group_count 1
  856. 151.15 s > groups_above_threshold 1
  857. 151.15 s > integrand se1l_rls_shifted
  858. 151.15 s > span warm_up{integrand.name=se1l_rls_shifted}
  859. 151.15 s > threshold_status above threshold
  860. 151.15 s > [2026-08-28 12:21:22.960] @process::amplitude INFO : overlap structure of group 0: [1: [0(2,3)]]
  861. 151.15 s > field value
  862. 151.15 s > span warm_up{integrand.name=se1l_rls_shifted}
  863. 151.15 s > [2026-08-28 12:21:22.964] @process::amplitude WARNING : External state 0 ('g', PDG 21, helicity +) is off shell: p^2 = +2.5e5, expected m^2 = +0e0 (|Δ| = +2.5e5). Fixed-helicity spinor/vector/tensor external states may be ill-defined at this kinematic point.
  864. 151.15 s > field value
  865. 151.15 s > span warm_up{integrand.name=se1l}
  866. 151.15 s > [2026-08-28 12:21:22.964] @process::amplitude WARNING : External state 1 ('g', PDG 21, helicity -) is off shell: p^2 = +2.5e5, expected m^2 = +0e0 (|Δ| = +2.5e5). Fixed-helicity spinor/vector/tensor external states may be ill-defined at this kinematic point.
  867. 151.15 s > field value
  868. 151.15 s > span warm_up{integrand.name=se1l}
  869. 151.15 s > [2026-08-28 12:21:22.965] @process::amplitude INFO : Input is above threshold: 1 existing threshold E-surfaces across 1/1 graph groups
  870. 151.15 s > field value
  871. 151.15 s > existing_esurfaces 1
  872. 151.15 s > group_count 1
  873. 151.15 s > groups_above_threshold 1
  874. 151.15 s > integrand se1l
  875. 151.15 s > span warm_up{integrand.name=se1l}
  876. 151.15 s > threshold_status above threshold
  877. 151.15 s > [2026-08-28 12:21:22.965] @process::amplitude INFO : overlap structure of group 0: [1: [0(2,3)]]
  878. 151.15 s > field value
  879. 151.15 s > span warm_up{integrand.name=se1l}
  880. 151.15 s > [2026-08-28 12:21:22.969] @process::amplitude WARNING : External state 0 ('g', PDG 21, helicity +) is off shell: p^2 = +2.5e5, expected m^2 = +0e0 (|Δ| = +2.5e5). Fixed-helicity spinor/vector/tensor external states may be ill-defined at this kinematic point.
  881. 151.15 s > field value
  882. 151.15 s > span warm_up{integrand.name=se1l_rls_shifted}
  883. 151.15 s > [2026-08-28 12:21:22.969] @process::amplitude WARNING : External state 1 ('g', PDG 21, helicity -) is off shell: p^2 = +2.5e5, expected m^2 = +0e0 (|Δ| = +2.5e5). Fixed-helicity spinor/vector/tensor external states may be ill-defined at this kinematic point.
  884. 151.15 s > field value
  885. 151.15 s > span warm_up{integrand.name=se1l_rls_shifted}
  886. 151.15 s > [2026-08-28 12:21:22.969] @process::amplitude INFO : Input is above threshold: 1 existing threshold E-surfaces across 1/1 graph groups
  887. 151.15 s > field value
  888. 151.15 s > existing_esurfaces 1
  889. 151.15 s > group_count 1
  890. 151.15 s > groups_above_threshold 1
  891. 151.15 s > integrand se1l_rls_shifted
  892. 151.15 s > span warm_up{integrand.name=se1l_rls_shifted}
  893. 151.15 s > threshold_status above threshold
  894. 151.15 s > [2026-08-28 12:21:22.969] @process::amplitude INFO : overlap structure of group 0: [1: [0(2,3)]]
  895. 151.15 s > field value
  896. 151.15 s > span warm_up{integrand.name=se1l_rls_shifted}
  897. 151.15 s > [2026-08-28 12:21:22.973] @process::amplitude WARNING : External state 0 ('g', PDG 21, helicity +) is off shell: p^2 = +2.5e5, expected m^2 = +0e0 (|Δ| = +2.5e5). Fixed-helicity spinor/vector/tensor external states may be ill-defined at this kinematic point.
  898. 151.15 s > field value
  899. 151.15 s > span warm_up{integrand.name=se1l}
  900. 151.15 s > [2026-08-28 12:21:22.973] @process::amplitude WARNING : External state 1 ('g', PDG 21, helicity -) is off shell: p^2 = +2.5e5, expected m^2 = +0e0 (|Δ| = +2.5e5). Fixed-helicity spinor/vector/tensor external states may be ill-defined at this kinematic point.
  901. 151.15 s > field value
  902. 151.15 s > span warm_up{integrand.name=se1l}
  903. 151.15 s > [2026-08-28 12:21:22.973] @process::amplitude INFO : Input is above threshold: 1 existing threshold E-surfaces across 1/1 graph groups
  904. 151.15 s > field value
  905. 151.15 s > existing_esurfaces 1
  906. 151.15 s > group_count 1
  907. 151.15 s > groups_above_threshold 1
  908. 151.15 s > integrand se1l
  909. 151.15 s > span warm_up{integrand.name=se1l}
  910. 151.15 s > threshold_status above threshold
  911. 151.15 s > [2026-08-28 12:21:22.973] @process::amplitude INFO : overlap structure of group 0: [1: [0(2,3)]]
  912. 151.15 s > field value
  913. 151.15 s > span warm_up{integrand.name=se1l}
  914. 151.15 s > [2026-08-28 12:21:22.977] @process::amplitude WARNING : External state 0 ('g', PDG 21, helicity +) is off shell: p^2 = +2.5e5, expected m^2 = +0e0 (|Δ| = +2.5e5). Fixed-helicity spinor/vector/tensor external states may be ill-defined at this kinematic point.
  915. 151.15 s > field value
  916. 151.15 s > span warm_up{integrand.name=se1l_mur_shifted}
  917. 151.15 s > [2026-08-28 12:21:22.977] @process::amplitude WARNING : External state 1 ('g', PDG 21, helicity -) is off shell: p^2 = +2.5e5, expected m^2 = +0e0 (|Δ| = +2.5e5). Fixed-helicity spinor/vector/tensor external states may be ill-defined at this kinematic point.
  918. 151.15 s > field value
  919. 151.15 s > span warm_up{integrand.name=se1l_mur_shifted}
  920. 151.15 s > [2026-08-28 12:21:22.977] @process::amplitude INFO : Input is above threshold: 1 existing threshold E-surfaces across 1/1 graph groups
  921. 151.15 s > field value
  922. 151.15 s > existing_esurfaces 1
  923. 151.15 s > group_count 1
  924. 151.15 s > groups_above_threshold 1
  925. 151.15 s > integrand se1l_mur_shifted
  926. 151.15 s > span warm_up{integrand.name=se1l_mur_shifted}
  927. 151.15 s > threshold_status above threshold
  928. 151.15 s > [2026-08-28 12:21:22.977] @process::amplitude INFO : overlap structure of group 0: [1: [0(2,3)]]
  929. 151.15 s > field value
  930. 151.15 s > span warm_up{integrand.name=se1l_mur_shifted}
  931. 151.15 s > [2026-08-28 12:21:22.981] @process::amplitude WARNING : External state 0 ('g', PDG 21, helicity +) is off shell: p^2 = +2.5e5, expected m^2 = +0e0 (|Δ| = +2.5e5). Fixed-helicity spinor/vector/tensor external states may be ill-defined at this kinematic point.
  932. 151.15 s > field value
  933. 151.15 s > span warm_up{integrand.name=se1l}
  934. 151.15 s > [2026-08-28 12:21:22.981] @process::amplitude WARNING : External state 1 ('g', PDG 21, helicity -) is off shell: p^2 = +2.5e5, expected m^2 = +0e0 (|Δ| = +2.5e5). Fixed-helicity spinor/vector/tensor external states may be ill-defined at this kinematic point.
  935. 151.15 s > field value
  936. 151.15 s > span warm_up{integrand.name=se1l}
  937. 151.15 s > [2026-08-28 12:21:22.981] @process::amplitude INFO : Input is above threshold: 1 existing threshold E-surfaces across 1/1 graph groups
  938. 151.15 s > field value
  939. 151.15 s > existing_esurfaces 1
  940. 151.15 s > group_count 1
  941. 151.15 s > groups_above_threshold 1
  942. 151.15 s > integrand se1l
  943. 151.15 s > span warm_up{integrand.name=se1l}
  944. 151.15 s > threshold_status above threshold
  945. 151.15 s > [2026-08-28 12:21:22.982] @process::amplitude INFO : overlap structure of group 0: [1: [0(2,3)]]
  946. 151.15 s > field value
  947. 151.15 s > span warm_up{integrand.name=se1l}
  948. 151.15 s > [2026-08-28 12:21:22.986] @process::amplitude WARNING : External state 0 ('g', PDG 21, helicity +) is off shell: p^2 = +2.5e5, expected m^2 = +0e0 (|Δ| = +2.5e5). Fixed-helicity spinor/vector/tensor external states may be ill-defined at this kinematic point.
  949. 151.15 s > field value
  950. 151.15 s > span warm_up{integrand.name=se1l_mur_shifted}
  951. 151.15 s > [2026-08-28 12:21:22.986] @process::amplitude WARNING : External state 1 ('g', PDG 21, helicity -) is off shell: p^2 = +2.5e5, expected m^2 = +0e0 (|Δ| = +2.5e5). Fixed-helicity spinor/vector/tensor external states may be ill-defined at this kinematic point.
  952. 151.15 s > field value
  953. 151.15 s > span warm_up{integrand.name=se1l_mur_shifted}
  954. 151.15 s > [2026-08-28 12:21:22.986] @process::amplitude INFO : Input is above threshold: 1 existing threshold E-surfaces across 1/1 graph groups
  955. 151.15 s > field value
  956. 151.15 s > existing_esurfaces 1
  957. 151.15 s > group_count 1
  958. 151.15 s > groups_above_threshold 1
  959. 151.15 s > integrand se1l_mur_shifted
  960. 151.15 s > span warm_up{integrand.name=se1l_mur_shifted}
  961. 151.15 s > threshold_status above threshold
  962. 151.15 s > [2026-08-28 12:21:22.986] @process::amplitude INFO : overlap structure of group 0: [1: [0(2,3)]]
  963. 151.15 s > field value
  964. 151.15 s > span warm_up{integrand.name=se1l_mur_shifted}
  965. 151.15 s > [2026-08-28 12:21:22.990] @process::amplitude WARNING : External state 0 ('g', PDG 21, helicity +) is off shell: p^2 = +2.5e5, expected m^2 = +0e0 (|Δ| = +2.5e5). Fixed-helicity spinor/vector/tensor external states may be ill-defined at this kinematic point.
  966. 151.15 s > field value
  967. 151.15 s > span warm_up{integrand.name=se1l}
  968. 151.15 s > [2026-08-28 12:21:22.990] @process::amplitude WARNING : External state 1 ('g', PDG 21, helicity -) is off shell: p^2 = +2.5e5, expected m^2 = +0e0 (|Δ| = +2.5e5). Fixed-helicity spinor/vector/tensor external states may be ill-defined at this kinematic point.
  969. 151.15 s > field value
  970. 151.15 s > span warm_up{integrand.name=se1l}
  971. 151.15 s > [2026-08-28 12:21:22.990] @process::amplitude INFO : Input is above threshold: 1 existing threshold E-surfaces across 1/1 graph groups
  972. 151.15 s > field value
  973. 151.15 s > existing_esurfaces 1
  974. 151.15 s > group_count 1
  975. 151.15 s > groups_above_threshold 1
  976. 151.15 s > integrand se1l
  977. 151.15 s > span warm_up{integrand.name=se1l}
  978. 151.15 s > threshold_status above threshold
  979. 151.15 s > [2026-08-28 12:21:22.990] @process::amplitude INFO : overlap structure of group 0: [1: [0(2,3)]]
  980. 151.15 s > field value
  981. 151.15 s > span warm_up{integrand.name=se1l}
  982. 151.15 s > [2026-08-28 12:21:22.994] @process::amplitude WARNING : External state 0 ('g', PDG 21, helicity +) is off shell: p^2 = +2.5e5, expected m^2 = +0e0 (|Δ| = +2.5e5). Fixed-helicity spinor/vector/tensor external states may be ill-defined at this kinematic point.
  983. 151.15 s > field value
  984. 151.15 s > span warm_up{integrand.name=se1l_mur_shifted}
  985. 151.15 s > [2026-08-28 12:21:22.994] @process::amplitude WARNING : External state 1 ('g', PDG 21, helicity -) is off shell: p^2 = +2.5e5, expected m^2 = +0e0 (|Δ| = +2.5e5). Fixed-helicity spinor/vector/tensor external states may be ill-defined at this kinematic point.
  986. 151.15 s > field value
  987. 151.15 s > span warm_up{integrand.name=se1l_mur_shifted}
  988. 151.15 s > [2026-08-28 12:21:22.994] @process::amplitude INFO : Input is above threshold: 1 existing threshold E-surfaces across 1/1 graph groups
  989. 151.15 s > field value
  990. 151.15 s > existing_esurfaces 1
  991. 151.15 s > group_count 1
  992. 151.15 s > groups_above_threshold 1
  993. 151.15 s > integrand se1l_mur_shifted
  994. 151.15 s > span warm_up{integrand.name=se1l_mur_shifted}
  995. 151.15 s > threshold_status above threshold
  996. 151.15 s > [2026-08-28 12:21:22.994] @process::amplitude INFO : overlap structure of group 0: [1: [0(2,3)]]
  997. 151.15 s > field value
  998. 151.15 s > span warm_up{integrand.name=se1l_mur_shifted}
  999. 151.15 s > [2026-08-28 12:21:22.998] @process::amplitude WARNING : External state 0 ('g', PDG 21, helicity +) is off shell: p^2 = +2.5e5, expected m^2 = +0e0 (|Δ| = +2.5e5). Fixed-helicity spinor/vector/tensor external states may be ill-defined at this kinematic point.
  1000. 151.15 s > field value
  1001. 151.15 s > span warm_up{integrand.name=se1l}
  1002. 151.15 s > [2026-08-28 12:21:22.998] @process::amplitude WARNING : External state 1 ('g', PDG 21, helicity -) is off shell: p^2 = +2.5e5, expected m^2 = +0e0 (|Δ| = +2.5e5). Fixed-helicity spinor/vector/tensor external states may be ill-defined at this kinematic point.
  1003. 151.15 s > field value
  1004. 151.15 s > span warm_up{integrand.name=se1l}
  1005. 151.15 s > [2026-08-28 12:21:22.999] @process::amplitude INFO : Input is above threshold: 1 existing threshold E-surfaces across 1/1 graph groups
  1006. 151.15 s > field value
  1007. 151.15 s > existing_esurfaces 1
  1008. 151.15 s > group_count 1
  1009. 151.15 s > groups_above_threshold 1
  1010. 151.15 s > integrand se1l
  1011. 151.15 s > span warm_up{integrand.name=se1l}
  1012. 151.15 s > threshold_status above threshold
  1013. 151.15 s > [2026-08-28 12:21:22.999] @process::amplitude INFO : overlap structure of group 0: [1: [0(2,3)]]
  1014. 151.15 s > field value
  1015. 151.15 s > span warm_up{integrand.name=se1l}
  1016. 151.15 s > [2026-08-28 12:21:23.003] @process::amplitude WARNING : External state 0 ('g', PDG 21, helicity +) is off shell: p^2 = +2.5e5, expected m^2 = +0e0 (|Δ| = +2.5e5). Fixed-helicity spinor/vector/tensor external states may be ill-defined at this kinematic point.
  1017. 151.15 s > field value
  1018. 151.15 s > span warm_up{integrand.name=se1l_mur_shifted}
  1019. 151.15 s > [2026-08-28 12:21:23.003] @process::amplitude WARNING : External state 1 ('g', PDG 21, helicity -) is off shell: p^2 = +2.5e5, expected m^2 = +0e0 (|Δ| = +2.5e5). Fixed-helicity spinor/vector/tensor external states may be ill-defined at this kinematic point.
  1020. 151.15 s > field value
  1021. 151.15 s > span warm_up{integrand.name=se1l_mur_shifted}
  1022. 151.15 s > [2026-08-28 12:21:23.003] @process::amplitude INFO : Input is above threshold: 1 existing threshold E-surfaces across 1/1 graph groups
  1023. 151.15 s > field value
  1024. 151.15 s > existing_esurfaces 1
  1025. 151.15 s > group_count 1
  1026. 151.15 s > groups_above_threshold 1
  1027. 151.15 s > integrand se1l_mur_shifted
  1028. 151.15 s > span warm_up{integrand.name=se1l_mur_shifted}
  1029. 151.15 s > threshold_status above threshold
  1030. 151.15 s > [2026-08-28 12:21:23.003] @process::amplitude INFO : overlap structure of group 0: [1: [0(2,3)]]
  1031. 151.15 s > field value
  1032. 151.15 s > span warm_up{integrand.name=se1l_mur_shifted}
  1033. 151.15 s > [2026-08-28 12:21:23.007] @process::amplitude WARNING : External state 0 ('g', PDG 21, helicity +) is off shell: p^2 = +2.5e5, expected m^2 = +0e0 (|Δ| = +2.5e5). Fixed-helicity spinor/vector/tensor external states may be ill-defined at this kinematic point.
  1034. 151.15 s > field value
  1035. 151.15 s > span warm_up{integrand.name=se1l}
  1036. 151.15 s > [2026-08-28 12:21:23.007] @process::amplitude WARNING : External state 1 ('g', PDG 21, helicity -) is off shell: p^2 = +2.5e5, expected m^2 = +0e0 (|Δ| = +2.5e5). Fixed-helicity spinor/vector/tensor external states may be ill-defined at this kinematic point.
  1037. 151.15 s > field value
  1038. 151.15 s > span warm_up{integrand.name=se1l}
  1039. 151.15 s > [2026-08-28 12:21:23.007] @process::amplitude INFO : Input is above threshold: 1 existing threshold E-surfaces across 1/1 graph groups
  1040. 151.15 s > field value
  1041. 151.15 s > existing_esurfaces 1
  1042. 151.15 s > group_count 1
  1043. 151.15 s > groups_above_threshold 1
  1044. 151.15 s > integrand se1l
  1045. 151.15 s > span warm_up{integrand.name=se1l}
  1046. 151.15 s > threshold_status above threshold
  1047. 151.15 s > [2026-08-28 12:21:23.007] @process::amplitude INFO : overlap structure of group 0: [1: [0(2,3)]]
  1048. 151.15 s > field value
  1049. 151.15 s > span warm_up{integrand.name=se1l}
  1050. 151.15 s > [2026-08-28 12:21:23.011] @process::amplitude WARNING : External state 0 ('g', PDG 21, helicity +) is off shell: p^2 = +2.5e5, expected m^2 = +0e0 (|Δ| = +2.5e5). Fixed-helicity spinor/vector/tensor external states may be ill-defined at this kinematic point.
  1051. 151.15 s > field value
  1052. 151.15 s > span warm_up{integrand.name=se1l_mur_shifted}
  1053. 151.15 s > [2026-08-28 12:21:23.011] @process::amplitude WARNING : External state 1 ('g', PDG 21, helicity -) is off shell: p^2 = +2.5e5, expected m^2 = +0e0 (|Δ| = +2.5e5). Fixed-helicity spinor/vector/tensor external states may be ill-defined at this kinematic point.
  1054. 151.15 s > field value
  1055. 151.15 s > span warm_up{integrand.name=se1l_mur_shifted}
  1056. 151.15 s > [2026-08-28 12:21:23.012] @process::amplitude INFO : Input is above threshold: 1 existing threshold E-surfaces across 1/1 graph groups
  1057. 151.15 s > field value
  1058. 151.15 s > existing_esurfaces 1
  1059. 151.15 s > group_count 1
  1060. 151.15 s > groups_above_threshold 1
  1061. 151.15 s > integrand se1l_mur_shifted
  1062. 151.15 s > span warm_up{integrand.name=se1l_mur_shifted}
  1063. 151.15 s > threshold_status above threshold
  1064. 151.15 s > [2026-08-28 12:21:23.012] @process::amplitude INFO : overlap structure of group 0: [1: [0(2,3)]]
  1065. 151.15 s > field value
  1066. 151.15 s > span warm_up{integrand.name=se1l_mur_shifted}
  1067. 151.15 s > [2026-08-28 12:21:23.016] @process::amplitude WARNING : External state 0 ('g', PDG 21, helicity +) is off shell: p^2 = +2.5e5, expected m^2 = +0e0 (|Δ| = +2.5e5). Fixed-helicity spinor/vector/tensor external states may be ill-defined at this kinematic point.
  1068. 151.15 s > field value
  1069. 151.15 s > span warm_up{integrand.name=se1l}
  1070. 151.15 s > [2026-08-28 12:21:23.016] @process::amplitude WARNING : External state 1 ('g', PDG 21, helicity -) is off shell: p^2 = +2.5e5, expected m^2 = +0e0 (|Δ| = +2.5e5). Fixed-helicity spinor/vector/tensor external states may be ill-defined at this kinematic point.
  1071. 151.15 s > field value
  1072. 151.15 s > span warm_up{integrand.name=se1l}
  1073. 151.15 s > [2026-08-28 12:21:23.016] @process::amplitude INFO : Input is above threshold: 1 existing threshold E-surfaces across 1/1 graph groups
  1074. 151.15 s > field value
  1075. 151.15 s > existing_esurfaces 1
  1076. 151.15 s > group_count 1
  1077. 151.15 s > groups_above_threshold 1
  1078. 151.15 s > integrand se1l
  1079. 151.15 s > span warm_up{integrand.name=se1l}
  1080. 151.15 s > threshold_status above threshold
  1081. 151.15 s > [2026-08-28 12:21:23.016] @process::amplitude INFO : overlap structure of group 0: [1: [0(2,3)]]
  1082. 151.15 s > field value
  1083. 151.15 s > span warm_up{integrand.name=se1l}
  1084. 151.15 s > [2026-08-28 12:21:23.020] @process::amplitude WARNING : External state 0 ('g', PDG 21, helicity +) is off shell: p^2 = +2.5e5, expected m^2 = +0e0 (|Δ| = +2.5e5). Fixed-helicity spinor/vector/tensor external states may be ill-defined at this kinematic point.
  1085. 151.15 s > field value
  1086. 151.15 s > span warm_up{integrand.name=se1l_mur_shifted}
  1087. 151.15 s > [2026-08-28 12:21:23.020] @process::amplitude WARNING : External state 1 ('g', PDG 21, helicity -) is off shell: p^2 = +2.5e5, expected m^2 = +0e0 (|Δ| = +2.5e5). Fixed-helicity spinor/vector/tensor external states may be ill-defined at this kinematic point.
  1088. 151.15 s > field value
  1089. 151.15 s > span warm_up{integrand.name=se1l_mur_shifted}
  1090. 151.15 s > [2026-08-28 12:21:23.020] @process::amplitude INFO : Input is above threshold: 1 existing threshold E-surfaces across 1/1 graph groups
  1091. 151.15 s > field value
  1092. 151.15 s > existing_esurfaces 1
  1093. 151.15 s > group_count 1
  1094. 151.15 s > groups_above_threshold 1
  1095. 151.15 s > integrand se1l_mur_shifted
  1096. 151.15 s > span warm_up{integrand.name=se1l_mur_shifted}
  1097. 151.15 s > threshold_status above threshold
  1098. 151.15 s > [2026-08-28 12:21:23.020] @process::amplitude INFO : overlap structure of group 0: [1: [0(2,3)]]
  1099. 151.15 s > field value
  1100. 151.15 s > span warm_up{integrand.name=se1l_mur_shifted}
  1101. 151.15 s > [2026-08-28 12:21:23.024] @process::amplitude WARNING : External state 0 ('g', PDG 21, helicity +) is off shell: p^2 = +2.5e5, expected m^2 = +0e0 (|Δ| = +2.5e5). Fixed-helicity spinor/vector/tensor external states may be ill-defined at this kinematic point.
  1102. 151.15 s > field value
  1103. 151.15 s > span warm_up{integrand.name=se1l}
  1104. 151.15 s > [2026-08-28 12:21:23.024] @process::amplitude WARNING : External state 1 ('g', PDG 21, helicity -) is off shell: p^2 = +2.5e5, expected m^2 = +0e0 (|Δ| = +2.5e5). Fixed-helicity spinor/vector/tensor external states may be ill-defined at this kinematic point.
  1105. 151.15 s > field value
  1106. 151.15 s > span warm_up{integrand.name=se1l}
  1107. 151.15 s > [2026-08-28 12:21:23.025] @process::amplitude INFO : Input is above threshold: 1 existing threshold E-surfaces across 1/1 graph groups
  1108. 151.15 s > field value
  1109. 151.15 s > existing_esurfaces 1
  1110. 151.15 s > group_count 1
  1111. 151.15 s > groups_above_threshold 1
  1112. 151.15 s > integrand se1l
  1113. 151.15 s > span warm_up{integrand.name=se1l}
  1114. 151.15 s > threshold_status above threshold
  1115. 151.15 s > [2026-08-28 12:21:23.025] @process::amplitude INFO : overlap structure of group 0: [1: [0(2,3)]]
  1116. 151.15 s > field value
  1117. 151.15 s > span warm_up{integrand.name=se1l}
  1118. 151.15 s > [2026-08-28 12:21:23.029] @process::amplitude WARNING : External state 0 ('g', PDG 21, helicity +) is off shell: p^2 = +2.5e5, expected m^2 = +0e0 (|Δ| = +2.5e5). Fixed-helicity spinor/vector/tensor external states may be ill-defined at this kinematic point.
  1119. 151.15 s > field value
  1120. 151.15 s > span warm_up{integrand.name=se1l_mur_shifted}
  1121. 151.15 s > [2026-08-28 12:21:23.029] @process::amplitude WARNING : External state 1 ('g', PDG 21, helicity -) is off shell: p^2 = +2.5e5, expected m^2 = +0e0 (|Δ| = +2.5e5). Fixed-helicity spinor/vector/tensor external states may be ill-defined at this kinematic point.
  1122. 151.15 s > field value
  1123. 151.15 s > span warm_up{integrand.name=se1l_mur_shifted}
  1124. 151.15 s > [2026-08-28 12:21:23.029] @process::amplitude INFO : Input is above threshold: 1 existing threshold E-surfaces across 1/1 graph groups
  1125. 151.15 s > field value
  1126. 151.15 s > existing_esurfaces 1
  1127. 151.15 s > group_count 1
  1128. 151.15 s > groups_above_threshold 1
  1129. 151.15 s > integrand se1l_mur_shifted
  1130. 151.15 s > span warm_up{integrand.name=se1l_mur_shifted}
  1131. 151.15 s > threshold_status above threshold
  1132. 151.15 s > [2026-08-28 12:21:23.029] @process::amplitude INFO : overlap structure of group 0: [1: [0(2,3)]]
  1133. 151.15 s > field value
  1134. 151.15 s > span warm_up{integrand.name=se1l_mur_shifted}
  1135. 151.15 s > [2026-08-28 12:21:23.033] @process::amplitude WARNING : External state 0 ('g', PDG 21, helicity +) is off shell: p^2 = +2.5e5, expected m^2 = +0e0 (|Δ| = +2.5e5). Fixed-helicity spinor/vector/tensor external states may be ill-defined at this kinematic point.
  1136. 151.15 s > field value
  1137. 151.15 s > span warm_up{integrand.name=se1l}
  1138. 151.15 s > [2026-08-28 12:21:23.033] @process::amplitude WARNING : External state 1 ('g', PDG 21, helicity -) is off shell: p^2 = +2.5e5, expected m^2 = +0e0 (|Δ| = +2.5e5). Fixed-helicity spinor/vector/tensor external states may be ill-defined at this kinematic point.
  1139. 151.15 s > field value
  1140. 151.15 s > span warm_up{integrand.name=se1l}
  1141. 151.15 s > [2026-08-28 12:21:23.033] @process::amplitude INFO : Input is above threshold: 1 existing threshold E-surfaces across 1/1 graph groups
  1142. 151.15 s > field value
  1143. 151.15 s > existing_esurfaces 1
  1144. 151.15 s > group_count 1
  1145. 151.15 s > groups_above_threshold 1
  1146. 151.15 s > integrand se1l
  1147. 151.15 s > span warm_up{integrand.name=se1l}
  1148. 151.15 s > threshold_status above threshold
  1149. 151.15 s > [2026-08-28 12:21:23.033] @process::amplitude INFO : overlap structure of group 0: [1: [0(2,3)]]
  1150. 151.15 s > field value
  1151. 151.15 s > span warm_up{integrand.name=se1l}
  1152. 151.15 s > [2026-08-28 12:21:23.037] @process::amplitude WARNING : External state 0 ('g', PDG 21, helicity +) is off shell: p^2 = +2.5e5, expected m^2 = +0e0 (|Δ| = +2.5e5). Fixed-helicity spinor/vector/tensor external states may be ill-defined at this kinematic point.
  1153. 151.15 s > field value
  1154. 151.15 s > span warm_up{integrand.name=se1l_mur_shifted}
  1155. 151.15 s > [2026-08-28 12:21:23.037] @process::amplitude WARNING : External state 1 ('g', PDG 21, helicity -) is off shell: p^2 = +2.5e5, expected m^2 = +0e0 (|Δ| = +2.5e5). Fixed-helicity spinor/vector/tensor external states may be ill-defined at this kinematic point.
  1156. 151.15 s > field value
  1157. 151.15 s > span warm_up{integrand.name=se1l_mur_shifted}
  1158. 151.15 s > [2026-08-28 12:21:23.038] @process::amplitude INFO : Input is above threshold: 1 existing threshold E-surfaces across 1/1 graph groups
  1159. 151.15 s > field value
  1160. 151.15 s > existing_esurfaces 1
  1161. 151.15 s > group_count 1
  1162. 151.15 s > groups_above_threshold 1
  1163. 151.15 s > integrand se1l_mur_shifted
  1164. 151.15 s > span warm_up{integrand.name=se1l_mur_shifted}
  1165. 151.15 s > threshold_status above threshold
  1166. 151.15 s > [2026-08-28 12:21:23.038] @process::amplitude INFO : overlap structure of group 0: [1: [0(2,3)]]
  1167. 151.15 s > field value
  1168. 151.15 s > span warm_up{integrand.name=se1l_mur_shifted}
  1169. 151.15 s > [2026-08-28 12:21:23.042] @process::amplitude WARNING : External state 0 ('g', PDG 21, helicity +) is off shell: p^2 = +2.5e5, expected m^2 = +0e0 (|Δ| = +2.5e5). Fixed-helicity spinor/vector/tensor external states may be ill-defined at this kinematic point.
  1170. 151.15 s > field value
  1171. 151.15 s > span warm_up{integrand.name=se1l}
  1172. 151.15 s > [2026-08-28 12:21:23.042] @process::amplitude WARNING : External state 1 ('g', PDG 21, helicity -) is off shell: p^2 = +2.5e5, expected m^2 = +0e0 (|Δ| = +2.5e5). Fixed-helicity spinor/vector/tensor external states may be ill-defined at this kinematic point.
  1173. 151.15 s > field value
  1174. 151.15 s > span warm_up{integrand.name=se1l}
  1175. 151.15 s > [2026-08-28 12:21:23.042] @process::amplitude INFO : Input is above threshold: 1 existing threshold E-surfaces across 1/1 graph groups
  1176. 151.15 s > field value
  1177. 151.15 s > existing_esurfaces 1
  1178. 151.15 s > group_count 1
  1179. 151.15 s > groups_above_threshold 1
  1180. 151.15 s > integrand se1l
  1181. 151.15 s > span warm_up{integrand.name=se1l}
  1182. 151.15 s > threshold_status above threshold
  1183. 151.15 s > [2026-08-28 12:21:23.042] @process::amplitude INFO : overlap structure of group 0: [1: [0(2,3)]]
  1184. 151.15 s > field value
  1185. 151.15 s > span warm_up{integrand.name=se1l}
  1186. 151.15 s > [2026-08-28 12:21:23.046] @process::amplitude WARNING : External state 0 ('g', PDG 21, helicity +) is off shell: p^2 = +2.5e5, expected m^2 = +0e0 (|Δ| = +2.5e5). Fixed-helicity spinor/vector/tensor external states may be ill-defined at this kinematic point.
  1187. 151.15 s > field value
  1188. 151.15 s > span warm_up{integrand.name=se1l_mur_shifted}
  1189. 151.15 s > [2026-08-28 12:21:23.046] @process::amplitude WARNING : External state 1 ('g', PDG 21, helicity -) is off shell: p^2 = +2.5e5, expected m^2 = +0e0 (|Δ| = +2.5e5). Fixed-helicity spinor/vector/tensor external states may be ill-defined at this kinematic point.
  1190. 151.15 s > field value
  1191. 151.15 s > span warm_up{integrand.name=se1l_mur_shifted}
  1192. 151.15 s > [2026-08-28 12:21:23.046] @process::amplitude INFO : Input is above threshold: 1 existing threshold E-surfaces across 1/1 graph groups
  1193. 151.15 s > field value
  1194. 151.15 s > existing_esurfaces 1
  1195. 151.15 s > group_count 1
  1196. 151.15 s > groups_above_threshold 1
  1197. 151.15 s > integrand se1l_mur_shifted
  1198. 151.15 s > span warm_up{integrand.name=se1l_mur_shifted}
  1199. 151.15 s > threshold_status above threshold
  1200. 151.15 s > [2026-08-28 12:21:23.046] @process::amplitude INFO : overlap structure of group 0: [1: [0(2,3)]]
  1201. 151.15 s > field value
  1202. 151.15 s > span warm_up{integrand.name=se1l_mur_shifted}
  1203. 151.15 s > [2026-08-28 12:21:23.050] @process::amplitude WARNING : External state 0 ('g', PDG 21, helicity +) is off shell: p^2 = +2.5e5, expected m^2 = +0e0 (|Δ| = +2.5e5). Fixed-helicity spinor/vector/tensor external states may be ill-defined at this kinematic point.
  1204. 151.15 s > field value
  1205. 151.15 s > span warm_up{integrand.name=se1l}
  1206. 151.15 s > [2026-08-28 12:21:23.050] @process::amplitude WARNING : External state 1 ('g', PDG 21, helicity -) is off shell: p^2 = +2.5e5, expected m^2 = +0e0 (|Δ| = +2.5e5). Fixed-helicity spinor/vector/tensor external states may be ill-defined at this kinematic point.
  1207. 151.15 s > field value
  1208. 151.15 s > span warm_up{integrand.name=se1l}
  1209. 151.15 s > [2026-08-28 12:21:23.051] @process::amplitude INFO : Input is above threshold: 1 existing threshold E-surfaces across 1/1 graph groups
  1210. 151.15 s > field value
  1211. 151.15 s > existing_esurfaces 1
  1212. 151.15 s > group_count 1
  1213. 151.15 s > groups_above_threshold 1
  1214. 151.15 s > integrand se1l
  1215. 151.15 s > span warm_up{integrand.name=se1l}
  1216. 151.15 s > threshold_status above threshold
  1217. 151.15 s > [2026-08-28 12:21:23.051] @process::amplitude INFO : overlap structure of group 0: [1: [0(2,3)]]
  1218. 151.15 s > field value
  1219. 151.15 s > span warm_up{integrand.name=se1l}
  1220. 151.15 s > [2026-08-28 12:21:23.055] @process::amplitude WARNING : External state 0 ('g', PDG 21, helicity +) is off shell: p^2 = +2.5e5, expected m^2 = +0e0 (|Δ| = +2.5e5). Fixed-helicity spinor/vector/tensor external states may be ill-defined at this kinematic point.
  1221. 151.15 s > field value
  1222. 151.15 s > span warm_up{integrand.name=se1l_mur_shifted}
  1223. 151.15 s > [2026-08-28 12:21:23.055] @process::amplitude WARNING : External state 1 ('g', PDG 21, helicity -) is off shell: p^2 = +2.5e5, expected m^2 = +0e0 (|Δ| = +2.5e5). Fixed-helicity spinor/vector/tensor external states may be ill-defined at this kinematic point.
  1224. 151.15 s > field value
  1225. 151.15 s > span warm_up{integrand.name=se1l_mur_shifted}
  1226. 151.15 s > [2026-08-28 12:21:23.055] @process::amplitude INFO : Input is above threshold: 1 existing threshold E-surfaces across 1/1 graph groups
  1227. 151.15 s > field value
  1228. 151.15 s > existing_esurfaces 1
  1229. 151.15 s > group_count 1
  1230. 151.15 s > groups_above_threshold 1
  1231. 151.15 s > integrand se1l_mur_shifted
  1232. 151.15 s > span warm_up{integrand.name=se1l_mur_shifted}
  1233. 151.15 s > threshold_status above threshold
  1234. 151.15 s > [2026-08-28 12:21:23.055] @process::amplitude INFO : overlap structure of group 0: [1: [0(2,3)]]
  1235. 151.15 s > field value
  1236. 151.15 s > span warm_up{integrand.name=se1l_mur_shifted}
  1237. 151.15 s > The application panicked (crashed).
  1238. 151.15 s > Message: Integrated UV case failed: se1l
  1239. 151.15 s > Location: tests/tests/uv.rs:1068
  1240. 151.15 s >
  1241. 151.15 s > ━━━━━━━━━━━━━━━━━━━━━━━━━━━━━━━━━━ BACKTRACE ━━━━━━━━━━━━━━━━━━━━━━━━━━━━━━━━━━━
  1242. 151.15 s > 1: <color_eyre[51793ea62743adbd]::config::PanicHook>::panic_report<unknown>
  1243. 151.15 s > at <unknown source file>:<unknown line>
  1244. 151.15 s > 2: <color_eyre[51793ea62743adbd]::config::PanicHook>::into_panic_hook::{closure#0}<unknown>
  1245. 151.15 s > at <unknown source file>:<unknown line>
  1246. 151.15 s > 3: std[bcb96dfbba0ab899]::panicking::panic_with_hook<unknown>
  1247. 151.15 s > at <unknown source file>:<unknown line>
  1248. 151.15 s > 4: std[bcb96dfbba0ab899]::panicking::panic_handler::{closure#0}<unknown>
  1249. 151.15 s > at <unknown source file>:<unknown line>
  1250. 151.15 s > 5: std[bcb96dfbba0ab899]::sys::backtrace::__rust_end_short_backtrace::<std[bcb96dfbba0ab899]::panicking::panic_handler::{closure#0}, !><unknown>
  1251. 151.15 s > at <unknown source file>:<unknown line>
  1252. 151.15 s > 6: __rustc[6c289b9f9c454d21]::rust_begin_unwind<unknown>
  1253. 151.15 s > at <unknown source file>:<unknown line>
  1254. 151.15 s > 7: core[940e698046960fd5]::panicking::panic_fmt<unknown>
  1255. 151.15 s > at <unknown source file>:<unknown line>
  1256. 151.15 s > 8: uv[52cf2b63f0104e31]::run_single_integrated_uv_case<unknown>
  1257. 151.15 s > at <unknown source file>:<unknown line>
  1258. 151.15 s > 9: <uv[52cf2b63f0104e31]::se1l_uv::{closure#0} as core[940e698046960fd5]::ops::function::FnOnce<()>>::call_once<unknown>
  1259. 151.15 s > at <unknown source file>:<unknown line>
  1260. 151.15 s > 10: test[75d6903177b1d7e9]::__rust_begin_short_backtrace::<core[940e698046960fd5]::result::Result<(), alloc[2ea6bcb46fca0c42]::string::String>, fn() -> core[940e698046960fd5]::result::Result<(), alloc[2ea6bcb46fca0c42]::string::String>><unknown>
  1261. 151.15 s > at <unknown source file>:<unknown line>
  1262. 151.15 s > 11: test[75d6903177b1d7e9]::run_test::{closure#0}<unknown>
  1263. 151.15 s > at <unknown source file>:<unknown line>
  1264. 151.15 s > 12: std[bcb96dfbba0ab899]::sys::backtrace::__rust_begin_short_backtrace::<test[75d6903177b1d7e9]::run_test::{closure#1}, ()><unknown>
  1265. 151.15 s > at <unknown source file>:<unknown line>
  1266. 151.15 s > 13: <std[bcb96dfbba0ab899]::thread::lifecycle::spawn_unchecked<test[75d6903177b1d7e9]::run_test::{closure#1}, ()>::{closure#1} as core[940e698046960fd5]::ops::function::FnOnce<()>>::call_once::{shim:vtable#0}<unknown>
  1267. 151.15 s > at <unknown source file>:<unknown line>
  1268. 151.15 s > 14: <std[bcb96dfbba0ab899]::sys::thread::unix::Thread>::new::thread_start<unknown>
  1269. 151.15 s > at <unknown source file>:<unknown line>
  1270. 151.15 s > 15: start_thread<unknown>
  1271. 151.15 s > at <unknown source file>:<unknown line>
  1272. 151.15 s > 16: __clone3<unknown>
  1273. 151.15 s > at <unknown source file>:<unknown line>
  1274. 151.15 s >
  1275. 151.15 s > Run with COLORBT_SHOW_HIDDEN=1 environment variable to disable frame filtering.
  1276. 151.15 s > Run with RUST_BACKTRACE=full to include source snippets.
  1277. 151.15 s >
  1278. 151.15 s > error: test run failed
  1279. 151.15 s >
  1280. 151.15 s > ========== nextest test summary ==========
  1281. 151.15 s > report: target/nextest/ci_gammaloop/junit.xml
  1282. 151.15 s > tests: 106, failures: 9, errors: 0
  1283. 151.15 s >
  1284. 151.15 s > 1. gammaloop-integration-tests::test_runs::approach::approach_momentum_space_reports_incomplete_triplet_cleanly
  1285. 151.15 s > failure: test failure with exit code 101
  1286. 151.15 s > system-out
  1287. 151.15 s > running 1 test
  1288. 151.15 s > test approach::approach_momentum_space_reports_incomplete_triplet_cleanly ... FAILED
  1289. 151.15 s >
  1290. 151.15 s > failures:
  1291. 151.15 s >
  1292. 151.15 s > failures:
  1293. 151.15 s > approach::approach_momentum_space_reports_incomplete_triplet_cleanly
  1294. 151.15 s >
  1295. 151.15 s > test result: FAILED. 0 passed; 1 failed; 0 ignored; 0 measured; 82 filtered out; finished in 0.85s
  1296. 151.15 s > system-err
  1297. 151.15 s > [2026-08-28 12:19:14.127] @gammaloop_api::se... INFO : Running command import model scalars-default.json
  1298. 151.15 s > [2026-08-28 12:19:14.127] @import::model INFO : Loading built-in JSON model scalars-default
  1299. 151.15 s > [2026-08-28 12:19:14.133] @gammalooprs::model INFO : The following 2 external parameters were forced to zero by the restriction card:
  1300. 151.15 s > width_scalar_1, width_scalar_2
  1301. 151.15 s > [2026-08-28 12:19:14.134] @gammaloop_api::se... INFO : Running command remove processes
  1302. 151.15 s > [2026-08-28 12:19:14.135] @gammaloop_api::se... INFO : Running command generate amp scalar_1 > scalar_0 scalar_0 [{1}] --allowed-vertex-interactions V_3_SCALAR_022 V_3_SCALAR_122 -p triangle -i scalar_tri
  1303. 151.15 s > [2026-08-28 12:19:14.137] @feyngen::diagram_... INFO : 0s | Δ=0s | Starting Feynman graph generation with Symbolica...
  1304. 151.15 s > [2026-08-28 12:19:14.137] @feyngen::diagram_... INFO : 0s | Δ=0s | Number of graphs resulting from Symbolica generation: 1
  1305. 151.15 s > [2026-08-28 12:19:14.137] @feyngen::diagram_... INFO : 0s | Δ=0s | Number of graphs retained after removal of vetoed topologies: 1
  1306. 151.15 s > [2026-08-28 12:19:14.140] @feyngen::diagram_... INFO : 0s | Δ=0s | Number of graphs after vertex info assignment: 1
  1307. 151.15 s > [2026-08-28 12:19:14.140] @feyngen::diagram_... INFO : 0s | Δ=0s | Number of graphs after all complete graphs filters are applied: 1
  1308. 151.15 s > [2026-08-28 12:19:14.143] @feyngen::diagram_... INFO : 0s | Δ=0s | Number of graphs after closed fermion chains analysis: 1
  1309. 151.15 s > [2026-08-28 12:19:14.143] @feyngen::diagram_... INFO : 0s | Δ=0s | Number of graphs after symmetrization of external states: 1
  1310. 151.15 s > [2026-08-28 12:19:14.145] @feyngen::diagram_... INFO : 0s | Δ=0s | Number of graphs after canonization of vertices, edges and flows (graph labels assigned here): 1
  1311. 151.15 s > [2026-08-28 12:19:14.166] @feyngen::diagram_... INFO : 0s | Δ=0s | Number of graphs after numerator-aware grouping with strategy 'up to a scalar rescaling': 1 (1 isomorphically unique graph, 0 color zero, 0 lorentz zero, 0 grouped and 0 cancellation)
  1312. 151.15 s > [2026-08-28 12:19:14.166] @feyngen::diagram_... INFO : ( Sum of the symmetry factors from each graph generated = 1 )
  1313. 151.15 s > [2026-08-28 12:19:14.166] @commands::generate INFO : Generated amplitude 1 graphs.
  1314. 151.15 s > [2026-08-28 12:19:14.236] @settings::runtime WARNING : No external kinematics were provided; using default-generated external momenta and helicities.
  1315. 151.15 s > [2026-08-28 12:19:14.275] @commands::generate INFO :
  1316. 151.15 s > Integrand generation summary
  1317. 151.15 s > peak RAM 65.09 MiB | cores 1
  1318. 151.15 s > ╭────────────┬───────┬─────────┬────────────┬───────────┬────────────────┬─────────────╮
  1319. 151.15 s > │ integrand │ graph │ # evals │ expr build │ spenso │ symbolica eval │ compile │
  1320. 151.15 s > ├────────────┼───────┼─────────┼────────────┼───────────┼────────────────┼─────────────┤
  1321. 151.15 s > │ scalar_tri │ GL0 │ 9 │ 36ms (59%) │ 6ms (10%) │ 18ms (31%) │ 0ms (0.00%) │
  1322. 151.15 s > ├────────────┼───────┼─────────┼────────────┼───────────┼────────────────┼─────────────┤
  1323. 151.15 s > │ Total │ │ 9 │ 36ms (59%) │ 6ms (10%) │ 18ms (31%) │ 0ms (0.00%) │
  1324. 151.15 s > ╰────────────┴───────┴─────────┴────────────┴───────────┴────────────────┴─────────────╯
  1325. 151.15 s > [2026-08-28 12:19:14.277] @gammaloop_api::se... INFO : Running command generate amp scalar_0 scalar_0 > scalar_0 scalar_0 [{1}] --allowed-vertex-interactions V_3_SCALAR_022 -p box -i scalar_box --select-graphs GL0
  1326. 151.15 s > [2026-08-28 12:19:14.282] @feyngen::diagram_... INFO : 0s | Δ=0s | Starting Feynman graph generation with Symbolica...
  1327. 151.15 s > [2026-08-28 12:19:14.282] @feyngen::diagram_... INFO : 0s | Δ=0s | Number of graphs resulting from Symbolica generation: 3
  1328. 151.15 s > [2026-08-28 12:19:14.284] @feyngen::diagram_... INFO : 0s | Δ=0s | Number of graphs retained after removal of vetoed topologies: 3
  1329. 151.15 s > [2026-08-28 12:19:14.285] @feyngen::diagram_... INFO : 0s | Δ=0s | Number of graphs after vertex info assignment: 3
  1330. 151.15 s > [2026-08-28 12:19:14.285] @feyngen::diagram_... INFO : 0s | Δ=0s | Number of graphs after all complete graphs filters are applied: 3
  1331. 151.15 s > [2026-08-28 12:19:14.285] @feyngen::diagram_... INFO : 0s | Δ=0s | Number of graphs after closed fermion chains analysis: 3
  1332. 151.15 s > [2026-08-28 12:19:14.285] @feyngen::diagram_... INFO : 0s | Δ=0s | Number of graphs after symmetrization of external states: 3
  1333. 151.15 s > [2026-08-28 12:19:14.286] @feyngen::diagram_... INFO : 0s | Δ=0s | Number of graphs after canonization of vertices, edges and flows (graph labels assigned here): 3
  1334. 151.15 s > [2026-08-28 12:19:14.310] @feyngen::diagram_... INFO : 0s | Δ=0s | Number of graphs after numerator-aware grouping with strategy 'up to a scalar rescaling': 1 (1 isomorphically unique graph, 0 color zero, 0 lorentz zero, 0 grouped and 0 cancellation)
  1335. 151.15 s > [2026-08-28 12:19:14.310] @feyngen::diagram_... INFO : ( Sum of the symmetry factors from each graph generated = 1 )
  1336. 151.15 s > [2026-08-28 12:19:14.310] @commands::generate INFO : Generated amplitude 1 graphs.
  1337. 151.15 s > [2026-08-28 12:19:14.451] @settings::runtime WARNING : No external kinematics were provided; using default-generated external momenta and helicities.
  1338. 151.15 s > [2026-08-28 12:19:14.525] @commands::generate INFO :
  1339. 151.15 s > Integrand generation summary
  1340. 151.15 s > peak RAM 68.96 MiB | cores 1
  1341. 151.15 s > ╭────────────┬───────┬─────────┬────────────┬──────────────┬────────────────┬─────────────╮
  1342. 151.15 s > │ integrand │ graph │ # evals │ expr build │ spenso │ symbolica eval │ compile │
  1343. 151.15 s > ├────────────┼───────┼─────────┼────────────┼──────────────┼────────────────┼─────────────┤
  1344. 151.15 s > │ scalar_box │ GL0 │ 13 │ 74ms (54%) │ 13ms (10.0%) │ 49ms (36%) │ 0ms (0.00%) │
  1345. 151.15 s > ├────────────┼───────┼─────────┼────────────┼──────────────┼────────────────┼─────────────┤
  1346. 151.15 s > │ Total │ │ 13 │ 74ms (54%) │ 13ms (10.0%) │ 49ms (36%) │ 0ms (0.00%) │
  1347. 151.15 s > ╰────────────┴───────┴─────────┴────────────┴──────────────┴────────────────┴─────────────╯
  1348. 151.15 s > [2026-08-28 12:19:14.526] @gammaloop_api::se... INFO : Running command generate
  1349. 151.15 s > [2026-08-28 12:19:14.660] @settings::runtime WARNING : No external kinematics were provided; using default-generated external momenta and helicities.
  1350. 151.15 s > [2026-08-28 12:19:14.718] @settings::runtime WARNING : No external kinematics were provided; using default-generated external momenta and helicities.
  1351. 151.15 s > [2026-08-28 12:19:14.756] @commands::generate INFO :
  1352. 151.15 s > Integrand generation summary
  1353. 151.15 s > peak RAM 70.04 MiB | cores 1
  1354. 151.15 s > ╭────────────┬───────┬─────────┬─────────────┬─────────────┬────────────────┬─────────────╮
  1355. 151.15 s > │ integrand │ graph │ # evals │ expr build │ spenso │ symbolica eval │ compile │
  1356. 151.15 s > ├────────────┼───────┼─────────┼─────────────┼─────────────┼────────────────┼─────────────┤
  1357. 151.15 s > │ scalar_tri │ GL0 │ 9 │ 17ms (60%) │ 2ms (9.3%) │ 9ms (31%) │ 0ms (0.00%) │
  1358. 151.15 s > │ scalar_box │ GL0 │ 13 │ 98ms (64%) │ 12ms (8.0%) │ 43ms (28%) │ 0ms (0.00%) │
  1359. 151.15 s > ├────────────┼───────┼─────────┼─────────────┼─────────────┼────────────────┼─────────────┤
  1360. 151.15 s > │ Total │ │ 22 │ 115ms (63%) │ 15ms (8.2%) │ 53ms (29%) │ 0ms (0.00%) │
  1361. 151.15 s > ╰────────────┴───────┴─────────┴─────────────┴─────────────┴────────────────┴─────────────╯
  1362. 151.15 s > [2026-08-28 12:19:14.757] @gammaloop_api::se... INFO : Running command set model mass_scalar_2=2.0
  1363. 151.15 s > [2026-08-28 12:19:14.758] @gammaloop_api::se... INFO : Running command set model mass_scalar_1=1.0
  1364. 151.15 s > [2026-08-28 12:19:14.759] @gammaloop_api::se... INFO : Running command set process -p triangle -i scalar_tri string '
  1365. 151.15 s > [kinematics.externals]
  1366. 151.15 s > type = "constant"
  1367. 151.15 s >
  1368. 151.15 s > [kinematics.externals.data]
  1369. 151.15 s > [...]
  1370. 151.15 s > [2026-08-28 12:19:14.763] @gammaloop_api::se... INFO : Running command set process -p box -i scalar_box string '
  1371. 151.15 s > [kinematics.externals]
  1372. 151.15 s > type = "constant"
  1373. 151.15 s >
  1374. 151.15 s > [kinematics.externals.data]
  1375. 151.15 s > [...]
  1376. 151.15 s > [2026-08-28 12:19:14.764] @gammaloop_api::se... INFO : Running command approach -x 1.0000000000000001e-1,2.0000000000000001e-1,2.9999999999999999e-1,4.0000000000000002e-1 --approach-axis 1.0000000000000000e-3,0.0000000000000000e0,0.0000000000000000e0,0.0000000000000000e0 --n-points 1 --n-cores 1 --output-results /build/source/tests/artifacts/scalar_box_invalid_momentum_approach/approach_momentum.json --momentum-space --graph-id 0
  1377. 151.15 s > The application panicked (crashed).
  1378. 151.15 s > Message: There are 2 processes available. Please specify a process.
  1379. 151.15 s > Location: tests/tests/test_runs/approach.rs:332
  1380. 151.15 s >
  1381. 151.15 s > ━━━━━━━━━━━━━━━━━━━━━━━━━━━━━━━━━━ BACKTRACE ━━━━━━━━━━━━━━━━━━━━━━━━━━━━━━━━━━━
  1382. 151.15 s > 1: <color_eyre[51793ea62743adbd]::config::PanicHook>::panic_report<unknown>
  1383. 151.15 s > at <unknown source file>:<unknown line>
  1384. 151.15 s > 2: <color_eyre[51793ea62743adbd]::config::PanicHook>::into_panic_hook::{closure#0}<unknown>
  1385. 151.15 s > at <unknown source file>:<unknown line>
  1386. 151.15 s > 3: std[bcb96dfbba0ab899]::panicking::panic_with_hook<unknown>
  1387. 151.15 s > at <unknown source file>:<unknown line>
  1388. 151.15 s > 4: std[bcb96dfbba0ab899]::panicking::panic_handler::{closure#0}<unknown>
  1389. 151.15 s > at <unknown source file>:<unknown line>
  1390. 151.15 s > 5: std[bcb96dfbba0ab899]::sys::backtrace::__rust_end_short_backtrace::<std[bcb96dfbba0ab899]::panicking::panic_handler::{closure#0}, !><unknown>
  1391. 151.15 s > at <unknown source file>:<unknown line>
  1392. 151.15 s > 6: __rustc[6c289b9f9c454d21]::rust_begin_unwind<unknown>
  1393. 151.15 s > at <unknown source file>:<unknown line>
  1394. 151.15 s > 7: core[940e698046960fd5]::panicking::panic_fmt<unknown>
  1395. 151.15 s > at <unknown source file>:<unknown line>
  1396. 151.15 s > 8: test_runs[3e7a390caee4e338]::approach::approach_momentum_space_reports_incomplete_triplet_cleanly<unknown>
  1397. 151.15 s > at <unknown source file>:<unknown line>
  1398. 151.15 s > 9: <test_runs[3e7a390caee4e338]::approach::approach_momentum_space_reports_incomplete_triplet_cleanly::{closure#0} as core[940e698046960fd5]::ops::function::FnOnce<()>>::call_once<unknown>
  1399. 151.15 s > at <unknown source file>:<unknown line>
  1400. 151.15 s > 10: test[75d6903177b1d7e9]::__rust_begin_short_backtrace::<core[940e698046960fd5]::result::Result<(), alloc[2ea6bcb46fca0c42]::string::String>, fn() -> core[940e698046960fd5]::result::Result<(), alloc[2ea6bcb46fca0c42]::string::String>><unknown>
  1401. 151.15 s > at <unknown source file>:<unknown line>
  1402. 151.15 s > 11: test[75d6903177b1d7e9]::run_test::{closure#0}<unknown>
  1403. 151.15 s > at <unknown source file>:<unknown line>
  1404. 151.15 s > 12: std[bcb96dfbba0ab899]::sys::backtrace::__rust_begin_short_backtrace::<test[75d6903177b1d7e9]::run_test::{closure#1}, ()><unknown>
  1405. 151.15 s > at <unknown source file>:<unknown line>
  1406. 151.15 s > 13: <std[bcb96dfbba0ab899]::thread::lifecycle::spawn_unchecked<test[75d6903177b1d7e9]::run_test::{closure#1}, ()>::{closure#1} as core[940e698046960fd5]::ops::function::FnOnce<()>>::call_once::{shim:vtable#0}<unknown>
  1407. 151.15 s > at <unknown source file>:<unknown line>
  1408. 151.15 s > 14: <std[bcb96dfbba0ab899]::sys::thread::unix::Thread>::new::thread_start<unknown>
  1409. 151.15 s > at <unknown source file>:<unknown line>
  1410. 151.15 s > 15: start_thread<unknown>
  1411. 151.15 s > at <unknown source file>:<unknown line>
  1412. 151.15 s > 16: __clone3<unknown>
  1413. 151.15 s > at <unknown source file>:<unknown line>
  1414. 151.15 s >
  1415. 151.15 s > Run with COLORBT_SHOW_HIDDEN=1 environment variable to disable frame filtering.
  1416. 151.15 s > ... omitted 1 more lines; see full nextest output above
  1417. 151.15 s >
  1418. 151.15 s > 2. gammaloop-integration-tests::test_runs::profile_bulk::box_4e_bulk_profile_passes
  1419. 151.15 s > failure: test failure with exit code 101
  1420. 151.15 s > Error:
  1421. 151.15 s > 0: IR profiling requested arbitrary precision but received a quad-precision result
  1422. 151.15 s >
  1423. 151.15 s > Location:
  1424. 151.15 s > crates/gammalooprs/src/integrands/process/ir.rs:2123
  1425. 151.15 s >
  1426. 151.15 s > ━━━━━━━━━━━━━━━━━━━━━━━━━━━━━━━━━━ BACKTRACE ━━━━━━━━━━━━━━━━━━━━━━━━━━━━━━━━━━━
  1427. 151.15 s > 1: <color_eyre[51793ea62743adbd]::config::EyreHook>::into_eyre_hook::{closure#0}<unknown>
  1428. 151.15 s > at <unknown source file>:<unknown line>
  1429. 151.15 s > 2: eyre[cb2fd339c0c40fca]::capture_handler<unknown>
  1430. 151.15 s > at <unknown source file>:<unknown line>
  1431. 151.15 s > 3: eyre[cb2fd339c0c40fca]::private::format_err<unknown>
  1432. 151.15 s > at <unknown source file>:<unknown line>
  1433. 151.15 s > 4: gammalooprs[d7a7c067ebd19583]::integrands::process::ir::evaluate_profile_momentum_point_arb::<gammalooprs[d7a7c067ebd19583]::integrands::process::amplitude::AmplitudeIntegrand><unknown>
  1434. 151.15 s > at <unknown source file>:<unknown line>
  1435. 151.15 s > 5: <gammalooprs[d7a7c067ebd19583]::integrands::process::amplitude::AmplitudeIntegrand>::test_single_ir_limit_impl<unknown>
  1436. 151.15 s > at <unknown source file>:<unknown line>
  1437. 151.15 s > 6: gammalooprs[d7a7c067ebd19583]::integrands::process::ir::run_ir_profile::<gammalooprs[d7a7c067ebd19583]::integrands::process::amplitude::AmplitudeIntegrand, <gammalooprs[d7a7c067ebd19583]::integrands::process::amplitude::AmplitudeIntegrand>::enumerate_ir_limits, <gammalooprs[d7a7c067ebd19583]::integrands::process::amplitude::AmplitudeIntegrand>::graph_cut_definitions, <gammalooprs[d7a7c067ebd19583]::integrands::process::amplitude::AmplitudeIntegrand>::test_single_ir_limit_impl><unknown>
  1438. 151.15 s > at <unknown source file>:<unknown line>
  1439. 151.15 s > 7: <gammalooprs[d7a7c067ebd19583]::integrands::process::amplitude::AmplitudeIntegrand>::test_ir<unknown>
  1440. 151.15 s > at <unknown source file>:<unknown line>
  1441. 151.15 s > 8: <gammaloop_api[92ae732909e47e14]::commands::profile::Profile>::run<unknown>
  1442. 151.15 s > at <unknown source file>:<unknown line>
  1443. 151.15 s > 9: test_runs[3e7a390caee4e338]::profile_bulk::box_4e_bulk_profile_passes<unknown>
  1444. 151.15 s > at <unknown source file>:<unknown line>
  1445. 151.15 s > 10: <test_runs[3e7a390caee4e338]::profile_bulk::box_4e_bulk_profile_passes::{closure#0} as core[940e698046960fd5]::ops::function::FnOnce<()>>::call_once<unknown>
  1446. 151.15 s > at <unknown source file>:<unknown line>
  1447. 151.15 s > 11: test[75d6903177b1d7e9]::__rust_begin_short_backtrace::<core[940e698046960fd5]::result::Result<(), alloc[2ea6bcb46fca0c42]::string::String>, fn() -> core[940e698046960fd5]::result::Result<(), alloc[2ea6bcb46fca0c42]::string::String>><unknown>
  1448. 151.15 s > at <unknown source file>:<unknown line>
  1449. 151.15 s > 12: test[75d6903177b1d7e9]::run_test::{closure#0}<unknown>
  1450. 151.15 s > at <unknown source file>:<unknown line>
  1451. 151.15 s > 13: std[bcb96dfbba0ab899]::sys::backtrace::__rust_begin_short_backtrace::<test[75d6903177b1d7e9]::run_test::{closure#1}, ()><unknown>
  1452. 151.15 s > at <unknown source file>:<unknown line>
  1453. 151.15 s > 14: <std[bcb96dfbba0ab899]::thread::lifecycle::spawn_unchecked<test[75d6903177b1d7e9]::run_test::{closure#1}, ()>::{closure#1} as core[940e698046960fd5]::ops::function::FnOnce<()>>::call_once::{shim:vtable#0}<unknown>
  1454. 151.15 s > at <unknown source file>:<unknown line>
  1455. 151.15 s > 15: <std[bcb96dfbba0ab899]::sys::thread::unix::Thread>::new::thread_start<unknown>
  1456. 151.15 s > at <unknown source file>:<unknown line>
  1457. 151.15 s > 16: start_thread<unknown>
  1458. 151.15 s > at <unknown source file>:<unknown line>
  1459. 151.15 s > 17: __clone3<unknown>
  1460. 151.15 s > at <unknown source file>:<unknown line>
  1461. 151.15 s >
  1462. 151.15 s > Run with COLORBT_SHOW_HIDDEN=1 environment variable to disable frame filtering.
  1463. 151.15 s > Run with RUST_BACKTRACE=full to include source snippets.
  1464. 151.15 s > Warning: SpanTrace capture is Unsupported.
  1465. 151.15 s > Ensure that you've setup a tracing-error ErrorLayer and the semver versions are compatible
  1466. 151.15 s > system-out
  1467. 151.15 s > running 1 test
  1468. 151.15 s > test profile_bulk::box_4e_bulk_profile_passes ... FAILED
  1469. 151.15 s >
  1470. 151.15 s > failures:
  1471. 151.15 s >
  1472. 151.15 s > failures:
  1473. 151.15 s > profile_bulk::box_4e_bulk_profile_passes
  1474. 151.15 s >
  1475. 151.15 s > test result: FAILED. 0 passed; 1 failed; 0 ignored; 0 measured; 82 filtered out; finished in 0.53s
  1476. 151.15 s > system-err
  1477. 151.15 s > [2026-08-28 12:19:17.337] @gammaloop_api::se... INFO : Running command import model ./assets/models/json/scalars/scalars.json
  1478. 151.15 s > [2026-08-28 12:19:17.337] @import::model INFO : Loading JSON model scalars-default from /build/source/assets/models/json/scalars/scalars
  1479. 151.15 s > [2026-08-28 12:19:17.344] @gammalooprs::model INFO : The following 2 external parameters were forced to zero by the restriction card:
  1480. 151.15 s > width_scalar_1, width_scalar_2
  1481. 151.15 s > [2026-08-28 12:19:17.345] @gammaloop_api::se... INFO : Running command import graphs ./tests/resources/graphs/massless_box.dot
  1482. 151.15 s > [2026-08-28 12:19:17.345] @commands::import INFO : Loading graphs from '/build/source/tests/resources/graphs/massless_box.dot'
  1483. 151.15 s > [2026-08-28 12:19:17.354] @gammaloop_api::se... INFO : Running command generate
  1484. 151.15 s > [2026-08-28 12:19:17.564] @commands::generate INFO :
  1485. 151.15 s > Integrand generation summary
  1486. 151.15 s > peak RAM 66.35 MiB | cores 1
  1487. 151.15 s > ╭───────────┬────────────────┬─────────┬─────────────┬────────────┬────────────────┬─────────────╮
  1488. 151.15 s > │ integrand │ graph │ # evals │ expr build │ spenso │ symbolica eval │ compile │
  1489. 151.15 s > ├───────────┼────────────────┼─────────┼─────────────┼────────────┼────────────────┼─────────────┤
  1490. 151.15 s > │ default │ massless_box_0 │ 14 │ 131ms (79%) │ 20ms (12%) │ 14ms (8.6%) │ 0ms (0.00%) │
  1491. 151.15 s > ├───────────┼────────────────┼─────────┼─────────────┼────────────┼────────────────┼─────────────┤
  1492. 151.15 s > │ Total │ │ 14 │ 131ms (79%) │ 20ms (12%) │ 14ms (8.6%) │ 0ms (0.00%) │
  1493. 151.15 s > ╰───────────┴────────────────┴─────────┴─────────────┴────────────┴────────────────┴─────────────╯
  1494. 151.15 s > [2026-08-28 12:19:17.574] @process::amplitude INFO : Input is above threshold: 4 existing threshold E-surfaces across 1/1 graph groups
  1495. 151.15 s > [2026-08-28 12:19:17.577] @process::amplitude INFO : overlap structure of group 0: [2: [4(3,4), 8(4,6)], 2: [9(3,5), 11(5,6)], 2: [4(3,4), 9(3,5)], 2: [8(4,6), 11(5,6)]]
  1496. 151.15 s > Error:
  1497. 151.15 s > 0: IR profiling requested arbitrary precision but received a quad-precision result
  1498. 151.15 s >
  1499. 151.15 s > Location:
  1500. 151.15 s > crates/gammalooprs/src/integrands/process/ir.rs:2123
  1501. 151.15 s >
  1502. 151.15 s > ━━━━━━━━━━━━━━━━━━━━━━━━━━━━━━━━━━ BACKTRACE ━━━━━━━━━━━━━━━━━━━━━━━━━━━━━━━━━━━
  1503. 151.15 s > 1: <color_eyre[51793ea62743adbd]::config::EyreHook>::into_eyre_hook::{closure#0}<unknown>
  1504. 151.15 s > at <unknown source file>:<unknown line>
  1505. 151.15 s > 2: eyre[cb2fd339c0c40fca]::capture_handler<unknown>
  1506. 151.15 s > at <unknown source file>:<unknown line>
  1507. 151.15 s > 3: eyre[cb2fd339c0c40fca]::private::format_err<unknown>
  1508. 151.15 s > at <unknown source file>:<unknown line>
  1509. 151.15 s > 4: gammalooprs[d7a7c067ebd19583]::integrands::process::ir::evaluate_profile_momentum_point_arb::<gammalooprs[d7a7c067ebd19583]::integrands::process::amplitude::AmplitudeIntegrand><unknown>
  1510. 151.15 s > at <unknown source file>:<unknown line>
  1511. 151.15 s > 5: <gammalooprs[d7a7c067ebd19583]::integrands::process::amplitude::AmplitudeIntegrand>::test_single_ir_limit_impl<unknown>
  1512. 151.15 s > at <unknown source file>:<unknown line>
  1513. 151.15 s > 6: gammalooprs[d7a7c067ebd19583]::integrands::process::ir::run_ir_profile::<gammalooprs[d7a7c067ebd19583]::integrands::process::amplitude::AmplitudeIntegrand, <gammalooprs[d7a7c067ebd19583]::integrands::process::amplitude::AmplitudeIntegrand>::enumerate_ir_limits, <gammalooprs[d7a7c067ebd19583]::integrands::process::amplitude::AmplitudeIntegrand>::graph_cut_definitions, <gammalooprs[d7a7c067ebd19583]::integrands::process::amplitude::AmplitudeIntegrand>::test_single_ir_limit_impl><unknown>
  1514. 151.15 s > at <unknown source file>:<unknown line>
  1515. 151.15 s > 7: <gammalooprs[d7a7c067ebd19583]::integrands::process::amplitude::AmplitudeIntegrand>::test_ir<unknown>
  1516. 151.15 s > at <unknown source file>:<unknown line>
  1517. 151.15 s > 8: <gammaloop_api[92ae732909e47e14]::commands::profile::Profile>::run<unknown>
  1518. 151.15 s > at <unknown source file>:<unknown line>
  1519. 151.15 s > 9: test_runs[3e7a390caee4e338]::profile_bulk::box_4e_bulk_profile_passes<unknown>
  1520. 151.15 s > at <unknown source file>:<unknown line>
  1521. 151.15 s > 10: <test_runs[3e7a390caee4e338]::profile_bulk::box_4e_bulk_profile_passes::{closure#0} as core[940e698046960fd5]::ops::function::FnOnce<()>>::call_once<unknown>
  1522. 151.15 s > at <unknown source file>:<unknown line>
  1523. 151.15 s > 11: test[75d6903177b1d7e9]::__rust_begin_short_backtrace::<core[940e698046960fd5]::result::Result<(), alloc[2ea6bcb46fca0c42]::string::String>, fn() -> core[940e698046960fd5]::result::Result<(), alloc[2ea6bcb46fca0c42]::string::String>><unknown>
  1524. 151.15 s > at <unknown source file>:<unknown line>
  1525. 151.15 s > 12: test[75d6903177b1d7e9]::run_test::{closure#0}<unknown>
  1526. 151.15 s > at <unknown source file>:<unknown line>
  1527. 151.15 s > 13: std[bcb96dfbba0ab899]::sys::backtrace::__rust_begin_short_backtrace::<test[75d6903177b1d7e9]::run_test::{closure#1}, ()><unknown>
  1528. 151.15 s > at <unknown source file>:<unknown line>
  1529. 151.15 s > 14: <std[bcb96dfbba0ab899]::thread::lifecycle::spawn_unchecked<test[75d6903177b1d7e9]::run_test::{closure#1}, ()>::{closure#1} as core[940e698046960fd5]::ops::function::FnOnce<()>>::call_once::{shim:vtable#0}<unknown>
  1530. 151.15 s > at <unknown source file>:<unknown line>
  1531. 151.15 s > 15: <std[bcb96dfbba0ab899]::sys::thread::unix::Thread>::new::thread_start<unknown>
  1532. 151.15 s > at <unknown source file>:<unknown line>
  1533. 151.15 s > 16: start_thread<unknown>
  1534. 151.15 s > at <unknown source file>:<unknown line>
  1535. 151.15 s > 17: __clone3<unknown>
  1536. 151.15 s > at <unknown source file>:<unknown line>
  1537. 151.15 s >
  1538. 151.15 s > Run with COLORBT_SHOW_HIDDEN=1 environment variable to disable frame filtering.
  1539. 151.15 s > Run with RUST_BACKTRACE=full to include source snippets.
  1540. 151.15 s > Warning: SpanTrace capture is Unsupported.
  1541. 151.15 s > Ensure that you've setup a tracing-error ErrorLayer and the semver versions are compatible
  1542. 151.15 s >
  1543. 151.15 s > 3. gammaloop-integration-tests::test_runs::profile_bulk::dotted_bubble_amp_bulk_profile_passes
  1544. 151.15 s > failure: test failure with exit code 101
  1545. 151.15 s > Error:
  1546. 151.15 s > 0: IR profiling requested arbitrary precision but received a quad-precision result
  1547. 151.15 s >
  1548. 151.15 s > Location:
  1549. 151.15 s > crates/gammalooprs/src/integrands/process/ir.rs:2123
  1550. 151.15 s >
  1551. 151.15 s > ━━━━━━━━━━━━━━━━━━━━━━━━━━━━━━━━━━ BACKTRACE ━━━━━━━━━━━━━━━━━━━━━━━━━━━━━━━━━━━
  1552. 151.15 s > 1: <color_eyre[51793ea62743adbd]::config::EyreHook>::into_eyre_hook::{closure#0}<unknown>
  1553. 151.15 s > at <unknown source file>:<unknown line>
  1554. 151.15 s > 2: eyre[cb2fd339c0c40fca]::capture_handler<unknown>
  1555. 151.15 s > at <unknown source file>:<unknown line>
  1556. 151.15 s > 3: eyre[cb2fd339c0c40fca]::private::format_err<unknown>
  1557. 151.15 s > at <unknown source file>:<unknown line>
  1558. 151.15 s > 4: gammalooprs[d7a7c067ebd19583]::integrands::process::ir::evaluate_profile_momentum_point_arb::<gammalooprs[d7a7c067ebd19583]::integrands::process::amplitude::AmplitudeIntegrand><unknown>
  1559. 151.15 s > at <unknown source file>:<unknown line>
  1560. 151.15 s > 5: <gammalooprs[d7a7c067ebd19583]::integrands::process::amplitude::AmplitudeIntegrand>::test_single_ir_limit_impl<unknown>
  1561. 151.15 s > at <unknown source file>:<unknown line>
  1562. 151.15 s > 6: gammalooprs[d7a7c067ebd19583]::integrands::process::ir::run_ir_profile::<gammalooprs[d7a7c067ebd19583]::integrands::process::amplitude::AmplitudeIntegrand, <gammalooprs[d7a7c067ebd19583]::integrands::process::amplitude::AmplitudeIntegrand>::enumerate_ir_limits, <gammalooprs[d7a7c067ebd19583]::integrands::process::amplitude::AmplitudeIntegrand>::graph_cut_definitions, <gammalooprs[d7a7c067ebd19583]::integrands::process::amplitude::AmplitudeIntegrand>::test_single_ir_limit_impl><unknown>
  1563. 151.15 s > at <unknown source file>:<unknown line>
  1564. 151.15 s > 7: <gammalooprs[d7a7c067ebd19583]::integrands::process::amplitude::AmplitudeIntegrand>::test_ir<unknown>
  1565. 151.15 s > at <unknown source file>:<unknown line>
  1566. 151.15 s > 8: <gammaloop_api[92ae732909e47e14]::commands::profile::Profile>::run<unknown>
  1567. 151.15 s > at <unknown source file>:<unknown line>
  1568. 151.15 s > 9: test_runs[3e7a390caee4e338]::profile_bulk::dotted_bubble_amp_bulk_profile_passes<unknown>
  1569. 151.15 s > at <unknown source file>:<unknown line>
  1570. 151.15 s > 10: <test_runs[3e7a390caee4e338]::profile_bulk::dotted_bubble_amp_bulk_profile_passes::{closure#0} as core[940e698046960fd5]::ops::function::FnOnce<()>>::call_once<unknown>
  1571. 151.15 s > at <unknown source file>:<unknown line>
  1572. 151.15 s > 11: test[75d6903177b1d7e9]::__rust_begin_short_backtrace::<core[940e698046960fd5]::result::Result<(), alloc[2ea6bcb46fca0c42]::string::String>, fn() -> core[940e698046960fd5]::result::Result<(), alloc[2ea6bcb46fca0c42]::string::String>><unknown>
  1573. 151.15 s > at <unknown source file>:<unknown line>
  1574. 151.15 s > 12: test[75d6903177b1d7e9]::run_test::{closure#0}<unknown>
  1575. 151.15 s > at <unknown source file>:<unknown line>
  1576. 151.15 s > 13: std[bcb96dfbba0ab899]::sys::backtrace::__rust_begin_short_backtrace::<test[75d6903177b1d7e9]::run_test::{closure#1}, ()><unknown>
  1577. 151.15 s > at <unknown source file>:<unknown line>
  1578. 151.15 s > 14: <std[bcb96dfbba0ab899]::thread::lifecycle::spawn_unchecked<test[75d6903177b1d7e9]::run_test::{closure#1}, ()>::{closure#1} as core[940e698046960fd5]::ops::function::FnOnce<()>>::call_once::{shim:vtable#0}<unknown>
  1579. 151.15 s > at <unknown source file>:<unknown line>
  1580. 151.15 s > 15: <std[bcb96dfbba0ab899]::sys::thread::unix::Thread>::new::thread_start<unknown>
  1581. 151.15 s > at <unknown source file>:<unknown line>
  1582. 151.15 s > 16: start_thread<unknown>
  1583. 151.15 s > at <unknown source file>:<unknown line>
  1584. 151.15 s > 17: __clone3<unknown>
  1585. 151.15 s > at <unknown source file>:<unknown line>
  1586. 151.15 s >
  1587. 151.15 s > Run with COLORBT_SHOW_HIDDEN=1 environment variable to disable frame filtering.
  1588. 151.15 s > Run with RUST_BACKTRACE=full to include source snippets.
  1589. 151.15 s > Warning: SpanTrace capture is Unsupported.
  1590. 151.15 s > Ensure that you've setup a tracing-error ErrorLayer and the semver versions are compatible
  1591. 151.15 s > system-out
  1592. 151.15 s > running 1 test
  1593. 151.15 s > test profile_bulk::dotted_bubble_amp_bulk_profile_passes ... FAILED
  1594. 151.15 s >
  1595. 151.15 s > failures:
  1596. 151.15 s >
  1597. 151.15 s > failures:
  1598. 151.15 s > profile_bulk::dotted_bubble_amp_bulk_profile_passes
  1599. 151.15 s >
  1600. 151.15 s > test result: FAILED. 0 passed; 1 failed; 0 ignored; 0 measured; 82 filtered out; finished in 0.57s
  1601. 151.15 s > system-err
  1602. 151.15 s > [2026-08-28 12:19:17.486] @gammaloop_api::se... INFO : Running command import model ./assets/models/json/scalars/scalars_2p_3p.json
  1603. 151.15 s > [2026-08-28 12:19:17.487] @import::model INFO : Loading JSON model scalars_2p_3p-default from /build/source/assets/models/json/scalars/scalars_2p_3p
  1604. 151.15 s > [2026-08-28 12:19:17.489] @gammaloop_api::se... INFO : Running command import graphs ./tests/resources/graphs/dotted_bubble_amp.dot
  1605. 151.15 s > [2026-08-28 12:19:17.490] @commands::import INFO : Loading graphs from '/build/source/tests/resources/graphs/dotted_bubble_amp.dot'
  1606. 151.15 s > [2026-08-28 12:19:17.500] @gammaloop_api::se... INFO : Running command generate
  1607. 151.15 s > [2026-08-28 12:19:17.750] @commands::generate INFO :
  1608. 151.15 s > Integrand generation summary
  1609. 151.15 s > peak RAM 67.43 MiB | cores 1
  1610. 151.15 s > ╭───────────┬───────────────────┬─────────┬────────────┬────────────┬────────────────┬─────────────╮
  1611. 151.15 s > │ integrand │ graph │ # evals │ expr build │ spenso │ symbolica eval │ compile │
  1612. 151.15 s > ├───────────┼───────────────────┼─────────┼────────────┼────────────┼────────────────┼─────────────┤
  1613. 151.15 s > │ default │ dotted_bubble_amp │ 8 │ 62ms (68%) │ 1ms (1.4%) │ 27ms (30%) │ 0ms (0.00%) │
  1614. 151.15 s > ├───────────┼───────────────────┼─────────┼────────────┼────────────┼────────────────┼─────────────┤
  1615. 151.15 s > │ Total │ │ 8 │ 62ms (68%) │ 1ms (1.4%) │ 27ms (30%) │ 0ms (0.00%) │
  1616. 151.15 s > ╰───────────┴───────────────────┴─────────┴────────────┴────────────┴────────────────┴─────────────╯
  1617. 151.15 s > [2026-08-28 12:19:17.752] @process::amplitude INFO : Input is above threshold: 1 existing threshold E-surfaces across 1/1 graph groups
  1618. 151.15 s > [2026-08-28 12:19:17.752] @process::amplitude INFO : overlap structure of group 0: [1: [1(1,3)]]
  1619. 151.15 s > Error:
  1620. 151.15 s > 0: IR profiling requested arbitrary precision but received a quad-precision result
  1621. 151.15 s >
  1622. 151.15 s > Location:
  1623. 151.15 s > crates/gammalooprs/src/integrands/process/ir.rs:2123
  1624. 151.15 s >
  1625. 151.15 s > ━━━━━━━━━━━━━━━━━━━━━━━━━━━━━━━━━━ BACKTRACE ━━━━━━━━━━━━━━━━━━━━━━━━━━━━━━━━━━━
  1626. 151.15 s > 1: <color_eyre[51793ea62743adbd]::config::EyreHook>::into_eyre_hook::{closure#0}<unknown>
  1627. 151.15 s > at <unknown source file>:<unknown line>
  1628. 151.15 s > 2: eyre[cb2fd339c0c40fca]::capture_handler<unknown>
  1629. 151.15 s > at <unknown source file>:<unknown line>
  1630. 151.15 s > 3: eyre[cb2fd339c0c40fca]::private::format_err<unknown>
  1631. 151.15 s > at <unknown source file>:<unknown line>
  1632. 151.15 s > 4: gammalooprs[d7a7c067ebd19583]::integrands::process::ir::evaluate_profile_momentum_point_arb::<gammalooprs[d7a7c067ebd19583]::integrands::process::amplitude::AmplitudeIntegrand><unknown>
  1633. 151.15 s > at <unknown source file>:<unknown line>
  1634. 151.15 s > 5: <gammalooprs[d7a7c067ebd19583]::integrands::process::amplitude::AmplitudeIntegrand>::test_single_ir_limit_impl<unknown>
  1635. 151.15 s > at <unknown source file>:<unknown line>
  1636. 151.15 s > 6: gammalooprs[d7a7c067ebd19583]::integrands::process::ir::run_ir_profile::<gammalooprs[d7a7c067ebd19583]::integrands::process::amplitude::AmplitudeIntegrand, <gammalooprs[d7a7c067ebd19583]::integrands::process::amplitude::AmplitudeIntegrand>::enumerate_ir_limits, <gammalooprs[d7a7c067ebd19583]::integrands::process::amplitude::AmplitudeIntegrand>::graph_cut_definitions, <gammalooprs[d7a7c067ebd19583]::integrands::process::amplitude::AmplitudeIntegrand>::test_single_ir_limit_impl><unknown>
  1637. 151.16 s > at <unknown source file>:<unknown line>
  1638. 151.16 s > 7: <gammalooprs[d7a7c067ebd19583]::integrands::process::amplitude::AmplitudeIntegrand>::test_ir<unknown>
  1639. 151.16 s > at <unknown source file>:<unknown line>
  1640. 151.16 s > 8: <gammaloop_api[92ae732909e47e14]::commands::profile::Profile>::run<unknown>
  1641. 151.16 s > at <unknown source file>:<unknown line>
  1642. 151.16 s > 9: test_runs[3e7a390caee4e338]::profile_bulk::dotted_bubble_amp_bulk_profile_passes<unknown>
  1643. 151.16 s > at <unknown source file>:<unknown line>
  1644. 151.16 s > 10: <test_runs[3e7a390caee4e338]::profile_bulk::dotted_bubble_amp_bulk_profile_passes::{closure#0} as core[940e698046960fd5]::ops::function::FnOnce<()>>::call_once<unknown>
  1645. 151.16 s > at <unknown source file>:<unknown line>
  1646. 151.16 s > 11: test[75d6903177b1d7e9]::__rust_begin_short_backtrace::<core[940e698046960fd5]::result::Result<(), alloc[2ea6bcb46fca0c42]::string::String>, fn() -> core[940e698046960fd5]::result::Result<(), alloc[2ea6bcb46fca0c42]::string::String>><unknown>
  1647. 151.16 s > at <unknown source file>:<unknown line>
  1648. 151.16 s > 12: test[75d6903177b1d7e9]::run_test::{closure#0}<unknown>
  1649. 151.16 s > at <unknown source file>:<unknown line>
  1650. 151.16 s > 13: std[bcb96dfbba0ab899]::sys::backtrace::__rust_begin_short_backtrace::<test[75d6903177b1d7e9]::run_test::{closure#1}, ()><unknown>
  1651. 151.16 s > at <unknown source file>:<unknown line>
  1652. 151.16 s > 14: <std[bcb96dfbba0ab899]::thread::lifecycle::spawn_unchecked<test[75d6903177b1d7e9]::run_test::{closure#1}, ()>::{closure#1} as core[940e698046960fd5]::ops::function::FnOnce<()>>::call_once::{shim:vtable#0}<unknown>
  1653. 151.16 s > at <unknown source file>:<unknown line>
  1654. 151.16 s > 15: <std[bcb96dfbba0ab899]::sys::thread::unix::Thread>::new::thread_start<unknown>
  1655. 151.16 s > at <unknown source file>:<unknown line>
  1656. 151.16 s > 16: start_thread<unknown>
  1657. 151.16 s > at <unknown source file>:<unknown line>
  1658. 151.16 s > 17: __clone3<unknown>
  1659. 151.16 s > at <unknown source file>:<unknown line>
  1660. 151.16 s >
  1661. 151.16 s > Run with COLORBT_SHOW_HIDDEN=1 environment variable to disable frame filtering.
  1662. 151.16 s > Run with RUST_BACKTRACE=full to include source snippets.
  1663. 151.16 s > Warning: SpanTrace capture is Unsupported.
  1664. 151.16 s > Ensure that you've setup a tracing-error ErrorLayer and the semver versions are compatible
  1665. 151.16 s >
  1666. 151.16 s > 4. gammaloop-integration-tests::test_runs::profile_bulk::double_dotted_bubble_amp_bulk_profile_passes
  1667. 151.16 s > failure: test failure with exit code 101
  1668. 151.16 s > Error:
  1669. 151.16 s > 0: IR profiling requested arbitrary precision but received a quad-precision result
  1670. 151.16 s >
  1671. 151.16 s > Location:
  1672. 151.16 s > crates/gammalooprs/src/integrands/process/ir.rs:2123
  1673. 151.16 s >
  1674. 151.16 s > ━━━━━━━━━━━━━━━━━━━━━━━━━━━━━━━━━━ BACKTRACE ━━━━━━━━━━━━━━━━━━━━━━━━━━━━━━━━━━━
  1675. 151.16 s > 1: <color_eyre[51793ea62743adbd]::config::EyreHook>::into_eyre_hook::{closure#0}<unknown>
  1676. 151.16 s > at <unknown source file>:<unknown line>
  1677. 151.16 s > 2: eyre[cb2fd339c0c40fca]::capture_handler<unknown>
  1678. 151.16 s > at <unknown source file>:<unknown line>
  1679. 151.16 s > 3: eyre[cb2fd339c0c40fca]::private::format_err<unknown>
  1680. 151.16 s > at <unknown source file>:<unknown line>
  1681. 151.16 s > 4: gammalooprs[d7a7c067ebd19583]::integrands::process::ir::evaluate_profile_momentum_point_arb::<gammalooprs[d7a7c067ebd19583]::integrands::process::amplitude::AmplitudeIntegrand><unknown>
  1682. 151.16 s > at <unknown source file>:<unknown line>
  1683. 151.16 s > 5: <gammalooprs[d7a7c067ebd19583]::integrands::process::amplitude::AmplitudeIntegrand>::test_single_ir_limit_impl<unknown>
  1684. 151.16 s > at <unknown source file>:<unknown line>
  1685. 151.16 s > 6: gammalooprs[d7a7c067ebd19583]::integrands::process::ir::run_ir_profile::<gammalooprs[d7a7c067ebd19583]::integrands::process::amplitude::AmplitudeIntegrand, <gammalooprs[d7a7c067ebd19583]::integrands::process::amplitude::AmplitudeIntegrand>::enumerate_ir_limits, <gammalooprs[d7a7c067ebd19583]::integrands::process::amplitude::AmplitudeIntegrand>::graph_cut_definitions, <gammalooprs[d7a7c067ebd19583]::integrands::process::amplitude::AmplitudeIntegrand>::test_single_ir_limit_impl><unknown>
  1686. 151.16 s > at <unknown source file>:<unknown line>
  1687. 151.16 s > 7: <gammalooprs[d7a7c067ebd19583]::integrands::process::amplitude::AmplitudeIntegrand>::test_ir<unknown>
  1688. 151.16 s > at <unknown source file>:<unknown line>
  1689. 151.16 s > 8: <gammaloop_api[92ae732909e47e14]::commands::profile::Profile>::run<unknown>
  1690. 151.16 s > at <unknown source file>:<unknown line>
  1691. 151.16 s > 9: test_runs[3e7a390caee4e338]::profile_bulk::double_dotted_bubble_amp_bulk_profile_passes<unknown>
  1692. 151.16 s > at <unknown source file>:<unknown line>
  1693. 151.16 s > 10: <test_runs[3e7a390caee4e338]::profile_bulk::double_dotted_bubble_amp_bulk_profile_passes::{closure#0} as core[940e698046960fd5]::ops::function::FnOnce<()>>::call_once<unknown>
  1694. 151.16 s > at <unknown source file>:<unknown line>
  1695. 151.16 s > 11: test[75d6903177b1d7e9]::__rust_begin_short_backtrace::<core[940e698046960fd5]::result::Result<(), alloc[2ea6bcb46fca0c42]::string::String>, fn() -> core[940e698046960fd5]::result::Result<(), alloc[2ea6bcb46fca0c42]::string::String>><unknown>
  1696. 151.16 s > at <unknown source file>:<unknown line>
  1697. 151.16 s > 12: test[75d6903177b1d7e9]::run_test::{closure#0}<unknown>
  1698. 151.16 s > at <unknown source file>:<unknown line>
  1699. 151.16 s > 13: std[bcb96dfbba0ab899]::sys::backtrace::__rust_begin_short_backtrace::<test[75d6903177b1d7e9]::run_test::{closure#1}, ()><unknown>
  1700. 151.16 s > at <unknown source file>:<unknown line>
  1701. 151.16 s > 14: <std[bcb96dfbba0ab899]::thread::lifecycle::spawn_unchecked<test[75d6903177b1d7e9]::run_test::{closure#1}, ()>::{closure#1} as core[940e698046960fd5]::ops::function::FnOnce<()>>::call_once::{shim:vtable#0}<unknown>
  1702. 151.16 s > at <unknown source file>:<unknown line>
  1703. 151.16 s > 15: <std[bcb96dfbba0ab899]::sys::thread::unix::Thread>::new::thread_start<unknown>
  1704. 151.16 s > at <unknown source file>:<unknown line>
  1705. 151.16 s > 16: start_thread<unknown>
  1706. 151.16 s > at <unknown source file>:<unknown line>
  1707. 151.16 s > 17: __clone3<unknown>
  1708. 151.16 s > at <unknown source file>:<unknown line>
  1709. 151.16 s >
  1710. 151.16 s > Run with COLORBT_SHOW_HIDDEN=1 environment variable to disable frame filtering.
  1711. 151.16 s > Run with RUST_BACKTRACE=full to include source snippets.
  1712. 151.16 s > Warning: SpanTrace capture is Unsupported.
  1713. 151.16 s > Ensure that you've setup a tracing-error ErrorLayer and the semver versions are compatible
  1714. 151.16 s > system-out
  1715. 151.16 s > running 1 test
  1716. 151.16 s > test profile_bulk::double_dotted_bubble_amp_bulk_profile_passes ... FAILED
  1717. 151.16 s >
  1718. 151.16 s > failures:
  1719. 151.16 s >
  1720. 151.16 s > failures:
  1721. 151.16 s > profile_bulk::double_dotted_bubble_amp_bulk_profile_passes
  1722. 151.16 s >
  1723. 151.16 s > test result: FAILED. 0 passed; 1 failed; 0 ignored; 0 measured; 82 filtered out; finished in 0.61s
  1724. 151.16 s > system-err
  1725. 151.16 s > [2026-08-28 12:19:17.728] @gammaloop_api::se... INFO : Running command import model ./assets/models/json/scalars/scalars_2p_3p.json
  1726. 151.16 s > [2026-08-28 12:19:17.728] @import::model INFO : Loading JSON model scalars_2p_3p-default from /build/source/assets/models/json/scalars/scalars_2p_3p
  1727. 151.16 s > [2026-08-28 12:19:17.740] @gammaloop_api::se... INFO : Running command import graphs ./tests/resources/graphs/double_dotted_bubble_amp.dot
  1728. 151.16 s > [2026-08-28 12:19:17.740] @commands::import INFO : Loading graphs from '/build/source/tests/resources/graphs/double_dotted_bubble_amp.dot'
  1729. 151.16 s > [2026-08-28 12:19:17.754] @gammaloop_api::se... INFO : Running command generate
  1730. 151.16 s > [2026-08-28 12:19:17.892] @commands::generate INFO :
  1731. 151.16 s > Integrand generation summary
  1732. 151.16 s > peak RAM 62.94 MiB | cores 1
  1733. 151.16 s > ╭───────────┬──────────────────────────┬─────────┬────────────┬─────────────┬────────────────┬─────────────╮
  1734. 151.16 s > │ integrand │ graph │ # evals │ expr build │ spenso │ symbolica eval │ compile │
  1735. 151.16 s > ├───────────┼──────────────────────────┼─────────┼────────────┼─────────────┼────────────────┼─────────────┤
  1736. 151.16 s > │ default │ double_dotted_bubble_amp │ 11 │ 70ms (58%) │ 10ms (8.9%) │ 40ms (33%) │ 0ms (0.00%) │
  1737. 151.16 s > ├───────────┼──────────────────────────┼─────────┼────────────┼─────────────┼────────────────┼─────────────┤
  1738. 151.16 s > │ Total │ │ 11 │ 70ms (58%) │ 10ms (8.9%) │ 40ms (33%) │ 0ms (0.00%) │
  1739. 151.16 s > ╰───────────┴──────────────────────────┴─────────┴────────────┴─────────────┴────────────────┴─────────────╯
  1740. 151.16 s > [2026-08-28 12:19:17.894] @process::amplitude INFO : Input is above threshold: 1 existing threshold E-surfaces across 1/1 graph groups
  1741. 151.16 s > [2026-08-28 12:19:17.894] @process::amplitude INFO : overlap structure of group 0: [1: [1(1,4)]]
  1742. 151.16 s > Error:
  1743. 151.16 s > 0: IR profiling requested arbitrary precision but received a quad-precision result
  1744. 151.16 s >
  1745. 151.16 s > Location:
  1746. 151.16 s > crates/gammalooprs/src/integrands/process/ir.rs:2123
  1747. 151.16 s >
  1748. 151.16 s > ━━━━━━━━━━━━━━━━━━━━━━━━━━━━━━━━━━ BACKTRACE ━━━━━━━━━━━━━━━━━━━━━━━━━━━━━━━━━━━
  1749. 151.16 s > 1: <color_eyre[51793ea62743adbd]::config::EyreHook>::into_eyre_hook::{closure#0}<unknown>
  1750. 151.16 s > at <unknown source file>:<unknown line>
  1751. 151.16 s > 2: eyre[cb2fd339c0c40fca]::capture_handler<unknown>
  1752. 151.16 s > at <unknown source file>:<unknown line>
  1753. 151.16 s > 3: eyre[cb2fd339c0c40fca]::private::format_err<unknown>
  1754. 151.16 s > at <unknown source file>:<unknown line>
  1755. 151.16 s > 4: gammalooprs[d7a7c067ebd19583]::integrands::process::ir::evaluate_profile_momentum_point_arb::<gammalooprs[d7a7c067ebd19583]::integrands::process::amplitude::AmplitudeIntegrand><unknown>
  1756. 151.16 s > at <unknown source file>:<unknown line>
  1757. 151.16 s > 5: <gammalooprs[d7a7c067ebd19583]::integrands::process::amplitude::AmplitudeIntegrand>::test_single_ir_limit_impl<unknown>
  1758. 151.16 s > at <unknown source file>:<unknown line>
  1759. 151.16 s > 6: gammalooprs[d7a7c067ebd19583]::integrands::process::ir::run_ir_profile::<gammalooprs[d7a7c067ebd19583]::integrands::process::amplitude::AmplitudeIntegrand, <gammalooprs[d7a7c067ebd19583]::integrands::process::amplitude::AmplitudeIntegrand>::enumerate_ir_limits, <gammalooprs[d7a7c067ebd19583]::integrands::process::amplitude::AmplitudeIntegrand>::graph_cut_definitions, <gammalooprs[d7a7c067ebd19583]::integrands::process::amplitude::AmplitudeIntegrand>::test_single_ir_limit_impl><unknown>
  1760. 151.16 s > at <unknown source file>:<unknown line>
  1761. 151.16 s > 7: <gammalooprs[d7a7c067ebd19583]::integrands::process::amplitude::AmplitudeIntegrand>::test_ir<unknown>
  1762. 151.16 s > at <unknown source file>:<unknown line>
  1763. 151.16 s > 8: <gammaloop_api[92ae732909e47e14]::commands::profile::Profile>::run<unknown>
  1764. 151.16 s > at <unknown source file>:<unknown line>
  1765. 151.16 s > 9: test_runs[3e7a390caee4e338]::profile_bulk::double_dotted_bubble_amp_bulk_profile_passes<unknown>
  1766. 151.16 s > at <unknown source file>:<unknown line>
  1767. 151.16 s > 10: <test_runs[3e7a390caee4e338]::profile_bulk::double_dotted_bubble_amp_bulk_profile_passes::{closure#0} as core[940e698046960fd5]::ops::function::FnOnce<()>>::call_once<unknown>
  1768. 151.16 s > at <unknown source file>:<unknown line>
  1769. 151.16 s > 11: test[75d6903177b1d7e9]::__rust_begin_short_backtrace::<core[940e698046960fd5]::result::Result<(), alloc[2ea6bcb46fca0c42]::string::String>, fn() -> core[940e698046960fd5]::result::Result<(), alloc[2ea6bcb46fca0c42]::string::String>><unknown>
  1770. 151.16 s > at <unknown source file>:<unknown line>
  1771. 151.16 s > 12: test[75d6903177b1d7e9]::run_test::{closure#0}<unknown>
  1772. 151.16 s > at <unknown source file>:<unknown line>
  1773. 151.16 s > 13: std[bcb96dfbba0ab899]::sys::backtrace::__rust_begin_short_backtrace::<test[75d6903177b1d7e9]::run_test::{closure#1}, ()><unknown>
  1774. 151.16 s > at <unknown source file>:<unknown line>
  1775. 151.16 s > 14: <std[bcb96dfbba0ab899]::thread::lifecycle::spawn_unchecked<test[75d6903177b1d7e9]::run_test::{closure#1}, ()>::{closure#1} as core[940e698046960fd5]::ops::function::FnOnce<()>>::call_once::{shim:vtable#0}<unknown>
  1776. 151.16 s > at <unknown source file>:<unknown line>
  1777. 151.16 s > 15: <std[bcb96dfbba0ab899]::sys::thread::unix::Thread>::new::thread_start<unknown>
  1778. 151.16 s > at <unknown source file>:<unknown line>
  1779. 151.16 s > 16: start_thread<unknown>
  1780. 151.16 s > at <unknown source file>:<unknown line>
  1781. 151.16 s > 17: __clone3<unknown>
  1782. 151.16 s > at <unknown source file>:<unknown line>
  1783. 151.16 s >
  1784. 151.16 s > Run with COLORBT_SHOW_HIDDEN=1 environment variable to disable frame filtering.
  1785. 151.16 s > Run with RUST_BACKTRACE=full to include source snippets.
  1786. 151.16 s > Warning: SpanTrace capture is Unsupported.
  1787. 151.16 s > Ensure that you've setup a tracing-error ErrorLayer and the semver versions are compatible
  1788. 151.16 s >
  1789. 151.16 s > 5. gammaloop-integration-tests::test_runs::profile_bulk::massless_triangle_bulk_profile_passes
  1790. 151.16 s > failure: test failure with exit code 101
  1791. 151.16 s > Error:
  1792. 151.16 s > 0: IR profiling requested arbitrary precision but received a quad-precision result
  1793. 151.16 s >
  1794. 151.16 s > Location:
  1795. 151.16 s > crates/gammalooprs/src/integrands/process/ir.rs:2123
  1796. 151.16 s >
  1797. 151.16 s > ━━━━━━━━━━━━━━━━━━━━━━━━━━━━━━━━━━ BACKTRACE ━━━━━━━━━━━━━━━━━━━━━━━━━━━━━━━━━━━
  1798. 151.16 s > 1: <color_eyre[51793ea62743adbd]::config::EyreHook>::into_eyre_hook::{closure#0}<unknown>
  1799. 151.16 s > at <unknown source file>:<unknown line>
  1800. 151.16 s > 2: eyre[cb2fd339c0c40fca]::capture_handler<unknown>
  1801. 151.16 s > at <unknown source file>:<unknown line>
  1802. 151.16 s > 3: eyre[cb2fd339c0c40fca]::private::format_err<unknown>
  1803. 151.16 s > at <unknown source file>:<unknown line>
  1804. 151.16 s > 4: gammalooprs[d7a7c067ebd19583]::integrands::process::ir::evaluate_profile_momentum_point_arb::<gammalooprs[d7a7c067ebd19583]::integrands::process::amplitude::AmplitudeIntegrand><unknown>
  1805. 151.16 s > at <unknown source file>:<unknown line>
  1806. 151.16 s > 5: <gammalooprs[d7a7c067ebd19583]::integrands::process::amplitude::AmplitudeIntegrand>::test_single_ir_limit_impl<unknown>
  1807. 151.16 s > at <unknown source file>:<unknown line>
  1808. 151.16 s > 6: gammalooprs[d7a7c067ebd19583]::integrands::process::ir::run_ir_profile::<gammalooprs[d7a7c067ebd19583]::integrands::process::amplitude::AmplitudeIntegrand, <gammalooprs[d7a7c067ebd19583]::integrands::process::amplitude::AmplitudeIntegrand>::enumerate_ir_limits, <gammalooprs[d7a7c067ebd19583]::integrands::process::amplitude::AmplitudeIntegrand>::graph_cut_definitions, <gammalooprs[d7a7c067ebd19583]::integrands::process::amplitude::AmplitudeIntegrand>::test_single_ir_limit_impl><unknown>
  1809. 151.16 s > at <unknown source file>:<unknown line>
  1810. 151.16 s > 7: <gammalooprs[d7a7c067ebd19583]::integrands::process::amplitude::AmplitudeIntegrand>::test_ir<unknown>
  1811. 151.16 s > at <unknown source file>:<unknown line>
  1812. 151.16 s > 8: <gammaloop_api[92ae732909e47e14]::commands::profile::Profile>::run<unknown>
  1813. 151.16 s > at <unknown source file>:<unknown line>
  1814. 151.16 s > 9: test_runs[3e7a390caee4e338]::profile_bulk::massless_triangle_bulk_profile_passes<unknown>
  1815. 151.16 s > at <unknown source file>:<unknown line>
  1816. 151.16 s > 10: <test_runs[3e7a390caee4e338]::profile_bulk::massless_triangle_bulk_profile_passes::{closure#0} as core[940e698046960fd5]::ops::function::FnOnce<()>>::call_once<unknown>
  1817. 151.16 s > at <unknown source file>:<unknown line>
  1818. 151.16 s > 11: test[75d6903177b1d7e9]::__rust_begin_short_backtrace::<core[940e698046960fd5]::result::Result<(), alloc[2ea6bcb46fca0c42]::string::String>, fn() -> core[940e698046960fd5]::result::Result<(), alloc[2ea6bcb46fca0c42]::string::String>><unknown>
  1819. 151.16 s > at <unknown source file>:<unknown line>
  1820. 151.16 s > 12: test[75d6903177b1d7e9]::run_test::{closure#0}<unknown>
  1821. 151.16 s > at <unknown source file>:<unknown line>
  1822. 151.16 s > 13: std[bcb96dfbba0ab899]::sys::backtrace::__rust_begin_short_backtrace::<test[75d6903177b1d7e9]::run_test::{closure#1}, ()><unknown>
  1823. 151.16 s > at <unknown source file>:<unknown line>
  1824. 151.16 s > 14: <std[bcb96dfbba0ab899]::thread::lifecycle::spawn_unchecked<test[75d6903177b1d7e9]::run_test::{closure#1}, ()>::{closure#1} as core[940e698046960fd5]::ops::function::FnOnce<()>>::call_once::{shim:vtable#0}<unknown>
  1825. 151.16 s > at <unknown source file>:<unknown line>
  1826. 151.16 s > 15: <std[bcb96dfbba0ab899]::sys::thread::unix::Thread>::new::thread_start<unknown>
  1827. 151.16 s > at <unknown source file>:<unknown line>
  1828. 151.16 s > 16: start_thread<unknown>
  1829. 151.16 s > at <unknown source file>:<unknown line>
  1830. 151.16 s > 17: __clone3<unknown>
  1831. 151.16 s > at <unknown source file>:<unknown line>
  1832. 151.16 s >
  1833. 151.16 s > Run with COLORBT_SHOW_HIDDEN=1 environment variable to disable frame filtering.
  1834. 151.16 s > Run with RUST_BACKTRACE=full to include source snippets.
  1835. 151.16 s > Warning: SpanTrace capture is Unsupported.
  1836. 151.16 s > Ensure that you've setup a tracing-error ErrorLayer and the semver versions are compatible
  1837. 151.16 s > system-out
  1838. 151.16 s > running 1 test
  1839. 151.16 s > test profile_bulk::massless_triangle_bulk_profile_passes ... FAILED
  1840. 151.16 s >
  1841. 151.16 s > failures:
  1842. 151.16 s >
  1843. 151.16 s > failures:
  1844. 151.16 s > profile_bulk::massless_triangle_bulk_profile_passes
  1845. 151.16 s >
  1846. 151.16 s > test result: FAILED. 0 passed; 1 failed; 0 ignored; 0 measured; 82 filtered out; finished in 0.46s
  1847. 151.16 s > system-err
  1848. 151.16 s > [2026-08-28 12:19:17.751] @gammaloop_api::se... INFO : Running command import model scalars
  1849. 151.16 s > [2026-08-28 12:19:17.751] @import::model INFO : Loading built-in JSON model scalars-default
  1850. 151.16 s > [2026-08-28 12:19:17.758] @gammalooprs::model INFO : The following 2 external parameters were forced to zero by the restriction card:
  1851. 151.16 s > width_scalar_1, width_scalar_2
  1852. 151.16 s > [2026-08-28 12:19:17.759] @gammaloop_api::se... INFO : Running command import graphs ./tests/resources/graphs/massless_triangle.dot
  1853. 151.16 s > [2026-08-28 12:19:17.759] @commands::import INFO : Loading graphs from '/build/source/tests/resources/graphs/massless_triangle.dot'
  1854. 151.16 s > [2026-08-28 12:19:17.765] @gammaloop_api::se... INFO : Running command generate
  1855. 151.16 s > [2026-08-28 12:19:17.919] @commands::generate INFO :
  1856. 151.16 s > Integrand generation summary
  1857. 151.16 s > peak RAM 63.57 MiB | cores 1
  1858. 151.16 s > ╭───────────┬─────────────────────┬─────────┬────────────┬────────────┬────────────────┬─────────────╮
  1859. 151.16 s > │ integrand │ graph │ # evals │ expr build │ spenso │ symbolica eval │ compile │
  1860. 151.16 s > ├───────────┼─────────────────────┼─────────┼────────────┼────────────┼────────────────┼─────────────┤
  1861. 151.16 s > │ default │ massless_triangle_0 │ 9 │ 24ms (68%) │ 3ms (8.4%) │ 8ms (24%) │ 0ms (0.00%) │
  1862. 151.16 s > ├───────────┼─────────────────────┼─────────┼────────────┼────────────┼────────────────┼─────────────┤
  1863. 151.16 s > │ Total │ │ 9 │ 24ms (68%) │ 3ms (8.4%) │ 8ms (24%) │ 0ms (0.00%) │
  1864. 151.16 s > ╰───────────┴─────────────────────┴─────────┴────────────┴────────────┴────────────────┴─────────────╯
  1865. 151.16 s > [2026-08-28 12:19:17.922] @process::amplitude INFO : Input is above threshold: 2 existing threshold E-surfaces across 1/1 graph groups
  1866. 151.16 s > [2026-08-28 12:19:17.925] @process::amplitude INFO : overlap structure of group 0: [2: [0(1,5), 1(1,3)]]
  1867. 151.16 s > Error:
  1868. 151.16 s > 0: IR profiling requested arbitrary precision but received a quad-precision result
  1869. 151.16 s >
  1870. 151.16 s > Location:
  1871. 151.16 s > crates/gammalooprs/src/integrands/process/ir.rs:2123
  1872. 151.16 s >
  1873. 151.16 s > ━━━━━━━━━━━━━━━━━━━━━━━━━━━━━━━━━━ BACKTRACE ━━━━━━━━━━━━━━━━━━━━━━━━━━━━━━━━━━━
  1874. 151.16 s > 1: <color_eyre[51793ea62743adbd]::config::EyreHook>::into_eyre_hook::{closure#0}<unknown>
  1875. 151.16 s > at <unknown source file>:<unknown line>
  1876. 151.16 s > 2: eyre[cb2fd339c0c40fca]::capture_handler<unknown>
  1877. 151.16 s > at <unknown source file>:<unknown line>
  1878. 151.16 s > 3: eyre[cb2fd339c0c40fca]::private::format_err<unknown>
  1879. 151.16 s > at <unknown source file>:<unknown line>
  1880. 151.16 s > 4: gammalooprs[d7a7c067ebd19583]::integrands::process::ir::evaluate_profile_momentum_point_arb::<gammalooprs[d7a7c067ebd19583]::integrands::process::amplitude::AmplitudeIntegrand><unknown>
  1881. 151.16 s > at <unknown source file>:<unknown line>
  1882. 151.16 s > 5: <gammalooprs[d7a7c067ebd19583]::integrands::process::amplitude::AmplitudeIntegrand>::test_single_ir_limit_impl<unknown>
  1883. 151.16 s > at <unknown source file>:<unknown line>
  1884. 151.16 s > 6: gammalooprs[d7a7c067ebd19583]::integrands::process::ir::run_ir_profile::<gammalooprs[d7a7c067ebd19583]::integrands::process::amplitude::AmplitudeIntegrand, <gammalooprs[d7a7c067ebd19583]::integrands::process::amplitude::AmplitudeIntegrand>::enumerate_ir_limits, <gammalooprs[d7a7c067ebd19583]::integrands::process::amplitude::AmplitudeIntegrand>::graph_cut_definitions, <gammalooprs[d7a7c067ebd19583]::integrands::process::amplitude::AmplitudeIntegrand>::test_single_ir_limit_impl><unknown>
  1885. 151.16 s > at <unknown source file>:<unknown line>
  1886. 151.16 s > 7: <gammalooprs[d7a7c067ebd19583]::integrands::process::amplitude::AmplitudeIntegrand>::test_ir<unknown>
  1887. 151.16 s > at <unknown source file>:<unknown line>
  1888. 151.16 s > 8: <gammaloop_api[92ae732909e47e14]::commands::profile::Profile>::run<unknown>
  1889. 151.16 s > at <unknown source file>:<unknown line>
  1890. 151.16 s > 9: test_runs[3e7a390caee4e338]::profile_bulk::massless_triangle_bulk_profile_passes<unknown>
  1891. 151.16 s > at <unknown source file>:<unknown line>
  1892. 151.16 s > 10: <test_runs[3e7a390caee4e338]::profile_bulk::massless_triangle_bulk_profile_passes::{closure#0} as core[940e698046960fd5]::ops::function::FnOnce<()>>::call_once<unknown>
  1893. 151.16 s > at <unknown source file>:<unknown line>
  1894. 151.16 s > 11: test[75d6903177b1d7e9]::__rust_begin_short_backtrace::<core[940e698046960fd5]::result::Result<(), alloc[2ea6bcb46fca0c42]::string::String>, fn() -> core[940e698046960fd5]::result::Result<(), alloc[2ea6bcb46fca0c42]::string::String>><unknown>
  1895. 151.16 s > at <unknown source file>:<unknown line>
  1896. 151.16 s > 12: test[75d6903177b1d7e9]::run_test::{closure#0}<unknown>
  1897. 151.16 s > at <unknown source file>:<unknown line>
  1898. 151.16 s > 13: std[bcb96dfbba0ab899]::sys::backtrace::__rust_begin_short_backtrace::<test[75d6903177b1d7e9]::run_test::{closure#1}, ()><unknown>
  1899. 151.16 s > at <unknown source file>:<unknown line>
  1900. 151.16 s > 14: <std[bcb96dfbba0ab899]::thread::lifecycle::spawn_unchecked<test[75d6903177b1d7e9]::run_test::{closure#1}, ()>::{closure#1} as core[940e698046960fd5]::ops::function::FnOnce<()>>::call_once::{shim:vtable#0}<unknown>
  1901. 151.16 s > at <unknown source file>:<unknown line>
  1902. 151.16 s > 15: <std[bcb96dfbba0ab899]::sys::thread::unix::Thread>::new::thread_start<unknown>
  1903. 151.16 s > at <unknown source file>:<unknown line>
  1904. 151.16 s > 16: start_thread<unknown>
  1905. 151.16 s > at <unknown source file>:<unknown line>
  1906. 151.16 s > 17: __clone3<unknown>
  1907. 151.16 s > at <unknown source file>:<unknown line>
  1908. 151.16 s >
  1909. 151.16 s > Run with COLORBT_SHOW_HIDDEN=1 environment variable to disable frame filtering.
  1910. 151.16 s > Run with RUST_BACKTRACE=full to include source snippets.
  1911. 151.16 s > Warning: SpanTrace capture is Unsupported.
  1912. 151.16 s > Ensure that you've setup a tracing-error ErrorLayer and the semver versions are compatible
  1913. 151.16 s >
  1914. 151.16 s > 6. gammaloop-integration-tests::test_runs::profile_bulk::scalar_self_energy_amp_bulk_profile_passes
  1915. 151.16 s > failure: test failure with exit code 101
  1916. 151.16 s > Error:
  1917. 151.16 s > 0: IR profiling requested arbitrary precision but received a quad-precision result
  1918. 151.16 s >
  1919. 151.16 s > Location:
  1920. 151.16 s > crates/gammalooprs/src/integrands/process/ir.rs:2123
  1921. 151.16 s >
  1922. 151.16 s > ━━━━━━━━━━━━━━━━━━━━━━━━━━━━━━━━━━ BACKTRACE ━━━━━━━━━━━━━━━━━━━━━━━━━━━━━━━━━━━
  1923. 151.16 s > 1: <color_eyre[51793ea62743adbd]::config::EyreHook>::into_eyre_hook::{closure#0}<unknown>
  1924. 151.16 s > at <unknown source file>:<unknown line>
  1925. 151.16 s > 2: eyre[cb2fd339c0c40fca]::capture_handler<unknown>
  1926. 151.16 s > at <unknown source file>:<unknown line>
  1927. 151.16 s > 3: eyre[cb2fd339c0c40fca]::private::format_err<unknown>
  1928. 151.16 s > at <unknown source file>:<unknown line>
  1929. 151.16 s > 4: gammalooprs[d7a7c067ebd19583]::integrands::process::ir::evaluate_profile_momentum_point_arb::<gammalooprs[d7a7c067ebd19583]::integrands::process::amplitude::AmplitudeIntegrand><unknown>
  1930. 151.16 s > at <unknown source file>:<unknown line>
  1931. 151.16 s > 5: <gammalooprs[d7a7c067ebd19583]::integrands::process::amplitude::AmplitudeIntegrand>::test_single_ir_limit_impl<unknown>
  1932. 151.16 s > at <unknown source file>:<unknown line>
  1933. 151.16 s > 6: gammalooprs[d7a7c067ebd19583]::integrands::process::ir::run_ir_profile::<gammalooprs[d7a7c067ebd19583]::integrands::process::amplitude::AmplitudeIntegrand, <gammalooprs[d7a7c067ebd19583]::integrands::process::amplitude::AmplitudeIntegrand>::enumerate_ir_limits, <gammalooprs[d7a7c067ebd19583]::integrands::process::amplitude::AmplitudeIntegrand>::graph_cut_definitions, <gammalooprs[d7a7c067ebd19583]::integrands::process::amplitude::AmplitudeIntegrand>::test_single_ir_limit_impl><unknown>
  1934. 151.16 s > at <unknown source file>:<unknown line>
  1935. 151.16 s > 7: <gammalooprs[d7a7c067ebd19583]::integrands::process::amplitude::AmplitudeIntegrand>::test_ir<unknown>
  1936. 151.16 s > at <unknown source file>:<unknown line>
  1937. 151.16 s > 8: <gammaloop_api[92ae732909e47e14]::commands::profile::Profile>::run<unknown>
  1938. 151.16 s > at <unknown source file>:<unknown line>
  1939. 151.16 s > 9: test_runs[3e7a390caee4e338]::profile_bulk::scalar_self_energy_amp_bulk_profile_passes<unknown>
  1940. 151.16 s > at <unknown source file>:<unknown line>
  1941. 151.16 s > 10: <test_runs[3e7a390caee4e338]::profile_bulk::scalar_self_energy_amp_bulk_profile_passes::{closure#0} as core[940e698046960fd5]::ops::function::FnOnce<()>>::call_once<unknown>
  1942. 151.16 s > at <unknown source file>:<unknown line>
  1943. 151.16 s > 11: test[75d6903177b1d7e9]::__rust_begin_short_backtrace::<core[940e698046960fd5]::result::Result<(), alloc[2ea6bcb46fca0c42]::string::String>, fn() -> core[940e698046960fd5]::result::Result<(), alloc[2ea6bcb46fca0c42]::string::String>><unknown>
  1944. 151.16 s > at <unknown source file>:<unknown line>
  1945. 151.16 s > 12: test[75d6903177b1d7e9]::run_test::{closure#0}<unknown>
  1946. 151.16 s > at <unknown source file>:<unknown line>
  1947. 151.16 s > 13: std[bcb96dfbba0ab899]::sys::backtrace::__rust_begin_short_backtrace::<test[75d6903177b1d7e9]::run_test::{closure#1}, ()><unknown>
  1948. 151.16 s > at <unknown source file>:<unknown line>
  1949. 151.16 s > 14: <std[bcb96dfbba0ab899]::thread::lifecycle::spawn_unchecked<test[75d6903177b1d7e9]::run_test::{closure#1}, ()>::{closure#1} as core[940e698046960fd5]::ops::function::FnOnce<()>>::call_once::{shim:vtable#0}<unknown>
  1950. 151.16 s > at <unknown source file>:<unknown line>
  1951. 151.16 s > 15: <std[bcb96dfbba0ab899]::sys::thread::unix::Thread>::new::thread_start<unknown>
  1952. 151.16 s > at <unknown source file>:<unknown line>
  1953. 151.16 s > 16: start_thread<unknown>
  1954. 151.16 s > at <unknown source file>:<unknown line>
  1955. 151.16 s > 17: __clone3<unknown>
  1956. 151.16 s > at <unknown source file>:<unknown line>
  1957. 151.16 s >
  1958. 151.16 s > Run with COLORBT_SHOW_HIDDEN=1 environment variable to disable frame filtering.
  1959. 151.16 s > Run with RUST_BACKTRACE=full to include source snippets.
  1960. 151.16 s > Warning: SpanTrace capture is Unsupported.
  1961. 151.16 s > Ensure that you've setup a tracing-error ErrorLayer and the semver versions are compatible
  1962. 151.16 s > system-out
  1963. 151.16 s > running 1 test
  1964. 151.16 s > test profile_bulk::scalar_self_energy_amp_bulk_profile_passes ... FAILED
  1965. 151.16 s >
  1966. 151.16 s > failures:
  1967. 151.16 s >
  1968. 151.16 s > failures:
  1969. 151.16 s > profile_bulk::scalar_self_energy_amp_bulk_profile_passes
  1970. 151.16 s >
  1971. 151.16 s > test result: FAILED. 0 passed; 1 failed; 0 ignored; 0 measured; 82 filtered out; finished in 1.26s
  1972. 151.16 s > system-err
  1973. 151.16 s > [2026-08-28 12:19:18.085] @gammaloop_api::se... INFO : Running command import model ./assets/models/json/scalars/scalars.json
  1974. 151.16 s > [2026-08-28 12:19:18.085] @import::model INFO : Loading JSON model scalars-default from /build/source/assets/models/json/scalars/scalars
  1975. 151.16 s > [2026-08-28 12:19:18.092] @gammalooprs::model INFO : The following 2 external parameters were forced to zero by the restriction card:
  1976. 151.16 s > width_scalar_1, width_scalar_2
  1977. 151.16 s > [2026-08-28 12:19:18.093] @gammaloop_api::se... INFO : Running command import graphs ./tests/resources/graphs/scalar_self_energy_amp.dot
  1978. 151.16 s > [2026-08-28 12:19:18.093] @commands::import INFO : Loading graphs from '/build/source/tests/resources/graphs/scalar_self_energy_amp.dot'
  1979. 151.16 s > [2026-08-28 12:19:18.109] @gammaloop_api::se... INFO : Running command generate
  1980. 151.16 s > [2026-08-28 12:19:18.870] @commands::generate INFO :
  1981. 151.16 s > Integrand generation summary
  1982. 151.16 s > peak RAM 71.55 MiB | cores 1
  1983. 151.16 s > ╭───────────┬────────────────────────┬─────────┬─────────────┬─────────────┬────────────────┬─────────────╮
  1984. 151.16 s > │ integrand │ graph │ # evals │ expr build │ spenso │ symbolica eval │ compile │
  1985. 151.16 s > ├───────────┼────────────────────────┼─────────┼─────────────┼─────────────┼────────────────┼─────────────┤
  1986. 151.16 s > │ default │ scalar_self_energy_amp │ 6 │ 643ms (97%) │ 11ms (1.8%) │ 8ms (1.3%) │ 0ms (0.00%) │
  1987. 151.16 s > ├───────────┼────────────────────────┼─────────┼─────────────┼─────────────┼────────────────┼─────────────┤
  1988. 151.16 s > │ Total │ │ 6 │ 643ms (97%) │ 11ms (1.8%) │ 8ms (1.3%) │ 0ms (0.00%) │
  1989. 151.16 s > ╰───────────┴────────────────────────┴─────────┴─────────────┴─────────────┴────────────────┴─────────────╯
  1990. 151.16 s > [2026-08-28 12:19:18.872] @process::amplitude INFO : Input is above threshold: 2 existing threshold E-surfaces across 1/1 graph groups
  1991. 151.16 s > [2026-08-28 12:19:18.872] @process::amplitude INFO : overlap structure of group 0: [2: [2(1,5), 4(2,3,5)]]
  1992. 151.16 s > Error:
  1993. 151.16 s > 0: IR profiling requested arbitrary precision but received a quad-precision result
  1994. 151.16 s >
  1995. 151.16 s > Location:
  1996. 151.16 s > crates/gammalooprs/src/integrands/process/ir.rs:2123
  1997. 151.16 s >
  1998. 151.16 s > ━━━━━━━━━━━━━━━━━━━━━━━━━━━━━━━━━━ BACKTRACE ━━━━━━━━━━━━━━━━━━━━━━━━━━━━━━━━━━━
  1999. 151.16 s > 1: <color_eyre[51793ea62743adbd]::config::EyreHook>::into_eyre_hook::{closure#0}<unknown>
  2000. 151.16 s > at <unknown source file>:<unknown line>
  2001. 151.16 s > 2: eyre[cb2fd339c0c40fca]::capture_handler<unknown>
  2002. 151.16 s > at <unknown source file>:<unknown line>
  2003. 151.16 s > 3: eyre[cb2fd339c0c40fca]::private::format_err<unknown>
  2004. 151.16 s > at <unknown source file>:<unknown line>
  2005. 151.16 s > 4: gammalooprs[d7a7c067ebd19583]::integrands::process::ir::evaluate_profile_momentum_point_arb::<gammalooprs[d7a7c067ebd19583]::integrands::process::amplitude::AmplitudeIntegrand><unknown>
  2006. 151.16 s > at <unknown source file>:<unknown line>
  2007. 151.16 s > 5: <gammalooprs[d7a7c067ebd19583]::integrands::process::amplitude::AmplitudeIntegrand>::test_single_ir_limit_impl<unknown>
  2008. 151.16 s > at <unknown source file>:<unknown line>
  2009. 151.16 s > 6: gammalooprs[d7a7c067ebd19583]::integrands::process::ir::run_ir_profile::<gammalooprs[d7a7c067ebd19583]::integrands::process::amplitude::AmplitudeIntegrand, <gammalooprs[d7a7c067ebd19583]::integrands::process::amplitude::AmplitudeIntegrand>::enumerate_ir_limits, <gammalooprs[d7a7c067ebd19583]::integrands::process::amplitude::AmplitudeIntegrand>::graph_cut_definitions, <gammalooprs[d7a7c067ebd19583]::integrands::process::amplitude::AmplitudeIntegrand>::test_single_ir_limit_impl><unknown>
  2010. 151.16 s > at <unknown source file>:<unknown line>
  2011. 151.16 s > 7: <gammalooprs[d7a7c067ebd19583]::integrands::process::amplitude::AmplitudeIntegrand>::test_ir<unknown>
  2012. 151.16 s > at <unknown source file>:<unknown line>
  2013. 151.16 s > 8: <gammaloop_api[92ae732909e47e14]::commands::profile::Profile>::run<unknown>
  2014. 151.16 s > at <unknown source file>:<unknown line>
  2015. 151.16 s > 9: test_runs[3e7a390caee4e338]::profile_bulk::scalar_self_energy_amp_bulk_profile_passes<unknown>
  2016. 151.16 s > at <unknown source file>:<unknown line>
  2017. 151.16 s > 10: <test_runs[3e7a390caee4e338]::profile_bulk::scalar_self_energy_amp_bulk_profile_passes::{closure#0} as core[940e698046960fd5]::ops::function::FnOnce<()>>::call_once<unknown>
  2018. 151.16 s > at <unknown source file>:<unknown line>
  2019. 151.16 s > 11: test[75d6903177b1d7e9]::__rust_begin_short_backtrace::<core[940e698046960fd5]::result::Result<(), alloc[2ea6bcb46fca0c42]::string::String>, fn() -> core[940e698046960fd5]::result::Result<(), alloc[2ea6bcb46fca0c42]::string::String>><unknown>
  2020. 151.16 s > at <unknown source file>:<unknown line>
  2021. 151.16 s > 12: test[75d6903177b1d7e9]::run_test::{closure#0}<unknown>
  2022. 151.16 s > at <unknown source file>:<unknown line>
  2023. 151.16 s > 13: std[bcb96dfbba0ab899]::sys::backtrace::__rust_begin_short_backtrace::<test[75d6903177b1d7e9]::run_test::{closure#1}, ()><unknown>
  2024. 151.16 s > at <unknown source file>:<unknown line>
  2025. 151.16 s > 14: <std[bcb96dfbba0ab899]::thread::lifecycle::spawn_unchecked<test[75d6903177b1d7e9]::run_test::{closure#1}, ()>::{closure#1} as core[940e698046960fd5]::ops::function::FnOnce<()>>::call_once::{shim:vtable#0}<unknown>
  2026. 151.16 s > at <unknown source file>:<unknown line>
  2027. 151.16 s > 15: <std[bcb96dfbba0ab899]::sys::thread::unix::Thread>::new::thread_start<unknown>
  2028. 151.16 s > at <unknown source file>:<unknown line>
  2029. 151.16 s > 16: start_thread<unknown>
  2030. 151.16 s > at <unknown source file>:<unknown line>
  2031. 151.16 s > 17: __clone3<unknown>
  2032. 151.16 s > at <unknown source file>:<unknown line>
  2033. 151.16 s >
  2034. 151.16 s > Run with COLORBT_SHOW_HIDDEN=1 environment variable to disable frame filtering.
  2035. 151.16 s > Run with RUST_BACKTRACE=full to include source snippets.
  2036. 151.16 s > Warning: SpanTrace capture is Unsupported.
  2037. 151.16 s > Ensure that you've setup a tracing-error ErrorLayer and the semver versions are compatible
  2038. 151.16 s >
  2039. 151.16 s > 7. gammaloop-integration-tests::uv::dod2_bubble_uv
  2040. 151.16 s > failure: test failure with exit code 101
  2041. 151.16 s > system-out
  2042. 151.16 s > running 1 test
  2043. 151.16 s > +-------------+-----------------+---------+--------+----------+-----------------------------------------------------------------------------------------------------------------------+-------+
  2044. 151.16 s > | case | check | graph | status | sigma | threshold | error |
  2045. 151.16 s > +-------------+-----------------+---------+--------+----------+-----------------------------------------------------------------------------------------------------------------------+-------+
  2046. 151.16 s > | dod2_bubble | uv_profile | - | FAIL | - | - | - |
  2047. 151.16 s > +-------------+-----------------+---------+--------+----------+-----------------------------------------------------------------------------------------------------------------------+-------+
  2048. 151.16 s > | dod2_bubble | m_uv.inspect | inspect | pass | - | best inspect relative delta 1.000e0 >= 1000*accuracy 1.000e-7 (accuracy=1.000e-10, exponent=+8.0, seed=0, probes=10) | - |
  2049. 151.16 s > +-------------+-----------------+---------+--------+----------+-----------------------------------------------------------------------------------------------------------------------+-------+
  2050. 151.16 s > | dod2_bubble | m_uv.integrated | GL0 | pass | 0.0sigma | compatible within 2sigma | - |
  2051. 151.16 s > +-------------+-----------------+---------+--------+----------+-----------------------------------------------------------------------------------------------------------------------+-------+
  2052. 151.16 s > | dod2_bubble | rls.inspect | inspect | pass | - | best inspect relative delta 2.822e-3 >= 1000*accuracy 1.000e-7 (accuracy=1.000e-10, exponent=+2.0, seed=1, probes=10) | - |
  2053. 151.16 s > +-------------+-----------------+---------+--------+----------+-----------------------------------------------------------------------------------------------------------------------+-------+
  2054. 151.16 s > | dod2_bubble | rls.integrated | GL0 | pass | 0.0sigma | compatible within 2sigma | - |
  2055. 151.16 s > +-------------+-----------------+---------+--------+----------+-----------------------------------------------------------------------------------------------------------------------+-------+
  2056. 151.16 s > | dod2_bubble | mu_r.inspect | inspect | pass | - | best inspect relative delta 6.951e-1 >= 1000*accuracy 1.000e-7 (accuracy=1.000e-10, exponent=+0.0, seed=0, probes=10) | - |
  2057. 151.16 s > +-------------+-----------------+---------+--------+----------+-----------------------------------------------------------------------------------------------------------------------+-------+
  2058. 151.16 s > | dod2_bubble | target | - | pass | - | 2sigma | - |
  2059. 151.16 s > +-------------+-----------------+---------+--------+----------+-----------------------------------------------------------------------------------------------------------------------+-------+
  2060. 151.16 s > test dod2_bubble_uv ... FAILED
  2061. 151.16 s >
  2062. 151.16 s > failures:
  2063. 151.16 s >
  2064. 151.16 s > failures:
  2065. 151.16 s > dod2_bubble_uv
  2066. 151.16 s >
  2067. 151.16 s > test result: FAILED. 0 passed; 1 failed; 0 ignored; 0 measured; 24 filtered out; finished in 47.31s
  2068. 151.16 s > system-err
  2069. 151.16 s > [2026-08-28 12:19:22.629] @gammaloop_api::se... INFO : Running command run generate
  2070. 151.16 s > [2026-08-28 12:19:22.629] @gammaloop_api::se... INFO : Starting command block generate
  2071. 151.16 s > [2026-08-28 12:19:22.630] @gammaloop_api::se... INFO : Running command import model scalars-default.json
  2072. 151.16 s > [2026-08-28 12:19:22.630] @import::model INFO : Loading built-in JSON model scalars-default
  2073. 151.16 s > [2026-08-28 12:19:22.640] @gammalooprs::model INFO : The following 2 external parameters were forced to zero by the restriction card:
  2074. 151.16 s > width_scalar_1, width_scalar_2
  2075. 151.16 s > [2026-08-28 12:19:22.644] @gammaloop_api::se... INFO : Running command remove processes
  2076. 151.16 s > [2026-08-28 12:19:22.644] @gammaloop_api::se... INFO : Running command set global kv global.generation.uv.generate_integrated=true
  2077. 151.16 s > [2026-08-28 12:19:22.645] @gammaloop_api::se... INFO : Running command import graphs ./tests/resources/graphs/scalar/dod2_bubble.dot -p bubble_dod2 -i scalar_bubble_below_thres
  2078. 151.16 s > [2026-08-28 12:19:22.645] @commands::import INFO : Loading graphs from '/build/source/tests/resources/graphs/scalar/dod2_bubble.dot'
  2079. 151.16 s > [2026-08-28 12:19:22.655] @gammaloop_api::se... INFO : Running command generate existing -p bubble_dod2 -i scalar_bubble_below_thres
  2080. 151.16 s > [2026-08-28 12:19:22.657] @approx::local_4d [{#uv, #inspect, #integrated}] DEBUG : Rescaled momenta expanded
  2081. 151.16 s > field value
  2082. 151.16 s > res n-terms: 1, byte size: 3,expr:
  2083. 151.16 s > 1
  2084. 151.16 s > [2026-08-28 12:19:22.681] @approx::local_4d [{#uv, #inspect, #integrated}] DEBUG : Rescaled momenta expanded
  2085. 151.16 s > field value
  2086. 151.16 s > res n-terms: 1, byte size: 585,expr:
  2087. 151.16 s > -SCALAR_COUPLING²·q₀(αᵉ².¹)·q₀(αᵉ³.¹)·q₂(αᵉ².¹)·q₂(αᵉ³.¹)
  2088. 151.16 s > /(t²·denom(3,-q₀-q₂/t,mass_scalar_2²,-mass_scalar_2²+2·(q₀.q₂)/t+(q₂.q₂)/t²+(q₀.q₀))
  2089. 151.16 s > ·denom(2,q₂/t,mass_scalar_2²,-mass_scalar_2²+(q₂.q₂)/t²))
  2090. 151.16 s > [2026-08-28 12:19:22.697] @approx::final_integrand[{#generation, #profile, #uv, #graph, #summary}] DEBUG : Computed global numerator
  2091. 151.16 s > field value
  2092. 151.16 s > global_num n-terms: 1, byte size: 4,expr:
  2093. 151.16 s > 1/2
  2094. 151.16 s > span build_3d{span_context=true graph=GL0 current=subgraph=0, topo_order=0, dod=0}
  2095. 151.16 s > [2026-08-28 12:19:22.752] @uv::approx [{#generation, #uv, #fourd}] DEBUG : Computing 4D
  2096. 151.16 s > field value
  2097. 151.16 s > simple subgraph(S_11,S_y)*Approx(subgraph(S_y,0)) of GL0
  2098. 151.16 s > span compute_4d{span_context=true graph=GL0 current=subgraph=y, topo_order=1, dod=2 given=subgraph=0, topo_order=0, dod=0 reduced=SubSet { set: BitVec<usize, bitvec::order::Lsb0> { addr: 0x7fffe8023490, head: 000000, bits: 6, capacity: 64 } [0, 0, 1, 1, 1, 1], id: PhantomData<linnet::half_edge::involution::Hedge> }}
  2099. 151.16 s > [2026-08-28 12:19:22.753] @approx::local_4d [{#uv, #algebra, #integrated, #start}] DEBUG :
  2100. 151.16 s > field value
  2101. 151.16 s > integrand n-terms: 1, byte size: 409,expr:
  2102. 151.16 s > SCALAR_COUPLING²·(q₀(αᵉ³.¹)+q₃(αᵉ³.¹))·q₀(αᵉ².¹)·q₀(αᵉ³.¹)·q₂(αᵉ².¹)
  2103. 151.16 s > /(denom(2,q₂,mass_scalar_2²,-mass_scalar_2²+(q₂.q₂))·denom(3,q₃,mass_scalar_2²,-mass_scalar_2²+(q₃.q₃)))
  2104. 151.16 s > reduced y
  2105. 151.16 s > span grow{span_context=true current=subgraph=y, topo_order=1, dod=2 given=subgraph=0, topo_order=0, dod=0}
  2106. 151.16 s > [2026-08-28 12:19:22.753] @approx::local_4d [{#uv, #inspect, #integrated}] DEBUG : Rescaled momenta expanded
  2107. 151.16 s > field value
  2108. 151.16 s > res n-terms: 1, byte size: 585,expr:
  2109. 151.16 s > -SCALAR_COUPLING²·q₀(αᵉ².¹)·q₀(αᵉ³.¹)·q₂(αᵉ².¹)·q₂(αᵉ³.¹)
  2110. 151.16 s > /(t²·denom(3,-q₀-q₂/t,mass_scalar_2²,-mass_scalar_2²+2·(q₀.q₂)/t+(q₂.q₂)/t²+(q₀.q₀))
  2111. 151.16 s > ·denom(2,q₂/t,mass_scalar_2²,-mass_scalar_2²+(q₂.q₂)/t²))
  2112. 151.16 s > span t{span_context=true current=subgraph=y, topo_order=1, dod=2 given=subgraph=0, topo_order=0, dod=0}
  2113. 151.16 s > [2026-08-28 12:19:22.754] @approx::local_4d [{#uv, #integrated, #rescaled}] DEBUG : Rescaled expanded
  2114. 151.16 s > field value
  2115. 151.16 s > n_loops 1
  2116. 151.16 s > res n-terms: 1, byte size: 707,expr:
  2117. 151.16 s > -SCALAR_COUPLING²·q₀(αᵉ².¹)·q₀(αᵉ³.¹)·q₂(αᵉ².¹)·q₂(αᵉ³.¹)
  2118. 151.16 s > /(t²·denom(3,-q₂,mUVexp²+t²·mass_scalar_2²,-mUV²+t²·(-mass_scalar_2²+2·(q₀.q₂)/t+(q₂.q₂)/t²+(q₀.q₀))+t²·mUVexp²)
  2119. 151.16 s > ·denom(2,q₂,mUVexp²+t²·mass_scalar_2²,-mUV²+t²·(-mass_scalar_2²+(q₂.q₂)/t²)+t²·mUVexp²))
  2120. 151.16 s > span t{span_context=true current=subgraph=y, topo_order=1, dod=2 given=subgraph=0, topo_order=0, dod=0}
  2121. 151.16 s > [2026-08-28 12:19:22.761] @approx::local_4d [{#uv, #integrated, #series}] DEBUG : Series expanded
  2122. 151.16 s > field value
  2123. 151.16 s > res n-terms: 3, byte size: 1896,expr:
  2124. 151.16 s > (1/2·SCALAR_COUPLING²·(2·mUVexp²-2·mass_scalar_2²)/(denom(2,q₂,mUVexp²,-mUV²+(q₂.q₂))²·denom(3,-q₂,mUVexp²,-mUV²+(q₂.q₂)))
  2125. 151.16 s > -SCALAR_COUPLING²
  2126. 151.16 s > ·(-1/2·(2·mUVexp²-2·mass_scalar_2²+2·(q₀.q₀))/denom(3,-q₂,mUVexp²,-mUV²+(q₂.q₂))
  2127. 151.16 s > +4·(q₀.q₂)²/denom(3,-q₂,mUVexp²,-mUV²+(q₂.q₂))²
  2128. 151.16 s > )/(denom(2,q₂,mUVexp²,-mUV²+(q₂.q₂))·denom(3,-q₂,mUVexp²,-mUV²+(q₂.q₂)))
  2129. 151.16 s > )·q₀(αᵉ².¹)·q₀(αᵉ³.¹)·q₂(αᵉ².¹)·q₂(αᵉ³.¹)
  2130. 151.16 s > +2·SCALAR_COUPLING²·(q₀.q₂)·q₀(αᵉ².¹)·q₀(αᵉ³.¹)·q₂(αᵉ².¹)·q₂(αᵉ³.¹)
  2131. 151.16 s > /(t·denom(2,q₂,mUVexp²,-mUV²+(q₂.q₂))·denom(3,-q₂,mUVexp²,-mUV²+(q₂.q₂))²)
  2132. 151.16 s > -SCALAR_COUPLING²·q₀(αᵉ².¹)·q₀(αᵉ³.¹)·q₂(αᵉ².¹)·q₂(αᵉ³.¹)
  2133. 151.16 s > /(t²·denom(2,q₂,mUVexp²,-mUV²+(q₂.q₂))·denom(3,-q₂,mUVexp²,-mUV²+(q₂.q₂)))
  2134. 151.16 s > span t{span_context=true current=subgraph=y, topo_order=1, dod=2 given=subgraph=0, topo_order=0, dod=0}
  2135. 151.16 s > [2026-08-28 12:19:22.762] @approx::local_4d [{#uv, #integrated, #series}] DEBUG : Evaluated at t = 1
  2136. 151.16 s > field value
  2137. 151.16 s > res n-terms: 3, byte size: 1880,expr:
  2138. 151.16 s > (1/2·SCALAR_COUPLING²·(2·mUVexp²-2·mass_scalar_2²)/(denom(2,q₂,mUVexp²,-mUV²+(q₂.q₂))²·denom(3,-q₂,mUVexp²,-mUV²+(q₂.q₂)))
  2139. 151.16 s > -SCALAR_COUPLING²
  2140. 151.16 s > ·(-1/2·(2·mUVexp²-2·mass_scalar_2²+2·(q₀.q₀))/denom(3,-q₂,mUVexp²,-mUV²+(q₂.q₂))
  2141. 151.16 s > +4·(q₀.q₂)²/denom(3,-q₂,mUVexp²,-mUV²+(q₂.q₂))²
  2142. 151.16 s > )/(denom(2,q₂,mUVexp²,-mUV²+(q₂.q₂))·denom(3,-q₂,mUVexp²,-mUV²+(q₂.q₂)))
  2143. 151.16 s > )·q₀(αᵉ².¹)·q₀(αᵉ³.¹)·q₂(αᵉ².¹)·q₂(αᵉ³.¹)
  2144. 151.16 s > -SCALAR_COUPLING²·q₀(αᵉ².¹)·q₀(αᵉ³.¹)·q₂(αᵉ².¹)·q₂(αᵉ³.¹)
  2145. 151.16 s > /(denom(2,q₂,mUVexp²,-mUV²+(q₂.q₂))·denom(3,-q₂,mUVexp²,-mUV²+(q₂.q₂)))
  2146. 151.16 s > +2·SCALAR_COUPLING²·(q₀.q₂)·q₀(αᵉ².¹)·q₀(αᵉ³.¹)·q₂(αᵉ².¹)·q₂(αᵉ³.¹)
  2147. 151.16 s > /(denom(2,q₂,mUVexp²,-mUV²+(q₂.q₂))·denom(3,-q₂,mUVexp²,-mUV²+(q₂.q₂))²)
  2148. 151.16 s > span t{span_context=true current=subgraph=y, topo_order=1, dod=2 given=subgraph=0, topo_order=0, dod=0}
  2149. 151.16 s > [2026-08-28 12:19:22.771] @approx::local_4d [{#uv, #collect, #integrated}] DEBUG : After gamma chain collection
  2150. 151.16 s > field value
  2151. 151.16 s > expr n-terms: 3, byte size: 1880,expr:
  2152. 151.16 s > (1/2·SCALAR_COUPLING²·(2·mUVexp²-2·mass_scalar_2²)/(denom(2,q₂,mUVexp²,-mUV²+(q₂.q₂))²·denom(3,-q₂,mUVexp²,-mUV²+(q₂.q₂)))
  2153. 151.16 s > -SCALAR_COUPLING²
  2154. 151.16 s > ·(-1/2·(2·mUVexp²-2·mass_scalar_2²+2·(q₀.q₀))/denom(3,-q₂,mUVexp²,-mUV²+(q₂.q₂))
  2155. 151.16 s > +4·(q₀.q₂)²/denom(3,-q₂,mUVexp²,-mUV²+(q₂.q₂))²
  2156. 151.16 s > )/(denom(2,q₂,mUVexp²,-mUV²+(q₂.q₂))·denom(3,-q₂,mUVexp²,-mUV²+(q₂.q₂)))
  2157. 151.16 s > )·q₀(αᵉ².¹)·q₀(αᵉ³.¹)·q₂(αᵉ².¹)·q₂(αᵉ³.¹)
  2158. 151.16 s > -SCALAR_COUPLING²·q₀(αᵉ².¹)·q₀(αᵉ³.¹)·q₂(αᵉ².¹)·q₂(αᵉ³.¹)
  2159. 151.16 s > /(denom(2,q₂,mUVexp²,-mUV²+(q₂.q₂))·denom(3,-q₂,mUVexp²,-mUV²+(q₂.q₂)))
  2160. 151.16 s > +2·SCALAR_COUPLING²·(q₀.q₂)·q₀(αᵉ².¹)·q₀(αᵉ³.¹)·q₂(αᵉ².¹)·q₂(αᵉ³.¹)
  2161. 151.16 s > /(denom(2,q₂,mUVexp²,-mUV²+(q₂.q₂))·denom(3,-q₂,mUVexp²,-mUV²+(q₂.q₂))²)
  2162. 151.16 s > span t{span_context=true current=subgraph=y, topo_order=1, dod=2 given=subgraph=0, topo_order=0, dod=0}
  2163. 151.16 s > [2026-08-28 12:19:22.780] @approx::local_4d [{#profile, #uv, #collect, #integrated, #start, #trace}] DEBUG : After gamma schoonschip
  2164. 151.16 s > field value
  2165. 151.16 s > expr n-terms: 3, byte size: 1631,expr:
  2166. 151.16 s > (1/2·SCALAR_COUPLING²·(2·mUVexp²-2·mass_scalar_2²)/(denom(2,q₂,mUVexp²,-mUV²+(q₂.q₂))²·denom(3,-q₂,mUVexp²,-mUV²+(q₂.q₂)))
  2167. 151.16 s > -SCALAR_COUPLING²
  2168. 151.16 s > ·(-1/2·(2·mUVexp²-2·mass_scalar_2²+2·(q₀.q₀))/denom(3,-q₂,mUVexp²,-mUV²+(q₂.q₂))
  2169. 151.16 s > +4·(q₀.q₂)²/denom(3,-q₂,mUVexp²,-mUV²+(q₂.q₂))²
  2170. 151.16 s > )/(denom(2,q₂,mUVexp²,-mUV²+(q₂.q₂))·denom(3,-q₂,mUVexp²,-mUV²+(q₂.q₂)))
  2171. 151.16 s > )·(q₀.q₂)²
  2172. 151.16 s > -SCALAR_COUPLING²·(q₀.q₂)²/(denom(2,q₂,mUVexp²,-mUV²+(q₂.q₂))·denom(3,-q₂,mUVexp²,-mUV²+(q₂.q₂)))
  2173. 151.16 s > +2·SCALAR_COUPLING²·(q₀.q₂)·(q₀.q₂)²
  2174. 151.16 s > /(denom(2,q₂,mUVexp²,-mUV²+(q₂.q₂))·denom(3,-q₂,mUVexp²,-mUV²+(q₂.q₂))²)
  2175. 151.16 s > span t{span_context=true current=subgraph=y, topo_order=1, dod=2 given=subgraph=0, topo_order=0, dod=0}
  2176. 151.16 s > [2026-08-28 12:19:22.782] @approx::local_4d [{#profile, #uv, #collect, #integrated, #start, #trace}] DEBUG : After gamma collection
  2177. 151.16 s > field value
  2178. 151.16 s > expr n-terms: 1, byte size: 1347,expr:
  2179. 151.16 s > SCALAR_COUPLING²
  2180. 151.16 s > ·(-denom(2,q₂,mUVexp²,-mUV²+(q₂.q₂))·denom(3,-q₂,mUVexp²,-mUV²+(q₂.q₂))²
  2181. 151.16 s > +1/2·(2·mUVexp²-2·mass_scalar_2²)·denom(3,-q₂,mUVexp²,-mUV²+(q₂.q₂))²
  2182. 151.16 s > -(-1/2·(2·mUVexp²-2·mass_scalar_2²+2·(q₀.q₀))·denom(3,-q₂,mUVexp²,-mUV²+(q₂.q₂))+4·(q₀.q₂)²)
  2183. 151.16 s > ·denom(2,q₂,mUVexp²,-mUV²+(q₂.q₂))
  2184. 151.16 s > +2·(q₀.q₂)·denom(2,q₂,mUVexp²,-mUV²+(q₂.q₂))·denom(3,-q₂,mUVexp²,-mUV²+(q₂.q₂))
  2185. 151.16 s > )·(q₀.q₂)²/(denom(2,q₂,mUVexp²,-mUV²+(q₂.q₂))²·denom(3,-q₂,mUVexp²,-mUV²+(q₂.q₂))³)
  2186. 151.16 s > span t{span_context=true current=subgraph=y, topo_order=1, dod=2 given=subgraph=0, topo_order=0, dod=0}
  2187. 151.16 s > [2026-08-28 12:19:22.790] @approx::local_4d [{#profile, #uv, #gamma, #integrated, #start, #trace, #vakint}] DEBUG : After gamma simplification
  2188. 151.16 s > ... omitted 3263 more lines; see full nextest output above
  2189. 151.16 s >
  2190. 151.16 s > 8. gammaloop-integration-tests::uv::sunrise_scalar_1_uv
  2191. 151.16 s > failure: test failure with exit code 101
  2192. 151.16 s > system-out
  2193. 151.16 s > running 1 test
  2194. 151.16 s > test sunrise_scalar_1_uv has been running for over 60 seconds
  2195. 151.16 s > +------------------+------------------------+--------------+--------+----------+----------------------------------------------------------------------------------------------------------------------+-------+
  2196. 151.16 s > | case | check | graph | status | sigma | threshold | error |
  2197. 151.16 s > +------------------+------------------------+--------------+--------+----------+----------------------------------------------------------------------------------------------------------------------+-------+
  2198. 151.16 s > | sunrise_scalar_1 | uv_profile | - | FAIL | - | - | - |
  2199. 151.16 s > +------------------+------------------------+--------------+--------+----------+----------------------------------------------------------------------------------------------------------------------+-------+
  2200. 151.16 s > | sunrise_scalar_1 | m_uv.inspect | inspect | pass | - | best inspect relative delta 1.624e0 >= 1000*accuracy 1.000e-3 (accuracy=1.000e-6, exponent=+1.0, seed=1, probes=10) | - |
  2201. 151.16 s > +------------------+------------------------+--------------+--------+----------+----------------------------------------------------------------------------------------------------------------------+-------+
  2202. 151.16 s > | sunrise_scalar_1 | m_uv.integrated | sunrise | pass | 0.1sigma | compatible within 2sigma | - |
  2203. 151.16 s > +------------------+------------------------+--------------+--------+----------+----------------------------------------------------------------------------------------------------------------------+-------+
  2204. 151.16 s > | sunrise_scalar_1 | rls.inspect | inspect | pass | - | best inspect relative delta 8.682e-1 >= 1000*accuracy 1.000e-3 (accuracy=1.000e-6, exponent=+1.0, seed=1, probes=10) | - |
  2205. 151.16 s > +------------------+------------------------+--------------+--------+----------+----------------------------------------------------------------------------------------------------------------------+-------+
  2206. 151.16 s > | sunrise_scalar_1 | rls.integrated | sunrise | pass | 0.0sigma | compatible within 2sigma | - |
  2207. 151.16 s > +------------------+------------------------+--------------+--------+----------+----------------------------------------------------------------------------------------------------------------------+-------+
  2208. 151.16 s > | sunrise_scalar_1 | mu_r.inspect | inspect | pass | - | best inspect relative delta 1.752e0 >= 1000*accuracy 1.000e-3 (accuracy=1.000e-6, exponent=+1.0, seed=1, probes=10) | - |
  2209. 151.16 s > +------------------+------------------------+--------------+--------+----------+----------------------------------------------------------------------------------------------------------------------+-------+
  2210. 151.16 s > | sunrise_scalar_1 | integrated.relerr | integrated | pass | - | relative error 9.20% <= 10.00% | - |
  2211. 151.16 s > +------------------+------------------------+--------------+--------+----------+----------------------------------------------------------------------------------------------------------------------+-------+
  2212. 151.16 s > | sunrise_scalar_1 | m_uv.integrated.relerr | m_uv-shifted | pass | - | relative error 5.89% <= 10.00% | - |
  2213. 151.16 s > +------------------+------------------------+--------------+--------+----------+----------------------------------------------------------------------------------------------------------------------+-------+
  2214. 151.16 s > | sunrise_scalar_1 | target | - | pass | - | 2sigma | - |
  2215. 151.16 s > +------------------+------------------------+--------------+--------+----------+----------------------------------------------------------------------------------------------------------------------+-------+
  2216. 151.16 s > test sunrise_scalar_1_uv ... FAILED
  2217. 151.16 s >
  2218. 151.16 s > failures:
  2219. 151.16 s >
  2220. 151.16 s > failures:
  2221. 151.16 s > sunrise_scalar_1_uv
  2222. 151.16 s >
  2223. 151.16 s > test result: FAILED. 0 passed; 1 failed; 0 ignored; 0 measured; 24 filtered out; finished in 104.17s
  2224. 151.16 s > system-err
  2225. 151.16 s > [2026-08-28 12:19:30.251] @gammaloop_api::se... INFO : Running command run generate
  2226. 151.16 s > [2026-08-28 12:19:30.251] @gammaloop_api::se... INFO : Starting command block generate
  2227. 151.16 s > [2026-08-28 12:19:30.251] @gammaloop_api::se... INFO : Running command import model scalars-default.json
  2228. 151.16 s > [2026-08-28 12:19:30.251] @import::model INFO : Loading built-in JSON model scalars-default
  2229. 151.16 s > [2026-08-28 12:19:30.255] @gammalooprs::model INFO : The following 2 external parameters were forced to zero by the restriction card:
  2230. 151.16 s > width_scalar_1, width_scalar_2
  2231. 151.16 s > [2026-08-28 12:19:30.255] @gammaloop_api::se... INFO : Running command remove processes
  2232. 151.16 s > [2026-08-28 12:19:30.256] @gammaloop_api::se... INFO : Running command set global kv global.generation.uv.generate_integrated=true
  2233. 151.16 s > [2026-08-28 12:19:30.259] @gammaloop_api::se... INFO : Running command import graphs ./tests/resources/graphs/scalar_sunrise.dot -p sunrise_scalar_1 -i scalar_sunrise
  2234. 151.16 s > [2026-08-28 12:19:30.259] @commands::import INFO : Loading graphs from '/build/source/tests/resources/graphs/scalar_sunrise.dot'
  2235. 151.16 s > [2026-08-28 12:19:30.262] @gammaloop_api::se... INFO : Running command generate existing -p sunrise_scalar_1 -i scalar_sunrise
  2236. 151.16 s > [2026-08-28 12:19:30.267] @approx::local_4d [{#uv, #inspect, #integrated}] DEBUG : Rescaled momenta expanded
  2237. 151.16 s > field value
  2238. 151.16 s > res n-terms: 1, byte size: 777,expr:
  2239. 151.16 s > 1/(denom(0,q₀/t,mass_scalar_1²,-mass_scalar_1²+(q₀.q₀)/t²)·denom(1,q₁/t,mass_scalar_1²,-mass_scalar_1²+(q₁.q₁)/t²)
  2240. 151.16 s > ·denom(2,q₄-q₀/t-q₁/t,mass_scalar_1²,
  2241. 151.16 s > -mass_scalar_1²-2·(q₀.q₄)/t-2·(q₁.q₄)/t+(q₀.q₀)/t²+2·(q₀.q₁)/t²
  2242. 151.16 s > +(q₁.q₁)/t²+(q₄.q₄)
  2243. 151.16 s > ))
  2244. 151.16 s > [2026-08-28 12:19:30.270] @approx::local_4d [{#uv, #inspect, #integrated}] DEBUG : Rescaled momenta expanded
  2245. 151.16 s > field value
  2246. 151.16 s > res n-terms: 1, byte size: 3,expr:
  2247. 151.16 s > 1
  2248. 151.16 s > [2026-08-28 12:19:30.270] @approx::local_4d [{#uv, #inspect, #integrated}] DEBUG : Rescaled momenta expanded
  2249. 151.16 s > field value
  2250. 151.16 s > res n-terms: 1, byte size: 611,expr:
  2251. 151.16 s > 1/(denom(1,q₁/t,mass_scalar_1²,-mass_scalar_1²+(q₁.q₁)/t²)
  2252. 151.16 s > ·denom(2,-q₀+q₃-q₁/t,mass_scalar_1²,
  2253. 151.16 s > -mass_scalar_1²+2·(q₀.q₁)/t-2·(q₁.q₃)/t+(q₁.q₁)/t²+(q₀.q₀)
  2254. 151.16 s > -2·(q₀.q₃)+(q₃.q₃)
  2255. 151.16 s > ))
  2256. 151.16 s > [2026-08-28 12:19:30.271] @approx::local_4d [{#uv, #inspect, #integrated}] DEBUG : Rescaled momenta expanded
  2257. 151.16 s > field value
  2258. 151.16 s > res n-terms: 1, byte size: 611,expr:
  2259. 151.16 s > 1/(denom(0,q₀/t,mass_scalar_1²,-mass_scalar_1²+(q₀.q₀)/t²)
  2260. 151.16 s > ·denom(2,-q₁+q₃-q₀/t,mass_scalar_1²,
  2261. 151.16 s > -mass_scalar_1²+2·(q₀.q₁)/t-2·(q₀.q₃)/t+(q₀.q₀)/t²+(q₁.q₁)
  2262. 151.16 s > -2·(q₁.q₃)+(q₃.q₃)
  2263. 151.16 s > ))
  2264. 151.16 s > [2026-08-28 12:19:30.276] @approx::local_4d [{#uv, #inspect, #integrated}] DEBUG : Rescaled momenta expanded
  2265. 151.16 s > field value
  2266. 151.16 s > res n-terms: 1, byte size: 611,expr:
  2267. 151.16 s > 1/(denom(0,q₀/t,mass_scalar_1²,-mass_scalar_1²+(q₀.q₀)/t²)
  2268. 151.16 s > ·denom(1,-q₂+q₃-q₀/t,mass_scalar_1²,
  2269. 151.16 s > -mass_scalar_1²+2·(q₀.q₂)/t-2·(q₀.q₃)/t+(q₀.q₀)/t²+(q₂.q₂)
  2270. 151.16 s > -2·(q₂.q₃)+(q₃.q₃)
  2271. 151.16 s > ))
  2272. 151.16 s > [2026-08-28 12:19:30.277] @approx::final_integrand[{#generation, #profile, #uv, #graph, #summary}] DEBUG : Computed global numerator
  2273. 151.16 s > field value
  2274. 151.16 s > global_num n-terms: 1, byte size: 3,expr:
  2275. 151.16 s > 1
  2276. 151.16 s > span build_3d{span_context=true graph=sunrise current=subgraph=0, topo_order=0, dod=0}
  2277. 151.16 s > [2026-08-28 12:19:30.279] @uv::approx [{#generation, #uv, #fourd}] DEBUG : Computing 4D
  2278. 151.16 s > field value
  2279. 151.16 s > simple subgraph(S_47,S_44)*Approx(subgraph(S_44,0)) of sunrise
  2280. 151.16 s > span compute_4d{span_context=true graph=sunrise current=subgraph=44, topo_order=1, dod=2 given=subgraph=0, topo_order=0, dod=0 reduced=SubSet { set: BitVec<usize, bitvec::order::Lsb0> { addr: 0x7fffd800cb20, head: 000000, bits: 8, capacity: 64 } [0, 0, 1, 1, 1, 1, 1, 1], id: PhantomData<linnet::half_edge::involution::Hedge> }}
  2281. 151.16 s > [2026-08-28 12:19:30.280] @approx::local_4d [{#uv, #algebra, #integrated, #start}] DEBUG :
  2282. 151.16 s > field value
  2283. 151.16 s > integrand n-terms: 1, byte size: 322,expr:
  2284. 151.16 s > 1/(denom(0,q₀,mass_scalar_1²,-mass_scalar_1²+(q₀.q₀))·denom(1,q₁,mass_scalar_1²,-mass_scalar_1²+(q₁.q₁))
  2285. 151.16 s > ·denom(2,q₂,mass_scalar_1²,-mass_scalar_1²+(q₂.q₂)))
  2286. 151.16 s > reduced 44
  2287. 151.16 s > span grow{span_context=true current=subgraph=44, topo_order=1, dod=2 given=subgraph=0, topo_order=0, dod=0}
  2288. 151.16 s > [2026-08-28 12:19:30.280] @approx::local_4d [{#uv, #inspect, #integrated}] DEBUG : Rescaled momenta expanded
  2289. 151.16 s > field value
  2290. 151.16 s > res n-terms: 1, byte size: 777,expr:
  2291. 151.16 s > 1/(denom(0,q₀/t,mass_scalar_1²,-mass_scalar_1²+(q₀.q₀)/t²)·denom(1,q₁/t,mass_scalar_1²,-mass_scalar_1²+(q₁.q₁)/t²)
  2292. 151.16 s > ·denom(2,q₄-q₀/t-q₁/t,mass_scalar_1²,
  2293. 151.16 s > -mass_scalar_1²-2·(q₀.q₄)/t-2·(q₁.q₄)/t+(q₀.q₀)/t²+2·(q₀.q₁)/t²
  2294. 151.16 s > +(q₁.q₁)/t²+(q₄.q₄)
  2295. 151.16 s > ))
  2296. 151.16 s > span t{span_context=true current=subgraph=44, topo_order=1, dod=2 given=subgraph=0, topo_order=0, dod=0}
  2297. 151.16 s > [2026-08-28 12:19:30.281] @approx::local_4d [{#uv, #integrated, #rescaled}] DEBUG : Rescaled expanded
  2298. 151.16 s > field value
  2299. 151.16 s > n_loops 2
  2300. 151.16 s > res n-terms: 1, byte size: 982,expr:
  2301. 151.16 s > 1/(t²
  2302. 151.16 s > ·denom(2,-q₀-q₁,mUVexp²+t²·mass_scalar_1²,
  2303. 151.16 s > -mUV²
  2304. 151.16 s > +t²
  2305. 151.16 s > ·(-mass_scalar_1²-2·(q₀.q₄)/t-2·(q₁.q₄)/t+(q₀.q₀)/t²+2·(q₀.q₁)/t²
  2306. 151.16 s > +(q₁.q₁)/t²+(q₄.q₄)
  2307. 151.16 s > )
  2308. 151.16 s > +t²·mUVexp²
  2309. 151.16 s > )
  2310. 151.16 s > ·denom(0,q₀,mUVexp²+t²·mass_scalar_1²,-mUV²+t²·(-mass_scalar_1²+(q₀.q₀)/t²)+t²·mUVexp²)
  2311. 151.16 s > ·denom(1,q₁,mUVexp²+t²·mass_scalar_1²,-mUV²+t²·(-mass_scalar_1²+(q₁.q₁)/t²)+t²·mUVexp²))
  2312. 151.16 s > span t{span_context=true current=subgraph=44, topo_order=1, dod=2 given=subgraph=0, topo_order=0, dod=0}
  2313. 151.16 s > [2026-08-28 12:19:30.286] @approx::local_4d [{#uv, #integrated, #series}] DEBUG : Series expanded
  2314. 151.16 s > field value
  2315. 151.16 s > res n-terms: 4, byte size: 3187,expr:
  2316. 151.16 s > -1/2·(2·mUVexp²-2·mass_scalar_1²)
  2317. 151.16 s > /(denom(0,q₀,mUVexp²,-mUV²+(q₀.q₀))·denom(1,q₁,mUVexp²,-mUV²+(q₁.q₁))²
  2318. 151.16 s > ·denom(2,-q₀-q₁,mUVexp²,-mUV²+(q₀.q₀)+2·(q₀.q₁)+(q₁.q₁)))
  2319. 151.16 s > +(-1/2·(2·mUVexp²-2·mass_scalar_1²)
  2320. 151.16 s > /(denom(0,q₀,mUVexp²,-mUV²+(q₀.q₀))²
  2321. 151.16 s > ·denom(2,-q₀-q₁,mUVexp²,-mUV²+(q₀.q₀)+2·(q₀.q₁)+(q₁.q₁)))
  2322. 151.16 s > +(-1/2·(2·mUVexp²-2·mass_scalar_1²+2·(q₄.q₄))
  2323. 151.16 s > /denom(2,-q₀-q₁,mUVexp²,-mUV²+(q₀.q₀)+2·(q₀.q₁)+(q₁.q₁))
  2324. 151.16 s > +(-2·(q₀.q₄)-2·(q₁.q₄))²
  2325. 151.16 s > /denom(2,-q₀-q₁,mUVexp²,-mUV²+(q₀.q₀)+2·(q₀.q₁)+(q₁.q₁))²
  2326. 151.16 s > )
  2327. 151.16 s > /(denom(0,q₀,mUVexp²,-mUV²+(q₀.q₀))
  2328. 151.16 s > ·denom(2,-q₀-q₁,mUVexp²,-mUV²+(q₀.q₀)+2·(q₀.q₁)+(q₁.q₁)))
  2329. 151.16 s > )/denom(1,q₁,mUVexp²,-mUV²+(q₁.q₁))
  2330. 151.16 s > -(-2·(q₀.q₄)-2·(q₁.q₄))
  2331. 151.16 s > /(t·denom(0,q₀,mUVexp²,-mUV²+(q₀.q₀))·denom(1,q₁,mUVexp²,-mUV²+(q₁.q₁))
  2332. 151.16 s > ·denom(2,-q₀-q₁,mUVexp²,-mUV²+(q₀.q₀)+2·(q₀.q₁)+(q₁.q₁))²)
  2333. 151.16 s > +1/(t²·denom(0,q₀,mUVexp²,-mUV²+(q₀.q₀))·denom(1,q₁,mUVexp²,-mUV²+(q₁.q₁))
  2334. 151.16 s > ·denom(2,-q₀-q₁,mUVexp²,-mUV²+(q₀.q₀)+2·(q₀.q₁)+(q₁.q₁)))
  2335. 151.16 s > span t{span_context=true current=subgraph=44, topo_order=1, dod=2 given=subgraph=0, topo_order=0, dod=0}
  2336. 151.16 s > [2026-08-28 12:19:30.286] @approx::local_4d [{#uv, #integrated, #series}] DEBUG : Evaluated at t = 1
  2337. 151.16 s > field value
  2338. 151.16 s > res n-terms: 4, byte size: 3171,expr:
  2339. 151.16 s > -1/2·(2·mUVexp²-2·mass_scalar_1²)
  2340. 151.16 s > /(denom(0,q₀,mUVexp²,-mUV²+(q₀.q₀))·denom(1,q₁,mUVexp²,-mUV²+(q₁.q₁))²
  2341. 151.16 s > ·denom(2,-q₀-q₁,mUVexp²,-mUV²+(q₀.q₀)+2·(q₀.q₁)+(q₁.q₁)))
  2342. 151.16 s > -(-2·(q₀.q₄)-2·(q₁.q₄))
  2343. 151.16 s > /(denom(0,q₀,mUVexp²,-mUV²+(q₀.q₀))·denom(1,q₁,mUVexp²,-mUV²+(q₁.q₁))
  2344. 151.16 s > ... omitted 20090 more lines; see full nextest output above
  2345. 151.16 s >
  2346. 151.16 s > 9. gammaloop-integration-tests::uv::se1l_uv
  2347. 151.16 s > failure: test failure with exit code 101
  2348. 151.16 s > system-out
  2349. 151.16 s > running 1 test
  2350. 151.16 s > test se1l_uv has been running for over 60 seconds
  2351. 151.16 s > +------+-----------------+---------+--------+----------+-----------------------------------------------------------------------------------------------------------------------+-------+
  2352. 151.16 s > | case | check | graph | status | sigma | threshold | error |
  2353. 151.16 s > +------+-----------------+---------+--------+----------+-----------------------------------------------------------------------------------------------------------------------+-------+
  2354. 151.16 s > | se1l | uv_profile | - | FAIL | - | - | - |
  2355. 151.16 s > +------+-----------------+---------+--------+----------+-----------------------------------------------------------------------------------------------------------------------+-------+
  2356. 151.16 s > | se1l | m_uv.inspect | inspect | pass | - | best inspect relative delta 1.097e-1 >= 1000*accuracy 1.000e-7 (accuracy=1.000e-10, exponent=+2.0, seed=1, probes=10) | - |
  2357. 151.16 s > +------+-----------------+---------+--------+----------+-----------------------------------------------------------------------------------------------------------------------+-------+
  2358. 151.16 s > | se1l | m_uv.integrated | se1l | pass | 0.1sigma | compatible within 2sigma | - |
  2359. 151.16 s > +------+-----------------+---------+--------+----------+-----------------------------------------------------------------------------------------------------------------------+-------+
  2360. 151.16 s > | se1l | rls.inspect | inspect | pass | - | best inspect relative delta 4.499e-2 >= 1000*accuracy 1.000e-7 (accuracy=1.000e-10, exponent=+2.0, seed=1, probes=10) | - |
  2361. 151.16 s > +------+-----------------+---------+--------+----------+-----------------------------------------------------------------------------------------------------------------------+-------+
  2362. 151.16 s > | se1l | rls.integrated | se1l | pass | 0.0sigma | compatible within 2sigma | - |
  2363. 151.16 s > +------+-----------------+---------+--------+----------+-----------------------------------------------------------------------------------------------------------------------+-------+
  2364. 151.16 s > | se1l | mu_r.inspect | inspect | pass | - | best inspect relative delta 1.424e-1 >= 1000*accuracy 1.000e-7 (accuracy=1.000e-10, exponent=+2.0, seed=1, probes=10) | - |
  2365. 151.16 s > +------+-----------------+---------+--------+----------+-----------------------------------------------------------------------------------------------------------------------+-------+
  2366. 151.16 s > | se1l | target | - | pass | - | 2sigma | - |
  2367. 151.16 s > +------+-----------------+---------+--------+----------+-----------------------------------------------------------------------------------------------------------------------+-------+
  2368. 151.16 s > test se1l_uv ... FAILED
  2369. 151.16 s >
  2370. 151.16 s > failures:
  2371. 151.16 s >
  2372. 151.16 s > failures:
  2373. 151.16 s > se1l_uv
  2374. 151.16 s >
  2375. 151.16 s > test result: FAILED. 0 passed; 1 failed; 0 ignored; 0 measured; 24 filtered out; finished in 113.51s
  2376. 151.16 s > system-err
  2377. 151.16 s > [2026-08-28 12:19:29.856] @gammaloop_api::se... INFO : Running command run generate
  2378. 151.16 s > [2026-08-28 12:19:29.856] @gammaloop_api::se... INFO : Starting command block generate
  2379. 151.16 s > [2026-08-28 12:19:29.856] @gammaloop_api::se... INFO : Running command import model sm-default
  2380. 151.16 s > [2026-08-28 12:19:29.856] @import::model INFO : Loading built-in JSON model sm-default
  2381. 151.16 s > [2026-08-28 12:19:29.912] @gammalooprs::model INFO : The following 11 external parameters were forced to zero by the restriction card:
  2382. 151.16 s > lamWS, AWS, rhoWS, etaWS, ymc, yme, ymm, MC, Me, MM, WTau
  2383. 151.16 s > [2026-08-28 12:19:29.912] @gammalooprs::model INFO : The following 34 vertex rules were removed by the restriction card:
  2384. 151.16 s > V_82 -> (c~, d, G+) | V_83 -> (t~, d, G+) | V_84 -> (c~, s, G+) | V_85 -> (t~, s, G+) | V_86 -> (u~, b, G+) | V_87 -> (c~, b, G+) | V_90 -> (c~, d, W+) | V_91 -> (t~, d, W+) | V_92 -> (u~, s, W+) | V_94 -> (t~, s, W+) | V_95 -> (u~, b, W+) | V_96 -> (c~, b, W+) | V_101 -> (e+, e-, G0) | V_102 -> (mu+, mu-, G0) | V_104 -> (e+, e-, H) | V_105 -> (mu+, mu-, H) | V_110 -> (ve~, e-, G+) | V_111 -> (vm~, mu-, G+) | V_116 -> (b~, u, G-) | V_117 -> (d~, c, G-) | V_118 -> (s~, c, G-) | V_119 -> (b~, c, G-) | V_120 -> (d~, t, G-) | V_121 -> (s~, t, G-) | V_124 -> (s~, u, W-) | V_125 -> (b~, u, W-) | V_126 -> (d~, c, W-) | V_128 -> (b~, c, W-) | V_129 -> (d~, t, W-) | V_130 -> (s~, t, W-) | V_138 -> (c~, c, G0) | V_140 -> (c~, c, H) | V_145 -> (e+, ve, G-) | V_146 -> (mu+, vm, G-)
  2385. 151.16 s > [2026-08-28 12:19:29.912] @gammalooprs::model INFO : The following 36 couplings were removed by the restriction card:
  2386. 151.16 s > GC_13, GC_14, GC_16, GC_17, GC_18, GC_19, GC_20, GC_22, GC_23, GC_24, GC_25, GC_26, GC_28, GC_29, GC_42, GC_43, GC_44, GC_46, GC_47, GC_48, GC_84, GC_85, GC_86, GC_87, GC_88, GC_89, GC_90, GC_91, GC_92, GC_93, GC_101, GC_102, GC_103, GC_105, GC_106, GC_107
  2387. 151.16 s > [2026-08-28 12:19:29.913] @gammaloop_api::se... INFO : Running command remove processes
  2388. 151.16 s > [2026-08-28 12:19:29.916] @gammaloop_api::se... INFO : Running command set global kv global.generation.uv.generate_integrated=true
  2389. 151.16 s > [2026-08-28 12:19:29.917] @gammaloop_api::se... INFO : Running command import graphs ./tests/resources/graphs/uv_tests/se1l.dot -p se1l -i se1l
  2390. 151.16 s > [2026-08-28 12:19:29.917] @commands::import INFO : Loading graphs from '/build/source/tests/resources/graphs/uv_tests/se1l.dot'
  2391. 151.16 s > [2026-08-28 12:19:29.922] @gammaloop_api::se... INFO : Running command generate existing -p se1l -i se1l
  2392. 151.16 s > [2026-08-28 12:19:31.145] @commands::generate INFO :
  2393. 151.16 s > Integrand generation summary
  2394. 151.16 s > peak RAM 75.04 MiB | cores 1
  2395. 151.16 s > ╭───────────┬───────┬─────────┬─────────────┬─────────────┬────────────────┬─────────────╮
  2396. 151.16 s > │ integrand │ graph │ # evals │ expr build │ spenso │ symbolica eval │ compile │
  2397. 151.16 s > ├───────────┼───────┼─────────┼─────────────┼─────────────┼────────────────┼─────────────┤
  2398. 151.16 s > │ se1l │ se1l │ 5 │ 1.09s (90%) │ 44ms (3.7%) │ 73ms (6.1%) │ 0ms (0.00%) │
  2399. 151.16 s > ├───────────┼───────┼─────────┼─────────────┼─────────────┼────────────────┼─────────────┤
  2400. 151.16 s > │ Total │ │ 5 │ 1.09s (90%) │ 44ms (3.7%) │ 73ms (6.1%) │ 0ms (0.00%) │
  2401. 151.16 s > ╰───────────┴───────┴─────────┴─────────────┴─────────────┴────────────────┴─────────────╯
  2402. 151.16 s > [2026-08-28 12:19:31.146] @gammaloop_api::se... INFO : Running command set process -p se1l -i se1l kv general.m_uv=0.2
  2403. 151.16 s > [2026-08-28 12:19:31.147] @gammaloop_api::se... INFO : Running command set process -p se1l -i se1l kv general.mu_r=0.2
  2404. 151.16 s > [2026-08-28 12:19:31.148] @gammaloop_api::se... INFO : Running command set process -p se1l -i se1l kv general.renormalization_localization_scale=0.2
  2405. 151.16 s > [2026-08-28 12:19:31.149] @gammaloop_api::se... INFO : Running command duplicate integrand -p se1l -i se1l --output_process_name se1l --output_integrand_name se1l_muv_shifted
  2406. 151.16 s > [2026-08-28 12:19:31.151] @gammaloop_api::se... INFO : Running command set process -p se1l -i se1l_muv_shifted kv general.m_uv=0.5
  2407. 151.16 s > [2026-08-28 12:19:31.152] @gammaloop_api::se... INFO : Running command duplicate integrand -p se1l -i se1l --output_process_name se1l --output_integrand_name se1l_rls_shifted
  2408. 151.16 s > [2026-08-28 12:19:31.154] @gammaloop_api::se... INFO : Running command set process -p se1l -i se1l_rls_shifted kv general.renormalization_localization_scale=1
  2409. 151.16 s > [2026-08-28 12:19:31.155] @gammaloop_api::se... INFO : Running command duplicate integrand -p se1l -i se1l --output_process_name se1l --output_integrand_name se1l_mur_shifted
  2410. 151.16 s > [2026-08-28 12:19:31.157] @gammaloop_api::se... INFO : Running command set process -p se1l -i se1l_mur_shifted kv general.mu_r=0.8
  2411. 151.16 s > [2026-08-28 12:19:31.162] @process::amplitude WARNING : External state 0 ('g', PDG 21, helicity +) is off shell: p^2 = +2.5e5, expected m^2 = +0e0 (|Δ| = +2.5e5). Fixed-helicity spinor/vector/tensor external states may be ill-defined at this kinematic point.
  2412. 151.16 s > field value
  2413. 151.16 s > span warm_up{integrand.name=se1l}
  2414. 151.16 s > [2026-08-28 12:19:31.162] @process::amplitude WARNING : External state 1 ('g', PDG 21, helicity -) is off shell: p^2 = +2.5e5, expected m^2 = +0e0 (|Δ| = +2.5e5). Fixed-helicity spinor/vector/tensor external states may be ill-defined at this kinematic point.
  2415. 151.16 s > field value
  2416. 151.16 s > span warm_up{integrand.name=se1l}
  2417. 151.16 s > [2026-08-28 12:19:31.163] @process::amplitude INFO : Input is above threshold: 1 existing threshold E-surfaces across 1/1 graph groups
  2418. 151.16 s > field value
  2419. 151.16 s > existing_esurfaces 1
  2420. 151.16 s > group_count 1
  2421. 151.16 s > groups_above_threshold 1
  2422. 151.16 s > integrand se1l
  2423. 151.16 s > span warm_up{integrand.name=se1l}
  2424. 151.16 s > threshold_status above threshold
  2425. 151.16 s > [2026-08-28 12:19:31.163] @process::amplitude INFO : overlap structure of group 0: [1: [0(2,3)]]
  2426. 151.16 s > field value
  2427. 151.16 s > span warm_up{integrand.name=se1l}
  2428. 151.16 s > [2026-08-28 12:19:31.434] @commands::profile INFO :
  2429. 151.16 s > ╭───────┬──────┬──────────┬───────┬─────┬──────────┬───────────╮
  2430. 151.16 s > │ fixed │ → ∞ │ slope │ r2 │ DOD │ bare DOD │ inspect │
  2431. 151.16 s > ├───────┼──────┼──────────┼───────┼─────┼──────────┼───────────┤
  2432. 151.16 s > │ {} │ {e3} │ 1.639236 │ 0.904 │ 2 │ 2 │ arb retry │
  2433. 151.16 s > │ {} │ {e2} │ 1.698834 │ 0.902 │ 2 │ 2 │ arb retry │
  2434. 151.16 s > ╰───────┴──────┴──────────┴───────┴─────┴──────────┴───────────╯
  2435. 151.16 s > [2026-08-28 12:19:31.434] @commands::profile INFO :
  2436. 151.16 s > ╭───────┬──────┬─────────────┬──────────┬───────┬─────┬──────────┬───────────╮
  2437. 151.16 s > │ fixed │ → ∞ │ orientation │ slope │ r2 │ DOD │ bare DOD │ inspect │
  2438. 151.16 s > ├───────┼──────┼─────────────┼──────────┼───────┼─────┼──────────┼───────────┤
  2439. 151.16 s > │ {} │ {e3} │ 00-+ │ 0.343429 │ 0.145 │ 0 │ 2 │ arb retry │
  2440. 151.16 s > │ {} │ {e3} │ 00+- │ 0.342577 │ 0.135 │ 0 │ 2 │ arb retry │
  2441. 151.16 s > │ {} │ {e2} │ 00-+ │ 0.385975 │ 0.161 │ 0 │ 2 │ arb retry │
  2442. 151.16 s > │ {} │ {e2} │ 00+- │ 0.384920 │ 0.192 │ 0 │ 2 │ arb retry │
  2443. 151.16 s > ╰───────┴──────┴─────────────┴──────────┴───────┴─────┴──────────┴───────────╯
  2444. 151.16 s > [2026-08-28 12:19:31.435] @gammaloop_api::se... INFO : Running command set process kv integrator.target_relative_accuracy=0.001 integrator.n_increase=0 integrator.n_start=50000 integrator.n_max=400000 integrator.seed=1337
  2445. 151.16 s > [2026-08-28 12:19:31.436] @commands::integrate INFO : Created workspace directory at /build/source/tests/artifacts/se1l/integration_workspace_se1l
  2446. 151.16 s > [2026-08-28 12:19:31.461] @commands::integrate INFO : No integration state found, starting new integration
  2447. 151.16 s > [2026-08-28 12:19:31.461] @commands::integrate INFO : Gammaloop now integrates se1l@se1l, se1l@se1l_muv_shifted, se1l@se1l_rls_shifted
  2448. 151.16 s > [2026-08-28 12:19:31.462] @process::amplitude WARNING : External state 0 ('g', PDG 21, helicity +) is off shell: p^2 = +2.5e5, expected m^2 = +0e0 (|Δ| = +2.5e5). Fixed-helicity spinor/vector/tensor external states may be ill-defined at this kinematic point.
  2449. 151.16 s > field value
  2450. 151.16 s > span warm_up{integrand.name=se1l}
  2451. 151.16 s > [2026-08-28 12:19:31.462] @process::amplitude WARNING : External state 1 ('g', PDG 21, helicity -) is off shell: p^2 = +2.5e5, expected m^2 = +0e0 (|Δ| = +2.5e5). Fixed-helicity spinor/vector/tensor external states may be ill-defined at this kinematic point.
  2452. 151.16 s > field value
  2453. 151.16 s > span warm_up{integrand.name=se1l}
  2454. 151.16 s > [2026-08-28 12:19:31.462] @process::amplitude INFO : Input is above threshold: 1 existing threshold E-surfaces across 1/1 graph groups
  2455. 151.16 s > field value
  2456. 151.16 s > existing_esurfaces 1
  2457. 151.16 s > group_count 1
  2458. 151.16 s > groups_above_threshold 1
  2459. 151.16 s > integrand se1l
  2460. 151.16 s > span warm_up{integrand.name=se1l}
  2461. 151.16 s > threshold_status above threshold
  2462. 151.16 s > [2026-08-28 12:19:31.462] @process::amplitude INFO : overlap structure of group 0: [1: [0(2,3)]]
  2463. 151.16 s > field value
  2464. 151.16 s > span warm_up{integrand.name=se1l}
  2465. 151.16 s > [2026-08-28 12:19:31.463] @process::amplitude WARNING : External state 0 ('g', PDG 21, helicity +) is off shell: p^2 = +2.5e5, expected m^2 = +0e0 (|Δ| = +2.5e5). Fixed-helicity spinor/vector/tensor external states may be ill-defined at this kinematic point.
  2466. 151.16 s > field value
  2467. 151.16 s > span warm_up{integrand.name=se1l_muv_shifted}
  2468. 151.16 s > [2026-08-28 12:19:31.463] @process::amplitude WARNING : External state 1 ('g', PDG 21, helicity -) is off shell: p^2 = +2.5e5, expected m^2 = +0e0 (|Δ| = +2.5e5). Fixed-helicity spinor/vector/tensor external states may be ill-defined at this kinematic point.
  2469. 151.16 s > field value
  2470. 151.16 s > span warm_up{integrand.name=se1l_muv_shifted}
  2471. 151.16 s > [2026-08-28 12:19:31.464] @process::amplitude INFO : Input is above threshold: 1 existing threshold E-surfaces across 1/1 graph groups
  2472. 151.16 s > field value
  2473. 151.16 s > existing_esurfaces 1
  2474. 151.16 s > group_count 1
  2475. 151.16 s > groups_above_threshold 1
  2476. 151.16 s > integrand se1l_muv_shifted
  2477. 151.16 s > span warm_up{integrand.name=se1l_muv_shifted}
  2478. 151.16 s > threshold_status above threshold
  2479. 151.16 s > [2026-08-28 12:19:31.464] @process::amplitude INFO : overlap structure of group 0: [1: [0(2,3)]]
  2480. 151.16 s > field value
  2481. 151.16 s > span warm_up{integrand.name=se1l_muv_shifted}
  2482. 151.16 s > [2026-08-28 12:19:31.465] @process::amplitude WARNING : External state 0 ('g', PDG 21, helicity +) is off shell: p^2 = +2.5e5, expected m^2 = +0e0 (|Δ| = +2.5e5). Fixed-helicity spinor/vector/tensor external states may be ill-defined at this kinematic point.
  2483. 151.16 s > field value
  2484. 151.16 s > span warm_up{integrand.name=se1l_rls_shifted}
  2485. 151.16 s > [2026-08-28 12:19:31.465] @process::amplitude WARNING : External state 1 ('g', PDG 21, helicity -) is off shell: p^2 = +2.5e5, expected m^2 = +0e0 (|Δ| = +2.5e5). Fixed-helicity spinor/vector/tensor external states may be ill-defined at this kinematic point.
  2486. 151.16 s > field value
  2487. 151.16 s > span warm_up{integrand.name=se1l_rls_shifted}
  2488. 151.16 s > [2026-08-28 12:19:31.466] @process::amplitude INFO : Input is above threshold: 1 existing threshold E-surfaces across 1/1 graph groups
  2489. 151.16 s > field value
  2490. 151.16 s > existing_esurfaces 1
  2491. 151.16 s > group_count 1
  2492. 151.16 s > groups_above_threshold 1
  2493. 151.16 s > integrand se1l_rls_shifted
  2494. 151.16 s > span warm_up{integrand.name=se1l_rls_shifted}
  2495. 151.16 s > threshold_status above threshold
  2496. 151.16 s > ... omitted 1410 more lines; see full nextest output above
  2497. 151.16 s > =========================================
  2498. 151.16 s For full logs, run:
  2499. 151.16 s nix log /nix/store/ifx25i75mrp4mx011vk3kpahjasmfqfi-gammaloop-nextest-integration.drv
  2500. 151.28 s [0 built (1 failed)]Run failed.