test packages.x86_64-linux.nix-ci-check-gammaloop-nextest-integration

Reproduce this run
Retry Run
  1. 223.33 s gammaloop-nextest-integration> | dod2_bubble | rls.integrated | GL0 | pass | 0.0sigma | compatible within 2sigma | - |
  2. 223.33 s gammaloop-nextest-integration> +-------------+-----------------+---------+--------+----------+-----------------------------------------------------------------------------------------------------------------------+-------+
  3. 223.33 s gammaloop-nextest-integration> | dod2_bubble | mu_r.inspect | inspect | pass | - | best inspect relative delta 6.951e-1 >= 1000*accuracy 1.000e-7 (accuracy=1.000e-10, exponent=+0.0, seed=0, probes=10) | - |
  4. 223.33 s gammaloop-nextest-integration> +-------------+-----------------+---------+--------+----------+-----------------------------------------------------------------------------------------------------------------------+-------+
  5. 223.33 s gammaloop-nextest-integration> | dod2_bubble | target | - | pass | - | 2sigma | - |
  6. 223.33 s gammaloop-nextest-integration> +-------------+-----------------+---------+--------+----------+-----------------------------------------------------------------------------------------------------------------------+-------+
  7. 223.33 s gammaloop-nextest-integration> test dod2_bubble_uv ... FAILED
  8. 223.33 s gammaloop-nextest-integration>
  9. 223.33 s gammaloop-nextest-integration> failures:
  10. 223.33 s gammaloop-nextest-integration>
  11. 223.33 s gammaloop-nextest-integration> failures:
  12. 223.33 s gammaloop-nextest-integration> dod2_bubble_uv
  13. 223.33 s gammaloop-nextest-integration>
  14. 223.33 s gammaloop-nextest-integration> test result: FAILED. 0 passed; 1 failed; 0 ignored; 0 measured; 24 filtered out; finished in 68.11s
  15. 223.33 s gammaloop-nextest-integration> system-err
  16. 223.33 s gammaloop-nextest-integration> [2026-08-28 12:15:38.161] @gammaloop_api::se... INFO : Running command run generate
  17. 223.33 s gammaloop-nextest-integration> [2026-08-28 12:15:38.161] @gammaloop_api::se... INFO : Starting command block generate
  18. 223.33 s gammaloop-nextest-integration> [2026-08-28 12:15:38.161] @gammaloop_api::se... INFO : Running command import model scalars-default.json
  19. 223.33 s gammaloop-nextest-integration> [2026-08-28 12:15:38.161] @import::model INFO : Loading built-in JSON model scalars-default
  20. 223.33 s gammaloop-nextest-integration> [2026-08-28 12:15:38.165] @gammalooprs::model INFO : The following 2 external parameters were forced to zero by the restriction card:
  21. 223.33 s gammaloop-nextest-integration> width_scalar_1, width_scalar_2
  22. 223.33 s gammaloop-nextest-integration> [2026-08-28 12:15:38.165] @gammaloop_api::se... INFO : Running command remove processes
  23. 223.34 s gammaloop-nextest-integration> [2026-08-28 12:15:38.166] @gammaloop_api::se... INFO : Running command set global kv global.generation.uv.generate_integrated=true
  24. 223.34 s gammaloop-nextest-integration> [2026-08-28 12:15:38.166] @gammaloop_api::se... INFO : Running command import graphs ./tests/resources/graphs/scalar/dod2_bubble.dot -p bubble_dod2 -i scalar_bubble_below_thres
  25. 223.34 s gammaloop-nextest-integration> [2026-08-28 12:15:38.166] @commands::import INFO : Loading graphs from '/build/source/tests/resources/graphs/scalar/dod2_bubble.dot'
  26. 223.34 s gammaloop-nextest-integration> [2026-08-28 12:15:38.169] @gammaloop_api::se... INFO : Running command generate existing -p bubble_dod2 -i scalar_bubble_below_thres
  27. 223.34 s gammaloop-nextest-integration> [2026-08-28 12:15:38.171] @approx::local_4d [{#uv, #inspect, #integrated}] DEBUG : Rescaled momenta expanded
  28. 223.34 s gammaloop-nextest-integration> field value
  29. 223.34 s gammaloop-nextest-integration> res n-terms: 1, byte size: 585,expr:
  30. 223.34 s gammaloop-nextest-integration> -SCALAR_COUPLING²·q₀(αᵉ².¹)·q₀(αᵉ³.¹)·q₂(αᵉ².¹)·q₂(αᵉ³.¹)
  31. 223.34 s gammaloop-nextest-integration> /(t²·denom(3,-q₀-q₂/t,mass_scalar_2²,-mass_scalar_2²+2·(q₀.q₂)/t+(q₂.q₂)/t²+(q₀.q₀))
  32. 223.34 s gammaloop-nextest-integration> ·denom(2,q₂/t,mass_scalar_2²,-mass_scalar_2²+(q₂.q₂)/t²))
  33. 223.34 s gammaloop-nextest-integration> [2026-08-28 12:15:38.177] @approx::local_4d [{#uv, #inspect, #integrated}] DEBUG : Rescaled momenta expanded
  34. 223.34 s gammaloop-nextest-integration> field value
  35. 223.34 s gammaloop-nextest-integration> res n-terms: 1, byte size: 3,expr:
  36. 223.34 s gammaloop-nextest-integration> 1
  37. 223.34 s gammaloop-nextest-integration> [2026-08-28 12:15:38.178] @approx::final_integrand[{#generation, #profile, #uv, #graph, #summary}] DEBUG : Computed global numerator
  38. 223.34 s gammaloop-nextest-integration> field value
  39. 223.34 s gammaloop-nextest-integration> global_num n-terms: 1, byte size: 4,expr:
  40. 223.34 s gammaloop-nextest-integration> 1/2
  41. 223.34 s gammaloop-nextest-integration> span build_3d{span_context=true graph=GL0 current=subgraph=0, topo_order=0, dod=0}
  42. 223.34 s gammaloop-nextest-integration> [2026-08-28 12:15:38.184] @uv::approx [{#generation, #uv, #fourd}] DEBUG : Computing 4D
  43. 223.34 s gammaloop-nextest-integration> field value
  44. 223.34 s gammaloop-nextest-integration> simple subgraph(S_11,S_y)*Approx(subgraph(S_y,0)) of GL0
  45. 223.34 s gammaloop-nextest-integration> span compute_4d{span_context=true graph=GL0 current=subgraph=y, topo_order=1, dod=2 given=subgraph=0, topo_order=0, dod=0 reduced=SubSet { set: BitVec<usize, bitvec::order::Lsb0> { addr: 0x7fffec015670, head: 000000, bits: 6, capacity: 64 } [0, 0, 1, 1, 1, 1], id: PhantomData<linnet::half_edge::involution::Hedge> }}
  46. 223.34 s gammaloop-nextest-integration> [2026-08-28 12:15:38.188] @approx::local_4d [{#uv, #algebra, #integrated, #start}] DEBUG :
  47. 223.34 s gammaloop-nextest-integration> field value
  48. 223.34 s gammaloop-nextest-integration> integrand n-terms: 1, byte size: 409,expr:
  49. 223.34 s gammaloop-nextest-integration> SCALAR_COUPLING²·(q₀(αᵉ³.¹)+q₃(αᵉ³.¹))·q₀(αᵉ².¹)·q₀(αᵉ³.¹)·q₂(αᵉ².¹)
  50. 223.34 s gammaloop-nextest-integration> /(denom(2,q₂,mass_scalar_2²,-mass_scalar_2²+(q₂.q₂))·denom(3,q₃,mass_scalar_2²,-mass_scalar_2²+(q₃.q₃)))
  51. 223.34 s gammaloop-nextest-integration> reduced y
  52. 223.34 s gammaloop-nextest-integration> span grow{span_context=true current=subgraph=y, topo_order=1, dod=2 given=subgraph=0, topo_order=0, dod=0}
  53. 223.34 s gammaloop-nextest-integration> [2026-08-28 12:15:38.188] @approx::local_4d [{#uv, #inspect, #integrated}] DEBUG : Rescaled momenta expanded
  54. 223.34 s gammaloop-nextest-integration> field value
  55. 223.34 s gammaloop-nextest-integration> res n-terms: 1, byte size: 585,expr:
  56. 223.34 s gammaloop-nextest-integration> -SCALAR_COUPLING²·q₀(αᵉ².¹)·q₀(αᵉ³.¹)·q₂(αᵉ².¹)·q₂(αᵉ³.¹)
  57. 223.34 s gammaloop-nextest-integration> /(t²·denom(3,-q₀-q₂/t,mass_scalar_2²,-mass_scalar_2²+2·(q₀.q₂)/t+(q₂.q₂)/t²+(q₀.q₀))
  58. 223.34 s gammaloop-nextest-integration> ·denom(2,q₂/t,mass_scalar_2²,-mass_scalar_2²+(q₂.q₂)/t²))
  59. 223.34 s gammaloop-nextest-integration> span t{span_context=true current=subgraph=y, topo_order=1, dod=2 given=subgraph=0, topo_order=0, dod=0}
  60. 223.34 s gammaloop-nextest-integration> [2026-08-28 12:15:38.189] @approx::local_4d [{#uv, #integrated, #rescaled}] DEBUG : Rescaled expanded
  61. 223.34 s gammaloop-nextest-integration> field value
  62. 223.34 s gammaloop-nextest-integration> n_loops 1
  63. 223.34 s gammaloop-nextest-integration> res n-terms: 1, byte size: 707,expr:
  64. 223.34 s gammaloop-nextest-integration> -SCALAR_COUPLING²·q₀(αᵉ².¹)·q₀(αᵉ³.¹)·q₂(αᵉ².¹)·q₂(αᵉ³.¹)
  65. 223.34 s gammaloop-nextest-integration> /(t²·denom(3,-q₂,mUVexp²+t²·mass_scalar_2²,-mUV²+t²·(-mass_scalar_2²+2·(q₀.q₂)/t+(q₂.q₂)/t²+(q₀.q₀))+t²·mUVexp²)
  66. 223.34 s gammaloop-nextest-integration> ·denom(2,q₂,mUVexp²+t²·mass_scalar_2²,-mUV²+t²·(-mass_scalar_2²+(q₂.q₂)/t²)+t²·mUVexp²))
  67. 223.34 s gammaloop-nextest-integration> span t{span_context=true current=subgraph=y, topo_order=1, dod=2 given=subgraph=0, topo_order=0, dod=0}
  68. 223.34 s gammaloop-nextest-integration> [2026-08-28 12:15:38.190] @approx::local_4d [{#uv, #integrated, #series}] DEBUG : Series expanded
  69. 223.34 s gammaloop-nextest-integration> field value
  70. 223.34 s gammaloop-nextest-integration> res n-terms: 3, byte size: 1896,expr:
  71. 223.34 s gammaloop-nextest-integration> (1/2·SCALAR_COUPLING²·(2·mUVexp²-2·mass_scalar_2²)/(denom(2,q₂,mUVexp²,-mUV²+(q₂.q₂))²·denom(3,-q₂,mUVexp²,-mUV²+(q₂.q₂)))
  72. 223.34 s gammaloop-nextest-integration> -SCALAR_COUPLING²
  73. 223.34 s gammaloop-nextest-integration> ·(-1/2·(2·mUVexp²-2·mass_scalar_2²+2·(q₀.q₀))/denom(3,-q₂,mUVexp²,-mUV²+(q₂.q₂))
  74. 223.34 s gammaloop-nextest-integration> +4·(q₀.q₂)²/denom(3,-q₂,mUVexp²,-mUV²+(q₂.q₂))²
  75. 223.34 s gammaloop-nextest-integration> )/(denom(2,q₂,mUVexp²,-mUV²+(q₂.q₂))·denom(3,-q₂,mUVexp²,-mUV²+(q₂.q₂)))
  76. 223.34 s gammaloop-nextest-integration> )·q₀(αᵉ².¹)·q₀(αᵉ³.¹)·q₂(αᵉ².¹)·q₂(αᵉ³.¹)
  77. 223.34 s gammaloop-nextest-integration> +2·SCALAR_COUPLING²·(q₀.q₂)·q₀(αᵉ².¹)·q₀(αᵉ³.¹)·q₂(αᵉ².¹)·q₂(αᵉ³.¹)
  78. 223.34 s gammaloop-nextest-integration> /(t·denom(2,q₂,mUVexp²,-mUV²+(q₂.q₂))·denom(3,-q₂,mUVexp²,-mUV²+(q₂.q₂))²)
  79. 223.34 s gammaloop-nextest-integration> -SCALAR_COUPLING²·q₀(αᵉ².¹)·q₀(αᵉ³.¹)·q₂(αᵉ².¹)·q₂(αᵉ³.¹)
  80. 223.34 s gammaloop-nextest-integration> /(t²·denom(2,q₂,mUVexp²,-mUV²+(q₂.q₂))·denom(3,-q₂,mUVexp²,-mUV²+(q₂.q₂)))
  81. 223.34 s gammaloop-nextest-integration> span t{span_context=true current=subgraph=y, topo_order=1, dod=2 given=subgraph=0, topo_order=0, dod=0}
  82. 223.34 s gammaloop-nextest-integration> [2026-08-28 12:15:38.191] @approx::local_4d [{#uv, #integrated, #series}] DEBUG : Evaluated at t = 1
  83. 223.34 s gammaloop-nextest-integration> field value
  84. 223.34 s gammaloop-nextest-integration> res n-terms: 3, byte size: 1880,expr:
  85. 223.34 s gammaloop-nextest-integration> (1/2·SCALAR_COUPLING²·(2·mUVexp²-2·mass_scalar_2²)/(denom(2,q₂,mUVexp²,-mUV²+(q₂.q₂))²·denom(3,-q₂,mUVexp²,-mUV²+(q₂.q₂)))
  86. 223.34 s gammaloop-nextest-integration> -SCALAR_COUPLING²
  87. 223.34 s gammaloop-nextest-integration> ·(-1/2·(2·mUVexp²-2·mass_scalar_2²+2·(q₀.q₀))/denom(3,-q₂,mUVexp²,-mUV²+(q₂.q₂))
  88. 223.34 s gammaloop-nextest-integration> +4·(q₀.q₂)²/denom(3,-q₂,mUVexp²,-mUV²+(q₂.q₂))²
  89. 223.34 s gammaloop-nextest-integration> )/(denom(2,q₂,mUVexp²,-mUV²+(q₂.q₂))·denom(3,-q₂,mUVexp²,-mUV²+(q₂.q₂)))
  90. 223.34 s gammaloop-nextest-integration> )·q₀(αᵉ².¹)·q₀(αᵉ³.¹)·q₂(αᵉ².¹)·q₂(αᵉ³.¹)
  91. 223.34 s gammaloop-nextest-integration> -SCALAR_COUPLING²·q₀(αᵉ².¹)·q₀(αᵉ³.¹)·q₂(αᵉ².¹)·q₂(αᵉ³.¹)
  92. 223.34 s gammaloop-nextest-integration> /(denom(2,q₂,mUVexp²,-mUV²+(q₂.q₂))·denom(3,-q₂,mUVexp²,-mUV²+(q₂.q₂)))
  93. 223.34 s gammaloop-nextest-integration> +2·SCALAR_COUPLING²·(q₀.q₂)·q₀(αᵉ².¹)·q₀(αᵉ³.¹)·q₂(αᵉ².¹)·q₂(αᵉ³.¹)
  94. 223.34 s gammaloop-nextest-integration> /(denom(2,q₂,mUVexp²,-mUV²+(q₂.q₂))·denom(3,-q₂,mUVexp²,-mUV²+(q₂.q₂))²)
  95. 223.34 s gammaloop-nextest-integration> span t{span_context=true current=subgraph=y, topo_order=1, dod=2 given=subgraph=0, topo_order=0, dod=0}
  96. 223.34 s gammaloop-nextest-integration> [2026-08-28 12:15:38.193] @approx::local_4d [{#uv, #collect, #integrated}] DEBUG : After gamma chain collection
  97. 223.34 s gammaloop-nextest-integration> field value
  98. 223.34 s gammaloop-nextest-integration> expr n-terms: 3, byte size: 1880,expr:
  99. 223.34 s gammaloop-nextest-integration> (1/2·SCALAR_COUPLING²·(2·mUVexp²-2·mass_scalar_2²)/(denom(2,q₂,mUVexp²,-mUV²+(q₂.q₂))²·denom(3,-q₂,mUVexp²,-mUV²+(q₂.q₂)))
  100. 223.34 s gammaloop-nextest-integration> -SCALAR_COUPLING²
  101. 223.34 s gammaloop-nextest-integration> ·(-1/2·(2·mUVexp²-2·mass_scalar_2²+2·(q₀.q₀))/denom(3,-q₂,mUVexp²,-mUV²+(q₂.q₂))
  102. 223.34 s gammaloop-nextest-integration> +4·(q₀.q₂)²/denom(3,-q₂,mUVexp²,-mUV²+(q₂.q₂))²
  103. 223.34 s gammaloop-nextest-integration> )/(denom(2,q₂,mUVexp²,-mUV²+(q₂.q₂))·denom(3,-q₂,mUVexp²,-mUV²+(q₂.q₂)))
  104. 223.34 s gammaloop-nextest-integration> )·q₀(αᵉ².¹)·q₀(αᵉ³.¹)·q₂(αᵉ².¹)·q₂(αᵉ³.¹)
  105. 223.34 s gammaloop-nextest-integration> -SCALAR_COUPLING²·q₀(αᵉ².¹)·q₀(αᵉ³.¹)·q₂(αᵉ².¹)·q₂(αᵉ³.¹)
  106. 223.34 s gammaloop-nextest-integration> /(denom(2,q₂,mUVexp²,-mUV²+(q₂.q₂))·denom(3,-q₂,mUVexp²,-mUV²+(q₂.q₂)))
  107. 223.34 s gammaloop-nextest-integration> +2·SCALAR_COUPLING²·(q₀.q₂)·q₀(αᵉ².¹)·q₀(αᵉ³.¹)·q₂(αᵉ².¹)·q₂(αᵉ³.¹)
  108. 223.34 s gammaloop-nextest-integration> /(denom(2,q₂,mUVexp²,-mUV²+(q₂.q₂))·denom(3,-q₂,mUVexp²,-mUV²+(q₂.q₂))²)
  109. 223.34 s gammaloop-nextest-integration> span t{span_context=true current=subgraph=y, topo_order=1, dod=2 given=subgraph=0, topo_order=0, dod=0}
  110. 223.34 s gammaloop-nextest-integration> [2026-08-28 12:15:38.195] @approx::local_4d [{#profile, #uv, #collect, #integrated, #start, #trace}] DEBUG : After gamma schoonschip
  111. 223.34 s gammaloop-nextest-integration> field value
  112. 223.34 s gammaloop-nextest-integration> expr n-terms: 3, byte size: 1631,expr:
  113. 223.34 s gammaloop-nextest-integration> (1/2·SCALAR_COUPLING²·(2·mUVexp²-2·mass_scalar_2²)/(denom(2,q₂,mUVexp²,-mUV²+(q₂.q₂))²·denom(3,-q₂,mUVexp²,-mUV²+(q₂.q₂)))
  114. 223.34 s gammaloop-nextest-integration> -SCALAR_COUPLING²
  115. 223.34 s gammaloop-nextest-integration> ·(-1/2·(2·mUVexp²-2·mass_scalar_2²+2·(q₀.q₀))/denom(3,-q₂,mUVexp²,-mUV²+(q₂.q₂))
  116. 223.34 s gammaloop-nextest-integration> +4·(q₀.q₂)²/denom(3,-q₂,mUVexp²,-mUV²+(q₂.q₂))²
  117. 223.34 s gammaloop-nextest-integration> )/(denom(2,q₂,mUVexp²,-mUV²+(q₂.q₂))·denom(3,-q₂,mUVexp²,-mUV²+(q₂.q₂)))
  118. 223.34 s gammaloop-nextest-integration> )·(q₀.q₂)²
  119. 223.34 s gammaloop-nextest-integration> -SCALAR_COUPLING²·(q₀.q₂)²/(denom(2,q₂,mUVexp²,-mUV²+(q₂.q₂))·denom(3,-q₂,mUVexp²,-mUV²+(q₂.q₂)))
  120. 223.34 s gammaloop-nextest-integration> +2·SCALAR_COUPLING²·(q₀.q₂)·(q₀.q₂)²
  121. 223.34 s gammaloop-nextest-integration> /(denom(2,q₂,mUVexp²,-mUV²+(q₂.q₂))·denom(3,-q₂,mUVexp²,-mUV²+(q₂.q₂))²)
  122. 223.34 s gammaloop-nextest-integration> span t{span_context=true current=subgraph=y, topo_order=1, dod=2 given=subgraph=0, topo_order=0, dod=0}
  123. 223.34 s gammaloop-nextest-integration> [2026-08-28 12:15:38.198] @approx::local_4d [{#profile, #uv, #collect, #integrated, #start, #trace}] DEBUG : After gamma collection
  124. 223.34 s gammaloop-nextest-integration> field value
  125. 223.34 s gammaloop-nextest-integration> expr n-terms: 1, byte size: 1347,expr:
  126. 223.34 s gammaloop-nextest-integration> SCALAR_COUPLING²
  127. 223.34 s gammaloop-nextest-integration> ·(-denom(2,q₂,mUVexp²,-mUV²+(q₂.q₂))·denom(3,-q₂,mUVexp²,-mUV²+(q₂.q₂))²
  128. 223.34 s gammaloop-nextest-integration> +1/2·(2·mUVexp²-2·mass_scalar_2²)·denom(3,-q₂,mUVexp²,-mUV²+(q₂.q₂))²
  129. 223.34 s gammaloop-nextest-integration> -(-1/2·(2·mUVexp²-2·mass_scalar_2²+2·(q₀.q₀))·denom(3,-q₂,mUVexp²,-mUV²+(q₂.q₂))+4·(q₀.q₂)²)
  130. 223.34 s gammaloop-nextest-integration> ·denom(2,q₂,mUVexp²,-mUV²+(q₂.q₂))
  131. 223.34 s gammaloop-nextest-integration> +2·(q₀.q₂)·denom(2,q₂,mUVexp²,-mUV²+(q₂.q₂))·denom(3,-q₂,mUVexp²,-mUV²+(q₂.q₂))
  132. 223.34 s gammaloop-nextest-integration> )·(q₀.q₂)²/(denom(2,q₂,mUVexp²,-mUV²+(q₂.q₂))²·denom(3,-q₂,mUVexp²,-mUV²+(q₂.q₂))³)
  133. 223.34 s gammaloop-nextest-integration> span t{span_context=true current=subgraph=y, topo_order=1, dod=2 given=subgraph=0, topo_order=0, dod=0}
  134. 223.34 s gammaloop-nextest-integration> [2026-08-28 12:15:38.199] @approx::local_4d [{#profile, #uv, #gamma, #integrated, #start, #trace, #vakint}] DEBUG : After gamma simplification
  135. 223.34 s gammaloop-nextest-integration> ... omitted 3263 more lines; see full nextest output above
  136. 223.34 s gammaloop-nextest-integration>
  137. 223.34 s gammaloop-nextest-integration> 8. gammaloop-integration-tests::uv::sunrise_scalar_1_uv
  138. 223.39 s gammaloop-nextest-integration> failure: test failure with exit code 101
  139. 223.39 s gammaloop-nextest-integration> system-out
  140. 223.39 s gammaloop-nextest-integration> running 1 test
  141. 223.39 s gammaloop-nextest-integration> test sunrise_scalar_1_uv has been running for over 60 seconds
  142. 223.39 s gammaloop-nextest-integration> +------------------+------------------------+--------------+--------+----------+----------------------------------------------------------------------------------------------------------------------+-------+
  143. 223.39 s gammaloop-nextest-integration> | case | check | graph | status | sigma | threshold | error |
  144. 223.39 s gammaloop-nextest-integration> +------------------+------------------------+--------------+--------+----------+----------------------------------------------------------------------------------------------------------------------+-------+
  145. 223.39 s gammaloop-nextest-integration> | sunrise_scalar_1 | uv_profile | - | FAIL | - | - | - |
  146. 223.39 s gammaloop-nextest-integration> +------------------+------------------------+--------------+--------+----------+----------------------------------------------------------------------------------------------------------------------+-------+
  147. 223.39 s gammaloop-nextest-integration> | sunrise_scalar_1 | m_uv.inspect | inspect | pass | - | best inspect relative delta 1.624e0 >= 1000*accuracy 1.000e-3 (accuracy=1.000e-6, exponent=+1.0, seed=1, probes=10) | - |
  148. 223.39 s gammaloop-nextest-integration> +------------------+------------------------+--------------+--------+----------+----------------------------------------------------------------------------------------------------------------------+-------+
  149. 223.39 s gammaloop-nextest-integration> | sunrise_scalar_1 | m_uv.integrated | sunrise | pass | 0.1sigma | compatible within 2sigma | - |
  150. 223.39 s gammaloop-nextest-integration> +------------------+------------------------+--------------+--------+----------+----------------------------------------------------------------------------------------------------------------------+-------+
  151. 223.39 s gammaloop-nextest-integration> | sunrise_scalar_1 | rls.inspect | inspect | pass | - | best inspect relative delta 8.682e-1 >= 1000*accuracy 1.000e-3 (accuracy=1.000e-6, exponent=+1.0, seed=1, probes=10) | - |
  152. 223.39 s gammaloop-nextest-integration> +------------------+------------------------+--------------+--------+----------+----------------------------------------------------------------------------------------------------------------------+-------+
  153. 223.39 s gammaloop-nextest-integration> | sunrise_scalar_1 | rls.integrated | sunrise | pass | 0.0sigma | compatible within 2sigma | - |
  154. 223.39 s gammaloop-nextest-integration> +------------------+------------------------+--------------+--------+----------+----------------------------------------------------------------------------------------------------------------------+-------+
  155. 223.39 s gammaloop-nextest-integration> | sunrise_scalar_1 | mu_r.inspect | inspect | pass | - | best inspect relative delta 1.752e0 >= 1000*accuracy 1.000e-3 (accuracy=1.000e-6, exponent=+1.0, seed=1, probes=10) | - |
  156. 223.40 s gammaloop-nextest-integration> +------------------+------------------------+--------------+--------+----------+----------------------------------------------------------------------------------------------------------------------+-------+
  157. 223.40 s gammaloop-nextest-integration> | sunrise_scalar_1 | integrated.relerr | integrated | pass | - | relative error 9.20% <= 10.00% | - |
  158. 223.40 s gammaloop-nextest-integration> +------------------+------------------------+--------------+--------+----------+----------------------------------------------------------------------------------------------------------------------+-------+
  159. 223.40 s gammaloop-nextest-integration> | sunrise_scalar_1 | m_uv.integrated.relerr | m_uv-shifted | pass | - | relative error 5.89% <= 10.00% | - |
  160. 223.40 s gammaloop-nextest-integration> +------------------+------------------------+--------------+--------+----------+----------------------------------------------------------------------------------------------------------------------+-------+
  161. 223.40 s gammaloop-nextest-integration> | sunrise_scalar_1 | target | - | pass | - | 2sigma | - |
  162. 223.40 s gammaloop-nextest-integration> +------------------+------------------------+--------------+--------+----------+----------------------------------------------------------------------------------------------------------------------+-------+
  163. 223.40 s gammaloop-nextest-integration> test sunrise_scalar_1_uv ... FAILED
  164. 223.40 s gammaloop-nextest-integration>
  165. 223.40 s gammaloop-nextest-integration> failures:
  166. 223.40 s gammaloop-nextest-integration>
  167. 223.40 s gammaloop-nextest-integration> failures:
  168. 223.40 s gammaloop-nextest-integration> sunrise_scalar_1_uv
  169. 223.40 s gammaloop-nextest-integration>
  170. 223.40 s gammaloop-nextest-integration> test result: FAILED. 0 passed; 1 failed; 0 ignored; 0 measured; 24 filtered out; finished in 170.22s
  171. 223.40 s gammaloop-nextest-integration> system-err
  172. 223.40 s gammaloop-nextest-integration> [2026-08-28 12:15:45.546] @gammaloop_api::se... INFO : Running command run generate
  173. 223.40 s gammaloop-nextest-integration> [2026-08-28 12:15:45.546] @gammaloop_api::se... INFO : Starting command block generate
  174. 223.40 s gammaloop-nextest-integration> [2026-08-28 12:15:45.546] @gammaloop_api::se... INFO : Running command import model scalars-default.json
  175. 223.40 s gammaloop-nextest-integration> [2026-08-28 12:15:45.546] @import::model INFO : Loading built-in JSON model scalars-default
  176. 223.40 s gammaloop-nextest-integration> [2026-08-28 12:15:45.553] @gammalooprs::model INFO : The following 2 external parameters were forced to zero by the restriction card:
  177. 223.40 s gammaloop-nextest-integration> width_scalar_1, width_scalar_2
  178. 223.40 s gammaloop-nextest-integration> [2026-08-28 12:15:45.554] @gammaloop_api::se... INFO : Running command remove processes
  179. 223.40 s gammaloop-nextest-integration> [2026-08-28 12:15:45.554] @gammaloop_api::se... INFO : Running command set global kv global.generation.uv.generate_integrated=true
  180. 223.40 s gammaloop-nextest-integration> [2026-08-28 12:15:45.557] @gammaloop_api::se... INFO : Running command import graphs ./tests/resources/graphs/scalar_sunrise.dot -p sunrise_scalar_1 -i scalar_sunrise
  181. 223.40 s gammaloop-nextest-integration> [2026-08-28 12:15:45.557] @commands::import INFO : Loading graphs from '/build/source/tests/resources/graphs/scalar_sunrise.dot'
  182. 223.40 s gammaloop-nextest-integration> [2026-08-28 12:15:45.563] @gammaloop_api::se... INFO : Running command generate existing -p sunrise_scalar_1 -i scalar_sunrise
  183. 223.40 s gammaloop-nextest-integration> [2026-08-28 12:15:45.629] @approx::local_4d [{#uv, #inspect, #integrated}] DEBUG : Rescaled momenta expanded
  184. 223.40 s gammaloop-nextest-integration> field value
  185. 223.40 s gammaloop-nextest-integration> res n-terms: 1, byte size: 611,expr:
  186. 223.40 s gammaloop-nextest-integration> 1/(denom(1,q₁/t,mass_scalar_1²,-mass_scalar_1²+(q₁.q₁)/t²)
  187. 223.40 s gammaloop-nextest-integration> ·denom(2,-q₀+q₃-q₁/t,mass_scalar_1²,
  188. 223.40 s gammaloop-nextest-integration> -mass_scalar_1²+2·(q₀.q₁)/t-2·(q₁.q₃)/t+(q₁.q₁)/t²+(q₀.q₀)
  189. 223.40 s gammaloop-nextest-integration> -2·(q₀.q₃)+(q₃.q₃)
  190. 223.40 s gammaloop-nextest-integration> ))
  191. 223.40 s gammaloop-nextest-integration> [2026-08-28 12:15:45.630] @approx::local_4d [{#uv, #inspect, #integrated}] DEBUG : Rescaled momenta expanded
  192. 223.40 s gammaloop-nextest-integration> field value
  193. 223.40 s gammaloop-nextest-integration> res n-terms: 1, byte size: 3,expr:
  194. 223.40 s gammaloop-nextest-integration> 1
  195. 223.40 s gammaloop-nextest-integration> [2026-08-28 12:15:45.631] @approx::local_4d [{#uv, #inspect, #integrated}] DEBUG : Rescaled momenta expanded
  196. 223.40 s gammaloop-nextest-integration> field value
  197. 223.40 s gammaloop-nextest-integration> res n-terms: 1, byte size: 777,expr:
  198. 223.40 s gammaloop-nextest-integration> 1/(denom(0,q₀/t,mass_scalar_1²,-mass_scalar_1²+(q₀.q₀)/t²)·denom(1,q₁/t,mass_scalar_1²,-mass_scalar_1²+(q₁.q₁)/t²)
  199. 223.40 s gammaloop-nextest-integration> ·denom(2,q₄-q₀/t-q₁/t,mass_scalar_1²,
  200. 223.40 s gammaloop-nextest-integration> -mass_scalar_1²-2·(q₀.q₄)/t-2·(q₁.q₄)/t+(q₀.q₀)/t²+2·(q₀.q₁)/t²
  201. 223.40 s gammaloop-nextest-integration> +(q₁.q₁)/t²+(q₄.q₄)
  202. 223.40 s gammaloop-nextest-integration> ))
  203. 223.40 s gammaloop-nextest-integration> [2026-08-28 12:15:45.637] @approx::local_4d [{#uv, #inspect, #integrated}] DEBUG : Rescaled momenta expanded
  204. 223.40 s gammaloop-nextest-integration> field value
  205. 223.40 s gammaloop-nextest-integration> res n-terms: 1, byte size: 611,expr:
  206. 223.40 s gammaloop-nextest-integration> 1/(denom(0,q₀/t,mass_scalar_1²,-mass_scalar_1²+(q₀.q₀)/t²)
  207. 223.40 s gammaloop-nextest-integration> ·denom(2,-q₁+q₃-q₀/t,mass_scalar_1²,
  208. 223.40 s gammaloop-nextest-integration> -mass_scalar_1²+2·(q₀.q₁)/t-2·(q₀.q₃)/t+(q₀.q₀)/t²+(q₁.q₁)
  209. 223.40 s gammaloop-nextest-integration> -2·(q₁.q₃)+(q₃.q₃)
  210. 223.40 s gammaloop-nextest-integration> ))
  211. 223.40 s gammaloop-nextest-integration> [2026-08-28 12:15:45.638] @approx::local_4d [{#uv, #inspect, #integrated}] DEBUG : Rescaled momenta expanded
  212. 223.40 s gammaloop-nextest-integration> field value
  213. 223.40 s gammaloop-nextest-integration> res n-terms: 1, byte size: 611,expr:
  214. 223.40 s gammaloop-nextest-integration> 1/(denom(0,q₀/t,mass_scalar_1²,-mass_scalar_1²+(q₀.q₀)/t²)
  215. 223.40 s gammaloop-nextest-integration> ·denom(1,-q₂+q₃-q₀/t,mass_scalar_1²,
  216. 223.40 s gammaloop-nextest-integration> -mass_scalar_1²+2·(q₀.q₂)/t-2·(q₀.q₃)/t+(q₀.q₀)/t²+(q₂.q₂)
  217. 223.40 s gammaloop-nextest-integration> -2·(q₂.q₃)+(q₃.q₃)
  218. 223.40 s gammaloop-nextest-integration> ))
  219. 223.40 s gammaloop-nextest-integration> [2026-08-28 12:15:45.642] @approx::final_integrand[{#generation, #profile, #uv, #graph, #summary}] DEBUG : Computed global numerator
  220. 223.40 s gammaloop-nextest-integration> field value
  221. 223.40 s gammaloop-nextest-integration> global_num n-terms: 1, byte size: 3,expr:
  222. 223.40 s gammaloop-nextest-integration> 1
  223. 223.40 s gammaloop-nextest-integration> span build_3d{span_context=true graph=sunrise current=subgraph=0, topo_order=0, dod=0}
  224. 223.40 s gammaloop-nextest-integration> [2026-08-28 12:15:45.643] @uv::approx [{#generation, #uv, #fourd}] DEBUG : Computing 4D
  225. 223.40 s gammaloop-nextest-integration> field value
  226. 223.40 s gammaloop-nextest-integration> simple subgraph(S_47,S_3s)*Approx(subgraph(S_3s,0)) of sunrise
  227. 223.40 s gammaloop-nextest-integration> span compute_4d{span_context=true graph=sunrise current=subgraph=3s, topo_order=1, dod=0 given=subgraph=0, topo_order=0, dod=0 reduced=SubSet { set: BitVec<usize, bitvec::order::Lsb0> { addr: 0x7fffec012da0, head: 000000, bits: 8, capacity: 64 } [0, 0, 0, 0, 1, 1, 1, 1], id: PhantomData<linnet::half_edge::involution::Hedge> }}
  228. 223.40 s gammaloop-nextest-integration> [2026-08-28 12:15:45.644] @approx::local_4d [{#uv, #algebra, #integrated, #start}] DEBUG :
  229. 223.40 s gammaloop-nextest-integration> field value
  230. 223.40 s gammaloop-nextest-integration> integrand n-terms: 1, byte size: 217,expr:
  231. 223.40 s gammaloop-nextest-integration> 1/(denom(1,q₁,mass_scalar_1²,-mass_scalar_1²+(q₁.q₁))·denom(2,q₂,mass_scalar_1²,-mass_scalar_1²+(q₂.q₂)))
  232. 223.40 s gammaloop-nextest-integration> reduced 3s
  233. 223.40 s gammaloop-nextest-integration> span grow{span_context=true current=subgraph=3s, topo_order=1, dod=0 given=subgraph=0, topo_order=0, dod=0}
  234. 223.40 s gammaloop-nextest-integration> [2026-08-28 12:15:45.647] @approx::local_4d [{#uv, #inspect, #integrated}] DEBUG : Rescaled momenta expanded
  235. 223.40 s gammaloop-nextest-integration> field value
  236. 223.40 s gammaloop-nextest-integration> res n-terms: 1, byte size: 611,expr:
  237. 223.40 s gammaloop-nextest-integration> 1/(denom(1,q₁/t,mass_scalar_1²,-mass_scalar_1²+(q₁.q₁)/t²)
  238. 223.40 s gammaloop-nextest-integration> ·denom(2,-q₀+q₃-q₁/t,mass_scalar_1²,
  239. 223.40 s gammaloop-nextest-integration> -mass_scalar_1²+2·(q₀.q₁)/t-2·(q₁.q₃)/t+(q₁.q₁)/t²+(q₀.q₀)
  240. 223.40 s gammaloop-nextest-integration> -2·(q₀.q₃)+(q₃.q₃)
  241. 223.40 s gammaloop-nextest-integration> ))
  242. 223.40 s gammaloop-nextest-integration> span t{span_context=true current=subgraph=3s, topo_order=1, dod=0 given=subgraph=0, topo_order=0, dod=0}
  243. 223.40 s gammaloop-nextest-integration> [2026-08-28 12:15:45.647] @approx::local_4d [{#uv, #integrated, #rescaled}] DEBUG : Rescaled expanded
  244. 223.40 s gammaloop-nextest-integration> field value
  245. 223.40 s gammaloop-nextest-integration> n_loops 1
  246. 223.40 s gammaloop-nextest-integration> res n-terms: 1, byte size: 723,expr:
  247. 223.40 s gammaloop-nextest-integration> 1/(denom(1,q₁,mUVexp²+t²·mass_scalar_1²,-mUV²+t²·(-mass_scalar_1²+(q₁.q₁)/t²)+t²·mUVexp²)
  248. 223.40 s gammaloop-nextest-integration> ·denom(2,-q₁,mUVexp²+t²·mass_scalar_1²,
  249. 223.40 s gammaloop-nextest-integration> -mUV²
  250. 223.40 s gammaloop-nextest-integration> +t²
  251. 223.40 s gammaloop-nextest-integration> ·(-mass_scalar_1²+2·(q₀.q₁)/t-2·(q₁.q₃)/t+(q₁.q₁)/t²+(q₀.q₀)
  252. 223.40 s gammaloop-nextest-integration> -2·(q₀.q₃)+(q₃.q₃)
  253. 223.40 s gammaloop-nextest-integration> )
  254. 223.40 s gammaloop-nextest-integration> +t²·mUVexp²
  255. 223.40 s gammaloop-nextest-integration> ))
  256. 223.40 s gammaloop-nextest-integration> span t{span_context=true current=subgraph=3s, topo_order=1, dod=0 given=subgraph=0, topo_order=0, dod=0}
  257. 223.40 s gammaloop-nextest-integration> [2026-08-28 12:15:45.648] @approx::local_4d [{#uv, #integrated, #series}] DEBUG : Series expanded
  258. 223.40 s gammaloop-nextest-integration> field value
  259. 223.40 s gammaloop-nextest-integration> res n-terms: 1, byte size: 223,expr:
  260. 223.40 s gammaloop-nextest-integration> 1/(denom(1,q₁,mUVexp²,-mUV²+(q₁.q₁))·denom(2,-q₁,mUVexp²,-mUV²+(q₁.q₁)))
  261. 223.40 s gammaloop-nextest-integration> span t{span_context=true current=subgraph=3s, topo_order=1, dod=0 given=subgraph=0, topo_order=0, dod=0}
  262. 223.40 s gammaloop-nextest-integration> [2026-08-28 12:15:45.648] @approx::local_4d [{#uv, #integrated, #series}] DEBUG : Evaluated at t = 1
  263. 223.40 s gammaloop-nextest-integration> field value
  264. 223.40 s gammaloop-nextest-integration> res n-terms: 1, byte size: 223,expr:
  265. 223.40 s gammaloop-nextest-integration> 1/(denom(1,q₁,mUVexp²,-mUV²+(q₁.q₁))·denom(2,-q₁,mUVexp²,-mUV²+(q₁.q₁)))
  266. 223.40 s gammaloop-nextest-integration> span t{span_context=true current=subgraph=3s, topo_order=1, dod=0 given=subgraph=0, topo_order=0, dod=0}
  267. 223.40 s gammaloop-nextest-integration> [2026-08-28 12:15:45.648] @approx::local_4d [{#uv, #collect, #integrated}] DEBUG : After gamma chain collection
  268. 223.40 s gammaloop-nextest-integration> field value
  269. 223.40 s gammaloop-nextest-integration> expr n-terms: 1, byte size: 223,expr:
  270. 223.40 s gammaloop-nextest-integration> 1/(denom(1,q₁,mUVexp²,-mUV²+(q₁.q₁))·denom(2,-q₁,mUVexp²,-mUV²+(q₁.q₁)))
  271. 223.40 s gammaloop-nextest-integration> span t{span_context=true current=subgraph=3s, topo_order=1, dod=0 given=subgraph=0, topo_order=0, dod=0}
  272. 223.40 s gammaloop-nextest-integration> [2026-08-28 12:15:45.648] @approx::local_4d [{#profile, #uv, #collect, #integrated, #start, #trace}] DEBUG : After gamma schoonschip
  273. 223.40 s gammaloop-nextest-integration> field value
  274. 223.40 s gammaloop-nextest-integration> expr n-terms: 1, byte size: 223,expr:
  275. 223.40 s gammaloop-nextest-integration> 1/(denom(1,q₁,mUVexp²,-mUV²+(q₁.q₁))·denom(2,-q₁,mUVexp²,-mUV²+(q₁.q₁)))
  276. 223.40 s gammaloop-nextest-integration> span t{span_context=true current=subgraph=3s, topo_order=1, dod=0 given=subgraph=0, topo_order=0, dod=0}
  277. 223.40 s gammaloop-nextest-integration> [2026-08-28 12:15:45.649] @approx::local_4d [{#profile, #uv, #collect, #integrated, #start, #trace}] DEBUG : After gamma collection
  278. 223.40 s gammaloop-nextest-integration> field value
  279. 223.40 s gammaloop-nextest-integration> expr n-terms: 1, byte size: 223,expr:
  280. 223.40 s gammaloop-nextest-integration> 1/(denom(1,q₁,mUVexp²,-mUV²+(q₁.q₁))·denom(2,-q₁,mUVexp²,-mUV²+(q₁.q₁)))
  281. 223.40 s gammaloop-nextest-integration> span t{span_context=true current=subgraph=3s, topo_order=1, dod=0 given=subgraph=0, topo_order=0, dod=0}
  282. 223.40 s gammaloop-nextest-integration> [2026-08-28 12:15:45.649] @approx::local_4d [{#profile, #uv, #gamma, #integrated, #start, #trace, #vakint}] DEBUG : After gamma simplification
  283. 223.40 s gammaloop-nextest-integration> field value
  284. 223.40 s gammaloop-nextest-integration> expr n-terms: 1, byte size: 223,expr:
  285. 223.40 s gammaloop-nextest-integration> 1/(denom(1,q₁,mUVexp²,-mUV²+(q₁.q₁))·denom(2,-q₁,mUVexp²,-mUV²+(q₁.q₁)))
  286. 223.40 s gammaloop-nextest-integration> span t{span_context=true current=subgraph=3s, topo_order=1, dod=0 given=subgraph=0, topo_order=0, dod=0}
  287. 223.40 s gammaloop-nextest-integration> [2026-08-28 12:15:45.649] @approx::local_4d [{#profile, #uv, #integrated, #schoonschip, #start, #trace, #vakint}] DEBUG : After Schoonschip net
  288. 223.40 s gammaloop-nextest-integration> field value
  289. 223.40 s gammaloop-nextest-integration> expr n-terms: 1, byte size: 223,expr:
  290. 223.40 s gammaloop-nextest-integration> 1/(denom(1,q₁,mUVexp²,-mUV²+(q₁.q₁))·denom(2,-q₁,mUVexp²,-mUV²+(q₁.q₁)))
  291. 223.40 s gammaloop-nextest-integration> ... omitted 20090 more lines; see full nextest output above
  292. 223.40 s gammaloop-nextest-integration>
  293. 223.40 s gammaloop-nextest-integration> 9. gammaloop-integration-tests::uv::se1l_uv
  294. 223.40 s gammaloop-nextest-integration> failure: test failure with exit code 101
  295. 223.40 s gammaloop-nextest-integration> system-out
  296. 223.40 s gammaloop-nextest-integration> running 1 test
  297. 223.40 s gammaloop-nextest-integration> test se1l_uv has been running for over 60 seconds
  298. 223.40 s gammaloop-nextest-integration> +------+-----------------+---------+--------+----------+-----------------------------------------------------------------------------------------------------------------------+-------+
  299. 223.40 s gammaloop-nextest-integration> | case | check | graph | status | sigma | threshold | error |
  300. 223.40 s gammaloop-nextest-integration> +------+-----------------+---------+--------+----------+-----------------------------------------------------------------------------------------------------------------------+-------+
  301. 223.40 s gammaloop-nextest-integration> | se1l | uv_profile | - | FAIL | - | - | - |
  302. 223.40 s gammaloop-nextest-integration> +------+-----------------+---------+--------+----------+-----------------------------------------------------------------------------------------------------------------------+-------+
  303. 223.40 s gammaloop-nextest-integration> | se1l | m_uv.inspect | inspect | pass | - | best inspect relative delta 1.097e-1 >= 1000*accuracy 1.000e-7 (accuracy=1.000e-10, exponent=+2.0, seed=1, probes=10) | - |
  304. 223.40 s gammaloop-nextest-integration> +------+-----------------+---------+--------+----------+-----------------------------------------------------------------------------------------------------------------------+-------+
  305. 223.40 s gammaloop-nextest-integration> | se1l | m_uv.integrated | se1l | pass | 0.1sigma | compatible within 2sigma | - |
  306. 223.40 s gammaloop-nextest-integration> +------+-----------------+---------+--------+----------+-----------------------------------------------------------------------------------------------------------------------+-------+
  307. 223.40 s gammaloop-nextest-integration> | se1l | rls.inspect | inspect | pass | - | best inspect relative delta 4.499e-2 >= 1000*accuracy 1.000e-7 (accuracy=1.000e-10, exponent=+2.0, seed=1, probes=10) | - |
  308. 223.40 s gammaloop-nextest-integration> +------+-----------------+---------+--------+----------+-----------------------------------------------------------------------------------------------------------------------+-------+
  309. 223.40 s gammaloop-nextest-integration> | se1l | rls.integrated | se1l | pass | 0.0sigma | compatible within 2sigma | - |
  310. 223.40 s gammaloop-nextest-integration> +------+-----------------+---------+--------+----------+-----------------------------------------------------------------------------------------------------------------------+-------+
  311. 223.40 s gammaloop-nextest-integration> | se1l | mu_r.inspect | inspect | pass | - | best inspect relative delta 1.424e-1 >= 1000*accuracy 1.000e-7 (accuracy=1.000e-10, exponent=+2.0, seed=1, probes=10) | - |
  312. 223.40 s gammaloop-nextest-integration> +------+-----------------+---------+--------+----------+-----------------------------------------------------------------------------------------------------------------------+-------+
  313. 223.40 s gammaloop-nextest-integration> | se1l | target | - | pass | - | 2sigma | - |
  314. 223.40 s gammaloop-nextest-integration> +------+-----------------+---------+--------+----------+-----------------------------------------------------------------------------------------------------------------------+-------+
  315. 223.40 s gammaloop-nextest-integration> test se1l_uv ... FAILED
  316. 223.40 s gammaloop-nextest-integration>
  317. 223.40 s gammaloop-nextest-integration> failures:
  318. 223.40 s gammaloop-nextest-integration>
  319. 223.40 s gammaloop-nextest-integration> failures:
  320. 223.40 s gammaloop-nextest-integration> se1l_uv
  321. 223.40 s gammaloop-nextest-integration>
  322. 223.40 s gammaloop-nextest-integration> test result: FAILED. 0 passed; 1 failed; 0 ignored; 0 measured; 24 filtered out; finished in 181.99s
  323. 223.40 s gammaloop-nextest-integration> system-err
  324. 223.40 s gammaloop-nextest-integration> [2026-08-28 12:15:45.001] @gammaloop_api::se... INFO : Running command run generate
  325. 223.40 s gammaloop-nextest-integration> [2026-08-28 12:15:45.001] @gammaloop_api::se... INFO : Starting command block generate
  326. 223.40 s gammaloop-nextest-integration> [2026-08-28 12:15:45.001] @gammaloop_api::se... INFO : Running command import model sm-default
  327. 223.40 s gammaloop-nextest-integration> [2026-08-28 12:15:45.002] @import::model INFO : Loading built-in JSON model sm-default
  328. 223.40 s gammaloop-nextest-integration> [2026-08-28 12:15:45.035] @gammalooprs::model INFO : The following 11 external parameters were forced to zero by the restriction card:
  329. 223.40 s gammaloop-nextest-integration> lamWS, AWS, rhoWS, etaWS, ymc, yme, ymm, MC, Me, MM, WTau
  330. 223.40 s gammaloop-nextest-integration> [2026-08-28 12:15:45.035] @gammalooprs::model INFO : The following 34 vertex rules were removed by the restriction card:
  331. 223.40 s gammaloop-nextest-integration> V_82 -> (c~, d, G+) | V_83 -> (t~, d, G+) | V_84 -> (c~, s, G+) | V_85 -> (t~, s, G+) | V_86 -> (u~, b, G+) | V_87 -> (c~, b, G+) | V_90 -> (c~, d, W+) | V_91 -> (t~, d, W+) | V_92 -> (u~, s, W+) | V_94 -> (t~, s, W+) | V_95 -> (u~, b, W+) | V_96 -> (c~, b, W+) | V_101 -> (e+, e-, G0) | V_102 -> (mu+, mu-, G0) | V_104 -> (e+, e-, H) | V_105 -> (mu+, mu-, H) | V_110 -> (ve~, e-, G+) | V_111 -> (vm~, mu-, G+) | V_116 -> (b~, u, G-) | V_117 -> (d~, c, G-) | V_118 -> (s~, c, G-) | V_119 -> (b~, c, G-) | V_120 -> (d~, t, G-) | V_121 -> (s~, t, G-) | V_124 -> (s~, u, W-) | V_125 -> (b~, u, W-) | V_126 -> (d~, c, W-) | V_128 -> (b~, c, W-) | V_129 -> (d~, t, W-) | V_130 -> (s~, t, W-) | V_138 -> (c~, c, G0) | V_140 -> (c~, c, H) | V_145 -> (e+, ve, G-) | V_146 -> (mu+, vm, G-)
  332. 223.40 s gammaloop-nextest-integration> [2026-08-28 12:15:45.035] @gammalooprs::model INFO : The following 36 couplings were removed by the restriction card:
  333. 223.40 s gammaloop-nextest-integration> GC_13, GC_14, GC_16, GC_17, GC_18, GC_19, GC_20, GC_22, GC_23, GC_24, GC_25, GC_26, GC_28, GC_29, GC_42, GC_43, GC_44, GC_46, GC_47, GC_48, GC_84, GC_85, GC_86, GC_87, GC_88, GC_89, GC_90, GC_91, GC_92, GC_93, GC_101, GC_102, GC_103, GC_105, GC_106, GC_107
  334. 223.40 s gammaloop-nextest-integration> [2026-08-28 12:15:45.036] @gammaloop_api::se... INFO : Running command remove processes
  335. 223.40 s gammaloop-nextest-integration> [2026-08-28 12:15:45.036] @gammaloop_api::se... INFO : Running command set global kv global.generation.uv.generate_integrated=true
  336. 223.40 s gammaloop-nextest-integration> [2026-08-28 12:15:45.037] @gammaloop_api::se... INFO : Running command import graphs ./tests/resources/graphs/uv_tests/se1l.dot -p se1l -i se1l
  337. 223.40 s gammaloop-nextest-integration> [2026-08-28 12:15:45.037] @commands::import INFO : Loading graphs from '/build/source/tests/resources/graphs/uv_tests/se1l.dot'
  338. 223.40 s gammaloop-nextest-integration> [2026-08-28 12:15:45.041] @gammaloop_api::se... INFO : Running command generate existing -p se1l -i se1l
  339. 223.40 s gammaloop-nextest-integration> [2026-08-28 12:15:46.451] @commands::generate INFO :
  340. 223.40 s gammaloop-nextest-integration> Integrand generation summary
  341. 223.40 s gammaloop-nextest-integration> peak RAM 89.35 MiB | cores 1
  342. 223.40 s gammaloop-nextest-integration> ╭───────────┬───────┬─────────┬─────────────┬─────────────┬────────────────┬─────────────╮
  343. 223.40 s gammaloop-nextest-integration> │ integrand │ graph │ # evals │ expr build │ spenso │ symbolica eval │ compile │
  344. 223.40 s gammaloop-nextest-integration> ├───────────┼───────┼─────────┼─────────────┼─────────────┼────────────────┼─────────────┤
  345. 223.40 s gammaloop-nextest-integration> │ se1l │ se1l │ 5 │ 1.17s (87%) │ 72ms (5.3%) │ 100ms (7.5%) │ 0ms (0.00%) │
  346. 223.40 s gammaloop-nextest-integration> ├───────────┼───────┼─────────┼─────────────┼─────────────┼────────────────┼─────────────┤
  347. 223.40 s gammaloop-nextest-integration> │ Total │ │ 5 │ 1.17s (87%) │ 72ms (5.3%) │ 100ms (7.5%) │ 0ms (0.00%) │
  348. 223.40 s gammaloop-nextest-integration> ╰───────────┴───────┴─────────┴─────────────┴─────────────┴────────────────┴─────────────╯
  349. 223.40 s gammaloop-nextest-integration> [2026-08-28 12:15:46.453] @gammaloop_api::se... INFO : Running command set process -p se1l -i se1l kv general.m_uv=0.2
  350. 223.40 s gammaloop-nextest-integration> [2026-08-28 12:15:46.454] @gammaloop_api::se... INFO : Running command set process -p se1l -i se1l kv general.mu_r=0.2
  351. 223.40 s gammaloop-nextest-integration> [2026-08-28 12:15:46.455] @gammaloop_api::se... INFO : Running command set process -p se1l -i se1l kv general.renormalization_localization_scale=0.2
  352. 223.40 s gammaloop-nextest-integration> [2026-08-28 12:15:46.456] @gammaloop_api::se... INFO : Running command duplicate integrand -p se1l -i se1l --output_process_name se1l --output_integrand_name se1l_muv_shifted
  353. 223.40 s gammaloop-nextest-integration> [2026-08-28 12:15:46.459] @gammaloop_api::se... INFO : Running command set process -p se1l -i se1l_muv_shifted kv general.m_uv=0.5
  354. 223.40 s gammaloop-nextest-integration> [2026-08-28 12:15:46.460] @gammaloop_api::se... INFO : Running command duplicate integrand -p se1l -i se1l --output_process_name se1l --output_integrand_name se1l_rls_shifted
  355. 223.40 s gammaloop-nextest-integration> [2026-08-28 12:15:46.467] @gammaloop_api::se... INFO : Running command set process -p se1l -i se1l_rls_shifted kv general.renormalization_localization_scale=1
  356. 223.40 s gammaloop-nextest-integration> [2026-08-28 12:15:46.472] @gammaloop_api::se... INFO : Running command duplicate integrand -p se1l -i se1l --output_process_name se1l --output_integrand_name se1l_mur_shifted
  357. 223.40 s gammaloop-nextest-integration> [2026-08-28 12:15:46.478] @gammaloop_api::se... INFO : Running command set process -p se1l -i se1l_mur_shifted kv general.mu_r=0.8
  358. 223.40 s gammaloop-nextest-integration> [2026-08-28 12:15:46.496] @process::amplitude WARNING : External state 0 ('g', PDG 21, helicity +) is off shell: p^2 = +2.5e5, expected m^2 = +0e0 (|Δ| = +2.5e5). Fixed-helicity spinor/vector/tensor external states may be ill-defined at this kinematic point.
  359. 223.40 s gammaloop-nextest-integration> field value
  360. 223.40 s gammaloop-nextest-integration> span warm_up{integrand.name=se1l}
  361. 223.40 s gammaloop-nextest-integration> [2026-08-28 12:15:46.497] @process::amplitude WARNING : External state 1 ('g', PDG 21, helicity -) is off shell: p^2 = +2.5e5, expected m^2 = +0e0 (|Δ| = +2.5e5). Fixed-helicity spinor/vector/tensor external states may be ill-defined at this kinematic point.
  362. 223.40 s gammaloop-nextest-integration> field value
  363. 223.40 s gammaloop-nextest-integration> span warm_up{integrand.name=se1l}
  364. 223.40 s gammaloop-nextest-integration> [2026-08-28 12:15:46.497] @process::amplitude INFO : Input is above threshold: 1 existing threshold E-surfaces across 1/1 graph groups
  365. 223.40 s gammaloop-nextest-integration> field value
  366. 223.40 s gammaloop-nextest-integration> existing_esurfaces 1
  367. 223.40 s gammaloop-nextest-integration> group_count 1
  368. 223.40 s gammaloop-nextest-integration> groups_above_threshold 1
  369. 223.40 s gammaloop-nextest-integration> integrand se1l
  370. 223.40 s gammaloop-nextest-integration> span warm_up{integrand.name=se1l}
  371. 223.40 s gammaloop-nextest-integration> threshold_status above threshold
  372. 223.40 s gammaloop-nextest-integration> [2026-08-28 12:15:46.497] @process::amplitude INFO : overlap structure of group 0: [1: [0(2,3)]]
  373. 223.40 s gammaloop-nextest-integration> field value
  374. 223.40 s gammaloop-nextest-integration> span warm_up{integrand.name=se1l}
  375. 223.40 s gammaloop-nextest-integration> [2026-08-28 12:15:46.887] @commands::profile INFO :
  376. 223.40 s gammaloop-nextest-integration> ╭───────┬──────┬──────────┬───────┬─────┬──────────┬───────────╮
  377. 223.40 s gammaloop-nextest-integration> │ fixed │ → ∞ │ slope │ r2 │ DOD │ bare DOD │ inspect │
  378. 223.40 s gammaloop-nextest-integration> ├───────┼──────┼──────────┼───────┼─────┼──────────┼───────────┤
  379. 223.40 s gammaloop-nextest-integration> │ {} │ {e3} │ 1.639236 │ 0.904 │ 2 │ 2 │ arb retry │
  380. 223.40 s gammaloop-nextest-integration> │ {} │ {e2} │ 1.698834 │ 0.902 │ 2 │ 2 │ arb retry │
  381. 223.40 s gammaloop-nextest-integration> ╰───────┴──────┴──────────┴───────┴─────┴──────────┴───────────╯
  382. 223.40 s gammaloop-nextest-integration> [2026-08-28 12:15:46.887] @commands::profile INFO :
  383. 223.40 s gammaloop-nextest-integration> ╭───────┬──────┬─────────────┬──────────┬───────┬─────┬──────────┬───────────╮
  384. 223.40 s gammaloop-nextest-integration> │ fixed │ → ∞ │ orientation │ slope │ r2 │ DOD │ bare DOD │ inspect │
  385. 223.40 s gammaloop-nextest-integration> ├───────┼──────┼─────────────┼──────────┼───────┼─────┼──────────┼───────────┤
  386. 223.40 s gammaloop-nextest-integration> │ {} │ {e3} │ 00-+ │ 0.343429 │ 0.145 │ 0 │ 2 │ arb retry │
  387. 223.40 s gammaloop-nextest-integration> │ {} │ {e3} │ 00+- │ 0.342577 │ 0.135 │ 0 │ 2 │ arb retry │
  388. 223.40 s gammaloop-nextest-integration> │ {} │ {e2} │ 00-+ │ 0.385975 │ 0.161 │ 0 │ 2 │ arb retry │
  389. 223.40 s gammaloop-nextest-integration> │ {} │ {e2} │ 00+- │ 0.384920 │ 0.192 │ 0 │ 2 │ arb retry │
  390. 223.40 s gammaloop-nextest-integration> ╰───────┴──────┴─────────────┴──────────┴───────┴─────┴──────────┴───────────╯
  391. 223.40 s gammaloop-nextest-integration> [2026-08-28 12:15:46.888] @gammaloop_api::se... INFO : Running command set process kv integrator.target_relative_accuracy=0.001 integrator.n_increase=0 integrator.n_start=50000 integrator.n_max=400000 integrator.seed=1337
  392. 223.40 s gammaloop-nextest-integration> [2026-08-28 12:15:46.889] @commands::integrate INFO : Created workspace directory at /build/source/tests/artifacts/se1l/integration_workspace_se1l
  393. 223.40 s gammaloop-nextest-integration> [2026-08-28 12:15:46.931] @commands::integrate INFO : No integration state found, starting new integration
  394. 223.40 s gammaloop-nextest-integration> [2026-08-28 12:15:46.931] @commands::integrate INFO : Gammaloop now integrates se1l@se1l, se1l@se1l_muv_shifted, se1l@se1l_rls_shifted
  395. 223.40 s gammaloop-nextest-integration> [2026-08-28 12:15:46.932] @process::amplitude WARNING : External state 0 ('g', PDG 21, helicity +) is off shell: p^2 = +2.5e5, expected m^2 = +0e0 (|Δ| = +2.5e5). Fixed-helicity spinor/vector/tensor external states may be ill-defined at this kinematic point.
  396. 223.40 s gammaloop-nextest-integration> field value
  397. 223.41 s gammaloop-nextest-integration> span warm_up{integrand.name=se1l}
  398. 223.41 s gammaloop-nextest-integration> [2026-08-28 12:15:46.932] @process::amplitude WARNING : External state 1 ('g', PDG 21, helicity -) is off shell: p^2 = +2.5e5, expected m^2 = +0e0 (|Δ| = +2.5e5). Fixed-helicity spinor/vector/tensor external states may be ill-defined at this kinematic point.
  399. 223.41 s gammaloop-nextest-integration> field value
  400. 223.41 s gammaloop-nextest-integration> span warm_up{integrand.name=se1l}
  401. 223.41 s gammaloop-nextest-integration> [2026-08-28 12:15:46.932] @process::amplitude INFO : Input is above threshold: 1 existing threshold E-surfaces across 1/1 graph groups
  402. 223.41 s gammaloop-nextest-integration> field value
  403. 223.41 s gammaloop-nextest-integration> existing_esurfaces 1
  404. 223.41 s gammaloop-nextest-integration> group_count 1
  405. 223.41 s gammaloop-nextest-integration> groups_above_threshold 1
  406. 223.41 s gammaloop-nextest-integration> integrand se1l
  407. 223.41 s gammaloop-nextest-integration> span warm_up{integrand.name=se1l}
  408. 223.41 s gammaloop-nextest-integration> threshold_status above threshold
  409. 223.41 s gammaloop-nextest-integration> [2026-08-28 12:15:46.932] @process::amplitude INFO : overlap structure of group 0: [1: [0(2,3)]]
  410. 223.41 s gammaloop-nextest-integration> field value
  411. 223.41 s gammaloop-nextest-integration> span warm_up{integrand.name=se1l}
  412. 223.41 s gammaloop-nextest-integration> [2026-08-28 12:15:46.936] @process::amplitude WARNING : External state 0 ('g', PDG 21, helicity +) is off shell: p^2 = +2.5e5, expected m^2 = +0e0 (|Δ| = +2.5e5). Fixed-helicity spinor/vector/tensor external states may be ill-defined at this kinematic point.
  413. 223.41 s gammaloop-nextest-integration> field value
  414. 223.41 s gammaloop-nextest-integration> span warm_up{integrand.name=se1l_muv_shifted}
  415. 223.41 s gammaloop-nextest-integration> [2026-08-28 12:15:46.936] @process::amplitude WARNING : External state 1 ('g', PDG 21, helicity -) is off shell: p^2 = +2.5e5, expected m^2 = +0e0 (|Δ| = +2.5e5). Fixed-helicity spinor/vector/tensor external states may be ill-defined at this kinematic point.
  416. 223.41 s gammaloop-nextest-integration> field value
  417. 223.41 s gammaloop-nextest-integration> span warm_up{integrand.name=se1l_muv_shifted}
  418. 223.41 s gammaloop-nextest-integration> [2026-08-28 12:15:46.937] @process::amplitude INFO : Input is above threshold: 1 existing threshold E-surfaces across 1/1 graph groups
  419. 223.41 s gammaloop-nextest-integration> field value
  420. 223.41 s gammaloop-nextest-integration> existing_esurfaces 1
  421. 223.41 s gammaloop-nextest-integration> group_count 1
  422. 223.41 s gammaloop-nextest-integration> groups_above_threshold 1
  423. 223.41 s gammaloop-nextest-integration> integrand se1l_muv_shifted
  424. 223.41 s gammaloop-nextest-integration> span warm_up{integrand.name=se1l_muv_shifted}
  425. 223.41 s gammaloop-nextest-integration> threshold_status above threshold
  426. 223.41 s gammaloop-nextest-integration> [2026-08-28 12:15:46.937] @process::amplitude INFO : overlap structure of group 0: [1: [0(2,3)]]
  427. 223.41 s gammaloop-nextest-integration> field value
  428. 223.41 s gammaloop-nextest-integration> span warm_up{integrand.name=se1l_muv_shifted}
  429. 223.41 s gammaloop-nextest-integration> [2026-08-28 12:15:46.939] @process::amplitude WARNING : External state 0 ('g', PDG 21, helicity +) is off shell: p^2 = +2.5e5, expected m^2 = +0e0 (|Δ| = +2.5e5). Fixed-helicity spinor/vector/tensor external states may be ill-defined at this kinematic point.
  430. 223.41 s gammaloop-nextest-integration> field value
  431. 223.41 s gammaloop-nextest-integration> span warm_up{integrand.name=se1l_rls_shifted}
  432. 223.41 s gammaloop-nextest-integration> [2026-08-28 12:15:46.939] @process::amplitude WARNING : External state 1 ('g', PDG 21, helicity -) is off shell: p^2 = +2.5e5, expected m^2 = +0e0 (|Δ| = +2.5e5). Fixed-helicity spinor/vector/tensor external states may be ill-defined at this kinematic point.
  433. 223.41 s gammaloop-nextest-integration> field value
  434. 223.41 s gammaloop-nextest-integration> span warm_up{integrand.name=se1l_rls_shifted}
  435. 223.41 s gammaloop-nextest-integration> [2026-08-28 12:15:46.939] @process::amplitude INFO : Input is above threshold: 1 existing threshold E-surfaces across 1/1 graph groups
  436. 223.41 s gammaloop-nextest-integration> field value
  437. 223.41 s gammaloop-nextest-integration> existing_esurfaces 1
  438. 223.41 s gammaloop-nextest-integration> group_count 1
  439. 223.41 s gammaloop-nextest-integration> groups_above_threshold 1
  440. 223.41 s gammaloop-nextest-integration> integrand se1l_rls_shifted
  441. 223.41 s gammaloop-nextest-integration> span warm_up{integrand.name=se1l_rls_shifted}
  442. 223.41 s gammaloop-nextest-integration> threshold_status above threshold
  443. 223.41 s gammaloop-nextest-integration> ... omitted 1410 more lines; see full nextest output above
  444. 223.41 s gammaloop-nextest-integration> =========================================
  445. 224.16 s error: Cannot build '/nix/store/ifx25i75mrp4mx011vk3kpahjasmfqfi-gammaloop-nextest-integration.drv'.
  446. 224.16 s Reason: builder failed with exit code 100.
  447. 224.16 s Output paths:
  448. 224.16 s /nix/store/zp6pznmk8m5zpqbw5hmcyg91mpp8x0kf-gammaloop-nextest-integration
  449. 224.16 s Last 2048 log lines:
  450. 224.16 s > threshold_status above threshold
  451. 224.16 s > [2026-08-28 12:18:46.529] @process::amplitude INFO : overlap structure of group 0: [1: [0(2,3)]]
  452. 224.16 s > field value
  453. 224.16 s > span warm_up{integrand.name=se1l_muv_shifted}
  454. 224.16 s > [2026-08-28 12:18:46.537] @process::amplitude WARNING : External state 0 ('g', PDG 21, helicity +) is off shell: p^2 = +2.5e5, expected m^2 = +0e0 (|Δ| = +2.5e5). Fixed-helicity spinor/vector/tensor external states may be ill-defined at this kinematic point.
  455. 224.16 s > field value
  456. 224.16 s > span warm_up{integrand.name=se1l}
  457. 224.16 s > [2026-08-28 12:18:46.537] @process::amplitude WARNING : External state 1 ('g', PDG 21, helicity -) is off shell: p^2 = +2.5e5, expected m^2 = +0e0 (|Δ| = +2.5e5). Fixed-helicity spinor/vector/tensor external states may be ill-defined at this kinematic point.
  458. 224.16 s > field value
  459. 224.16 s > span warm_up{integrand.name=se1l}
  460. 224.16 s > [2026-08-28 12:18:46.537] @process::amplitude INFO : Input is above threshold: 1 existing threshold E-surfaces across 1/1 graph groups
  461. 224.16 s > field value
  462. 224.16 s > existing_esurfaces 1
  463. 224.16 s > group_count 1
  464. 224.16 s > groups_above_threshold 1
  465. 224.16 s > integrand se1l
  466. 224.16 s > span warm_up{integrand.name=se1l}
  467. 224.16 s > threshold_status above threshold
  468. 224.16 s > [2026-08-28 12:18:46.537] @process::amplitude INFO : overlap structure of group 0: [1: [0(2,3)]]
  469. 224.16 s > field value
  470. 224.16 s > span warm_up{integrand.name=se1l}
  471. 224.16 s > [2026-08-28 12:18:46.545] @process::amplitude WARNING : External state 0 ('g', PDG 21, helicity +) is off shell: p^2 = +2.5e5, expected m^2 = +0e0 (|Δ| = +2.5e5). Fixed-helicity spinor/vector/tensor external states may be ill-defined at this kinematic point.
  472. 224.16 s > field value
  473. 224.16 s > span warm_up{integrand.name=se1l_muv_shifted}
  474. 224.16 s > [2026-08-28 12:18:46.545] @process::amplitude WARNING : External state 1 ('g', PDG 21, helicity -) is off shell: p^2 = +2.5e5, expected m^2 = +0e0 (|Δ| = +2.5e5). Fixed-helicity spinor/vector/tensor external states may be ill-defined at this kinematic point.
  475. 224.16 s > field value
  476. 224.16 s > span warm_up{integrand.name=se1l_muv_shifted}
  477. 224.16 s > [2026-08-28 12:18:46.545] @process::amplitude INFO : Input is above threshold: 1 existing threshold E-surfaces across 1/1 graph groups
  478. 224.16 s > field value
  479. 224.16 s > existing_esurfaces 1
  480. 224.16 s > group_count 1
  481. 224.16 s > groups_above_threshold 1
  482. 224.16 s > integrand se1l_muv_shifted
  483. 224.16 s > span warm_up{integrand.name=se1l_muv_shifted}
  484. 224.16 s > threshold_status above threshold
  485. 224.16 s > [2026-08-28 12:18:46.545] @process::amplitude INFO : overlap structure of group 0: [1: [0(2,3)]]
  486. 224.16 s > field value
  487. 224.16 s > span warm_up{integrand.name=se1l_muv_shifted}
  488. 224.16 s > [2026-08-28 12:18:46.553] @process::amplitude WARNING : External state 0 ('g', PDG 21, helicity +) is off shell: p^2 = +2.5e5, expected m^2 = +0e0 (|Δ| = +2.5e5). Fixed-helicity spinor/vector/tensor external states may be ill-defined at this kinematic point.
  489. 224.16 s > field value
  490. 224.16 s > span warm_up{integrand.name=se1l}
  491. 224.16 s > [2026-08-28 12:18:46.554] @process::amplitude WARNING : External state 1 ('g', PDG 21, helicity -) is off shell: p^2 = +2.5e5, expected m^2 = +0e0 (|Δ| = +2.5e5). Fixed-helicity spinor/vector/tensor external states may be ill-defined at this kinematic point.
  492. 224.16 s > field value
  493. 224.16 s > span warm_up{integrand.name=se1l}
  494. 224.16 s > [2026-08-28 12:18:46.554] @process::amplitude INFO : Input is above threshold: 1 existing threshold E-surfaces across 1/1 graph groups
  495. 224.16 s > field value
  496. 224.16 s > existing_esurfaces 1
  497. 224.16 s > group_count 1
  498. 224.16 s > groups_above_threshold 1
  499. 224.16 s > integrand se1l
  500. 224.16 s > span warm_up{integrand.name=se1l}
  501. 224.16 s > threshold_status above threshold
  502. 224.16 s > [2026-08-28 12:18:46.554] @process::amplitude INFO : overlap structure of group 0: [1: [0(2,3)]]
  503. 224.16 s > field value
  504. 224.16 s > span warm_up{integrand.name=se1l}
  505. 224.16 s > [2026-08-28 12:18:46.562] @process::amplitude WARNING : External state 0 ('g', PDG 21, helicity +) is off shell: p^2 = +2.5e5, expected m^2 = +0e0 (|Δ| = +2.5e5). Fixed-helicity spinor/vector/tensor external states may be ill-defined at this kinematic point.
  506. 224.16 s > field value
  507. 224.16 s > span warm_up{integrand.name=se1l_muv_shifted}
  508. 224.16 s > [2026-08-28 12:18:46.562] @process::amplitude WARNING : External state 1 ('g', PDG 21, helicity -) is off shell: p^2 = +2.5e5, expected m^2 = +0e0 (|Δ| = +2.5e5). Fixed-helicity spinor/vector/tensor external states may be ill-defined at this kinematic point.
  509. 224.16 s > field value
  510. 224.16 s > span warm_up{integrand.name=se1l_muv_shifted}
  511. 224.16 s > [2026-08-28 12:18:46.562] @process::amplitude INFO : Input is above threshold: 1 existing threshold E-surfaces across 1/1 graph groups
  512. 224.16 s > field value
  513. 224.16 s > existing_esurfaces 1
  514. 224.16 s > group_count 1
  515. 224.16 s > groups_above_threshold 1
  516. 224.16 s > integrand se1l_muv_shifted
  517. 224.16 s > span warm_up{integrand.name=se1l_muv_shifted}
  518. 224.16 s > threshold_status above threshold
  519. 224.16 s > [2026-08-28 12:18:46.562] @process::amplitude INFO : overlap structure of group 0: [1: [0(2,3)]]
  520. 224.16 s > field value
  521. 224.16 s > span warm_up{integrand.name=se1l_muv_shifted}
  522. 224.16 s > [2026-08-28 12:18:46.568] @process::amplitude WARNING : External state 0 ('g', PDG 21, helicity +) is off shell: p^2 = +2.5e5, expected m^2 = +0e0 (|Δ| = +2.5e5). Fixed-helicity spinor/vector/tensor external states may be ill-defined at this kinematic point.
  523. 224.16 s > field value
  524. 224.16 s > span warm_up{integrand.name=se1l}
  525. 224.16 s > [2026-08-28 12:18:46.568] @process::amplitude WARNING : External state 1 ('g', PDG 21, helicity -) is off shell: p^2 = +2.5e5, expected m^2 = +0e0 (|Δ| = +2.5e5). Fixed-helicity spinor/vector/tensor external states may be ill-defined at this kinematic point.
  526. 224.16 s > field value
  527. 224.16 s > span warm_up{integrand.name=se1l}
  528. 224.16 s > [2026-08-28 12:18:46.568] @process::amplitude INFO : Input is above threshold: 1 existing threshold E-surfaces across 1/1 graph groups
  529. 224.16 s > field value
  530. 224.16 s > existing_esurfaces 1
  531. 224.16 s > group_count 1
  532. 224.16 s > groups_above_threshold 1
  533. 224.16 s > integrand se1l
  534. 224.16 s > span warm_up{integrand.name=se1l}
  535. 224.16 s > threshold_status above threshold
  536. 224.16 s > [2026-08-28 12:18:46.568] @process::amplitude INFO : overlap structure of group 0: [1: [0(2,3)]]
  537. 224.16 s > field value
  538. 224.16 s > span warm_up{integrand.name=se1l}
  539. 224.16 s > [2026-08-28 12:18:46.574] @process::amplitude WARNING : External state 0 ('g', PDG 21, helicity +) is off shell: p^2 = +2.5e5, expected m^2 = +0e0 (|Δ| = +2.5e5). Fixed-helicity spinor/vector/tensor external states may be ill-defined at this kinematic point.
  540. 224.16 s > field value
  541. 224.16 s > span warm_up{integrand.name=se1l_muv_shifted}
  542. 224.16 s > [2026-08-28 12:18:46.574] @process::amplitude WARNING : External state 1 ('g', PDG 21, helicity -) is off shell: p^2 = +2.5e5, expected m^2 = +0e0 (|Δ| = +2.5e5). Fixed-helicity spinor/vector/tensor external states may be ill-defined at this kinematic point.
  543. 224.16 s > field value
  544. 224.16 s > span warm_up{integrand.name=se1l_muv_shifted}
  545. 224.16 s > [2026-08-28 12:18:46.574] @process::amplitude INFO : Input is above threshold: 1 existing threshold E-surfaces across 1/1 graph groups
  546. 224.16 s > field value
  547. 224.16 s > existing_esurfaces 1
  548. 224.16 s > group_count 1
  549. 224.16 s > groups_above_threshold 1
  550. 224.16 s > integrand se1l_muv_shifted
  551. 224.16 s > span warm_up{integrand.name=se1l_muv_shifted}
  552. 224.16 s > threshold_status above threshold
  553. 224.16 s > [2026-08-28 12:18:46.574] @process::amplitude INFO : overlap structure of group 0: [1: [0(2,3)]]
  554. 224.16 s > field value
  555. 224.16 s > span warm_up{integrand.name=se1l_muv_shifted}
  556. 224.16 s > [2026-08-28 12:18:46.580] @process::amplitude WARNING : External state 0 ('g', PDG 21, helicity +) is off shell: p^2 = +2.5e5, expected m^2 = +0e0 (|Δ| = +2.5e5). Fixed-helicity spinor/vector/tensor external states may be ill-defined at this kinematic point.
  557. 224.16 s > field value
  558. 224.16 s > span warm_up{integrand.name=se1l}
  559. 224.16 s > [2026-08-28 12:18:46.580] @process::amplitude WARNING : External state 1 ('g', PDG 21, helicity -) is off shell: p^2 = +2.5e5, expected m^2 = +0e0 (|Δ| = +2.5e5). Fixed-helicity spinor/vector/tensor external states may be ill-defined at this kinematic point.
  560. 224.16 s > field value
  561. 224.16 s > span warm_up{integrand.name=se1l}
  562. 224.16 s > [2026-08-28 12:18:46.581] @process::amplitude INFO : Input is above threshold: 1 existing threshold E-surfaces across 1/1 graph groups
  563. 224.16 s > field value
  564. 224.16 s > existing_esurfaces 1
  565. 224.16 s > group_count 1
  566. 224.16 s > groups_above_threshold 1
  567. 224.16 s > integrand se1l
  568. 224.16 s > span warm_up{integrand.name=se1l}
  569. 224.16 s > threshold_status above threshold
  570. 224.16 s > [2026-08-28 12:18:46.581] @process::amplitude INFO : overlap structure of group 0: [1: [0(2,3)]]
  571. 224.16 s > field value
  572. 224.16 s > span warm_up{integrand.name=se1l}
  573. 224.16 s > [2026-08-28 12:18:46.587] @process::amplitude WARNING : External state 0 ('g', PDG 21, helicity +) is off shell: p^2 = +2.5e5, expected m^2 = +0e0 (|Δ| = +2.5e5). Fixed-helicity spinor/vector/tensor external states may be ill-defined at this kinematic point.
  574. 224.16 s > field value
  575. 224.16 s > span warm_up{integrand.name=se1l_rls_shifted}
  576. 224.16 s > [2026-08-28 12:18:46.587] @process::amplitude WARNING : External state 1 ('g', PDG 21, helicity -) is off shell: p^2 = +2.5e5, expected m^2 = +0e0 (|Δ| = +2.5e5). Fixed-helicity spinor/vector/tensor external states may be ill-defined at this kinematic point.
  577. 224.16 s > field value
  578. 224.16 s > span warm_up{integrand.name=se1l_rls_shifted}
  579. 224.16 s > [2026-08-28 12:18:46.587] @process::amplitude INFO : Input is above threshold: 1 existing threshold E-surfaces across 1/1 graph groups
  580. 224.16 s > field value
  581. 224.16 s > existing_esurfaces 1
  582. 224.16 s > group_count 1
  583. 224.16 s > groups_above_threshold 1
  584. 224.16 s > integrand se1l_rls_shifted
  585. 224.16 s > span warm_up{integrand.name=se1l_rls_shifted}
  586. 224.16 s > threshold_status above threshold
  587. 224.16 s > [2026-08-28 12:18:46.587] @process::amplitude INFO : overlap structure of group 0: [1: [0(2,3)]]
  588. 224.16 s > field value
  589. 224.16 s > span warm_up{integrand.name=se1l_rls_shifted}
  590. 224.16 s > [2026-08-28 12:18:46.593] @process::amplitude WARNING : External state 0 ('g', PDG 21, helicity +) is off shell: p^2 = +2.5e5, expected m^2 = +0e0 (|Δ| = +2.5e5). Fixed-helicity spinor/vector/tensor external states may be ill-defined at this kinematic point.
  591. 224.16 s > field value
  592. 224.16 s > span warm_up{integrand.name=se1l}
  593. 224.16 s > [2026-08-28 12:18:46.593] @process::amplitude WARNING : External state 1 ('g', PDG 21, helicity -) is off shell: p^2 = +2.5e5, expected m^2 = +0e0 (|Δ| = +2.5e5). Fixed-helicity spinor/vector/tensor external states may be ill-defined at this kinematic point.
  594. 224.16 s > field value
  595. 224.16 s > span warm_up{integrand.name=se1l}
  596. 224.16 s > [2026-08-28 12:18:46.593] @process::amplitude INFO : Input is above threshold: 1 existing threshold E-surfaces across 1/1 graph groups
  597. 224.16 s > field value
  598. 224.16 s > existing_esurfaces 1
  599. 224.16 s > group_count 1
  600. 224.16 s > groups_above_threshold 1
  601. 224.16 s > integrand se1l
  602. 224.16 s > span warm_up{integrand.name=se1l}
  603. 224.16 s > threshold_status above threshold
  604. 224.16 s > [2026-08-28 12:18:46.594] @process::amplitude INFO : overlap structure of group 0: [1: [0(2,3)]]
  605. 224.16 s > field value
  606. 224.16 s > span warm_up{integrand.name=se1l}
  607. 224.16 s > [2026-08-28 12:18:46.600] @process::amplitude WARNING : External state 0 ('g', PDG 21, helicity +) is off shell: p^2 = +2.5e5, expected m^2 = +0e0 (|Δ| = +2.5e5). Fixed-helicity spinor/vector/tensor external states may be ill-defined at this kinematic point.
  608. 224.16 s > field value
  609. 224.16 s > span warm_up{integrand.name=se1l_rls_shifted}
  610. 224.16 s > [2026-08-28 12:18:46.600] @process::amplitude WARNING : External state 1 ('g', PDG 21, helicity -) is off shell: p^2 = +2.5e5, expected m^2 = +0e0 (|Δ| = +2.5e5). Fixed-helicity spinor/vector/tensor external states may be ill-defined at this kinematic point.
  611. 224.16 s > field value
  612. 224.16 s > span warm_up{integrand.name=se1l_rls_shifted}
  613. 224.16 s > [2026-08-28 12:18:46.600] @process::amplitude INFO : Input is above threshold: 1 existing threshold E-surfaces across 1/1 graph groups
  614. 224.16 s > field value
  615. 224.16 s > existing_esurfaces 1
  616. 224.16 s > group_count 1
  617. 224.16 s > groups_above_threshold 1
  618. 224.16 s > integrand se1l_rls_shifted
  619. 224.16 s > span warm_up{integrand.name=se1l_rls_shifted}
  620. 224.16 s > threshold_status above threshold
  621. 224.16 s > [2026-08-28 12:18:46.600] @process::amplitude INFO : overlap structure of group 0: [1: [0(2,3)]]
  622. 224.16 s > field value
  623. 224.16 s > span warm_up{integrand.name=se1l_rls_shifted}
  624. 224.16 s > [2026-08-28 12:18:46.606] @process::amplitude WARNING : External state 0 ('g', PDG 21, helicity +) is off shell: p^2 = +2.5e5, expected m^2 = +0e0 (|Δ| = +2.5e5). Fixed-helicity spinor/vector/tensor external states may be ill-defined at this kinematic point.
  625. 224.16 s > field value
  626. 224.16 s > span warm_up{integrand.name=se1l}
  627. 224.16 s > [2026-08-28 12:18:46.606] @process::amplitude WARNING : External state 1 ('g', PDG 21, helicity -) is off shell: p^2 = +2.5e5, expected m^2 = +0e0 (|Δ| = +2.5e5). Fixed-helicity spinor/vector/tensor external states may be ill-defined at this kinematic point.
  628. 224.16 s > field value
  629. 224.16 s > span warm_up{integrand.name=se1l}
  630. 224.16 s > [2026-08-28 12:18:46.606] @process::amplitude INFO : Input is above threshold: 1 existing threshold E-surfaces across 1/1 graph groups
  631. 224.16 s > field value
  632. 224.16 s > existing_esurfaces 1
  633. 224.16 s > group_count 1
  634. 224.16 s > groups_above_threshold 1
  635. 224.16 s > integrand se1l
  636. 224.16 s > span warm_up{integrand.name=se1l}
  637. 224.16 s > threshold_status above threshold
  638. 224.16 s > [2026-08-28 12:18:46.607] @process::amplitude INFO : overlap structure of group 0: [1: [0(2,3)]]
  639. 224.16 s > field value
  640. 224.16 s > span warm_up{integrand.name=se1l}
  641. 224.16 s > [2026-08-28 12:18:46.613] @process::amplitude WARNING : External state 0 ('g', PDG 21, helicity +) is off shell: p^2 = +2.5e5, expected m^2 = +0e0 (|Δ| = +2.5e5). Fixed-helicity spinor/vector/tensor external states may be ill-defined at this kinematic point.
  642. 224.16 s > field value
  643. 224.16 s > span warm_up{integrand.name=se1l_rls_shifted}
  644. 224.16 s > [2026-08-28 12:18:46.613] @process::amplitude WARNING : External state 1 ('g', PDG 21, helicity -) is off shell: p^2 = +2.5e5, expected m^2 = +0e0 (|Δ| = +2.5e5). Fixed-helicity spinor/vector/tensor external states may be ill-defined at this kinematic point.
  645. 224.16 s > field value
  646. 224.16 s > span warm_up{integrand.name=se1l_rls_shifted}
  647. 224.16 s > [2026-08-28 12:18:46.613] @process::amplitude INFO : Input is above threshold: 1 existing threshold E-surfaces across 1/1 graph groups
  648. 224.16 s > field value
  649. 224.16 s > existing_esurfaces 1
  650. 224.16 s > group_count 1
  651. 224.16 s > groups_above_threshold 1
  652. 224.16 s > integrand se1l_rls_shifted
  653. 224.16 s > span warm_up{integrand.name=se1l_rls_shifted}
  654. 224.16 s > threshold_status above threshold
  655. 224.16 s > [2026-08-28 12:18:46.613] @process::amplitude INFO : overlap structure of group 0: [1: [0(2,3)]]
  656. 224.16 s > field value
  657. 224.16 s > span warm_up{integrand.name=se1l_rls_shifted}
  658. 224.16 s > [2026-08-28 12:18:46.619] @process::amplitude WARNING : External state 0 ('g', PDG 21, helicity +) is off shell: p^2 = +2.5e5, expected m^2 = +0e0 (|Δ| = +2.5e5). Fixed-helicity spinor/vector/tensor external states may be ill-defined at this kinematic point.
  659. 224.16 s > field value
  660. 224.16 s > span warm_up{integrand.name=se1l}
  661. 224.16 s > [2026-08-28 12:18:46.620] @process::amplitude WARNING : External state 1 ('g', PDG 21, helicity -) is off shell: p^2 = +2.5e5, expected m^2 = +0e0 (|Δ| = +2.5e5). Fixed-helicity spinor/vector/tensor external states may be ill-defined at this kinematic point.
  662. 224.16 s > field value
  663. 224.16 s > span warm_up{integrand.name=se1l}
  664. 224.16 s > [2026-08-28 12:18:46.620] @process::amplitude INFO : Input is above threshold: 1 existing threshold E-surfaces across 1/1 graph groups
  665. 224.16 s > field value
  666. 224.16 s > existing_esurfaces 1
  667. 224.16 s > group_count 1
  668. 224.16 s > groups_above_threshold 1
  669. 224.16 s > integrand se1l
  670. 224.16 s > span warm_up{integrand.name=se1l}
  671. 224.16 s > threshold_status above threshold
  672. 224.16 s > [2026-08-28 12:18:46.620] @process::amplitude INFO : overlap structure of group 0: [1: [0(2,3)]]
  673. 224.16 s > field value
  674. 224.16 s > span warm_up{integrand.name=se1l}
  675. 224.16 s > [2026-08-28 12:18:46.626] @process::amplitude WARNING : External state 0 ('g', PDG 21, helicity +) is off shell: p^2 = +2.5e5, expected m^2 = +0e0 (|Δ| = +2.5e5). Fixed-helicity spinor/vector/tensor external states may be ill-defined at this kinematic point.
  676. 224.16 s > field value
  677. 224.16 s > span warm_up{integrand.name=se1l_rls_shifted}
  678. 224.16 s > [2026-08-28 12:18:46.626] @process::amplitude WARNING : External state 1 ('g', PDG 21, helicity -) is off shell: p^2 = +2.5e5, expected m^2 = +0e0 (|Δ| = +2.5e5). Fixed-helicity spinor/vector/tensor external states may be ill-defined at this kinematic point.
  679. 224.16 s > field value
  680. 224.16 s > span warm_up{integrand.name=se1l_rls_shifted}
  681. 224.16 s > [2026-08-28 12:18:46.627] @process::amplitude INFO : Input is above threshold: 1 existing threshold E-surfaces across 1/1 graph groups
  682. 224.16 s > field value
  683. 224.16 s > existing_esurfaces 1
  684. 224.16 s > group_count 1
  685. 224.16 s > groups_above_threshold 1
  686. 224.16 s > integrand se1l_rls_shifted
  687. 224.16 s > span warm_up{integrand.name=se1l_rls_shifted}
  688. 224.16 s > threshold_status above threshold
  689. 224.16 s > [2026-08-28 12:18:46.627] @process::amplitude INFO : overlap structure of group 0: [1: [0(2,3)]]
  690. 224.16 s > field value
  691. 224.16 s > span warm_up{integrand.name=se1l_rls_shifted}
  692. 224.16 s > [2026-08-28 12:18:46.633] @process::amplitude WARNING : External state 0 ('g', PDG 21, helicity +) is off shell: p^2 = +2.5e5, expected m^2 = +0e0 (|Δ| = +2.5e5). Fixed-helicity spinor/vector/tensor external states may be ill-defined at this kinematic point.
  693. 224.16 s > field value
  694. 224.16 s > span warm_up{integrand.name=se1l}
  695. 224.16 s > [2026-08-28 12:18:46.633] @process::amplitude WARNING : External state 1 ('g', PDG 21, helicity -) is off shell: p^2 = +2.5e5, expected m^2 = +0e0 (|Δ| = +2.5e5). Fixed-helicity spinor/vector/tensor external states may be ill-defined at this kinematic point.
  696. 224.16 s > field value
  697. 224.16 s > span warm_up{integrand.name=se1l}
  698. 224.16 s > [2026-08-28 12:18:46.633] @process::amplitude INFO : Input is above threshold: 1 existing threshold E-surfaces across 1/1 graph groups
  699. 224.16 s > field value
  700. 224.16 s > existing_esurfaces 1
  701. 224.16 s > group_count 1
  702. 224.16 s > groups_above_threshold 1
  703. 224.16 s > integrand se1l
  704. 224.16 s > span warm_up{integrand.name=se1l}
  705. 224.16 s > threshold_status above threshold
  706. 224.16 s > [2026-08-28 12:18:46.634] @process::amplitude INFO : overlap structure of group 0: [1: [0(2,3)]]
  707. 224.16 s > field value
  708. 224.16 s > span warm_up{integrand.name=se1l}
  709. 224.16 s > [2026-08-28 12:18:46.639] @process::amplitude WARNING : External state 0 ('g', PDG 21, helicity +) is off shell: p^2 = +2.5e5, expected m^2 = +0e0 (|Δ| = +2.5e5). Fixed-helicity spinor/vector/tensor external states may be ill-defined at this kinematic point.
  710. 224.16 s > field value
  711. 224.16 s > span warm_up{integrand.name=se1l_rls_shifted}
  712. 224.16 s > [2026-08-28 12:18:46.640] @process::amplitude WARNING : External state 1 ('g', PDG 21, helicity -) is off shell: p^2 = +2.5e5, expected m^2 = +0e0 (|Δ| = +2.5e5). Fixed-helicity spinor/vector/tensor external states may be ill-defined at this kinematic point.
  713. 224.16 s > field value
  714. 224.16 s > span warm_up{integrand.name=se1l_rls_shifted}
  715. 224.16 s > [2026-08-28 12:18:46.640] @process::amplitude INFO : Input is above threshold: 1 existing threshold E-surfaces across 1/1 graph groups
  716. 224.16 s > field value
  717. 224.16 s > existing_esurfaces 1
  718. 224.16 s > group_count 1
  719. 224.16 s > groups_above_threshold 1
  720. 224.16 s > integrand se1l_rls_shifted
  721. 224.16 s > span warm_up{integrand.name=se1l_rls_shifted}
  722. 224.16 s > threshold_status above threshold
  723. 224.16 s > [2026-08-28 12:18:46.640] @process::amplitude INFO : overlap structure of group 0: [1: [0(2,3)]]
  724. 224.16 s > field value
  725. 224.16 s > span warm_up{integrand.name=se1l_rls_shifted}
  726. 224.16 s > [2026-08-28 12:18:46.646] @process::amplitude WARNING : External state 0 ('g', PDG 21, helicity +) is off shell: p^2 = +2.5e5, expected m^2 = +0e0 (|Δ| = +2.5e5). Fixed-helicity spinor/vector/tensor external states may be ill-defined at this kinematic point.
  727. 224.16 s > field value
  728. 224.16 s > span warm_up{integrand.name=se1l}
  729. 224.16 s > [2026-08-28 12:18:46.646] @process::amplitude WARNING : External state 1 ('g', PDG 21, helicity -) is off shell: p^2 = +2.5e5, expected m^2 = +0e0 (|Δ| = +2.5e5). Fixed-helicity spinor/vector/tensor external states may be ill-defined at this kinematic point.
  730. 224.16 s > field value
  731. 224.16 s > span warm_up{integrand.name=se1l}
  732. 224.16 s > [2026-08-28 12:18:46.647] @process::amplitude INFO : Input is above threshold: 1 existing threshold E-surfaces across 1/1 graph groups
  733. 224.16 s > field value
  734. 224.16 s > existing_esurfaces 1
  735. 224.16 s > group_count 1
  736. 224.16 s > groups_above_threshold 1
  737. 224.16 s > integrand se1l
  738. 224.16 s > span warm_up{integrand.name=se1l}
  739. 224.16 s > threshold_status above threshold
  740. 224.16 s > [2026-08-28 12:18:46.647] @process::amplitude INFO : overlap structure of group 0: [1: [0(2,3)]]
  741. 224.16 s > field value
  742. 224.16 s > span warm_up{integrand.name=se1l}
  743. 224.16 s > [2026-08-28 12:18:46.653] @process::amplitude WARNING : External state 0 ('g', PDG 21, helicity +) is off shell: p^2 = +2.5e5, expected m^2 = +0e0 (|Δ| = +2.5e5). Fixed-helicity spinor/vector/tensor external states may be ill-defined at this kinematic point.
  744. 224.16 s > field value
  745. 224.16 s > span warm_up{integrand.name=se1l_rls_shifted}
  746. 224.16 s > [2026-08-28 12:18:46.653] @process::amplitude WARNING : External state 1 ('g', PDG 21, helicity -) is off shell: p^2 = +2.5e5, expected m^2 = +0e0 (|Δ| = +2.5e5). Fixed-helicity spinor/vector/tensor external states may be ill-defined at this kinematic point.
  747. 224.16 s > field value
  748. 224.16 s > span warm_up{integrand.name=se1l_rls_shifted}
  749. 224.16 s > [2026-08-28 12:18:46.653] @process::amplitude INFO : Input is above threshold: 1 existing threshold E-surfaces across 1/1 graph groups
  750. 224.16 s > field value
  751. 224.16 s > existing_esurfaces 1
  752. 224.16 s > group_count 1
  753. 224.16 s > groups_above_threshold 1
  754. 224.16 s > integrand se1l_rls_shifted
  755. 224.16 s > span warm_up{integrand.name=se1l_rls_shifted}
  756. 224.16 s > threshold_status above threshold
  757. 224.16 s > [2026-08-28 12:18:46.653] @process::amplitude INFO : overlap structure of group 0: [1: [0(2,3)]]
  758. 224.16 s > field value
  759. 224.16 s > span warm_up{integrand.name=se1l_rls_shifted}
  760. 224.16 s > [2026-08-28 12:18:46.660] @process::amplitude WARNING : External state 0 ('g', PDG 21, helicity +) is off shell: p^2 = +2.5e5, expected m^2 = +0e0 (|Δ| = +2.5e5). Fixed-helicity spinor/vector/tensor external states may be ill-defined at this kinematic point.
  761. 224.16 s > field value
  762. 224.16 s > span warm_up{integrand.name=se1l}
  763. 224.16 s > [2026-08-28 12:18:46.660] @process::amplitude WARNING : External state 1 ('g', PDG 21, helicity -) is off shell: p^2 = +2.5e5, expected m^2 = +0e0 (|Δ| = +2.5e5). Fixed-helicity spinor/vector/tensor external states may be ill-defined at this kinematic point.
  764. 224.16 s > field value
  765. 224.16 s > span warm_up{integrand.name=se1l}
  766. 224.16 s > [2026-08-28 12:18:46.660] @process::amplitude INFO : Input is above threshold: 1 existing threshold E-surfaces across 1/1 graph groups
  767. 224.16 s > field value
  768. 224.16 s > existing_esurfaces 1
  769. 224.16 s > group_count 1
  770. 224.16 s > groups_above_threshold 1
  771. 224.16 s > integrand se1l
  772. 224.16 s > span warm_up{integrand.name=se1l}
  773. 224.16 s > threshold_status above threshold
  774. 224.16 s > [2026-08-28 12:18:46.660] @process::amplitude INFO : overlap structure of group 0: [1: [0(2,3)]]
  775. 224.16 s > field value
  776. 224.16 s > span warm_up{integrand.name=se1l}
  777. 224.16 s > [2026-08-28 12:18:46.666] @process::amplitude WARNING : External state 0 ('g', PDG 21, helicity +) is off shell: p^2 = +2.5e5, expected m^2 = +0e0 (|Δ| = +2.5e5). Fixed-helicity spinor/vector/tensor external states may be ill-defined at this kinematic point.
  778. 224.16 s > field value
  779. 224.16 s > span warm_up{integrand.name=se1l_rls_shifted}
  780. 224.16 s > [2026-08-28 12:18:46.666] @process::amplitude WARNING : External state 1 ('g', PDG 21, helicity -) is off shell: p^2 = +2.5e5, expected m^2 = +0e0 (|Δ| = +2.5e5). Fixed-helicity spinor/vector/tensor external states may be ill-defined at this kinematic point.
  781. 224.16 s > field value
  782. 224.16 s > span warm_up{integrand.name=se1l_rls_shifted}
  783. 224.16 s > [2026-08-28 12:18:46.667] @process::amplitude INFO : Input is above threshold: 1 existing threshold E-surfaces across 1/1 graph groups
  784. 224.16 s > field value
  785. 224.16 s > existing_esurfaces 1
  786. 224.16 s > group_count 1
  787. 224.16 s > groups_above_threshold 1
  788. 224.16 s > integrand se1l_rls_shifted
  789. 224.16 s > span warm_up{integrand.name=se1l_rls_shifted}
  790. 224.16 s > threshold_status above threshold
  791. 224.16 s > [2026-08-28 12:18:46.667] @process::amplitude INFO : overlap structure of group 0: [1: [0(2,3)]]
  792. 224.16 s > field value
  793. 224.16 s > span warm_up{integrand.name=se1l_rls_shifted}
  794. 224.16 s > [2026-08-28 12:18:46.674] @process::amplitude WARNING : External state 0 ('g', PDG 21, helicity +) is off shell: p^2 = +2.5e5, expected m^2 = +0e0 (|Δ| = +2.5e5). Fixed-helicity spinor/vector/tensor external states may be ill-defined at this kinematic point.
  795. 224.16 s > field value
  796. 224.16 s > span warm_up{integrand.name=se1l}
  797. 224.16 s > [2026-08-28 12:18:46.674] @process::amplitude WARNING : External state 1 ('g', PDG 21, helicity -) is off shell: p^2 = +2.5e5, expected m^2 = +0e0 (|Δ| = +2.5e5). Fixed-helicity spinor/vector/tensor external states may be ill-defined at this kinematic point.
  798. 224.16 s > field value
  799. 224.16 s > span warm_up{integrand.name=se1l}
  800. 224.16 s > [2026-08-28 12:18:46.674] @process::amplitude INFO : Input is above threshold: 1 existing threshold E-surfaces across 1/1 graph groups
  801. 224.16 s > field value
  802. 224.16 s > existing_esurfaces 1
  803. 224.16 s > group_count 1
  804. 224.16 s > groups_above_threshold 1
  805. 224.16 s > integrand se1l
  806. 224.16 s > span warm_up{integrand.name=se1l}
  807. 224.16 s > threshold_status above threshold
  808. 224.16 s > [2026-08-28 12:18:46.674] @process::amplitude INFO : overlap structure of group 0: [1: [0(2,3)]]
  809. 224.16 s > field value
  810. 224.16 s > span warm_up{integrand.name=se1l}
  811. 224.16 s > [2026-08-28 12:18:46.680] @process::amplitude WARNING : External state 0 ('g', PDG 21, helicity +) is off shell: p^2 = +2.5e5, expected m^2 = +0e0 (|Δ| = +2.5e5). Fixed-helicity spinor/vector/tensor external states may be ill-defined at this kinematic point.
  812. 224.16 s > field value
  813. 224.16 s > span warm_up{integrand.name=se1l_rls_shifted}
  814. 224.16 s > [2026-08-28 12:18:46.680] @process::amplitude WARNING : External state 1 ('g', PDG 21, helicity -) is off shell: p^2 = +2.5e5, expected m^2 = +0e0 (|Δ| = +2.5e5). Fixed-helicity spinor/vector/tensor external states may be ill-defined at this kinematic point.
  815. 224.16 s > field value
  816. 224.16 s > span warm_up{integrand.name=se1l_rls_shifted}
  817. 224.16 s > [2026-08-28 12:18:46.680] @process::amplitude INFO : Input is above threshold: 1 existing threshold E-surfaces across 1/1 graph groups
  818. 224.16 s > field value
  819. 224.16 s > existing_esurfaces 1
  820. 224.16 s > group_count 1
  821. 224.16 s > groups_above_threshold 1
  822. 224.16 s > integrand se1l_rls_shifted
  823. 224.16 s > span warm_up{integrand.name=se1l_rls_shifted}
  824. 224.16 s > threshold_status above threshold
  825. 224.16 s > [2026-08-28 12:18:46.680] @process::amplitude INFO : overlap structure of group 0: [1: [0(2,3)]]
  826. 224.16 s > field value
  827. 224.16 s > span warm_up{integrand.name=se1l_rls_shifted}
  828. 224.16 s > [2026-08-28 12:18:46.686] @process::amplitude WARNING : External state 0 ('g', PDG 21, helicity +) is off shell: p^2 = +2.5e5, expected m^2 = +0e0 (|Δ| = +2.5e5). Fixed-helicity spinor/vector/tensor external states may be ill-defined at this kinematic point.
  829. 224.16 s > field value
  830. 224.16 s > span warm_up{integrand.name=se1l}
  831. 224.16 s > [2026-08-28 12:18:46.686] @process::amplitude WARNING : External state 1 ('g', PDG 21, helicity -) is off shell: p^2 = +2.5e5, expected m^2 = +0e0 (|Δ| = +2.5e5). Fixed-helicity spinor/vector/tensor external states may be ill-defined at this kinematic point.
  832. 224.16 s > field value
  833. 224.16 s > span warm_up{integrand.name=se1l}
  834. 224.16 s > [2026-08-28 12:18:46.687] @process::amplitude INFO : Input is above threshold: 1 existing threshold E-surfaces across 1/1 graph groups
  835. 224.16 s > field value
  836. 224.16 s > existing_esurfaces 1
  837. 224.16 s > group_count 1
  838. 224.16 s > groups_above_threshold 1
  839. 224.16 s > integrand se1l
  840. 224.16 s > span warm_up{integrand.name=se1l}
  841. 224.16 s > threshold_status above threshold
  842. 224.16 s > [2026-08-28 12:18:46.687] @process::amplitude INFO : overlap structure of group 0: [1: [0(2,3)]]
  843. 224.16 s > field value
  844. 224.16 s > span warm_up{integrand.name=se1l}
  845. 224.16 s > [2026-08-28 12:18:46.693] @process::amplitude WARNING : External state 0 ('g', PDG 21, helicity +) is off shell: p^2 = +2.5e5, expected m^2 = +0e0 (|Δ| = +2.5e5). Fixed-helicity spinor/vector/tensor external states may be ill-defined at this kinematic point.
  846. 224.16 s > field value
  847. 224.16 s > span warm_up{integrand.name=se1l_rls_shifted}
  848. 224.16 s > [2026-08-28 12:18:46.693] @process::amplitude WARNING : External state 1 ('g', PDG 21, helicity -) is off shell: p^2 = +2.5e5, expected m^2 = +0e0 (|Δ| = +2.5e5). Fixed-helicity spinor/vector/tensor external states may be ill-defined at this kinematic point.
  849. 224.16 s > field value
  850. 224.16 s > span warm_up{integrand.name=se1l_rls_shifted}
  851. 224.16 s > [2026-08-28 12:18:46.693] @process::amplitude INFO : Input is above threshold: 1 existing threshold E-surfaces across 1/1 graph groups
  852. 224.16 s > field value
  853. 224.16 s > existing_esurfaces 1
  854. 224.16 s > group_count 1
  855. 224.16 s > groups_above_threshold 1
  856. 224.16 s > integrand se1l_rls_shifted
  857. 224.16 s > span warm_up{integrand.name=se1l_rls_shifted}
  858. 224.16 s > threshold_status above threshold
  859. 224.16 s > [2026-08-28 12:18:46.694] @process::amplitude INFO : overlap structure of group 0: [1: [0(2,3)]]
  860. 224.16 s > field value
  861. 224.16 s > span warm_up{integrand.name=se1l_rls_shifted}
  862. 224.16 s > [2026-08-28 12:18:46.700] @process::amplitude WARNING : External state 0 ('g', PDG 21, helicity +) is off shell: p^2 = +2.5e5, expected m^2 = +0e0 (|Δ| = +2.5e5). Fixed-helicity spinor/vector/tensor external states may be ill-defined at this kinematic point.
  863. 224.16 s > field value
  864. 224.16 s > span warm_up{integrand.name=se1l}
  865. 224.16 s > [2026-08-28 12:18:46.700] @process::amplitude WARNING : External state 1 ('g', PDG 21, helicity -) is off shell: p^2 = +2.5e5, expected m^2 = +0e0 (|Δ| = +2.5e5). Fixed-helicity spinor/vector/tensor external states may be ill-defined at this kinematic point.
  866. 224.16 s > field value
  867. 224.16 s > span warm_up{integrand.name=se1l}
  868. 224.16 s > [2026-08-28 12:18:46.700] @process::amplitude INFO : Input is above threshold: 1 existing threshold E-surfaces across 1/1 graph groups
  869. 224.16 s > field value
  870. 224.16 s > existing_esurfaces 1
  871. 224.16 s > group_count 1
  872. 224.16 s > groups_above_threshold 1
  873. 224.16 s > integrand se1l
  874. 224.16 s > span warm_up{integrand.name=se1l}
  875. 224.16 s > threshold_status above threshold
  876. 224.16 s > [2026-08-28 12:18:46.701] @process::amplitude INFO : overlap structure of group 0: [1: [0(2,3)]]
  877. 224.16 s > field value
  878. 224.16 s > span warm_up{integrand.name=se1l}
  879. 224.16 s > [2026-08-28 12:18:46.707] @process::amplitude WARNING : External state 0 ('g', PDG 21, helicity +) is off shell: p^2 = +2.5e5, expected m^2 = +0e0 (|Δ| = +2.5e5). Fixed-helicity spinor/vector/tensor external states may be ill-defined at this kinematic point.
  880. 224.16 s > field value
  881. 224.16 s > span warm_up{integrand.name=se1l_rls_shifted}
  882. 224.16 s > [2026-08-28 12:18:46.707] @process::amplitude WARNING : External state 1 ('g', PDG 21, helicity -) is off shell: p^2 = +2.5e5, expected m^2 = +0e0 (|Δ| = +2.5e5). Fixed-helicity spinor/vector/tensor external states may be ill-defined at this kinematic point.
  883. 224.16 s > field value
  884. 224.16 s > span warm_up{integrand.name=se1l_rls_shifted}
  885. 224.16 s > [2026-08-28 12:18:46.708] @process::amplitude INFO : Input is above threshold: 1 existing threshold E-surfaces across 1/1 graph groups
  886. 224.16 s > field value
  887. 224.16 s > existing_esurfaces 1
  888. 224.16 s > group_count 1
  889. 224.16 s > groups_above_threshold 1
  890. 224.16 s > integrand se1l_rls_shifted
  891. 224.16 s > span warm_up{integrand.name=se1l_rls_shifted}
  892. 224.16 s > threshold_status above threshold
  893. 224.16 s > [2026-08-28 12:18:46.708] @process::amplitude INFO : overlap structure of group 0: [1: [0(2,3)]]
  894. 224.16 s > field value
  895. 224.16 s > span warm_up{integrand.name=se1l_rls_shifted}
  896. 224.16 s > [2026-08-28 12:18:46.714] @process::amplitude WARNING : External state 0 ('g', PDG 21, helicity +) is off shell: p^2 = +2.5e5, expected m^2 = +0e0 (|Δ| = +2.5e5). Fixed-helicity spinor/vector/tensor external states may be ill-defined at this kinematic point.
  897. 224.16 s > field value
  898. 224.16 s > span warm_up{integrand.name=se1l}
  899. 224.16 s > [2026-08-28 12:18:46.714] @process::amplitude WARNING : External state 1 ('g', PDG 21, helicity -) is off shell: p^2 = +2.5e5, expected m^2 = +0e0 (|Δ| = +2.5e5). Fixed-helicity spinor/vector/tensor external states may be ill-defined at this kinematic point.
  900. 224.16 s > field value
  901. 224.16 s > span warm_up{integrand.name=se1l}
  902. 224.16 s > [2026-08-28 12:18:46.714] @process::amplitude INFO : Input is above threshold: 1 existing threshold E-surfaces across 1/1 graph groups
  903. 224.16 s > field value
  904. 224.16 s > existing_esurfaces 1
  905. 224.16 s > group_count 1
  906. 224.16 s > groups_above_threshold 1
  907. 224.16 s > integrand se1l
  908. 224.16 s > span warm_up{integrand.name=se1l}
  909. 224.16 s > threshold_status above threshold
  910. 224.16 s > [2026-08-28 12:18:46.714] @process::amplitude INFO : overlap structure of group 0: [1: [0(2,3)]]
  911. 224.16 s > field value
  912. 224.16 s > span warm_up{integrand.name=se1l}
  913. 224.16 s > [2026-08-28 12:18:46.721] @process::amplitude WARNING : External state 0 ('g', PDG 21, helicity +) is off shell: p^2 = +2.5e5, expected m^2 = +0e0 (|Δ| = +2.5e5). Fixed-helicity spinor/vector/tensor external states may be ill-defined at this kinematic point.
  914. 224.16 s > field value
  915. 224.16 s > span warm_up{integrand.name=se1l_mur_shifted}
  916. 224.16 s > [2026-08-28 12:18:46.721] @process::amplitude WARNING : External state 1 ('g', PDG 21, helicity -) is off shell: p^2 = +2.5e5, expected m^2 = +0e0 (|Δ| = +2.5e5). Fixed-helicity spinor/vector/tensor external states may be ill-defined at this kinematic point.
  917. 224.16 s > field value
  918. 224.16 s > span warm_up{integrand.name=se1l_mur_shifted}
  919. 224.16 s > [2026-08-28 12:18:46.721] @process::amplitude INFO : Input is above threshold: 1 existing threshold E-surfaces across 1/1 graph groups
  920. 224.16 s > field value
  921. 224.16 s > existing_esurfaces 1
  922. 224.16 s > group_count 1
  923. 224.16 s > groups_above_threshold 1
  924. 224.16 s > integrand se1l_mur_shifted
  925. 224.16 s > span warm_up{integrand.name=se1l_mur_shifted}
  926. 224.16 s > threshold_status above threshold
  927. 224.16 s > [2026-08-28 12:18:46.721] @process::amplitude INFO : overlap structure of group 0: [1: [0(2,3)]]
  928. 224.16 s > field value
  929. 224.16 s > span warm_up{integrand.name=se1l_mur_shifted}
  930. 224.16 s > [2026-08-28 12:18:46.728] @process::amplitude WARNING : External state 0 ('g', PDG 21, helicity +) is off shell: p^2 = +2.5e5, expected m^2 = +0e0 (|Δ| = +2.5e5). Fixed-helicity spinor/vector/tensor external states may be ill-defined at this kinematic point.
  931. 224.16 s > field value
  932. 224.16 s > span warm_up{integrand.name=se1l}
  933. 224.16 s > [2026-08-28 12:18:46.728] @process::amplitude WARNING : External state 1 ('g', PDG 21, helicity -) is off shell: p^2 = +2.5e5, expected m^2 = +0e0 (|Δ| = +2.5e5). Fixed-helicity spinor/vector/tensor external states may be ill-defined at this kinematic point.
  934. 224.16 s > field value
  935. 224.16 s > span warm_up{integrand.name=se1l}
  936. 224.16 s > [2026-08-28 12:18:46.728] @process::amplitude INFO : Input is above threshold: 1 existing threshold E-surfaces across 1/1 graph groups
  937. 224.16 s > field value
  938. 224.16 s > existing_esurfaces 1
  939. 224.16 s > group_count 1
  940. 224.16 s > groups_above_threshold 1
  941. 224.16 s > integrand se1l
  942. 224.16 s > span warm_up{integrand.name=se1l}
  943. 224.16 s > threshold_status above threshold
  944. 224.16 s > [2026-08-28 12:18:46.728] @process::amplitude INFO : overlap structure of group 0: [1: [0(2,3)]]
  945. 224.16 s > field value
  946. 224.16 s > span warm_up{integrand.name=se1l}
  947. 224.16 s > [2026-08-28 12:18:46.735] @process::amplitude WARNING : External state 0 ('g', PDG 21, helicity +) is off shell: p^2 = +2.5e5, expected m^2 = +0e0 (|Δ| = +2.5e5). Fixed-helicity spinor/vector/tensor external states may be ill-defined at this kinematic point.
  948. 224.16 s > field value
  949. 224.16 s > span warm_up{integrand.name=se1l_mur_shifted}
  950. 224.16 s > [2026-08-28 12:18:46.735] @process::amplitude WARNING : External state 1 ('g', PDG 21, helicity -) is off shell: p^2 = +2.5e5, expected m^2 = +0e0 (|Δ| = +2.5e5). Fixed-helicity spinor/vector/tensor external states may be ill-defined at this kinematic point.
  951. 224.16 s > field value
  952. 224.16 s > span warm_up{integrand.name=se1l_mur_shifted}
  953. 224.16 s > [2026-08-28 12:18:46.736] @process::amplitude INFO : Input is above threshold: 1 existing threshold E-surfaces across 1/1 graph groups
  954. 224.16 s > field value
  955. 224.16 s > existing_esurfaces 1
  956. 224.16 s > group_count 1
  957. 224.16 s > groups_above_threshold 1
  958. 224.16 s > integrand se1l_mur_shifted
  959. 224.16 s > span warm_up{integrand.name=se1l_mur_shifted}
  960. 224.16 s > threshold_status above threshold
  961. 224.16 s > [2026-08-28 12:18:46.736] @process::amplitude INFO : overlap structure of group 0: [1: [0(2,3)]]
  962. 224.16 s > field value
  963. 224.16 s > span warm_up{integrand.name=se1l_mur_shifted}
  964. 224.16 s > [2026-08-28 12:18:46.742] @process::amplitude WARNING : External state 0 ('g', PDG 21, helicity +) is off shell: p^2 = +2.5e5, expected m^2 = +0e0 (|Δ| = +2.5e5). Fixed-helicity spinor/vector/tensor external states may be ill-defined at this kinematic point.
  965. 224.16 s > field value
  966. 224.16 s > span warm_up{integrand.name=se1l}
  967. 224.16 s > [2026-08-28 12:18:46.742] @process::amplitude WARNING : External state 1 ('g', PDG 21, helicity -) is off shell: p^2 = +2.5e5, expected m^2 = +0e0 (|Δ| = +2.5e5). Fixed-helicity spinor/vector/tensor external states may be ill-defined at this kinematic point.
  968. 224.16 s > field value
  969. 224.16 s > span warm_up{integrand.name=se1l}
  970. 224.16 s > [2026-08-28 12:18:46.742] @process::amplitude INFO : Input is above threshold: 1 existing threshold E-surfaces across 1/1 graph groups
  971. 224.16 s > field value
  972. 224.16 s > existing_esurfaces 1
  973. 224.16 s > group_count 1
  974. 224.16 s > groups_above_threshold 1
  975. 224.16 s > integrand se1l
  976. 224.16 s > span warm_up{integrand.name=se1l}
  977. 224.16 s > threshold_status above threshold
  978. 224.16 s > [2026-08-28 12:18:46.742] @process::amplitude INFO : overlap structure of group 0: [1: [0(2,3)]]
  979. 224.16 s > field value
  980. 224.16 s > span warm_up{integrand.name=se1l}
  981. 224.16 s > [2026-08-28 12:18:46.748] @process::amplitude WARNING : External state 0 ('g', PDG 21, helicity +) is off shell: p^2 = +2.5e5, expected m^2 = +0e0 (|Δ| = +2.5e5). Fixed-helicity spinor/vector/tensor external states may be ill-defined at this kinematic point.
  982. 224.16 s > field value
  983. 224.16 s > span warm_up{integrand.name=se1l_mur_shifted}
  984. 224.16 s > [2026-08-28 12:18:46.748] @process::amplitude WARNING : External state 1 ('g', PDG 21, helicity -) is off shell: p^2 = +2.5e5, expected m^2 = +0e0 (|Δ| = +2.5e5). Fixed-helicity spinor/vector/tensor external states may be ill-defined at this kinematic point.
  985. 224.16 s > field value
  986. 224.16 s > span warm_up{integrand.name=se1l_mur_shifted}
  987. 224.16 s > [2026-08-28 12:18:46.748] @process::amplitude INFO : Input is above threshold: 1 existing threshold E-surfaces across 1/1 graph groups
  988. 224.16 s > field value
  989. 224.16 s > existing_esurfaces 1
  990. 224.16 s > group_count 1
  991. 224.16 s > groups_above_threshold 1
  992. 224.16 s > integrand se1l_mur_shifted
  993. 224.16 s > span warm_up{integrand.name=se1l_mur_shifted}
  994. 224.16 s > threshold_status above threshold
  995. 224.16 s > [2026-08-28 12:18:46.749] @process::amplitude INFO : overlap structure of group 0: [1: [0(2,3)]]
  996. 224.16 s > field value
  997. 224.16 s > span warm_up{integrand.name=se1l_mur_shifted}
  998. 224.16 s > [2026-08-28 12:18:46.754] @process::amplitude WARNING : External state 0 ('g', PDG 21, helicity +) is off shell: p^2 = +2.5e5, expected m^2 = +0e0 (|Δ| = +2.5e5). Fixed-helicity spinor/vector/tensor external states may be ill-defined at this kinematic point.
  999. 224.16 s > field value
  1000. 224.16 s > span warm_up{integrand.name=se1l}
  1001. 224.16 s > [2026-08-28 12:18:46.754] @process::amplitude WARNING : External state 1 ('g', PDG 21, helicity -) is off shell: p^2 = +2.5e5, expected m^2 = +0e0 (|Δ| = +2.5e5). Fixed-helicity spinor/vector/tensor external states may be ill-defined at this kinematic point.
  1002. 224.16 s > field value
  1003. 224.16 s > span warm_up{integrand.name=se1l}
  1004. 224.16 s > [2026-08-28 12:18:46.754] @process::amplitude INFO : Input is above threshold: 1 existing threshold E-surfaces across 1/1 graph groups
  1005. 224.16 s > field value
  1006. 224.16 s > existing_esurfaces 1
  1007. 224.16 s > group_count 1
  1008. 224.16 s > groups_above_threshold 1
  1009. 224.16 s > integrand se1l
  1010. 224.16 s > span warm_up{integrand.name=se1l}
  1011. 224.16 s > threshold_status above threshold
  1012. 224.16 s > [2026-08-28 12:18:46.755] @process::amplitude INFO : overlap structure of group 0: [1: [0(2,3)]]
  1013. 224.16 s > field value
  1014. 224.16 s > span warm_up{integrand.name=se1l}
  1015. 224.16 s > [2026-08-28 12:18:46.761] @process::amplitude WARNING : External state 0 ('g', PDG 21, helicity +) is off shell: p^2 = +2.5e5, expected m^2 = +0e0 (|Δ| = +2.5e5). Fixed-helicity spinor/vector/tensor external states may be ill-defined at this kinematic point.
  1016. 224.16 s > field value
  1017. 224.16 s > span warm_up{integrand.name=se1l_mur_shifted}
  1018. 224.16 s > [2026-08-28 12:18:46.761] @process::amplitude WARNING : External state 1 ('g', PDG 21, helicity -) is off shell: p^2 = +2.5e5, expected m^2 = +0e0 (|Δ| = +2.5e5). Fixed-helicity spinor/vector/tensor external states may be ill-defined at this kinematic point.
  1019. 224.16 s > field value
  1020. 224.16 s > span warm_up{integrand.name=se1l_mur_shifted}
  1021. 224.16 s > [2026-08-28 12:18:46.761] @process::amplitude INFO : Input is above threshold: 1 existing threshold E-surfaces across 1/1 graph groups
  1022. 224.16 s > field value
  1023. 224.16 s > existing_esurfaces 1
  1024. 224.16 s > group_count 1
  1025. 224.16 s > groups_above_threshold 1
  1026. 224.16 s > integrand se1l_mur_shifted
  1027. 224.16 s > span warm_up{integrand.name=se1l_mur_shifted}
  1028. 224.16 s > threshold_status above threshold
  1029. 224.16 s > [2026-08-28 12:18:46.761] @process::amplitude INFO : overlap structure of group 0: [1: [0(2,3)]]
  1030. 224.16 s > field value
  1031. 224.16 s > span warm_up{integrand.name=se1l_mur_shifted}
  1032. 224.16 s > [2026-08-28 12:18:46.768] @process::amplitude WARNING : External state 0 ('g', PDG 21, helicity +) is off shell: p^2 = +2.5e5, expected m^2 = +0e0 (|Δ| = +2.5e5). Fixed-helicity spinor/vector/tensor external states may be ill-defined at this kinematic point.
  1033. 224.16 s > field value
  1034. 224.16 s > span warm_up{integrand.name=se1l}
  1035. 224.16 s > [2026-08-28 12:18:46.768] @process::amplitude WARNING : External state 1 ('g', PDG 21, helicity -) is off shell: p^2 = +2.5e5, expected m^2 = +0e0 (|Δ| = +2.5e5). Fixed-helicity spinor/vector/tensor external states may be ill-defined at this kinematic point.
  1036. 224.16 s > field value
  1037. 224.16 s > span warm_up{integrand.name=se1l}
  1038. 224.16 s > [2026-08-28 12:18:46.768] @process::amplitude INFO : Input is above threshold: 1 existing threshold E-surfaces across 1/1 graph groups
  1039. 224.16 s > field value
  1040. 224.16 s > existing_esurfaces 1
  1041. 224.16 s > group_count 1
  1042. 224.16 s > groups_above_threshold 1
  1043. 224.16 s > integrand se1l
  1044. 224.16 s > span warm_up{integrand.name=se1l}
  1045. 224.16 s > threshold_status above threshold
  1046. 224.16 s > [2026-08-28 12:18:46.768] @process::amplitude INFO : overlap structure of group 0: [1: [0(2,3)]]
  1047. 224.16 s > field value
  1048. 224.16 s > span warm_up{integrand.name=se1l}
  1049. 224.16 s > [2026-08-28 12:18:46.775] @process::amplitude WARNING : External state 0 ('g', PDG 21, helicity +) is off shell: p^2 = +2.5e5, expected m^2 = +0e0 (|Δ| = +2.5e5). Fixed-helicity spinor/vector/tensor external states may be ill-defined at this kinematic point.
  1050. 224.16 s > field value
  1051. 224.16 s > span warm_up{integrand.name=se1l_mur_shifted}
  1052. 224.16 s > [2026-08-28 12:18:46.775] @process::amplitude WARNING : External state 1 ('g', PDG 21, helicity -) is off shell: p^2 = +2.5e5, expected m^2 = +0e0 (|Δ| = +2.5e5). Fixed-helicity spinor/vector/tensor external states may be ill-defined at this kinematic point.
  1053. 224.16 s > field value
  1054. 224.16 s > span warm_up{integrand.name=se1l_mur_shifted}
  1055. 224.16 s > [2026-08-28 12:18:46.775] @process::amplitude INFO : Input is above threshold: 1 existing threshold E-surfaces across 1/1 graph groups
  1056. 224.16 s > field value
  1057. 224.16 s > existing_esurfaces 1
  1058. 224.16 s > group_count 1
  1059. 224.16 s > groups_above_threshold 1
  1060. 224.16 s > integrand se1l_mur_shifted
  1061. 224.16 s > span warm_up{integrand.name=se1l_mur_shifted}
  1062. 224.16 s > threshold_status above threshold
  1063. 224.16 s > [2026-08-28 12:18:46.775] @process::amplitude INFO : overlap structure of group 0: [1: [0(2,3)]]
  1064. 224.16 s > field value
  1065. 224.16 s > span warm_up{integrand.name=se1l_mur_shifted}
  1066. 224.16 s > [2026-08-28 12:18:46.780] @process::amplitude WARNING : External state 0 ('g', PDG 21, helicity +) is off shell: p^2 = +2.5e5, expected m^2 = +0e0 (|Δ| = +2.5e5). Fixed-helicity spinor/vector/tensor external states may be ill-defined at this kinematic point.
  1067. 224.16 s > field value
  1068. 224.16 s > span warm_up{integrand.name=se1l}
  1069. 224.16 s > [2026-08-28 12:18:46.780] @process::amplitude WARNING : External state 1 ('g', PDG 21, helicity -) is off shell: p^2 = +2.5e5, expected m^2 = +0e0 (|Δ| = +2.5e5). Fixed-helicity spinor/vector/tensor external states may be ill-defined at this kinematic point.
  1070. 224.16 s > field value
  1071. 224.16 s > span warm_up{integrand.name=se1l}
  1072. 224.16 s > [2026-08-28 12:18:46.781] @process::amplitude INFO : Input is above threshold: 1 existing threshold E-surfaces across 1/1 graph groups
  1073. 224.16 s > field value
  1074. 224.16 s > existing_esurfaces 1
  1075. 224.16 s > group_count 1
  1076. 224.16 s > groups_above_threshold 1
  1077. 224.16 s > integrand se1l
  1078. 224.16 s > span warm_up{integrand.name=se1l}
  1079. 224.16 s > threshold_status above threshold
  1080. 224.16 s > [2026-08-28 12:18:46.781] @process::amplitude INFO : overlap structure of group 0: [1: [0(2,3)]]
  1081. 224.16 s > field value
  1082. 224.16 s > span warm_up{integrand.name=se1l}
  1083. 224.16 s > [2026-08-28 12:18:46.787] @process::amplitude WARNING : External state 0 ('g', PDG 21, helicity +) is off shell: p^2 = +2.5e5, expected m^2 = +0e0 (|Δ| = +2.5e5). Fixed-helicity spinor/vector/tensor external states may be ill-defined at this kinematic point.
  1084. 224.16 s > field value
  1085. 224.16 s > span warm_up{integrand.name=se1l_mur_shifted}
  1086. 224.16 s > [2026-08-28 12:18:46.787] @process::amplitude WARNING : External state 1 ('g', PDG 21, helicity -) is off shell: p^2 = +2.5e5, expected m^2 = +0e0 (|Δ| = +2.5e5). Fixed-helicity spinor/vector/tensor external states may be ill-defined at this kinematic point.
  1087. 224.16 s > field value
  1088. 224.16 s > span warm_up{integrand.name=se1l_mur_shifted}
  1089. 224.16 s > [2026-08-28 12:18:46.787] @process::amplitude INFO : Input is above threshold: 1 existing threshold E-surfaces across 1/1 graph groups
  1090. 224.16 s > field value
  1091. 224.16 s > existing_esurfaces 1
  1092. 224.16 s > group_count 1
  1093. 224.16 s > groups_above_threshold 1
  1094. 224.16 s > integrand se1l_mur_shifted
  1095. 224.16 s > span warm_up{integrand.name=se1l_mur_shifted}
  1096. 224.16 s > threshold_status above threshold
  1097. 224.16 s > [2026-08-28 12:18:46.787] @process::amplitude INFO : overlap structure of group 0: [1: [0(2,3)]]
  1098. 224.16 s > field value
  1099. 224.16 s > span warm_up{integrand.name=se1l_mur_shifted}
  1100. 224.16 s > [2026-08-28 12:18:46.794] @process::amplitude WARNING : External state 0 ('g', PDG 21, helicity +) is off shell: p^2 = +2.5e5, expected m^2 = +0e0 (|Δ| = +2.5e5). Fixed-helicity spinor/vector/tensor external states may be ill-defined at this kinematic point.
  1101. 224.16 s > field value
  1102. 224.16 s > span warm_up{integrand.name=se1l}
  1103. 224.16 s > [2026-08-28 12:18:46.794] @process::amplitude WARNING : External state 1 ('g', PDG 21, helicity -) is off shell: p^2 = +2.5e5, expected m^2 = +0e0 (|Δ| = +2.5e5). Fixed-helicity spinor/vector/tensor external states may be ill-defined at this kinematic point.
  1104. 224.16 s > field value
  1105. 224.16 s > span warm_up{integrand.name=se1l}
  1106. 224.16 s > [2026-08-28 12:18:46.794] @process::amplitude INFO : Input is above threshold: 1 existing threshold E-surfaces across 1/1 graph groups
  1107. 224.16 s > field value
  1108. 224.16 s > existing_esurfaces 1
  1109. 224.16 s > group_count 1
  1110. 224.16 s > groups_above_threshold 1
  1111. 224.16 s > integrand se1l
  1112. 224.16 s > span warm_up{integrand.name=se1l}
  1113. 224.16 s > threshold_status above threshold
  1114. 224.16 s > [2026-08-28 12:18:46.794] @process::amplitude INFO : overlap structure of group 0: [1: [0(2,3)]]
  1115. 224.16 s > field value
  1116. 224.16 s > span warm_up{integrand.name=se1l}
  1117. 224.16 s > [2026-08-28 12:18:46.800] @process::amplitude WARNING : External state 0 ('g', PDG 21, helicity +) is off shell: p^2 = +2.5e5, expected m^2 = +0e0 (|Δ| = +2.5e5). Fixed-helicity spinor/vector/tensor external states may be ill-defined at this kinematic point.
  1118. 224.16 s > field value
  1119. 224.16 s > span warm_up{integrand.name=se1l_mur_shifted}
  1120. 224.16 s > [2026-08-28 12:18:46.800] @process::amplitude WARNING : External state 1 ('g', PDG 21, helicity -) is off shell: p^2 = +2.5e5, expected m^2 = +0e0 (|Δ| = +2.5e5). Fixed-helicity spinor/vector/tensor external states may be ill-defined at this kinematic point.
  1121. 224.16 s > field value
  1122. 224.16 s > span warm_up{integrand.name=se1l_mur_shifted}
  1123. 224.16 s > [2026-08-28 12:18:46.800] @process::amplitude INFO : Input is above threshold: 1 existing threshold E-surfaces across 1/1 graph groups
  1124. 224.16 s > field value
  1125. 224.16 s > existing_esurfaces 1
  1126. 224.16 s > group_count 1
  1127. 224.16 s > groups_above_threshold 1
  1128. 224.16 s > integrand se1l_mur_shifted
  1129. 224.16 s > span warm_up{integrand.name=se1l_mur_shifted}
  1130. 224.16 s > threshold_status above threshold
  1131. 224.16 s > [2026-08-28 12:18:46.800] @process::amplitude INFO : overlap structure of group 0: [1: [0(2,3)]]
  1132. 224.16 s > field value
  1133. 224.16 s > span warm_up{integrand.name=se1l_mur_shifted}
  1134. 224.16 s > [2026-08-28 12:18:46.806] @process::amplitude WARNING : External state 0 ('g', PDG 21, helicity +) is off shell: p^2 = +2.5e5, expected m^2 = +0e0 (|Δ| = +2.5e5). Fixed-helicity spinor/vector/tensor external states may be ill-defined at this kinematic point.
  1135. 224.16 s > field value
  1136. 224.16 s > span warm_up{integrand.name=se1l}
  1137. 224.16 s > [2026-08-28 12:18:46.806] @process::amplitude WARNING : External state 1 ('g', PDG 21, helicity -) is off shell: p^2 = +2.5e5, expected m^2 = +0e0 (|Δ| = +2.5e5). Fixed-helicity spinor/vector/tensor external states may be ill-defined at this kinematic point.
  1138. 224.16 s > field value
  1139. 224.16 s > span warm_up{integrand.name=se1l}
  1140. 224.16 s > [2026-08-28 12:18:46.806] @process::amplitude INFO : Input is above threshold: 1 existing threshold E-surfaces across 1/1 graph groups
  1141. 224.16 s > field value
  1142. 224.16 s > existing_esurfaces 1
  1143. 224.16 s > group_count 1
  1144. 224.16 s > groups_above_threshold 1
  1145. 224.16 s > integrand se1l
  1146. 224.16 s > span warm_up{integrand.name=se1l}
  1147. 224.16 s > threshold_status above threshold
  1148. 224.16 s > [2026-08-28 12:18:46.806] @process::amplitude INFO : overlap structure of group 0: [1: [0(2,3)]]
  1149. 224.16 s > field value
  1150. 224.16 s > span warm_up{integrand.name=se1l}
  1151. 224.16 s > [2026-08-28 12:18:46.812] @process::amplitude WARNING : External state 0 ('g', PDG 21, helicity +) is off shell: p^2 = +2.5e5, expected m^2 = +0e0 (|Δ| = +2.5e5). Fixed-helicity spinor/vector/tensor external states may be ill-defined at this kinematic point.
  1152. 224.16 s > field value
  1153. 224.16 s > span warm_up{integrand.name=se1l_mur_shifted}
  1154. 224.16 s > [2026-08-28 12:18:46.812] @process::amplitude WARNING : External state 1 ('g', PDG 21, helicity -) is off shell: p^2 = +2.5e5, expected m^2 = +0e0 (|Δ| = +2.5e5). Fixed-helicity spinor/vector/tensor external states may be ill-defined at this kinematic point.
  1155. 224.16 s > field value
  1156. 224.16 s > span warm_up{integrand.name=se1l_mur_shifted}
  1157. 224.16 s > [2026-08-28 12:18:46.813] @process::amplitude INFO : Input is above threshold: 1 existing threshold E-surfaces across 1/1 graph groups
  1158. 224.16 s > field value
  1159. 224.16 s > existing_esurfaces 1
  1160. 224.16 s > group_count 1
  1161. 224.16 s > groups_above_threshold 1
  1162. 224.16 s > integrand se1l_mur_shifted
  1163. 224.16 s > span warm_up{integrand.name=se1l_mur_shifted}
  1164. 224.16 s > threshold_status above threshold
  1165. 224.16 s > [2026-08-28 12:18:46.813] @process::amplitude INFO : overlap structure of group 0: [1: [0(2,3)]]
  1166. 224.16 s > field value
  1167. 224.16 s > span warm_up{integrand.name=se1l_mur_shifted}
  1168. 224.16 s > [2026-08-28 12:18:46.819] @process::amplitude WARNING : External state 0 ('g', PDG 21, helicity +) is off shell: p^2 = +2.5e5, expected m^2 = +0e0 (|Δ| = +2.5e5). Fixed-helicity spinor/vector/tensor external states may be ill-defined at this kinematic point.
  1169. 224.16 s > field value
  1170. 224.16 s > span warm_up{integrand.name=se1l}
  1171. 224.16 s > [2026-08-28 12:18:46.819] @process::amplitude WARNING : External state 1 ('g', PDG 21, helicity -) is off shell: p^2 = +2.5e5, expected m^2 = +0e0 (|Δ| = +2.5e5). Fixed-helicity spinor/vector/tensor external states may be ill-defined at this kinematic point.
  1172. 224.16 s > field value
  1173. 224.16 s > span warm_up{integrand.name=se1l}
  1174. 224.16 s > [2026-08-28 12:18:46.820] @process::amplitude INFO : Input is above threshold: 1 existing threshold E-surfaces across 1/1 graph groups
  1175. 224.16 s > field value
  1176. 224.16 s > existing_esurfaces 1
  1177. 224.16 s > group_count 1
  1178. 224.16 s > groups_above_threshold 1
  1179. 224.16 s > integrand se1l
  1180. 224.16 s > span warm_up{integrand.name=se1l}
  1181. 224.16 s > threshold_status above threshold
  1182. 224.16 s > [2026-08-28 12:18:46.820] @process::amplitude INFO : overlap structure of group 0: [1: [0(2,3)]]
  1183. 224.16 s > field value
  1184. 224.16 s > span warm_up{integrand.name=se1l}
  1185. 224.16 s > [2026-08-28 12:18:46.826] @process::amplitude WARNING : External state 0 ('g', PDG 21, helicity +) is off shell: p^2 = +2.5e5, expected m^2 = +0e0 (|Δ| = +2.5e5). Fixed-helicity spinor/vector/tensor external states may be ill-defined at this kinematic point.
  1186. 224.16 s > field value
  1187. 224.16 s > span warm_up{integrand.name=se1l_mur_shifted}
  1188. 224.16 s > [2026-08-28 12:18:46.826] @process::amplitude WARNING : External state 1 ('g', PDG 21, helicity -) is off shell: p^2 = +2.5e5, expected m^2 = +0e0 (|Δ| = +2.5e5). Fixed-helicity spinor/vector/tensor external states may be ill-defined at this kinematic point.
  1189. 224.16 s > field value
  1190. 224.16 s > span warm_up{integrand.name=se1l_mur_shifted}
  1191. 224.16 s > [2026-08-28 12:18:46.826] @process::amplitude INFO : Input is above threshold: 1 existing threshold E-surfaces across 1/1 graph groups
  1192. 224.16 s > field value
  1193. 224.16 s > existing_esurfaces 1
  1194. 224.16 s > group_count 1
  1195. 224.16 s > groups_above_threshold 1
  1196. 224.16 s > integrand se1l_mur_shifted
  1197. 224.16 s > span warm_up{integrand.name=se1l_mur_shifted}
  1198. 224.16 s > threshold_status above threshold
  1199. 224.16 s > [2026-08-28 12:18:46.826] @process::amplitude INFO : overlap structure of group 0: [1: [0(2,3)]]
  1200. 224.16 s > field value
  1201. 224.16 s > span warm_up{integrand.name=se1l_mur_shifted}
  1202. 224.16 s > [2026-08-28 12:18:46.833] @process::amplitude WARNING : External state 0 ('g', PDG 21, helicity +) is off shell: p^2 = +2.5e5, expected m^2 = +0e0 (|Δ| = +2.5e5). Fixed-helicity spinor/vector/tensor external states may be ill-defined at this kinematic point.
  1203. 224.16 s > field value
  1204. 224.16 s > span warm_up{integrand.name=se1l}
  1205. 224.16 s > [2026-08-28 12:18:46.833] @process::amplitude WARNING : External state 1 ('g', PDG 21, helicity -) is off shell: p^2 = +2.5e5, expected m^2 = +0e0 (|Δ| = +2.5e5). Fixed-helicity spinor/vector/tensor external states may be ill-defined at this kinematic point.
  1206. 224.16 s > field value
  1207. 224.16 s > span warm_up{integrand.name=se1l}
  1208. 224.16 s > [2026-08-28 12:18:46.833] @process::amplitude INFO : Input is above threshold: 1 existing threshold E-surfaces across 1/1 graph groups
  1209. 224.16 s > field value
  1210. 224.16 s > existing_esurfaces 1
  1211. 224.16 s > group_count 1
  1212. 224.16 s > groups_above_threshold 1
  1213. 224.16 s > integrand se1l
  1214. 224.16 s > span warm_up{integrand.name=se1l}
  1215. 224.16 s > threshold_status above threshold
  1216. 224.16 s > [2026-08-28 12:18:46.833] @process::amplitude INFO : overlap structure of group 0: [1: [0(2,3)]]
  1217. 224.16 s > field value
  1218. 224.16 s > span warm_up{integrand.name=se1l}
  1219. 224.16 s > [2026-08-28 12:18:46.839] @process::amplitude WARNING : External state 0 ('g', PDG 21, helicity +) is off shell: p^2 = +2.5e5, expected m^2 = +0e0 (|Δ| = +2.5e5). Fixed-helicity spinor/vector/tensor external states may be ill-defined at this kinematic point.
  1220. 224.16 s > field value
  1221. 224.16 s > span warm_up{integrand.name=se1l_mur_shifted}
  1222. 224.16 s > [2026-08-28 12:18:46.839] @process::amplitude WARNING : External state 1 ('g', PDG 21, helicity -) is off shell: p^2 = +2.5e5, expected m^2 = +0e0 (|Δ| = +2.5e5). Fixed-helicity spinor/vector/tensor external states may be ill-defined at this kinematic point.
  1223. 224.16 s > field value
  1224. 224.16 s > span warm_up{integrand.name=se1l_mur_shifted}
  1225. 224.16 s > [2026-08-28 12:18:46.839] @process::amplitude INFO : Input is above threshold: 1 existing threshold E-surfaces across 1/1 graph groups
  1226. 224.16 s > field value
  1227. 224.16 s > existing_esurfaces 1
  1228. 224.16 s > group_count 1
  1229. 224.16 s > groups_above_threshold 1
  1230. 224.16 s > integrand se1l_mur_shifted
  1231. 224.16 s > span warm_up{integrand.name=se1l_mur_shifted}
  1232. 224.16 s > threshold_status above threshold
  1233. 224.16 s > [2026-08-28 12:18:46.840] @process::amplitude INFO : overlap structure of group 0: [1: [0(2,3)]]
  1234. 224.16 s > field value
  1235. 224.16 s > span warm_up{integrand.name=se1l_mur_shifted}
  1236. 224.16 s > The application panicked (crashed).
  1237. 224.16 s > Message: Integrated UV case failed: se1l
  1238. 224.16 s > Location: tests/tests/uv.rs:1068
  1239. 224.16 s >
  1240. 224.16 s > ━━━━━━━━━━━━━━━━━━━━━━━━━━━━━━━━━━ BACKTRACE ━━━━━━━━━━━━━━━━━━━━━━━━━━━━━━━━━━━
  1241. 224.16 s > 1: <color_eyre[51793ea62743adbd]::config::PanicHook>::panic_report<unknown>
  1242. 224.16 s > at <unknown source file>:<unknown line>
  1243. 224.16 s > 2: <color_eyre[51793ea62743adbd]::config::PanicHook>::into_panic_hook::{closure#0}<unknown>
  1244. 224.16 s > at <unknown source file>:<unknown line>
  1245. 224.16 s > 3: std[bcb96dfbba0ab899]::panicking::panic_with_hook<unknown>
  1246. 224.16 s > at <unknown source file>:<unknown line>
  1247. 224.16 s > 4: std[bcb96dfbba0ab899]::panicking::panic_handler::{closure#0}<unknown>
  1248. 224.16 s > at <unknown source file>:<unknown line>
  1249. 224.16 s > 5: std[bcb96dfbba0ab899]::sys::backtrace::__rust_end_short_backtrace::<std[bcb96dfbba0ab899]::panicking::panic_handler::{closure#0}, !><unknown>
  1250. 224.16 s > at <unknown source file>:<unknown line>
  1251. 224.16 s > 6: __rustc[6c289b9f9c454d21]::rust_begin_unwind<unknown>
  1252. 224.16 s > at <unknown source file>:<unknown line>
  1253. 224.16 s > 7: core[940e698046960fd5]::panicking::panic_fmt<unknown>
  1254. 224.16 s > at <unknown source file>:<unknown line>
  1255. 224.16 s > 8: uv[52cf2b63f0104e31]::run_single_integrated_uv_case<unknown>
  1256. 224.16 s > at <unknown source file>:<unknown line>
  1257. 224.16 s > 9: <uv[52cf2b63f0104e31]::se1l_uv::{closure#0} as core[940e698046960fd5]::ops::function::FnOnce<()>>::call_once<unknown>
  1258. 224.16 s > at <unknown source file>:<unknown line>
  1259. 224.16 s > 10: test[75d6903177b1d7e9]::__rust_begin_short_backtrace::<core[940e698046960fd5]::result::Result<(), alloc[2ea6bcb46fca0c42]::string::String>, fn() -> core[940e698046960fd5]::result::Result<(), alloc[2ea6bcb46fca0c42]::string::String>><unknown>
  1260. 224.16 s > at <unknown source file>:<unknown line>
  1261. 224.16 s > 11: test[75d6903177b1d7e9]::run_test::{closure#0}<unknown>
  1262. 224.16 s > at <unknown source file>:<unknown line>
  1263. 224.16 s > 12: std[bcb96dfbba0ab899]::sys::backtrace::__rust_begin_short_backtrace::<test[75d6903177b1d7e9]::run_test::{closure#1}, ()><unknown>
  1264. 224.16 s > at <unknown source file>:<unknown line>
  1265. 224.16 s > 13: <std[bcb96dfbba0ab899]::thread::lifecycle::spawn_unchecked<test[75d6903177b1d7e9]::run_test::{closure#1}, ()>::{closure#1} as core[940e698046960fd5]::ops::function::FnOnce<()>>::call_once::{shim:vtable#0}<unknown>
  1266. 224.16 s > at <unknown source file>:<unknown line>
  1267. 224.16 s > 14: <std[bcb96dfbba0ab899]::sys::thread::unix::Thread>::new::thread_start<unknown>
  1268. 224.16 s > at <unknown source file>:<unknown line>
  1269. 224.16 s > 15: start_thread<unknown>
  1270. 224.16 s > at <unknown source file>:<unknown line>
  1271. 224.16 s > 16: __clone3<unknown>
  1272. 224.16 s > at <unknown source file>:<unknown line>
  1273. 224.16 s >
  1274. 224.16 s > Run with COLORBT_SHOW_HIDDEN=1 environment variable to disable frame filtering.
  1275. 224.16 s > Run with RUST_BACKTRACE=full to include source snippets.
  1276. 224.16 s >
  1277. 224.16 s > error: test run failed
  1278. 224.16 s >
  1279. 224.16 s > ========== nextest test summary ==========
  1280. 224.16 s > report: target/nextest/ci_gammaloop/junit.xml
  1281. 224.16 s > tests: 106, failures: 9, errors: 0
  1282. 224.16 s >
  1283. 224.16 s > 1. gammaloop-integration-tests::test_runs::approach::approach_momentum_space_reports_incomplete_triplet_cleanly
  1284. 224.16 s > failure: test failure with exit code 101
  1285. 224.16 s > system-out
  1286. 224.16 s > running 1 test
  1287. 224.16 s > test approach::approach_momentum_space_reports_incomplete_triplet_cleanly ... FAILED
  1288. 224.16 s >
  1289. 224.16 s > failures:
  1290. 224.16 s >
  1291. 224.16 s > failures:
  1292. 224.16 s > approach::approach_momentum_space_reports_incomplete_triplet_cleanly
  1293. 224.16 s >
  1294. 224.16 s > test result: FAILED. 0 passed; 1 failed; 0 ignored; 0 measured; 82 filtered out; finished in 0.78s
  1295. 224.16 s > system-err
  1296. 224.16 s > [2026-08-28 12:15:32.256] @gammaloop_api::se... INFO : Running command import model scalars-default.json
  1297. 224.16 s > [2026-08-28 12:15:32.256] @import::model INFO : Loading built-in JSON model scalars-default
  1298. 224.16 s > [2026-08-28 12:15:32.261] @gammalooprs::model INFO : The following 2 external parameters were forced to zero by the restriction card:
  1299. 224.16 s > width_scalar_1, width_scalar_2
  1300. 224.16 s > [2026-08-28 12:15:32.262] @gammaloop_api::se... INFO : Running command remove processes
  1301. 224.16 s > [2026-08-28 12:15:32.263] @gammaloop_api::se... INFO : Running command generate amp scalar_1 > scalar_0 scalar_0 [{1}] --allowed-vertex-interactions V_3_SCALAR_022 V_3_SCALAR_122 -p triangle -i scalar_tri
  1302. 224.16 s > [2026-08-28 12:15:32.264] @feyngen::diagram_... INFO : 0s | Δ=0s | Starting Feynman graph generation with Symbolica...
  1303. 224.16 s > [2026-08-28 12:15:32.264] @feyngen::diagram_... INFO : 0s | Δ=0s | Number of graphs resulting from Symbolica generation: 1
  1304. 224.16 s > [2026-08-28 12:15:32.266] @feyngen::diagram_... INFO : 0s | Δ=0s | Number of graphs retained after removal of vetoed topologies: 1
  1305. 224.16 s > [2026-08-28 12:15:32.272] @feyngen::diagram_... INFO : 0s | Δ=0s | Number of graphs after vertex info assignment: 1
  1306. 224.16 s > [2026-08-28 12:15:32.272] @feyngen::diagram_... INFO : 0s | Δ=0s | Number of graphs after all complete graphs filters are applied: 1
  1307. 224.16 s > [2026-08-28 12:15:32.278] @feyngen::diagram_... INFO : 0s | Δ=0s | Number of graphs after closed fermion chains analysis: 1
  1308. 224.16 s > [2026-08-28 12:15:32.278] @feyngen::diagram_... INFO : 0s | Δ=0s | Number of graphs after symmetrization of external states: 1
  1309. 224.16 s > [2026-08-28 12:15:32.281] @feyngen::diagram_... INFO : 0s | Δ=0s | Number of graphs after canonization of vertices, edges and flows (graph labels assigned here): 1
  1310. 224.16 s > [2026-08-28 12:15:32.301] @feyngen::diagram_... INFO : 0s | Δ=0s | Number of graphs after numerator-aware grouping with strategy 'up to a scalar rescaling': 1 (1 isomorphically unique graph, 0 color zero, 0 lorentz zero, 0 grouped and 0 cancellation)
  1311. 224.16 s > [2026-08-28 12:15:32.301] @feyngen::diagram_... INFO : ( Sum of the symmetry factors from each graph generated = 1 )
  1312. 224.16 s > [2026-08-28 12:15:32.301] @commands::generate INFO : Generated amplitude 1 graphs.
  1313. 224.16 s > [2026-08-28 12:15:32.377] @settings::runtime WARNING : No external kinematics were provided; using default-generated external momenta and helicities.
  1314. 224.16 s > [2026-08-28 12:15:32.423] @commands::generate INFO :
  1315. 224.16 s > Integrand generation summary
  1316. 224.16 s > peak RAM 65.12 MiB | cores 1
  1317. 224.16 s > ╭────────────┬───────┬─────────┬────────────┬───────────┬────────────────┬─────────────╮
  1318. 224.16 s > │ integrand │ graph │ # evals │ expr build │ spenso │ symbolica eval │ compile │
  1319. 224.16 s > ├────────────┼───────┼─────────┼────────────┼───────────┼────────────────┼─────────────┤
  1320. 224.16 s > │ scalar_tri │ GL0 │ 9 │ 42ms (60%) │ 7ms (11%) │ 19ms (28%) │ 0ms (0.00%) │
  1321. 224.16 s > ├────────────┼───────┼─────────┼────────────┼───────────┼────────────────┼─────────────┤
  1322. 224.16 s > │ Total │ │ 9 │ 42ms (60%) │ 7ms (11%) │ 19ms (28%) │ 0ms (0.00%) │
  1323. 224.16 s > ╰────────────┴───────┴─────────┴────────────┴───────────┴────────────────┴─────────────╯
  1324. 224.16 s > [2026-08-28 12:15:32.425] @gammaloop_api::se... INFO : Running command generate amp scalar_0 scalar_0 > scalar_0 scalar_0 [{1}] --allowed-vertex-interactions V_3_SCALAR_022 -p box -i scalar_box --select-graphs GL0
  1325. 224.16 s > [2026-08-28 12:15:32.431] @feyngen::diagram_... INFO : 0s | Δ=0s | Starting Feynman graph generation with Symbolica...
  1326. 224.16 s > [2026-08-28 12:15:32.431] @feyngen::diagram_... INFO : 0s | Δ=0s | Number of graphs resulting from Symbolica generation: 3
  1327. 224.16 s > [2026-08-28 12:15:32.434] @feyngen::diagram_... INFO : 0s | Δ=0s | Number of graphs retained after removal of vetoed topologies: 3
  1328. 224.16 s > [2026-08-28 12:15:32.435] @feyngen::diagram_... INFO : 0s | Δ=0s | Number of graphs after vertex info assignment: 3
  1329. 224.16 s > [2026-08-28 12:15:32.435] @feyngen::diagram_... INFO : 0s | Δ=0s | Number of graphs after all complete graphs filters are applied: 3
  1330. 224.16 s > [2026-08-28 12:15:32.435] @feyngen::diagram_... INFO : 0s | Δ=0s | Number of graphs after closed fermion chains analysis: 3
  1331. 224.16 s > [2026-08-28 12:15:32.435] @feyngen::diagram_... INFO : 0s | Δ=0s | Number of graphs after symmetrization of external states: 3
  1332. 224.16 s > [2026-08-28 12:15:32.436] @feyngen::diagram_... INFO : 0s | Δ=0s | Number of graphs after canonization of vertices, edges and flows (graph labels assigned here): 3
  1333. 224.16 s > [2026-08-28 12:15:32.453] @feyngen::diagram_... INFO : 0s | Δ=0s | Number of graphs after numerator-aware grouping with strategy 'up to a scalar rescaling': 1 (1 isomorphically unique graph, 0 color zero, 0 lorentz zero, 0 grouped and 0 cancellation)
  1334. 224.16 s > [2026-08-28 12:15:32.453] @feyngen::diagram_... INFO : ( Sum of the symmetry factors from each graph generated = 1 )
  1335. 224.16 s > [2026-08-28 12:15:32.453] @commands::generate INFO : Generated amplitude 1 graphs.
  1336. 224.16 s > [2026-08-28 12:15:32.596] @settings::runtime WARNING : No external kinematics were provided; using default-generated external momenta and helicities.
  1337. 224.16 s > [2026-08-28 12:15:32.674] @commands::generate INFO :
  1338. 224.16 s > Integrand generation summary
  1339. 224.16 s > peak RAM 68.96 MiB | cores 1
  1340. 224.16 s > ╭────────────┬───────┬─────────┬────────────┬─────────────┬────────────────┬─────────────╮
  1341. 224.16 s > │ integrand │ graph │ # evals │ expr build │ spenso │ symbolica eval │ compile │
  1342. 224.16 s > ├────────────┼───────┼─────────┼────────────┼─────────────┼────────────────┼─────────────┤
  1343. 224.16 s > │ scalar_box │ GL0 │ 13 │ 79ms (57%) │ 13ms (9.9%) │ 45ms (33%) │ 0ms (0.00%) │
  1344. 224.16 s > ├────────────┼───────┼─────────┼────────────┼─────────────┼────────────────┼─────────────┤
  1345. 224.16 s > │ Total │ │ 13 │ 79ms (57%) │ 13ms (9.9%) │ 45ms (33%) │ 0ms (0.00%) │
  1346. 224.16 s > ╰────────────┴───────┴─────────┴────────────┴─────────────┴────────────────┴─────────────╯
  1347. 224.16 s > [2026-08-28 12:15:32.676] @gammaloop_api::se... INFO : Running command generate
  1348. 224.16 s > [2026-08-28 12:15:32.764] @settings::runtime WARNING : No external kinematics were provided; using default-generated external momenta and helicities.
  1349. 224.16 s > [2026-08-28 12:15:32.814] @settings::runtime WARNING : No external kinematics were provided; using default-generated external momenta and helicities.
  1350. 224.16 s > [2026-08-28 12:15:32.887] @commands::generate INFO :
  1351. 224.16 s > Integrand generation summary
  1352. 224.16 s > peak RAM 71.29 MiB | cores 1
  1353. 224.16 s > ╭────────────┬───────┬─────────┬────────────┬─────────────┬────────────────┬─────────────╮
  1354. 224.16 s > │ integrand │ graph │ # evals │ expr build │ spenso │ symbolica eval │ compile │
  1355. 224.16 s > ├────────────┼───────┼─────────┼────────────┼─────────────┼────────────────┼─────────────┤
  1356. 224.16 s > │ scalar_tri │ GL0 │ 9 │ 18ms (65%) │ 2ms (7.7%) │ 7ms (28%) │ 0ms (0.00%) │
  1357. 224.16 s > │ scalar_box │ GL0 │ 13 │ 57ms (55%) │ 10ms (9.8%) │ 37ms (36%) │ 0ms (0.00%) │
  1358. 224.16 s > ├────────────┼───────┼─────────┼────────────┼─────────────┼────────────────┼─────────────┤
  1359. 224.16 s > │ Total │ │ 22 │ 75ms (57%) │ 12ms (9.4%) │ 45ms (34%) │ 0ms (0.00%) │
  1360. 224.16 s > ╰────────────┴───────┴─────────┴────────────┴─────────────┴────────────────┴─────────────╯
  1361. 224.16 s > [2026-08-28 12:15:32.888] @gammaloop_api::se... INFO : Running command set model mass_scalar_2=2.0
  1362. 224.16 s > [2026-08-28 12:15:32.890] @gammaloop_api::se... INFO : Running command set model mass_scalar_1=1.0
  1363. 224.16 s > [2026-08-28 12:15:32.891] @gammaloop_api::se... INFO : Running command set process -p triangle -i scalar_tri string '
  1364. 224.16 s > [kinematics.externals]
  1365. 224.16 s > type = "constant"
  1366. 224.16 s >
  1367. 224.16 s > [kinematics.externals.data]
  1368. 224.16 s > [...]
  1369. 224.16 s > [2026-08-28 12:15:32.893] @gammaloop_api::se... INFO : Running command set process -p box -i scalar_box string '
  1370. 224.16 s > [kinematics.externals]
  1371. 224.16 s > type = "constant"
  1372. 224.16 s >
  1373. 224.16 s > [kinematics.externals.data]
  1374. 224.16 s > [...]
  1375. 224.16 s > [2026-08-28 12:15:32.894] @gammaloop_api::se... INFO : Running command approach -x 1.0000000000000001e-1,2.0000000000000001e-1,2.9999999999999999e-1,4.0000000000000002e-1 --approach-axis 1.0000000000000000e-3,0.0000000000000000e0,0.0000000000000000e0,0.0000000000000000e0 --n-points 1 --n-cores 1 --output-results /build/source/tests/artifacts/scalar_box_invalid_momentum_approach/approach_momentum.json --momentum-space --graph-id 0
  1376. 224.16 s > The application panicked (crashed).
  1377. 224.16 s > Message: There are 2 processes available. Please specify a process.
  1378. 224.16 s > Location: tests/tests/test_runs/approach.rs:332
  1379. 224.16 s >
  1380. 224.16 s > ━━━━━━━━━━━━━━━━━━━━━━━━━━━━━━━━━━ BACKTRACE ━━━━━━━━━━━━━━━━━━━━━━━━━━━━━━━━━━━
  1381. 224.16 s > 1: <color_eyre[51793ea62743adbd]::config::PanicHook>::panic_report<unknown>
  1382. 224.16 s > at <unknown source file>:<unknown line>
  1383. 224.16 s > 2: <color_eyre[51793ea62743adbd]::config::PanicHook>::into_panic_hook::{closure#0}<unknown>
  1384. 224.16 s > at <unknown source file>:<unknown line>
  1385. 224.16 s > 3: std[bcb96dfbba0ab899]::panicking::panic_with_hook<unknown>
  1386. 224.16 s > at <unknown source file>:<unknown line>
  1387. 224.16 s > 4: std[bcb96dfbba0ab899]::panicking::panic_handler::{closure#0}<unknown>
  1388. 224.16 s > at <unknown source file>:<unknown line>
  1389. 224.16 s > 5: std[bcb96dfbba0ab899]::sys::backtrace::__rust_end_short_backtrace::<std[bcb96dfbba0ab899]::panicking::panic_handler::{closure#0}, !><unknown>
  1390. 224.16 s > at <unknown source file>:<unknown line>
  1391. 224.16 s > 6: __rustc[6c289b9f9c454d21]::rust_begin_unwind<unknown>
  1392. 224.16 s > at <unknown source file>:<unknown line>
  1393. 224.16 s > 7: core[940e698046960fd5]::panicking::panic_fmt<unknown>
  1394. 224.16 s > at <unknown source file>:<unknown line>
  1395. 224.16 s > 8: test_runs[3e7a390caee4e338]::approach::approach_momentum_space_reports_incomplete_triplet_cleanly<unknown>
  1396. 224.16 s > at <unknown source file>:<unknown line>
  1397. 224.16 s > 9: <test_runs[3e7a390caee4e338]::approach::approach_momentum_space_reports_incomplete_triplet_cleanly::{closure#0} as core[940e698046960fd5]::ops::function::FnOnce<()>>::call_once<unknown>
  1398. 224.16 s > at <unknown source file>:<unknown line>
  1399. 224.16 s > 10: test[75d6903177b1d7e9]::__rust_begin_short_backtrace::<core[940e698046960fd5]::result::Result<(), alloc[2ea6bcb46fca0c42]::string::String>, fn() -> core[940e698046960fd5]::result::Result<(), alloc[2ea6bcb46fca0c42]::string::String>><unknown>
  1400. 224.16 s > at <unknown source file>:<unknown line>
  1401. 224.16 s > 11: test[75d6903177b1d7e9]::run_test::{closure#0}<unknown>
  1402. 224.16 s > at <unknown source file>:<unknown line>
  1403. 224.16 s > 12: std[bcb96dfbba0ab899]::sys::backtrace::__rust_begin_short_backtrace::<test[75d6903177b1d7e9]::run_test::{closure#1}, ()><unknown>
  1404. 224.16 s > at <unknown source file>:<unknown line>
  1405. 224.16 s > 13: <std[bcb96dfbba0ab899]::thread::lifecycle::spawn_unchecked<test[75d6903177b1d7e9]::run_test::{closure#1}, ()>::{closure#1} as core[940e698046960fd5]::ops::function::FnOnce<()>>::call_once::{shim:vtable#0}<unknown>
  1406. 224.16 s > at <unknown source file>:<unknown line>
  1407. 224.16 s > 14: <std[bcb96dfbba0ab899]::sys::thread::unix::Thread>::new::thread_start<unknown>
  1408. 224.16 s > at <unknown source file>:<unknown line>
  1409. 224.16 s > 15: start_thread<unknown>
  1410. 224.16 s > at <unknown source file>:<unknown line>
  1411. 224.16 s > 16: __clone3<unknown>
  1412. 224.16 s > at <unknown source file>:<unknown line>
  1413. 224.16 s >
  1414. 224.16 s > Run with COLORBT_SHOW_HIDDEN=1 environment variable to disable frame filtering.
  1415. 224.16 s > ... omitted 1 more lines; see full nextest output above
  1416. 224.16 s >
  1417. 224.16 s > 2. gammaloop-integration-tests::test_runs::profile_bulk::dotted_bubble_amp_bulk_profile_passes
  1418. 224.16 s > failure: test failure with exit code 101
  1419. 224.16 s > Error:
  1420. 224.16 s > 0: IR profiling requested arbitrary precision but received a quad-precision result
  1421. 224.16 s >
  1422. 224.16 s > Location:
  1423. 224.16 s > crates/gammalooprs/src/integrands/process/ir.rs:2123
  1424. 224.16 s >
  1425. 224.16 s > ━━━━━━━━━━━━━━━━━━━━━━━━━━━━━━━━━━ BACKTRACE ━━━━━━━━━━━━━━━━━━━━━━━━━━━━━━━━━━━
  1426. 224.16 s > 1: <color_eyre[51793ea62743adbd]::config::EyreHook>::into_eyre_hook::{closure#0}<unknown>
  1427. 224.16 s > at <unknown source file>:<unknown line>
  1428. 224.16 s > 2: eyre[cb2fd339c0c40fca]::capture_handler<unknown>
  1429. 224.17 s > at <unknown source file>:<unknown line>
  1430. 224.17 s > 3: eyre[cb2fd339c0c40fca]::private::format_err<unknown>
  1431. 224.17 s > at <unknown source file>:<unknown line>
  1432. 224.17 s > 4: gammalooprs[d7a7c067ebd19583]::integrands::process::ir::evaluate_profile_momentum_point_arb::<gammalooprs[d7a7c067ebd19583]::integrands::process::amplitude::AmplitudeIntegrand><unknown>
  1433. 224.17 s > at <unknown source file>:<unknown line>
  1434. 224.17 s > 5: <gammalooprs[d7a7c067ebd19583]::integrands::process::amplitude::AmplitudeIntegrand>::test_single_ir_limit_impl<unknown>
  1435. 224.17 s > at <unknown source file>:<unknown line>
  1436. 224.17 s > 6: gammalooprs[d7a7c067ebd19583]::integrands::process::ir::run_ir_profile::<gammalooprs[d7a7c067ebd19583]::integrands::process::amplitude::AmplitudeIntegrand, <gammalooprs[d7a7c067ebd19583]::integrands::process::amplitude::AmplitudeIntegrand>::enumerate_ir_limits, <gammalooprs[d7a7c067ebd19583]::integrands::process::amplitude::AmplitudeIntegrand>::graph_cut_definitions, <gammalooprs[d7a7c067ebd19583]::integrands::process::amplitude::AmplitudeIntegrand>::test_single_ir_limit_impl><unknown>
  1437. 224.17 s > at <unknown source file>:<unknown line>
  1438. 224.17 s > 7: <gammalooprs[d7a7c067ebd19583]::integrands::process::amplitude::AmplitudeIntegrand>::test_ir<unknown>
  1439. 224.17 s > at <unknown source file>:<unknown line>
  1440. 224.17 s > 8: <gammaloop_api[92ae732909e47e14]::commands::profile::Profile>::run<unknown>
  1441. 224.17 s > at <unknown source file>:<unknown line>
  1442. 224.17 s > 9: test_runs[3e7a390caee4e338]::profile_bulk::dotted_bubble_amp_bulk_profile_passes<unknown>
  1443. 224.17 s > at <unknown source file>:<unknown line>
  1444. 224.17 s > 10: <test_runs[3e7a390caee4e338]::profile_bulk::dotted_bubble_amp_bulk_profile_passes::{closure#0} as core[940e698046960fd5]::ops::function::FnOnce<()>>::call_once<unknown>
  1445. 224.17 s > at <unknown source file>:<unknown line>
  1446. 224.17 s > 11: test[75d6903177b1d7e9]::__rust_begin_short_backtrace::<core[940e698046960fd5]::result::Result<(), alloc[2ea6bcb46fca0c42]::string::String>, fn() -> core[940e698046960fd5]::result::Result<(), alloc[2ea6bcb46fca0c42]::string::String>><unknown>
  1447. 224.17 s > at <unknown source file>:<unknown line>
  1448. 224.17 s > 12: test[75d6903177b1d7e9]::run_test::{closure#0}<unknown>
  1449. 224.17 s > at <unknown source file>:<unknown line>
  1450. 224.17 s > 13: std[bcb96dfbba0ab899]::sys::backtrace::__rust_begin_short_backtrace::<test[75d6903177b1d7e9]::run_test::{closure#1}, ()><unknown>
  1451. 224.17 s > at <unknown source file>:<unknown line>
  1452. 224.17 s > 14: <std[bcb96dfbba0ab899]::thread::lifecycle::spawn_unchecked<test[75d6903177b1d7e9]::run_test::{closure#1}, ()>::{closure#1} as core[940e698046960fd5]::ops::function::FnOnce<()>>::call_once::{shim:vtable#0}<unknown>
  1453. 224.17 s > at <unknown source file>:<unknown line>
  1454. 224.17 s > 15: <std[bcb96dfbba0ab899]::sys::thread::unix::Thread>::new::thread_start<unknown>
  1455. 224.17 s > at <unknown source file>:<unknown line>
  1456. 224.17 s > 16: start_thread<unknown>
  1457. 224.17 s > at <unknown source file>:<unknown line>
  1458. 224.17 s > 17: __clone3<unknown>
  1459. 224.17 s > at <unknown source file>:<unknown line>
  1460. 224.17 s >
  1461. 224.17 s > Run with COLORBT_SHOW_HIDDEN=1 environment variable to disable frame filtering.
  1462. 224.17 s > Run with RUST_BACKTRACE=full to include source snippets.
  1463. 224.17 s > Warning: SpanTrace capture is Unsupported.
  1464. 224.17 s > Ensure that you've setup a tracing-error ErrorLayer and the semver versions are compatible
  1465. 224.17 s > system-out
  1466. 224.17 s > running 1 test
  1467. 224.17 s > test profile_bulk::dotted_bubble_amp_bulk_profile_passes ... FAILED
  1468. 224.17 s >
  1469. 224.17 s > failures:
  1470. 224.17 s >
  1471. 224.17 s > failures:
  1472. 224.17 s > profile_bulk::dotted_bubble_amp_bulk_profile_passes
  1473. 224.17 s >
  1474. 224.17 s > test result: FAILED. 0 passed; 1 failed; 0 ignored; 0 measured; 82 filtered out; finished in 0.35s
  1475. 224.17 s > system-err
  1476. 224.17 s > [2026-08-28 12:15:35.183] @gammaloop_api::se... INFO : Running command import model ./assets/models/json/scalars/scalars_2p_3p.json
  1477. 224.17 s > [2026-08-28 12:15:35.183] @import::model INFO : Loading JSON model scalars_2p_3p-default from /build/source/assets/models/json/scalars/scalars_2p_3p
  1478. 224.17 s > [2026-08-28 12:15:35.185] @gammaloop_api::se... INFO : Running command import graphs ./tests/resources/graphs/dotted_bubble_amp.dot
  1479. 224.17 s > [2026-08-28 12:15:35.185] @commands::import INFO : Loading graphs from '/build/source/tests/resources/graphs/dotted_bubble_amp.dot'
  1480. 224.17 s > [2026-08-28 12:15:35.188] @gammaloop_api::se... INFO : Running command generate
  1481. 224.17 s > [2026-08-28 12:15:35.308] @commands::generate INFO :
  1482. 224.17 s > Integrand generation summary
  1483. 224.17 s > peak RAM 62.64 MiB | cores 1
  1484. 224.17 s > ╭───────────┬───────────────────┬─────────┬────────────┬────────────┬────────────────┬─────────────╮
  1485. 224.17 s > │ integrand │ graph │ # evals │ expr build │ spenso │ symbolica eval │ compile │
  1486. 224.17 s > ├───────────┼───────────────────┼─────────┼────────────┼────────────┼────────────────┼─────────────┤
  1487. 224.17 s > │ default │ dotted_bubble_amp │ 8 │ 36ms (69%) │ 1ms (2.5%) │ 14ms (28%) │ 0ms (0.00%) │
  1488. 224.17 s > ├───────────┼───────────────────┼─────────┼────────────┼────────────┼────────────────┼─────────────┤
  1489. 224.17 s > │ Total │ │ 8 │ 36ms (69%) │ 1ms (2.5%) │ 14ms (28%) │ 0ms (0.00%) │
  1490. 224.17 s > ╰───────────┴───────────────────┴─────────┴────────────┴────────────┴────────────────┴─────────────╯
  1491. 224.17 s > [2026-08-28 12:15:35.310] @process::amplitude INFO : Input is above threshold: 1 existing threshold E-surfaces across 1/1 graph groups
  1492. 224.17 s > [2026-08-28 12:15:35.310] @process::amplitude INFO : overlap structure of group 0: [1: [1(1,3)]]
  1493. 224.17 s > Error:
  1494. 224.17 s > 0: IR profiling requested arbitrary precision but received a quad-precision result
  1495. 224.17 s >
  1496. 224.17 s > Location:
  1497. 224.17 s > crates/gammalooprs/src/integrands/process/ir.rs:2123
  1498. 224.17 s >
  1499. 224.17 s > ━━━━━━━━━━━━━━━━━━━━━━━━━━━━━━━━━━ BACKTRACE ━━━━━━━━━━━━━━━━━━━━━━━━━━━━━━━━━━━
  1500. 224.17 s > 1: <color_eyre[51793ea62743adbd]::config::EyreHook>::into_eyre_hook::{closure#0}<unknown>
  1501. 224.17 s > at <unknown source file>:<unknown line>
  1502. 224.17 s > 2: eyre[cb2fd339c0c40fca]::capture_handler<unknown>
  1503. 224.17 s > at <unknown source file>:<unknown line>
  1504. 224.17 s > 3: eyre[cb2fd339c0c40fca]::private::format_err<unknown>
  1505. 224.17 s > at <unknown source file>:<unknown line>
  1506. 224.17 s > 4: gammalooprs[d7a7c067ebd19583]::integrands::process::ir::evaluate_profile_momentum_point_arb::<gammalooprs[d7a7c067ebd19583]::integrands::process::amplitude::AmplitudeIntegrand><unknown>
  1507. 224.17 s > at <unknown source file>:<unknown line>
  1508. 224.17 s > 5: <gammalooprs[d7a7c067ebd19583]::integrands::process::amplitude::AmplitudeIntegrand>::test_single_ir_limit_impl<unknown>
  1509. 224.17 s > at <unknown source file>:<unknown line>
  1510. 224.17 s > 6: gammalooprs[d7a7c067ebd19583]::integrands::process::ir::run_ir_profile::<gammalooprs[d7a7c067ebd19583]::integrands::process::amplitude::AmplitudeIntegrand, <gammalooprs[d7a7c067ebd19583]::integrands::process::amplitude::AmplitudeIntegrand>::enumerate_ir_limits, <gammalooprs[d7a7c067ebd19583]::integrands::process::amplitude::AmplitudeIntegrand>::graph_cut_definitions, <gammalooprs[d7a7c067ebd19583]::integrands::process::amplitude::AmplitudeIntegrand>::test_single_ir_limit_impl><unknown>
  1511. 224.17 s > at <unknown source file>:<unknown line>
  1512. 224.17 s > 7: <gammalooprs[d7a7c067ebd19583]::integrands::process::amplitude::AmplitudeIntegrand>::test_ir<unknown>
  1513. 224.17 s > at <unknown source file>:<unknown line>
  1514. 224.17 s > 8: <gammaloop_api[92ae732909e47e14]::commands::profile::Profile>::run<unknown>
  1515. 224.17 s > at <unknown source file>:<unknown line>
  1516. 224.17 s > 9: test_runs[3e7a390caee4e338]::profile_bulk::dotted_bubble_amp_bulk_profile_passes<unknown>
  1517. 224.17 s > at <unknown source file>:<unknown line>
  1518. 224.17 s > 10: <test_runs[3e7a390caee4e338]::profile_bulk::dotted_bubble_amp_bulk_profile_passes::{closure#0} as core[940e698046960fd5]::ops::function::FnOnce<()>>::call_once<unknown>
  1519. 224.17 s > at <unknown source file>:<unknown line>
  1520. 224.17 s > 11: test[75d6903177b1d7e9]::__rust_begin_short_backtrace::<core[940e698046960fd5]::result::Result<(), alloc[2ea6bcb46fca0c42]::string::String>, fn() -> core[940e698046960fd5]::result::Result<(), alloc[2ea6bcb46fca0c42]::string::String>><unknown>
  1521. 224.17 s > at <unknown source file>:<unknown line>
  1522. 224.17 s > 12: test[75d6903177b1d7e9]::run_test::{closure#0}<unknown>
  1523. 224.17 s > at <unknown source file>:<unknown line>
  1524. 224.17 s > 13: std[bcb96dfbba0ab899]::sys::backtrace::__rust_begin_short_backtrace::<test[75d6903177b1d7e9]::run_test::{closure#1}, ()><unknown>
  1525. 224.17 s > at <unknown source file>:<unknown line>
  1526. 224.17 s > 14: <std[bcb96dfbba0ab899]::thread::lifecycle::spawn_unchecked<test[75d6903177b1d7e9]::run_test::{closure#1}, ()>::{closure#1} as core[940e698046960fd5]::ops::function::FnOnce<()>>::call_once::{shim:vtable#0}<unknown>
  1527. 224.17 s > at <unknown source file>:<unknown line>
  1528. 224.17 s > 15: <std[bcb96dfbba0ab899]::sys::thread::unix::Thread>::new::thread_start<unknown>
  1529. 224.17 s > at <unknown source file>:<unknown line>
  1530. 224.17 s > 16: start_thread<unknown>
  1531. 224.17 s > at <unknown source file>:<unknown line>
  1532. 224.17 s > 17: __clone3<unknown>
  1533. 224.17 s > at <unknown source file>:<unknown line>
  1534. 224.17 s >
  1535. 224.17 s > Run with COLORBT_SHOW_HIDDEN=1 environment variable to disable frame filtering.
  1536. 224.17 s > Run with RUST_BACKTRACE=full to include source snippets.
  1537. 224.17 s > Warning: SpanTrace capture is Unsupported.
  1538. 224.17 s > Ensure that you've setup a tracing-error ErrorLayer and the semver versions are compatible
  1539. 224.17 s >
  1540. 224.17 s > 3. gammaloop-integration-tests::test_runs::profile_bulk::double_dotted_bubble_amp_bulk_profile_passes
  1541. 224.17 s > failure: test failure with exit code 101
  1542. 224.17 s > Error:
  1543. 224.17 s > 0: IR profiling requested arbitrary precision but received a quad-precision result
  1544. 224.17 s >
  1545. 224.17 s > Location:
  1546. 224.17 s > crates/gammalooprs/src/integrands/process/ir.rs:2123
  1547. 224.17 s >
  1548. 224.17 s > ━━━━━━━━━━━━━━━━━━━━━━━━━━━━━━━━━━ BACKTRACE ━━━━━━━━━━━━━━━━━━━━━━━━━━━━━━━━━━━
  1549. 224.17 s > 1: <color_eyre[51793ea62743adbd]::config::EyreHook>::into_eyre_hook::{closure#0}<unknown>
  1550. 224.17 s > at <unknown source file>:<unknown line>
  1551. 224.17 s > 2: eyre[cb2fd339c0c40fca]::capture_handler<unknown>
  1552. 224.17 s > at <unknown source file>:<unknown line>
  1553. 224.17 s > 3: eyre[cb2fd339c0c40fca]::private::format_err<unknown>
  1554. 224.17 s > at <unknown source file>:<unknown line>
  1555. 224.17 s > 4: gammalooprs[d7a7c067ebd19583]::integrands::process::ir::evaluate_profile_momentum_point_arb::<gammalooprs[d7a7c067ebd19583]::integrands::process::amplitude::AmplitudeIntegrand><unknown>
  1556. 224.17 s > at <unknown source file>:<unknown line>
  1557. 224.17 s > 5: <gammalooprs[d7a7c067ebd19583]::integrands::process::amplitude::AmplitudeIntegrand>::test_single_ir_limit_impl<unknown>
  1558. 224.17 s > at <unknown source file>:<unknown line>
  1559. 224.17 s > 6: gammalooprs[d7a7c067ebd19583]::integrands::process::ir::run_ir_profile::<gammalooprs[d7a7c067ebd19583]::integrands::process::amplitude::AmplitudeIntegrand, <gammalooprs[d7a7c067ebd19583]::integrands::process::amplitude::AmplitudeIntegrand>::enumerate_ir_limits, <gammalooprs[d7a7c067ebd19583]::integrands::process::amplitude::AmplitudeIntegrand>::graph_cut_definitions, <gammalooprs[d7a7c067ebd19583]::integrands::process::amplitude::AmplitudeIntegrand>::test_single_ir_limit_impl><unknown>
  1560. 224.17 s > at <unknown source file>:<unknown line>
  1561. 224.17 s > 7: <gammalooprs[d7a7c067ebd19583]::integrands::process::amplitude::AmplitudeIntegrand>::test_ir<unknown>
  1562. 224.17 s > at <unknown source file>:<unknown line>
  1563. 224.17 s > 8: <gammaloop_api[92ae732909e47e14]::commands::profile::Profile>::run<unknown>
  1564. 224.17 s > at <unknown source file>:<unknown line>
  1565. 224.17 s > 9: test_runs[3e7a390caee4e338]::profile_bulk::double_dotted_bubble_amp_bulk_profile_passes<unknown>
  1566. 224.17 s > at <unknown source file>:<unknown line>
  1567. 224.17 s > 10: <test_runs[3e7a390caee4e338]::profile_bulk::double_dotted_bubble_amp_bulk_profile_passes::{closure#0} as core[940e698046960fd5]::ops::function::FnOnce<()>>::call_once<unknown>
  1568. 224.17 s > at <unknown source file>:<unknown line>
  1569. 224.17 s > 11: test[75d6903177b1d7e9]::__rust_begin_short_backtrace::<core[940e698046960fd5]::result::Result<(), alloc[2ea6bcb46fca0c42]::string::String>, fn() -> core[940e698046960fd5]::result::Result<(), alloc[2ea6bcb46fca0c42]::string::String>><unknown>
  1570. 224.17 s > at <unknown source file>:<unknown line>
  1571. 224.17 s > 12: test[75d6903177b1d7e9]::run_test::{closure#0}<unknown>
  1572. 224.17 s > at <unknown source file>:<unknown line>
  1573. 224.17 s > 13: std[bcb96dfbba0ab899]::sys::backtrace::__rust_begin_short_backtrace::<test[75d6903177b1d7e9]::run_test::{closure#1}, ()><unknown>
  1574. 224.17 s > at <unknown source file>:<unknown line>
  1575. 224.17 s > 14: <std[bcb96dfbba0ab899]::thread::lifecycle::spawn_unchecked<test[75d6903177b1d7e9]::run_test::{closure#1}, ()>::{closure#1} as core[940e698046960fd5]::ops::function::FnOnce<()>>::call_once::{shim:vtable#0}<unknown>
  1576. 224.17 s > at <unknown source file>:<unknown line>
  1577. 224.17 s > 15: <std[bcb96dfbba0ab899]::sys::thread::unix::Thread>::new::thread_start<unknown>
  1578. 224.17 s > at <unknown source file>:<unknown line>
  1579. 224.17 s > 16: start_thread<unknown>
  1580. 224.17 s > at <unknown source file>:<unknown line>
  1581. 224.17 s > 17: __clone3<unknown>
  1582. 224.17 s > at <unknown source file>:<unknown line>
  1583. 224.17 s >
  1584. 224.17 s > Run with COLORBT_SHOW_HIDDEN=1 environment variable to disable frame filtering.
  1585. 224.17 s > Run with RUST_BACKTRACE=full to include source snippets.
  1586. 224.17 s > Warning: SpanTrace capture is Unsupported.
  1587. 224.17 s > Ensure that you've setup a tracing-error ErrorLayer and the semver versions are compatible
  1588. 224.17 s > system-out
  1589. 224.17 s > running 1 test
  1590. 224.17 s > test profile_bulk::double_dotted_bubble_amp_bulk_profile_passes ... FAILED
  1591. 224.17 s >
  1592. 224.17 s > failures:
  1593. 224.17 s >
  1594. 224.17 s > failures:
  1595. 224.17 s > profile_bulk::double_dotted_bubble_amp_bulk_profile_passes
  1596. 224.17 s >
  1597. 224.17 s > test result: FAILED. 0 passed; 1 failed; 0 ignored; 0 measured; 82 filtered out; finished in 0.41s
  1598. 224.17 s > system-err
  1599. 224.17 s > [2026-08-28 12:15:35.310] @gammaloop_api::se... INFO : Running command import model ./assets/models/json/scalars/scalars_2p_3p.json
  1600. 224.17 s > [2026-08-28 12:15:35.310] @import::model INFO : Loading JSON model scalars_2p_3p-default from /build/source/assets/models/json/scalars/scalars_2p_3p
  1601. 224.17 s > [2026-08-28 12:15:35.312] @gammaloop_api::se... INFO : Running command import graphs ./tests/resources/graphs/double_dotted_bubble_amp.dot
  1602. 224.17 s > [2026-08-28 12:15:35.312] @commands::import INFO : Loading graphs from '/build/source/tests/resources/graphs/double_dotted_bubble_amp.dot'
  1603. 224.17 s > [2026-08-28 12:15:35.327] @gammaloop_api::se... INFO : Running command generate
  1604. 224.17 s > [2026-08-28 12:15:35.461] @commands::generate INFO :
  1605. 224.17 s > Integrand generation summary
  1606. 224.17 s > peak RAM 66.02 MiB | cores 1
  1607. 224.17 s > ╭───────────┬──────────────────────────┬─────────┬────────────┬────────────┬────────────────┬─────────────╮
  1608. 224.17 s > │ integrand │ graph │ # evals │ expr build │ spenso │ symbolica eval │ compile │
  1609. 224.17 s > ├───────────┼──────────────────────────┼─────────┼────────────┼────────────┼────────────────┼─────────────┤
  1610. 224.17 s > │ default │ double_dotted_bubble_amp │ 11 │ 35ms (68%) │ 2ms (5.5%) │ 13ms (27%) │ 0ms (0.00%) │
  1611. 224.17 s > ├───────────┼──────────────────────────┼─────────┼────────────┼────────────┼────────────────┼─────────────┤
  1612. 224.17 s > │ Total │ │ 11 │ 35ms (68%) │ 2ms (5.5%) │ 13ms (27%) │ 0ms (0.00%) │
  1613. 224.17 s > ╰───────────┴──────────────────────────┴─────────┴────────────┴────────────┴────────────────┴─────────────╯
  1614. 224.17 s > [2026-08-28 12:15:35.463] @process::amplitude INFO : Input is above threshold: 1 existing threshold E-surfaces across 1/1 graph groups
  1615. 224.17 s > [2026-08-28 12:15:35.463] @process::amplitude INFO : overlap structure of group 0: [1: [1(1,4)]]
  1616. 224.17 s > Error:
  1617. 224.17 s > 0: IR profiling requested arbitrary precision but received a quad-precision result
  1618. 224.17 s >
  1619. 224.17 s > Location:
  1620. 224.17 s > crates/gammalooprs/src/integrands/process/ir.rs:2123
  1621. 224.17 s >
  1622. 224.17 s > ━━━━━━━━━━━━━━━━━━━━━━━━━━━━━━━━━━ BACKTRACE ━━━━━━━━━━━━━━━━━━━━━━━━━━━━━━━━━━━
  1623. 224.17 s > 1: <color_eyre[51793ea62743adbd]::config::EyreHook>::into_eyre_hook::{closure#0}<unknown>
  1624. 224.17 s > at <unknown source file>:<unknown line>
  1625. 224.17 s > 2: eyre[cb2fd339c0c40fca]::capture_handler<unknown>
  1626. 224.17 s > at <unknown source file>:<unknown line>
  1627. 224.17 s > 3: eyre[cb2fd339c0c40fca]::private::format_err<unknown>
  1628. 224.17 s > at <unknown source file>:<unknown line>
  1629. 224.17 s > 4: gammalooprs[d7a7c067ebd19583]::integrands::process::ir::evaluate_profile_momentum_point_arb::<gammalooprs[d7a7c067ebd19583]::integrands::process::amplitude::AmplitudeIntegrand><unknown>
  1630. 224.17 s > at <unknown source file>:<unknown line>
  1631. 224.17 s > 5: <gammalooprs[d7a7c067ebd19583]::integrands::process::amplitude::AmplitudeIntegrand>::test_single_ir_limit_impl<unknown>
  1632. 224.17 s > at <unknown source file>:<unknown line>
  1633. 224.17 s > 6: gammalooprs[d7a7c067ebd19583]::integrands::process::ir::run_ir_profile::<gammalooprs[d7a7c067ebd19583]::integrands::process::amplitude::AmplitudeIntegrand, <gammalooprs[d7a7c067ebd19583]::integrands::process::amplitude::AmplitudeIntegrand>::enumerate_ir_limits, <gammalooprs[d7a7c067ebd19583]::integrands::process::amplitude::AmplitudeIntegrand>::graph_cut_definitions, <gammalooprs[d7a7c067ebd19583]::integrands::process::amplitude::AmplitudeIntegrand>::test_single_ir_limit_impl><unknown>
  1634. 224.17 s > at <unknown source file>:<unknown line>
  1635. 224.17 s > 7: <gammalooprs[d7a7c067ebd19583]::integrands::process::amplitude::AmplitudeIntegrand>::test_ir<unknown>
  1636. 224.17 s > at <unknown source file>:<unknown line>
  1637. 224.17 s > 8: <gammaloop_api[92ae732909e47e14]::commands::profile::Profile>::run<unknown>
  1638. 224.17 s > at <unknown source file>:<unknown line>
  1639. 224.17 s > 9: test_runs[3e7a390caee4e338]::profile_bulk::double_dotted_bubble_amp_bulk_profile_passes<unknown>
  1640. 224.17 s > at <unknown source file>:<unknown line>
  1641. 224.17 s > 10: <test_runs[3e7a390caee4e338]::profile_bulk::double_dotted_bubble_amp_bulk_profile_passes::{closure#0} as core[940e698046960fd5]::ops::function::FnOnce<()>>::call_once<unknown>
  1642. 224.17 s > at <unknown source file>:<unknown line>
  1643. 224.17 s > 11: test[75d6903177b1d7e9]::__rust_begin_short_backtrace::<core[940e698046960fd5]::result::Result<(), alloc[2ea6bcb46fca0c42]::string::String>, fn() -> core[940e698046960fd5]::result::Result<(), alloc[2ea6bcb46fca0c42]::string::String>><unknown>
  1644. 224.17 s > at <unknown source file>:<unknown line>
  1645. 224.17 s > 12: test[75d6903177b1d7e9]::run_test::{closure#0}<unknown>
  1646. 224.17 s > at <unknown source file>:<unknown line>
  1647. 224.17 s > 13: std[bcb96dfbba0ab899]::sys::backtrace::__rust_begin_short_backtrace::<test[75d6903177b1d7e9]::run_test::{closure#1}, ()><unknown>
  1648. 224.17 s > at <unknown source file>:<unknown line>
  1649. 224.17 s > 14: <std[bcb96dfbba0ab899]::thread::lifecycle::spawn_unchecked<test[75d6903177b1d7e9]::run_test::{closure#1}, ()>::{closure#1} as core[940e698046960fd5]::ops::function::FnOnce<()>>::call_once::{shim:vtable#0}<unknown>
  1650. 224.17 s > at <unknown source file>:<unknown line>
  1651. 224.17 s > 15: <std[bcb96dfbba0ab899]::sys::thread::unix::Thread>::new::thread_start<unknown>
  1652. 224.17 s > at <unknown source file>:<unknown line>
  1653. 224.17 s > 16: start_thread<unknown>
  1654. 224.17 s > at <unknown source file>:<unknown line>
  1655. 224.17 s > 17: __clone3<unknown>
  1656. 224.17 s > at <unknown source file>:<unknown line>
  1657. 224.17 s >
  1658. 224.17 s > Run with COLORBT_SHOW_HIDDEN=1 environment variable to disable frame filtering.
  1659. 224.17 s > Run with RUST_BACKTRACE=full to include source snippets.
  1660. 224.17 s > Warning: SpanTrace capture is Unsupported.
  1661. 224.17 s > Ensure that you've setup a tracing-error ErrorLayer and the semver versions are compatible
  1662. 224.17 s >
  1663. 224.17 s > 4. gammaloop-integration-tests::test_runs::profile_bulk::massless_triangle_bulk_profile_passes
  1664. 224.17 s > failure: test failure with exit code 101
  1665. 224.17 s > Error:
  1666. 224.17 s > 0: IR profiling requested arbitrary precision but received a quad-precision result
  1667. 224.17 s >
  1668. 224.17 s > Location:
  1669. 224.17 s > crates/gammalooprs/src/integrands/process/ir.rs:2123
  1670. 224.17 s >
  1671. 224.17 s > ━━━━━━━━━━━━━━━━━━━━━━━━━━━━━━━━━━ BACKTRACE ━━━━━━━━━━━━━━━━━━━━━━━━━━━━━━━━━━━
  1672. 224.17 s > 1: <color_eyre[51793ea62743adbd]::config::EyreHook>::into_eyre_hook::{closure#0}<unknown>
  1673. 224.17 s > at <unknown source file>:<unknown line>
  1674. 224.17 s > 2: eyre[cb2fd339c0c40fca]::capture_handler<unknown>
  1675. 224.17 s > at <unknown source file>:<unknown line>
  1676. 224.17 s > 3: eyre[cb2fd339c0c40fca]::private::format_err<unknown>
  1677. 224.17 s > at <unknown source file>:<unknown line>
  1678. 224.17 s > 4: gammalooprs[d7a7c067ebd19583]::integrands::process::ir::evaluate_profile_momentum_point_arb::<gammalooprs[d7a7c067ebd19583]::integrands::process::amplitude::AmplitudeIntegrand><unknown>
  1679. 224.17 s > at <unknown source file>:<unknown line>
  1680. 224.17 s > 5: <gammalooprs[d7a7c067ebd19583]::integrands::process::amplitude::AmplitudeIntegrand>::test_single_ir_limit_impl<unknown>
  1681. 224.17 s > at <unknown source file>:<unknown line>
  1682. 224.17 s > 6: gammalooprs[d7a7c067ebd19583]::integrands::process::ir::run_ir_profile::<gammalooprs[d7a7c067ebd19583]::integrands::process::amplitude::AmplitudeIntegrand, <gammalooprs[d7a7c067ebd19583]::integrands::process::amplitude::AmplitudeIntegrand>::enumerate_ir_limits, <gammalooprs[d7a7c067ebd19583]::integrands::process::amplitude::AmplitudeIntegrand>::graph_cut_definitions, <gammalooprs[d7a7c067ebd19583]::integrands::process::amplitude::AmplitudeIntegrand>::test_single_ir_limit_impl><unknown>
  1683. 224.17 s > at <unknown source file>:<unknown line>
  1684. 224.17 s > 7: <gammalooprs[d7a7c067ebd19583]::integrands::process::amplitude::AmplitudeIntegrand>::test_ir<unknown>
  1685. 224.17 s > at <unknown source file>:<unknown line>
  1686. 224.17 s > 8: <gammaloop_api[92ae732909e47e14]::commands::profile::Profile>::run<unknown>
  1687. 224.17 s > at <unknown source file>:<unknown line>
  1688. 224.17 s > 9: test_runs[3e7a390caee4e338]::profile_bulk::massless_triangle_bulk_profile_passes<unknown>
  1689. 224.17 s > at <unknown source file>:<unknown line>
  1690. 224.17 s > 10: <test_runs[3e7a390caee4e338]::profile_bulk::massless_triangle_bulk_profile_passes::{closure#0} as core[940e698046960fd5]::ops::function::FnOnce<()>>::call_once<unknown>
  1691. 224.17 s > at <unknown source file>:<unknown line>
  1692. 224.17 s > 11: test[75d6903177b1d7e9]::__rust_begin_short_backtrace::<core[940e698046960fd5]::result::Result<(), alloc[2ea6bcb46fca0c42]::string::String>, fn() -> core[940e698046960fd5]::result::Result<(), alloc[2ea6bcb46fca0c42]::string::String>><unknown>
  1693. 224.17 s > at <unknown source file>:<unknown line>
  1694. 224.17 s > 12: test[75d6903177b1d7e9]::run_test::{closure#0}<unknown>
  1695. 224.17 s > at <unknown source file>:<unknown line>
  1696. 224.17 s > 13: std[bcb96dfbba0ab899]::sys::backtrace::__rust_begin_short_backtrace::<test[75d6903177b1d7e9]::run_test::{closure#1}, ()><unknown>
  1697. 224.17 s > at <unknown source file>:<unknown line>
  1698. 224.17 s > 14: <std[bcb96dfbba0ab899]::thread::lifecycle::spawn_unchecked<test[75d6903177b1d7e9]::run_test::{closure#1}, ()>::{closure#1} as core[940e698046960fd5]::ops::function::FnOnce<()>>::call_once::{shim:vtable#0}<unknown>
  1699. 224.17 s > at <unknown source file>:<unknown line>
  1700. 224.17 s > 15: <std[bcb96dfbba0ab899]::sys::thread::unix::Thread>::new::thread_start<unknown>
  1701. 224.17 s > at <unknown source file>:<unknown line>
  1702. 224.17 s > 16: start_thread<unknown>
  1703. 224.17 s > at <unknown source file>:<unknown line>
  1704. 224.17 s > 17: __clone3<unknown>
  1705. 224.17 s > at <unknown source file>:<unknown line>
  1706. 224.17 s >
  1707. 224.17 s > Run with COLORBT_SHOW_HIDDEN=1 environment variable to disable frame filtering.
  1708. 224.17 s > Run with RUST_BACKTRACE=full to include source snippets.
  1709. 224.17 s > Warning: SpanTrace capture is Unsupported.
  1710. 224.17 s > Ensure that you've setup a tracing-error ErrorLayer and the semver versions are compatible
  1711. 224.17 s > system-out
  1712. 224.17 s > running 1 test
  1713. 224.17 s > test profile_bulk::massless_triangle_bulk_profile_passes ... FAILED
  1714. 224.17 s >
  1715. 224.17 s > failures:
  1716. 224.17 s >
  1717. 224.17 s > failures:
  1718. 224.17 s > profile_bulk::massless_triangle_bulk_profile_passes
  1719. 224.17 s >
  1720. 224.17 s > test result: FAILED. 0 passed; 1 failed; 0 ignored; 0 measured; 82 filtered out; finished in 0.49s
  1721. 224.17 s > system-err
  1722. 224.17 s > [2026-08-28 12:15:35.401] @gammaloop_api::se... INFO : Running command import model scalars
  1723. 224.17 s > [2026-08-28 12:15:35.401] @import::model INFO : Loading built-in JSON model scalars-default
  1724. 224.17 s > [2026-08-28 12:15:35.405] @gammalooprs::model INFO : The following 2 external parameters were forced to zero by the restriction card:
  1725. 224.17 s > width_scalar_1, width_scalar_2
  1726. 224.17 s > [2026-08-28 12:15:35.406] @gammaloop_api::se... INFO : Running command import graphs ./tests/resources/graphs/massless_triangle.dot
  1727. 224.17 s > [2026-08-28 12:15:35.406] @commands::import INFO : Loading graphs from '/build/source/tests/resources/graphs/massless_triangle.dot'
  1728. 224.17 s > [2026-08-28 12:15:35.409] @gammaloop_api::se... INFO : Running command generate
  1729. 224.17 s > [2026-08-28 12:15:35.521] @commands::generate INFO :
  1730. 224.17 s > Integrand generation summary
  1731. 224.17 s > peak RAM 65.01 MiB | cores 1
  1732. 224.17 s > ╭───────────┬─────────────────────┬─────────┬────────────┬─────────────┬────────────────┬─────────────╮
  1733. 224.17 s > │ integrand │ graph │ # evals │ expr build │ spenso │ symbolica eval │ compile │
  1734. 224.17 s > ├───────────┼─────────────────────┼─────────┼────────────┼─────────────┼────────────────┼─────────────┤
  1735. 224.17 s > │ default │ massless_triangle_0 │ 9 │ 11ms (60%) │ 1ms (10.0%) │ 5ms (30%) │ 0ms (0.00%) │
  1736. 224.17 s > ├───────────┼─────────────────────┼─────────┼────────────┼─────────────┼────────────────┼─────────────┤
  1737. 224.17 s > │ Total │ │ 9 │ 11ms (60%) │ 1ms (10.0%) │ 5ms (30%) │ 0ms (0.00%) │
  1738. 224.17 s > ╰───────────┴─────────────────────┴─────────┴────────────┴─────────────┴────────────────┴─────────────╯
  1739. 224.17 s > [2026-08-28 12:15:35.524] @process::amplitude INFO : Input is above threshold: 2 existing threshold E-surfaces across 1/1 graph groups
  1740. 224.17 s > [2026-08-28 12:15:35.528] @process::amplitude INFO : overlap structure of group 0: [2: [0(1,5), 1(1,3)]]
  1741. 224.17 s > Error:
  1742. 224.17 s > 0: IR profiling requested arbitrary precision but received a quad-precision result
  1743. 224.17 s >
  1744. 224.17 s > Location:
  1745. 224.17 s > crates/gammalooprs/src/integrands/process/ir.rs:2123
  1746. 224.17 s >
  1747. 224.17 s > ━━━━━━━━━━━━━━━━━━━━━━━━━━━━━━━━━━ BACKTRACE ━━━━━━━━━━━━━━━━━━━━━━━━━━━━━━━━━━━
  1748. 224.17 s > 1: <color_eyre[51793ea62743adbd]::config::EyreHook>::into_eyre_hook::{closure#0}<unknown>
  1749. 224.17 s > at <unknown source file>:<unknown line>
  1750. 224.17 s > 2: eyre[cb2fd339c0c40fca]::capture_handler<unknown>
  1751. 224.17 s > at <unknown source file>:<unknown line>
  1752. 224.17 s > 3: eyre[cb2fd339c0c40fca]::private::format_err<unknown>
  1753. 224.17 s > at <unknown source file>:<unknown line>
  1754. 224.17 s > 4: gammalooprs[d7a7c067ebd19583]::integrands::process::ir::evaluate_profile_momentum_point_arb::<gammalooprs[d7a7c067ebd19583]::integrands::process::amplitude::AmplitudeIntegrand><unknown>
  1755. 224.17 s > at <unknown source file>:<unknown line>
  1756. 224.17 s > 5: <gammalooprs[d7a7c067ebd19583]::integrands::process::amplitude::AmplitudeIntegrand>::test_single_ir_limit_impl<unknown>
  1757. 224.17 s > at <unknown source file>:<unknown line>
  1758. 224.17 s > 6: gammalooprs[d7a7c067ebd19583]::integrands::process::ir::run_ir_profile::<gammalooprs[d7a7c067ebd19583]::integrands::process::amplitude::AmplitudeIntegrand, <gammalooprs[d7a7c067ebd19583]::integrands::process::amplitude::AmplitudeIntegrand>::enumerate_ir_limits, <gammalooprs[d7a7c067ebd19583]::integrands::process::amplitude::AmplitudeIntegrand>::graph_cut_definitions, <gammalooprs[d7a7c067ebd19583]::integrands::process::amplitude::AmplitudeIntegrand>::test_single_ir_limit_impl><unknown>
  1759. 224.17 s > at <unknown source file>:<unknown line>
  1760. 224.17 s > 7: <gammalooprs[d7a7c067ebd19583]::integrands::process::amplitude::AmplitudeIntegrand>::test_ir<unknown>
  1761. 224.17 s > at <unknown source file>:<unknown line>
  1762. 224.17 s > 8: <gammaloop_api[92ae732909e47e14]::commands::profile::Profile>::run<unknown>
  1763. 224.17 s > at <unknown source file>:<unknown line>
  1764. 224.17 s > 9: test_runs[3e7a390caee4e338]::profile_bulk::massless_triangle_bulk_profile_passes<unknown>
  1765. 224.17 s > at <unknown source file>:<unknown line>
  1766. 224.17 s > 10: <test_runs[3e7a390caee4e338]::profile_bulk::massless_triangle_bulk_profile_passes::{closure#0} as core[940e698046960fd5]::ops::function::FnOnce<()>>::call_once<unknown>
  1767. 224.17 s > at <unknown source file>:<unknown line>
  1768. 224.17 s > 11: test[75d6903177b1d7e9]::__rust_begin_short_backtrace::<core[940e698046960fd5]::result::Result<(), alloc[2ea6bcb46fca0c42]::string::String>, fn() -> core[940e698046960fd5]::result::Result<(), alloc[2ea6bcb46fca0c42]::string::String>><unknown>
  1769. 224.17 s > at <unknown source file>:<unknown line>
  1770. 224.17 s > 12: test[75d6903177b1d7e9]::run_test::{closure#0}<unknown>
  1771. 224.17 s > at <unknown source file>:<unknown line>
  1772. 224.17 s > 13: std[bcb96dfbba0ab899]::sys::backtrace::__rust_begin_short_backtrace::<test[75d6903177b1d7e9]::run_test::{closure#1}, ()><unknown>
  1773. 224.17 s > at <unknown source file>:<unknown line>
  1774. 224.17 s > 14: <std[bcb96dfbba0ab899]::thread::lifecycle::spawn_unchecked<test[75d6903177b1d7e9]::run_test::{closure#1}, ()>::{closure#1} as core[940e698046960fd5]::ops::function::FnOnce<()>>::call_once::{shim:vtable#0}<unknown>
  1775. 224.17 s > at <unknown source file>:<unknown line>
  1776. 224.17 s > 15: <std[bcb96dfbba0ab899]::sys::thread::unix::Thread>::new::thread_start<unknown>
  1777. 224.17 s > at <unknown source file>:<unknown line>
  1778. 224.17 s > 16: start_thread<unknown>
  1779. 224.17 s > at <unknown source file>:<unknown line>
  1780. 224.17 s > 17: __clone3<unknown>
  1781. 224.17 s > at <unknown source file>:<unknown line>
  1782. 224.17 s >
  1783. 224.17 s > Run with COLORBT_SHOW_HIDDEN=1 environment variable to disable frame filtering.
  1784. 224.17 s > Run with RUST_BACKTRACE=full to include source snippets.
  1785. 224.17 s > Warning: SpanTrace capture is Unsupported.
  1786. 224.17 s > Ensure that you've setup a tracing-error ErrorLayer and the semver versions are compatible
  1787. 224.17 s >
  1788. 224.17 s > 5. gammaloop-integration-tests::test_runs::profile_bulk::box_4e_bulk_profile_passes
  1789. 224.17 s > failure: test failure with exit code 101
  1790. 224.17 s > Error:
  1791. 224.17 s > 0: IR profiling requested arbitrary precision but received a quad-precision result
  1792. 224.17 s >
  1793. 224.17 s > Location:
  1794. 224.17 s > crates/gammalooprs/src/integrands/process/ir.rs:2123
  1795. 224.17 s >
  1796. 224.17 s > ━━━━━━━━━━━━━━━━━━━━━━━━━━━━━━━━━━ BACKTRACE ━━━━━━━━━━━━━━━━━━━━━━━━━━━━━━━━━━━
  1797. 224.17 s > 1: <color_eyre[51793ea62743adbd]::config::EyreHook>::into_eyre_hook::{closure#0}<unknown>
  1798. 224.17 s > at <unknown source file>:<unknown line>
  1799. 224.17 s > 2: eyre[cb2fd339c0c40fca]::capture_handler<unknown>
  1800. 224.17 s > at <unknown source file>:<unknown line>
  1801. 224.17 s > 3: eyre[cb2fd339c0c40fca]::private::format_err<unknown>
  1802. 224.17 s > at <unknown source file>:<unknown line>
  1803. 224.17 s > 4: gammalooprs[d7a7c067ebd19583]::integrands::process::ir::evaluate_profile_momentum_point_arb::<gammalooprs[d7a7c067ebd19583]::integrands::process::amplitude::AmplitudeIntegrand><unknown>
  1804. 224.17 s > at <unknown source file>:<unknown line>
  1805. 224.17 s > 5: <gammalooprs[d7a7c067ebd19583]::integrands::process::amplitude::AmplitudeIntegrand>::test_single_ir_limit_impl<unknown>
  1806. 224.17 s > at <unknown source file>:<unknown line>
  1807. 224.17 s > 6: gammalooprs[d7a7c067ebd19583]::integrands::process::ir::run_ir_profile::<gammalooprs[d7a7c067ebd19583]::integrands::process::amplitude::AmplitudeIntegrand, <gammalooprs[d7a7c067ebd19583]::integrands::process::amplitude::AmplitudeIntegrand>::enumerate_ir_limits, <gammalooprs[d7a7c067ebd19583]::integrands::process::amplitude::AmplitudeIntegrand>::graph_cut_definitions, <gammalooprs[d7a7c067ebd19583]::integrands::process::amplitude::AmplitudeIntegrand>::test_single_ir_limit_impl><unknown>
  1808. 224.17 s > at <unknown source file>:<unknown line>
  1809. 224.17 s > 7: <gammalooprs[d7a7c067ebd19583]::integrands::process::amplitude::AmplitudeIntegrand>::test_ir<unknown>
  1810. 224.17 s > at <unknown source file>:<unknown line>
  1811. 224.17 s > 8: <gammaloop_api[92ae732909e47e14]::commands::profile::Profile>::run<unknown>
  1812. 224.17 s > at <unknown source file>:<unknown line>
  1813. 224.17 s > 9: test_runs[3e7a390caee4e338]::profile_bulk::box_4e_bulk_profile_passes<unknown>
  1814. 224.17 s > at <unknown source file>:<unknown line>
  1815. 224.17 s > 10: <test_runs[3e7a390caee4e338]::profile_bulk::box_4e_bulk_profile_passes::{closure#0} as core[940e698046960fd5]::ops::function::FnOnce<()>>::call_once<unknown>
  1816. 224.17 s > at <unknown source file>:<unknown line>
  1817. 224.17 s > 11: test[75d6903177b1d7e9]::__rust_begin_short_backtrace::<core[940e698046960fd5]::result::Result<(), alloc[2ea6bcb46fca0c42]::string::String>, fn() -> core[940e698046960fd5]::result::Result<(), alloc[2ea6bcb46fca0c42]::string::String>><unknown>
  1818. 224.17 s > at <unknown source file>:<unknown line>
  1819. 224.17 s > 12: test[75d6903177b1d7e9]::run_test::{closure#0}<unknown>
  1820. 224.17 s > at <unknown source file>:<unknown line>
  1821. 224.17 s > 13: std[bcb96dfbba0ab899]::sys::backtrace::__rust_begin_short_backtrace::<test[75d6903177b1d7e9]::run_test::{closure#1}, ()><unknown>
  1822. 224.17 s > at <unknown source file>:<unknown line>
  1823. 224.17 s > 14: <std[bcb96dfbba0ab899]::thread::lifecycle::spawn_unchecked<test[75d6903177b1d7e9]::run_test::{closure#1}, ()>::{closure#1} as core[940e698046960fd5]::ops::function::FnOnce<()>>::call_once::{shim:vtable#0}<unknown>
  1824. 224.17 s > at <unknown source file>:<unknown line>
  1825. 224.17 s > 15: <std[bcb96dfbba0ab899]::sys::thread::unix::Thread>::new::thread_start<unknown>
  1826. 224.17 s > at <unknown source file>:<unknown line>
  1827. 224.17 s > 16: start_thread<unknown>
  1828. 224.17 s > at <unknown source file>:<unknown line>
  1829. 224.17 s > 17: __clone3<unknown>
  1830. 224.17 s > at <unknown source file>:<unknown line>
  1831. 224.17 s >
  1832. 224.17 s > Run with COLORBT_SHOW_HIDDEN=1 environment variable to disable frame filtering.
  1833. 224.17 s > Run with RUST_BACKTRACE=full to include source snippets.
  1834. 224.17 s > Warning: SpanTrace capture is Unsupported.
  1835. 224.17 s > Ensure that you've setup a tracing-error ErrorLayer and the semver versions are compatible
  1836. 224.17 s > system-out
  1837. 224.17 s > running 1 test
  1838. 224.17 s > test profile_bulk::box_4e_bulk_profile_passes ... FAILED
  1839. 224.17 s >
  1840. 224.17 s > failures:
  1841. 224.17 s >
  1842. 224.17 s > failures:
  1843. 224.17 s > profile_bulk::box_4e_bulk_profile_passes
  1844. 224.17 s >
  1845. 224.17 s > test result: FAILED. 0 passed; 1 failed; 0 ignored; 0 measured; 82 filtered out; finished in 1.05s
  1846. 224.17 s > system-err
  1847. 224.17 s > [2026-08-28 12:15:35.261] @gammaloop_api::se... INFO : Running command import model ./assets/models/json/scalars/scalars.json
  1848. 224.17 s > [2026-08-28 12:15:35.261] @import::model INFO : Loading JSON model scalars-default from /build/source/assets/models/json/scalars/scalars
  1849. 224.17 s > [2026-08-28 12:15:35.266] @gammalooprs::model INFO : The following 2 external parameters were forced to zero by the restriction card:
  1850. 224.17 s > width_scalar_1, width_scalar_2
  1851. 224.17 s > [2026-08-28 12:15:35.266] @gammaloop_api::se... INFO : Running command import graphs ./tests/resources/graphs/massless_box.dot
  1852. 224.17 s > [2026-08-28 12:15:35.266] @commands::import INFO : Loading graphs from '/build/source/tests/resources/graphs/massless_box.dot'
  1853. 224.17 s > [2026-08-28 12:15:35.271] @gammaloop_api::se... INFO : Running command generate
  1854. 224.17 s > [2026-08-28 12:15:35.705] @commands::generate INFO :
  1855. 224.17 s > Integrand generation summary
  1856. 224.17 s > peak RAM 66.36 MiB | cores 1
  1857. 224.17 s > ╭───────────┬────────────────┬─────────┬─────────────┬─────────────┬────────────────┬─────────────╮
  1858. 224.17 s > │ integrand │ graph │ # evals │ expr build │ spenso │ symbolica eval │ compile │
  1859. 224.17 s > ├───────────┼────────────────┼─────────┼─────────────┼─────────────┼────────────────┼─────────────┤
  1860. 224.17 s > │ default │ massless_box_0 │ 14 │ 347ms (85%) │ 33ms (8.2%) │ 27ms (6.8%) │ 0ms (0.00%) │
  1861. 224.17 s > ├───────────┼────────────────┼─────────┼─────────────┼─────────────┼────────────────┼─────────────┤
  1862. 224.17 s > │ Total │ │ 14 │ 347ms (85%) │ 33ms (8.2%) │ 27ms (6.8%) │ 0ms (0.00%) │
  1863. 224.17 s > ╰───────────┴────────────────┴─────────┴─────────────┴─────────────┴────────────────┴─────────────╯
  1864. 224.17 s > [2026-08-28 12:15:35.708] @process::amplitude INFO : Input is above threshold: 4 existing threshold E-surfaces across 1/1 graph groups
  1865. 224.17 s > [2026-08-28 12:15:35.709] @process::amplitude INFO : overlap structure of group 0: [2: [4(3,4), 8(4,6)], 2: [8(4,6), 11(5,6)], 2: [4(3,4), 9(3,5)], 2: [9(3,5), 11(5,6)]]
  1866. 224.17 s > Error:
  1867. 224.17 s > 0: IR profiling requested arbitrary precision but received a quad-precision result
  1868. 224.17 s >
  1869. 224.17 s > Location:
  1870. 224.17 s > crates/gammalooprs/src/integrands/process/ir.rs:2123
  1871. 224.17 s >
  1872. 224.17 s > ━━━━━━━━━━━━━━━━━━━━━━━━━━━━━━━━━━ BACKTRACE ━━━━━━━━━━━━━━━━━━━━━━━━━━━━━━━━━━━
  1873. 224.17 s > 1: <color_eyre[51793ea62743adbd]::config::EyreHook>::into_eyre_hook::{closure#0}<unknown>
  1874. 224.17 s > at <unknown source file>:<unknown line>
  1875. 224.17 s > 2: eyre[cb2fd339c0c40fca]::capture_handler<unknown>
  1876. 224.17 s > at <unknown source file>:<unknown line>
  1877. 224.17 s > 3: eyre[cb2fd339c0c40fca]::private::format_err<unknown>
  1878. 224.17 s > at <unknown source file>:<unknown line>
  1879. 224.17 s > 4: gammalooprs[d7a7c067ebd19583]::integrands::process::ir::evaluate_profile_momentum_point_arb::<gammalooprs[d7a7c067ebd19583]::integrands::process::amplitude::AmplitudeIntegrand><unknown>
  1880. 224.17 s > at <unknown source file>:<unknown line>
  1881. 224.17 s > 5: <gammalooprs[d7a7c067ebd19583]::integrands::process::amplitude::AmplitudeIntegrand>::test_single_ir_limit_impl<unknown>
  1882. 224.17 s > at <unknown source file>:<unknown line>
  1883. 224.17 s > 6: gammalooprs[d7a7c067ebd19583]::integrands::process::ir::run_ir_profile::<gammalooprs[d7a7c067ebd19583]::integrands::process::amplitude::AmplitudeIntegrand, <gammalooprs[d7a7c067ebd19583]::integrands::process::amplitude::AmplitudeIntegrand>::enumerate_ir_limits, <gammalooprs[d7a7c067ebd19583]::integrands::process::amplitude::AmplitudeIntegrand>::graph_cut_definitions, <gammalooprs[d7a7c067ebd19583]::integrands::process::amplitude::AmplitudeIntegrand>::test_single_ir_limit_impl><unknown>
  1884. 224.17 s > at <unknown source file>:<unknown line>
  1885. 224.17 s > 7: <gammalooprs[d7a7c067ebd19583]::integrands::process::amplitude::AmplitudeIntegrand>::test_ir<unknown>
  1886. 224.17 s > at <unknown source file>:<unknown line>
  1887. 224.17 s > 8: <gammaloop_api[92ae732909e47e14]::commands::profile::Profile>::run<unknown>
  1888. 224.17 s > at <unknown source file>:<unknown line>
  1889. 224.17 s > 9: test_runs[3e7a390caee4e338]::profile_bulk::box_4e_bulk_profile_passes<unknown>
  1890. 224.17 s > at <unknown source file>:<unknown line>
  1891. 224.17 s > 10: <test_runs[3e7a390caee4e338]::profile_bulk::box_4e_bulk_profile_passes::{closure#0} as core[940e698046960fd5]::ops::function::FnOnce<()>>::call_once<unknown>
  1892. 224.17 s > at <unknown source file>:<unknown line>
  1893. 224.17 s > 11: test[75d6903177b1d7e9]::__rust_begin_short_backtrace::<core[940e698046960fd5]::result::Result<(), alloc[2ea6bcb46fca0c42]::string::String>, fn() -> core[940e698046960fd5]::result::Result<(), alloc[2ea6bcb46fca0c42]::string::String>><unknown>
  1894. 224.17 s > at <unknown source file>:<unknown line>
  1895. 224.17 s > 12: test[75d6903177b1d7e9]::run_test::{closure#0}<unknown>
  1896. 224.17 s > at <unknown source file>:<unknown line>
  1897. 224.17 s > 13: std[bcb96dfbba0ab899]::sys::backtrace::__rust_begin_short_backtrace::<test[75d6903177b1d7e9]::run_test::{closure#1}, ()><unknown>
  1898. 224.17 s > at <unknown source file>:<unknown line>
  1899. 224.17 s > 14: <std[bcb96dfbba0ab899]::thread::lifecycle::spawn_unchecked<test[75d6903177b1d7e9]::run_test::{closure#1}, ()>::{closure#1} as core[940e698046960fd5]::ops::function::FnOnce<()>>::call_once::{shim:vtable#0}<unknown>
  1900. 224.17 s > at <unknown source file>:<unknown line>
  1901. 224.17 s > 15: <std[bcb96dfbba0ab899]::sys::thread::unix::Thread>::new::thread_start<unknown>
  1902. 224.17 s > at <unknown source file>:<unknown line>
  1903. 224.17 s > 16: start_thread<unknown>
  1904. 224.17 s > at <unknown source file>:<unknown line>
  1905. 224.17 s > 17: __clone3<unknown>
  1906. 224.17 s > at <unknown source file>:<unknown line>
  1907. 224.17 s >
  1908. 224.17 s > Run with COLORBT_SHOW_HIDDEN=1 environment variable to disable frame filtering.
  1909. 224.17 s > Run with RUST_BACKTRACE=full to include source snippets.
  1910. 224.17 s > Warning: SpanTrace capture is Unsupported.
  1911. 224.17 s > Ensure that you've setup a tracing-error ErrorLayer and the semver versions are compatible
  1912. 224.17 s >
  1913. 224.17 s > 6. gammaloop-integration-tests::test_runs::profile_bulk::scalar_self_energy_amp_bulk_profile_passes
  1914. 224.17 s > failure: test failure with exit code 101
  1915. 224.17 s > Error:
  1916. 224.17 s > 0: IR profiling requested arbitrary precision but received a quad-precision result
  1917. 224.17 s >
  1918. 224.17 s > Location:
  1919. 224.17 s > crates/gammalooprs/src/integrands/process/ir.rs:2123
  1920. 224.17 s >
  1921. 224.17 s > ━━━━━━━━━━━━━━━━━━━━━━━━━━━━━━━━━━ BACKTRACE ━━━━━━━━━━━━━━━━━━━━━━━━━━━━━━━━━━━
  1922. 224.17 s > 1: <color_eyre[51793ea62743adbd]::config::EyreHook>::into_eyre_hook::{closure#0}<unknown>
  1923. 224.17 s > at <unknown source file>:<unknown line>
  1924. 224.17 s > 2: eyre[cb2fd339c0c40fca]::capture_handler<unknown>
  1925. 224.17 s > at <unknown source file>:<unknown line>
  1926. 224.17 s > 3: eyre[cb2fd339c0c40fca]::private::format_err<unknown>
  1927. 224.17 s > at <unknown source file>:<unknown line>
  1928. 224.17 s > 4: gammalooprs[d7a7c067ebd19583]::integrands::process::ir::evaluate_profile_momentum_point_arb::<gammalooprs[d7a7c067ebd19583]::integrands::process::amplitude::AmplitudeIntegrand><unknown>
  1929. 224.17 s > at <unknown source file>:<unknown line>
  1930. 224.17 s > 5: <gammalooprs[d7a7c067ebd19583]::integrands::process::amplitude::AmplitudeIntegrand>::test_single_ir_limit_impl<unknown>
  1931. 224.17 s > at <unknown source file>:<unknown line>
  1932. 224.17 s > 6: gammalooprs[d7a7c067ebd19583]::integrands::process::ir::run_ir_profile::<gammalooprs[d7a7c067ebd19583]::integrands::process::amplitude::AmplitudeIntegrand, <gammalooprs[d7a7c067ebd19583]::integrands::process::amplitude::AmplitudeIntegrand>::enumerate_ir_limits, <gammalooprs[d7a7c067ebd19583]::integrands::process::amplitude::AmplitudeIntegrand>::graph_cut_definitions, <gammalooprs[d7a7c067ebd19583]::integrands::process::amplitude::AmplitudeIntegrand>::test_single_ir_limit_impl><unknown>
  1933. 224.17 s > at <unknown source file>:<unknown line>
  1934. 224.17 s > 7: <gammalooprs[d7a7c067ebd19583]::integrands::process::amplitude::AmplitudeIntegrand>::test_ir<unknown>
  1935. 224.17 s > at <unknown source file>:<unknown line>
  1936. 224.17 s > 8: <gammaloop_api[92ae732909e47e14]::commands::profile::Profile>::run<unknown>
  1937. 224.17 s > at <unknown source file>:<unknown line>
  1938. 224.17 s > 9: test_runs[3e7a390caee4e338]::profile_bulk::scalar_self_energy_amp_bulk_profile_passes<unknown>
  1939. 224.17 s > at <unknown source file>:<unknown line>
  1940. 224.17 s > 10: <test_runs[3e7a390caee4e338]::profile_bulk::scalar_self_energy_amp_bulk_profile_passes::{closure#0} as core[940e698046960fd5]::ops::function::FnOnce<()>>::call_once<unknown>
  1941. 224.17 s > at <unknown source file>:<unknown line>
  1942. 224.17 s > 11: test[75d6903177b1d7e9]::__rust_begin_short_backtrace::<core[940e698046960fd5]::result::Result<(), alloc[2ea6bcb46fca0c42]::string::String>, fn() -> core[940e698046960fd5]::result::Result<(), alloc[2ea6bcb46fca0c42]::string::String>><unknown>
  1943. 224.17 s > at <unknown source file>:<unknown line>
  1944. 224.17 s > 12: test[75d6903177b1d7e9]::run_test::{closure#0}<unknown>
  1945. 224.17 s > at <unknown source file>:<unknown line>
  1946. 224.17 s > 13: std[bcb96dfbba0ab899]::sys::backtrace::__rust_begin_short_backtrace::<test[75d6903177b1d7e9]::run_test::{closure#1}, ()><unknown>
  1947. 224.17 s > at <unknown source file>:<unknown line>
  1948. 224.17 s > 14: <std[bcb96dfbba0ab899]::thread::lifecycle::spawn_unchecked<test[75d6903177b1d7e9]::run_test::{closure#1}, ()>::{closure#1} as core[940e698046960fd5]::ops::function::FnOnce<()>>::call_once::{shim:vtable#0}<unknown>
  1949. 224.17 s > at <unknown source file>:<unknown line>
  1950. 224.17 s > 15: <std[bcb96dfbba0ab899]::sys::thread::unix::Thread>::new::thread_start<unknown>
  1951. 224.17 s > at <unknown source file>:<unknown line>
  1952. 224.17 s > 16: start_thread<unknown>
  1953. 224.17 s > at <unknown source file>:<unknown line>
  1954. 224.17 s > 17: __clone3<unknown>
  1955. 224.17 s > at <unknown source file>:<unknown line>
  1956. 224.17 s >
  1957. 224.17 s > Run with COLORBT_SHOW_HIDDEN=1 environment variable to disable frame filtering.
  1958. 224.17 s > Run with RUST_BACKTRACE=full to include source snippets.
  1959. 224.17 s > Warning: SpanTrace capture is Unsupported.
  1960. 224.17 s > Ensure that you've setup a tracing-error ErrorLayer and the semver versions are compatible
  1961. 224.17 s > system-out
  1962. 224.17 s > running 1 test
  1963. 224.17 s > test profile_bulk::scalar_self_energy_amp_bulk_profile_passes ... FAILED
  1964. 224.17 s >
  1965. 224.17 s > failures:
  1966. 224.17 s >
  1967. 224.17 s > failures:
  1968. 224.17 s > profile_bulk::scalar_self_energy_amp_bulk_profile_passes
  1969. 224.17 s >
  1970. 224.17 s > test result: FAILED. 0 passed; 1 failed; 0 ignored; 0 measured; 82 filtered out; finished in 0.57s
  1971. 224.17 s > system-err
  1972. 224.17 s > [2026-08-28 12:15:35.449] @gammaloop_api::se... INFO : Running command import model ./assets/models/json/scalars/scalars.json
  1973. 224.17 s > [2026-08-28 12:15:35.449] @import::model INFO : Loading JSON model scalars-default from /build/source/assets/models/json/scalars/scalars
  1974. 224.17 s > [2026-08-28 12:15:35.453] @gammalooprs::model INFO : The following 2 external parameters were forced to zero by the restriction card:
  1975. 224.17 s > width_scalar_1, width_scalar_2
  1976. 224.17 s > [2026-08-28 12:15:35.454] @gammaloop_api::se... INFO : Running command import graphs ./tests/resources/graphs/scalar_self_energy_amp.dot
  1977. 224.17 s > [2026-08-28 12:15:35.454] @commands::import INFO : Loading graphs from '/build/source/tests/resources/graphs/scalar_self_energy_amp.dot'
  1978. 224.17 s > [2026-08-28 12:15:35.458] @gammaloop_api::se... INFO : Running command generate
  1979. 224.17 s > [2026-08-28 12:15:35.890] @commands::generate INFO :
  1980. 224.17 s > Integrand generation summary
  1981. 224.17 s > peak RAM 71.05 MiB | cores 1
  1982. 224.17 s > ╭───────────┬────────────────────────┬─────────┬─────────────┬─────────────┬────────────────┬─────────────╮
  1983. 224.17 s > │ integrand │ graph │ # evals │ expr build │ spenso │ symbolica eval │ compile │
  1984. 224.17 s > ├───────────┼────────────────────────┼─────────┼─────────────┼─────────────┼────────────────┼─────────────┤
  1985. 224.17 s > │ default │ scalar_self_energy_amp │ 6 │ 325ms (94%) │ 12ms (3.6%) │ 8ms (2.4%) │ 0ms (0.00%) │
  1986. 224.17 s > ├───────────┼────────────────────────┼─────────┼─────────────┼─────────────┼────────────────┼─────────────┤
  1987. 224.17 s > │ Total │ │ 6 │ 325ms (94%) │ 12ms (3.6%) │ 8ms (2.4%) │ 0ms (0.00%) │
  1988. 224.17 s > ╰───────────┴────────────────────────┴─────────┴─────────────┴─────────────┴────────────────┴─────────────╯
  1989. 224.17 s > [2026-08-28 12:15:35.892] @process::amplitude INFO : Input is above threshold: 2 existing threshold E-surfaces across 1/1 graph groups
  1990. 224.17 s > [2026-08-28 12:15:35.892] @process::amplitude INFO : overlap structure of group 0: [2: [2(1,5), 4(2,3,5)]]
  1991. 224.17 s > Error:
  1992. 224.17 s > 0: IR profiling requested arbitrary precision but received a quad-precision result
  1993. 224.17 s >
  1994. 224.17 s > Location:
  1995. 224.17 s > crates/gammalooprs/src/integrands/process/ir.rs:2123
  1996. 224.17 s >
  1997. 224.17 s > ━━━━━━━━━━━━━━━━━━━━━━━━━━━━━━━━━━ BACKTRACE ━━━━━━━━━━━━━━━━━━━━━━━━━━━━━━━━━━━
  1998. 224.17 s > 1: <color_eyre[51793ea62743adbd]::config::EyreHook>::into_eyre_hook::{closure#0}<unknown>
  1999. 224.17 s > at <unknown source file>:<unknown line>
  2000. 224.17 s > 2: eyre[cb2fd339c0c40fca]::capture_handler<unknown>
  2001. 224.17 s > at <unknown source file>:<unknown line>
  2002. 224.17 s > 3: eyre[cb2fd339c0c40fca]::private::format_err<unknown>
  2003. 224.17 s > at <unknown source file>:<unknown line>
  2004. 224.17 s > 4: gammalooprs[d7a7c067ebd19583]::integrands::process::ir::evaluate_profile_momentum_point_arb::<gammalooprs[d7a7c067ebd19583]::integrands::process::amplitude::AmplitudeIntegrand><unknown>
  2005. 224.17 s > at <unknown source file>:<unknown line>
  2006. 224.17 s > 5: <gammalooprs[d7a7c067ebd19583]::integrands::process::amplitude::AmplitudeIntegrand>::test_single_ir_limit_impl<unknown>
  2007. 224.17 s > at <unknown source file>:<unknown line>
  2008. 224.17 s > 6: gammalooprs[d7a7c067ebd19583]::integrands::process::ir::run_ir_profile::<gammalooprs[d7a7c067ebd19583]::integrands::process::amplitude::AmplitudeIntegrand, <gammalooprs[d7a7c067ebd19583]::integrands::process::amplitude::AmplitudeIntegrand>::enumerate_ir_limits, <gammalooprs[d7a7c067ebd19583]::integrands::process::amplitude::AmplitudeIntegrand>::graph_cut_definitions, <gammalooprs[d7a7c067ebd19583]::integrands::process::amplitude::AmplitudeIntegrand>::test_single_ir_limit_impl><unknown>
  2009. 224.17 s > at <unknown source file>:<unknown line>
  2010. 224.17 s > 7: <gammalooprs[d7a7c067ebd19583]::integrands::process::amplitude::AmplitudeIntegrand>::test_ir<unknown>
  2011. 224.17 s > at <unknown source file>:<unknown line>
  2012. 224.17 s > 8: <gammaloop_api[92ae732909e47e14]::commands::profile::Profile>::run<unknown>
  2013. 224.17 s > at <unknown source file>:<unknown line>
  2014. 224.17 s > 9: test_runs[3e7a390caee4e338]::profile_bulk::scalar_self_energy_amp_bulk_profile_passes<unknown>
  2015. 224.17 s > at <unknown source file>:<unknown line>
  2016. 224.17 s > 10: <test_runs[3e7a390caee4e338]::profile_bulk::scalar_self_energy_amp_bulk_profile_passes::{closure#0} as core[940e698046960fd5]::ops::function::FnOnce<()>>::call_once<unknown>
  2017. 224.17 s > at <unknown source file>:<unknown line>
  2018. 224.17 s > 11: test[75d6903177b1d7e9]::__rust_begin_short_backtrace::<core[940e698046960fd5]::result::Result<(), alloc[2ea6bcb46fca0c42]::string::String>, fn() -> core[940e698046960fd5]::result::Result<(), alloc[2ea6bcb46fca0c42]::string::String>><unknown>
  2019. 224.17 s > at <unknown source file>:<unknown line>
  2020. 224.17 s > 12: test[75d6903177b1d7e9]::run_test::{closure#0}<unknown>
  2021. 224.17 s > at <unknown source file>:<unknown line>
  2022. 224.17 s > 13: std[bcb96dfbba0ab899]::sys::backtrace::__rust_begin_short_backtrace::<test[75d6903177b1d7e9]::run_test::{closure#1}, ()><unknown>
  2023. 224.17 s > at <unknown source file>:<unknown line>
  2024. 224.17 s > 14: <std[bcb96dfbba0ab899]::thread::lifecycle::spawn_unchecked<test[75d6903177b1d7e9]::run_test::{closure#1}, ()>::{closure#1} as core[940e698046960fd5]::ops::function::FnOnce<()>>::call_once::{shim:vtable#0}<unknown>
  2025. 224.17 s > at <unknown source file>:<unknown line>
  2026. 224.17 s > 15: <std[bcb96dfbba0ab899]::sys::thread::unix::Thread>::new::thread_start<unknown>
  2027. 224.17 s > at <unknown source file>:<unknown line>
  2028. 224.17 s > 16: start_thread<unknown>
  2029. 224.17 s > at <unknown source file>:<unknown line>
  2030. 224.17 s > 17: __clone3<unknown>
  2031. 224.17 s > at <unknown source file>:<unknown line>
  2032. 224.17 s >
  2033. 224.17 s > Run with COLORBT_SHOW_HIDDEN=1 environment variable to disable frame filtering.
  2034. 224.17 s > Run with RUST_BACKTRACE=full to include source snippets.
  2035. 224.17 s > Warning: SpanTrace capture is Unsupported.
  2036. 224.17 s > Ensure that you've setup a tracing-error ErrorLayer and the semver versions are compatible
  2037. 224.17 s >
  2038. 224.17 s > 7. gammaloop-integration-tests::uv::dod2_bubble_uv
  2039. 224.17 s > failure: test failure with exit code 101
  2040. 224.17 s > system-out
  2041. 224.17 s > running 1 test
  2042. 224.17 s > test dod2_bubble_uv has been running for over 60 seconds
  2043. 224.17 s > +-------------+-----------------+---------+--------+----------+-----------------------------------------------------------------------------------------------------------------------+-------+
  2044. 224.17 s > | case | check | graph | status | sigma | threshold | error |
  2045. 224.17 s > +-------------+-----------------+---------+--------+----------+-----------------------------------------------------------------------------------------------------------------------+-------+
  2046. 224.17 s > | dod2_bubble | uv_profile | - | FAIL | - | - | - |
  2047. 224.17 s > +-------------+-----------------+---------+--------+----------+-----------------------------------------------------------------------------------------------------------------------+-------+
  2048. 224.17 s > | dod2_bubble | m_uv.inspect | inspect | pass | - | best inspect relative delta 1.000e0 >= 1000*accuracy 1.000e-7 (accuracy=1.000e-10, exponent=+8.0, seed=0, probes=10) | - |
  2049. 224.17 s > +-------------+-----------------+---------+--------+----------+-----------------------------------------------------------------------------------------------------------------------+-------+
  2050. 224.17 s > | dod2_bubble | m_uv.integrated | GL0 | pass | 0.0sigma | compatible within 2sigma | - |
  2051. 224.17 s > +-------------+-----------------+---------+--------+----------+-----------------------------------------------------------------------------------------------------------------------+-------+
  2052. 224.17 s > | dod2_bubble | rls.inspect | inspect | pass | - | best inspect relative delta 2.822e-3 >= 1000*accuracy 1.000e-7 (accuracy=1.000e-10, exponent=+2.0, seed=1, probes=10) | - |
  2053. 224.17 s > +-------------+-----------------+---------+--------+----------+-----------------------------------------------------------------------------------------------------------------------+-------+
  2054. 224.17 s > | dod2_bubble | rls.integrated | GL0 | pass | 0.0sigma | compatible within 2sigma | - |
  2055. 224.17 s > +-------------+-----------------+---------+--------+----------+-----------------------------------------------------------------------------------------------------------------------+-------+
  2056. 224.17 s > | dod2_bubble | mu_r.inspect | inspect | pass | - | best inspect relative delta 6.951e-1 >= 1000*accuracy 1.000e-7 (accuracy=1.000e-10, exponent=+0.0, seed=0, probes=10) | - |
  2057. 224.17 s > +-------------+-----------------+---------+--------+----------+-----------------------------------------------------------------------------------------------------------------------+-------+
  2058. 224.17 s > | dod2_bubble | target | - | pass | - | 2sigma | - |
  2059. 224.17 s > +-------------+-----------------+---------+--------+----------+-----------------------------------------------------------------------------------------------------------------------+-------+
  2060. 224.17 s > test dod2_bubble_uv ... FAILED
  2061. 224.17 s >
  2062. 224.17 s > failures:
  2063. 224.17 s >
  2064. 224.17 s > failures:
  2065. 224.17 s > dod2_bubble_uv
  2066. 224.17 s >
  2067. 224.17 s > test result: FAILED. 0 passed; 1 failed; 0 ignored; 0 measured; 24 filtered out; finished in 68.11s
  2068. 224.17 s > system-err
  2069. 224.17 s > [2026-08-28 12:15:38.161] @gammaloop_api::se... INFO : Running command run generate
  2070. 224.17 s > [2026-08-28 12:15:38.161] @gammaloop_api::se... INFO : Starting command block generate
  2071. 224.17 s > [2026-08-28 12:15:38.161] @gammaloop_api::se... INFO : Running command import model scalars-default.json
  2072. 224.17 s > [2026-08-28 12:15:38.161] @import::model INFO : Loading built-in JSON model scalars-default
  2073. 224.17 s > [2026-08-28 12:15:38.165] @gammalooprs::model INFO : The following 2 external parameters were forced to zero by the restriction card:
  2074. 224.17 s > width_scalar_1, width_scalar_2
  2075. 224.17 s > [2026-08-28 12:15:38.165] @gammaloop_api::se... INFO : Running command remove processes
  2076. 224.17 s > [2026-08-28 12:15:38.166] @gammaloop_api::se... INFO : Running command set global kv global.generation.uv.generate_integrated=true
  2077. 224.17 s > [2026-08-28 12:15:38.166] @gammaloop_api::se... INFO : Running command import graphs ./tests/resources/graphs/scalar/dod2_bubble.dot -p bubble_dod2 -i scalar_bubble_below_thres
  2078. 224.17 s > [2026-08-28 12:15:38.166] @commands::import INFO : Loading graphs from '/build/source/tests/resources/graphs/scalar/dod2_bubble.dot'
  2079. 224.17 s > [2026-08-28 12:15:38.169] @gammaloop_api::se... INFO : Running command generate existing -p bubble_dod2 -i scalar_bubble_below_thres
  2080. 224.17 s > [2026-08-28 12:15:38.171] @approx::local_4d [{#uv, #inspect, #integrated}] DEBUG : Rescaled momenta expanded
  2081. 224.17 s > field value
  2082. 224.17 s > res n-terms: 1, byte size: 585,expr:
  2083. 224.17 s > -SCALAR_COUPLING²·q₀(αᵉ².¹)·q₀(αᵉ³.¹)·q₂(αᵉ².¹)·q₂(αᵉ³.¹)
  2084. 224.17 s > /(t²·denom(3,-q₀-q₂/t,mass_scalar_2²,-mass_scalar_2²+2·(q₀.q₂)/t+(q₂.q₂)/t²+(q₀.q₀))
  2085. 224.17 s > ·denom(2,q₂/t,mass_scalar_2²,-mass_scalar_2²+(q₂.q₂)/t²))
  2086. 224.17 s > [2026-08-28 12:15:38.177] @approx::local_4d [{#uv, #inspect, #integrated}] DEBUG : Rescaled momenta expanded
  2087. 224.17 s > field value
  2088. 224.17 s > res n-terms: 1, byte size: 3,expr:
  2089. 224.17 s > 1
  2090. 224.17 s > [2026-08-28 12:15:38.178] @approx::final_integrand[{#generation, #profile, #uv, #graph, #summary}] DEBUG : Computed global numerator
  2091. 224.17 s > field value
  2092. 224.17 s > global_num n-terms: 1, byte size: 4,expr:
  2093. 224.17 s > 1/2
  2094. 224.17 s > span build_3d{span_context=true graph=GL0 current=subgraph=0, topo_order=0, dod=0}
  2095. 224.17 s > [2026-08-28 12:15:38.184] @uv::approx [{#generation, #uv, #fourd}] DEBUG : Computing 4D
  2096. 224.17 s > field value
  2097. 224.17 s > simple subgraph(S_11,S_y)*Approx(subgraph(S_y,0)) of GL0
  2098. 224.17 s > span compute_4d{span_context=true graph=GL0 current=subgraph=y, topo_order=1, dod=2 given=subgraph=0, topo_order=0, dod=0 reduced=SubSet { set: BitVec<usize, bitvec::order::Lsb0> { addr: 0x7fffec015670, head: 000000, bits: 6, capacity: 64 } [0, 0, 1, 1, 1, 1], id: PhantomData<linnet::half_edge::involution::Hedge> }}
  2099. 224.17 s > [2026-08-28 12:15:38.188] @approx::local_4d [{#uv, #algebra, #integrated, #start}] DEBUG :
  2100. 224.17 s > field value
  2101. 224.17 s > integrand n-terms: 1, byte size: 409,expr:
  2102. 224.17 s > SCALAR_COUPLING²·(q₀(αᵉ³.¹)+q₃(αᵉ³.¹))·q₀(αᵉ².¹)·q₀(αᵉ³.¹)·q₂(αᵉ².¹)
  2103. 224.17 s > /(denom(2,q₂,mass_scalar_2²,-mass_scalar_2²+(q₂.q₂))·denom(3,q₃,mass_scalar_2²,-mass_scalar_2²+(q₃.q₃)))
  2104. 224.17 s > reduced y
  2105. 224.17 s > span grow{span_context=true current=subgraph=y, topo_order=1, dod=2 given=subgraph=0, topo_order=0, dod=0}
  2106. 224.17 s > [2026-08-28 12:15:38.188] @approx::local_4d [{#uv, #inspect, #integrated}] DEBUG : Rescaled momenta expanded
  2107. 224.17 s > field value
  2108. 224.17 s > res n-terms: 1, byte size: 585,expr:
  2109. 224.17 s > -SCALAR_COUPLING²·q₀(αᵉ².¹)·q₀(αᵉ³.¹)·q₂(αᵉ².¹)·q₂(αᵉ³.¹)
  2110. 224.17 s > /(t²·denom(3,-q₀-q₂/t,mass_scalar_2²,-mass_scalar_2²+2·(q₀.q₂)/t+(q₂.q₂)/t²+(q₀.q₀))
  2111. 224.17 s > ·denom(2,q₂/t,mass_scalar_2²,-mass_scalar_2²+(q₂.q₂)/t²))
  2112. 224.17 s > span t{span_context=true current=subgraph=y, topo_order=1, dod=2 given=subgraph=0, topo_order=0, dod=0}
  2113. 224.17 s > [2026-08-28 12:15:38.189] @approx::local_4d [{#uv, #integrated, #rescaled}] DEBUG : Rescaled expanded
  2114. 224.17 s > field value
  2115. 224.17 s > n_loops 1
  2116. 224.17 s > res n-terms: 1, byte size: 707,expr:
  2117. 224.17 s > -SCALAR_COUPLING²·q₀(αᵉ².¹)·q₀(αᵉ³.¹)·q₂(αᵉ².¹)·q₂(αᵉ³.¹)
  2118. 224.17 s > /(t²·denom(3,-q₂,mUVexp²+t²·mass_scalar_2²,-mUV²+t²·(-mass_scalar_2²+2·(q₀.q₂)/t+(q₂.q₂)/t²+(q₀.q₀))+t²·mUVexp²)
  2119. 224.17 s > ·denom(2,q₂,mUVexp²+t²·mass_scalar_2²,-mUV²+t²·(-mass_scalar_2²+(q₂.q₂)/t²)+t²·mUVexp²))
  2120. 224.17 s > span t{span_context=true current=subgraph=y, topo_order=1, dod=2 given=subgraph=0, topo_order=0, dod=0}
  2121. 224.17 s > [2026-08-28 12:15:38.190] @approx::local_4d [{#uv, #integrated, #series}] DEBUG : Series expanded
  2122. 224.17 s > field value
  2123. 224.17 s > res n-terms: 3, byte size: 1896,expr:
  2124. 224.17 s > (1/2·SCALAR_COUPLING²·(2·mUVexp²-2·mass_scalar_2²)/(denom(2,q₂,mUVexp²,-mUV²+(q₂.q₂))²·denom(3,-q₂,mUVexp²,-mUV²+(q₂.q₂)))
  2125. 224.17 s > -SCALAR_COUPLING²
  2126. 224.17 s > ·(-1/2·(2·mUVexp²-2·mass_scalar_2²+2·(q₀.q₀))/denom(3,-q₂,mUVexp²,-mUV²+(q₂.q₂))
  2127. 224.17 s > +4·(q₀.q₂)²/denom(3,-q₂,mUVexp²,-mUV²+(q₂.q₂))²
  2128. 224.17 s > )/(denom(2,q₂,mUVexp²,-mUV²+(q₂.q₂))·denom(3,-q₂,mUVexp²,-mUV²+(q₂.q₂)))
  2129. 224.17 s > )·q₀(αᵉ².¹)·q₀(αᵉ³.¹)·q₂(αᵉ².¹)·q₂(αᵉ³.¹)
  2130. 224.17 s > +2·SCALAR_COUPLING²·(q₀.q₂)·q₀(αᵉ².¹)·q₀(αᵉ³.¹)·q₂(αᵉ².¹)·q₂(αᵉ³.¹)
  2131. 224.17 s > /(t·denom(2,q₂,mUVexp²,-mUV²+(q₂.q₂))·denom(3,-q₂,mUVexp²,-mUV²+(q₂.q₂))²)
  2132. 224.17 s > -SCALAR_COUPLING²·q₀(αᵉ².¹)·q₀(αᵉ³.¹)·q₂(αᵉ².¹)·q₂(αᵉ³.¹)
  2133. 224.17 s > /(t²·denom(2,q₂,mUVexp²,-mUV²+(q₂.q₂))·denom(3,-q₂,mUVexp²,-mUV²+(q₂.q₂)))
  2134. 224.17 s > span t{span_context=true current=subgraph=y, topo_order=1, dod=2 given=subgraph=0, topo_order=0, dod=0}
  2135. 224.17 s > [2026-08-28 12:15:38.191] @approx::local_4d [{#uv, #integrated, #series}] DEBUG : Evaluated at t = 1
  2136. 224.17 s > field value
  2137. 224.17 s > res n-terms: 3, byte size: 1880,expr:
  2138. 224.17 s > (1/2·SCALAR_COUPLING²·(2·mUVexp²-2·mass_scalar_2²)/(denom(2,q₂,mUVexp²,-mUV²+(q₂.q₂))²·denom(3,-q₂,mUVexp²,-mUV²+(q₂.q₂)))
  2139. 224.17 s > -SCALAR_COUPLING²
  2140. 224.17 s > ·(-1/2·(2·mUVexp²-2·mass_scalar_2²+2·(q₀.q₀))/denom(3,-q₂,mUVexp²,-mUV²+(q₂.q₂))
  2141. 224.17 s > +4·(q₀.q₂)²/denom(3,-q₂,mUVexp²,-mUV²+(q₂.q₂))²
  2142. 224.17 s > )/(denom(2,q₂,mUVexp²,-mUV²+(q₂.q₂))·denom(3,-q₂,mUVexp²,-mUV²+(q₂.q₂)))
  2143. 224.17 s > )·q₀(αᵉ².¹)·q₀(αᵉ³.¹)·q₂(αᵉ².¹)·q₂(αᵉ³.¹)
  2144. 224.17 s > -SCALAR_COUPLING²·q₀(αᵉ².¹)·q₀(αᵉ³.¹)·q₂(αᵉ².¹)·q₂(αᵉ³.¹)
  2145. 224.17 s > /(denom(2,q₂,mUVexp²,-mUV²+(q₂.q₂))·denom(3,-q₂,mUVexp²,-mUV²+(q₂.q₂)))
  2146. 224.17 s > +2·SCALAR_COUPLING²·(q₀.q₂)·q₀(αᵉ².¹)·q₀(αᵉ³.¹)·q₂(αᵉ².¹)·q₂(αᵉ³.¹)
  2147. 224.17 s > /(denom(2,q₂,mUVexp²,-mUV²+(q₂.q₂))·denom(3,-q₂,mUVexp²,-mUV²+(q₂.q₂))²)
  2148. 224.17 s > span t{span_context=true current=subgraph=y, topo_order=1, dod=2 given=subgraph=0, topo_order=0, dod=0}
  2149. 224.17 s > [2026-08-28 12:15:38.193] @approx::local_4d [{#uv, #collect, #integrated}] DEBUG : After gamma chain collection
  2150. 224.17 s > field value
  2151. 224.17 s > expr n-terms: 3, byte size: 1880,expr:
  2152. 224.17 s > (1/2·SCALAR_COUPLING²·(2·mUVexp²-2·mass_scalar_2²)/(denom(2,q₂,mUVexp²,-mUV²+(q₂.q₂))²·denom(3,-q₂,mUVexp²,-mUV²+(q₂.q₂)))
  2153. 224.17 s > -SCALAR_COUPLING²
  2154. 224.17 s > ·(-1/2·(2·mUVexp²-2·mass_scalar_2²+2·(q₀.q₀))/denom(3,-q₂,mUVexp²,-mUV²+(q₂.q₂))
  2155. 224.17 s > +4·(q₀.q₂)²/denom(3,-q₂,mUVexp²,-mUV²+(q₂.q₂))²
  2156. 224.17 s > )/(denom(2,q₂,mUVexp²,-mUV²+(q₂.q₂))·denom(3,-q₂,mUVexp²,-mUV²+(q₂.q₂)))
  2157. 224.17 s > )·q₀(αᵉ².¹)·q₀(αᵉ³.¹)·q₂(αᵉ².¹)·q₂(αᵉ³.¹)
  2158. 224.17 s > -SCALAR_COUPLING²·q₀(αᵉ².¹)·q₀(αᵉ³.¹)·q₂(αᵉ².¹)·q₂(αᵉ³.¹)
  2159. 224.17 s > /(denom(2,q₂,mUVexp²,-mUV²+(q₂.q₂))·denom(3,-q₂,mUVexp²,-mUV²+(q₂.q₂)))
  2160. 224.17 s > +2·SCALAR_COUPLING²·(q₀.q₂)·q₀(αᵉ².¹)·q₀(αᵉ³.¹)·q₂(αᵉ².¹)·q₂(αᵉ³.¹)
  2161. 224.17 s > /(denom(2,q₂,mUVexp²,-mUV²+(q₂.q₂))·denom(3,-q₂,mUVexp²,-mUV²+(q₂.q₂))²)
  2162. 224.17 s > span t{span_context=true current=subgraph=y, topo_order=1, dod=2 given=subgraph=0, topo_order=0, dod=0}
  2163. 224.17 s > [2026-08-28 12:15:38.195] @approx::local_4d [{#profile, #uv, #collect, #integrated, #start, #trace}] DEBUG : After gamma schoonschip
  2164. 224.17 s > field value
  2165. 224.17 s > expr n-terms: 3, byte size: 1631,expr:
  2166. 224.17 s > (1/2·SCALAR_COUPLING²·(2·mUVexp²-2·mass_scalar_2²)/(denom(2,q₂,mUVexp²,-mUV²+(q₂.q₂))²·denom(3,-q₂,mUVexp²,-mUV²+(q₂.q₂)))
  2167. 224.17 s > -SCALAR_COUPLING²
  2168. 224.17 s > ·(-1/2·(2·mUVexp²-2·mass_scalar_2²+2·(q₀.q₀))/denom(3,-q₂,mUVexp²,-mUV²+(q₂.q₂))
  2169. 224.17 s > +4·(q₀.q₂)²/denom(3,-q₂,mUVexp²,-mUV²+(q₂.q₂))²
  2170. 224.17 s > )/(denom(2,q₂,mUVexp²,-mUV²+(q₂.q₂))·denom(3,-q₂,mUVexp²,-mUV²+(q₂.q₂)))
  2171. 224.17 s > )·(q₀.q₂)²
  2172. 224.17 s > -SCALAR_COUPLING²·(q₀.q₂)²/(denom(2,q₂,mUVexp²,-mUV²+(q₂.q₂))·denom(3,-q₂,mUVexp²,-mUV²+(q₂.q₂)))
  2173. 224.17 s > +2·SCALAR_COUPLING²·(q₀.q₂)·(q₀.q₂)²
  2174. 224.17 s > /(denom(2,q₂,mUVexp²,-mUV²+(q₂.q₂))·denom(3,-q₂,mUVexp²,-mUV²+(q₂.q₂))²)
  2175. 224.17 s > span t{span_context=true current=subgraph=y, topo_order=1, dod=2 given=subgraph=0, topo_order=0, dod=0}
  2176. 224.17 s > [2026-08-28 12:15:38.198] @approx::local_4d [{#profile, #uv, #collect, #integrated, #start, #trace}] DEBUG : After gamma collection
  2177. 224.17 s > field value
  2178. 224.17 s > expr n-terms: 1, byte size: 1347,expr:
  2179. 224.17 s > SCALAR_COUPLING²
  2180. 224.17 s > ·(-denom(2,q₂,mUVexp²,-mUV²+(q₂.q₂))·denom(3,-q₂,mUVexp²,-mUV²+(q₂.q₂))²
  2181. 224.17 s > +1/2·(2·mUVexp²-2·mass_scalar_2²)·denom(3,-q₂,mUVexp²,-mUV²+(q₂.q₂))²
  2182. 224.17 s > -(-1/2·(2·mUVexp²-2·mass_scalar_2²+2·(q₀.q₀))·denom(3,-q₂,mUVexp²,-mUV²+(q₂.q₂))+4·(q₀.q₂)²)
  2183. 224.17 s > ·denom(2,q₂,mUVexp²,-mUV²+(q₂.q₂))
  2184. 224.17 s > +2·(q₀.q₂)·denom(2,q₂,mUVexp²,-mUV²+(q₂.q₂))·denom(3,-q₂,mUVexp²,-mUV²+(q₂.q₂))
  2185. 224.17 s > )·(q₀.q₂)²/(denom(2,q₂,mUVexp²,-mUV²+(q₂.q₂))²·denom(3,-q₂,mUVexp²,-mUV²+(q₂.q₂))³)
  2186. 224.17 s > span t{span_context=true current=subgraph=y, topo_order=1, dod=2 given=subgraph=0, topo_order=0, dod=0}
  2187. 224.17 s > [2026-08-28 12:15:38.199] @approx::local_4d [{#profile, #uv, #gamma, #integrated, #start, #trace, #vakint}] DEBUG : After gamma simplification
  2188. 224.17 s > ... omitted 3263 more lines; see full nextest output above
  2189. 224.17 s >
  2190. 224.17 s > 8. gammaloop-integration-tests::uv::sunrise_scalar_1_uv
  2191. 224.17 s > failure: test failure with exit code 101
  2192. 224.17 s > system-out
  2193. 224.17 s > running 1 test
  2194. 224.17 s > test sunrise_scalar_1_uv has been running for over 60 seconds
  2195. 224.17 s > +------------------+------------------------+--------------+--------+----------+----------------------------------------------------------------------------------------------------------------------+-------+
  2196. 224.17 s > | case | check | graph | status | sigma | threshold | error |
  2197. 224.17 s > +------------------+------------------------+--------------+--------+----------+----------------------------------------------------------------------------------------------------------------------+-------+
  2198. 224.17 s > | sunrise_scalar_1 | uv_profile | - | FAIL | - | - | - |
  2199. 224.17 s > +------------------+------------------------+--------------+--------+----------+----------------------------------------------------------------------------------------------------------------------+-------+
  2200. 224.17 s > | sunrise_scalar_1 | m_uv.inspect | inspect | pass | - | best inspect relative delta 1.624e0 >= 1000*accuracy 1.000e-3 (accuracy=1.000e-6, exponent=+1.0, seed=1, probes=10) | - |
  2201. 224.17 s > +------------------+------------------------+--------------+--------+----------+----------------------------------------------------------------------------------------------------------------------+-------+
  2202. 224.17 s > | sunrise_scalar_1 | m_uv.integrated | sunrise | pass | 0.1sigma | compatible within 2sigma | - |
  2203. 224.17 s > +------------------+------------------------+--------------+--------+----------+----------------------------------------------------------------------------------------------------------------------+-------+
  2204. 224.17 s > | sunrise_scalar_1 | rls.inspect | inspect | pass | - | best inspect relative delta 8.682e-1 >= 1000*accuracy 1.000e-3 (accuracy=1.000e-6, exponent=+1.0, seed=1, probes=10) | - |
  2205. 224.17 s > +------------------+------------------------+--------------+--------+----------+----------------------------------------------------------------------------------------------------------------------+-------+
  2206. 224.17 s > | sunrise_scalar_1 | rls.integrated | sunrise | pass | 0.0sigma | compatible within 2sigma | - |
  2207. 224.17 s > +------------------+------------------------+--------------+--------+----------+----------------------------------------------------------------------------------------------------------------------+-------+
  2208. 224.17 s > | sunrise_scalar_1 | mu_r.inspect | inspect | pass | - | best inspect relative delta 1.752e0 >= 1000*accuracy 1.000e-3 (accuracy=1.000e-6, exponent=+1.0, seed=1, probes=10) | - |
  2209. 224.17 s > +------------------+------------------------+--------------+--------+----------+----------------------------------------------------------------------------------------------------------------------+-------+
  2210. 224.17 s > | sunrise_scalar_1 | integrated.relerr | integrated | pass | - | relative error 9.20% <= 10.00% | - |
  2211. 224.17 s > +------------------+------------------------+--------------+--------+----------+----------------------------------------------------------------------------------------------------------------------+-------+
  2212. 224.17 s > | sunrise_scalar_1 | m_uv.integrated.relerr | m_uv-shifted | pass | - | relative error 5.89% <= 10.00% | - |
  2213. 224.17 s > +------------------+------------------------+--------------+--------+----------+----------------------------------------------------------------------------------------------------------------------+-------+
  2214. 224.17 s > | sunrise_scalar_1 | target | - | pass | - | 2sigma | - |
  2215. 224.17 s > +------------------+------------------------+--------------+--------+----------+----------------------------------------------------------------------------------------------------------------------+-------+
  2216. 224.17 s > test sunrise_scalar_1_uv ... FAILED
  2217. 224.17 s >
  2218. 224.17 s > failures:
  2219. 224.17 s >
  2220. 224.17 s > failures:
  2221. 224.17 s > sunrise_scalar_1_uv
  2222. 224.17 s >
  2223. 224.17 s > test result: FAILED. 0 passed; 1 failed; 0 ignored; 0 measured; 24 filtered out; finished in 170.22s
  2224. 224.17 s > system-err
  2225. 224.17 s > [2026-08-28 12:15:45.546] @gammaloop_api::se... INFO : Running command run generate
  2226. 224.17 s > [2026-08-28 12:15:45.546] @gammaloop_api::se... INFO : Starting command block generate
  2227. 224.17 s > [2026-08-28 12:15:45.546] @gammaloop_api::se... INFO : Running command import model scalars-default.json
  2228. 224.17 s > [2026-08-28 12:15:45.546] @import::model INFO : Loading built-in JSON model scalars-default
  2229. 224.17 s > [2026-08-28 12:15:45.553] @gammalooprs::model INFO : The following 2 external parameters were forced to zero by the restriction card:
  2230. 224.17 s > width_scalar_1, width_scalar_2
  2231. 224.17 s > [2026-08-28 12:15:45.554] @gammaloop_api::se... INFO : Running command remove processes
  2232. 224.17 s > [2026-08-28 12:15:45.554] @gammaloop_api::se... INFO : Running command set global kv global.generation.uv.generate_integrated=true
  2233. 224.17 s > [2026-08-28 12:15:45.557] @gammaloop_api::se... INFO : Running command import graphs ./tests/resources/graphs/scalar_sunrise.dot -p sunrise_scalar_1 -i scalar_sunrise
  2234. 224.17 s > [2026-08-28 12:15:45.557] @commands::import INFO : Loading graphs from '/build/source/tests/resources/graphs/scalar_sunrise.dot'
  2235. 224.17 s > [2026-08-28 12:15:45.563] @gammaloop_api::se... INFO : Running command generate existing -p sunrise_scalar_1 -i scalar_sunrise
  2236. 224.17 s > [2026-08-28 12:15:45.629] @approx::local_4d [{#uv, #inspect, #integrated}] DEBUG : Rescaled momenta expanded
  2237. 224.17 s > field value
  2238. 224.17 s > res n-terms: 1, byte size: 611,expr:
  2239. 224.17 s > 1/(denom(1,q₁/t,mass_scalar_1²,-mass_scalar_1²+(q₁.q₁)/t²)
  2240. 224.17 s > ·denom(2,-q₀+q₃-q₁/t,mass_scalar_1²,
  2241. 224.17 s > -mass_scalar_1²+2·(q₀.q₁)/t-2·(q₁.q₃)/t+(q₁.q₁)/t²+(q₀.q₀)
  2242. 224.17 s > -2·(q₀.q₃)+(q₃.q₃)
  2243. 224.17 s > ))
  2244. 224.17 s > [2026-08-28 12:15:45.630] @approx::local_4d [{#uv, #inspect, #integrated}] DEBUG : Rescaled momenta expanded
  2245. 224.17 s > field value
  2246. 224.17 s > res n-terms: 1, byte size: 3,expr:
  2247. 224.17 s > 1
  2248. 224.17 s > [2026-08-28 12:15:45.631] @approx::local_4d [{#uv, #inspect, #integrated}] DEBUG : Rescaled momenta expanded
  2249. 224.17 s > field value
  2250. 224.17 s > res n-terms: 1, byte size: 777,expr:
  2251. 224.17 s > 1/(denom(0,q₀/t,mass_scalar_1²,-mass_scalar_1²+(q₀.q₀)/t²)·denom(1,q₁/t,mass_scalar_1²,-mass_scalar_1²+(q₁.q₁)/t²)
  2252. 224.17 s > ·denom(2,q₄-q₀/t-q₁/t,mass_scalar_1²,
  2253. 224.17 s > -mass_scalar_1²-2·(q₀.q₄)/t-2·(q₁.q₄)/t+(q₀.q₀)/t²+2·(q₀.q₁)/t²
  2254. 224.17 s > +(q₁.q₁)/t²+(q₄.q₄)
  2255. 224.17 s > ))
  2256. 224.17 s > [2026-08-28 12:15:45.637] @approx::local_4d [{#uv, #inspect, #integrated}] DEBUG : Rescaled momenta expanded
  2257. 224.17 s > field value
  2258. 224.17 s > res n-terms: 1, byte size: 611,expr:
  2259. 224.17 s > 1/(denom(0,q₀/t,mass_scalar_1²,-mass_scalar_1²+(q₀.q₀)/t²)
  2260. 224.17 s > ·denom(2,-q₁+q₃-q₀/t,mass_scalar_1²,
  2261. 224.17 s > -mass_scalar_1²+2·(q₀.q₁)/t-2·(q₀.q₃)/t+(q₀.q₀)/t²+(q₁.q₁)
  2262. 224.17 s > -2·(q₁.q₃)+(q₃.q₃)
  2263. 224.17 s > ))
  2264. 224.17 s > [2026-08-28 12:15:45.638] @approx::local_4d [{#uv, #inspect, #integrated}] DEBUG : Rescaled momenta expanded
  2265. 224.17 s > field value
  2266. 224.17 s > res n-terms: 1, byte size: 611,expr:
  2267. 224.17 s > 1/(denom(0,q₀/t,mass_scalar_1²,-mass_scalar_1²+(q₀.q₀)/t²)
  2268. 224.17 s > ·denom(1,-q₂+q₃-q₀/t,mass_scalar_1²,
  2269. 224.17 s > -mass_scalar_1²+2·(q₀.q₂)/t-2·(q₀.q₃)/t+(q₀.q₀)/t²+(q₂.q₂)
  2270. 224.17 s > -2·(q₂.q₃)+(q₃.q₃)
  2271. 224.17 s > ))
  2272. 224.17 s > [2026-08-28 12:15:45.642] @approx::final_integrand[{#generation, #profile, #uv, #graph, #summary}] DEBUG : Computed global numerator
  2273. 224.17 s > field value
  2274. 224.17 s > global_num n-terms: 1, byte size: 3,expr:
  2275. 224.17 s > 1
  2276. 224.17 s > span build_3d{span_context=true graph=sunrise current=subgraph=0, topo_order=0, dod=0}
  2277. 224.17 s > [2026-08-28 12:15:45.643] @uv::approx [{#generation, #uv, #fourd}] DEBUG : Computing 4D
  2278. 224.17 s > field value
  2279. 224.17 s > simple subgraph(S_47,S_3s)*Approx(subgraph(S_3s,0)) of sunrise
  2280. 224.17 s > span compute_4d{span_context=true graph=sunrise current=subgraph=3s, topo_order=1, dod=0 given=subgraph=0, topo_order=0, dod=0 reduced=SubSet { set: BitVec<usize, bitvec::order::Lsb0> { addr: 0x7fffec012da0, head: 000000, bits: 8, capacity: 64 } [0, 0, 0, 0, 1, 1, 1, 1], id: PhantomData<linnet::half_edge::involution::Hedge> }}
  2281. 224.17 s > [2026-08-28 12:15:45.644] @approx::local_4d [{#uv, #algebra, #integrated, #start}] DEBUG :
  2282. 224.17 s > field value
  2283. 224.17 s > integrand n-terms: 1, byte size: 217,expr:
  2284. 224.17 s > 1/(denom(1,q₁,mass_scalar_1²,-mass_scalar_1²+(q₁.q₁))·denom(2,q₂,mass_scalar_1²,-mass_scalar_1²+(q₂.q₂)))
  2285. 224.17 s > reduced 3s
  2286. 224.17 s > span grow{span_context=true current=subgraph=3s, topo_order=1, dod=0 given=subgraph=0, topo_order=0, dod=0}
  2287. 224.17 s > [2026-08-28 12:15:45.647] @approx::local_4d [{#uv, #inspect, #integrated}] DEBUG : Rescaled momenta expanded
  2288. 224.17 s > field value
  2289. 224.17 s > res n-terms: 1, byte size: 611,expr:
  2290. 224.17 s > 1/(denom(1,q₁/t,mass_scalar_1²,-mass_scalar_1²+(q₁.q₁)/t²)
  2291. 224.17 s > ·denom(2,-q₀+q₃-q₁/t,mass_scalar_1²,
  2292. 224.17 s > -mass_scalar_1²+2·(q₀.q₁)/t-2·(q₁.q₃)/t+(q₁.q₁)/t²+(q₀.q₀)
  2293. 224.17 s > -2·(q₀.q₃)+(q₃.q₃)
  2294. 224.17 s > ))
  2295. 224.17 s > span t{span_context=true current=subgraph=3s, topo_order=1, dod=0 given=subgraph=0, topo_order=0, dod=0}
  2296. 224.17 s > [2026-08-28 12:15:45.647] @approx::local_4d [{#uv, #integrated, #rescaled}] DEBUG : Rescaled expanded
  2297. 224.17 s > field value
  2298. 224.17 s > n_loops 1
  2299. 224.17 s > res n-terms: 1, byte size: 723,expr:
  2300. 224.17 s > 1/(denom(1,q₁,mUVexp²+t²·mass_scalar_1²,-mUV²+t²·(-mass_scalar_1²+(q₁.q₁)/t²)+t²·mUVexp²)
  2301. 224.17 s > ·denom(2,-q₁,mUVexp²+t²·mass_scalar_1²,
  2302. 224.17 s > -mUV²
  2303. 224.17 s > +t²
  2304. 224.17 s > ·(-mass_scalar_1²+2·(q₀.q₁)/t-2·(q₁.q₃)/t+(q₁.q₁)/t²+(q₀.q₀)
  2305. 224.17 s > -2·(q₀.q₃)+(q₃.q₃)
  2306. 224.17 s > )
  2307. 224.17 s > +t²·mUVexp²
  2308. 224.17 s > ))
  2309. 224.17 s > span t{span_context=true current=subgraph=3s, topo_order=1, dod=0 given=subgraph=0, topo_order=0, dod=0}
  2310. 224.17 s > [2026-08-28 12:15:45.648] @approx::local_4d [{#uv, #integrated, #series}] DEBUG : Series expanded
  2311. 224.17 s > field value
  2312. 224.17 s > res n-terms: 1, byte size: 223,expr:
  2313. 224.17 s > 1/(denom(1,q₁,mUVexp²,-mUV²+(q₁.q₁))·denom(2,-q₁,mUVexp²,-mUV²+(q₁.q₁)))
  2314. 224.17 s > span t{span_context=true current=subgraph=3s, topo_order=1, dod=0 given=subgraph=0, topo_order=0, dod=0}
  2315. 224.17 s > [2026-08-28 12:15:45.648] @approx::local_4d [{#uv, #integrated, #series}] DEBUG : Evaluated at t = 1
  2316. 224.17 s > field value
  2317. 224.17 s > res n-terms: 1, byte size: 223,expr:
  2318. 224.17 s > 1/(denom(1,q₁,mUVexp²,-mUV²+(q₁.q₁))·denom(2,-q₁,mUVexp²,-mUV²+(q₁.q₁)))
  2319. 224.17 s > span t{span_context=true current=subgraph=3s, topo_order=1, dod=0 given=subgraph=0, topo_order=0, dod=0}
  2320. 224.17 s > [2026-08-28 12:15:45.648] @approx::local_4d [{#uv, #collect, #integrated}] DEBUG : After gamma chain collection
  2321. 224.17 s > field value
  2322. 224.17 s > expr n-terms: 1, byte size: 223,expr:
  2323. 224.17 s > 1/(denom(1,q₁,mUVexp²,-mUV²+(q₁.q₁))·denom(2,-q₁,mUVexp²,-mUV²+(q₁.q₁)))
  2324. 224.17 s > span t{span_context=true current=subgraph=3s, topo_order=1, dod=0 given=subgraph=0, topo_order=0, dod=0}
  2325. 224.17 s > [2026-08-28 12:15:45.648] @approx::local_4d [{#profile, #uv, #collect, #integrated, #start, #trace}] DEBUG : After gamma schoonschip
  2326. 224.17 s > field value
  2327. 224.17 s > expr n-terms: 1, byte size: 223,expr:
  2328. 224.17 s > 1/(denom(1,q₁,mUVexp²,-mUV²+(q₁.q₁))·denom(2,-q₁,mUVexp²,-mUV²+(q₁.q₁)))
  2329. 224.17 s > span t{span_context=true current=subgraph=3s, topo_order=1, dod=0 given=subgraph=0, topo_order=0, dod=0}
  2330. 224.17 s > [2026-08-28 12:15:45.649] @approx::local_4d [{#profile, #uv, #collect, #integrated, #start, #trace}] DEBUG : After gamma collection
  2331. 224.17 s > field value
  2332. 224.17 s > expr n-terms: 1, byte size: 223,expr:
  2333. 224.17 s > 1/(denom(1,q₁,mUVexp²,-mUV²+(q₁.q₁))·denom(2,-q₁,mUVexp²,-mUV²+(q₁.q₁)))
  2334. 224.17 s > span t{span_context=true current=subgraph=3s, topo_order=1, dod=0 given=subgraph=0, topo_order=0, dod=0}
  2335. 224.17 s > [2026-08-28 12:15:45.649] @approx::local_4d [{#profile, #uv, #gamma, #integrated, #start, #trace, #vakint}] DEBUG : After gamma simplification
  2336. 224.17 s > field value
  2337. 224.17 s > expr n-terms: 1, byte size: 223,expr:
  2338. 224.17 s > 1/(denom(1,q₁,mUVexp²,-mUV²+(q₁.q₁))·denom(2,-q₁,mUVexp²,-mUV²+(q₁.q₁)))
  2339. 224.17 s > span t{span_context=true current=subgraph=3s, topo_order=1, dod=0 given=subgraph=0, topo_order=0, dod=0}
  2340. 224.17 s > [2026-08-28 12:15:45.649] @approx::local_4d [{#profile, #uv, #integrated, #schoonschip, #start, #trace, #vakint}] DEBUG : After Schoonschip net
  2341. 224.17 s > field value
  2342. 224.17 s > expr n-terms: 1, byte size: 223,expr:
  2343. 224.17 s > 1/(denom(1,q₁,mUVexp²,-mUV²+(q₁.q₁))·denom(2,-q₁,mUVexp²,-mUV²+(q₁.q₁)))
  2344. 224.17 s > ... omitted 20090 more lines; see full nextest output above
  2345. 224.17 s >
  2346. 224.17 s > 9. gammaloop-integration-tests::uv::se1l_uv
  2347. 224.17 s > failure: test failure with exit code 101
  2348. 224.17 s > system-out
  2349. 224.17 s > running 1 test
  2350. 224.17 s > test se1l_uv has been running for over 60 seconds
  2351. 224.17 s > +------+-----------------+---------+--------+----------+-----------------------------------------------------------------------------------------------------------------------+-------+
  2352. 224.17 s > | case | check | graph | status | sigma | threshold | error |
  2353. 224.17 s > +------+-----------------+---------+--------+----------+-----------------------------------------------------------------------------------------------------------------------+-------+
  2354. 224.17 s > | se1l | uv_profile | - | FAIL | - | - | - |
  2355. 224.17 s > +------+-----------------+---------+--------+----------+-----------------------------------------------------------------------------------------------------------------------+-------+
  2356. 224.17 s > | se1l | m_uv.inspect | inspect | pass | - | best inspect relative delta 1.097e-1 >= 1000*accuracy 1.000e-7 (accuracy=1.000e-10, exponent=+2.0, seed=1, probes=10) | - |
  2357. 224.17 s > +------+-----------------+---------+--------+----------+-----------------------------------------------------------------------------------------------------------------------+-------+
  2358. 224.17 s > | se1l | m_uv.integrated | se1l | pass | 0.1sigma | compatible within 2sigma | - |
  2359. 224.17 s > +------+-----------------+---------+--------+----------+-----------------------------------------------------------------------------------------------------------------------+-------+
  2360. 224.17 s > | se1l | rls.inspect | inspect | pass | - | best inspect relative delta 4.499e-2 >= 1000*accuracy 1.000e-7 (accuracy=1.000e-10, exponent=+2.0, seed=1, probes=10) | - |
  2361. 224.17 s > +------+-----------------+---------+--------+----------+-----------------------------------------------------------------------------------------------------------------------+-------+
  2362. 224.17 s > | se1l | rls.integrated | se1l | pass | 0.0sigma | compatible within 2sigma | - |
  2363. 224.17 s > +------+-----------------+---------+--------+----------+-----------------------------------------------------------------------------------------------------------------------+-------+
  2364. 224.17 s > | se1l | mu_r.inspect | inspect | pass | - | best inspect relative delta 1.424e-1 >= 1000*accuracy 1.000e-7 (accuracy=1.000e-10, exponent=+2.0, seed=1, probes=10) | - |
  2365. 224.17 s > +------+-----------------+---------+--------+----------+-----------------------------------------------------------------------------------------------------------------------+-------+
  2366. 224.17 s > | se1l | target | - | pass | - | 2sigma | - |
  2367. 224.17 s > +------+-----------------+---------+--------+----------+-----------------------------------------------------------------------------------------------------------------------+-------+
  2368. 224.17 s > test se1l_uv ... FAILED
  2369. 224.17 s >
  2370. 224.17 s > failures:
  2371. 224.17 s >
  2372. 224.17 s > failures:
  2373. 224.17 s > se1l_uv
  2374. 224.17 s >
  2375. 224.17 s > test result: FAILED. 0 passed; 1 failed; 0 ignored; 0 measured; 24 filtered out; finished in 181.99s
  2376. 224.17 s > system-err
  2377. 224.17 s > [2026-08-28 12:15:45.001] @gammaloop_api::se... INFO : Running command run generate
  2378. 224.17 s > [2026-08-28 12:15:45.001] @gammaloop_api::se... INFO : Starting command block generate
  2379. 224.17 s > [2026-08-28 12:15:45.001] @gammaloop_api::se... INFO : Running command import model sm-default
  2380. 224.17 s > [2026-08-28 12:15:45.002] @import::model INFO : Loading built-in JSON model sm-default
  2381. 224.17 s > [2026-08-28 12:15:45.035] @gammalooprs::model INFO : The following 11 external parameters were forced to zero by the restriction card:
  2382. 224.17 s > lamWS, AWS, rhoWS, etaWS, ymc, yme, ymm, MC, Me, MM, WTau
  2383. 224.17 s > [2026-08-28 12:15:45.035] @gammalooprs::model INFO : The following 34 vertex rules were removed by the restriction card:
  2384. 224.17 s > V_82 -> (c~, d, G+) | V_83 -> (t~, d, G+) | V_84 -> (c~, s, G+) | V_85 -> (t~, s, G+) | V_86 -> (u~, b, G+) | V_87 -> (c~, b, G+) | V_90 -> (c~, d, W+) | V_91 -> (t~, d, W+) | V_92 -> (u~, s, W+) | V_94 -> (t~, s, W+) | V_95 -> (u~, b, W+) | V_96 -> (c~, b, W+) | V_101 -> (e+, e-, G0) | V_102 -> (mu+, mu-, G0) | V_104 -> (e+, e-, H) | V_105 -> (mu+, mu-, H) | V_110 -> (ve~, e-, G+) | V_111 -> (vm~, mu-, G+) | V_116 -> (b~, u, G-) | V_117 -> (d~, c, G-) | V_118 -> (s~, c, G-) | V_119 -> (b~, c, G-) | V_120 -> (d~, t, G-) | V_121 -> (s~, t, G-) | V_124 -> (s~, u, W-) | V_125 -> (b~, u, W-) | V_126 -> (d~, c, W-) | V_128 -> (b~, c, W-) | V_129 -> (d~, t, W-) | V_130 -> (s~, t, W-) | V_138 -> (c~, c, G0) | V_140 -> (c~, c, H) | V_145 -> (e+, ve, G-) | V_146 -> (mu+, vm, G-)
  2385. 224.17 s > [2026-08-28 12:15:45.035] @gammalooprs::model INFO : The following 36 couplings were removed by the restriction card:
  2386. 224.17 s > GC_13, GC_14, GC_16, GC_17, GC_18, GC_19, GC_20, GC_22, GC_23, GC_24, GC_25, GC_26, GC_28, GC_29, GC_42, GC_43, GC_44, GC_46, GC_47, GC_48, GC_84, GC_85, GC_86, GC_87, GC_88, GC_89, GC_90, GC_91, GC_92, GC_93, GC_101, GC_102, GC_103, GC_105, GC_106, GC_107
  2387. 224.17 s > [2026-08-28 12:15:45.036] @gammaloop_api::se... INFO : Running command remove processes
  2388. 224.17 s > [2026-08-28 12:15:45.036] @gammaloop_api::se... INFO : Running command set global kv global.generation.uv.generate_integrated=true
  2389. 224.17 s > [2026-08-28 12:15:45.037] @gammaloop_api::se... INFO : Running command import graphs ./tests/resources/graphs/uv_tests/se1l.dot -p se1l -i se1l
  2390. 224.17 s > [2026-08-28 12:15:45.037] @commands::import INFO : Loading graphs from '/build/source/tests/resources/graphs/uv_tests/se1l.dot'
  2391. 224.17 s > [2026-08-28 12:15:45.041] @gammaloop_api::se... INFO : Running command generate existing -p se1l -i se1l
  2392. 224.17 s > [2026-08-28 12:15:46.451] @commands::generate INFO :
  2393. 224.17 s > Integrand generation summary
  2394. 224.17 s > peak RAM 89.35 MiB | cores 1
  2395. 224.17 s > ╭───────────┬───────┬─────────┬─────────────┬─────────────┬────────────────┬─────────────╮
  2396. 224.17 s > │ integrand │ graph │ # evals │ expr build │ spenso │ symbolica eval │ compile │
  2397. 224.17 s > ├───────────┼───────┼─────────┼─────────────┼─────────────┼────────────────┼─────────────┤
  2398. 224.17 s > │ se1l │ se1l │ 5 │ 1.17s (87%) │ 72ms (5.3%) │ 100ms (7.5%) │ 0ms (0.00%) │
  2399. 224.17 s > ├───────────┼───────┼─────────┼─────────────┼─────────────┼────────────────┼─────────────┤
  2400. 224.17 s > │ Total │ │ 5 │ 1.17s (87%) │ 72ms (5.3%) │ 100ms (7.5%) │ 0ms (0.00%) │
  2401. 224.17 s > ╰───────────┴───────┴─────────┴─────────────┴─────────────┴────────────────┴─────────────╯
  2402. 224.17 s > [2026-08-28 12:15:46.453] @gammaloop_api::se... INFO : Running command set process -p se1l -i se1l kv general.m_uv=0.2
  2403. 224.17 s > [2026-08-28 12:15:46.454] @gammaloop_api::se... INFO : Running command set process -p se1l -i se1l kv general.mu_r=0.2
  2404. 224.17 s > [2026-08-28 12:15:46.455] @gammaloop_api::se... INFO : Running command set process -p se1l -i se1l kv general.renormalization_localization_scale=0.2
  2405. 224.17 s > [2026-08-28 12:15:46.456] @gammaloop_api::se... INFO : Running command duplicate integrand -p se1l -i se1l --output_process_name se1l --output_integrand_name se1l_muv_shifted
  2406. 224.17 s > [2026-08-28 12:15:46.459] @gammaloop_api::se... INFO : Running command set process -p se1l -i se1l_muv_shifted kv general.m_uv=0.5
  2407. 224.17 s > [2026-08-28 12:15:46.460] @gammaloop_api::se... INFO : Running command duplicate integrand -p se1l -i se1l --output_process_name se1l --output_integrand_name se1l_rls_shifted
  2408. 224.17 s > [2026-08-28 12:15:46.467] @gammaloop_api::se... INFO : Running command set process -p se1l -i se1l_rls_shifted kv general.renormalization_localization_scale=1
  2409. 224.17 s > [2026-08-28 12:15:46.472] @gammaloop_api::se... INFO : Running command duplicate integrand -p se1l -i se1l --output_process_name se1l --output_integrand_name se1l_mur_shifted
  2410. 224.17 s > [2026-08-28 12:15:46.478] @gammaloop_api::se... INFO : Running command set process -p se1l -i se1l_mur_shifted kv general.mu_r=0.8
  2411. 224.17 s > [2026-08-28 12:15:46.496] @process::amplitude WARNING : External state 0 ('g', PDG 21, helicity +) is off shell: p^2 = +2.5e5, expected m^2 = +0e0 (|Δ| = +2.5e5). Fixed-helicity spinor/vector/tensor external states may be ill-defined at this kinematic point.
  2412. 224.17 s > field value
  2413. 224.17 s > span warm_up{integrand.name=se1l}
  2414. 224.17 s > [2026-08-28 12:15:46.497] @process::amplitude WARNING : External state 1 ('g', PDG 21, helicity -) is off shell: p^2 = +2.5e5, expected m^2 = +0e0 (|Δ| = +2.5e5). Fixed-helicity spinor/vector/tensor external states may be ill-defined at this kinematic point.
  2415. 224.17 s > field value
  2416. 224.17 s > span warm_up{integrand.name=se1l}
  2417. 224.17 s > [2026-08-28 12:15:46.497] @process::amplitude INFO : Input is above threshold: 1 existing threshold E-surfaces across 1/1 graph groups
  2418. 224.17 s > field value
  2419. 224.17 s > existing_esurfaces 1
  2420. 224.17 s > group_count 1
  2421. 224.17 s > groups_above_threshold 1
  2422. 224.17 s > integrand se1l
  2423. 224.17 s > span warm_up{integrand.name=se1l}
  2424. 224.17 s > threshold_status above threshold
  2425. 224.17 s > [2026-08-28 12:15:46.497] @process::amplitude INFO : overlap structure of group 0: [1: [0(2,3)]]
  2426. 224.17 s > field value
  2427. 224.17 s > span warm_up{integrand.name=se1l}
  2428. 224.17 s > [2026-08-28 12:15:46.887] @commands::profile INFO :
  2429. 224.17 s > ╭───────┬──────┬──────────┬───────┬─────┬──────────┬───────────╮
  2430. 224.17 s > │ fixed │ → ∞ │ slope │ r2 │ DOD │ bare DOD │ inspect │
  2431. 224.17 s > ├───────┼──────┼──────────┼───────┼─────┼──────────┼───────────┤
  2432. 224.17 s > │ {} │ {e3} │ 1.639236 │ 0.904 │ 2 │ 2 │ arb retry │
  2433. 224.17 s > │ {} │ {e2} │ 1.698834 │ 0.902 │ 2 │ 2 │ arb retry │
  2434. 224.17 s > ╰───────┴──────┴──────────┴───────┴─────┴──────────┴───────────╯
  2435. 224.17 s > [2026-08-28 12:15:46.887] @commands::profile INFO :
  2436. 224.17 s > ╭───────┬──────┬─────────────┬──────────┬───────┬─────┬──────────┬───────────╮
  2437. 224.17 s > │ fixed │ → ∞ │ orientation │ slope │ r2 │ DOD │ bare DOD │ inspect │
  2438. 224.17 s > ├───────┼──────┼─────────────┼──────────┼───────┼─────┼──────────┼───────────┤
  2439. 224.17 s > │ {} │ {e3} │ 00-+ │ 0.343429 │ 0.145 │ 0 │ 2 │ arb retry │
  2440. 224.17 s > │ {} │ {e3} │ 00+- │ 0.342577 │ 0.135 │ 0 │ 2 │ arb retry │
  2441. 224.17 s > │ {} │ {e2} │ 00-+ │ 0.385975 │ 0.161 │ 0 │ 2 │ arb retry │
  2442. 224.17 s > │ {} │ {e2} │ 00+- │ 0.384920 │ 0.192 │ 0 │ 2 │ arb retry │
  2443. 224.17 s > ╰───────┴──────┴─────────────┴──────────┴───────┴─────┴──────────┴───────────╯
  2444. 224.17 s > [2026-08-28 12:15:46.888] @gammaloop_api::se... INFO : Running command set process kv integrator.target_relative_accuracy=0.001 integrator.n_increase=0 integrator.n_start=50000 integrator.n_max=400000 integrator.seed=1337
  2445. 224.17 s > [2026-08-28 12:15:46.889] @commands::integrate INFO : Created workspace directory at /build/source/tests/artifacts/se1l/integration_workspace_se1l
  2446. 224.17 s > [2026-08-28 12:15:46.931] @commands::integrate INFO : No integration state found, starting new integration
  2447. 224.17 s > [2026-08-28 12:15:46.931] @commands::integrate INFO : Gammaloop now integrates se1l@se1l, se1l@se1l_muv_shifted, se1l@se1l_rls_shifted
  2448. 224.17 s > [2026-08-28 12:15:46.932] @process::amplitude WARNING : External state 0 ('g', PDG 21, helicity +) is off shell: p^2 = +2.5e5, expected m^2 = +0e0 (|Δ| = +2.5e5). Fixed-helicity spinor/vector/tensor external states may be ill-defined at this kinematic point.
  2449. 224.17 s > field value
  2450. 224.17 s > span warm_up{integrand.name=se1l}
  2451. 224.17 s > [2026-08-28 12:15:46.932] @process::amplitude WARNING : External state 1 ('g', PDG 21, helicity -) is off shell: p^2 = +2.5e5, expected m^2 = +0e0 (|Δ| = +2.5e5). Fixed-helicity spinor/vector/tensor external states may be ill-defined at this kinematic point.
  2452. 224.17 s > field value
  2453. 224.17 s > span warm_up{integrand.name=se1l}
  2454. 224.17 s > [2026-08-28 12:15:46.932] @process::amplitude INFO : Input is above threshold: 1 existing threshold E-surfaces across 1/1 graph groups
  2455. 224.17 s > field value
  2456. 224.17 s > existing_esurfaces 1
  2457. 224.17 s > group_count 1
  2458. 224.17 s > groups_above_threshold 1
  2459. 224.17 s > integrand se1l
  2460. 224.17 s > span warm_up{integrand.name=se1l}
  2461. 224.17 s > threshold_status above threshold
  2462. 224.17 s > [2026-08-28 12:15:46.932] @process::amplitude INFO : overlap structure of group 0: [1: [0(2,3)]]
  2463. 224.17 s > field value
  2464. 224.17 s > span warm_up{integrand.name=se1l}
  2465. 224.17 s > [2026-08-28 12:15:46.936] @process::amplitude WARNING : External state 0 ('g', PDG 21, helicity +) is off shell: p^2 = +2.5e5, expected m^2 = +0e0 (|Δ| = +2.5e5). Fixed-helicity spinor/vector/tensor external states may be ill-defined at this kinematic point.
  2466. 224.17 s > field value
  2467. 224.17 s > span warm_up{integrand.name=se1l_muv_shifted}
  2468. 224.17 s > [2026-08-28 12:15:46.936] @process::amplitude WARNING : External state 1 ('g', PDG 21, helicity -) is off shell: p^2 = +2.5e5, expected m^2 = +0e0 (|Δ| = +2.5e5). Fixed-helicity spinor/vector/tensor external states may be ill-defined at this kinematic point.
  2469. 224.17 s > field value
  2470. 224.17 s > span warm_up{integrand.name=se1l_muv_shifted}
  2471. 224.17 s > [2026-08-28 12:15:46.937] @process::amplitude INFO : Input is above threshold: 1 existing threshold E-surfaces across 1/1 graph groups
  2472. 224.17 s > field value
  2473. 224.17 s > existing_esurfaces 1
  2474. 224.17 s > group_count 1
  2475. 224.17 s > groups_above_threshold 1
  2476. 224.17 s > integrand se1l_muv_shifted
  2477. 224.17 s > span warm_up{integrand.name=se1l_muv_shifted}
  2478. 224.17 s > threshold_status above threshold
  2479. 224.17 s > [2026-08-28 12:15:46.937] @process::amplitude INFO : overlap structure of group 0: [1: [0(2,3)]]
  2480. 224.17 s > field value
  2481. 224.17 s > span warm_up{integrand.name=se1l_muv_shifted}
  2482. 224.17 s > [2026-08-28 12:15:46.939] @process::amplitude WARNING : External state 0 ('g', PDG 21, helicity +) is off shell: p^2 = +2.5e5, expected m^2 = +0e0 (|Δ| = +2.5e5). Fixed-helicity spinor/vector/tensor external states may be ill-defined at this kinematic point.
  2483. 224.17 s > field value
  2484. 224.17 s > span warm_up{integrand.name=se1l_rls_shifted}
  2485. 224.17 s > [2026-08-28 12:15:46.939] @process::amplitude WARNING : External state 1 ('g', PDG 21, helicity -) is off shell: p^2 = +2.5e5, expected m^2 = +0e0 (|Δ| = +2.5e5). Fixed-helicity spinor/vector/tensor external states may be ill-defined at this kinematic point.
  2486. 224.17 s > field value
  2487. 224.17 s > span warm_up{integrand.name=se1l_rls_shifted}
  2488. 224.17 s > [2026-08-28 12:15:46.939] @process::amplitude INFO : Input is above threshold: 1 existing threshold E-surfaces across 1/1 graph groups
  2489. 224.17 s > field value
  2490. 224.17 s > existing_esurfaces 1
  2491. 224.17 s > group_count 1
  2492. 224.17 s > groups_above_threshold 1
  2493. 224.17 s > integrand se1l_rls_shifted
  2494. 224.17 s > span warm_up{integrand.name=se1l_rls_shifted}
  2495. 224.17 s > threshold_status above threshold
  2496. 224.17 s > ... omitted 1410 more lines; see full nextest output above
  2497. 224.17 s > =========================================
  2498. 224.17 s For full logs, run:
  2499. 224.17 s nix log /nix/store/ifx25i75mrp4mx011vk3kpahjasmfqfi-gammaloop-nextest-integration.drv
  2500. 224.39 s [0 built (1 failed), 0.0Run failed.