test packages.x86_64-linux.nix-ci-check-gammaloop-nextest-integration

Reproduce this run
Retry Run
  1. 167.68 s gammaloop-nextest-integration> | dod2_bubble | rls.integrated | GL0 | pass | 0.0sigma | compatible within 2sigma | - |
  2. 167.68 s gammaloop-nextest-integration> +-------------+-----------------+---------+--------+----------+-----------------------------------------------------------------------------------------------------------------------+-------+
  3. 167.68 s gammaloop-nextest-integration> | dod2_bubble | mu_r.inspect | inspect | pass | - | best inspect relative delta 6.951e-1 >= 1000*accuracy 1.000e-7 (accuracy=1.000e-10, exponent=+0.0, seed=0, probes=10) | - |
  4. 167.68 s gammaloop-nextest-integration> +-------------+-----------------+---------+--------+----------+-----------------------------------------------------------------------------------------------------------------------+-------+
  5. 167.68 s gammaloop-nextest-integration> | dod2_bubble | target | - | pass | - | 2sigma | - |
  6. 167.68 s gammaloop-nextest-integration> +-------------+-----------------+---------+--------+----------+-----------------------------------------------------------------------------------------------------------------------+-------+
  7. 167.68 s gammaloop-nextest-integration> test dod2_bubble_uv ... FAILED
  8. 167.68 s gammaloop-nextest-integration>
  9. 167.68 s gammaloop-nextest-integration> failures:
  10. 167.68 s gammaloop-nextest-integration>
  11. 167.68 s gammaloop-nextest-integration> failures:
  12. 167.68 s gammaloop-nextest-integration> dod2_bubble_uv
  13. 167.68 s gammaloop-nextest-integration>
  14. 167.68 s gammaloop-nextest-integration> test result: FAILED. 0 passed; 1 failed; 0 ignored; 0 measured; 24 filtered out; finished in 56.92s
  15. 167.68 s gammaloop-nextest-integration> system-err
  16. 167.68 s gammaloop-nextest-integration> [2026-08-27 10:07:45.505] @gammaloop_api::se... INFO : Running command run generate
  17. 167.68 s gammaloop-nextest-integration> [2026-08-27 10:07:45.505] @gammaloop_api::se... INFO : Starting command block generate
  18. 167.68 s gammaloop-nextest-integration> [2026-08-27 10:07:45.505] @gammaloop_api::se... INFO : Running command import model scalars-default.json
  19. 167.68 s gammaloop-nextest-integration> [2026-08-27 10:07:45.505] @import::model INFO : Loading built-in JSON model scalars-default
  20. 167.68 s gammaloop-nextest-integration> [2026-08-27 10:07:45.511] @gammalooprs::model INFO : The following 2 external parameters were forced to zero by the restriction card:
  21. 167.68 s gammaloop-nextest-integration> width_scalar_1, width_scalar_2
  22. 167.68 s gammaloop-nextest-integration> [2026-08-27 10:07:45.511] @gammaloop_api::se... INFO : Running command remove processes
  23. 167.68 s gammaloop-nextest-integration> [2026-08-27 10:07:45.512] @gammaloop_api::se... INFO : Running command set global kv global.generation.uv.generate_integrated=true
  24. 167.68 s gammaloop-nextest-integration> [2026-08-27 10:07:45.512] @gammaloop_api::se... INFO : Running command import graphs ./tests/resources/graphs/scalar/dod2_bubble.dot -p bubble_dod2 -i scalar_bubble_below_thres
  25. 167.68 s gammaloop-nextest-integration> [2026-08-27 10:07:45.513] @commands::import INFO : Loading graphs from '/build/source/tests/resources/graphs/scalar/dod2_bubble.dot'
  26. 167.68 s gammaloop-nextest-integration> [2026-08-27 10:07:45.518] @gammaloop_api::se... INFO : Running command generate existing -p bubble_dod2 -i scalar_bubble_below_thres
  27. 167.68 s gammaloop-nextest-integration> [2026-08-27 10:07:45.519] @approx::local_4d [{#uv, #inspect, #integrated}] DEBUG : Rescaled momenta expanded
  28. 167.68 s gammaloop-nextest-integration> field value
  29. 167.68 s gammaloop-nextest-integration> res n-terms: 1, byte size: 585,expr:
  30. 167.68 s gammaloop-nextest-integration> -SCALAR_COUPLING²·q₀(αᵉ².¹)·q₀(αᵉ³.¹)·q₂(αᵉ².¹)·q₂(αᵉ³.¹)
  31. 167.68 s gammaloop-nextest-integration> /(t²·denom(3,-q₀-q₂/t,mass_scalar_2²,-mass_scalar_2²+2·(q₀.q₂)/t+(q₂.q₂)/t²+(q₀.q₀))
  32. 167.68 s gammaloop-nextest-integration> ·denom(2,q₂/t,mass_scalar_2²,-mass_scalar_2²+(q₂.q₂)/t²))
  33. 167.68 s gammaloop-nextest-integration> [2026-08-27 10:07:45.524] @approx::local_4d [{#uv, #inspect, #integrated}] DEBUG : Rescaled momenta expanded
  34. 167.68 s gammaloop-nextest-integration> field value
  35. 167.68 s gammaloop-nextest-integration> res n-terms: 1, byte size: 3,expr:
  36. 167.68 s gammaloop-nextest-integration> 1
  37. 167.68 s gammaloop-nextest-integration> [2026-08-27 10:07:45.524] @approx::final_integrand[{#generation, #profile, #uv, #graph, #summary}] DEBUG : Computed global numerator
  38. 167.68 s gammaloop-nextest-integration> field value
  39. 167.68 s gammaloop-nextest-integration> global_num n-terms: 1, byte size: 4,expr:
  40. 167.68 s gammaloop-nextest-integration> 1/2
  41. 167.68 s gammaloop-nextest-integration> span build_3d{span_context=true graph=GL0 current=subgraph=0, topo_order=0, dod=0}
  42. 167.68 s gammaloop-nextest-integration> [2026-08-27 10:07:45.526] @uv::approx [{#generation, #uv, #fourd}] DEBUG : Computing 4D
  43. 167.68 s gammaloop-nextest-integration> field value
  44. 167.68 s gammaloop-nextest-integration> simple subgraph(S_11,S_y)*Approx(subgraph(S_y,0)) of GL0
  45. 167.68 s gammaloop-nextest-integration> span compute_4d{span_context=true graph=GL0 current=subgraph=y, topo_order=1, dod=2 given=subgraph=0, topo_order=0, dod=0 reduced=SubSet { set: BitVec<usize, bitvec::order::Lsb0> { addr: 0x7fffec015670, head: 000000, bits: 6, capacity: 64 } [0, 0, 1, 1, 1, 1], id: PhantomData<linnet::half_edge::involution::Hedge> }}
  46. 167.68 s gammaloop-nextest-integration> [2026-08-27 10:07:45.530] @approx::local_4d [{#uv, #algebra, #integrated, #start}] DEBUG :
  47. 167.68 s gammaloop-nextest-integration> field value
  48. 167.68 s gammaloop-nextest-integration> integrand n-terms: 1, byte size: 409,expr:
  49. 167.68 s gammaloop-nextest-integration> SCALAR_COUPLING²·(q₀(αᵉ³.¹)+q₃(αᵉ³.¹))·q₀(αᵉ².¹)·q₀(αᵉ³.¹)·q₂(αᵉ².¹)
  50. 167.68 s gammaloop-nextest-integration> /(denom(2,q₂,mass_scalar_2²,-mass_scalar_2²+(q₂.q₂))·denom(3,q₃,mass_scalar_2²,-mass_scalar_2²+(q₃.q₃)))
  51. 167.68 s gammaloop-nextest-integration> reduced y
  52. 167.68 s gammaloop-nextest-integration> span grow{span_context=true current=subgraph=y, topo_order=1, dod=2 given=subgraph=0, topo_order=0, dod=0}
  53. 167.68 s gammaloop-nextest-integration> [2026-08-27 10:07:45.530] @approx::local_4d [{#uv, #inspect, #integrated}] DEBUG : Rescaled momenta expanded
  54. 167.68 s gammaloop-nextest-integration> field value
  55. 167.68 s gammaloop-nextest-integration> res n-terms: 1, byte size: 585,expr:
  56. 167.68 s gammaloop-nextest-integration> -SCALAR_COUPLING²·q₀(αᵉ².¹)·q₀(αᵉ³.¹)·q₂(αᵉ².¹)·q₂(αᵉ³.¹)
  57. 167.68 s gammaloop-nextest-integration> /(t²·denom(3,-q₀-q₂/t,mass_scalar_2²,-mass_scalar_2²+2·(q₀.q₂)/t+(q₂.q₂)/t²+(q₀.q₀))
  58. 167.68 s gammaloop-nextest-integration> ·denom(2,q₂/t,mass_scalar_2²,-mass_scalar_2²+(q₂.q₂)/t²))
  59. 167.68 s gammaloop-nextest-integration> span t{span_context=true current=subgraph=y, topo_order=1, dod=2 given=subgraph=0, topo_order=0, dod=0}
  60. 167.68 s gammaloop-nextest-integration> [2026-08-27 10:07:45.530] @approx::local_4d [{#uv, #integrated, #rescaled}] DEBUG : Rescaled expanded
  61. 167.68 s gammaloop-nextest-integration> field value
  62. 167.68 s gammaloop-nextest-integration> n_loops 1
  63. 167.68 s gammaloop-nextest-integration> res n-terms: 1, byte size: 707,expr:
  64. 167.68 s gammaloop-nextest-integration> -SCALAR_COUPLING²·q₀(αᵉ².¹)·q₀(αᵉ³.¹)·q₂(αᵉ².¹)·q₂(αᵉ³.¹)
  65. 167.68 s gammaloop-nextest-integration> /(t²·denom(3,-q₂,mUVexp²+t²·mass_scalar_2²,-mUV²+t²·(-mass_scalar_2²+2·(q₀.q₂)/t+(q₂.q₂)/t²+(q₀.q₀))+t²·mUVexp²)
  66. 167.68 s gammaloop-nextest-integration> ·denom(2,q₂,mUVexp²+t²·mass_scalar_2²,-mUV²+t²·(-mass_scalar_2²+(q₂.q₂)/t²)+t²·mUVexp²))
  67. 167.68 s gammaloop-nextest-integration> span t{span_context=true current=subgraph=y, topo_order=1, dod=2 given=subgraph=0, topo_order=0, dod=0}
  68. 167.68 s gammaloop-nextest-integration> [2026-08-27 10:07:45.531] @approx::local_4d [{#uv, #integrated, #series}] DEBUG : Series expanded
  69. 167.68 s gammaloop-nextest-integration> field value
  70. 167.68 s gammaloop-nextest-integration> res n-terms: 3, byte size: 1896,expr:
  71. 167.68 s gammaloop-nextest-integration> (1/2·SCALAR_COUPLING²·(2·mUVexp²-2·mass_scalar_2²)/(denom(2,q₂,mUVexp²,-mUV²+(q₂.q₂))²·denom(3,-q₂,mUVexp²,-mUV²+(q₂.q₂)))
  72. 167.68 s gammaloop-nextest-integration> -SCALAR_COUPLING²
  73. 167.68 s gammaloop-nextest-integration> ·(-1/2·(2·mUVexp²-2·mass_scalar_2²+2·(q₀.q₀))/denom(3,-q₂,mUVexp²,-mUV²+(q₂.q₂))
  74. 167.68 s gammaloop-nextest-integration> +4·(q₀.q₂)²/denom(3,-q₂,mUVexp²,-mUV²+(q₂.q₂))²
  75. 167.68 s gammaloop-nextest-integration> )/(denom(2,q₂,mUVexp²,-mUV²+(q₂.q₂))·denom(3,-q₂,mUVexp²,-mUV²+(q₂.q₂)))
  76. 167.68 s gammaloop-nextest-integration> )·q₀(αᵉ².¹)·q₀(αᵉ³.¹)·q₂(αᵉ².¹)·q₂(αᵉ³.¹)
  77. 167.68 s gammaloop-nextest-integration> +2·SCALAR_COUPLING²·(q₀.q₂)·q₀(αᵉ².¹)·q₀(αᵉ³.¹)·q₂(αᵉ².¹)·q₂(αᵉ³.¹)
  78. 167.68 s gammaloop-nextest-integration> /(t·denom(2,q₂,mUVexp²,-mUV²+(q₂.q₂))·denom(3,-q₂,mUVexp²,-mUV²+(q₂.q₂))²)
  79. 167.68 s gammaloop-nextest-integration> -SCALAR_COUPLING²·q₀(αᵉ².¹)·q₀(αᵉ³.¹)·q₂(αᵉ².¹)·q₂(αᵉ³.¹)
  80. 167.68 s gammaloop-nextest-integration> /(t²·denom(2,q₂,mUVexp²,-mUV²+(q₂.q₂))·denom(3,-q₂,mUVexp²,-mUV²+(q₂.q₂)))
  81. 167.68 s gammaloop-nextest-integration> span t{span_context=true current=subgraph=y, topo_order=1, dod=2 given=subgraph=0, topo_order=0, dod=0}
  82. 167.68 s gammaloop-nextest-integration> [2026-08-27 10:07:45.531] @approx::local_4d [{#uv, #integrated, #series}] DEBUG : Evaluated at t = 1
  83. 167.68 s gammaloop-nextest-integration> field value
  84. 167.68 s gammaloop-nextest-integration> res n-terms: 3, byte size: 1880,expr:
  85. 167.68 s gammaloop-nextest-integration> (1/2·SCALAR_COUPLING²·(2·mUVexp²-2·mass_scalar_2²)/(denom(2,q₂,mUVexp²,-mUV²+(q₂.q₂))²·denom(3,-q₂,mUVexp²,-mUV²+(q₂.q₂)))
  86. 167.68 s gammaloop-nextest-integration> -SCALAR_COUPLING²
  87. 167.68 s gammaloop-nextest-integration> ·(-1/2·(2·mUVexp²-2·mass_scalar_2²+2·(q₀.q₀))/denom(3,-q₂,mUVexp²,-mUV²+(q₂.q₂))
  88. 167.68 s gammaloop-nextest-integration> +4·(q₀.q₂)²/denom(3,-q₂,mUVexp²,-mUV²+(q₂.q₂))²
  89. 167.68 s gammaloop-nextest-integration> )/(denom(2,q₂,mUVexp²,-mUV²+(q₂.q₂))·denom(3,-q₂,mUVexp²,-mUV²+(q₂.q₂)))
  90. 167.68 s gammaloop-nextest-integration> )·q₀(αᵉ².¹)·q₀(αᵉ³.¹)·q₂(αᵉ².¹)·q₂(αᵉ³.¹)
  91. 167.68 s gammaloop-nextest-integration> -SCALAR_COUPLING²·q₀(αᵉ².¹)·q₀(αᵉ³.¹)·q₂(αᵉ².¹)·q₂(αᵉ³.¹)
  92. 167.68 s gammaloop-nextest-integration> /(denom(2,q₂,mUVexp²,-mUV²+(q₂.q₂))·denom(3,-q₂,mUVexp²,-mUV²+(q₂.q₂)))
  93. 167.68 s gammaloop-nextest-integration> +2·SCALAR_COUPLING²·(q₀.q₂)·q₀(αᵉ².¹)·q₀(αᵉ³.¹)·q₂(αᵉ².¹)·q₂(αᵉ³.¹)
  94. 167.68 s gammaloop-nextest-integration> /(denom(2,q₂,mUVexp²,-mUV²+(q₂.q₂))·denom(3,-q₂,mUVexp²,-mUV²+(q₂.q₂))²)
  95. 167.68 s gammaloop-nextest-integration> span t{span_context=true current=subgraph=y, topo_order=1, dod=2 given=subgraph=0, topo_order=0, dod=0}
  96. 167.68 s gammaloop-nextest-integration> [2026-08-27 10:07:45.532] @approx::local_4d [{#uv, #collect, #integrated}] DEBUG : After gamma chain collection
  97. 167.68 s gammaloop-nextest-integration> field value
  98. 167.68 s gammaloop-nextest-integration> expr n-terms: 3, byte size: 1880,expr:
  99. 167.68 s gammaloop-nextest-integration> (1/2·SCALAR_COUPLING²·(2·mUVexp²-2·mass_scalar_2²)/(denom(2,q₂,mUVexp²,-mUV²+(q₂.q₂))²·denom(3,-q₂,mUVexp²,-mUV²+(q₂.q₂)))
  100. 167.68 s gammaloop-nextest-integration> -SCALAR_COUPLING²
  101. 167.68 s gammaloop-nextest-integration> ·(-1/2·(2·mUVexp²-2·mass_scalar_2²+2·(q₀.q₀))/denom(3,-q₂,mUVexp²,-mUV²+(q₂.q₂))
  102. 167.68 s gammaloop-nextest-integration> +4·(q₀.q₂)²/denom(3,-q₂,mUVexp²,-mUV²+(q₂.q₂))²
  103. 167.68 s gammaloop-nextest-integration> )/(denom(2,q₂,mUVexp²,-mUV²+(q₂.q₂))·denom(3,-q₂,mUVexp²,-mUV²+(q₂.q₂)))
  104. 167.68 s gammaloop-nextest-integration> )·q₀(αᵉ².¹)·q₀(αᵉ³.¹)·q₂(αᵉ².¹)·q₂(αᵉ³.¹)
  105. 167.68 s gammaloop-nextest-integration> -SCALAR_COUPLING²·q₀(αᵉ².¹)·q₀(αᵉ³.¹)·q₂(αᵉ².¹)·q₂(αᵉ³.¹)
  106. 167.68 s gammaloop-nextest-integration> /(denom(2,q₂,mUVexp²,-mUV²+(q₂.q₂))·denom(3,-q₂,mUVexp²,-mUV²+(q₂.q₂)))
  107. 167.68 s gammaloop-nextest-integration> +2·SCALAR_COUPLING²·(q₀.q₂)·q₀(αᵉ².¹)·q₀(αᵉ³.¹)·q₂(αᵉ².¹)·q₂(αᵉ³.¹)
  108. 167.68 s gammaloop-nextest-integration> /(denom(2,q₂,mUVexp²,-mUV²+(q₂.q₂))·denom(3,-q₂,mUVexp²,-mUV²+(q₂.q₂))²)
  109. 167.68 s gammaloop-nextest-integration> span t{span_context=true current=subgraph=y, topo_order=1, dod=2 given=subgraph=0, topo_order=0, dod=0}
  110. 167.68 s gammaloop-nextest-integration> [2026-08-27 10:07:45.536] @approx::local_4d [{#profile, #uv, #collect, #integrated, #start, #trace}] DEBUG : After gamma schoonschip
  111. 167.68 s gammaloop-nextest-integration> field value
  112. 167.68 s gammaloop-nextest-integration> expr n-terms: 3, byte size: 1631,expr:
  113. 167.68 s gammaloop-nextest-integration> (1/2·SCALAR_COUPLING²·(2·mUVexp²-2·mass_scalar_2²)/(denom(2,q₂,mUVexp²,-mUV²+(q₂.q₂))²·denom(3,-q₂,mUVexp²,-mUV²+(q₂.q₂)))
  114. 167.68 s gammaloop-nextest-integration> -SCALAR_COUPLING²
  115. 167.68 s gammaloop-nextest-integration> ·(-1/2·(2·mUVexp²-2·mass_scalar_2²+2·(q₀.q₀))/denom(3,-q₂,mUVexp²,-mUV²+(q₂.q₂))
  116. 167.68 s gammaloop-nextest-integration> +4·(q₀.q₂)²/denom(3,-q₂,mUVexp²,-mUV²+(q₂.q₂))²
  117. 167.68 s gammaloop-nextest-integration> )/(denom(2,q₂,mUVexp²,-mUV²+(q₂.q₂))·denom(3,-q₂,mUVexp²,-mUV²+(q₂.q₂)))
  118. 167.68 s gammaloop-nextest-integration> )·(q₀.q₂)²
  119. 167.68 s gammaloop-nextest-integration> -SCALAR_COUPLING²·(q₀.q₂)²/(denom(2,q₂,mUVexp²,-mUV²+(q₂.q₂))·denom(3,-q₂,mUVexp²,-mUV²+(q₂.q₂)))
  120. 167.68 s gammaloop-nextest-integration> +2·SCALAR_COUPLING²·(q₀.q₂)·(q₀.q₂)²
  121. 167.68 s gammaloop-nextest-integration> /(denom(2,q₂,mUVexp²,-mUV²+(q₂.q₂))·denom(3,-q₂,mUVexp²,-mUV²+(q₂.q₂))²)
  122. 167.68 s gammaloop-nextest-integration> span t{span_context=true current=subgraph=y, topo_order=1, dod=2 given=subgraph=0, topo_order=0, dod=0}
  123. 167.68 s gammaloop-nextest-integration> [2026-08-27 10:07:45.538] @approx::local_4d [{#profile, #uv, #collect, #integrated, #start, #trace}] DEBUG : After gamma collection
  124. 167.68 s gammaloop-nextest-integration> field value
  125. 167.68 s gammaloop-nextest-integration> expr n-terms: 1, byte size: 1347,expr:
  126. 167.68 s gammaloop-nextest-integration> SCALAR_COUPLING²
  127. 167.68 s gammaloop-nextest-integration> ·(-denom(2,q₂,mUVexp²,-mUV²+(q₂.q₂))·denom(3,-q₂,mUVexp²,-mUV²+(q₂.q₂))²
  128. 167.68 s gammaloop-nextest-integration> +1/2·(2·mUVexp²-2·mass_scalar_2²)·denom(3,-q₂,mUVexp²,-mUV²+(q₂.q₂))²
  129. 167.68 s gammaloop-nextest-integration> -(-1/2·(2·mUVexp²-2·mass_scalar_2²+2·(q₀.q₀))·denom(3,-q₂,mUVexp²,-mUV²+(q₂.q₂))+4·(q₀.q₂)²)
  130. 167.68 s gammaloop-nextest-integration> ·denom(2,q₂,mUVexp²,-mUV²+(q₂.q₂))
  131. 167.68 s gammaloop-nextest-integration> +2·(q₀.q₂)·denom(2,q₂,mUVexp²,-mUV²+(q₂.q₂))·denom(3,-q₂,mUVexp²,-mUV²+(q₂.q₂))
  132. 167.68 s gammaloop-nextest-integration> )·(q₀.q₂)²/(denom(2,q₂,mUVexp²,-mUV²+(q₂.q₂))²·denom(3,-q₂,mUVexp²,-mUV²+(q₂.q₂))³)
  133. 167.68 s gammaloop-nextest-integration> span t{span_context=true current=subgraph=y, topo_order=1, dod=2 given=subgraph=0, topo_order=0, dod=0}
  134. 167.68 s gammaloop-nextest-integration> [2026-08-27 10:07:45.542] @approx::local_4d [{#profile, #uv, #gamma, #integrated, #start, #trace, #vakint}] DEBUG : After gamma simplification
  135. 167.68 s gammaloop-nextest-integration> ... omitted 3263 more lines; see full nextest output above
  136. 167.68 s gammaloop-nextest-integration>
  137. 167.68 s gammaloop-nextest-integration> 8. gammaloop-integration-tests::uv::sunrise_scalar_1_uv
  138. 167.71 s gammaloop-nextest-integration> failure: test failure with exit code 101
  139. 167.71 s gammaloop-nextest-integration> system-out
  140. 167.71 s gammaloop-nextest-integration> running 1 test
  141. 167.71 s gammaloop-nextest-integration> test sunrise_scalar_1_uv has been running for over 60 seconds
  142. 167.71 s gammaloop-nextest-integration> +------------------+------------------------+--------------+--------+----------+----------------------------------------------------------------------------------------------------------------------+-------+
  143. 167.71 s gammaloop-nextest-integration> | case | check | graph | status | sigma | threshold | error |
  144. 167.71 s gammaloop-nextest-integration> +------------------+------------------------+--------------+--------+----------+----------------------------------------------------------------------------------------------------------------------+-------+
  145. 167.71 s gammaloop-nextest-integration> | sunrise_scalar_1 | uv_profile | - | FAIL | - | - | - |
  146. 167.71 s gammaloop-nextest-integration> +------------------+------------------------+--------------+--------+----------+----------------------------------------------------------------------------------------------------------------------+-------+
  147. 167.71 s gammaloop-nextest-integration> | sunrise_scalar_1 | m_uv.inspect | inspect | pass | - | best inspect relative delta 1.624e0 >= 1000*accuracy 1.000e-3 (accuracy=1.000e-6, exponent=+1.0, seed=1, probes=10) | - |
  148. 167.71 s gammaloop-nextest-integration> +------------------+------------------------+--------------+--------+----------+----------------------------------------------------------------------------------------------------------------------+-------+
  149. 167.71 s gammaloop-nextest-integration> | sunrise_scalar_1 | m_uv.integrated | sunrise | pass | 0.1sigma | compatible within 2sigma | - |
  150. 167.71 s gammaloop-nextest-integration> +------------------+------------------------+--------------+--------+----------+----------------------------------------------------------------------------------------------------------------------+-------+
  151. 167.71 s gammaloop-nextest-integration> | sunrise_scalar_1 | rls.inspect | inspect | pass | - | best inspect relative delta 8.682e-1 >= 1000*accuracy 1.000e-3 (accuracy=1.000e-6, exponent=+1.0, seed=1, probes=10) | - |
  152. 167.71 s gammaloop-nextest-integration> +------------------+------------------------+--------------+--------+----------+----------------------------------------------------------------------------------------------------------------------+-------+
  153. 167.71 s gammaloop-nextest-integration> | sunrise_scalar_1 | rls.integrated | sunrise | pass | 0.0sigma | compatible within 2sigma | - |
  154. 167.71 s gammaloop-nextest-integration> +------------------+------------------------+--------------+--------+----------+----------------------------------------------------------------------------------------------------------------------+-------+
  155. 167.71 s gammaloop-nextest-integration> | sunrise_scalar_1 | mu_r.inspect | inspect | pass | - | best inspect relative delta 1.752e0 >= 1000*accuracy 1.000e-3 (accuracy=1.000e-6, exponent=+1.0, seed=1, probes=10) | - |
  156. 167.71 s gammaloop-nextest-integration> +------------------+------------------------+--------------+--------+----------+----------------------------------------------------------------------------------------------------------------------+-------+
  157. 167.71 s gammaloop-nextest-integration> | sunrise_scalar_1 | integrated.relerr | integrated | pass | - | relative error 9.20% <= 10.00% | - |
  158. 167.71 s gammaloop-nextest-integration> +------------------+------------------------+--------------+--------+----------+----------------------------------------------------------------------------------------------------------------------+-------+
  159. 167.71 s gammaloop-nextest-integration> | sunrise_scalar_1 | m_uv.integrated.relerr | m_uv-shifted | pass | - | relative error 5.89% <= 10.00% | - |
  160. 167.71 s gammaloop-nextest-integration> +------------------+------------------------+--------------+--------+----------+----------------------------------------------------------------------------------------------------------------------+-------+
  161. 167.71 s gammaloop-nextest-integration> | sunrise_scalar_1 | target | - | pass | - | 2sigma | - |
  162. 167.71 s gammaloop-nextest-integration> +------------------+------------------------+--------------+--------+----------+----------------------------------------------------------------------------------------------------------------------+-------+
  163. 167.71 s gammaloop-nextest-integration> test sunrise_scalar_1_uv ... FAILED
  164. 167.71 s gammaloop-nextest-integration>
  165. 167.71 s gammaloop-nextest-integration> failures:
  166. 167.71 s gammaloop-nextest-integration>
  167. 167.71 s gammaloop-nextest-integration> failures:
  168. 167.71 s gammaloop-nextest-integration> sunrise_scalar_1_uv
  169. 167.71 s gammaloop-nextest-integration>
  170. 167.71 s gammaloop-nextest-integration> test result: FAILED. 0 passed; 1 failed; 0 ignored; 0 measured; 24 filtered out; finished in 115.96s
  171. 167.71 s gammaloop-nextest-integration> system-err
  172. 167.71 s gammaloop-nextest-integration> [2026-08-27 10:07:50.457] @gammaloop_api::se... INFO : Running command run generate
  173. 167.71 s gammaloop-nextest-integration> [2026-08-27 10:07:50.457] @gammaloop_api::se... INFO : Starting command block generate
  174. 167.71 s gammaloop-nextest-integration> [2026-08-27 10:07:50.457] @gammaloop_api::se... INFO : Running command import model scalars-default.json
  175. 167.71 s gammaloop-nextest-integration> [2026-08-27 10:07:50.457] @import::model INFO : Loading built-in JSON model scalars-default
  176. 167.71 s gammaloop-nextest-integration> [2026-08-27 10:07:50.469] @gammalooprs::model INFO : The following 2 external parameters were forced to zero by the restriction card:
  177. 167.71 s gammaloop-nextest-integration> width_scalar_1, width_scalar_2
  178. 167.71 s gammaloop-nextest-integration> [2026-08-27 10:07:50.470] @gammaloop_api::se... INFO : Running command remove processes
  179. 167.71 s gammaloop-nextest-integration> [2026-08-27 10:07:50.470] @gammaloop_api::se... INFO : Running command set global kv global.generation.uv.generate_integrated=true
  180. 167.71 s gammaloop-nextest-integration> [2026-08-27 10:07:50.471] @gammaloop_api::se... INFO : Running command import graphs ./tests/resources/graphs/scalar_sunrise.dot -p sunrise_scalar_1 -i scalar_sunrise
  181. 167.71 s gammaloop-nextest-integration> [2026-08-27 10:07:50.471] @commands::import INFO : Loading graphs from '/build/source/tests/resources/graphs/scalar_sunrise.dot'
  182. 167.71 s gammaloop-nextest-integration> [2026-08-27 10:07:50.484] @gammaloop_api::se... INFO : Running command generate existing -p sunrise_scalar_1 -i scalar_sunrise
  183. 167.71 s gammaloop-nextest-integration> [2026-08-27 10:07:50.485] @approx::local_4d [{#uv, #inspect, #integrated}] DEBUG : Rescaled momenta expanded
  184. 167.71 s gammaloop-nextest-integration> field value
  185. 167.71 s gammaloop-nextest-integration> res n-terms: 1, byte size: 611,expr:
  186. 167.71 s gammaloop-nextest-integration> 1/(denom(1,q₁/t,mass_scalar_1²,-mass_scalar_1²+(q₁.q₁)/t²)
  187. 167.71 s gammaloop-nextest-integration> ·denom(2,-q₀+q₃-q₁/t,mass_scalar_1²,
  188. 167.71 s gammaloop-nextest-integration> -mass_scalar_1²+2·(q₀.q₁)/t-2·(q₁.q₃)/t+(q₁.q₁)/t²+(q₀.q₀)
  189. 167.71 s gammaloop-nextest-integration> -2·(q₀.q₃)+(q₃.q₃)
  190. 167.71 s gammaloop-nextest-integration> ))
  191. 167.71 s gammaloop-nextest-integration> [2026-08-27 10:07:50.486] @approx::local_4d [{#uv, #inspect, #integrated}] DEBUG : Rescaled momenta expanded
  192. 167.71 s gammaloop-nextest-integration> field value
  193. 167.71 s gammaloop-nextest-integration> res n-terms: 1, byte size: 3,expr:
  194. 167.71 s gammaloop-nextest-integration> 1
  195. 167.71 s gammaloop-nextest-integration> [2026-08-27 10:07:50.492] @approx::local_4d [{#uv, #inspect, #integrated}] DEBUG : Rescaled momenta expanded
  196. 167.71 s gammaloop-nextest-integration> field value
  197. 167.71 s gammaloop-nextest-integration> res n-terms: 1, byte size: 611,expr:
  198. 167.71 s gammaloop-nextest-integration> 1/(denom(0,q₀/t,mass_scalar_1²,-mass_scalar_1²+(q₀.q₀)/t²)
  199. 167.71 s gammaloop-nextest-integration> ·denom(2,-q₁+q₃-q₀/t,mass_scalar_1²,
  200. 167.71 s gammaloop-nextest-integration> -mass_scalar_1²+2·(q₀.q₁)/t-2·(q₀.q₃)/t+(q₀.q₀)/t²+(q₁.q₁)
  201. 167.71 s gammaloop-nextest-integration> -2·(q₁.q₃)+(q₃.q₃)
  202. 167.71 s gammaloop-nextest-integration> ))
  203. 167.71 s gammaloop-nextest-integration> [2026-08-27 10:07:50.493] @approx::local_4d [{#uv, #inspect, #integrated}] DEBUG : Rescaled momenta expanded
  204. 167.71 s gammaloop-nextest-integration> field value
  205. 167.71 s gammaloop-nextest-integration> res n-terms: 1, byte size: 777,expr:
  206. 167.71 s gammaloop-nextest-integration> 1/(denom(0,q₀/t,mass_scalar_1²,-mass_scalar_1²+(q₀.q₀)/t²)·denom(1,q₁/t,mass_scalar_1²,-mass_scalar_1²+(q₁.q₁)/t²)
  207. 167.71 s gammaloop-nextest-integration> ·denom(2,q₄-q₀/t-q₁/t,mass_scalar_1²,
  208. 167.71 s gammaloop-nextest-integration> -mass_scalar_1²-2·(q₀.q₄)/t-2·(q₁.q₄)/t+(q₀.q₀)/t²+2·(q₀.q₁)/t²
  209. 167.71 s gammaloop-nextest-integration> +(q₁.q₁)/t²+(q₄.q₄)
  210. 167.71 s gammaloop-nextest-integration> ))
  211. 167.71 s gammaloop-nextest-integration> [2026-08-27 10:07:50.496] @approx::local_4d [{#uv, #inspect, #integrated}] DEBUG : Rescaled momenta expanded
  212. 167.71 s gammaloop-nextest-integration> field value
  213. 167.71 s gammaloop-nextest-integration> res n-terms: 1, byte size: 611,expr:
  214. 167.71 s gammaloop-nextest-integration> 1/(denom(0,q₀/t,mass_scalar_1²,-mass_scalar_1²+(q₀.q₀)/t²)
  215. 167.71 s gammaloop-nextest-integration> ·denom(1,-q₂+q₃-q₀/t,mass_scalar_1²,
  216. 167.71 s gammaloop-nextest-integration> -mass_scalar_1²+2·(q₀.q₂)/t-2·(q₀.q₃)/t+(q₀.q₀)/t²+(q₂.q₂)
  217. 167.71 s gammaloop-nextest-integration> -2·(q₂.q₃)+(q₃.q₃)
  218. 167.71 s gammaloop-nextest-integration> ))
  219. 167.71 s gammaloop-nextest-integration> [2026-08-27 10:07:50.497] @approx::final_integrand[{#generation, #profile, #uv, #graph, #summary}] DEBUG : Computed global numerator
  220. 167.71 s gammaloop-nextest-integration> field value
  221. 167.71 s gammaloop-nextest-integration> global_num n-terms: 1, byte size: 3,expr:
  222. 167.71 s gammaloop-nextest-integration> 1
  223. 167.71 s gammaloop-nextest-integration> span build_3d{span_context=true graph=sunrise current=subgraph=0, topo_order=0, dod=0}
  224. 167.71 s gammaloop-nextest-integration> [2026-08-27 10:07:50.498] @uv::approx [{#generation, #uv, #fourd}] DEBUG : Computing 4D
  225. 167.71 s gammaloop-nextest-integration> field value
  226. 167.71 s gammaloop-nextest-integration> simple subgraph(S_47,S_3s)*Approx(subgraph(S_3s,0)) of sunrise
  227. 167.71 s gammaloop-nextest-integration> span compute_4d{span_context=true graph=sunrise current=subgraph=3s, topo_order=1, dod=0 given=subgraph=0, topo_order=0, dod=0 reduced=SubSet { set: BitVec<usize, bitvec::order::Lsb0> { addr: 0x7fffec00bae0, head: 000000, bits: 8, capacity: 64 } [0, 0, 0, 0, 1, 1, 1, 1], id: PhantomData<linnet::half_edge::involution::Hedge> }}
  228. 167.71 s gammaloop-nextest-integration> [2026-08-27 10:07:50.499] @approx::local_4d [{#uv, #algebra, #integrated, #start}] DEBUG :
  229. 167.71 s gammaloop-nextest-integration> field value
  230. 167.71 s gammaloop-nextest-integration> integrand n-terms: 1, byte size: 217,expr:
  231. 167.71 s gammaloop-nextest-integration> 1/(denom(1,q₁,mass_scalar_1²,-mass_scalar_1²+(q₁.q₁))·denom(2,q₂,mass_scalar_1²,-mass_scalar_1²+(q₂.q₂)))
  232. 167.71 s gammaloop-nextest-integration> reduced 3s
  233. 167.71 s gammaloop-nextest-integration> span grow{span_context=true current=subgraph=3s, topo_order=1, dod=0 given=subgraph=0, topo_order=0, dod=0}
  234. 167.71 s gammaloop-nextest-integration> [2026-08-27 10:07:50.499] @approx::local_4d [{#uv, #inspect, #integrated}] DEBUG : Rescaled momenta expanded
  235. 167.71 s gammaloop-nextest-integration> field value
  236. 167.71 s gammaloop-nextest-integration> res n-terms: 1, byte size: 611,expr:
  237. 167.71 s gammaloop-nextest-integration> 1/(denom(1,q₁/t,mass_scalar_1²,-mass_scalar_1²+(q₁.q₁)/t²)
  238. 167.71 s gammaloop-nextest-integration> ·denom(2,-q₀+q₃-q₁/t,mass_scalar_1²,
  239. 167.71 s gammaloop-nextest-integration> -mass_scalar_1²+2·(q₀.q₁)/t-2·(q₁.q₃)/t+(q₁.q₁)/t²+(q₀.q₀)
  240. 167.71 s gammaloop-nextest-integration> -2·(q₀.q₃)+(q₃.q₃)
  241. 167.71 s gammaloop-nextest-integration> ))
  242. 167.71 s gammaloop-nextest-integration> span t{span_context=true current=subgraph=3s, topo_order=1, dod=0 given=subgraph=0, topo_order=0, dod=0}
  243. 167.71 s gammaloop-nextest-integration> [2026-08-27 10:07:50.499] @approx::local_4d [{#uv, #integrated, #rescaled}] DEBUG : Rescaled expanded
  244. 167.71 s gammaloop-nextest-integration> field value
  245. 167.71 s gammaloop-nextest-integration> n_loops 1
  246. 167.71 s gammaloop-nextest-integration> res n-terms: 1, byte size: 723,expr:
  247. 167.71 s gammaloop-nextest-integration> 1/(denom(1,q₁,mUVexp²+t²·mass_scalar_1²,-mUV²+t²·(-mass_scalar_1²+(q₁.q₁)/t²)+t²·mUVexp²)
  248. 167.71 s gammaloop-nextest-integration> ·denom(2,-q₁,mUVexp²+t²·mass_scalar_1²,
  249. 167.71 s gammaloop-nextest-integration> -mUV²
  250. 167.71 s gammaloop-nextest-integration> +t²
  251. 167.71 s gammaloop-nextest-integration> ·(-mass_scalar_1²+2·(q₀.q₁)/t-2·(q₁.q₃)/t+(q₁.q₁)/t²+(q₀.q₀)
  252. 167.71 s gammaloop-nextest-integration> -2·(q₀.q₃)+(q₃.q₃)
  253. 167.71 s gammaloop-nextest-integration> )
  254. 167.71 s gammaloop-nextest-integration> +t²·mUVexp²
  255. 167.71 s gammaloop-nextest-integration> ))
  256. 167.71 s gammaloop-nextest-integration> span t{span_context=true current=subgraph=3s, topo_order=1, dod=0 given=subgraph=0, topo_order=0, dod=0}
  257. 167.71 s gammaloop-nextest-integration> [2026-08-27 10:07:50.500] @approx::local_4d [{#uv, #integrated, #series}] DEBUG : Series expanded
  258. 167.71 s gammaloop-nextest-integration> field value
  259. 167.71 s gammaloop-nextest-integration> res n-terms: 1, byte size: 223,expr:
  260. 167.71 s gammaloop-nextest-integration> 1/(denom(1,q₁,mUVexp²,-mUV²+(q₁.q₁))·denom(2,-q₁,mUVexp²,-mUV²+(q₁.q₁)))
  261. 167.71 s gammaloop-nextest-integration> span t{span_context=true current=subgraph=3s, topo_order=1, dod=0 given=subgraph=0, topo_order=0, dod=0}
  262. 167.71 s gammaloop-nextest-integration> [2026-08-27 10:07:50.500] @approx::local_4d [{#uv, #integrated, #series}] DEBUG : Evaluated at t = 1
  263. 167.71 s gammaloop-nextest-integration> field value
  264. 167.71 s gammaloop-nextest-integration> res n-terms: 1, byte size: 223,expr:
  265. 167.71 s gammaloop-nextest-integration> 1/(denom(1,q₁,mUVexp²,-mUV²+(q₁.q₁))·denom(2,-q₁,mUVexp²,-mUV²+(q₁.q₁)))
  266. 167.71 s gammaloop-nextest-integration> span t{span_context=true current=subgraph=3s, topo_order=1, dod=0 given=subgraph=0, topo_order=0, dod=0}
  267. 167.71 s gammaloop-nextest-integration> [2026-08-27 10:07:50.500] @approx::local_4d [{#uv, #collect, #integrated}] DEBUG : After gamma chain collection
  268. 167.71 s gammaloop-nextest-integration> field value
  269. 167.71 s gammaloop-nextest-integration> expr n-terms: 1, byte size: 223,expr:
  270. 167.71 s gammaloop-nextest-integration> 1/(denom(1,q₁,mUVexp²,-mUV²+(q₁.q₁))·denom(2,-q₁,mUVexp²,-mUV²+(q₁.q₁)))
  271. 167.71 s gammaloop-nextest-integration> span t{span_context=true current=subgraph=3s, topo_order=1, dod=0 given=subgraph=0, topo_order=0, dod=0}
  272. 167.71 s gammaloop-nextest-integration> [2026-08-27 10:07:50.500] @approx::local_4d [{#profile, #uv, #collect, #integrated, #start, #trace}] DEBUG : After gamma schoonschip
  273. 167.71 s gammaloop-nextest-integration> field value
  274. 167.71 s gammaloop-nextest-integration> expr n-terms: 1, byte size: 223,expr:
  275. 167.71 s gammaloop-nextest-integration> 1/(denom(1,q₁,mUVexp²,-mUV²+(q₁.q₁))·denom(2,-q₁,mUVexp²,-mUV²+(q₁.q₁)))
  276. 167.71 s gammaloop-nextest-integration> span t{span_context=true current=subgraph=3s, topo_order=1, dod=0 given=subgraph=0, topo_order=0, dod=0}
  277. 167.71 s gammaloop-nextest-integration> [2026-08-27 10:07:50.500] @approx::local_4d [{#profile, #uv, #collect, #integrated, #start, #trace}] DEBUG : After gamma collection
  278. 167.71 s gammaloop-nextest-integration> field value
  279. 167.71 s gammaloop-nextest-integration> expr n-terms: 1, byte size: 223,expr:
  280. 167.71 s gammaloop-nextest-integration> 1/(denom(1,q₁,mUVexp²,-mUV²+(q₁.q₁))·denom(2,-q₁,mUVexp²,-mUV²+(q₁.q₁)))
  281. 167.71 s gammaloop-nextest-integration> span t{span_context=true current=subgraph=3s, topo_order=1, dod=0 given=subgraph=0, topo_order=0, dod=0}
  282. 167.71 s gammaloop-nextest-integration> [2026-08-27 10:07:50.500] @approx::local_4d [{#profile, #uv, #gamma, #integrated, #start, #trace, #vakint}] DEBUG : After gamma simplification
  283. 167.71 s gammaloop-nextest-integration> field value
  284. 167.71 s gammaloop-nextest-integration> expr n-terms: 1, byte size: 223,expr:
  285. 167.71 s gammaloop-nextest-integration> 1/(denom(1,q₁,mUVexp²,-mUV²+(q₁.q₁))·denom(2,-q₁,mUVexp²,-mUV²+(q₁.q₁)))
  286. 167.71 s gammaloop-nextest-integration> span t{span_context=true current=subgraph=3s, topo_order=1, dod=0 given=subgraph=0, topo_order=0, dod=0}
  287. 167.71 s gammaloop-nextest-integration> [2026-08-27 10:07:50.501] @approx::local_4d [{#profile, #uv, #integrated, #schoonschip, #start, #trace, #vakint}] DEBUG : After Schoonschip net
  288. 167.71 s gammaloop-nextest-integration> field value
  289. 167.71 s gammaloop-nextest-integration> expr n-terms: 1, byte size: 223,expr:
  290. 167.71 s gammaloop-nextest-integration> 1/(denom(1,q₁,mUVexp²,-mUV²+(q₁.q₁))·denom(2,-q₁,mUVexp²,-mUV²+(q₁.q₁)))
  291. 167.71 s gammaloop-nextest-integration> ... omitted 20095 more lines; see full nextest output above
  292. 167.71 s gammaloop-nextest-integration>
  293. 167.71 s gammaloop-nextest-integration> 9. gammaloop-integration-tests::uv::se1l_uv
  294. 167.71 s gammaloop-nextest-integration> failure: test failure with exit code 101
  295. 167.71 s gammaloop-nextest-integration> system-out
  296. 167.71 s gammaloop-nextest-integration> running 1 test
  297. 167.71 s gammaloop-nextest-integration> test se1l_uv has been running for over 60 seconds
  298. 167.71 s gammaloop-nextest-integration> +------+-----------------+---------+--------+----------+-----------------------------------------------------------------------------------------------------------------------+-------+
  299. 167.71 s gammaloop-nextest-integration> | case | check | graph | status | sigma | threshold | error |
  300. 167.71 s gammaloop-nextest-integration> +------+-----------------+---------+--------+----------+-----------------------------------------------------------------------------------------------------------------------+-------+
  301. 167.71 s gammaloop-nextest-integration> | se1l | uv_profile | - | FAIL | - | - | - |
  302. 167.71 s gammaloop-nextest-integration> +------+-----------------+---------+--------+----------+-----------------------------------------------------------------------------------------------------------------------+-------+
  303. 167.71 s gammaloop-nextest-integration> | se1l | m_uv.inspect | inspect | pass | - | best inspect relative delta 1.097e-1 >= 1000*accuracy 1.000e-7 (accuracy=1.000e-10, exponent=+2.0, seed=1, probes=10) | - |
  304. 167.71 s gammaloop-nextest-integration> +------+-----------------+---------+--------+----------+-----------------------------------------------------------------------------------------------------------------------+-------+
  305. 167.71 s gammaloop-nextest-integration> | se1l | m_uv.integrated | se1l | pass | 0.1sigma | compatible within 2sigma | - |
  306. 167.71 s gammaloop-nextest-integration> +------+-----------------+---------+--------+----------+-----------------------------------------------------------------------------------------------------------------------+-------+
  307. 167.71 s gammaloop-nextest-integration> | se1l | rls.inspect | inspect | pass | - | best inspect relative delta 4.499e-2 >= 1000*accuracy 1.000e-7 (accuracy=1.000e-10, exponent=+2.0, seed=1, probes=10) | - |
  308. 167.71 s gammaloop-nextest-integration> +------+-----------------+---------+--------+----------+-----------------------------------------------------------------------------------------------------------------------+-------+
  309. 167.71 s gammaloop-nextest-integration> | se1l | rls.integrated | se1l | pass | 0.0sigma | compatible within 2sigma | - |
  310. 167.71 s gammaloop-nextest-integration> +------+-----------------+---------+--------+----------+-----------------------------------------------------------------------------------------------------------------------+-------+
  311. 167.71 s gammaloop-nextest-integration> | se1l | mu_r.inspect | inspect | pass | - | best inspect relative delta 1.424e-1 >= 1000*accuracy 1.000e-7 (accuracy=1.000e-10, exponent=+2.0, seed=1, probes=10) | - |
  312. 167.71 s gammaloop-nextest-integration> +------+-----------------+---------+--------+----------+-----------------------------------------------------------------------------------------------------------------------+-------+
  313. 167.71 s gammaloop-nextest-integration> | se1l | target | - | pass | - | 2sigma | - |
  314. 167.71 s gammaloop-nextest-integration> +------+-----------------+---------+--------+----------+-----------------------------------------------------------------------------------------------------------------------+-------+
  315. 167.71 s gammaloop-nextest-integration> test se1l_uv ... FAILED
  316. 167.71 s gammaloop-nextest-integration>
  317. 167.71 s gammaloop-nextest-integration> failures:
  318. 167.71 s gammaloop-nextest-integration>
  319. 167.71 s gammaloop-nextest-integration> failures:
  320. 167.71 s gammaloop-nextest-integration> se1l_uv
  321. 167.71 s gammaloop-nextest-integration>
  322. 167.71 s gammaloop-nextest-integration> test result: FAILED. 0 passed; 1 failed; 0 ignored; 0 measured; 24 filtered out; finished in 124.10s
  323. 167.71 s gammaloop-nextest-integration> system-err
  324. 167.71 s gammaloop-nextest-integration> [2026-08-27 10:07:49.742] @gammaloop_api::se... INFO : Running command run generate
  325. 167.71 s gammaloop-nextest-integration> [2026-08-27 10:07:49.742] @gammaloop_api::se... INFO : Starting command block generate
  326. 167.71 s gammaloop-nextest-integration> [2026-08-27 10:07:49.742] @gammaloop_api::se... INFO : Running command import model sm-default
  327. 167.71 s gammaloop-nextest-integration> [2026-08-27 10:07:49.742] @import::model INFO : Loading built-in JSON model sm-default
  328. 167.71 s gammaloop-nextest-integration> [2026-08-27 10:07:49.865] @gammalooprs::model INFO : The following 11 external parameters were forced to zero by the restriction card:
  329. 167.71 s gammaloop-nextest-integration> lamWS, AWS, rhoWS, etaWS, ymc, yme, ymm, MC, Me, MM, WTau
  330. 167.71 s gammaloop-nextest-integration> [2026-08-27 10:07:49.865] @gammalooprs::model INFO : The following 34 vertex rules were removed by the restriction card:
  331. 167.71 s gammaloop-nextest-integration> V_82 -> (c~, d, G+) | V_83 -> (t~, d, G+) | V_84 -> (c~, s, G+) | V_85 -> (t~, s, G+) | V_86 -> (u~, b, G+) | V_87 -> (c~, b, G+) | V_90 -> (c~, d, W+) | V_91 -> (t~, d, W+) | V_92 -> (u~, s, W+) | V_94 -> (t~, s, W+) | V_95 -> (u~, b, W+) | V_96 -> (c~, b, W+) | V_101 -> (e+, e-, G0) | V_102 -> (mu+, mu-, G0) | V_104 -> (e+, e-, H) | V_105 -> (mu+, mu-, H) | V_110 -> (ve~, e-, G+) | V_111 -> (vm~, mu-, G+) | V_116 -> (b~, u, G-) | V_117 -> (d~, c, G-) | V_118 -> (s~, c, G-) | V_119 -> (b~, c, G-) | V_120 -> (d~, t, G-) | V_121 -> (s~, t, G-) | V_124 -> (s~, u, W-) | V_125 -> (b~, u, W-) | V_126 -> (d~, c, W-) | V_128 -> (b~, c, W-) | V_129 -> (d~, t, W-) | V_130 -> (s~, t, W-) | V_138 -> (c~, c, G0) | V_140 -> (c~, c, H) | V_145 -> (e+, ve, G-) | V_146 -> (mu+, vm, G-)
  332. 167.71 s gammaloop-nextest-integration> [2026-08-27 10:07:49.865] @gammalooprs::model INFO : The following 36 couplings were removed by the restriction card:
  333. 167.71 s gammaloop-nextest-integration> GC_13, GC_14, GC_16, GC_17, GC_18, GC_19, GC_20, GC_22, GC_23, GC_24, GC_25, GC_26, GC_28, GC_29, GC_42, GC_43, GC_44, GC_46, GC_47, GC_48, GC_84, GC_85, GC_86, GC_87, GC_88, GC_89, GC_90, GC_91, GC_92, GC_93, GC_101, GC_102, GC_103, GC_105, GC_106, GC_107
  334. 167.71 s gammaloop-nextest-integration> [2026-08-27 10:07:49.866] @gammaloop_api::se... INFO : Running command remove processes
  335. 167.71 s gammaloop-nextest-integration> [2026-08-27 10:07:49.866] @gammaloop_api::se... INFO : Running command set global kv global.generation.uv.generate_integrated=true
  336. 167.71 s gammaloop-nextest-integration> [2026-08-27 10:07:49.866] @gammaloop_api::se... INFO : Running command import graphs ./tests/resources/graphs/uv_tests/se1l.dot -p se1l -i se1l
  337. 167.71 s gammaloop-nextest-integration> [2026-08-27 10:07:49.866] @commands::import INFO : Loading graphs from '/build/source/tests/resources/graphs/uv_tests/se1l.dot'
  338. 167.71 s gammaloop-nextest-integration> [2026-08-27 10:07:49.881] @gammaloop_api::se... INFO : Running command generate existing -p se1l -i se1l
  339. 167.71 s gammaloop-nextest-integration> [2026-08-27 10:07:52.471] @commands::generate INFO :
  340. 167.71 s gammaloop-nextest-integration> Integrand generation summary
  341. 167.71 s gammaloop-nextest-integration> peak RAM 90.29 MiB | cores 1
  342. 167.71 s gammaloop-nextest-integration> ╭───────────┬───────┬─────────┬─────────────┬──────────────┬────────────────┬─────────────╮
  343. 167.71 s gammaloop-nextest-integration> │ integrand │ graph │ # evals │ expr build │ spenso │ symbolica eval │ compile │
  344. 167.71 s gammaloop-nextest-integration> ├───────────┼───────┼─────────┼─────────────┼──────────────┼────────────────┼─────────────┤
  345. 167.71 s gammaloop-nextest-integration> │ se1l │ se1l │ 5 │ 2.25s (88%) │ 108ms (4.2%) │ 184ms (7.3%) │ 0ms (0.00%) │
  346. 167.71 s gammaloop-nextest-integration> ├───────────┼───────┼─────────┼─────────────┼──────────────┼────────────────┼─────────────┤
  347. 167.71 s gammaloop-nextest-integration> │ Total │ │ 5 │ 2.25s (88%) │ 108ms (4.2%) │ 184ms (7.3%) │ 0ms (0.00%) │
  348. 167.71 s gammaloop-nextest-integration> ╰───────────┴───────┴─────────┴─────────────┴──────────────┴────────────────┴─────────────╯
  349. 167.71 s gammaloop-nextest-integration> [2026-08-27 10:07:52.472] @gammaloop_api::se... INFO : Running command set process -p se1l -i se1l kv general.m_uv=0.2
  350. 167.71 s gammaloop-nextest-integration> [2026-08-27 10:07:52.473] @gammaloop_api::se... INFO : Running command set process -p se1l -i se1l kv general.mu_r=0.2
  351. 167.71 s gammaloop-nextest-integration> [2026-08-27 10:07:52.474] @gammaloop_api::se... INFO : Running command set process -p se1l -i se1l kv general.renormalization_localization_scale=0.2
  352. 167.71 s gammaloop-nextest-integration> [2026-08-27 10:07:52.482] @gammaloop_api::se... INFO : Running command duplicate integrand -p se1l -i se1l --output_process_name se1l --output_integrand_name se1l_muv_shifted
  353. 167.71 s gammaloop-nextest-integration> [2026-08-27 10:07:52.483] @gammaloop_api::se... INFO : Running command set process -p se1l -i se1l_muv_shifted kv general.m_uv=0.5
  354. 167.71 s gammaloop-nextest-integration> [2026-08-27 10:07:52.484] @gammaloop_api::se... INFO : Running command duplicate integrand -p se1l -i se1l --output_process_name se1l --output_integrand_name se1l_rls_shifted
  355. 167.71 s gammaloop-nextest-integration> [2026-08-27 10:07:52.493] @gammaloop_api::se... INFO : Running command set process -p se1l -i se1l_rls_shifted kv general.renormalization_localization_scale=1
  356. 167.71 s gammaloop-nextest-integration> [2026-08-27 10:07:52.494] @gammaloop_api::se... INFO : Running command duplicate integrand -p se1l -i se1l --output_process_name se1l --output_integrand_name se1l_mur_shifted
  357. 167.71 s gammaloop-nextest-integration> [2026-08-27 10:07:52.499] @gammaloop_api::se... INFO : Running command set process -p se1l -i se1l_mur_shifted kv general.mu_r=0.8
  358. 167.71 s gammaloop-nextest-integration> [2026-08-27 10:07:52.518] @process::amplitude WARNING : External state 0 ('g', PDG 21, helicity +) is off shell: p^2 = +2.5e5, expected m^2 = +0e0 (|Δ| = +2.5e5). Fixed-helicity spinor/vector/tensor external states may be ill-defined at this kinematic point.
  359. 167.71 s gammaloop-nextest-integration> field value
  360. 167.71 s gammaloop-nextest-integration> span warm_up{integrand.name=se1l}
  361. 167.71 s gammaloop-nextest-integration> [2026-08-27 10:07:52.518] @process::amplitude WARNING : External state 1 ('g', PDG 21, helicity -) is off shell: p^2 = +2.5e5, expected m^2 = +0e0 (|Δ| = +2.5e5). Fixed-helicity spinor/vector/tensor external states may be ill-defined at this kinematic point.
  362. 167.71 s gammaloop-nextest-integration> field value
  363. 167.71 s gammaloop-nextest-integration> span warm_up{integrand.name=se1l}
  364. 167.71 s gammaloop-nextest-integration> [2026-08-27 10:07:52.518] @process::amplitude INFO : Input is above threshold: 1 existing threshold E-surfaces across 1/1 graph groups
  365. 167.71 s gammaloop-nextest-integration> field value
  366. 167.71 s gammaloop-nextest-integration> existing_esurfaces 1
  367. 167.71 s gammaloop-nextest-integration> group_count 1
  368. 167.71 s gammaloop-nextest-integration> groups_above_threshold 1
  369. 167.71 s gammaloop-nextest-integration> integrand se1l
  370. 167.71 s gammaloop-nextest-integration> span warm_up{integrand.name=se1l}
  371. 167.71 s gammaloop-nextest-integration> threshold_status above threshold
  372. 167.71 s gammaloop-nextest-integration> [2026-08-27 10:07:52.518] @process::amplitude INFO : overlap structure of group 0: [1: [0(2,3)]]
  373. 167.71 s gammaloop-nextest-integration> field value
  374. 167.71 s gammaloop-nextest-integration> span warm_up{integrand.name=se1l}
  375. 167.71 s gammaloop-nextest-integration> [2026-08-27 10:07:53.426] @commands::profile INFO :
  376. 167.71 s gammaloop-nextest-integration> ╭───────┬──────┬──────────┬───────┬─────┬──────────┬───────────╮
  377. 167.71 s gammaloop-nextest-integration> │ fixed │ → ∞ │ slope │ r2 │ DOD │ bare DOD │ inspect │
  378. 167.71 s gammaloop-nextest-integration> ├───────┼──────┼──────────┼───────┼─────┼──────────┼───────────┤
  379. 167.71 s gammaloop-nextest-integration> │ {} │ {e3} │ 1.639236 │ 0.904 │ 2 │ 2 │ arb retry │
  380. 167.71 s gammaloop-nextest-integration> │ {} │ {e2} │ 1.698834 │ 0.902 │ 2 │ 2 │ arb retry │
  381. 167.71 s gammaloop-nextest-integration> ╰───────┴──────┴──────────┴───────┴─────┴──────────┴───────────╯
  382. 167.71 s gammaloop-nextest-integration> [2026-08-27 10:07:53.426] @commands::profile INFO :
  383. 167.71 s gammaloop-nextest-integration> ╭───────┬──────┬─────────────┬──────────┬───────┬─────┬──────────┬───────────╮
  384. 167.71 s gammaloop-nextest-integration> │ fixed │ → ∞ │ orientation │ slope │ r2 │ DOD │ bare DOD │ inspect │
  385. 167.71 s gammaloop-nextest-integration> ├───────┼──────┼─────────────┼──────────┼───────┼─────┼──────────┼───────────┤
  386. 167.71 s gammaloop-nextest-integration> │ {} │ {e3} │ 00-+ │ 0.343429 │ 0.145 │ 0 │ 2 │ arb retry │
  387. 167.71 s gammaloop-nextest-integration> │ {} │ {e3} │ 00+- │ 0.342577 │ 0.135 │ 0 │ 2 │ arb retry │
  388. 167.71 s gammaloop-nextest-integration> │ {} │ {e2} │ 00-+ │ 0.385975 │ 0.161 │ 0 │ 2 │ arb retry │
  389. 167.71 s gammaloop-nextest-integration> │ {} │ {e2} │ 00+- │ 0.384920 │ 0.192 │ 0 │ 2 │ arb retry │
  390. 167.71 s gammaloop-nextest-integration> ╰───────┴──────┴─────────────┴──────────┴───────┴─────┴──────────┴───────────╯
  391. 167.71 s gammaloop-nextest-integration> [2026-08-27 10:07:53.427] @gammaloop_api::se... INFO : Running command set process kv integrator.target_relative_accuracy=0.001 integrator.n_increase=0 integrator.n_start=50000 integrator.n_max=400000 integrator.seed=1337
  392. 167.71 s gammaloop-nextest-integration> [2026-08-27 10:07:53.428] @commands::integrate INFO : Created workspace directory at /build/source/tests/artifacts/se1l/integration_workspace_se1l
  393. 167.71 s gammaloop-nextest-integration> [2026-08-27 10:07:53.516] @commands::integrate INFO : No integration state found, starting new integration
  394. 167.71 s gammaloop-nextest-integration> [2026-08-27 10:07:53.516] @commands::integrate INFO : Gammaloop now integrates se1l@se1l, se1l@se1l_muv_shifted, se1l@se1l_rls_shifted
  395. 167.71 s gammaloop-nextest-integration> [2026-08-27 10:07:53.517] @process::amplitude WARNING : External state 0 ('g', PDG 21, helicity +) is off shell: p^2 = +2.5e5, expected m^2 = +0e0 (|Δ| = +2.5e5). Fixed-helicity spinor/vector/tensor external states may be ill-defined at this kinematic point.
  396. 167.71 s gammaloop-nextest-integration> field value
  397. 167.71 s gammaloop-nextest-integration> span warm_up{integrand.name=se1l}
  398. 167.71 s gammaloop-nextest-integration> [2026-08-27 10:07:53.517] @process::amplitude WARNING : External state 1 ('g', PDG 21, helicity -) is off shell: p^2 = +2.5e5, expected m^2 = +0e0 (|Δ| = +2.5e5). Fixed-helicity spinor/vector/tensor external states may be ill-defined at this kinematic point.
  399. 167.71 s gammaloop-nextest-integration> field value
  400. 167.71 s gammaloop-nextest-integration> span warm_up{integrand.name=se1l}
  401. 167.71 s gammaloop-nextest-integration> [2026-08-27 10:07:53.517] @process::amplitude INFO : Input is above threshold: 1 existing threshold E-surfaces across 1/1 graph groups
  402. 167.71 s gammaloop-nextest-integration> field value
  403. 167.71 s gammaloop-nextest-integration> existing_esurfaces 1
  404. 167.71 s gammaloop-nextest-integration> group_count 1
  405. 167.71 s gammaloop-nextest-integration> groups_above_threshold 1
  406. 167.71 s gammaloop-nextest-integration> integrand se1l
  407. 167.71 s gammaloop-nextest-integration> span warm_up{integrand.name=se1l}
  408. 167.71 s gammaloop-nextest-integration> threshold_status above threshold
  409. 167.71 s gammaloop-nextest-integration> [2026-08-27 10:07:53.529] @process::amplitude INFO : overlap structure of group 0: [1: [0(2,3)]]
  410. 167.71 s gammaloop-nextest-integration> field value
  411. 167.71 s gammaloop-nextest-integration> span warm_up{integrand.name=se1l}
  412. 167.71 s gammaloop-nextest-integration> [2026-08-27 10:07:53.530] @process::amplitude WARNING : External state 0 ('g', PDG 21, helicity +) is off shell: p^2 = +2.5e5, expected m^2 = +0e0 (|Δ| = +2.5e5). Fixed-helicity spinor/vector/tensor external states may be ill-defined at this kinematic point.
  413. 167.71 s gammaloop-nextest-integration> field value
  414. 167.71 s gammaloop-nextest-integration> span warm_up{integrand.name=se1l_muv_shifted}
  415. 167.71 s gammaloop-nextest-integration> [2026-08-27 10:07:53.530] @process::amplitude WARNING : External state 1 ('g', PDG 21, helicity -) is off shell: p^2 = +2.5e5, expected m^2 = +0e0 (|Δ| = +2.5e5). Fixed-helicity spinor/vector/tensor external states may be ill-defined at this kinematic point.
  416. 167.71 s gammaloop-nextest-integration> field value
  417. 167.71 s gammaloop-nextest-integration> span warm_up{integrand.name=se1l_muv_shifted}
  418. 167.71 s gammaloop-nextest-integration> [2026-08-27 10:07:53.531] @process::amplitude INFO : Input is above threshold: 1 existing threshold E-surfaces across 1/1 graph groups
  419. 167.71 s gammaloop-nextest-integration> field value
  420. 167.71 s gammaloop-nextest-integration> existing_esurfaces 1
  421. 167.71 s gammaloop-nextest-integration> group_count 1
  422. 167.71 s gammaloop-nextest-integration> groups_above_threshold 1
  423. 167.71 s gammaloop-nextest-integration> integrand se1l_muv_shifted
  424. 167.71 s gammaloop-nextest-integration> span warm_up{integrand.name=se1l_muv_shifted}
  425. 167.71 s gammaloop-nextest-integration> threshold_status above threshold
  426. 167.71 s gammaloop-nextest-integration> [2026-08-27 10:07:53.531] @process::amplitude INFO : overlap structure of group 0: [1: [0(2,3)]]
  427. 167.71 s gammaloop-nextest-integration> field value
  428. 167.71 s gammaloop-nextest-integration> span warm_up{integrand.name=se1l_muv_shifted}
  429. 167.71 s gammaloop-nextest-integration> [2026-08-27 10:07:53.532] @process::amplitude WARNING : External state 0 ('g', PDG 21, helicity +) is off shell: p^2 = +2.5e5, expected m^2 = +0e0 (|Δ| = +2.5e5). Fixed-helicity spinor/vector/tensor external states may be ill-defined at this kinematic point.
  430. 167.71 s gammaloop-nextest-integration> field value
  431. 167.71 s gammaloop-nextest-integration> span warm_up{integrand.name=se1l_rls_shifted}
  432. 167.71 s gammaloop-nextest-integration> [2026-08-27 10:07:53.532] @process::amplitude WARNING : External state 1 ('g', PDG 21, helicity -) is off shell: p^2 = +2.5e5, expected m^2 = +0e0 (|Δ| = +2.5e5). Fixed-helicity spinor/vector/tensor external states may be ill-defined at this kinematic point.
  433. 167.71 s gammaloop-nextest-integration> field value
  434. 167.71 s gammaloop-nextest-integration> span warm_up{integrand.name=se1l_rls_shifted}
  435. 167.71 s gammaloop-nextest-integration> [2026-08-27 10:07:53.532] @process::amplitude INFO : Input is above threshold: 1 existing threshold E-surfaces across 1/1 graph groups
  436. 167.71 s gammaloop-nextest-integration> field value
  437. 167.71 s gammaloop-nextest-integration> existing_esurfaces 1
  438. 167.71 s gammaloop-nextest-integration> group_count 1
  439. 167.71 s gammaloop-nextest-integration> groups_above_threshold 1
  440. 167.71 s gammaloop-nextest-integration> integrand se1l_rls_shifted
  441. 167.71 s gammaloop-nextest-integration> span warm_up{integrand.name=se1l_rls_shifted}
  442. 167.71 s gammaloop-nextest-integration> threshold_status above threshold
  443. 167.71 s gammaloop-nextest-integration> ... omitted 1410 more lines; see full nextest output above
  444. 167.71 s gammaloop-nextest-integration> =========================================
  445. 168.10 s error: Cannot build '/nix/store/8h9hx82zgi6sfhhm31fs0s7q4qa225j3-gammaloop-nextest-integration.drv'.
  446. 168.10 s Reason: builder failed with exit code 100.
  447. 168.10 s Output paths:
  448. 168.10 s /nix/store/ysdxdji6v6hcl8m5v9j2vlz012z5wc1w-gammaloop-nextest-integration
  449. 168.10 s Last 2048 log lines:
  450. 168.10 s > span warm_up{integrand.name=se1l_muv_shifted}
  451. 168.10 s > threshold_status above threshold
  452. 168.10 s > [2026-08-27 10:09:53.397] @process::amplitude INFO : overlap structure of group 0: [1: [0(2,3)]]
  453. 168.10 s > field value
  454. 168.10 s > span warm_up{integrand.name=se1l_muv_shifted}
  455. 168.10 s > [2026-08-27 10:09:53.400] @process::amplitude WARNING : External state 0 ('g', PDG 21, helicity +) is off shell: p^2 = +2.5e5, expected m^2 = +0e0 (|Δ| = +2.5e5). Fixed-helicity spinor/vector/tensor external states may be ill-defined at this kinematic point.
  456. 168.10 s > field value
  457. 168.10 s > span warm_up{integrand.name=se1l}
  458. 168.10 s > [2026-08-27 10:09:53.400] @process::amplitude WARNING : External state 1 ('g', PDG 21, helicity -) is off shell: p^2 = +2.5e5, expected m^2 = +0e0 (|Δ| = +2.5e5). Fixed-helicity spinor/vector/tensor external states may be ill-defined at this kinematic point.
  459. 168.10 s > field value
  460. 168.10 s > span warm_up{integrand.name=se1l}
  461. 168.10 s > [2026-08-27 10:09:53.401] @process::amplitude INFO : Input is above threshold: 1 existing threshold E-surfaces across 1/1 graph groups
  462. 168.10 s > field value
  463. 168.10 s > existing_esurfaces 1
  464. 168.10 s > group_count 1
  465. 168.10 s > groups_above_threshold 1
  466. 168.10 s > integrand se1l
  467. 168.10 s > span warm_up{integrand.name=se1l}
  468. 168.10 s > threshold_status above threshold
  469. 168.10 s > [2026-08-27 10:09:53.401] @process::amplitude INFO : overlap structure of group 0: [1: [0(2,3)]]
  470. 168.10 s > field value
  471. 168.10 s > span warm_up{integrand.name=se1l}
  472. 168.10 s > [2026-08-27 10:09:53.404] @process::amplitude WARNING : External state 0 ('g', PDG 21, helicity +) is off shell: p^2 = +2.5e5, expected m^2 = +0e0 (|Δ| = +2.5e5). Fixed-helicity spinor/vector/tensor external states may be ill-defined at this kinematic point.
  473. 168.10 s > field value
  474. 168.10 s > span warm_up{integrand.name=se1l_muv_shifted}
  475. 168.10 s > [2026-08-27 10:09:53.404] @process::amplitude WARNING : External state 1 ('g', PDG 21, helicity -) is off shell: p^2 = +2.5e5, expected m^2 = +0e0 (|Δ| = +2.5e5). Fixed-helicity spinor/vector/tensor external states may be ill-defined at this kinematic point.
  476. 168.10 s > field value
  477. 168.10 s > span warm_up{integrand.name=se1l_muv_shifted}
  478. 168.10 s > [2026-08-27 10:09:53.404] @process::amplitude INFO : Input is above threshold: 1 existing threshold E-surfaces across 1/1 graph groups
  479. 168.10 s > field value
  480. 168.10 s > existing_esurfaces 1
  481. 168.10 s > group_count 1
  482. 168.10 s > groups_above_threshold 1
  483. 168.10 s > integrand se1l_muv_shifted
  484. 168.10 s > span warm_up{integrand.name=se1l_muv_shifted}
  485. 168.10 s > threshold_status above threshold
  486. 168.10 s > [2026-08-27 10:09:53.404] @process::amplitude INFO : overlap structure of group 0: [1: [0(2,3)]]
  487. 168.10 s > field value
  488. 168.10 s > span warm_up{integrand.name=se1l_muv_shifted}
  489. 168.10 s > [2026-08-27 10:09:53.409] @process::amplitude WARNING : External state 0 ('g', PDG 21, helicity +) is off shell: p^2 = +2.5e5, expected m^2 = +0e0 (|Δ| = +2.5e5). Fixed-helicity spinor/vector/tensor external states may be ill-defined at this kinematic point.
  490. 168.10 s > field value
  491. 168.10 s > span warm_up{integrand.name=se1l}
  492. 168.10 s > [2026-08-27 10:09:53.409] @process::amplitude WARNING : External state 1 ('g', PDG 21, helicity -) is off shell: p^2 = +2.5e5, expected m^2 = +0e0 (|Δ| = +2.5e5). Fixed-helicity spinor/vector/tensor external states may be ill-defined at this kinematic point.
  493. 168.10 s > field value
  494. 168.10 s > span warm_up{integrand.name=se1l}
  495. 168.10 s > [2026-08-27 10:09:53.409] @process::amplitude INFO : Input is above threshold: 1 existing threshold E-surfaces across 1/1 graph groups
  496. 168.10 s > field value
  497. 168.10 s > existing_esurfaces 1
  498. 168.10 s > group_count 1
  499. 168.10 s > groups_above_threshold 1
  500. 168.10 s > integrand se1l
  501. 168.10 s > span warm_up{integrand.name=se1l}
  502. 168.10 s > threshold_status above threshold
  503. 168.10 s > [2026-08-27 10:09:53.409] @process::amplitude INFO : overlap structure of group 0: [1: [0(2,3)]]
  504. 168.10 s > field value
  505. 168.10 s > span warm_up{integrand.name=se1l}
  506. 168.10 s > [2026-08-27 10:09:53.413] @process::amplitude WARNING : External state 0 ('g', PDG 21, helicity +) is off shell: p^2 = +2.5e5, expected m^2 = +0e0 (|Δ| = +2.5e5). Fixed-helicity spinor/vector/tensor external states may be ill-defined at this kinematic point.
  507. 168.10 s > field value
  508. 168.10 s > span warm_up{integrand.name=se1l_muv_shifted}
  509. 168.10 s > [2026-08-27 10:09:53.413] @process::amplitude WARNING : External state 1 ('g', PDG 21, helicity -) is off shell: p^2 = +2.5e5, expected m^2 = +0e0 (|Δ| = +2.5e5). Fixed-helicity spinor/vector/tensor external states may be ill-defined at this kinematic point.
  510. 168.10 s > field value
  511. 168.10 s > span warm_up{integrand.name=se1l_muv_shifted}
  512. 168.10 s > [2026-08-27 10:09:53.413] @process::amplitude INFO : Input is above threshold: 1 existing threshold E-surfaces across 1/1 graph groups
  513. 168.10 s > field value
  514. 168.10 s > existing_esurfaces 1
  515. 168.10 s > group_count 1
  516. 168.10 s > groups_above_threshold 1
  517. 168.10 s > integrand se1l_muv_shifted
  518. 168.10 s > span warm_up{integrand.name=se1l_muv_shifted}
  519. 168.10 s > threshold_status above threshold
  520. 168.10 s > [2026-08-27 10:09:53.413] @process::amplitude INFO : overlap structure of group 0: [1: [0(2,3)]]
  521. 168.10 s > field value
  522. 168.10 s > span warm_up{integrand.name=se1l_muv_shifted}
  523. 168.10 s > [2026-08-27 10:09:53.416] @process::amplitude WARNING : External state 0 ('g', PDG 21, helicity +) is off shell: p^2 = +2.5e5, expected m^2 = +0e0 (|Δ| = +2.5e5). Fixed-helicity spinor/vector/tensor external states may be ill-defined at this kinematic point.
  524. 168.10 s > field value
  525. 168.10 s > span warm_up{integrand.name=se1l}
  526. 168.10 s > [2026-08-27 10:09:53.416] @process::amplitude WARNING : External state 1 ('g', PDG 21, helicity -) is off shell: p^2 = +2.5e5, expected m^2 = +0e0 (|Δ| = +2.5e5). Fixed-helicity spinor/vector/tensor external states may be ill-defined at this kinematic point.
  527. 168.10 s > field value
  528. 168.10 s > span warm_up{integrand.name=se1l}
  529. 168.10 s > [2026-08-27 10:09:53.416] @process::amplitude INFO : Input is above threshold: 1 existing threshold E-surfaces across 1/1 graph groups
  530. 168.10 s > field value
  531. 168.10 s > existing_esurfaces 1
  532. 168.10 s > group_count 1
  533. 168.10 s > groups_above_threshold 1
  534. 168.10 s > integrand se1l
  535. 168.10 s > span warm_up{integrand.name=se1l}
  536. 168.10 s > threshold_status above threshold
  537. 168.10 s > [2026-08-27 10:09:53.416] @process::amplitude INFO : overlap structure of group 0: [1: [0(2,3)]]
  538. 168.10 s > field value
  539. 168.10 s > span warm_up{integrand.name=se1l}
  540. 168.10 s > [2026-08-27 10:09:53.420] @process::amplitude WARNING : External state 0 ('g', PDG 21, helicity +) is off shell: p^2 = +2.5e5, expected m^2 = +0e0 (|Δ| = +2.5e5). Fixed-helicity spinor/vector/tensor external states may be ill-defined at this kinematic point.
  541. 168.10 s > field value
  542. 168.10 s > span warm_up{integrand.name=se1l_muv_shifted}
  543. 168.10 s > [2026-08-27 10:09:53.420] @process::amplitude WARNING : External state 1 ('g', PDG 21, helicity -) is off shell: p^2 = +2.5e5, expected m^2 = +0e0 (|Δ| = +2.5e5). Fixed-helicity spinor/vector/tensor external states may be ill-defined at this kinematic point.
  544. 168.10 s > field value
  545. 168.10 s > span warm_up{integrand.name=se1l_muv_shifted}
  546. 168.10 s > [2026-08-27 10:09:53.420] @process::amplitude INFO : Input is above threshold: 1 existing threshold E-surfaces across 1/1 graph groups
  547. 168.10 s > field value
  548. 168.10 s > existing_esurfaces 1
  549. 168.10 s > group_count 1
  550. 168.10 s > groups_above_threshold 1
  551. 168.10 s > integrand se1l_muv_shifted
  552. 168.10 s > span warm_up{integrand.name=se1l_muv_shifted}
  553. 168.10 s > threshold_status above threshold
  554. 168.10 s > [2026-08-27 10:09:53.420] @process::amplitude INFO : overlap structure of group 0: [1: [0(2,3)]]
  555. 168.10 s > field value
  556. 168.10 s > span warm_up{integrand.name=se1l_muv_shifted}
  557. 168.10 s > [2026-08-27 10:09:53.423] @process::amplitude WARNING : External state 0 ('g', PDG 21, helicity +) is off shell: p^2 = +2.5e5, expected m^2 = +0e0 (|Δ| = +2.5e5). Fixed-helicity spinor/vector/tensor external states may be ill-defined at this kinematic point.
  558. 168.10 s > field value
  559. 168.10 s > span warm_up{integrand.name=se1l}
  560. 168.10 s > [2026-08-27 10:09:53.423] @process::amplitude WARNING : External state 1 ('g', PDG 21, helicity -) is off shell: p^2 = +2.5e5, expected m^2 = +0e0 (|Δ| = +2.5e5). Fixed-helicity spinor/vector/tensor external states may be ill-defined at this kinematic point.
  561. 168.10 s > field value
  562. 168.10 s > span warm_up{integrand.name=se1l}
  563. 168.10 s > [2026-08-27 10:09:53.423] @process::amplitude INFO : Input is above threshold: 1 existing threshold E-surfaces across 1/1 graph groups
  564. 168.10 s > field value
  565. 168.10 s > existing_esurfaces 1
  566. 168.10 s > group_count 1
  567. 168.10 s > groups_above_threshold 1
  568. 168.10 s > integrand se1l
  569. 168.10 s > span warm_up{integrand.name=se1l}
  570. 168.10 s > threshold_status above threshold
  571. 168.10 s > [2026-08-27 10:09:53.423] @process::amplitude INFO : overlap structure of group 0: [1: [0(2,3)]]
  572. 168.10 s > field value
  573. 168.10 s > span warm_up{integrand.name=se1l}
  574. 168.10 s > [2026-08-27 10:09:53.427] @process::amplitude WARNING : External state 0 ('g', PDG 21, helicity +) is off shell: p^2 = +2.5e5, expected m^2 = +0e0 (|Δ| = +2.5e5). Fixed-helicity spinor/vector/tensor external states may be ill-defined at this kinematic point.
  575. 168.10 s > field value
  576. 168.10 s > span warm_up{integrand.name=se1l_rls_shifted}
  577. 168.10 s > [2026-08-27 10:09:53.427] @process::amplitude WARNING : External state 1 ('g', PDG 21, helicity -) is off shell: p^2 = +2.5e5, expected m^2 = +0e0 (|Δ| = +2.5e5). Fixed-helicity spinor/vector/tensor external states may be ill-defined at this kinematic point.
  578. 168.10 s > field value
  579. 168.10 s > span warm_up{integrand.name=se1l_rls_shifted}
  580. 168.10 s > [2026-08-27 10:09:53.427] @process::amplitude INFO : Input is above threshold: 1 existing threshold E-surfaces across 1/1 graph groups
  581. 168.10 s > field value
  582. 168.10 s > existing_esurfaces 1
  583. 168.10 s > group_count 1
  584. 168.10 s > groups_above_threshold 1
  585. 168.10 s > integrand se1l_rls_shifted
  586. 168.10 s > span warm_up{integrand.name=se1l_rls_shifted}
  587. 168.10 s > threshold_status above threshold
  588. 168.10 s > [2026-08-27 10:09:53.427] @process::amplitude INFO : overlap structure of group 0: [1: [0(2,3)]]
  589. 168.10 s > field value
  590. 168.10 s > span warm_up{integrand.name=se1l_rls_shifted}
  591. 168.10 s > [2026-08-27 10:09:53.430] @process::amplitude WARNING : External state 0 ('g', PDG 21, helicity +) is off shell: p^2 = +2.5e5, expected m^2 = +0e0 (|Δ| = +2.5e5). Fixed-helicity spinor/vector/tensor external states may be ill-defined at this kinematic point.
  592. 168.10 s > field value
  593. 168.10 s > span warm_up{integrand.name=se1l}
  594. 168.10 s > [2026-08-27 10:09:53.430] @process::amplitude WARNING : External state 1 ('g', PDG 21, helicity -) is off shell: p^2 = +2.5e5, expected m^2 = +0e0 (|Δ| = +2.5e5). Fixed-helicity spinor/vector/tensor external states may be ill-defined at this kinematic point.
  595. 168.10 s > field value
  596. 168.10 s > span warm_up{integrand.name=se1l}
  597. 168.10 s > [2026-08-27 10:09:53.430] @process::amplitude INFO : Input is above threshold: 1 existing threshold E-surfaces across 1/1 graph groups
  598. 168.10 s > field value
  599. 168.10 s > existing_esurfaces 1
  600. 168.10 s > group_count 1
  601. 168.10 s > groups_above_threshold 1
  602. 168.10 s > integrand se1l
  603. 168.10 s > span warm_up{integrand.name=se1l}
  604. 168.10 s > threshold_status above threshold
  605. 168.10 s > [2026-08-27 10:09:53.430] @process::amplitude INFO : overlap structure of group 0: [1: [0(2,3)]]
  606. 168.10 s > field value
  607. 168.10 s > span warm_up{integrand.name=se1l}
  608. 168.10 s > [2026-08-27 10:09:53.434] @process::amplitude WARNING : External state 0 ('g', PDG 21, helicity +) is off shell: p^2 = +2.5e5, expected m^2 = +0e0 (|Δ| = +2.5e5). Fixed-helicity spinor/vector/tensor external states may be ill-defined at this kinematic point.
  609. 168.10 s > field value
  610. 168.10 s > span warm_up{integrand.name=se1l_rls_shifted}
  611. 168.10 s > [2026-08-27 10:09:53.434] @process::amplitude WARNING : External state 1 ('g', PDG 21, helicity -) is off shell: p^2 = +2.5e5, expected m^2 = +0e0 (|Δ| = +2.5e5). Fixed-helicity spinor/vector/tensor external states may be ill-defined at this kinematic point.
  612. 168.10 s > field value
  613. 168.10 s > span warm_up{integrand.name=se1l_rls_shifted}
  614. 168.10 s > [2026-08-27 10:09:53.434] @process::amplitude INFO : Input is above threshold: 1 existing threshold E-surfaces across 1/1 graph groups
  615. 168.10 s > field value
  616. 168.10 s > existing_esurfaces 1
  617. 168.10 s > group_count 1
  618. 168.10 s > groups_above_threshold 1
  619. 168.10 s > integrand se1l_rls_shifted
  620. 168.10 s > span warm_up{integrand.name=se1l_rls_shifted}
  621. 168.10 s > threshold_status above threshold
  622. 168.10 s > [2026-08-27 10:09:53.434] @process::amplitude INFO : overlap structure of group 0: [1: [0(2,3)]]
  623. 168.10 s > field value
  624. 168.10 s > span warm_up{integrand.name=se1l_rls_shifted}
  625. 168.10 s > [2026-08-27 10:09:53.437] @process::amplitude WARNING : External state 0 ('g', PDG 21, helicity +) is off shell: p^2 = +2.5e5, expected m^2 = +0e0 (|Δ| = +2.5e5). Fixed-helicity spinor/vector/tensor external states may be ill-defined at this kinematic point.
  626. 168.10 s > field value
  627. 168.10 s > span warm_up{integrand.name=se1l}
  628. 168.10 s > [2026-08-27 10:09:53.437] @process::amplitude WARNING : External state 1 ('g', PDG 21, helicity -) is off shell: p^2 = +2.5e5, expected m^2 = +0e0 (|Δ| = +2.5e5). Fixed-helicity spinor/vector/tensor external states may be ill-defined at this kinematic point.
  629. 168.10 s > field value
  630. 168.10 s > span warm_up{integrand.name=se1l}
  631. 168.10 s > [2026-08-27 10:09:53.437] @process::amplitude INFO : Input is above threshold: 1 existing threshold E-surfaces across 1/1 graph groups
  632. 168.10 s > field value
  633. 168.10 s > existing_esurfaces 1
  634. 168.10 s > group_count 1
  635. 168.10 s > groups_above_threshold 1
  636. 168.10 s > integrand se1l
  637. 168.10 s > span warm_up{integrand.name=se1l}
  638. 168.10 s > threshold_status above threshold
  639. 168.10 s > [2026-08-27 10:09:53.437] @process::amplitude INFO : overlap structure of group 0: [1: [0(2,3)]]
  640. 168.10 s > field value
  641. 168.10 s > span warm_up{integrand.name=se1l}
  642. 168.10 s > [2026-08-27 10:09:53.441] @process::amplitude WARNING : External state 0 ('g', PDG 21, helicity +) is off shell: p^2 = +2.5e5, expected m^2 = +0e0 (|Δ| = +2.5e5). Fixed-helicity spinor/vector/tensor external states may be ill-defined at this kinematic point.
  643. 168.10 s > field value
  644. 168.10 s > span warm_up{integrand.name=se1l_rls_shifted}
  645. 168.10 s > [2026-08-27 10:09:53.441] @process::amplitude WARNING : External state 1 ('g', PDG 21, helicity -) is off shell: p^2 = +2.5e5, expected m^2 = +0e0 (|Δ| = +2.5e5). Fixed-helicity spinor/vector/tensor external states may be ill-defined at this kinematic point.
  646. 168.10 s > field value
  647. 168.10 s > span warm_up{integrand.name=se1l_rls_shifted}
  648. 168.10 s > [2026-08-27 10:09:53.441] @process::amplitude INFO : Input is above threshold: 1 existing threshold E-surfaces across 1/1 graph groups
  649. 168.10 s > field value
  650. 168.10 s > existing_esurfaces 1
  651. 168.10 s > group_count 1
  652. 168.10 s > groups_above_threshold 1
  653. 168.10 s > integrand se1l_rls_shifted
  654. 168.10 s > span warm_up{integrand.name=se1l_rls_shifted}
  655. 168.10 s > threshold_status above threshold
  656. 168.10 s > [2026-08-27 10:09:53.441] @process::amplitude INFO : overlap structure of group 0: [1: [0(2,3)]]
  657. 168.10 s > field value
  658. 168.10 s > span warm_up{integrand.name=se1l_rls_shifted}
  659. 168.10 s > [2026-08-27 10:09:53.444] @process::amplitude WARNING : External state 0 ('g', PDG 21, helicity +) is off shell: p^2 = +2.5e5, expected m^2 = +0e0 (|Δ| = +2.5e5). Fixed-helicity spinor/vector/tensor external states may be ill-defined at this kinematic point.
  660. 168.10 s > field value
  661. 168.10 s > span warm_up{integrand.name=se1l}
  662. 168.10 s > [2026-08-27 10:09:53.444] @process::amplitude WARNING : External state 1 ('g', PDG 21, helicity -) is off shell: p^2 = +2.5e5, expected m^2 = +0e0 (|Δ| = +2.5e5). Fixed-helicity spinor/vector/tensor external states may be ill-defined at this kinematic point.
  663. 168.10 s > field value
  664. 168.10 s > span warm_up{integrand.name=se1l}
  665. 168.10 s > [2026-08-27 10:09:53.444] @process::amplitude INFO : Input is above threshold: 1 existing threshold E-surfaces across 1/1 graph groups
  666. 168.10 s > field value
  667. 168.10 s > existing_esurfaces 1
  668. 168.10 s > group_count 1
  669. 168.10 s > groups_above_threshold 1
  670. 168.10 s > integrand se1l
  671. 168.10 s > span warm_up{integrand.name=se1l}
  672. 168.10 s > threshold_status above threshold
  673. 168.10 s > [2026-08-27 10:09:53.444] @process::amplitude INFO : overlap structure of group 0: [1: [0(2,3)]]
  674. 168.10 s > field value
  675. 168.10 s > span warm_up{integrand.name=se1l}
  676. 168.10 s > [2026-08-27 10:09:53.448] @process::amplitude WARNING : External state 0 ('g', PDG 21, helicity +) is off shell: p^2 = +2.5e5, expected m^2 = +0e0 (|Δ| = +2.5e5). Fixed-helicity spinor/vector/tensor external states may be ill-defined at this kinematic point.
  677. 168.10 s > field value
  678. 168.10 s > span warm_up{integrand.name=se1l_rls_shifted}
  679. 168.10 s > [2026-08-27 10:09:53.448] @process::amplitude WARNING : External state 1 ('g', PDG 21, helicity -) is off shell: p^2 = +2.5e5, expected m^2 = +0e0 (|Δ| = +2.5e5). Fixed-helicity spinor/vector/tensor external states may be ill-defined at this kinematic point.
  680. 168.10 s > field value
  681. 168.10 s > span warm_up{integrand.name=se1l_rls_shifted}
  682. 168.10 s > [2026-08-27 10:09:53.448] @process::amplitude INFO : Input is above threshold: 1 existing threshold E-surfaces across 1/1 graph groups
  683. 168.10 s > field value
  684. 168.10 s > existing_esurfaces 1
  685. 168.10 s > group_count 1
  686. 168.10 s > groups_above_threshold 1
  687. 168.10 s > integrand se1l_rls_shifted
  688. 168.10 s > span warm_up{integrand.name=se1l_rls_shifted}
  689. 168.10 s > threshold_status above threshold
  690. 168.10 s > [2026-08-27 10:09:53.448] @process::amplitude INFO : overlap structure of group 0: [1: [0(2,3)]]
  691. 168.10 s > field value
  692. 168.10 s > span warm_up{integrand.name=se1l_rls_shifted}
  693. 168.10 s > [2026-08-27 10:09:53.451] @process::amplitude WARNING : External state 0 ('g', PDG 21, helicity +) is off shell: p^2 = +2.5e5, expected m^2 = +0e0 (|Δ| = +2.5e5). Fixed-helicity spinor/vector/tensor external states may be ill-defined at this kinematic point.
  694. 168.10 s > field value
  695. 168.10 s > span warm_up{integrand.name=se1l}
  696. 168.10 s > [2026-08-27 10:09:53.451] @process::amplitude WARNING : External state 1 ('g', PDG 21, helicity -) is off shell: p^2 = +2.5e5, expected m^2 = +0e0 (|Δ| = +2.5e5). Fixed-helicity spinor/vector/tensor external states may be ill-defined at this kinematic point.
  697. 168.10 s > field value
  698. 168.10 s > span warm_up{integrand.name=se1l}
  699. 168.10 s > [2026-08-27 10:09:53.451] @process::amplitude INFO : Input is above threshold: 1 existing threshold E-surfaces across 1/1 graph groups
  700. 168.10 s > field value
  701. 168.10 s > existing_esurfaces 1
  702. 168.10 s > group_count 1
  703. 168.10 s > groups_above_threshold 1
  704. 168.10 s > integrand se1l
  705. 168.10 s > span warm_up{integrand.name=se1l}
  706. 168.10 s > threshold_status above threshold
  707. 168.10 s > [2026-08-27 10:09:53.451] @process::amplitude INFO : overlap structure of group 0: [1: [0(2,3)]]
  708. 168.10 s > field value
  709. 168.10 s > span warm_up{integrand.name=se1l}
  710. 168.10 s > [2026-08-27 10:09:53.455] @process::amplitude WARNING : External state 0 ('g', PDG 21, helicity +) is off shell: p^2 = +2.5e5, expected m^2 = +0e0 (|Δ| = +2.5e5). Fixed-helicity spinor/vector/tensor external states may be ill-defined at this kinematic point.
  711. 168.10 s > field value
  712. 168.10 s > span warm_up{integrand.name=se1l_rls_shifted}
  713. 168.10 s > [2026-08-27 10:09:53.455] @process::amplitude WARNING : External state 1 ('g', PDG 21, helicity -) is off shell: p^2 = +2.5e5, expected m^2 = +0e0 (|Δ| = +2.5e5). Fixed-helicity spinor/vector/tensor external states may be ill-defined at this kinematic point.
  714. 168.10 s > field value
  715. 168.10 s > span warm_up{integrand.name=se1l_rls_shifted}
  716. 168.10 s > [2026-08-27 10:09:53.455] @process::amplitude INFO : Input is above threshold: 1 existing threshold E-surfaces across 1/1 graph groups
  717. 168.10 s > field value
  718. 168.10 s > existing_esurfaces 1
  719. 168.10 s > group_count 1
  720. 168.10 s > groups_above_threshold 1
  721. 168.10 s > integrand se1l_rls_shifted
  722. 168.10 s > span warm_up{integrand.name=se1l_rls_shifted}
  723. 168.10 s > threshold_status above threshold
  724. 168.10 s > [2026-08-27 10:09:53.455] @process::amplitude INFO : overlap structure of group 0: [1: [0(2,3)]]
  725. 168.10 s > field value
  726. 168.10 s > span warm_up{integrand.name=se1l_rls_shifted}
  727. 168.10 s > [2026-08-27 10:09:53.458] @process::amplitude WARNING : External state 0 ('g', PDG 21, helicity +) is off shell: p^2 = +2.5e5, expected m^2 = +0e0 (|Δ| = +2.5e5). Fixed-helicity spinor/vector/tensor external states may be ill-defined at this kinematic point.
  728. 168.10 s > field value
  729. 168.10 s > span warm_up{integrand.name=se1l}
  730. 168.10 s > [2026-08-27 10:09:53.458] @process::amplitude WARNING : External state 1 ('g', PDG 21, helicity -) is off shell: p^2 = +2.5e5, expected m^2 = +0e0 (|Δ| = +2.5e5). Fixed-helicity spinor/vector/tensor external states may be ill-defined at this kinematic point.
  731. 168.10 s > field value
  732. 168.10 s > span warm_up{integrand.name=se1l}
  733. 168.10 s > [2026-08-27 10:09:53.458] @process::amplitude INFO : Input is above threshold: 1 existing threshold E-surfaces across 1/1 graph groups
  734. 168.10 s > field value
  735. 168.10 s > existing_esurfaces 1
  736. 168.10 s > group_count 1
  737. 168.10 s > groups_above_threshold 1
  738. 168.10 s > integrand se1l
  739. 168.10 s > span warm_up{integrand.name=se1l}
  740. 168.10 s > threshold_status above threshold
  741. 168.10 s > [2026-08-27 10:09:53.458] @process::amplitude INFO : overlap structure of group 0: [1: [0(2,3)]]
  742. 168.10 s > field value
  743. 168.10 s > span warm_up{integrand.name=se1l}
  744. 168.10 s > [2026-08-27 10:09:53.461] @process::amplitude WARNING : External state 0 ('g', PDG 21, helicity +) is off shell: p^2 = +2.5e5, expected m^2 = +0e0 (|Δ| = +2.5e5). Fixed-helicity spinor/vector/tensor external states may be ill-defined at this kinematic point.
  745. 168.10 s > field value
  746. 168.10 s > span warm_up{integrand.name=se1l_rls_shifted}
  747. 168.10 s > [2026-08-27 10:09:53.462] @process::amplitude WARNING : External state 1 ('g', PDG 21, helicity -) is off shell: p^2 = +2.5e5, expected m^2 = +0e0 (|Δ| = +2.5e5). Fixed-helicity spinor/vector/tensor external states may be ill-defined at this kinematic point.
  748. 168.10 s > field value
  749. 168.10 s > span warm_up{integrand.name=se1l_rls_shifted}
  750. 168.10 s > [2026-08-27 10:09:53.462] @process::amplitude INFO : Input is above threshold: 1 existing threshold E-surfaces across 1/1 graph groups
  751. 168.10 s > field value
  752. 168.10 s > existing_esurfaces 1
  753. 168.10 s > group_count 1
  754. 168.10 s > groups_above_threshold 1
  755. 168.10 s > integrand se1l_rls_shifted
  756. 168.10 s > span warm_up{integrand.name=se1l_rls_shifted}
  757. 168.10 s > threshold_status above threshold
  758. 168.10 s > [2026-08-27 10:09:53.462] @process::amplitude INFO : overlap structure of group 0: [1: [0(2,3)]]
  759. 168.10 s > field value
  760. 168.10 s > span warm_up{integrand.name=se1l_rls_shifted}
  761. 168.10 s > [2026-08-27 10:09:53.465] @process::amplitude WARNING : External state 0 ('g', PDG 21, helicity +) is off shell: p^2 = +2.5e5, expected m^2 = +0e0 (|Δ| = +2.5e5). Fixed-helicity spinor/vector/tensor external states may be ill-defined at this kinematic point.
  762. 168.10 s > field value
  763. 168.10 s > span warm_up{integrand.name=se1l}
  764. 168.10 s > [2026-08-27 10:09:53.465] @process::amplitude WARNING : External state 1 ('g', PDG 21, helicity -) is off shell: p^2 = +2.5e5, expected m^2 = +0e0 (|Δ| = +2.5e5). Fixed-helicity spinor/vector/tensor external states may be ill-defined at this kinematic point.
  765. 168.10 s > field value
  766. 168.10 s > span warm_up{integrand.name=se1l}
  767. 168.10 s > [2026-08-27 10:09:53.465] @process::amplitude INFO : Input is above threshold: 1 existing threshold E-surfaces across 1/1 graph groups
  768. 168.10 s > field value
  769. 168.10 s > existing_esurfaces 1
  770. 168.10 s > group_count 1
  771. 168.10 s > groups_above_threshold 1
  772. 168.10 s > integrand se1l
  773. 168.10 s > span warm_up{integrand.name=se1l}
  774. 168.10 s > threshold_status above threshold
  775. 168.10 s > [2026-08-27 10:09:53.465] @process::amplitude INFO : overlap structure of group 0: [1: [0(2,3)]]
  776. 168.10 s > field value
  777. 168.10 s > span warm_up{integrand.name=se1l}
  778. 168.10 s > [2026-08-27 10:09:53.469] @process::amplitude WARNING : External state 0 ('g', PDG 21, helicity +) is off shell: p^2 = +2.5e5, expected m^2 = +0e0 (|Δ| = +2.5e5). Fixed-helicity spinor/vector/tensor external states may be ill-defined at this kinematic point.
  779. 168.10 s > field value
  780. 168.10 s > span warm_up{integrand.name=se1l_rls_shifted}
  781. 168.10 s > [2026-08-27 10:09:53.469] @process::amplitude WARNING : External state 1 ('g', PDG 21, helicity -) is off shell: p^2 = +2.5e5, expected m^2 = +0e0 (|Δ| = +2.5e5). Fixed-helicity spinor/vector/tensor external states may be ill-defined at this kinematic point.
  782. 168.10 s > field value
  783. 168.10 s > span warm_up{integrand.name=se1l_rls_shifted}
  784. 168.10 s > [2026-08-27 10:09:53.469] @process::amplitude INFO : Input is above threshold: 1 existing threshold E-surfaces across 1/1 graph groups
  785. 168.10 s > field value
  786. 168.10 s > existing_esurfaces 1
  787. 168.10 s > group_count 1
  788. 168.10 s > groups_above_threshold 1
  789. 168.10 s > integrand se1l_rls_shifted
  790. 168.10 s > span warm_up{integrand.name=se1l_rls_shifted}
  791. 168.10 s > threshold_status above threshold
  792. 168.10 s > [2026-08-27 10:09:53.469] @process::amplitude INFO : overlap structure of group 0: [1: [0(2,3)]]
  793. 168.10 s > field value
  794. 168.10 s > span warm_up{integrand.name=se1l_rls_shifted}
  795. 168.10 s > [2026-08-27 10:09:53.472] @process::amplitude WARNING : External state 0 ('g', PDG 21, helicity +) is off shell: p^2 = +2.5e5, expected m^2 = +0e0 (|Δ| = +2.5e5). Fixed-helicity spinor/vector/tensor external states may be ill-defined at this kinematic point.
  796. 168.10 s > field value
  797. 168.10 s > span warm_up{integrand.name=se1l}
  798. 168.10 s > [2026-08-27 10:09:53.472] @process::amplitude WARNING : External state 1 ('g', PDG 21, helicity -) is off shell: p^2 = +2.5e5, expected m^2 = +0e0 (|Δ| = +2.5e5). Fixed-helicity spinor/vector/tensor external states may be ill-defined at this kinematic point.
  799. 168.10 s > field value
  800. 168.10 s > span warm_up{integrand.name=se1l}
  801. 168.10 s > [2026-08-27 10:09:53.472] @process::amplitude INFO : Input is above threshold: 1 existing threshold E-surfaces across 1/1 graph groups
  802. 168.10 s > field value
  803. 168.10 s > existing_esurfaces 1
  804. 168.10 s > group_count 1
  805. 168.10 s > groups_above_threshold 1
  806. 168.10 s > integrand se1l
  807. 168.10 s > span warm_up{integrand.name=se1l}
  808. 168.10 s > threshold_status above threshold
  809. 168.10 s > [2026-08-27 10:09:53.472] @process::amplitude INFO : overlap structure of group 0: [1: [0(2,3)]]
  810. 168.10 s > field value
  811. 168.10 s > span warm_up{integrand.name=se1l}
  812. 168.10 s > [2026-08-27 10:09:53.476] @process::amplitude WARNING : External state 0 ('g', PDG 21, helicity +) is off shell: p^2 = +2.5e5, expected m^2 = +0e0 (|Δ| = +2.5e5). Fixed-helicity spinor/vector/tensor external states may be ill-defined at this kinematic point.
  813. 168.10 s > field value
  814. 168.10 s > span warm_up{integrand.name=se1l_rls_shifted}
  815. 168.10 s > [2026-08-27 10:09:53.476] @process::amplitude WARNING : External state 1 ('g', PDG 21, helicity -) is off shell: p^2 = +2.5e5, expected m^2 = +0e0 (|Δ| = +2.5e5). Fixed-helicity spinor/vector/tensor external states may be ill-defined at this kinematic point.
  816. 168.10 s > field value
  817. 168.10 s > span warm_up{integrand.name=se1l_rls_shifted}
  818. 168.10 s > [2026-08-27 10:09:53.476] @process::amplitude INFO : Input is above threshold: 1 existing threshold E-surfaces across 1/1 graph groups
  819. 168.10 s > field value
  820. 168.10 s > existing_esurfaces 1
  821. 168.10 s > group_count 1
  822. 168.10 s > groups_above_threshold 1
  823. 168.10 s > integrand se1l_rls_shifted
  824. 168.10 s > span warm_up{integrand.name=se1l_rls_shifted}
  825. 168.10 s > threshold_status above threshold
  826. 168.10 s > [2026-08-27 10:09:53.476] @process::amplitude INFO : overlap structure of group 0: [1: [0(2,3)]]
  827. 168.10 s > field value
  828. 168.10 s > span warm_up{integrand.name=se1l_rls_shifted}
  829. 168.10 s > [2026-08-27 10:09:53.479] @process::amplitude WARNING : External state 0 ('g', PDG 21, helicity +) is off shell: p^2 = +2.5e5, expected m^2 = +0e0 (|Δ| = +2.5e5). Fixed-helicity spinor/vector/tensor external states may be ill-defined at this kinematic point.
  830. 168.10 s > field value
  831. 168.10 s > span warm_up{integrand.name=se1l}
  832. 168.10 s > [2026-08-27 10:09:53.479] @process::amplitude WARNING : External state 1 ('g', PDG 21, helicity -) is off shell: p^2 = +2.5e5, expected m^2 = +0e0 (|Δ| = +2.5e5). Fixed-helicity spinor/vector/tensor external states may be ill-defined at this kinematic point.
  833. 168.10 s > field value
  834. 168.10 s > span warm_up{integrand.name=se1l}
  835. 168.10 s > [2026-08-27 10:09:53.479] @process::amplitude INFO : Input is above threshold: 1 existing threshold E-surfaces across 1/1 graph groups
  836. 168.10 s > field value
  837. 168.10 s > existing_esurfaces 1
  838. 168.10 s > group_count 1
  839. 168.10 s > groups_above_threshold 1
  840. 168.10 s > integrand se1l
  841. 168.10 s > span warm_up{integrand.name=se1l}
  842. 168.10 s > threshold_status above threshold
  843. 168.10 s > [2026-08-27 10:09:53.479] @process::amplitude INFO : overlap structure of group 0: [1: [0(2,3)]]
  844. 168.10 s > field value
  845. 168.10 s > span warm_up{integrand.name=se1l}
  846. 168.10 s > [2026-08-27 10:09:53.483] @process::amplitude WARNING : External state 0 ('g', PDG 21, helicity +) is off shell: p^2 = +2.5e5, expected m^2 = +0e0 (|Δ| = +2.5e5). Fixed-helicity spinor/vector/tensor external states may be ill-defined at this kinematic point.
  847. 168.10 s > field value
  848. 168.10 s > span warm_up{integrand.name=se1l_rls_shifted}
  849. 168.10 s > [2026-08-27 10:09:53.483] @process::amplitude WARNING : External state 1 ('g', PDG 21, helicity -) is off shell: p^2 = +2.5e5, expected m^2 = +0e0 (|Δ| = +2.5e5). Fixed-helicity spinor/vector/tensor external states may be ill-defined at this kinematic point.
  850. 168.10 s > field value
  851. 168.10 s > span warm_up{integrand.name=se1l_rls_shifted}
  852. 168.10 s > [2026-08-27 10:09:53.483] @process::amplitude INFO : Input is above threshold: 1 existing threshold E-surfaces across 1/1 graph groups
  853. 168.10 s > field value
  854. 168.10 s > existing_esurfaces 1
  855. 168.10 s > group_count 1
  856. 168.10 s > groups_above_threshold 1
  857. 168.10 s > integrand se1l_rls_shifted
  858. 168.10 s > span warm_up{integrand.name=se1l_rls_shifted}
  859. 168.10 s > threshold_status above threshold
  860. 168.10 s > [2026-08-27 10:09:53.483] @process::amplitude INFO : overlap structure of group 0: [1: [0(2,3)]]
  861. 168.10 s > field value
  862. 168.10 s > span warm_up{integrand.name=se1l_rls_shifted}
  863. 168.10 s > [2026-08-27 10:09:53.486] @process::amplitude WARNING : External state 0 ('g', PDG 21, helicity +) is off shell: p^2 = +2.5e5, expected m^2 = +0e0 (|Δ| = +2.5e5). Fixed-helicity spinor/vector/tensor external states may be ill-defined at this kinematic point.
  864. 168.10 s > field value
  865. 168.10 s > span warm_up{integrand.name=se1l}
  866. 168.10 s > [2026-08-27 10:09:53.486] @process::amplitude WARNING : External state 1 ('g', PDG 21, helicity -) is off shell: p^2 = +2.5e5, expected m^2 = +0e0 (|Δ| = +2.5e5). Fixed-helicity spinor/vector/tensor external states may be ill-defined at this kinematic point.
  867. 168.10 s > field value
  868. 168.10 s > span warm_up{integrand.name=se1l}
  869. 168.10 s > [2026-08-27 10:09:53.486] @process::amplitude INFO : Input is above threshold: 1 existing threshold E-surfaces across 1/1 graph groups
  870. 168.10 s > field value
  871. 168.10 s > existing_esurfaces 1
  872. 168.10 s > group_count 1
  873. 168.10 s > groups_above_threshold 1
  874. 168.10 s > integrand se1l
  875. 168.10 s > span warm_up{integrand.name=se1l}
  876. 168.10 s > threshold_status above threshold
  877. 168.10 s > [2026-08-27 10:09:53.486] @process::amplitude INFO : overlap structure of group 0: [1: [0(2,3)]]
  878. 168.10 s > field value
  879. 168.10 s > span warm_up{integrand.name=se1l}
  880. 168.10 s > [2026-08-27 10:09:53.490] @process::amplitude WARNING : External state 0 ('g', PDG 21, helicity +) is off shell: p^2 = +2.5e5, expected m^2 = +0e0 (|Δ| = +2.5e5). Fixed-helicity spinor/vector/tensor external states may be ill-defined at this kinematic point.
  881. 168.10 s > field value
  882. 168.10 s > span warm_up{integrand.name=se1l_rls_shifted}
  883. 168.10 s > [2026-08-27 10:09:53.490] @process::amplitude WARNING : External state 1 ('g', PDG 21, helicity -) is off shell: p^2 = +2.5e5, expected m^2 = +0e0 (|Δ| = +2.5e5). Fixed-helicity spinor/vector/tensor external states may be ill-defined at this kinematic point.
  884. 168.10 s > field value
  885. 168.10 s > span warm_up{integrand.name=se1l_rls_shifted}
  886. 168.10 s > [2026-08-27 10:09:53.490] @process::amplitude INFO : Input is above threshold: 1 existing threshold E-surfaces across 1/1 graph groups
  887. 168.10 s > field value
  888. 168.10 s > existing_esurfaces 1
  889. 168.10 s > group_count 1
  890. 168.10 s > groups_above_threshold 1
  891. 168.10 s > integrand se1l_rls_shifted
  892. 168.10 s > span warm_up{integrand.name=se1l_rls_shifted}
  893. 168.10 s > threshold_status above threshold
  894. 168.10 s > [2026-08-27 10:09:53.490] @process::amplitude INFO : overlap structure of group 0: [1: [0(2,3)]]
  895. 168.10 s > field value
  896. 168.10 s > span warm_up{integrand.name=se1l_rls_shifted}
  897. 168.10 s > [2026-08-27 10:09:53.493] @process::amplitude WARNING : External state 0 ('g', PDG 21, helicity +) is off shell: p^2 = +2.5e5, expected m^2 = +0e0 (|Δ| = +2.5e5). Fixed-helicity spinor/vector/tensor external states may be ill-defined at this kinematic point.
  898. 168.10 s > field value
  899. 168.10 s > span warm_up{integrand.name=se1l}
  900. 168.10 s > [2026-08-27 10:09:53.493] @process::amplitude WARNING : External state 1 ('g', PDG 21, helicity -) is off shell: p^2 = +2.5e5, expected m^2 = +0e0 (|Δ| = +2.5e5). Fixed-helicity spinor/vector/tensor external states may be ill-defined at this kinematic point.
  901. 168.10 s > field value
  902. 168.10 s > span warm_up{integrand.name=se1l}
  903. 168.10 s > [2026-08-27 10:09:53.493] @process::amplitude INFO : Input is above threshold: 1 existing threshold E-surfaces across 1/1 graph groups
  904. 168.10 s > field value
  905. 168.10 s > existing_esurfaces 1
  906. 168.10 s > group_count 1
  907. 168.10 s > groups_above_threshold 1
  908. 168.10 s > integrand se1l
  909. 168.10 s > span warm_up{integrand.name=se1l}
  910. 168.10 s > threshold_status above threshold
  911. 168.10 s > [2026-08-27 10:09:53.493] @process::amplitude INFO : overlap structure of group 0: [1: [0(2,3)]]
  912. 168.10 s > field value
  913. 168.10 s > span warm_up{integrand.name=se1l}
  914. 168.10 s > [2026-08-27 10:09:53.497] @process::amplitude WARNING : External state 0 ('g', PDG 21, helicity +) is off shell: p^2 = +2.5e5, expected m^2 = +0e0 (|Δ| = +2.5e5). Fixed-helicity spinor/vector/tensor external states may be ill-defined at this kinematic point.
  915. 168.10 s > field value
  916. 168.10 s > span warm_up{integrand.name=se1l_mur_shifted}
  917. 168.10 s > [2026-08-27 10:09:53.497] @process::amplitude WARNING : External state 1 ('g', PDG 21, helicity -) is off shell: p^2 = +2.5e5, expected m^2 = +0e0 (|Δ| = +2.5e5). Fixed-helicity spinor/vector/tensor external states may be ill-defined at this kinematic point.
  918. 168.10 s > field value
  919. 168.10 s > span warm_up{integrand.name=se1l_mur_shifted}
  920. 168.10 s > [2026-08-27 10:09:53.497] @process::amplitude INFO : Input is above threshold: 1 existing threshold E-surfaces across 1/1 graph groups
  921. 168.10 s > field value
  922. 168.10 s > existing_esurfaces 1
  923. 168.10 s > group_count 1
  924. 168.10 s > groups_above_threshold 1
  925. 168.10 s > integrand se1l_mur_shifted
  926. 168.10 s > span warm_up{integrand.name=se1l_mur_shifted}
  927. 168.10 s > threshold_status above threshold
  928. 168.10 s > [2026-08-27 10:09:53.497] @process::amplitude INFO : overlap structure of group 0: [1: [0(2,3)]]
  929. 168.10 s > field value
  930. 168.10 s > span warm_up{integrand.name=se1l_mur_shifted}
  931. 168.10 s > [2026-08-27 10:09:53.500] @process::amplitude WARNING : External state 0 ('g', PDG 21, helicity +) is off shell: p^2 = +2.5e5, expected m^2 = +0e0 (|Δ| = +2.5e5). Fixed-helicity spinor/vector/tensor external states may be ill-defined at this kinematic point.
  932. 168.10 s > field value
  933. 168.10 s > span warm_up{integrand.name=se1l}
  934. 168.10 s > [2026-08-27 10:09:53.500] @process::amplitude WARNING : External state 1 ('g', PDG 21, helicity -) is off shell: p^2 = +2.5e5, expected m^2 = +0e0 (|Δ| = +2.5e5). Fixed-helicity spinor/vector/tensor external states may be ill-defined at this kinematic point.
  935. 168.10 s > field value
  936. 168.10 s > span warm_up{integrand.name=se1l}
  937. 168.10 s > [2026-08-27 10:09:53.500] @process::amplitude INFO : Input is above threshold: 1 existing threshold E-surfaces across 1/1 graph groups
  938. 168.10 s > field value
  939. 168.10 s > existing_esurfaces 1
  940. 168.10 s > group_count 1
  941. 168.10 s > groups_above_threshold 1
  942. 168.10 s > integrand se1l
  943. 168.10 s > span warm_up{integrand.name=se1l}
  944. 168.10 s > threshold_status above threshold
  945. 168.10 s > [2026-08-27 10:09:53.500] @process::amplitude INFO : overlap structure of group 0: [1: [0(2,3)]]
  946. 168.10 s > field value
  947. 168.10 s > span warm_up{integrand.name=se1l}
  948. 168.10 s > [2026-08-27 10:09:53.504] @process::amplitude WARNING : External state 0 ('g', PDG 21, helicity +) is off shell: p^2 = +2.5e5, expected m^2 = +0e0 (|Δ| = +2.5e5). Fixed-helicity spinor/vector/tensor external states may be ill-defined at this kinematic point.
  949. 168.10 s > field value
  950. 168.10 s > span warm_up{integrand.name=se1l_mur_shifted}
  951. 168.10 s > [2026-08-27 10:09:53.504] @process::amplitude WARNING : External state 1 ('g', PDG 21, helicity -) is off shell: p^2 = +2.5e5, expected m^2 = +0e0 (|Δ| = +2.5e5). Fixed-helicity spinor/vector/tensor external states may be ill-defined at this kinematic point.
  952. 168.10 s > field value
  953. 168.10 s > span warm_up{integrand.name=se1l_mur_shifted}
  954. 168.10 s > [2026-08-27 10:09:53.504] @process::amplitude INFO : Input is above threshold: 1 existing threshold E-surfaces across 1/1 graph groups
  955. 168.10 s > field value
  956. 168.10 s > existing_esurfaces 1
  957. 168.10 s > group_count 1
  958. 168.10 s > groups_above_threshold 1
  959. 168.10 s > integrand se1l_mur_shifted
  960. 168.10 s > span warm_up{integrand.name=se1l_mur_shifted}
  961. 168.10 s > threshold_status above threshold
  962. 168.10 s > [2026-08-27 10:09:53.504] @process::amplitude INFO : overlap structure of group 0: [1: [0(2,3)]]
  963. 168.10 s > field value
  964. 168.10 s > span warm_up{integrand.name=se1l_mur_shifted}
  965. 168.10 s > [2026-08-27 10:09:53.507] @process::amplitude WARNING : External state 0 ('g', PDG 21, helicity +) is off shell: p^2 = +2.5e5, expected m^2 = +0e0 (|Δ| = +2.5e5). Fixed-helicity spinor/vector/tensor external states may be ill-defined at this kinematic point.
  966. 168.10 s > field value
  967. 168.10 s > span warm_up{integrand.name=se1l}
  968. 168.10 s > [2026-08-27 10:09:53.507] @process::amplitude WARNING : External state 1 ('g', PDG 21, helicity -) is off shell: p^2 = +2.5e5, expected m^2 = +0e0 (|Δ| = +2.5e5). Fixed-helicity spinor/vector/tensor external states may be ill-defined at this kinematic point.
  969. 168.10 s > field value
  970. 168.10 s > span warm_up{integrand.name=se1l}
  971. 168.10 s > [2026-08-27 10:09:53.507] @process::amplitude INFO : Input is above threshold: 1 existing threshold E-surfaces across 1/1 graph groups
  972. 168.10 s > field value
  973. 168.10 s > existing_esurfaces 1
  974. 168.10 s > group_count 1
  975. 168.10 s > groups_above_threshold 1
  976. 168.10 s > integrand se1l
  977. 168.10 s > span warm_up{integrand.name=se1l}
  978. 168.10 s > threshold_status above threshold
  979. 168.10 s > [2026-08-27 10:09:53.507] @process::amplitude INFO : overlap structure of group 0: [1: [0(2,3)]]
  980. 168.10 s > field value
  981. 168.10 s > span warm_up{integrand.name=se1l}
  982. 168.10 s > [2026-08-27 10:09:53.511] @process::amplitude WARNING : External state 0 ('g', PDG 21, helicity +) is off shell: p^2 = +2.5e5, expected m^2 = +0e0 (|Δ| = +2.5e5). Fixed-helicity spinor/vector/tensor external states may be ill-defined at this kinematic point.
  983. 168.10 s > field value
  984. 168.10 s > span warm_up{integrand.name=se1l_mur_shifted}
  985. 168.10 s > [2026-08-27 10:09:53.511] @process::amplitude WARNING : External state 1 ('g', PDG 21, helicity -) is off shell: p^2 = +2.5e5, expected m^2 = +0e0 (|Δ| = +2.5e5). Fixed-helicity spinor/vector/tensor external states may be ill-defined at this kinematic point.
  986. 168.10 s > field value
  987. 168.10 s > span warm_up{integrand.name=se1l_mur_shifted}
  988. 168.10 s > [2026-08-27 10:09:53.511] @process::amplitude INFO : Input is above threshold: 1 existing threshold E-surfaces across 1/1 graph groups
  989. 168.10 s > field value
  990. 168.10 s > existing_esurfaces 1
  991. 168.10 s > group_count 1
  992. 168.10 s > groups_above_threshold 1
  993. 168.10 s > integrand se1l_mur_shifted
  994. 168.10 s > span warm_up{integrand.name=se1l_mur_shifted}
  995. 168.10 s > threshold_status above threshold
  996. 168.10 s > [2026-08-27 10:09:53.511] @process::amplitude INFO : overlap structure of group 0: [1: [0(2,3)]]
  997. 168.10 s > field value
  998. 168.10 s > span warm_up{integrand.name=se1l_mur_shifted}
  999. 168.10 s > [2026-08-27 10:09:53.514] @process::amplitude WARNING : External state 0 ('g', PDG 21, helicity +) is off shell: p^2 = +2.5e5, expected m^2 = +0e0 (|Δ| = +2.5e5). Fixed-helicity spinor/vector/tensor external states may be ill-defined at this kinematic point.
  1000. 168.10 s > field value
  1001. 168.10 s > span warm_up{integrand.name=se1l}
  1002. 168.10 s > [2026-08-27 10:09:53.514] @process::amplitude WARNING : External state 1 ('g', PDG 21, helicity -) is off shell: p^2 = +2.5e5, expected m^2 = +0e0 (|Δ| = +2.5e5). Fixed-helicity spinor/vector/tensor external states may be ill-defined at this kinematic point.
  1003. 168.10 s > field value
  1004. 168.10 s > span warm_up{integrand.name=se1l}
  1005. 168.10 s > [2026-08-27 10:09:53.514] @process::amplitude INFO : Input is above threshold: 1 existing threshold E-surfaces across 1/1 graph groups
  1006. 168.10 s > field value
  1007. 168.10 s > existing_esurfaces 1
  1008. 168.10 s > group_count 1
  1009. 168.10 s > groups_above_threshold 1
  1010. 168.10 s > integrand se1l
  1011. 168.10 s > span warm_up{integrand.name=se1l}
  1012. 168.10 s > threshold_status above threshold
  1013. 168.10 s > [2026-08-27 10:09:53.514] @process::amplitude INFO : overlap structure of group 0: [1: [0(2,3)]]
  1014. 168.10 s > field value
  1015. 168.10 s > span warm_up{integrand.name=se1l}
  1016. 168.10 s > [2026-08-27 10:09:53.518] @process::amplitude WARNING : External state 0 ('g', PDG 21, helicity +) is off shell: p^2 = +2.5e5, expected m^2 = +0e0 (|Δ| = +2.5e5). Fixed-helicity spinor/vector/tensor external states may be ill-defined at this kinematic point.
  1017. 168.10 s > field value
  1018. 168.10 s > span warm_up{integrand.name=se1l_mur_shifted}
  1019. 168.10 s > [2026-08-27 10:09:53.518] @process::amplitude WARNING : External state 1 ('g', PDG 21, helicity -) is off shell: p^2 = +2.5e5, expected m^2 = +0e0 (|Δ| = +2.5e5). Fixed-helicity spinor/vector/tensor external states may be ill-defined at this kinematic point.
  1020. 168.10 s > field value
  1021. 168.10 s > span warm_up{integrand.name=se1l_mur_shifted}
  1022. 168.10 s > [2026-08-27 10:09:53.518] @process::amplitude INFO : Input is above threshold: 1 existing threshold E-surfaces across 1/1 graph groups
  1023. 168.10 s > field value
  1024. 168.10 s > existing_esurfaces 1
  1025. 168.10 s > group_count 1
  1026. 168.10 s > groups_above_threshold 1
  1027. 168.10 s > integrand se1l_mur_shifted
  1028. 168.10 s > span warm_up{integrand.name=se1l_mur_shifted}
  1029. 168.10 s > threshold_status above threshold
  1030. 168.10 s > [2026-08-27 10:09:53.518] @process::amplitude INFO : overlap structure of group 0: [1: [0(2,3)]]
  1031. 168.10 s > field value
  1032. 168.10 s > span warm_up{integrand.name=se1l_mur_shifted}
  1033. 168.10 s > [2026-08-27 10:09:53.521] @process::amplitude WARNING : External state 0 ('g', PDG 21, helicity +) is off shell: p^2 = +2.5e5, expected m^2 = +0e0 (|Δ| = +2.5e5). Fixed-helicity spinor/vector/tensor external states may be ill-defined at this kinematic point.
  1034. 168.10 s > field value
  1035. 168.10 s > span warm_up{integrand.name=se1l}
  1036. 168.10 s > [2026-08-27 10:09:53.521] @process::amplitude WARNING : External state 1 ('g', PDG 21, helicity -) is off shell: p^2 = +2.5e5, expected m^2 = +0e0 (|Δ| = +2.5e5). Fixed-helicity spinor/vector/tensor external states may be ill-defined at this kinematic point.
  1037. 168.10 s > field value
  1038. 168.10 s > span warm_up{integrand.name=se1l}
  1039. 168.10 s > [2026-08-27 10:09:53.521] @process::amplitude INFO : Input is above threshold: 1 existing threshold E-surfaces across 1/1 graph groups
  1040. 168.10 s > field value
  1041. 168.10 s > existing_esurfaces 1
  1042. 168.10 s > group_count 1
  1043. 168.10 s > groups_above_threshold 1
  1044. 168.10 s > integrand se1l
  1045. 168.10 s > span warm_up{integrand.name=se1l}
  1046. 168.10 s > threshold_status above threshold
  1047. 168.10 s > [2026-08-27 10:09:53.521] @process::amplitude INFO : overlap structure of group 0: [1: [0(2,3)]]
  1048. 168.10 s > field value
  1049. 168.10 s > span warm_up{integrand.name=se1l}
  1050. 168.10 s > [2026-08-27 10:09:53.525] @process::amplitude WARNING : External state 0 ('g', PDG 21, helicity +) is off shell: p^2 = +2.5e5, expected m^2 = +0e0 (|Δ| = +2.5e5). Fixed-helicity spinor/vector/tensor external states may be ill-defined at this kinematic point.
  1051. 168.10 s > field value
  1052. 168.10 s > span warm_up{integrand.name=se1l_mur_shifted}
  1053. 168.10 s > [2026-08-27 10:09:53.525] @process::amplitude WARNING : External state 1 ('g', PDG 21, helicity -) is off shell: p^2 = +2.5e5, expected m^2 = +0e0 (|Δ| = +2.5e5). Fixed-helicity spinor/vector/tensor external states may be ill-defined at this kinematic point.
  1054. 168.10 s > field value
  1055. 168.10 s > span warm_up{integrand.name=se1l_mur_shifted}
  1056. 168.10 s > [2026-08-27 10:09:53.525] @process::amplitude INFO : Input is above threshold: 1 existing threshold E-surfaces across 1/1 graph groups
  1057. 168.10 s > field value
  1058. 168.10 s > existing_esurfaces 1
  1059. 168.10 s > group_count 1
  1060. 168.10 s > groups_above_threshold 1
  1061. 168.10 s > integrand se1l_mur_shifted
  1062. 168.10 s > span warm_up{integrand.name=se1l_mur_shifted}
  1063. 168.10 s > threshold_status above threshold
  1064. 168.10 s > [2026-08-27 10:09:53.525] @process::amplitude INFO : overlap structure of group 0: [1: [0(2,3)]]
  1065. 168.10 s > field value
  1066. 168.10 s > span warm_up{integrand.name=se1l_mur_shifted}
  1067. 168.10 s > [2026-08-27 10:09:53.528] @process::amplitude WARNING : External state 0 ('g', PDG 21, helicity +) is off shell: p^2 = +2.5e5, expected m^2 = +0e0 (|Δ| = +2.5e5). Fixed-helicity spinor/vector/tensor external states may be ill-defined at this kinematic point.
  1068. 168.10 s > field value
  1069. 168.10 s > span warm_up{integrand.name=se1l}
  1070. 168.10 s > [2026-08-27 10:09:53.528] @process::amplitude WARNING : External state 1 ('g', PDG 21, helicity -) is off shell: p^2 = +2.5e5, expected m^2 = +0e0 (|Δ| = +2.5e5). Fixed-helicity spinor/vector/tensor external states may be ill-defined at this kinematic point.
  1071. 168.10 s > field value
  1072. 168.10 s > span warm_up{integrand.name=se1l}
  1073. 168.10 s > [2026-08-27 10:09:53.528] @process::amplitude INFO : Input is above threshold: 1 existing threshold E-surfaces across 1/1 graph groups
  1074. 168.10 s > field value
  1075. 168.10 s > existing_esurfaces 1
  1076. 168.10 s > group_count 1
  1077. 168.10 s > groups_above_threshold 1
  1078. 168.10 s > integrand se1l
  1079. 168.10 s > span warm_up{integrand.name=se1l}
  1080. 168.10 s > threshold_status above threshold
  1081. 168.10 s > [2026-08-27 10:09:53.528] @process::amplitude INFO : overlap structure of group 0: [1: [0(2,3)]]
  1082. 168.10 s > field value
  1083. 168.10 s > span warm_up{integrand.name=se1l}
  1084. 168.10 s > [2026-08-27 10:09:53.532] @process::amplitude WARNING : External state 0 ('g', PDG 21, helicity +) is off shell: p^2 = +2.5e5, expected m^2 = +0e0 (|Δ| = +2.5e5). Fixed-helicity spinor/vector/tensor external states may be ill-defined at this kinematic point.
  1085. 168.10 s > field value
  1086. 168.10 s > span warm_up{integrand.name=se1l_mur_shifted}
  1087. 168.10 s > [2026-08-27 10:09:53.532] @process::amplitude WARNING : External state 1 ('g', PDG 21, helicity -) is off shell: p^2 = +2.5e5, expected m^2 = +0e0 (|Δ| = +2.5e5). Fixed-helicity spinor/vector/tensor external states may be ill-defined at this kinematic point.
  1088. 168.10 s > field value
  1089. 168.10 s > span warm_up{integrand.name=se1l_mur_shifted}
  1090. 168.10 s > [2026-08-27 10:09:53.532] @process::amplitude INFO : Input is above threshold: 1 existing threshold E-surfaces across 1/1 graph groups
  1091. 168.10 s > field value
  1092. 168.10 s > existing_esurfaces 1
  1093. 168.10 s > group_count 1
  1094. 168.10 s > groups_above_threshold 1
  1095. 168.10 s > integrand se1l_mur_shifted
  1096. 168.10 s > span warm_up{integrand.name=se1l_mur_shifted}
  1097. 168.10 s > threshold_status above threshold
  1098. 168.10 s > [2026-08-27 10:09:53.532] @process::amplitude INFO : overlap structure of group 0: [1: [0(2,3)]]
  1099. 168.10 s > field value
  1100. 168.10 s > span warm_up{integrand.name=se1l_mur_shifted}
  1101. 168.10 s > [2026-08-27 10:09:53.535] @process::amplitude WARNING : External state 0 ('g', PDG 21, helicity +) is off shell: p^2 = +2.5e5, expected m^2 = +0e0 (|Δ| = +2.5e5). Fixed-helicity spinor/vector/tensor external states may be ill-defined at this kinematic point.
  1102. 168.10 s > field value
  1103. 168.10 s > span warm_up{integrand.name=se1l}
  1104. 168.10 s > [2026-08-27 10:09:53.535] @process::amplitude WARNING : External state 1 ('g', PDG 21, helicity -) is off shell: p^2 = +2.5e5, expected m^2 = +0e0 (|Δ| = +2.5e5). Fixed-helicity spinor/vector/tensor external states may be ill-defined at this kinematic point.
  1105. 168.10 s > field value
  1106. 168.10 s > span warm_up{integrand.name=se1l}
  1107. 168.10 s > [2026-08-27 10:09:53.535] @process::amplitude INFO : Input is above threshold: 1 existing threshold E-surfaces across 1/1 graph groups
  1108. 168.10 s > field value
  1109. 168.10 s > existing_esurfaces 1
  1110. 168.10 s > group_count 1
  1111. 168.10 s > groups_above_threshold 1
  1112. 168.10 s > integrand se1l
  1113. 168.10 s > span warm_up{integrand.name=se1l}
  1114. 168.10 s > threshold_status above threshold
  1115. 168.10 s > [2026-08-27 10:09:53.535] @process::amplitude INFO : overlap structure of group 0: [1: [0(2,3)]]
  1116. 168.10 s > field value
  1117. 168.10 s > span warm_up{integrand.name=se1l}
  1118. 168.10 s > [2026-08-27 10:09:53.539] @process::amplitude WARNING : External state 0 ('g', PDG 21, helicity +) is off shell: p^2 = +2.5e5, expected m^2 = +0e0 (|Δ| = +2.5e5). Fixed-helicity spinor/vector/tensor external states may be ill-defined at this kinematic point.
  1119. 168.10 s > field value
  1120. 168.10 s > span warm_up{integrand.name=se1l_mur_shifted}
  1121. 168.10 s > [2026-08-27 10:09:53.539] @process::amplitude WARNING : External state 1 ('g', PDG 21, helicity -) is off shell: p^2 = +2.5e5, expected m^2 = +0e0 (|Δ| = +2.5e5). Fixed-helicity spinor/vector/tensor external states may be ill-defined at this kinematic point.
  1122. 168.10 s > field value
  1123. 168.10 s > span warm_up{integrand.name=se1l_mur_shifted}
  1124. 168.10 s > [2026-08-27 10:09:53.539] @process::amplitude INFO : Input is above threshold: 1 existing threshold E-surfaces across 1/1 graph groups
  1125. 168.10 s > field value
  1126. 168.10 s > existing_esurfaces 1
  1127. 168.10 s > group_count 1
  1128. 168.10 s > groups_above_threshold 1
  1129. 168.10 s > integrand se1l_mur_shifted
  1130. 168.10 s > span warm_up{integrand.name=se1l_mur_shifted}
  1131. 168.10 s > threshold_status above threshold
  1132. 168.10 s > [2026-08-27 10:09:53.539] @process::amplitude INFO : overlap structure of group 0: [1: [0(2,3)]]
  1133. 168.10 s > field value
  1134. 168.10 s > span warm_up{integrand.name=se1l_mur_shifted}
  1135. 168.10 s > [2026-08-27 10:09:53.542] @process::amplitude WARNING : External state 0 ('g', PDG 21, helicity +) is off shell: p^2 = +2.5e5, expected m^2 = +0e0 (|Δ| = +2.5e5). Fixed-helicity spinor/vector/tensor external states may be ill-defined at this kinematic point.
  1136. 168.10 s > field value
  1137. 168.10 s > span warm_up{integrand.name=se1l}
  1138. 168.10 s > [2026-08-27 10:09:53.542] @process::amplitude WARNING : External state 1 ('g', PDG 21, helicity -) is off shell: p^2 = +2.5e5, expected m^2 = +0e0 (|Δ| = +2.5e5). Fixed-helicity spinor/vector/tensor external states may be ill-defined at this kinematic point.
  1139. 168.10 s > field value
  1140. 168.10 s > span warm_up{integrand.name=se1l}
  1141. 168.10 s > [2026-08-27 10:09:53.542] @process::amplitude INFO : Input is above threshold: 1 existing threshold E-surfaces across 1/1 graph groups
  1142. 168.10 s > field value
  1143. 168.10 s > existing_esurfaces 1
  1144. 168.10 s > group_count 1
  1145. 168.10 s > groups_above_threshold 1
  1146. 168.10 s > integrand se1l
  1147. 168.10 s > span warm_up{integrand.name=se1l}
  1148. 168.10 s > threshold_status above threshold
  1149. 168.10 s > [2026-08-27 10:09:53.542] @process::amplitude INFO : overlap structure of group 0: [1: [0(2,3)]]
  1150. 168.10 s > field value
  1151. 168.10 s > span warm_up{integrand.name=se1l}
  1152. 168.10 s > [2026-08-27 10:09:53.546] @process::amplitude WARNING : External state 0 ('g', PDG 21, helicity +) is off shell: p^2 = +2.5e5, expected m^2 = +0e0 (|Δ| = +2.5e5). Fixed-helicity spinor/vector/tensor external states may be ill-defined at this kinematic point.
  1153. 168.10 s > field value
  1154. 168.10 s > span warm_up{integrand.name=se1l_mur_shifted}
  1155. 168.10 s > [2026-08-27 10:09:53.546] @process::amplitude WARNING : External state 1 ('g', PDG 21, helicity -) is off shell: p^2 = +2.5e5, expected m^2 = +0e0 (|Δ| = +2.5e5). Fixed-helicity spinor/vector/tensor external states may be ill-defined at this kinematic point.
  1156. 168.10 s > field value
  1157. 168.10 s > span warm_up{integrand.name=se1l_mur_shifted}
  1158. 168.10 s > [2026-08-27 10:09:53.546] @process::amplitude INFO : Input is above threshold: 1 existing threshold E-surfaces across 1/1 graph groups
  1159. 168.10 s > field value
  1160. 168.10 s > existing_esurfaces 1
  1161. 168.10 s > group_count 1
  1162. 168.10 s > groups_above_threshold 1
  1163. 168.10 s > integrand se1l_mur_shifted
  1164. 168.10 s > span warm_up{integrand.name=se1l_mur_shifted}
  1165. 168.10 s > threshold_status above threshold
  1166. 168.10 s > [2026-08-27 10:09:53.546] @process::amplitude INFO : overlap structure of group 0: [1: [0(2,3)]]
  1167. 168.10 s > field value
  1168. 168.10 s > span warm_up{integrand.name=se1l_mur_shifted}
  1169. 168.10 s > [2026-08-27 10:09:53.549] @process::amplitude WARNING : External state 0 ('g', PDG 21, helicity +) is off shell: p^2 = +2.5e5, expected m^2 = +0e0 (|Δ| = +2.5e5). Fixed-helicity spinor/vector/tensor external states may be ill-defined at this kinematic point.
  1170. 168.10 s > field value
  1171. 168.10 s > span warm_up{integrand.name=se1l}
  1172. 168.10 s > [2026-08-27 10:09:53.549] @process::amplitude WARNING : External state 1 ('g', PDG 21, helicity -) is off shell: p^2 = +2.5e5, expected m^2 = +0e0 (|Δ| = +2.5e5). Fixed-helicity spinor/vector/tensor external states may be ill-defined at this kinematic point.
  1173. 168.10 s > field value
  1174. 168.10 s > span warm_up{integrand.name=se1l}
  1175. 168.10 s > [2026-08-27 10:09:53.549] @process::amplitude INFO : Input is above threshold: 1 existing threshold E-surfaces across 1/1 graph groups
  1176. 168.10 s > field value
  1177. 168.10 s > existing_esurfaces 1
  1178. 168.10 s > group_count 1
  1179. 168.10 s > groups_above_threshold 1
  1180. 168.10 s > integrand se1l
  1181. 168.10 s > span warm_up{integrand.name=se1l}
  1182. 168.10 s > threshold_status above threshold
  1183. 168.10 s > [2026-08-27 10:09:53.549] @process::amplitude INFO : overlap structure of group 0: [1: [0(2,3)]]
  1184. 168.10 s > field value
  1185. 168.10 s > span warm_up{integrand.name=se1l}
  1186. 168.10 s > [2026-08-27 10:09:53.553] @process::amplitude WARNING : External state 0 ('g', PDG 21, helicity +) is off shell: p^2 = +2.5e5, expected m^2 = +0e0 (|Δ| = +2.5e5). Fixed-helicity spinor/vector/tensor external states may be ill-defined at this kinematic point.
  1187. 168.10 s > field value
  1188. 168.10 s > span warm_up{integrand.name=se1l_mur_shifted}
  1189. 168.10 s > [2026-08-27 10:09:53.553] @process::amplitude WARNING : External state 1 ('g', PDG 21, helicity -) is off shell: p^2 = +2.5e5, expected m^2 = +0e0 (|Δ| = +2.5e5). Fixed-helicity spinor/vector/tensor external states may be ill-defined at this kinematic point.
  1190. 168.10 s > field value
  1191. 168.10 s > span warm_up{integrand.name=se1l_mur_shifted}
  1192. 168.10 s > [2026-08-27 10:09:53.553] @process::amplitude INFO : Input is above threshold: 1 existing threshold E-surfaces across 1/1 graph groups
  1193. 168.10 s > field value
  1194. 168.10 s > existing_esurfaces 1
  1195. 168.10 s > group_count 1
  1196. 168.10 s > groups_above_threshold 1
  1197. 168.10 s > integrand se1l_mur_shifted
  1198. 168.10 s > span warm_up{integrand.name=se1l_mur_shifted}
  1199. 168.10 s > threshold_status above threshold
  1200. 168.10 s > [2026-08-27 10:09:53.553] @process::amplitude INFO : overlap structure of group 0: [1: [0(2,3)]]
  1201. 168.10 s > field value
  1202. 168.10 s > span warm_up{integrand.name=se1l_mur_shifted}
  1203. 168.10 s > [2026-08-27 10:09:53.556] @process::amplitude WARNING : External state 0 ('g', PDG 21, helicity +) is off shell: p^2 = +2.5e5, expected m^2 = +0e0 (|Δ| = +2.5e5). Fixed-helicity spinor/vector/tensor external states may be ill-defined at this kinematic point.
  1204. 168.10 s > field value
  1205. 168.10 s > span warm_up{integrand.name=se1l}
  1206. 168.10 s > [2026-08-27 10:09:53.556] @process::amplitude WARNING : External state 1 ('g', PDG 21, helicity -) is off shell: p^2 = +2.5e5, expected m^2 = +0e0 (|Δ| = +2.5e5). Fixed-helicity spinor/vector/tensor external states may be ill-defined at this kinematic point.
  1207. 168.10 s > field value
  1208. 168.10 s > span warm_up{integrand.name=se1l}
  1209. 168.10 s > [2026-08-27 10:09:53.556] @process::amplitude INFO : Input is above threshold: 1 existing threshold E-surfaces across 1/1 graph groups
  1210. 168.10 s > field value
  1211. 168.10 s > existing_esurfaces 1
  1212. 168.10 s > group_count 1
  1213. 168.10 s > groups_above_threshold 1
  1214. 168.10 s > integrand se1l
  1215. 168.10 s > span warm_up{integrand.name=se1l}
  1216. 168.10 s > threshold_status above threshold
  1217. 168.10 s > [2026-08-27 10:09:53.556] @process::amplitude INFO : overlap structure of group 0: [1: [0(2,3)]]
  1218. 168.10 s > field value
  1219. 168.10 s > span warm_up{integrand.name=se1l}
  1220. 168.10 s > [2026-08-27 10:09:53.560] @process::amplitude WARNING : External state 0 ('g', PDG 21, helicity +) is off shell: p^2 = +2.5e5, expected m^2 = +0e0 (|Δ| = +2.5e5). Fixed-helicity spinor/vector/tensor external states may be ill-defined at this kinematic point.
  1221. 168.10 s > field value
  1222. 168.10 s > span warm_up{integrand.name=se1l_mur_shifted}
  1223. 168.10 s > [2026-08-27 10:09:53.560] @process::amplitude WARNING : External state 1 ('g', PDG 21, helicity -) is off shell: p^2 = +2.5e5, expected m^2 = +0e0 (|Δ| = +2.5e5). Fixed-helicity spinor/vector/tensor external states may be ill-defined at this kinematic point.
  1224. 168.10 s > field value
  1225. 168.10 s > span warm_up{integrand.name=se1l_mur_shifted}
  1226. 168.10 s > [2026-08-27 10:09:53.560] @process::amplitude INFO : Input is above threshold: 1 existing threshold E-surfaces across 1/1 graph groups
  1227. 168.10 s > field value
  1228. 168.10 s > existing_esurfaces 1
  1229. 168.10 s > group_count 1
  1230. 168.10 s > groups_above_threshold 1
  1231. 168.10 s > integrand se1l_mur_shifted
  1232. 168.10 s > span warm_up{integrand.name=se1l_mur_shifted}
  1233. 168.10 s > threshold_status above threshold
  1234. 168.10 s > [2026-08-27 10:09:53.560] @process::amplitude INFO : overlap structure of group 0: [1: [0(2,3)]]
  1235. 168.10 s > field value
  1236. 168.10 s > span warm_up{integrand.name=se1l_mur_shifted}
  1237. 168.10 s > The application panicked (crashed).
  1238. 168.10 s > Message: Integrated UV case failed: se1l
  1239. 168.10 s > Location: tests/tests/uv.rs:1068
  1240. 168.10 s >
  1241. 168.10 s > ━━━━━━━━━━━━━━━━━━━━━━━━━━━━━━━━━━ BACKTRACE ━━━━━━━━━━━━━━━━━━━━━━━━━━━━━━━━━━━
  1242. 168.10 s > 1: <color_eyre[51793ea62743adbd]::config::PanicHook>::panic_report<unknown>
  1243. 168.10 s > at <unknown source file>:<unknown line>
  1244. 168.10 s > 2: <color_eyre[51793ea62743adbd]::config::PanicHook>::into_panic_hook::{closure#0}<unknown>
  1245. 168.10 s > at <unknown source file>:<unknown line>
  1246. 168.10 s > 3: std[bcb96dfbba0ab899]::panicking::panic_with_hook<unknown>
  1247. 168.10 s > at <unknown source file>:<unknown line>
  1248. 168.10 s > 4: std[bcb96dfbba0ab899]::panicking::panic_handler::{closure#0}<unknown>
  1249. 168.10 s > at <unknown source file>:<unknown line>
  1250. 168.10 s > 5: std[bcb96dfbba0ab899]::sys::backtrace::__rust_end_short_backtrace::<std[bcb96dfbba0ab899]::panicking::panic_handler::{closure#0}, !><unknown>
  1251. 168.10 s > at <unknown source file>:<unknown line>
  1252. 168.10 s > 6: __rustc[6c289b9f9c454d21]::rust_begin_unwind<unknown>
  1253. 168.10 s > at <unknown source file>:<unknown line>
  1254. 168.10 s > 7: core[940e698046960fd5]::panicking::panic_fmt<unknown>
  1255. 168.10 s > at <unknown source file>:<unknown line>
  1256. 168.10 s > 8: uv[52cf2b63f0104e31]::run_single_integrated_uv_case<unknown>
  1257. 168.10 s > at <unknown source file>:<unknown line>
  1258. 168.10 s > 9: <uv[52cf2b63f0104e31]::se1l_uv::{closure#0} as core[940e698046960fd5]::ops::function::FnOnce<()>>::call_once<unknown>
  1259. 168.10 s > at <unknown source file>:<unknown line>
  1260. 168.10 s > 10: test[75d6903177b1d7e9]::__rust_begin_short_backtrace::<core[940e698046960fd5]::result::Result<(), alloc[2ea6bcb46fca0c42]::string::String>, fn() -> core[940e698046960fd5]::result::Result<(), alloc[2ea6bcb46fca0c42]::string::String>><unknown>
  1261. 168.10 s > at <unknown source file>:<unknown line>
  1262. 168.10 s > 11: test[75d6903177b1d7e9]::run_test::{closure#0}<unknown>
  1263. 168.10 s > at <unknown source file>:<unknown line>
  1264. 168.10 s > 12: std[bcb96dfbba0ab899]::sys::backtrace::__rust_begin_short_backtrace::<test[75d6903177b1d7e9]::run_test::{closure#1}, ()><unknown>
  1265. 168.10 s > at <unknown source file>:<unknown line>
  1266. 168.10 s > 13: <std[bcb96dfbba0ab899]::thread::lifecycle::spawn_unchecked<test[75d6903177b1d7e9]::run_test::{closure#1}, ()>::{closure#1} as core[940e698046960fd5]::ops::function::FnOnce<()>>::call_once::{shim:vtable#0}<unknown>
  1267. 168.10 s > at <unknown source file>:<unknown line>
  1268. 168.10 s > 14: <std[bcb96dfbba0ab899]::sys::thread::unix::Thread>::new::thread_start<unknown>
  1269. 168.10 s > at <unknown source file>:<unknown line>
  1270. 168.10 s > 15: start_thread<unknown>
  1271. 168.10 s > at <unknown source file>:<unknown line>
  1272. 168.10 s > 16: __clone3<unknown>
  1273. 168.10 s > at <unknown source file>:<unknown line>
  1274. 168.10 s >
  1275. 168.10 s > Run with COLORBT_SHOW_HIDDEN=1 environment variable to disable frame filtering.
  1276. 168.10 s > Run with RUST_BACKTRACE=full to include source snippets.
  1277. 168.10 s >
  1278. 168.10 s > error: test run failed
  1279. 168.10 s >
  1280. 168.10 s > ========== nextest test summary ==========
  1281. 168.10 s > report: target/nextest/ci_gammaloop/junit.xml
  1282. 168.10 s > tests: 106, failures: 9, errors: 0
  1283. 168.10 s >
  1284. 168.10 s > 1. gammaloop-integration-tests::test_runs::approach::approach_momentum_space_reports_incomplete_triplet_cleanly
  1285. 168.10 s > failure: test failure with exit code 101
  1286. 168.10 s > system-out
  1287. 168.10 s > running 1 test
  1288. 168.10 s > test approach::approach_momentum_space_reports_incomplete_triplet_cleanly ... FAILED
  1289. 168.10 s >
  1290. 168.10 s > failures:
  1291. 168.10 s >
  1292. 168.10 s > failures:
  1293. 168.10 s > approach::approach_momentum_space_reports_incomplete_triplet_cleanly
  1294. 168.10 s >
  1295. 168.10 s > test result: FAILED. 0 passed; 1 failed; 0 ignored; 0 measured; 82 filtered out; finished in 3.34s
  1296. 168.10 s > system-err
  1297. 168.10 s > [2026-08-27 10:07:35.461] @gammaloop_api::se... INFO : Running command import model scalars-default.json
  1298. 168.10 s > [2026-08-27 10:07:35.461] @import::model INFO : Loading built-in JSON model scalars-default
  1299. 168.10 s > [2026-08-27 10:07:35.466] @gammalooprs::model INFO : The following 2 external parameters were forced to zero by the restriction card:
  1300. 168.10 s > width_scalar_1, width_scalar_2
  1301. 168.10 s > [2026-08-27 10:07:35.466] @gammaloop_api::se... INFO : Running command remove processes
  1302. 168.10 s > [2026-08-27 10:07:35.467] @gammaloop_api::se... INFO : Running command generate amp scalar_1 > scalar_0 scalar_0 [{1}] --allowed-vertex-interactions V_3_SCALAR_022 V_3_SCALAR_122 -p triangle -i scalar_tri
  1303. 168.10 s > [2026-08-27 10:07:35.471] @feyngen::diagram_... INFO : 0s | Δ=0s | Starting Feynman graph generation with Symbolica...
  1304. 168.10 s > [2026-08-27 10:07:35.471] @feyngen::diagram_... INFO : 0s | Δ=0s | Number of graphs resulting from Symbolica generation: 1
  1305. 168.10 s > [2026-08-27 10:07:35.472] @feyngen::diagram_... INFO : 0s | Δ=0s | Number of graphs retained after removal of vetoed topologies: 1
  1306. 168.10 s > [2026-08-27 10:07:35.475] @feyngen::diagram_... INFO : 0s | Δ=0s | Number of graphs after vertex info assignment: 1
  1307. 168.10 s > [2026-08-27 10:07:35.475] @feyngen::diagram_... INFO : 0s | Δ=0s | Number of graphs after all complete graphs filters are applied: 1
  1308. 168.10 s > [2026-08-27 10:07:35.483] @feyngen::diagram_... INFO : 0s | Δ=0s | Number of graphs after closed fermion chains analysis: 1
  1309. 168.10 s > [2026-08-27 10:07:35.483] @feyngen::diagram_... INFO : 0s | Δ=0s | Number of graphs after symmetrization of external states: 1
  1310. 168.10 s > [2026-08-27 10:07:35.486] @feyngen::diagram_... INFO : 0s | Δ=0s | Number of graphs after canonization of vertices, edges and flows (graph labels assigned here): 1
  1311. 168.10 s > [2026-08-27 10:07:35.507] @feyngen::diagram_... INFO : 0s | Δ=0s | Number of graphs after numerator-aware grouping with strategy 'up to a scalar rescaling': 1 (1 isomorphically unique graph, 0 color zero, 0 lorentz zero, 0 grouped and 0 cancellation)
  1312. 168.10 s > [2026-08-27 10:07:35.507] @feyngen::diagram_... INFO : ( Sum of the symmetry factors from each graph generated = 1 )
  1313. 168.10 s > [2026-08-27 10:07:35.507] @commands::generate INFO : Generated amplitude 1 graphs.
  1314. 168.10 s > [2026-08-27 10:07:35.548] @settings::runtime WARNING : No external kinematics were provided; using default-generated external momenta and helicities.
  1315. 168.10 s > [2026-08-27 10:07:35.621] @commands::generate INFO :
  1316. 168.10 s > Integrand generation summary
  1317. 168.10 s > peak RAM 65.44 MiB | cores 1
  1318. 168.10 s > ╭────────────┬───────┬─────────┬────────────┬────────────┬────────────────┬─────────────╮
  1319. 168.10 s > │ integrand │ graph │ # evals │ expr build │ spenso │ symbolica eval │ compile │
  1320. 168.10 s > ├────────────┼───────┼─────────┼────────────┼────────────┼────────────────┼─────────────┤
  1321. 168.10 s > │ scalar_tri │ GL0 │ 9 │ 22ms (59%) │ 2ms (7.3%) │ 12ms (34%) │ 0ms (0.00%) │
  1322. 168.10 s > ├────────────┼───────┼─────────┼────────────┼────────────┼────────────────┼─────────────┤
  1323. 168.10 s > │ Total │ │ 9 │ 22ms (59%) │ 2ms (7.3%) │ 12ms (34%) │ 0ms (0.00%) │
  1324. 168.10 s > ╰────────────┴───────┴─────────┴────────────┴────────────┴────────────────┴─────────────╯
  1325. 168.10 s > [2026-08-27 10:07:35.622] @gammaloop_api::se... INFO : Running command generate amp scalar_0 scalar_0 > scalar_0 scalar_0 [{1}] --allowed-vertex-interactions V_3_SCALAR_022 -p box -i scalar_box --select-graphs GL0
  1326. 168.10 s > [2026-08-27 10:07:35.623] @feyngen::diagram_... INFO : 0s | Δ=0s | Starting Feynman graph generation with Symbolica...
  1327. 168.10 s > [2026-08-27 10:07:35.623] @feyngen::diagram_... INFO : 0s | Δ=0s | Number of graphs resulting from Symbolica generation: 3
  1328. 168.10 s > [2026-08-27 10:07:35.626] @feyngen::diagram_... INFO : 0s | Δ=0s | Number of graphs retained after removal of vetoed topologies: 3
  1329. 168.10 s > [2026-08-27 10:07:35.631] @feyngen::diagram_... INFO : 0s | Δ=0s | Number of graphs after vertex info assignment: 3
  1330. 168.10 s > [2026-08-27 10:07:35.631] @feyngen::diagram_... INFO : 0s | Δ=0s | Number of graphs after all complete graphs filters are applied: 3
  1331. 168.10 s > [2026-08-27 10:07:35.634] @feyngen::diagram_... INFO : 0s | Δ=0s | Number of graphs after closed fermion chains analysis: 3
  1332. 168.10 s > [2026-08-27 10:07:35.634] @feyngen::diagram_... INFO : 0s | Δ=0s | Number of graphs after symmetrization of external states: 3
  1333. 168.10 s > [2026-08-27 10:07:35.635] @feyngen::diagram_... INFO : 0s | Δ=0s | Number of graphs after canonization of vertices, edges and flows (graph labels assigned here): 3
  1334. 168.10 s > [2026-08-27 10:07:35.650] @feyngen::diagram_... INFO : 0s | Δ=0s | Number of graphs after numerator-aware grouping with strategy 'up to a scalar rescaling': 1 (1 isomorphically unique graph, 0 color zero, 0 lorentz zero, 0 grouped and 0 cancellation)
  1335. 168.10 s > [2026-08-27 10:07:35.650] @feyngen::diagram_... INFO : ( Sum of the symmetry factors from each graph generated = 1 )
  1336. 168.10 s > [2026-08-27 10:07:35.650] @commands::generate INFO : Generated amplitude 1 graphs.
  1337. 168.10 s > [2026-08-27 10:07:35.917] @settings::runtime WARNING : No external kinematics were provided; using default-generated external momenta and helicities.
  1338. 168.10 s > [2026-08-27 10:07:35.989] @commands::generate INFO :
  1339. 168.10 s > Integrand generation summary
  1340. 168.10 s > peak RAM 69.74 MiB | cores 1
  1341. 168.10 s > ╭────────────┬───────┬─────────┬─────────────┬─────────────┬────────────────┬─────────────╮
  1342. 168.10 s > │ integrand │ graph │ # evals │ expr build │ spenso │ symbolica eval │ compile │
  1343. 168.10 s > ├────────────┼───────┼─────────┼─────────────┼─────────────┼────────────────┼─────────────┤
  1344. 168.10 s > │ scalar_box │ GL0 │ 13 │ 153ms (60%) │ 11ms (4.7%) │ 88ms (35%) │ 0ms (0.00%) │
  1345. 168.10 s > ├────────────┼───────┼─────────┼─────────────┼─────────────┼────────────────┼─────────────┤
  1346. 168.10 s > │ Total │ │ 13 │ 153ms (60%) │ 11ms (4.7%) │ 88ms (35%) │ 0ms (0.00%) │
  1347. 168.10 s > ╰────────────┴───────┴─────────┴─────────────┴─────────────┴────────────────┴─────────────╯
  1348. 168.10 s > [2026-08-27 10:07:35.990] @gammaloop_api::se... INFO : Running command generate
  1349. 168.10 s > [2026-08-27 10:07:36.934] @settings::runtime WARNING : No external kinematics were provided; using default-generated external momenta and helicities.
  1350. 168.10 s > [2026-08-27 10:07:38.014] @settings::runtime WARNING : No external kinematics were provided; using default-generated external momenta and helicities.
  1351. 168.10 s > [2026-08-27 10:07:38.025] @commands::generate INFO :
  1352. 168.10 s > Integrand generation summary
  1353. 168.10 s > peak RAM 72.55 MiB | cores 1
  1354. 168.10 s > ╭────────────┬───────┬─────────┬─────────────┬─────────────┬────────────────┬─────────────╮
  1355. 168.10 s > │ integrand │ graph │ # evals │ expr build │ spenso │ symbolica eval │ compile │
  1356. 168.10 s > ├────────────┼───────┼─────────┼─────────────┼─────────────┼────────────────┼─────────────┤
  1357. 168.10 s > │ scalar_tri │ GL0 │ 9 │ 136ms (39%) │ 47ms (14%) │ 161ms (47%) │ 0ms (0.00%) │
  1358. 168.10 s > │ scalar_box │ GL0 │ 13 │ 599ms (37%) │ 169ms (11%) │ 841ms (52%) │ 0ms (0.00%) │
  1359. 168.10 s > ├────────────┼───────┼─────────┼─────────────┼─────────────┼────────────────┼─────────────┤
  1360. 168.10 s > │ Total │ │ 22 │ 735ms (38%) │ 216ms (11%) │ 1.00s (51%) │ 0ms (0.00%) │
  1361. 168.10 s > ╰────────────┴───────┴─────────┴─────────────┴─────────────┴────────────────┴─────────────╯
  1362. 168.10 s > [2026-08-27 10:07:38.026] @gammaloop_api::se... INFO : Running command set model mass_scalar_2=2.0
  1363. 168.10 s > [2026-08-27 10:07:38.027] @gammaloop_api::se... INFO : Running command set model mass_scalar_1=1.0
  1364. 168.10 s > [2026-08-27 10:07:38.028] @gammaloop_api::se... INFO : Running command set process -p triangle -i scalar_tri string '
  1365. 168.10 s > [kinematics.externals]
  1366. 168.10 s > type = "constant"
  1367. 168.10 s >
  1368. 168.10 s > [kinematics.externals.data]
  1369. 168.10 s > [...]
  1370. 168.10 s > [2026-08-27 10:07:38.038] @gammaloop_api::se... INFO : Running command set process -p box -i scalar_box string '
  1371. 168.10 s > [kinematics.externals]
  1372. 168.10 s > type = "constant"
  1373. 168.10 s >
  1374. 168.10 s > [kinematics.externals.data]
  1375. 168.10 s > [...]
  1376. 168.10 s > [2026-08-27 10:07:38.039] @gammaloop_api::se... INFO : Running command approach -x 1.0000000000000001e-1,2.0000000000000001e-1,2.9999999999999999e-1,4.0000000000000002e-1 --approach-axis 1.0000000000000000e-3,0.0000000000000000e0,0.0000000000000000e0,0.0000000000000000e0 --n-points 1 --n-cores 1 --output-results /build/source/tests/artifacts/scalar_box_invalid_momentum_approach/approach_momentum.json --momentum-space --graph-id 0
  1377. 168.10 s > The application panicked (crashed).
  1378. 168.10 s > Message: There are 2 processes available. Please specify a process.
  1379. 168.10 s > Location: tests/tests/test_runs/approach.rs:332
  1380. 168.10 s >
  1381. 168.10 s > ━━━━━━━━━━━━━━━━━━━━━━━━━━━━━━━━━━ BACKTRACE ━━━━━━━━━━━━━━━━━━━━━━━━━━━━━━━━━━━
  1382. 168.10 s > 1: <color_eyre[51793ea62743adbd]::config::PanicHook>::panic_report<unknown>
  1383. 168.10 s > at <unknown source file>:<unknown line>
  1384. 168.10 s > 2: <color_eyre[51793ea62743adbd]::config::PanicHook>::into_panic_hook::{closure#0}<unknown>
  1385. 168.10 s > at <unknown source file>:<unknown line>
  1386. 168.10 s > 3: std[bcb96dfbba0ab899]::panicking::panic_with_hook<unknown>
  1387. 168.10 s > at <unknown source file>:<unknown line>
  1388. 168.10 s > 4: std[bcb96dfbba0ab899]::panicking::panic_handler::{closure#0}<unknown>
  1389. 168.10 s > at <unknown source file>:<unknown line>
  1390. 168.10 s > 5: std[bcb96dfbba0ab899]::sys::backtrace::__rust_end_short_backtrace::<std[bcb96dfbba0ab899]::panicking::panic_handler::{closure#0}, !><unknown>
  1391. 168.10 s > at <unknown source file>:<unknown line>
  1392. 168.10 s > 6: __rustc[6c289b9f9c454d21]::rust_begin_unwind<unknown>
  1393. 168.10 s > at <unknown source file>:<unknown line>
  1394. 168.10 s > 7: core[940e698046960fd5]::panicking::panic_fmt<unknown>
  1395. 168.10 s > at <unknown source file>:<unknown line>
  1396. 168.10 s > 8: test_runs[3e7a390caee4e338]::approach::approach_momentum_space_reports_incomplete_triplet_cleanly<unknown>
  1397. 168.10 s > at <unknown source file>:<unknown line>
  1398. 168.10 s > 9: <test_runs[3e7a390caee4e338]::approach::approach_momentum_space_reports_incomplete_triplet_cleanly::{closure#0} as core[940e698046960fd5]::ops::function::FnOnce<()>>::call_once<unknown>
  1399. 168.10 s > at <unknown source file>:<unknown line>
  1400. 168.10 s > 10: test[75d6903177b1d7e9]::__rust_begin_short_backtrace::<core[940e698046960fd5]::result::Result<(), alloc[2ea6bcb46fca0c42]::string::String>, fn() -> core[940e698046960fd5]::result::Result<(), alloc[2ea6bcb46fca0c42]::string::String>><unknown>
  1401. 168.10 s > at <unknown source file>:<unknown line>
  1402. 168.10 s > 11: test[75d6903177b1d7e9]::run_test::{closure#0}<unknown>
  1403. 168.10 s > at <unknown source file>:<unknown line>
  1404. 168.10 s > 12: std[bcb96dfbba0ab899]::sys::backtrace::__rust_begin_short_backtrace::<test[75d6903177b1d7e9]::run_test::{closure#1}, ()><unknown>
  1405. 168.10 s > at <unknown source file>:<unknown line>
  1406. 168.10 s > 13: <std[bcb96dfbba0ab899]::thread::lifecycle::spawn_unchecked<test[75d6903177b1d7e9]::run_test::{closure#1}, ()>::{closure#1} as core[940e698046960fd5]::ops::function::FnOnce<()>>::call_once::{shim:vtable#0}<unknown>
  1407. 168.10 s > at <unknown source file>:<unknown line>
  1408. 168.10 s > 14: <std[bcb96dfbba0ab899]::sys::thread::unix::Thread>::new::thread_start<unknown>
  1409. 168.10 s > at <unknown source file>:<unknown line>
  1410. 168.10 s > 15: start_thread<unknown>
  1411. 168.10 s > at <unknown source file>:<unknown line>
  1412. 168.10 s > 16: __clone3<unknown>
  1413. 168.10 s > at <unknown source file>:<unknown line>
  1414. 168.10 s >
  1415. 168.10 s > Run with COLORBT_SHOW_HIDDEN=1 environment variable to disable frame filtering.
  1416. 168.10 s > ... omitted 1 more lines; see full nextest output above
  1417. 168.10 s >
  1418. 168.10 s > 2. gammaloop-integration-tests::test_runs::profile_bulk::dotted_bubble_amp_bulk_profile_passes
  1419. 168.10 s > failure: test failure with exit code 101
  1420. 168.10 s > Error:
  1421. 168.10 s > 0: IR profiling requested arbitrary precision but received a quad-precision result
  1422. 168.10 s >
  1423. 168.10 s > Location:
  1424. 168.10 s > crates/gammalooprs/src/integrands/process/ir.rs:2123
  1425. 168.10 s >
  1426. 168.10 s > ━━━━━━━━━━━━━━━━━━━━━━━━━━━━━━━━━━ BACKTRACE ━━━━━━━━━━━━━━━━━━━━━━━━━━━━━━━━━━━
  1427. 168.10 s > 1: <color_eyre[51793ea62743adbd]::config::EyreHook>::into_eyre_hook::{closure#0}<unknown>
  1428. 168.10 s > at <unknown source file>:<unknown line>
  1429. 168.10 s > 2: eyre[cb2fd339c0c40fca]::capture_handler<unknown>
  1430. 168.10 s > at <unknown source file>:<unknown line>
  1431. 168.10 s > 3: eyre[cb2fd339c0c40fca]::private::format_err<unknown>
  1432. 168.10 s > at <unknown source file>:<unknown line>
  1433. 168.10 s > 4: gammalooprs[d7a7c067ebd19583]::integrands::process::ir::evaluate_profile_momentum_point_arb::<gammalooprs[d7a7c067ebd19583]::integrands::process::amplitude::AmplitudeIntegrand><unknown>
  1434. 168.10 s > at <unknown source file>:<unknown line>
  1435. 168.10 s > 5: <gammalooprs[d7a7c067ebd19583]::integrands::process::amplitude::AmplitudeIntegrand>::test_single_ir_limit_impl<unknown>
  1436. 168.10 s > at <unknown source file>:<unknown line>
  1437. 168.10 s > 6: gammalooprs[d7a7c067ebd19583]::integrands::process::ir::run_ir_profile::<gammalooprs[d7a7c067ebd19583]::integrands::process::amplitude::AmplitudeIntegrand, <gammalooprs[d7a7c067ebd19583]::integrands::process::amplitude::AmplitudeIntegrand>::enumerate_ir_limits, <gammalooprs[d7a7c067ebd19583]::integrands::process::amplitude::AmplitudeIntegrand>::graph_cut_definitions, <gammalooprs[d7a7c067ebd19583]::integrands::process::amplitude::AmplitudeIntegrand>::test_single_ir_limit_impl><unknown>
  1438. 168.10 s > at <unknown source file>:<unknown line>
  1439. 168.10 s > 7: <gammalooprs[d7a7c067ebd19583]::integrands::process::amplitude::AmplitudeIntegrand>::test_ir<unknown>
  1440. 168.10 s > at <unknown source file>:<unknown line>
  1441. 168.10 s > 8: <gammaloop_api[92ae732909e47e14]::commands::profile::Profile>::run<unknown>
  1442. 168.10 s > at <unknown source file>:<unknown line>
  1443. 168.10 s > 9: test_runs[3e7a390caee4e338]::profile_bulk::dotted_bubble_amp_bulk_profile_passes<unknown>
  1444. 168.10 s > at <unknown source file>:<unknown line>
  1445. 168.10 s > 10: <test_runs[3e7a390caee4e338]::profile_bulk::dotted_bubble_amp_bulk_profile_passes::{closure#0} as core[940e698046960fd5]::ops::function::FnOnce<()>>::call_once<unknown>
  1446. 168.10 s > at <unknown source file>:<unknown line>
  1447. 168.10 s > 11: test[75d6903177b1d7e9]::__rust_begin_short_backtrace::<core[940e698046960fd5]::result::Result<(), alloc[2ea6bcb46fca0c42]::string::String>, fn() -> core[940e698046960fd5]::result::Result<(), alloc[2ea6bcb46fca0c42]::string::String>><unknown>
  1448. 168.10 s > at <unknown source file>:<unknown line>
  1449. 168.10 s > 12: test[75d6903177b1d7e9]::run_test::{closure#0}<unknown>
  1450. 168.10 s > at <unknown source file>:<unknown line>
  1451. 168.10 s > 13: std[bcb96dfbba0ab899]::sys::backtrace::__rust_begin_short_backtrace::<test[75d6903177b1d7e9]::run_test::{closure#1}, ()><unknown>
  1452. 168.10 s > at <unknown source file>:<unknown line>
  1453. 168.10 s > 14: <std[bcb96dfbba0ab899]::thread::lifecycle::spawn_unchecked<test[75d6903177b1d7e9]::run_test::{closure#1}, ()>::{closure#1} as core[940e698046960fd5]::ops::function::FnOnce<()>>::call_once::{shim:vtable#0}<unknown>
  1454. 168.10 s > at <unknown source file>:<unknown line>
  1455. 168.10 s > 15: <std[bcb96dfbba0ab899]::sys::thread::unix::Thread>::new::thread_start<unknown>
  1456. 168.10 s > at <unknown source file>:<unknown line>
  1457. 168.10 s > 16: start_thread<unknown>
  1458. 168.10 s > at <unknown source file>:<unknown line>
  1459. 168.10 s > 17: __clone3<unknown>
  1460. 168.10 s > at <unknown source file>:<unknown line>
  1461. 168.10 s >
  1462. 168.10 s > Run with COLORBT_SHOW_HIDDEN=1 environment variable to disable frame filtering.
  1463. 168.10 s > Run with RUST_BACKTRACE=full to include source snippets.
  1464. 168.10 s > Warning: SpanTrace capture is Unsupported.
  1465. 168.10 s > Ensure that you've setup a tracing-error ErrorLayer and the semver versions are compatible
  1466. 168.10 s > system-out
  1467. 168.10 s > running 1 test
  1468. 168.10 s > test profile_bulk::dotted_bubble_amp_bulk_profile_passes ... FAILED
  1469. 168.10 s >
  1470. 168.10 s > failures:
  1471. 168.10 s >
  1472. 168.10 s > failures:
  1473. 168.10 s > profile_bulk::dotted_bubble_amp_bulk_profile_passes
  1474. 168.10 s >
  1475. 168.10 s > test result: FAILED. 0 passed; 1 failed; 0 ignored; 0 measured; 82 filtered out; finished in 0.59s
  1476. 168.10 s > system-err
  1477. 168.10 s > [2026-08-27 10:07:39.755] @gammaloop_api::se... INFO : Running command import model ./assets/models/json/scalars/scalars_2p_3p.json
  1478. 168.10 s > [2026-08-27 10:07:39.755] @import::model INFO : Loading JSON model scalars_2p_3p-default from /build/source/assets/models/json/scalars/scalars_2p_3p
  1479. 168.10 s > [2026-08-27 10:07:39.757] @gammaloop_api::se... INFO : Running command import graphs ./tests/resources/graphs/dotted_bubble_amp.dot
  1480. 168.10 s > [2026-08-27 10:07:39.757] @commands::import INFO : Loading graphs from '/build/source/tests/resources/graphs/dotted_bubble_amp.dot'
  1481. 168.10 s > [2026-08-27 10:07:39.771] @gammaloop_api::se... INFO : Running command generate
  1482. 168.10 s > [2026-08-27 10:07:39.896] @commands::generate INFO :
  1483. 168.10 s > Integrand generation summary
  1484. 168.10 s > peak RAM 64.71 MiB | cores 1
  1485. 168.10 s > ╭───────────┬───────────────────┬─────────┬────────────┬────────────┬────────────────┬─────────────╮
  1486. 168.10 s > │ integrand │ graph │ # evals │ expr build │ spenso │ symbolica eval │ compile │
  1487. 168.10 s > ├───────────┼───────────────────┼─────────┼────────────┼────────────┼────────────────┼─────────────┤
  1488. 168.10 s > │ default │ dotted_bubble_amp │ 8 │ 37ms (67%) │ 1ms (2.2%) │ 17ms (31%) │ 0ms (0.00%) │
  1489. 168.10 s > ├───────────┼───────────────────┼─────────┼────────────┼────────────┼────────────────┼─────────────┤
  1490. 168.10 s > │ Total │ │ 8 │ 37ms (67%) │ 1ms (2.2%) │ 17ms (31%) │ 0ms (0.00%) │
  1491. 168.10 s > ╰───────────┴───────────────────┴─────────┴────────────┴────────────┴────────────────┴─────────────╯
  1492. 168.10 s > [2026-08-27 10:07:39.898] @process::amplitude INFO : Input is above threshold: 1 existing threshold E-surfaces across 1/1 graph groups
  1493. 168.10 s > [2026-08-27 10:07:39.898] @process::amplitude INFO : overlap structure of group 0: [1: [1(1,3)]]
  1494. 168.10 s > Error:
  1495. 168.10 s > 0: IR profiling requested arbitrary precision but received a quad-precision result
  1496. 168.10 s >
  1497. 168.10 s > Location:
  1498. 168.10 s > crates/gammalooprs/src/integrands/process/ir.rs:2123
  1499. 168.10 s >
  1500. 168.10 s > ━━━━━━━━━━━━━━━━━━━━━━━━━━━━━━━━━━ BACKTRACE ━━━━━━━━━━━━━━━━━━━━━━━━━━━━━━━━━━━
  1501. 168.10 s > 1: <color_eyre[51793ea62743adbd]::config::EyreHook>::into_eyre_hook::{closure#0}<unknown>
  1502. 168.10 s > at <unknown source file>:<unknown line>
  1503. 168.10 s > 2: eyre[cb2fd339c0c40fca]::capture_handler<unknown>
  1504. 168.10 s > at <unknown source file>:<unknown line>
  1505. 168.10 s > 3: eyre[cb2fd339c0c40fca]::private::format_err<unknown>
  1506. 168.10 s > at <unknown source file>:<unknown line>
  1507. 168.10 s > 4: gammalooprs[d7a7c067ebd19583]::integrands::process::ir::evaluate_profile_momentum_point_arb::<gammalooprs[d7a7c067ebd19583]::integrands::process::amplitude::AmplitudeIntegrand><unknown>
  1508. 168.10 s > at <unknown source file>:<unknown line>
  1509. 168.10 s > 5: <gammalooprs[d7a7c067ebd19583]::integrands::process::amplitude::AmplitudeIntegrand>::test_single_ir_limit_impl<unknown>
  1510. 168.10 s > at <unknown source file>:<unknown line>
  1511. 168.10 s > 6: gammalooprs[d7a7c067ebd19583]::integrands::process::ir::run_ir_profile::<gammalooprs[d7a7c067ebd19583]::integrands::process::amplitude::AmplitudeIntegrand, <gammalooprs[d7a7c067ebd19583]::integrands::process::amplitude::AmplitudeIntegrand>::enumerate_ir_limits, <gammalooprs[d7a7c067ebd19583]::integrands::process::amplitude::AmplitudeIntegrand>::graph_cut_definitions, <gammalooprs[d7a7c067ebd19583]::integrands::process::amplitude::AmplitudeIntegrand>::test_single_ir_limit_impl><unknown>
  1512. 168.10 s > at <unknown source file>:<unknown line>
  1513. 168.10 s > 7: <gammalooprs[d7a7c067ebd19583]::integrands::process::amplitude::AmplitudeIntegrand>::test_ir<unknown>
  1514. 168.10 s > at <unknown source file>:<unknown line>
  1515. 168.10 s > 8: <gammaloop_api[92ae732909e47e14]::commands::profile::Profile>::run<unknown>
  1516. 168.10 s > at <unknown source file>:<unknown line>
  1517. 168.10 s > 9: test_runs[3e7a390caee4e338]::profile_bulk::dotted_bubble_amp_bulk_profile_passes<unknown>
  1518. 168.10 s > at <unknown source file>:<unknown line>
  1519. 168.10 s > 10: <test_runs[3e7a390caee4e338]::profile_bulk::dotted_bubble_amp_bulk_profile_passes::{closure#0} as core[940e698046960fd5]::ops::function::FnOnce<()>>::call_once<unknown>
  1520. 168.10 s > at <unknown source file>:<unknown line>
  1521. 168.10 s > 11: test[75d6903177b1d7e9]::__rust_begin_short_backtrace::<core[940e698046960fd5]::result::Result<(), alloc[2ea6bcb46fca0c42]::string::String>, fn() -> core[940e698046960fd5]::result::Result<(), alloc[2ea6bcb46fca0c42]::string::String>><unknown>
  1522. 168.10 s > at <unknown source file>:<unknown line>
  1523. 168.10 s > 12: test[75d6903177b1d7e9]::run_test::{closure#0}<unknown>
  1524. 168.10 s > at <unknown source file>:<unknown line>
  1525. 168.10 s > 13: std[bcb96dfbba0ab899]::sys::backtrace::__rust_begin_short_backtrace::<test[75d6903177b1d7e9]::run_test::{closure#1}, ()><unknown>
  1526. 168.10 s > at <unknown source file>:<unknown line>
  1527. 168.10 s > 14: <std[bcb96dfbba0ab899]::thread::lifecycle::spawn_unchecked<test[75d6903177b1d7e9]::run_test::{closure#1}, ()>::{closure#1} as core[940e698046960fd5]::ops::function::FnOnce<()>>::call_once::{shim:vtable#0}<unknown>
  1528. 168.10 s > at <unknown source file>:<unknown line>
  1529. 168.10 s > 15: <std[bcb96dfbba0ab899]::sys::thread::unix::Thread>::new::thread_start<unknown>
  1530. 168.10 s > at <unknown source file>:<unknown line>
  1531. 168.10 s > 16: start_thread<unknown>
  1532. 168.10 s > at <unknown source file>:<unknown line>
  1533. 168.10 s > 17: __clone3<unknown>
  1534. 168.10 s > at <unknown source file>:<unknown line>
  1535. 168.10 s >
  1536. 168.10 s > Run with COLORBT_SHOW_HIDDEN=1 environment variable to disable frame filtering.
  1537. 168.10 s > Run with RUST_BACKTRACE=full to include source snippets.
  1538. 168.10 s > Warning: SpanTrace capture is Unsupported.
  1539. 168.10 s > Ensure that you've setup a tracing-error ErrorLayer and the semver versions are compatible
  1540. 168.10 s >
  1541. 168.10 s > 3. gammaloop-integration-tests::test_runs::profile_bulk::box_4e_bulk_profile_passes
  1542. 168.10 s > failure: test failure with exit code 101
  1543. 168.10 s > Error:
  1544. 168.10 s > 0: IR profiling requested arbitrary precision but received a quad-precision result
  1545. 168.10 s >
  1546. 168.10 s > Location:
  1547. 168.10 s > crates/gammalooprs/src/integrands/process/ir.rs:2123
  1548. 168.10 s >
  1549. 168.10 s > ━━━━━━━━━━━━━━━━━━━━━━━━━━━━━━━━━━ BACKTRACE ━━━━━━━━━━━━━━━━━━━━━━━━━━━━━━━━━━━
  1550. 168.10 s > 1: <color_eyre[51793ea62743adbd]::config::EyreHook>::into_eyre_hook::{closure#0}<unknown>
  1551. 168.10 s > at <unknown source file>:<unknown line>
  1552. 168.10 s > 2: eyre[cb2fd339c0c40fca]::capture_handler<unknown>
  1553. 168.10 s > at <unknown source file>:<unknown line>
  1554. 168.10 s > 3: eyre[cb2fd339c0c40fca]::private::format_err<unknown>
  1555. 168.10 s > at <unknown source file>:<unknown line>
  1556. 168.10 s > 4: gammalooprs[d7a7c067ebd19583]::integrands::process::ir::evaluate_profile_momentum_point_arb::<gammalooprs[d7a7c067ebd19583]::integrands::process::amplitude::AmplitudeIntegrand><unknown>
  1557. 168.10 s > at <unknown source file>:<unknown line>
  1558. 168.10 s > 5: <gammalooprs[d7a7c067ebd19583]::integrands::process::amplitude::AmplitudeIntegrand>::test_single_ir_limit_impl<unknown>
  1559. 168.10 s > at <unknown source file>:<unknown line>
  1560. 168.10 s > 6: gammalooprs[d7a7c067ebd19583]::integrands::process::ir::run_ir_profile::<gammalooprs[d7a7c067ebd19583]::integrands::process::amplitude::AmplitudeIntegrand, <gammalooprs[d7a7c067ebd19583]::integrands::process::amplitude::AmplitudeIntegrand>::enumerate_ir_limits, <gammalooprs[d7a7c067ebd19583]::integrands::process::amplitude::AmplitudeIntegrand>::graph_cut_definitions, <gammalooprs[d7a7c067ebd19583]::integrands::process::amplitude::AmplitudeIntegrand>::test_single_ir_limit_impl><unknown>
  1561. 168.10 s > at <unknown source file>:<unknown line>
  1562. 168.10 s > 7: <gammalooprs[d7a7c067ebd19583]::integrands::process::amplitude::AmplitudeIntegrand>::test_ir<unknown>
  1563. 168.10 s > at <unknown source file>:<unknown line>
  1564. 168.10 s > 8: <gammaloop_api[92ae732909e47e14]::commands::profile::Profile>::run<unknown>
  1565. 168.10 s > at <unknown source file>:<unknown line>
  1566. 168.10 s > 9: test_runs[3e7a390caee4e338]::profile_bulk::box_4e_bulk_profile_passes<unknown>
  1567. 168.10 s > at <unknown source file>:<unknown line>
  1568. 168.10 s > 10: <test_runs[3e7a390caee4e338]::profile_bulk::box_4e_bulk_profile_passes::{closure#0} as core[940e698046960fd5]::ops::function::FnOnce<()>>::call_once<unknown>
  1569. 168.10 s > at <unknown source file>:<unknown line>
  1570. 168.10 s > 11: test[75d6903177b1d7e9]::__rust_begin_short_backtrace::<core[940e698046960fd5]::result::Result<(), alloc[2ea6bcb46fca0c42]::string::String>, fn() -> core[940e698046960fd5]::result::Result<(), alloc[2ea6bcb46fca0c42]::string::String>><unknown>
  1571. 168.10 s > at <unknown source file>:<unknown line>
  1572. 168.10 s > 12: test[75d6903177b1d7e9]::run_test::{closure#0}<unknown>
  1573. 168.10 s > at <unknown source file>:<unknown line>
  1574. 168.10 s > 13: std[bcb96dfbba0ab899]::sys::backtrace::__rust_begin_short_backtrace::<test[75d6903177b1d7e9]::run_test::{closure#1}, ()><unknown>
  1575. 168.10 s > at <unknown source file>:<unknown line>
  1576. 168.10 s > 14: <std[bcb96dfbba0ab899]::thread::lifecycle::spawn_unchecked<test[75d6903177b1d7e9]::run_test::{closure#1}, ()>::{closure#1} as core[940e698046960fd5]::ops::function::FnOnce<()>>::call_once::{shim:vtable#0}<unknown>
  1577. 168.10 s > at <unknown source file>:<unknown line>
  1578. 168.10 s > 15: <std[bcb96dfbba0ab899]::sys::thread::unix::Thread>::new::thread_start<unknown>
  1579. 168.10 s > at <unknown source file>:<unknown line>
  1580. 168.10 s > 16: start_thread<unknown>
  1581. 168.10 s > at <unknown source file>:<unknown line>
  1582. 168.10 s > 17: __clone3<unknown>
  1583. 168.10 s > at <unknown source file>:<unknown line>
  1584. 168.10 s >
  1585. 168.10 s > Run with COLORBT_SHOW_HIDDEN=1 environment variable to disable frame filtering.
  1586. 168.10 s > Run with RUST_BACKTRACE=full to include source snippets.
  1587. 168.10 s > Warning: SpanTrace capture is Unsupported.
  1588. 168.10 s > Ensure that you've setup a tracing-error ErrorLayer and the semver versions are compatible
  1589. 168.10 s > system-out
  1590. 168.10 s > running 1 test
  1591. 168.10 s > test profile_bulk::box_4e_bulk_profile_passes ... FAILED
  1592. 168.10 s >
  1593. 168.10 s > failures:
  1594. 168.10 s >
  1595. 168.10 s > failures:
  1596. 168.10 s > profile_bulk::box_4e_bulk_profile_passes
  1597. 168.10 s >
  1598. 168.10 s > test result: FAILED. 0 passed; 1 failed; 0 ignored; 0 measured; 82 filtered out; finished in 0.99s
  1599. 168.10 s > system-err
  1600. 168.10 s > [2026-08-27 10:07:39.744] @gammaloop_api::se... INFO : Running command import model ./assets/models/json/scalars/scalars.json
  1601. 168.10 s > [2026-08-27 10:07:39.744] @import::model INFO : Loading JSON model scalars-default from /build/source/assets/models/json/scalars/scalars
  1602. 168.10 s > [2026-08-27 10:07:39.747] @gammalooprs::model INFO : The following 2 external parameters were forced to zero by the restriction card:
  1603. 168.10 s > width_scalar_1, width_scalar_2
  1604. 168.10 s > [2026-08-27 10:07:39.748] @gammaloop_api::se... INFO : Running command import graphs ./tests/resources/graphs/massless_box.dot
  1605. 168.10 s > [2026-08-27 10:07:39.748] @commands::import INFO : Loading graphs from '/build/source/tests/resources/graphs/massless_box.dot'
  1606. 168.10 s > [2026-08-27 10:07:39.759] @gammaloop_api::se... INFO : Running command generate
  1607. 168.10 s > [2026-08-27 10:07:40.088] @commands::generate INFO :
  1608. 168.10 s > Integrand generation summary
  1609. 168.10 s > peak RAM 67.75 MiB | cores 1
  1610. 168.10 s > ╭───────────┬────────────────┬─────────┬─────────────┬────────────┬────────────────┬─────────────╮
  1611. 168.10 s > │ integrand │ graph │ # evals │ expr build │ spenso │ symbolica eval │ compile │
  1612. 168.10 s > ├───────────┼────────────────┼─────────┼─────────────┼────────────┼────────────────┼─────────────┤
  1613. 168.10 s > │ default │ massless_box_0 │ 14 │ 187ms (80%) │ 28ms (12%) │ 19ms (8.1%) │ 0ms (0.00%) │
  1614. 168.10 s > ├───────────┼────────────────┼─────────┼─────────────┼────────────┼────────────────┼─────────────┤
  1615. 168.10 s > │ Total │ │ 14 │ 187ms (80%) │ 28ms (12%) │ 19ms (8.1%) │ 0ms (0.00%) │
  1616. 168.10 s > ╰───────────┴────────────────┴─────────┴─────────────┴────────────┴────────────────┴─────────────╯
  1617. 168.10 s > [2026-08-27 10:07:40.091] @process::amplitude INFO : Input is above threshold: 4 existing threshold E-surfaces across 1/1 graph groups
  1618. 168.10 s > [2026-08-27 10:07:40.101] @process::amplitude INFO : overlap structure of group 0: [2: [8(4,6), 11(5,6)], 2: [4(3,4), 8(4,6)], 2: [9(3,5), 11(5,6)], 2: [4(3,4), 9(3,5)]]
  1619. 168.10 s > Error:
  1620. 168.10 s > 0: IR profiling requested arbitrary precision but received a quad-precision result
  1621. 168.10 s >
  1622. 168.10 s > Location:
  1623. 168.10 s > crates/gammalooprs/src/integrands/process/ir.rs:2123
  1624. 168.10 s >
  1625. 168.10 s > ━━━━━━━━━━━━━━━━━━━━━━━━━━━━━━━━━━ BACKTRACE ━━━━━━━━━━━━━━━━━━━━━━━━━━━━━━━━━━━
  1626. 168.10 s > 1: <color_eyre[51793ea62743adbd]::config::EyreHook>::into_eyre_hook::{closure#0}<unknown>
  1627. 168.10 s > at <unknown source file>:<unknown line>
  1628. 168.10 s > 2: eyre[cb2fd339c0c40fca]::capture_handler<unknown>
  1629. 168.10 s > at <unknown source file>:<unknown line>
  1630. 168.10 s > 3: eyre[cb2fd339c0c40fca]::private::format_err<unknown>
  1631. 168.10 s > at <unknown source file>:<unknown line>
  1632. 168.10 s > 4: gammalooprs[d7a7c067ebd19583]::integrands::process::ir::evaluate_profile_momentum_point_arb::<gammalooprs[d7a7c067ebd19583]::integrands::process::amplitude::AmplitudeIntegrand><unknown>
  1633. 168.10 s > at <unknown source file>:<unknown line>
  1634. 168.10 s > 5: <gammalooprs[d7a7c067ebd19583]::integrands::process::amplitude::AmplitudeIntegrand>::test_single_ir_limit_impl<unknown>
  1635. 168.10 s > at <unknown source file>:<unknown line>
  1636. 168.10 s > 6: gammalooprs[d7a7c067ebd19583]::integrands::process::ir::run_ir_profile::<gammalooprs[d7a7c067ebd19583]::integrands::process::amplitude::AmplitudeIntegrand, <gammalooprs[d7a7c067ebd19583]::integrands::process::amplitude::AmplitudeIntegrand>::enumerate_ir_limits, <gammalooprs[d7a7c067ebd19583]::integrands::process::amplitude::AmplitudeIntegrand>::graph_cut_definitions, <gammalooprs[d7a7c067ebd19583]::integrands::process::amplitude::AmplitudeIntegrand>::test_single_ir_limit_impl><unknown>
  1637. 168.10 s > at <unknown source file>:<unknown line>
  1638. 168.10 s > 7: <gammalooprs[d7a7c067ebd19583]::integrands::process::amplitude::AmplitudeIntegrand>::test_ir<unknown>
  1639. 168.10 s > at <unknown source file>:<unknown line>
  1640. 168.10 s > 8: <gammaloop_api[92ae732909e47e14]::commands::profile::Profile>::run<unknown>
  1641. 168.10 s > at <unknown source file>:<unknown line>
  1642. 168.10 s > 9: test_runs[3e7a390caee4e338]::profile_bulk::box_4e_bulk_profile_passes<unknown>
  1643. 168.10 s > at <unknown source file>:<unknown line>
  1644. 168.10 s > 10: <test_runs[3e7a390caee4e338]::profile_bulk::box_4e_bulk_profile_passes::{closure#0} as core[940e698046960fd5]::ops::function::FnOnce<()>>::call_once<unknown>
  1645. 168.10 s > at <unknown source file>:<unknown line>
  1646. 168.10 s > 11: test[75d6903177b1d7e9]::__rust_begin_short_backtrace::<core[940e698046960fd5]::result::Result<(), alloc[2ea6bcb46fca0c42]::string::String>, fn() -> core[940e698046960fd5]::result::Result<(), alloc[2ea6bcb46fca0c42]::string::String>><unknown>
  1647. 168.10 s > at <unknown source file>:<unknown line>
  1648. 168.10 s > 12: test[75d6903177b1d7e9]::run_test::{closure#0}<unknown>
  1649. 168.10 s > at <unknown source file>:<unknown line>
  1650. 168.10 s > 13: std[bcb96dfbba0ab899]::sys::backtrace::__rust_begin_short_backtrace::<test[75d6903177b1d7e9]::run_test::{closure#1}, ()><unknown>
  1651. 168.10 s > at <unknown source file>:<unknown line>
  1652. 168.10 s > 14: <std[bcb96dfbba0ab899]::thread::lifecycle::spawn_unchecked<test[75d6903177b1d7e9]::run_test::{closure#1}, ()>::{closure#1} as core[940e698046960fd5]::ops::function::FnOnce<()>>::call_once::{shim:vtable#0}<unknown>
  1653. 168.10 s > at <unknown source file>:<unknown line>
  1654. 168.10 s > 15: <std[bcb96dfbba0ab899]::sys::thread::unix::Thread>::new::thread_start<unknown>
  1655. 168.10 s > at <unknown source file>:<unknown line>
  1656. 168.10 s > 16: start_thread<unknown>
  1657. 168.10 s > at <unknown source file>:<unknown line>
  1658. 168.10 s > 17: __clone3<unknown>
  1659. 168.10 s > at <unknown source file>:<unknown line>
  1660. 168.10 s >
  1661. 168.10 s > Run with COLORBT_SHOW_HIDDEN=1 environment variable to disable frame filtering.
  1662. 168.10 s > Run with RUST_BACKTRACE=full to include source snippets.
  1663. 168.10 s > Warning: SpanTrace capture is Unsupported.
  1664. 168.10 s > Ensure that you've setup a tracing-error ErrorLayer and the semver versions are compatible
  1665. 168.10 s >
  1666. 168.10 s > 4. gammaloop-integration-tests::test_runs::profile_bulk::massless_triangle_bulk_profile_passes
  1667. 168.10 s > failure: test failure with exit code 101
  1668. 168.10 s > Error:
  1669. 168.10 s > 0: IR profiling requested arbitrary precision but received a quad-precision result
  1670. 168.10 s >
  1671. 168.10 s > Location:
  1672. 168.10 s > crates/gammalooprs/src/integrands/process/ir.rs:2123
  1673. 168.10 s >
  1674. 168.10 s > ━━━━━━━━━━━━━━━━━━━━━━━━━━━━━━━━━━ BACKTRACE ━━━━━━━━━━━━━━━━━━━━━━━━━━━━━━━━━━━
  1675. 168.10 s > 1: <color_eyre[51793ea62743adbd]::config::EyreHook>::into_eyre_hook::{closure#0}<unknown>
  1676. 168.10 s > at <unknown source file>:<unknown line>
  1677. 168.10 s > 2: eyre[cb2fd339c0c40fca]::capture_handler<unknown>
  1678. 168.10 s > at <unknown source file>:<unknown line>
  1679. 168.10 s > 3: eyre[cb2fd339c0c40fca]::private::format_err<unknown>
  1680. 168.10 s > at <unknown source file>:<unknown line>
  1681. 168.10 s > 4: gammalooprs[d7a7c067ebd19583]::integrands::process::ir::evaluate_profile_momentum_point_arb::<gammalooprs[d7a7c067ebd19583]::integrands::process::amplitude::AmplitudeIntegrand><unknown>
  1682. 168.10 s > at <unknown source file>:<unknown line>
  1683. 168.10 s > 5: <gammalooprs[d7a7c067ebd19583]::integrands::process::amplitude::AmplitudeIntegrand>::test_single_ir_limit_impl<unknown>
  1684. 168.10 s > at <unknown source file>:<unknown line>
  1685. 168.10 s > 6: gammalooprs[d7a7c067ebd19583]::integrands::process::ir::run_ir_profile::<gammalooprs[d7a7c067ebd19583]::integrands::process::amplitude::AmplitudeIntegrand, <gammalooprs[d7a7c067ebd19583]::integrands::process::amplitude::AmplitudeIntegrand>::enumerate_ir_limits, <gammalooprs[d7a7c067ebd19583]::integrands::process::amplitude::AmplitudeIntegrand>::graph_cut_definitions, <gammalooprs[d7a7c067ebd19583]::integrands::process::amplitude::AmplitudeIntegrand>::test_single_ir_limit_impl><unknown>
  1686. 168.10 s > at <unknown source file>:<unknown line>
  1687. 168.10 s > 7: <gammalooprs[d7a7c067ebd19583]::integrands::process::amplitude::AmplitudeIntegrand>::test_ir<unknown>
  1688. 168.10 s > at <unknown source file>:<unknown line>
  1689. 168.10 s > 8: <gammaloop_api[92ae732909e47e14]::commands::profile::Profile>::run<unknown>
  1690. 168.10 s > at <unknown source file>:<unknown line>
  1691. 168.10 s > 9: test_runs[3e7a390caee4e338]::profile_bulk::massless_triangle_bulk_profile_passes<unknown>
  1692. 168.10 s > at <unknown source file>:<unknown line>
  1693. 168.10 s > 10: <test_runs[3e7a390caee4e338]::profile_bulk::massless_triangle_bulk_profile_passes::{closure#0} as core[940e698046960fd5]::ops::function::FnOnce<()>>::call_once<unknown>
  1694. 168.10 s > at <unknown source file>:<unknown line>
  1695. 168.10 s > 11: test[75d6903177b1d7e9]::__rust_begin_short_backtrace::<core[940e698046960fd5]::result::Result<(), alloc[2ea6bcb46fca0c42]::string::String>, fn() -> core[940e698046960fd5]::result::Result<(), alloc[2ea6bcb46fca0c42]::string::String>><unknown>
  1696. 168.10 s > at <unknown source file>:<unknown line>
  1697. 168.10 s > 12: test[75d6903177b1d7e9]::run_test::{closure#0}<unknown>
  1698. 168.10 s > at <unknown source file>:<unknown line>
  1699. 168.10 s > 13: std[bcb96dfbba0ab899]::sys::backtrace::__rust_begin_short_backtrace::<test[75d6903177b1d7e9]::run_test::{closure#1}, ()><unknown>
  1700. 168.10 s > at <unknown source file>:<unknown line>
  1701. 168.10 s > 14: <std[bcb96dfbba0ab899]::thread::lifecycle::spawn_unchecked<test[75d6903177b1d7e9]::run_test::{closure#1}, ()>::{closure#1} as core[940e698046960fd5]::ops::function::FnOnce<()>>::call_once::{shim:vtable#0}<unknown>
  1702. 168.10 s > at <unknown source file>:<unknown line>
  1703. 168.10 s > 15: <std[bcb96dfbba0ab899]::sys::thread::unix::Thread>::new::thread_start<unknown>
  1704. 168.10 s > at <unknown source file>:<unknown line>
  1705. 168.10 s > 16: start_thread<unknown>
  1706. 168.10 s > at <unknown source file>:<unknown line>
  1707. 168.10 s > 17: __clone3<unknown>
  1708. 168.10 s > at <unknown source file>:<unknown line>
  1709. 168.10 s >
  1710. 168.10 s > Run with COLORBT_SHOW_HIDDEN=1 environment variable to disable frame filtering.
  1711. 168.10 s > Run with RUST_BACKTRACE=full to include source snippets.
  1712. 168.10 s > Warning: SpanTrace capture is Unsupported.
  1713. 168.10 s > Ensure that you've setup a tracing-error ErrorLayer and the semver versions are compatible
  1714. 168.10 s > system-out
  1715. 168.10 s > running 1 test
  1716. 168.10 s > test profile_bulk::massless_triangle_bulk_profile_passes ... FAILED
  1717. 168.10 s >
  1718. 168.10 s > failures:
  1719. 168.10 s >
  1720. 168.10 s > failures:
  1721. 168.10 s > profile_bulk::massless_triangle_bulk_profile_passes
  1722. 168.10 s >
  1723. 168.10 s > test result: FAILED. 0 passed; 1 failed; 0 ignored; 0 measured; 82 filtered out; finished in 0.58s
  1724. 168.10 s > system-err
  1725. 168.10 s > [2026-08-27 10:07:40.710] @gammaloop_api::se... INFO : Running command import model scalars
  1726. 168.10 s > [2026-08-27 10:07:40.714] @import::model INFO : Loading built-in JSON model scalars-default
  1727. 168.10 s > [2026-08-27 10:07:40.719] @gammalooprs::model INFO : The following 2 external parameters were forced to zero by the restriction card:
  1728. 168.10 s > width_scalar_1, width_scalar_2
  1729. 168.10 s > [2026-08-27 10:07:40.720] @gammaloop_api::se... INFO : Running command import graphs ./tests/resources/graphs/massless_triangle.dot
  1730. 168.10 s > [2026-08-27 10:07:40.721] @commands::import INFO : Loading graphs from '/build/source/tests/resources/graphs/massless_triangle.dot'
  1731. 168.10 s > [2026-08-27 10:07:40.739] @gammaloop_api::se... INFO : Running command generate
  1732. 168.10 s > [2026-08-27 10:07:40.855] @commands::generate INFO :
  1733. 168.10 s > Integrand generation summary
  1734. 168.10 s > peak RAM 64.00 MiB | cores 1
  1735. 168.10 s > ╭───────────┬─────────────────────┬─────────┬────────────┬────────────┬────────────────┬─────────────╮
  1736. 168.10 s > │ integrand │ graph │ # evals │ expr build │ spenso │ symbolica eval │ compile │
  1737. 168.10 s > ├───────────┼─────────────────────┼─────────┼────────────┼────────────┼────────────────┼─────────────┤
  1738. 168.10 s > │ default │ massless_triangle_0 │ 9 │ 58ms (69%) │ 2ms (2.6%) │ 23ms (28%) │ 0ms (0.00%) │
  1739. 168.10 s > ├───────────┼─────────────────────┼─────────┼────────────┼────────────┼────────────────┼─────────────┤
  1740. 168.10 s > │ Total │ │ 9 │ 58ms (69%) │ 2ms (2.6%) │ 23ms (28%) │ 0ms (0.00%) │
  1741. 168.10 s > ╰───────────┴─────────────────────┴─────────┴────────────┴────────────┴────────────────┴─────────────╯
  1742. 168.10 s > [2026-08-27 10:07:40.857] @process::amplitude INFO : Input is above threshold: 2 existing threshold E-surfaces across 1/1 graph groups
  1743. 168.10 s > [2026-08-27 10:07:40.857] @process::amplitude INFO : overlap structure of group 0: [2: [0(1,5), 1(1,3)]]
  1744. 168.10 s > Error:
  1745. 168.10 s > 0: IR profiling requested arbitrary precision but received a quad-precision result
  1746. 168.10 s >
  1747. 168.10 s > Location:
  1748. 168.10 s > crates/gammalooprs/src/integrands/process/ir.rs:2123
  1749. 168.10 s >
  1750. 168.10 s > ━━━━━━━━━━━━━━━━━━━━━━━━━━━━━━━━━━ BACKTRACE ━━━━━━━━━━━━━━━━━━━━━━━━━━━━━━━━━━━
  1751. 168.10 s > 1: <color_eyre[51793ea62743adbd]::config::EyreHook>::into_eyre_hook::{closure#0}<unknown>
  1752. 168.10 s > at <unknown source file>:<unknown line>
  1753. 168.10 s > 2: eyre[cb2fd339c0c40fca]::capture_handler<unknown>
  1754. 168.10 s > at <unknown source file>:<unknown line>
  1755. 168.10 s > 3: eyre[cb2fd339c0c40fca]::private::format_err<unknown>
  1756. 168.10 s > at <unknown source file>:<unknown line>
  1757. 168.10 s > 4: gammalooprs[d7a7c067ebd19583]::integrands::process::ir::evaluate_profile_momentum_point_arb::<gammalooprs[d7a7c067ebd19583]::integrands::process::amplitude::AmplitudeIntegrand><unknown>
  1758. 168.10 s > at <unknown source file>:<unknown line>
  1759. 168.10 s > 5: <gammalooprs[d7a7c067ebd19583]::integrands::process::amplitude::AmplitudeIntegrand>::test_single_ir_limit_impl<unknown>
  1760. 168.10 s > at <unknown source file>:<unknown line>
  1761. 168.10 s > 6: gammalooprs[d7a7c067ebd19583]::integrands::process::ir::run_ir_profile::<gammalooprs[d7a7c067ebd19583]::integrands::process::amplitude::AmplitudeIntegrand, <gammalooprs[d7a7c067ebd19583]::integrands::process::amplitude::AmplitudeIntegrand>::enumerate_ir_limits, <gammalooprs[d7a7c067ebd19583]::integrands::process::amplitude::AmplitudeIntegrand>::graph_cut_definitions, <gammalooprs[d7a7c067ebd19583]::integrands::process::amplitude::AmplitudeIntegrand>::test_single_ir_limit_impl><unknown>
  1762. 168.10 s > at <unknown source file>:<unknown line>
  1763. 168.10 s > 7: <gammalooprs[d7a7c067ebd19583]::integrands::process::amplitude::AmplitudeIntegrand>::test_ir<unknown>
  1764. 168.10 s > at <unknown source file>:<unknown line>
  1765. 168.10 s > 8: <gammaloop_api[92ae732909e47e14]::commands::profile::Profile>::run<unknown>
  1766. 168.10 s > at <unknown source file>:<unknown line>
  1767. 168.10 s > 9: test_runs[3e7a390caee4e338]::profile_bulk::massless_triangle_bulk_profile_passes<unknown>
  1768. 168.10 s > at <unknown source file>:<unknown line>
  1769. 168.10 s > 10: <test_runs[3e7a390caee4e338]::profile_bulk::massless_triangle_bulk_profile_passes::{closure#0} as core[940e698046960fd5]::ops::function::FnOnce<()>>::call_once<unknown>
  1770. 168.10 s > at <unknown source file>:<unknown line>
  1771. 168.10 s > 11: test[75d6903177b1d7e9]::__rust_begin_short_backtrace::<core[940e698046960fd5]::result::Result<(), alloc[2ea6bcb46fca0c42]::string::String>, fn() -> core[940e698046960fd5]::result::Result<(), alloc[2ea6bcb46fca0c42]::string::String>><unknown>
  1772. 168.10 s > at <unknown source file>:<unknown line>
  1773. 168.10 s > 12: test[75d6903177b1d7e9]::run_test::{closure#0}<unknown>
  1774. 168.10 s > at <unknown source file>:<unknown line>
  1775. 168.10 s > 13: std[bcb96dfbba0ab899]::sys::backtrace::__rust_begin_short_backtrace::<test[75d6903177b1d7e9]::run_test::{closure#1}, ()><unknown>
  1776. 168.10 s > at <unknown source file>:<unknown line>
  1777. 168.10 s > 14: <std[bcb96dfbba0ab899]::thread::lifecycle::spawn_unchecked<test[75d6903177b1d7e9]::run_test::{closure#1}, ()>::{closure#1} as core[940e698046960fd5]::ops::function::FnOnce<()>>::call_once::{shim:vtable#0}<unknown>
  1778. 168.10 s > at <unknown source file>:<unknown line>
  1779. 168.10 s > 15: <std[bcb96dfbba0ab899]::sys::thread::unix::Thread>::new::thread_start<unknown>
  1780. 168.10 s > at <unknown source file>:<unknown line>
  1781. 168.10 s > 16: start_thread<unknown>
  1782. 168.10 s > at <unknown source file>:<unknown line>
  1783. 168.10 s > 17: __clone3<unknown>
  1784. 168.10 s > at <unknown source file>:<unknown line>
  1785. 168.10 s >
  1786. 168.10 s > Run with COLORBT_SHOW_HIDDEN=1 environment variable to disable frame filtering.
  1787. 168.10 s > Run with RUST_BACKTRACE=full to include source snippets.
  1788. 168.10 s > Warning: SpanTrace capture is Unsupported.
  1789. 168.10 s > Ensure that you've setup a tracing-error ErrorLayer and the semver versions are compatible
  1790. 168.10 s >
  1791. 168.10 s > 5. gammaloop-integration-tests::test_runs::profile_bulk::double_dotted_bubble_amp_bulk_profile_passes
  1792. 168.10 s > failure: test failure with exit code 101
  1793. 168.10 s > Error:
  1794. 168.10 s > 0: IR profiling requested arbitrary precision but received a quad-precision result
  1795. 168.10 s >
  1796. 168.10 s > Location:
  1797. 168.10 s > crates/gammalooprs/src/integrands/process/ir.rs:2123
  1798. 168.10 s >
  1799. 168.10 s > ━━━━━━━━━━━━━━━━━━━━━━━━━━━━━━━━━━ BACKTRACE ━━━━━━━━━━━━━━━━━━━━━━━━━━━━━━━━━━━
  1800. 168.10 s > 1: <color_eyre[51793ea62743adbd]::config::EyreHook>::into_eyre_hook::{closure#0}<unknown>
  1801. 168.10 s > at <unknown source file>:<unknown line>
  1802. 168.10 s > 2: eyre[cb2fd339c0c40fca]::capture_handler<unknown>
  1803. 168.10 s > at <unknown source file>:<unknown line>
  1804. 168.10 s > 3: eyre[cb2fd339c0c40fca]::private::format_err<unknown>
  1805. 168.10 s > at <unknown source file>:<unknown line>
  1806. 168.10 s > 4: gammalooprs[d7a7c067ebd19583]::integrands::process::ir::evaluate_profile_momentum_point_arb::<gammalooprs[d7a7c067ebd19583]::integrands::process::amplitude::AmplitudeIntegrand><unknown>
  1807. 168.10 s > at <unknown source file>:<unknown line>
  1808. 168.10 s > 5: <gammalooprs[d7a7c067ebd19583]::integrands::process::amplitude::AmplitudeIntegrand>::test_single_ir_limit_impl<unknown>
  1809. 168.10 s > at <unknown source file>:<unknown line>
  1810. 168.10 s > 6: gammalooprs[d7a7c067ebd19583]::integrands::process::ir::run_ir_profile::<gammalooprs[d7a7c067ebd19583]::integrands::process::amplitude::AmplitudeIntegrand, <gammalooprs[d7a7c067ebd19583]::integrands::process::amplitude::AmplitudeIntegrand>::enumerate_ir_limits, <gammalooprs[d7a7c067ebd19583]::integrands::process::amplitude::AmplitudeIntegrand>::graph_cut_definitions, <gammalooprs[d7a7c067ebd19583]::integrands::process::amplitude::AmplitudeIntegrand>::test_single_ir_limit_impl><unknown>
  1811. 168.10 s > at <unknown source file>:<unknown line>
  1812. 168.10 s > 7: <gammalooprs[d7a7c067ebd19583]::integrands::process::amplitude::AmplitudeIntegrand>::test_ir<unknown>
  1813. 168.10 s > at <unknown source file>:<unknown line>
  1814. 168.10 s > 8: <gammaloop_api[92ae732909e47e14]::commands::profile::Profile>::run<unknown>
  1815. 168.10 s > at <unknown source file>:<unknown line>
  1816. 168.10 s > 9: test_runs[3e7a390caee4e338]::profile_bulk::double_dotted_bubble_amp_bulk_profile_passes<unknown>
  1817. 168.10 s > at <unknown source file>:<unknown line>
  1818. 168.10 s > 10: <test_runs[3e7a390caee4e338]::profile_bulk::double_dotted_bubble_amp_bulk_profile_passes::{closure#0} as core[940e698046960fd5]::ops::function::FnOnce<()>>::call_once<unknown>
  1819. 168.10 s > at <unknown source file>:<unknown line>
  1820. 168.10 s > 11: test[75d6903177b1d7e9]::__rust_begin_short_backtrace::<core[940e698046960fd5]::result::Result<(), alloc[2ea6bcb46fca0c42]::string::String>, fn() -> core[940e698046960fd5]::result::Result<(), alloc[2ea6bcb46fca0c42]::string::String>><unknown>
  1821. 168.10 s > at <unknown source file>:<unknown line>
  1822. 168.10 s > 12: test[75d6903177b1d7e9]::run_test::{closure#0}<unknown>
  1823. 168.10 s > at <unknown source file>:<unknown line>
  1824. 168.10 s > 13: std[bcb96dfbba0ab899]::sys::backtrace::__rust_begin_short_backtrace::<test[75d6903177b1d7e9]::run_test::{closure#1}, ()><unknown>
  1825. 168.10 s > at <unknown source file>:<unknown line>
  1826. 168.10 s > 14: <std[bcb96dfbba0ab899]::thread::lifecycle::spawn_unchecked<test[75d6903177b1d7e9]::run_test::{closure#1}, ()>::{closure#1} as core[940e698046960fd5]::ops::function::FnOnce<()>>::call_once::{shim:vtable#0}<unknown>
  1827. 168.10 s > at <unknown source file>:<unknown line>
  1828. 168.10 s > 15: <std[bcb96dfbba0ab899]::sys::thread::unix::Thread>::new::thread_start<unknown>
  1829. 168.10 s > at <unknown source file>:<unknown line>
  1830. 168.10 s > 16: start_thread<unknown>
  1831. 168.10 s > at <unknown source file>:<unknown line>
  1832. 168.10 s > 17: __clone3<unknown>
  1833. 168.10 s > at <unknown source file>:<unknown line>
  1834. 168.10 s >
  1835. 168.10 s > Run with COLORBT_SHOW_HIDDEN=1 environment variable to disable frame filtering.
  1836. 168.10 s > Run with RUST_BACKTRACE=full to include source snippets.
  1837. 168.10 s > Warning: SpanTrace capture is Unsupported.
  1838. 168.10 s > Ensure that you've setup a tracing-error ErrorLayer and the semver versions are compatible
  1839. 168.10 s > system-out
  1840. 168.10 s > running 1 test
  1841. 168.10 s > test profile_bulk::double_dotted_bubble_amp_bulk_profile_passes ... FAILED
  1842. 168.10 s >
  1843. 168.10 s > failures:
  1844. 168.10 s >
  1845. 168.10 s > failures:
  1846. 168.10 s > profile_bulk::double_dotted_bubble_amp_bulk_profile_passes
  1847. 168.10 s >
  1848. 168.10 s > test result: FAILED. 0 passed; 1 failed; 0 ignored; 0 measured; 82 filtered out; finished in 1.21s
  1849. 168.10 s > system-err
  1850. 168.10 s > [2026-08-27 10:07:40.368] @gammaloop_api::se... INFO : Running command import model ./assets/models/json/scalars/scalars_2p_3p.json
  1851. 168.10 s > [2026-08-27 10:07:40.368] @import::model INFO : Loading JSON model scalars_2p_3p-default from /build/source/assets/models/json/scalars/scalars_2p_3p
  1852. 168.10 s > [2026-08-27 10:07:40.370] @gammaloop_api::se... INFO : Running command import graphs ./tests/resources/graphs/double_dotted_bubble_amp.dot
  1853. 168.10 s > [2026-08-27 10:07:40.370] @commands::import INFO : Loading graphs from '/build/source/tests/resources/graphs/double_dotted_bubble_amp.dot'
  1854. 168.10 s > [2026-08-27 10:07:40.378] @gammaloop_api::se... INFO : Running command generate
  1855. 168.10 s > [2026-08-27 10:07:41.147] @commands::generate INFO :
  1856. 168.10 s > Integrand generation summary
  1857. 168.10 s > peak RAM 67.32 MiB | cores 1
  1858. 168.10 s > ╭───────────┬──────────────────────────┬─────────┬─────────────┬─────────────┬────────────────┬─────────────╮
  1859. 168.10 s > │ integrand │ graph │ # evals │ expr build │ spenso │ symbolica eval │ compile │
  1860. 168.10 s > ├───────────┼──────────────────────────┼─────────┼─────────────┼─────────────┼────────────────┼─────────────┤
  1861. 168.10 s > │ default │ double_dotted_bubble_amp │ 11 │ 344ms (49%) │ 122ms (17%) │ 232ms (33%) │ 0ms (0.00%) │
  1862. 168.10 s > ├───────────┼──────────────────────────┼─────────┼─────────────┼─────────────┼────────────────┼─────────────┤
  1863. 168.10 s > │ Total │ │ 11 │ 344ms (49%) │ 122ms (17%) │ 232ms (33%) │ 0ms (0.00%) │
  1864. 168.10 s > ╰───────────┴──────────────────────────┴─────────┴─────────────┴─────────────┴────────────────┴─────────────╯
  1865. 168.10 s > [2026-08-27 10:07:41.148] @process::amplitude INFO : Input is above threshold: 1 existing threshold E-surfaces across 1/1 graph groups
  1866. 168.10 s > [2026-08-27 10:07:41.149] @process::amplitude INFO : overlap structure of group 0: [1: [1(1,4)]]
  1867. 168.10 s > Error:
  1868. 168.10 s > 0: IR profiling requested arbitrary precision but received a quad-precision result
  1869. 168.10 s >
  1870. 168.10 s > Location:
  1871. 168.10 s > crates/gammalooprs/src/integrands/process/ir.rs:2123
  1872. 168.10 s >
  1873. 168.10 s > ━━━━━━━━━━━━━━━━━━━━━━━━━━━━━━━━━━ BACKTRACE ━━━━━━━━━━━━━━━━━━━━━━━━━━━━━━━━━━━
  1874. 168.10 s > 1: <color_eyre[51793ea62743adbd]::config::EyreHook>::into_eyre_hook::{closure#0}<unknown>
  1875. 168.10 s > at <unknown source file>:<unknown line>
  1876. 168.10 s > 2: eyre[cb2fd339c0c40fca]::capture_handler<unknown>
  1877. 168.10 s > at <unknown source file>:<unknown line>
  1878. 168.10 s > 3: eyre[cb2fd339c0c40fca]::private::format_err<unknown>
  1879. 168.10 s > at <unknown source file>:<unknown line>
  1880. 168.10 s > 4: gammalooprs[d7a7c067ebd19583]::integrands::process::ir::evaluate_profile_momentum_point_arb::<gammalooprs[d7a7c067ebd19583]::integrands::process::amplitude::AmplitudeIntegrand><unknown>
  1881. 168.10 s > at <unknown source file>:<unknown line>
  1882. 168.10 s > 5: <gammalooprs[d7a7c067ebd19583]::integrands::process::amplitude::AmplitudeIntegrand>::test_single_ir_limit_impl<unknown>
  1883. 168.10 s > at <unknown source file>:<unknown line>
  1884. 168.10 s > 6: gammalooprs[d7a7c067ebd19583]::integrands::process::ir::run_ir_profile::<gammalooprs[d7a7c067ebd19583]::integrands::process::amplitude::AmplitudeIntegrand, <gammalooprs[d7a7c067ebd19583]::integrands::process::amplitude::AmplitudeIntegrand>::enumerate_ir_limits, <gammalooprs[d7a7c067ebd19583]::integrands::process::amplitude::AmplitudeIntegrand>::graph_cut_definitions, <gammalooprs[d7a7c067ebd19583]::integrands::process::amplitude::AmplitudeIntegrand>::test_single_ir_limit_impl><unknown>
  1885. 168.10 s > at <unknown source file>:<unknown line>
  1886. 168.10 s > 7: <gammalooprs[d7a7c067ebd19583]::integrands::process::amplitude::AmplitudeIntegrand>::test_ir<unknown>
  1887. 168.10 s > at <unknown source file>:<unknown line>
  1888. 168.10 s > 8: <gammaloop_api[92ae732909e47e14]::commands::profile::Profile>::run<unknown>
  1889. 168.10 s > at <unknown source file>:<unknown line>
  1890. 168.10 s > 9: test_runs[3e7a390caee4e338]::profile_bulk::double_dotted_bubble_amp_bulk_profile_passes<unknown>
  1891. 168.10 s > at <unknown source file>:<unknown line>
  1892. 168.10 s > 10: <test_runs[3e7a390caee4e338]::profile_bulk::double_dotted_bubble_amp_bulk_profile_passes::{closure#0} as core[940e698046960fd5]::ops::function::FnOnce<()>>::call_once<unknown>
  1893. 168.10 s > at <unknown source file>:<unknown line>
  1894. 168.10 s > 11: test[75d6903177b1d7e9]::__rust_begin_short_backtrace::<core[940e698046960fd5]::result::Result<(), alloc[2ea6bcb46fca0c42]::string::String>, fn() -> core[940e698046960fd5]::result::Result<(), alloc[2ea6bcb46fca0c42]::string::String>><unknown>
  1895. 168.10 s > at <unknown source file>:<unknown line>
  1896. 168.10 s > 12: test[75d6903177b1d7e9]::run_test::{closure#0}<unknown>
  1897. 168.10 s > at <unknown source file>:<unknown line>
  1898. 168.10 s > 13: std[bcb96dfbba0ab899]::sys::backtrace::__rust_begin_short_backtrace::<test[75d6903177b1d7e9]::run_test::{closure#1}, ()><unknown>
  1899. 168.10 s > at <unknown source file>:<unknown line>
  1900. 168.10 s > 14: <std[bcb96dfbba0ab899]::thread::lifecycle::spawn_unchecked<test[75d6903177b1d7e9]::run_test::{closure#1}, ()>::{closure#1} as core[940e698046960fd5]::ops::function::FnOnce<()>>::call_once::{shim:vtable#0}<unknown>
  1901. 168.10 s > at <unknown source file>:<unknown line>
  1902. 168.10 s > 15: <std[bcb96dfbba0ab899]::sys::thread::unix::Thread>::new::thread_start<unknown>
  1903. 168.10 s > at <unknown source file>:<unknown line>
  1904. 168.10 s > 16: start_thread<unknown>
  1905. 168.10 s > at <unknown source file>:<unknown line>
  1906. 168.10 s > 17: __clone3<unknown>
  1907. 168.10 s > at <unknown source file>:<unknown line>
  1908. 168.10 s >
  1909. 168.10 s > Run with COLORBT_SHOW_HIDDEN=1 environment variable to disable frame filtering.
  1910. 168.10 s > Run with RUST_BACKTRACE=full to include source snippets.
  1911. 168.10 s > Warning: SpanTrace capture is Unsupported.
  1912. 168.10 s > Ensure that you've setup a tracing-error ErrorLayer and the semver versions are compatible
  1913. 168.10 s >
  1914. 168.10 s > 6. gammaloop-integration-tests::test_runs::profile_bulk::scalar_self_energy_amp_bulk_profile_passes
  1915. 168.10 s > failure: test failure with exit code 101
  1916. 168.10 s > Error:
  1917. 168.10 s > 0: IR profiling requested arbitrary precision but received a quad-precision result
  1918. 168.10 s >
  1919. 168.10 s > Location:
  1920. 168.10 s > crates/gammalooprs/src/integrands/process/ir.rs:2123
  1921. 168.10 s >
  1922. 168.10 s > ━━━━━━━━━━━━━━━━━━━━━━━━━━━━━━━━━━ BACKTRACE ━━━━━━━━━━━━━━━━━━━━━━━━━━━━━━━━━━━
  1923. 168.10 s > 1: <color_eyre[51793ea62743adbd]::config::EyreHook>::into_eyre_hook::{closure#0}<unknown>
  1924. 168.10 s > at <unknown source file>:<unknown line>
  1925. 168.10 s > 2: eyre[cb2fd339c0c40fca]::capture_handler<unknown>
  1926. 168.10 s > at <unknown source file>:<unknown line>
  1927. 168.10 s > 3: eyre[cb2fd339c0c40fca]::private::format_err<unknown>
  1928. 168.10 s > at <unknown source file>:<unknown line>
  1929. 168.10 s > 4: gammalooprs[d7a7c067ebd19583]::integrands::process::ir::evaluate_profile_momentum_point_arb::<gammalooprs[d7a7c067ebd19583]::integrands::process::amplitude::AmplitudeIntegrand><unknown>
  1930. 168.10 s > at <unknown source file>:<unknown line>
  1931. 168.10 s > 5: <gammalooprs[d7a7c067ebd19583]::integrands::process::amplitude::AmplitudeIntegrand>::test_single_ir_limit_impl<unknown>
  1932. 168.10 s > at <unknown source file>:<unknown line>
  1933. 168.10 s > 6: gammalooprs[d7a7c067ebd19583]::integrands::process::ir::run_ir_profile::<gammalooprs[d7a7c067ebd19583]::integrands::process::amplitude::AmplitudeIntegrand, <gammalooprs[d7a7c067ebd19583]::integrands::process::amplitude::AmplitudeIntegrand>::enumerate_ir_limits, <gammalooprs[d7a7c067ebd19583]::integrands::process::amplitude::AmplitudeIntegrand>::graph_cut_definitions, <gammalooprs[d7a7c067ebd19583]::integrands::process::amplitude::AmplitudeIntegrand>::test_single_ir_limit_impl><unknown>
  1934. 168.10 s > at <unknown source file>:<unknown line>
  1935. 168.10 s > 7: <gammalooprs[d7a7c067ebd19583]::integrands::process::amplitude::AmplitudeIntegrand>::test_ir<unknown>
  1936. 168.10 s > at <unknown source file>:<unknown line>
  1937. 168.10 s > 8: <gammaloop_api[92ae732909e47e14]::commands::profile::Profile>::run<unknown>
  1938. 168.10 s > at <unknown source file>:<unknown line>
  1939. 168.10 s > 9: test_runs[3e7a390caee4e338]::profile_bulk::scalar_self_energy_amp_bulk_profile_passes<unknown>
  1940. 168.10 s > at <unknown source file>:<unknown line>
  1941. 168.10 s > 10: <test_runs[3e7a390caee4e338]::profile_bulk::scalar_self_energy_amp_bulk_profile_passes::{closure#0} as core[940e698046960fd5]::ops::function::FnOnce<()>>::call_once<unknown>
  1942. 168.10 s > at <unknown source file>:<unknown line>
  1943. 168.10 s > 11: test[75d6903177b1d7e9]::__rust_begin_short_backtrace::<core[940e698046960fd5]::result::Result<(), alloc[2ea6bcb46fca0c42]::string::String>, fn() -> core[940e698046960fd5]::result::Result<(), alloc[2ea6bcb46fca0c42]::string::String>><unknown>
  1944. 168.10 s > at <unknown source file>:<unknown line>
  1945. 168.10 s > 12: test[75d6903177b1d7e9]::run_test::{closure#0}<unknown>
  1946. 168.10 s > at <unknown source file>:<unknown line>
  1947. 168.10 s > 13: std[bcb96dfbba0ab899]::sys::backtrace::__rust_begin_short_backtrace::<test[75d6903177b1d7e9]::run_test::{closure#1}, ()><unknown>
  1948. 168.10 s > at <unknown source file>:<unknown line>
  1949. 168.10 s > 14: <std[bcb96dfbba0ab899]::thread::lifecycle::spawn_unchecked<test[75d6903177b1d7e9]::run_test::{closure#1}, ()>::{closure#1} as core[940e698046960fd5]::ops::function::FnOnce<()>>::call_once::{shim:vtable#0}<unknown>
  1950. 168.10 s > at <unknown source file>:<unknown line>
  1951. 168.10 s > 15: <std[bcb96dfbba0ab899]::sys::thread::unix::Thread>::new::thread_start<unknown>
  1952. 168.10 s > at <unknown source file>:<unknown line>
  1953. 168.10 s > 16: start_thread<unknown>
  1954. 168.10 s > at <unknown source file>:<unknown line>
  1955. 168.10 s > 17: __clone3<unknown>
  1956. 168.10 s > at <unknown source file>:<unknown line>
  1957. 168.10 s >
  1958. 168.10 s > Run with COLORBT_SHOW_HIDDEN=1 environment variable to disable frame filtering.
  1959. 168.10 s > Run with RUST_BACKTRACE=full to include source snippets.
  1960. 168.10 s > Warning: SpanTrace capture is Unsupported.
  1961. 168.10 s > Ensure that you've setup a tracing-error ErrorLayer and the semver versions are compatible
  1962. 168.10 s > system-out
  1963. 168.10 s > running 1 test
  1964. 168.10 s > test profile_bulk::scalar_self_energy_amp_bulk_profile_passes ... FAILED
  1965. 168.10 s >
  1966. 168.10 s > failures:
  1967. 168.10 s >
  1968. 168.10 s > failures:
  1969. 168.10 s > profile_bulk::scalar_self_energy_amp_bulk_profile_passes
  1970. 168.10 s >
  1971. 168.10 s > test result: FAILED. 0 passed; 1 failed; 0 ignored; 0 measured; 82 filtered out; finished in 0.90s
  1972. 168.10 s > system-err
  1973. 168.10 s > [2026-08-27 10:07:40.881] @gammaloop_api::se... INFO : Running command import model ./assets/models/json/scalars/scalars.json
  1974. 168.10 s > [2026-08-27 10:07:40.881] @import::model INFO : Loading JSON model scalars-default from /build/source/assets/models/json/scalars/scalars
  1975. 168.10 s > [2026-08-27 10:07:40.891] @gammalooprs::model INFO : The following 2 external parameters were forced to zero by the restriction card:
  1976. 168.10 s > width_scalar_1, width_scalar_2
  1977. 168.10 s > [2026-08-27 10:07:40.903] @gammaloop_api::se... INFO : Running command import graphs ./tests/resources/graphs/scalar_self_energy_amp.dot
  1978. 168.10 s > [2026-08-27 10:07:40.912] @commands::import INFO : Loading graphs from '/build/source/tests/resources/graphs/scalar_self_energy_amp.dot'
  1979. 168.10 s > [2026-08-27 10:07:40.929] @gammaloop_api::se... INFO : Running command generate
  1980. 168.10 s > [2026-08-27 10:07:41.486] @commands::generate INFO :
  1981. 168.10 s > Integrand generation summary
  1982. 168.10 s > peak RAM 70.91 MiB | cores 1
  1983. 168.10 s > ╭───────────┬────────────────────────┬─────────┬─────────────┬─────────────┬────────────────┬─────────────╮
  1984. 168.10 s > │ integrand │ graph │ # evals │ expr build │ spenso │ symbolica eval │ compile │
  1985. 168.10 s > ├───────────┼────────────────────────┼─────────┼─────────────┼─────────────┼────────────────┼─────────────┤
  1986. 168.10 s > │ default │ scalar_self_energy_amp │ 6 │ 375ms (91%) │ 24ms (5.8%) │ 14ms (3.4%) │ 0ms (0.00%) │
  1987. 168.10 s > ├───────────┼────────────────────────┼─────────┼─────────────┼─────────────┼────────────────┼─────────────┤
  1988. 168.10 s > │ Total │ │ 6 │ 375ms (91%) │ 24ms (5.8%) │ 14ms (3.4%) │ 0ms (0.00%) │
  1989. 168.10 s > ╰───────────┴────────────────────────┴─────────┴─────────────┴─────────────┴────────────────┴─────────────╯
  1990. 168.10 s > [2026-08-27 10:07:41.488] @process::amplitude INFO : Input is above threshold: 2 existing threshold E-surfaces across 1/1 graph groups
  1991. 168.10 s > [2026-08-27 10:07:41.488] @process::amplitude INFO : overlap structure of group 0: [2: [2(1,5), 4(2,3,5)]]
  1992. 168.10 s > Error:
  1993. 168.10 s > 0: IR profiling requested arbitrary precision but received a quad-precision result
  1994. 168.10 s >
  1995. 168.10 s > Location:
  1996. 168.10 s > crates/gammalooprs/src/integrands/process/ir.rs:2123
  1997. 168.10 s >
  1998. 168.10 s > ━━━━━━━━━━━━━━━━━━━━━━━━━━━━━━━━━━ BACKTRACE ━━━━━━━━━━━━━━━━━━━━━━━━━━━━━━━━━━━
  1999. 168.10 s > 1: <color_eyre[51793ea62743adbd]::config::EyreHook>::into_eyre_hook::{closure#0}<unknown>
  2000. 168.10 s > at <unknown source file>:<unknown line>
  2001. 168.10 s > 2: eyre[cb2fd339c0c40fca]::capture_handler<unknown>
  2002. 168.10 s > at <unknown source file>:<unknown line>
  2003. 168.10 s > 3: eyre[cb2fd339c0c40fca]::private::format_err<unknown>
  2004. 168.10 s > at <unknown source file>:<unknown line>
  2005. 168.10 s > 4: gammalooprs[d7a7c067ebd19583]::integrands::process::ir::evaluate_profile_momentum_point_arb::<gammalooprs[d7a7c067ebd19583]::integrands::process::amplitude::AmplitudeIntegrand><unknown>
  2006. 168.10 s > at <unknown source file>:<unknown line>
  2007. 168.10 s > 5: <gammalooprs[d7a7c067ebd19583]::integrands::process::amplitude::AmplitudeIntegrand>::test_single_ir_limit_impl<unknown>
  2008. 168.10 s > at <unknown source file>:<unknown line>
  2009. 168.10 s > 6: gammalooprs[d7a7c067ebd19583]::integrands::process::ir::run_ir_profile::<gammalooprs[d7a7c067ebd19583]::integrands::process::amplitude::AmplitudeIntegrand, <gammalooprs[d7a7c067ebd19583]::integrands::process::amplitude::AmplitudeIntegrand>::enumerate_ir_limits, <gammalooprs[d7a7c067ebd19583]::integrands::process::amplitude::AmplitudeIntegrand>::graph_cut_definitions, <gammalooprs[d7a7c067ebd19583]::integrands::process::amplitude::AmplitudeIntegrand>::test_single_ir_limit_impl><unknown>
  2010. 168.10 s > at <unknown source file>:<unknown line>
  2011. 168.10 s > 7: <gammalooprs[d7a7c067ebd19583]::integrands::process::amplitude::AmplitudeIntegrand>::test_ir<unknown>
  2012. 168.10 s > at <unknown source file>:<unknown line>
  2013. 168.10 s > 8: <gammaloop_api[92ae732909e47e14]::commands::profile::Profile>::run<unknown>
  2014. 168.10 s > at <unknown source file>:<unknown line>
  2015. 168.10 s > 9: test_runs[3e7a390caee4e338]::profile_bulk::scalar_self_energy_amp_bulk_profile_passes<unknown>
  2016. 168.10 s > at <unknown source file>:<unknown line>
  2017. 168.10 s > 10: <test_runs[3e7a390caee4e338]::profile_bulk::scalar_self_energy_amp_bulk_profile_passes::{closure#0} as core[940e698046960fd5]::ops::function::FnOnce<()>>::call_once<unknown>
  2018. 168.10 s > at <unknown source file>:<unknown line>
  2019. 168.10 s > 11: test[75d6903177b1d7e9]::__rust_begin_short_backtrace::<core[940e698046960fd5]::result::Result<(), alloc[2ea6bcb46fca0c42]::string::String>, fn() -> core[940e698046960fd5]::result::Result<(), alloc[2ea6bcb46fca0c42]::string::String>><unknown>
  2020. 168.10 s > at <unknown source file>:<unknown line>
  2021. 168.10 s > 12: test[75d6903177b1d7e9]::run_test::{closure#0}<unknown>
  2022. 168.10 s > at <unknown source file>:<unknown line>
  2023. 168.10 s > 13: std[bcb96dfbba0ab899]::sys::backtrace::__rust_begin_short_backtrace::<test[75d6903177b1d7e9]::run_test::{closure#1}, ()><unknown>
  2024. 168.10 s > at <unknown source file>:<unknown line>
  2025. 168.10 s > 14: <std[bcb96dfbba0ab899]::thread::lifecycle::spawn_unchecked<test[75d6903177b1d7e9]::run_test::{closure#1}, ()>::{closure#1} as core[940e698046960fd5]::ops::function::FnOnce<()>>::call_once::{shim:vtable#0}<unknown>
  2026. 168.10 s > at <unknown source file>:<unknown line>
  2027. 168.10 s > 15: <std[bcb96dfbba0ab899]::sys::thread::unix::Thread>::new::thread_start<unknown>
  2028. 168.10 s > at <unknown source file>:<unknown line>
  2029. 168.10 s > 16: start_thread<unknown>
  2030. 168.10 s > at <unknown source file>:<unknown line>
  2031. 168.10 s > 17: __clone3<unknown>
  2032. 168.10 s > at <unknown source file>:<unknown line>
  2033. 168.10 s >
  2034. 168.10 s > Run with COLORBT_SHOW_HIDDEN=1 environment variable to disable frame filtering.
  2035. 168.10 s > Run with RUST_BACKTRACE=full to include source snippets.
  2036. 168.10 s > Warning: SpanTrace capture is Unsupported.
  2037. 168.10 s > Ensure that you've setup a tracing-error ErrorLayer and the semver versions are compatible
  2038. 168.10 s >
  2039. 168.10 s > 7. gammaloop-integration-tests::uv::dod2_bubble_uv
  2040. 168.10 s > failure: test failure with exit code 101
  2041. 168.10 s > system-out
  2042. 168.10 s > running 1 test
  2043. 168.10 s > +-------------+-----------------+---------+--------+----------+-----------------------------------------------------------------------------------------------------------------------+-------+
  2044. 168.10 s > | case | check | graph | status | sigma | threshold | error |
  2045. 168.10 s > +-------------+-----------------+---------+--------+----------+-----------------------------------------------------------------------------------------------------------------------+-------+
  2046. 168.10 s > | dod2_bubble | uv_profile | - | FAIL | - | - | - |
  2047. 168.10 s > +-------------+-----------------+---------+--------+----------+-----------------------------------------------------------------------------------------------------------------------+-------+
  2048. 168.10 s > | dod2_bubble | m_uv.inspect | inspect | pass | - | best inspect relative delta 1.000e0 >= 1000*accuracy 1.000e-7 (accuracy=1.000e-10, exponent=+8.0, seed=0, probes=10) | - |
  2049. 168.10 s > +-------------+-----------------+---------+--------+----------+-----------------------------------------------------------------------------------------------------------------------+-------+
  2050. 168.10 s > | dod2_bubble | m_uv.integrated | GL0 | pass | 0.0sigma | compatible within 2sigma | - |
  2051. 168.10 s > +-------------+-----------------+---------+--------+----------+-----------------------------------------------------------------------------------------------------------------------+-------+
  2052. 168.10 s > | dod2_bubble | rls.inspect | inspect | pass | - | best inspect relative delta 2.822e-3 >= 1000*accuracy 1.000e-7 (accuracy=1.000e-10, exponent=+2.0, seed=1, probes=10) | - |
  2053. 168.10 s > +-------------+-----------------+---------+--------+----------+-----------------------------------------------------------------------------------------------------------------------+-------+
  2054. 168.10 s > | dod2_bubble | rls.integrated | GL0 | pass | 0.0sigma | compatible within 2sigma | - |
  2055. 168.10 s > +-------------+-----------------+---------+--------+----------+-----------------------------------------------------------------------------------------------------------------------+-------+
  2056. 168.10 s > | dod2_bubble | mu_r.inspect | inspect | pass | - | best inspect relative delta 6.951e-1 >= 1000*accuracy 1.000e-7 (accuracy=1.000e-10, exponent=+0.0, seed=0, probes=10) | - |
  2057. 168.10 s > +-------------+-----------------+---------+--------+----------+-----------------------------------------------------------------------------------------------------------------------+-------+
  2058. 168.10 s > | dod2_bubble | target | - | pass | - | 2sigma | - |
  2059. 168.10 s > +-------------+-----------------+---------+--------+----------+-----------------------------------------------------------------------------------------------------------------------+-------+
  2060. 168.10 s > test dod2_bubble_uv ... FAILED
  2061. 168.10 s >
  2062. 168.10 s > failures:
  2063. 168.10 s >
  2064. 168.10 s > failures:
  2065. 168.10 s > dod2_bubble_uv
  2066. 168.10 s >
  2067. 168.10 s > test result: FAILED. 0 passed; 1 failed; 0 ignored; 0 measured; 24 filtered out; finished in 56.92s
  2068. 168.10 s > system-err
  2069. 168.10 s > [2026-08-27 10:07:45.505] @gammaloop_api::se... INFO : Running command run generate
  2070. 168.10 s > [2026-08-27 10:07:45.505] @gammaloop_api::se... INFO : Starting command block generate
  2071. 168.10 s > [2026-08-27 10:07:45.505] @gammaloop_api::se... INFO : Running command import model scalars-default.json
  2072. 168.10 s > [2026-08-27 10:07:45.505] @import::model INFO : Loading built-in JSON model scalars-default
  2073. 168.10 s > [2026-08-27 10:07:45.511] @gammalooprs::model INFO : The following 2 external parameters were forced to zero by the restriction card:
  2074. 168.10 s > width_scalar_1, width_scalar_2
  2075. 168.10 s > [2026-08-27 10:07:45.511] @gammaloop_api::se... INFO : Running command remove processes
  2076. 168.10 s > [2026-08-27 10:07:45.512] @gammaloop_api::se... INFO : Running command set global kv global.generation.uv.generate_integrated=true
  2077. 168.10 s > [2026-08-27 10:07:45.512] @gammaloop_api::se... INFO : Running command import graphs ./tests/resources/graphs/scalar/dod2_bubble.dot -p bubble_dod2 -i scalar_bubble_below_thres
  2078. 168.10 s > [2026-08-27 10:07:45.513] @commands::import INFO : Loading graphs from '/build/source/tests/resources/graphs/scalar/dod2_bubble.dot'
  2079. 168.10 s > [2026-08-27 10:07:45.518] @gammaloop_api::se... INFO : Running command generate existing -p bubble_dod2 -i scalar_bubble_below_thres
  2080. 168.10 s > [2026-08-27 10:07:45.519] @approx::local_4d [{#uv, #inspect, #integrated}] DEBUG : Rescaled momenta expanded
  2081. 168.10 s > field value
  2082. 168.10 s > res n-terms: 1, byte size: 585,expr:
  2083. 168.10 s > -SCALAR_COUPLING²·q₀(αᵉ².¹)·q₀(αᵉ³.¹)·q₂(αᵉ².¹)·q₂(αᵉ³.¹)
  2084. 168.10 s > /(t²·denom(3,-q₀-q₂/t,mass_scalar_2²,-mass_scalar_2²+2·(q₀.q₂)/t+(q₂.q₂)/t²+(q₀.q₀))
  2085. 168.10 s > ·denom(2,q₂/t,mass_scalar_2²,-mass_scalar_2²+(q₂.q₂)/t²))
  2086. 168.10 s > [2026-08-27 10:07:45.524] @approx::local_4d [{#uv, #inspect, #integrated}] DEBUG : Rescaled momenta expanded
  2087. 168.10 s > field value
  2088. 168.10 s > res n-terms: 1, byte size: 3,expr:
  2089. 168.10 s > 1
  2090. 168.10 s > [2026-08-27 10:07:45.524] @approx::final_integrand[{#generation, #profile, #uv, #graph, #summary}] DEBUG : Computed global numerator
  2091. 168.10 s > field value
  2092. 168.10 s > global_num n-terms: 1, byte size: 4,expr:
  2093. 168.10 s > 1/2
  2094. 168.10 s > span build_3d{span_context=true graph=GL0 current=subgraph=0, topo_order=0, dod=0}
  2095. 168.10 s > [2026-08-27 10:07:45.526] @uv::approx [{#generation, #uv, #fourd}] DEBUG : Computing 4D
  2096. 168.10 s > field value
  2097. 168.10 s > simple subgraph(S_11,S_y)*Approx(subgraph(S_y,0)) of GL0
  2098. 168.10 s > span compute_4d{span_context=true graph=GL0 current=subgraph=y, topo_order=1, dod=2 given=subgraph=0, topo_order=0, dod=0 reduced=SubSet { set: BitVec<usize, bitvec::order::Lsb0> { addr: 0x7fffec015670, head: 000000, bits: 6, capacity: 64 } [0, 0, 1, 1, 1, 1], id: PhantomData<linnet::half_edge::involution::Hedge> }}
  2099. 168.10 s > [2026-08-27 10:07:45.530] @approx::local_4d [{#uv, #algebra, #integrated, #start}] DEBUG :
  2100. 168.10 s > field value
  2101. 168.10 s > integrand n-terms: 1, byte size: 409,expr:
  2102. 168.10 s > SCALAR_COUPLING²·(q₀(αᵉ³.¹)+q₃(αᵉ³.¹))·q₀(αᵉ².¹)·q₀(αᵉ³.¹)·q₂(αᵉ².¹)
  2103. 168.10 s > /(denom(2,q₂,mass_scalar_2²,-mass_scalar_2²+(q₂.q₂))·denom(3,q₃,mass_scalar_2²,-mass_scalar_2²+(q₃.q₃)))
  2104. 168.10 s > reduced y
  2105. 168.10 s > span grow{span_context=true current=subgraph=y, topo_order=1, dod=2 given=subgraph=0, topo_order=0, dod=0}
  2106. 168.10 s > [2026-08-27 10:07:45.530] @approx::local_4d [{#uv, #inspect, #integrated}] DEBUG : Rescaled momenta expanded
  2107. 168.10 s > field value
  2108. 168.10 s > res n-terms: 1, byte size: 585,expr:
  2109. 168.10 s > -SCALAR_COUPLING²·q₀(αᵉ².¹)·q₀(αᵉ³.¹)·q₂(αᵉ².¹)·q₂(αᵉ³.¹)
  2110. 168.10 s > /(t²·denom(3,-q₀-q₂/t,mass_scalar_2²,-mass_scalar_2²+2·(q₀.q₂)/t+(q₂.q₂)/t²+(q₀.q₀))
  2111. 168.10 s > ·denom(2,q₂/t,mass_scalar_2²,-mass_scalar_2²+(q₂.q₂)/t²))
  2112. 168.10 s > span t{span_context=true current=subgraph=y, topo_order=1, dod=2 given=subgraph=0, topo_order=0, dod=0}
  2113. 168.10 s > [2026-08-27 10:07:45.530] @approx::local_4d [{#uv, #integrated, #rescaled}] DEBUG : Rescaled expanded
  2114. 168.10 s > field value
  2115. 168.10 s > n_loops 1
  2116. 168.10 s > res n-terms: 1, byte size: 707,expr:
  2117. 168.10 s > -SCALAR_COUPLING²·q₀(αᵉ².¹)·q₀(αᵉ³.¹)·q₂(αᵉ².¹)·q₂(αᵉ³.¹)
  2118. 168.10 s > /(t²·denom(3,-q₂,mUVexp²+t²·mass_scalar_2²,-mUV²+t²·(-mass_scalar_2²+2·(q₀.q₂)/t+(q₂.q₂)/t²+(q₀.q₀))+t²·mUVexp²)
  2119. 168.10 s > ·denom(2,q₂,mUVexp²+t²·mass_scalar_2²,-mUV²+t²·(-mass_scalar_2²+(q₂.q₂)/t²)+t²·mUVexp²))
  2120. 168.10 s > span t{span_context=true current=subgraph=y, topo_order=1, dod=2 given=subgraph=0, topo_order=0, dod=0}
  2121. 168.10 s > [2026-08-27 10:07:45.531] @approx::local_4d [{#uv, #integrated, #series}] DEBUG : Series expanded
  2122. 168.10 s > field value
  2123. 168.10 s > res n-terms: 3, byte size: 1896,expr:
  2124. 168.10 s > (1/2·SCALAR_COUPLING²·(2·mUVexp²-2·mass_scalar_2²)/(denom(2,q₂,mUVexp²,-mUV²+(q₂.q₂))²·denom(3,-q₂,mUVexp²,-mUV²+(q₂.q₂)))
  2125. 168.10 s > -SCALAR_COUPLING²
  2126. 168.10 s > ·(-1/2·(2·mUVexp²-2·mass_scalar_2²+2·(q₀.q₀))/denom(3,-q₂,mUVexp²,-mUV²+(q₂.q₂))
  2127. 168.10 s > +4·(q₀.q₂)²/denom(3,-q₂,mUVexp²,-mUV²+(q₂.q₂))²
  2128. 168.10 s > )/(denom(2,q₂,mUVexp²,-mUV²+(q₂.q₂))·denom(3,-q₂,mUVexp²,-mUV²+(q₂.q₂)))
  2129. 168.10 s > )·q₀(αᵉ².¹)·q₀(αᵉ³.¹)·q₂(αᵉ².¹)·q₂(αᵉ³.¹)
  2130. 168.10 s > +2·SCALAR_COUPLING²·(q₀.q₂)·q₀(αᵉ².¹)·q₀(αᵉ³.¹)·q₂(αᵉ².¹)·q₂(αᵉ³.¹)
  2131. 168.10 s > /(t·denom(2,q₂,mUVexp²,-mUV²+(q₂.q₂))·denom(3,-q₂,mUVexp²,-mUV²+(q₂.q₂))²)
  2132. 168.10 s > -SCALAR_COUPLING²·q₀(αᵉ².¹)·q₀(αᵉ³.¹)·q₂(αᵉ².¹)·q₂(αᵉ³.¹)
  2133. 168.10 s > /(t²·denom(2,q₂,mUVexp²,-mUV²+(q₂.q₂))·denom(3,-q₂,mUVexp²,-mUV²+(q₂.q₂)))
  2134. 168.10 s > span t{span_context=true current=subgraph=y, topo_order=1, dod=2 given=subgraph=0, topo_order=0, dod=0}
  2135. 168.10 s > [2026-08-27 10:07:45.531] @approx::local_4d [{#uv, #integrated, #series}] DEBUG : Evaluated at t = 1
  2136. 168.10 s > field value
  2137. 168.10 s > res n-terms: 3, byte size: 1880,expr:
  2138. 168.10 s > (1/2·SCALAR_COUPLING²·(2·mUVexp²-2·mass_scalar_2²)/(denom(2,q₂,mUVexp²,-mUV²+(q₂.q₂))²·denom(3,-q₂,mUVexp²,-mUV²+(q₂.q₂)))
  2139. 168.10 s > -SCALAR_COUPLING²
  2140. 168.10 s > ·(-1/2·(2·mUVexp²-2·mass_scalar_2²+2·(q₀.q₀))/denom(3,-q₂,mUVexp²,-mUV²+(q₂.q₂))
  2141. 168.10 s > +4·(q₀.q₂)²/denom(3,-q₂,mUVexp²,-mUV²+(q₂.q₂))²
  2142. 168.10 s > )/(denom(2,q₂,mUVexp²,-mUV²+(q₂.q₂))·denom(3,-q₂,mUVexp²,-mUV²+(q₂.q₂)))
  2143. 168.10 s > )·q₀(αᵉ².¹)·q₀(αᵉ³.¹)·q₂(αᵉ².¹)·q₂(αᵉ³.¹)
  2144. 168.10 s > -SCALAR_COUPLING²·q₀(αᵉ².¹)·q₀(αᵉ³.¹)·q₂(αᵉ².¹)·q₂(αᵉ³.¹)
  2145. 168.10 s > /(denom(2,q₂,mUVexp²,-mUV²+(q₂.q₂))·denom(3,-q₂,mUVexp²,-mUV²+(q₂.q₂)))
  2146. 168.10 s > +2·SCALAR_COUPLING²·(q₀.q₂)·q₀(αᵉ².¹)·q₀(αᵉ³.¹)·q₂(αᵉ².¹)·q₂(αᵉ³.¹)
  2147. 168.10 s > /(denom(2,q₂,mUVexp²,-mUV²+(q₂.q₂))·denom(3,-q₂,mUVexp²,-mUV²+(q₂.q₂))²)
  2148. 168.10 s > span t{span_context=true current=subgraph=y, topo_order=1, dod=2 given=subgraph=0, topo_order=0, dod=0}
  2149. 168.10 s > [2026-08-27 10:07:45.532] @approx::local_4d [{#uv, #collect, #integrated}] DEBUG : After gamma chain collection
  2150. 168.10 s > field value
  2151. 168.10 s > expr n-terms: 3, byte size: 1880,expr:
  2152. 168.10 s > (1/2·SCALAR_COUPLING²·(2·mUVexp²-2·mass_scalar_2²)/(denom(2,q₂,mUVexp²,-mUV²+(q₂.q₂))²·denom(3,-q₂,mUVexp²,-mUV²+(q₂.q₂)))
  2153. 168.10 s > -SCALAR_COUPLING²
  2154. 168.10 s > ·(-1/2·(2·mUVexp²-2·mass_scalar_2²+2·(q₀.q₀))/denom(3,-q₂,mUVexp²,-mUV²+(q₂.q₂))
  2155. 168.10 s > +4·(q₀.q₂)²/denom(3,-q₂,mUVexp²,-mUV²+(q₂.q₂))²
  2156. 168.10 s > )/(denom(2,q₂,mUVexp²,-mUV²+(q₂.q₂))·denom(3,-q₂,mUVexp²,-mUV²+(q₂.q₂)))
  2157. 168.10 s > )·q₀(αᵉ².¹)·q₀(αᵉ³.¹)·q₂(αᵉ².¹)·q₂(αᵉ³.¹)
  2158. 168.10 s > -SCALAR_COUPLING²·q₀(αᵉ².¹)·q₀(αᵉ³.¹)·q₂(αᵉ².¹)·q₂(αᵉ³.¹)
  2159. 168.10 s > /(denom(2,q₂,mUVexp²,-mUV²+(q₂.q₂))·denom(3,-q₂,mUVexp²,-mUV²+(q₂.q₂)))
  2160. 168.10 s > +2·SCALAR_COUPLING²·(q₀.q₂)·q₀(αᵉ².¹)·q₀(αᵉ³.¹)·q₂(αᵉ².¹)·q₂(αᵉ³.¹)
  2161. 168.10 s > /(denom(2,q₂,mUVexp²,-mUV²+(q₂.q₂))·denom(3,-q₂,mUVexp²,-mUV²+(q₂.q₂))²)
  2162. 168.10 s > span t{span_context=true current=subgraph=y, topo_order=1, dod=2 given=subgraph=0, topo_order=0, dod=0}
  2163. 168.10 s > [2026-08-27 10:07:45.536] @approx::local_4d [{#profile, #uv, #collect, #integrated, #start, #trace}] DEBUG : After gamma schoonschip
  2164. 168.10 s > field value
  2165. 168.10 s > expr n-terms: 3, byte size: 1631,expr:
  2166. 168.10 s > (1/2·SCALAR_COUPLING²·(2·mUVexp²-2·mass_scalar_2²)/(denom(2,q₂,mUVexp²,-mUV²+(q₂.q₂))²·denom(3,-q₂,mUVexp²,-mUV²+(q₂.q₂)))
  2167. 168.10 s > -SCALAR_COUPLING²
  2168. 168.10 s > ·(-1/2·(2·mUVexp²-2·mass_scalar_2²+2·(q₀.q₀))/denom(3,-q₂,mUVexp²,-mUV²+(q₂.q₂))
  2169. 168.10 s > +4·(q₀.q₂)²/denom(3,-q₂,mUVexp²,-mUV²+(q₂.q₂))²
  2170. 168.10 s > )/(denom(2,q₂,mUVexp²,-mUV²+(q₂.q₂))·denom(3,-q₂,mUVexp²,-mUV²+(q₂.q₂)))
  2171. 168.10 s > )·(q₀.q₂)²
  2172. 168.10 s > -SCALAR_COUPLING²·(q₀.q₂)²/(denom(2,q₂,mUVexp²,-mUV²+(q₂.q₂))·denom(3,-q₂,mUVexp²,-mUV²+(q₂.q₂)))
  2173. 168.10 s > +2·SCALAR_COUPLING²·(q₀.q₂)·(q₀.q₂)²
  2174. 168.10 s > /(denom(2,q₂,mUVexp²,-mUV²+(q₂.q₂))·denom(3,-q₂,mUVexp²,-mUV²+(q₂.q₂))²)
  2175. 168.10 s > span t{span_context=true current=subgraph=y, topo_order=1, dod=2 given=subgraph=0, topo_order=0, dod=0}
  2176. 168.10 s > [2026-08-27 10:07:45.538] @approx::local_4d [{#profile, #uv, #collect, #integrated, #start, #trace}] DEBUG : After gamma collection
  2177. 168.10 s > field value
  2178. 168.10 s > expr n-terms: 1, byte size: 1347,expr:
  2179. 168.10 s > SCALAR_COUPLING²
  2180. 168.10 s > ·(-denom(2,q₂,mUVexp²,-mUV²+(q₂.q₂))·denom(3,-q₂,mUVexp²,-mUV²+(q₂.q₂))²
  2181. 168.10 s > +1/2·(2·mUVexp²-2·mass_scalar_2²)·denom(3,-q₂,mUVexp²,-mUV²+(q₂.q₂))²
  2182. 168.10 s > -(-1/2·(2·mUVexp²-2·mass_scalar_2²+2·(q₀.q₀))·denom(3,-q₂,mUVexp²,-mUV²+(q₂.q₂))+4·(q₀.q₂)²)
  2183. 168.10 s > ·denom(2,q₂,mUVexp²,-mUV²+(q₂.q₂))
  2184. 168.10 s > +2·(q₀.q₂)·denom(2,q₂,mUVexp²,-mUV²+(q₂.q₂))·denom(3,-q₂,mUVexp²,-mUV²+(q₂.q₂))
  2185. 168.10 s > )·(q₀.q₂)²/(denom(2,q₂,mUVexp²,-mUV²+(q₂.q₂))²·denom(3,-q₂,mUVexp²,-mUV²+(q₂.q₂))³)
  2186. 168.10 s > span t{span_context=true current=subgraph=y, topo_order=1, dod=2 given=subgraph=0, topo_order=0, dod=0}
  2187. 168.10 s > [2026-08-27 10:07:45.542] @approx::local_4d [{#profile, #uv, #gamma, #integrated, #start, #trace, #vakint}] DEBUG : After gamma simplification
  2188. 168.10 s > ... omitted 3263 more lines; see full nextest output above
  2189. 168.10 s >
  2190. 168.10 s > 8. gammaloop-integration-tests::uv::sunrise_scalar_1_uv
  2191. 168.10 s > failure: test failure with exit code 101
  2192. 168.10 s > system-out
  2193. 168.10 s > running 1 test
  2194. 168.10 s > test sunrise_scalar_1_uv has been running for over 60 seconds
  2195. 168.10 s > +------------------+------------------------+--------------+--------+----------+----------------------------------------------------------------------------------------------------------------------+-------+
  2196. 168.10 s > | case | check | graph | status | sigma | threshold | error |
  2197. 168.10 s > +------------------+------------------------+--------------+--------+----------+----------------------------------------------------------------------------------------------------------------------+-------+
  2198. 168.10 s > | sunrise_scalar_1 | uv_profile | - | FAIL | - | - | - |
  2199. 168.10 s > +------------------+------------------------+--------------+--------+----------+----------------------------------------------------------------------------------------------------------------------+-------+
  2200. 168.10 s > | sunrise_scalar_1 | m_uv.inspect | inspect | pass | - | best inspect relative delta 1.624e0 >= 1000*accuracy 1.000e-3 (accuracy=1.000e-6, exponent=+1.0, seed=1, probes=10) | - |
  2201. 168.10 s > +------------------+------------------------+--------------+--------+----------+----------------------------------------------------------------------------------------------------------------------+-------+
  2202. 168.10 s > | sunrise_scalar_1 | m_uv.integrated | sunrise | pass | 0.1sigma | compatible within 2sigma | - |
  2203. 168.10 s > +------------------+------------------------+--------------+--------+----------+----------------------------------------------------------------------------------------------------------------------+-------+
  2204. 168.10 s > | sunrise_scalar_1 | rls.inspect | inspect | pass | - | best inspect relative delta 8.682e-1 >= 1000*accuracy 1.000e-3 (accuracy=1.000e-6, exponent=+1.0, seed=1, probes=10) | - |
  2205. 168.10 s > +------------------+------------------------+--------------+--------+----------+----------------------------------------------------------------------------------------------------------------------+-------+
  2206. 168.10 s > | sunrise_scalar_1 | rls.integrated | sunrise | pass | 0.0sigma | compatible within 2sigma | - |
  2207. 168.10 s > +------------------+------------------------+--------------+--------+----------+----------------------------------------------------------------------------------------------------------------------+-------+
  2208. 168.10 s > | sunrise_scalar_1 | mu_r.inspect | inspect | pass | - | best inspect relative delta 1.752e0 >= 1000*accuracy 1.000e-3 (accuracy=1.000e-6, exponent=+1.0, seed=1, probes=10) | - |
  2209. 168.10 s > +------------------+------------------------+--------------+--------+----------+----------------------------------------------------------------------------------------------------------------------+-------+
  2210. 168.10 s > | sunrise_scalar_1 | integrated.relerr | integrated | pass | - | relative error 9.20% <= 10.00% | - |
  2211. 168.10 s > +------------------+------------------------+--------------+--------+----------+----------------------------------------------------------------------------------------------------------------------+-------+
  2212. 168.10 s > | sunrise_scalar_1 | m_uv.integrated.relerr | m_uv-shifted | pass | - | relative error 5.89% <= 10.00% | - |
  2213. 168.10 s > +------------------+------------------------+--------------+--------+----------+----------------------------------------------------------------------------------------------------------------------+-------+
  2214. 168.10 s > | sunrise_scalar_1 | target | - | pass | - | 2sigma | - |
  2215. 168.10 s > +------------------+------------------------+--------------+--------+----------+----------------------------------------------------------------------------------------------------------------------+-------+
  2216. 168.10 s > test sunrise_scalar_1_uv ... FAILED
  2217. 168.10 s >
  2218. 168.10 s > failures:
  2219. 168.10 s >
  2220. 168.10 s > failures:
  2221. 168.10 s > sunrise_scalar_1_uv
  2222. 168.10 s >
  2223. 168.10 s > test result: FAILED. 0 passed; 1 failed; 0 ignored; 0 measured; 24 filtered out; finished in 115.96s
  2224. 168.10 s > system-err
  2225. 168.10 s > [2026-08-27 10:07:50.457] @gammaloop_api::se... INFO : Running command run generate
  2226. 168.10 s > [2026-08-27 10:07:50.457] @gammaloop_api::se... INFO : Starting command block generate
  2227. 168.10 s > [2026-08-27 10:07:50.457] @gammaloop_api::se... INFO : Running command import model scalars-default.json
  2228. 168.10 s > [2026-08-27 10:07:50.457] @import::model INFO : Loading built-in JSON model scalars-default
  2229. 168.10 s > [2026-08-27 10:07:50.469] @gammalooprs::model INFO : The following 2 external parameters were forced to zero by the restriction card:
  2230. 168.10 s > width_scalar_1, width_scalar_2
  2231. 168.10 s > [2026-08-27 10:07:50.470] @gammaloop_api::se... INFO : Running command remove processes
  2232. 168.10 s > [2026-08-27 10:07:50.470] @gammaloop_api::se... INFO : Running command set global kv global.generation.uv.generate_integrated=true
  2233. 168.10 s > [2026-08-27 10:07:50.471] @gammaloop_api::se... INFO : Running command import graphs ./tests/resources/graphs/scalar_sunrise.dot -p sunrise_scalar_1 -i scalar_sunrise
  2234. 168.10 s > [2026-08-27 10:07:50.471] @commands::import INFO : Loading graphs from '/build/source/tests/resources/graphs/scalar_sunrise.dot'
  2235. 168.10 s > [2026-08-27 10:07:50.484] @gammaloop_api::se... INFO : Running command generate existing -p sunrise_scalar_1 -i scalar_sunrise
  2236. 168.10 s > [2026-08-27 10:07:50.485] @approx::local_4d [{#uv, #inspect, #integrated}] DEBUG : Rescaled momenta expanded
  2237. 168.10 s > field value
  2238. 168.10 s > res n-terms: 1, byte size: 611,expr:
  2239. 168.10 s > 1/(denom(1,q₁/t,mass_scalar_1²,-mass_scalar_1²+(q₁.q₁)/t²)
  2240. 168.10 s > ·denom(2,-q₀+q₃-q₁/t,mass_scalar_1²,
  2241. 168.10 s > -mass_scalar_1²+2·(q₀.q₁)/t-2·(q₁.q₃)/t+(q₁.q₁)/t²+(q₀.q₀)
  2242. 168.10 s > -2·(q₀.q₃)+(q₃.q₃)
  2243. 168.10 s > ))
  2244. 168.10 s > [2026-08-27 10:07:50.486] @approx::local_4d [{#uv, #inspect, #integrated}] DEBUG : Rescaled momenta expanded
  2245. 168.10 s > field value
  2246. 168.10 s > res n-terms: 1, byte size: 3,expr:
  2247. 168.10 s > 1
  2248. 168.10 s > [2026-08-27 10:07:50.492] @approx::local_4d [{#uv, #inspect, #integrated}] DEBUG : Rescaled momenta expanded
  2249. 168.10 s > field value
  2250. 168.10 s > res n-terms: 1, byte size: 611,expr:
  2251. 168.10 s > 1/(denom(0,q₀/t,mass_scalar_1²,-mass_scalar_1²+(q₀.q₀)/t²)
  2252. 168.10 s > ·denom(2,-q₁+q₃-q₀/t,mass_scalar_1²,
  2253. 168.10 s > -mass_scalar_1²+2·(q₀.q₁)/t-2·(q₀.q₃)/t+(q₀.q₀)/t²+(q₁.q₁)
  2254. 168.10 s > -2·(q₁.q₃)+(q₃.q₃)
  2255. 168.10 s > ))
  2256. 168.10 s > [2026-08-27 10:07:50.493] @approx::local_4d [{#uv, #inspect, #integrated}] DEBUG : Rescaled momenta expanded
  2257. 168.10 s > field value
  2258. 168.10 s > res n-terms: 1, byte size: 777,expr:
  2259. 168.10 s > 1/(denom(0,q₀/t,mass_scalar_1²,-mass_scalar_1²+(q₀.q₀)/t²)·denom(1,q₁/t,mass_scalar_1²,-mass_scalar_1²+(q₁.q₁)/t²)
  2260. 168.10 s > ·denom(2,q₄-q₀/t-q₁/t,mass_scalar_1²,
  2261. 168.10 s > -mass_scalar_1²-2·(q₀.q₄)/t-2·(q₁.q₄)/t+(q₀.q₀)/t²+2·(q₀.q₁)/t²
  2262. 168.10 s > +(q₁.q₁)/t²+(q₄.q₄)
  2263. 168.10 s > ))
  2264. 168.10 s > [2026-08-27 10:07:50.496] @approx::local_4d [{#uv, #inspect, #integrated}] DEBUG : Rescaled momenta expanded
  2265. 168.10 s > field value
  2266. 168.10 s > res n-terms: 1, byte size: 611,expr:
  2267. 168.10 s > 1/(denom(0,q₀/t,mass_scalar_1²,-mass_scalar_1²+(q₀.q₀)/t²)
  2268. 168.10 s > ·denom(1,-q₂+q₃-q₀/t,mass_scalar_1²,
  2269. 168.10 s > -mass_scalar_1²+2·(q₀.q₂)/t-2·(q₀.q₃)/t+(q₀.q₀)/t²+(q₂.q₂)
  2270. 168.10 s > -2·(q₂.q₃)+(q₃.q₃)
  2271. 168.10 s > ))
  2272. 168.10 s > [2026-08-27 10:07:50.497] @approx::final_integrand[{#generation, #profile, #uv, #graph, #summary}] DEBUG : Computed global numerator
  2273. 168.10 s > field value
  2274. 168.10 s > global_num n-terms: 1, byte size: 3,expr:
  2275. 168.10 s > 1
  2276. 168.10 s > span build_3d{span_context=true graph=sunrise current=subgraph=0, topo_order=0, dod=0}
  2277. 168.10 s > [2026-08-27 10:07:50.498] @uv::approx [{#generation, #uv, #fourd}] DEBUG : Computing 4D
  2278. 168.10 s > field value
  2279. 168.10 s > simple subgraph(S_47,S_3s)*Approx(subgraph(S_3s,0)) of sunrise
  2280. 168.10 s > span compute_4d{span_context=true graph=sunrise current=subgraph=3s, topo_order=1, dod=0 given=subgraph=0, topo_order=0, dod=0 reduced=SubSet { set: BitVec<usize, bitvec::order::Lsb0> { addr: 0x7fffec00bae0, head: 000000, bits: 8, capacity: 64 } [0, 0, 0, 0, 1, 1, 1, 1], id: PhantomData<linnet::half_edge::involution::Hedge> }}
  2281. 168.10 s > [2026-08-27 10:07:50.499] @approx::local_4d [{#uv, #algebra, #integrated, #start}] DEBUG :
  2282. 168.10 s > field value
  2283. 168.10 s > integrand n-terms: 1, byte size: 217,expr:
  2284. 168.10 s > 1/(denom(1,q₁,mass_scalar_1²,-mass_scalar_1²+(q₁.q₁))·denom(2,q₂,mass_scalar_1²,-mass_scalar_1²+(q₂.q₂)))
  2285. 168.10 s > reduced 3s
  2286. 168.10 s > span grow{span_context=true current=subgraph=3s, topo_order=1, dod=0 given=subgraph=0, topo_order=0, dod=0}
  2287. 168.10 s > [2026-08-27 10:07:50.499] @approx::local_4d [{#uv, #inspect, #integrated}] DEBUG : Rescaled momenta expanded
  2288. 168.10 s > field value
  2289. 168.10 s > res n-terms: 1, byte size: 611,expr:
  2290. 168.10 s > 1/(denom(1,q₁/t,mass_scalar_1²,-mass_scalar_1²+(q₁.q₁)/t²)
  2291. 168.10 s > ·denom(2,-q₀+q₃-q₁/t,mass_scalar_1²,
  2292. 168.10 s > -mass_scalar_1²+2·(q₀.q₁)/t-2·(q₁.q₃)/t+(q₁.q₁)/t²+(q₀.q₀)
  2293. 168.10 s > -2·(q₀.q₃)+(q₃.q₃)
  2294. 168.10 s > ))
  2295. 168.10 s > span t{span_context=true current=subgraph=3s, topo_order=1, dod=0 given=subgraph=0, topo_order=0, dod=0}
  2296. 168.10 s > [2026-08-27 10:07:50.499] @approx::local_4d [{#uv, #integrated, #rescaled}] DEBUG : Rescaled expanded
  2297. 168.10 s > field value
  2298. 168.10 s > n_loops 1
  2299. 168.10 s > res n-terms: 1, byte size: 723,expr:
  2300. 168.10 s > 1/(denom(1,q₁,mUVexp²+t²·mass_scalar_1²,-mUV²+t²·(-mass_scalar_1²+(q₁.q₁)/t²)+t²·mUVexp²)
  2301. 168.10 s > ·denom(2,-q₁,mUVexp²+t²·mass_scalar_1²,
  2302. 168.10 s > -mUV²
  2303. 168.10 s > +t²
  2304. 168.10 s > ·(-mass_scalar_1²+2·(q₀.q₁)/t-2·(q₁.q₃)/t+(q₁.q₁)/t²+(q₀.q₀)
  2305. 168.10 s > -2·(q₀.q₃)+(q₃.q₃)
  2306. 168.10 s > )
  2307. 168.10 s > +t²·mUVexp²
  2308. 168.10 s > ))
  2309. 168.10 s > span t{span_context=true current=subgraph=3s, topo_order=1, dod=0 given=subgraph=0, topo_order=0, dod=0}
  2310. 168.10 s > [2026-08-27 10:07:50.500] @approx::local_4d [{#uv, #integrated, #series}] DEBUG : Series expanded
  2311. 168.10 s > field value
  2312. 168.10 s > res n-terms: 1, byte size: 223,expr:
  2313. 168.10 s > 1/(denom(1,q₁,mUVexp²,-mUV²+(q₁.q₁))·denom(2,-q₁,mUVexp²,-mUV²+(q₁.q₁)))
  2314. 168.10 s > span t{span_context=true current=subgraph=3s, topo_order=1, dod=0 given=subgraph=0, topo_order=0, dod=0}
  2315. 168.10 s > [2026-08-27 10:07:50.500] @approx::local_4d [{#uv, #integrated, #series}] DEBUG : Evaluated at t = 1
  2316. 168.10 s > field value
  2317. 168.10 s > res n-terms: 1, byte size: 223,expr:
  2318. 168.10 s > 1/(denom(1,q₁,mUVexp²,-mUV²+(q₁.q₁))·denom(2,-q₁,mUVexp²,-mUV²+(q₁.q₁)))
  2319. 168.10 s > span t{span_context=true current=subgraph=3s, topo_order=1, dod=0 given=subgraph=0, topo_order=0, dod=0}
  2320. 168.10 s > [2026-08-27 10:07:50.500] @approx::local_4d [{#uv, #collect, #integrated}] DEBUG : After gamma chain collection
  2321. 168.10 s > field value
  2322. 168.10 s > expr n-terms: 1, byte size: 223,expr:
  2323. 168.10 s > 1/(denom(1,q₁,mUVexp²,-mUV²+(q₁.q₁))·denom(2,-q₁,mUVexp²,-mUV²+(q₁.q₁)))
  2324. 168.10 s > span t{span_context=true current=subgraph=3s, topo_order=1, dod=0 given=subgraph=0, topo_order=0, dod=0}
  2325. 168.10 s > [2026-08-27 10:07:50.500] @approx::local_4d [{#profile, #uv, #collect, #integrated, #start, #trace}] DEBUG : After gamma schoonschip
  2326. 168.10 s > field value
  2327. 168.10 s > expr n-terms: 1, byte size: 223,expr:
  2328. 168.10 s > 1/(denom(1,q₁,mUVexp²,-mUV²+(q₁.q₁))·denom(2,-q₁,mUVexp²,-mUV²+(q₁.q₁)))
  2329. 168.10 s > span t{span_context=true current=subgraph=3s, topo_order=1, dod=0 given=subgraph=0, topo_order=0, dod=0}
  2330. 168.10 s > [2026-08-27 10:07:50.500] @approx::local_4d [{#profile, #uv, #collect, #integrated, #start, #trace}] DEBUG : After gamma collection
  2331. 168.10 s > field value
  2332. 168.10 s > expr n-terms: 1, byte size: 223,expr:
  2333. 168.10 s > 1/(denom(1,q₁,mUVexp²,-mUV²+(q₁.q₁))·denom(2,-q₁,mUVexp²,-mUV²+(q₁.q₁)))
  2334. 168.10 s > span t{span_context=true current=subgraph=3s, topo_order=1, dod=0 given=subgraph=0, topo_order=0, dod=0}
  2335. 168.10 s > [2026-08-27 10:07:50.500] @approx::local_4d [{#profile, #uv, #gamma, #integrated, #start, #trace, #vakint}] DEBUG : After gamma simplification
  2336. 168.10 s > field value
  2337. 168.10 s > expr n-terms: 1, byte size: 223,expr:
  2338. 168.10 s > 1/(denom(1,q₁,mUVexp²,-mUV²+(q₁.q₁))·denom(2,-q₁,mUVexp²,-mUV²+(q₁.q₁)))
  2339. 168.10 s > span t{span_context=true current=subgraph=3s, topo_order=1, dod=0 given=subgraph=0, topo_order=0, dod=0}
  2340. 168.10 s > [2026-08-27 10:07:50.501] @approx::local_4d [{#profile, #uv, #integrated, #schoonschip, #start, #trace, #vakint}] DEBUG : After Schoonschip net
  2341. 168.10 s > field value
  2342. 168.10 s > expr n-terms: 1, byte size: 223,expr:
  2343. 168.10 s > 1/(denom(1,q₁,mUVexp²,-mUV²+(q₁.q₁))·denom(2,-q₁,mUVexp²,-mUV²+(q₁.q₁)))
  2344. 168.10 s > ... omitted 20095 more lines; see full nextest output above
  2345. 168.10 s >
  2346. 168.10 s > 9. gammaloop-integration-tests::uv::se1l_uv
  2347. 168.10 s > failure: test failure with exit code 101
  2348. 168.10 s > system-out
  2349. 168.10 s > running 1 test
  2350. 168.10 s > test se1l_uv has been running for over 60 seconds
  2351. 168.10 s > +------+-----------------+---------+--------+----------+-----------------------------------------------------------------------------------------------------------------------+-------+
  2352. 168.10 s > | case | check | graph | status | sigma | threshold | error |
  2353. 168.10 s > +------+-----------------+---------+--------+----------+-----------------------------------------------------------------------------------------------------------------------+-------+
  2354. 168.10 s > | se1l | uv_profile | - | FAIL | - | - | - |
  2355. 168.10 s > +------+-----------------+---------+--------+----------+-----------------------------------------------------------------------------------------------------------------------+-------+
  2356. 168.10 s > | se1l | m_uv.inspect | inspect | pass | - | best inspect relative delta 1.097e-1 >= 1000*accuracy 1.000e-7 (accuracy=1.000e-10, exponent=+2.0, seed=1, probes=10) | - |
  2357. 168.10 s > +------+-----------------+---------+--------+----------+-----------------------------------------------------------------------------------------------------------------------+-------+
  2358. 168.10 s > | se1l | m_uv.integrated | se1l | pass | 0.1sigma | compatible within 2sigma | - |
  2359. 168.10 s > +------+-----------------+---------+--------+----------+-----------------------------------------------------------------------------------------------------------------------+-------+
  2360. 168.10 s > | se1l | rls.inspect | inspect | pass | - | best inspect relative delta 4.499e-2 >= 1000*accuracy 1.000e-7 (accuracy=1.000e-10, exponent=+2.0, seed=1, probes=10) | - |
  2361. 168.10 s > +------+-----------------+---------+--------+----------+-----------------------------------------------------------------------------------------------------------------------+-------+
  2362. 168.10 s > | se1l | rls.integrated | se1l | pass | 0.0sigma | compatible within 2sigma | - |
  2363. 168.10 s > +------+-----------------+---------+--------+----------+-----------------------------------------------------------------------------------------------------------------------+-------+
  2364. 168.10 s > | se1l | mu_r.inspect | inspect | pass | - | best inspect relative delta 1.424e-1 >= 1000*accuracy 1.000e-7 (accuracy=1.000e-10, exponent=+2.0, seed=1, probes=10) | - |
  2365. 168.10 s > +------+-----------------+---------+--------+----------+-----------------------------------------------------------------------------------------------------------------------+-------+
  2366. 168.10 s > | se1l | target | - | pass | - | 2sigma | - |
  2367. 168.10 s > +------+-----------------+---------+--------+----------+-----------------------------------------------------------------------------------------------------------------------+-------+
  2368. 168.10 s > test se1l_uv ... FAILED
  2369. 168.10 s >
  2370. 168.10 s > failures:
  2371. 168.10 s >
  2372. 168.10 s > failures:
  2373. 168.10 s > se1l_uv
  2374. 168.10 s >
  2375. 168.10 s > test result: FAILED. 0 passed; 1 failed; 0 ignored; 0 measured; 24 filtered out; finished in 124.10s
  2376. 168.10 s > system-err
  2377. 168.10 s > [2026-08-27 10:07:49.742] @gammaloop_api::se... INFO : Running command run generate
  2378. 168.10 s > [2026-08-27 10:07:49.742] @gammaloop_api::se... INFO : Starting command block generate
  2379. 168.10 s > [2026-08-27 10:07:49.742] @gammaloop_api::se... INFO : Running command import model sm-default
  2380. 168.10 s > [2026-08-27 10:07:49.742] @import::model INFO : Loading built-in JSON model sm-default
  2381. 168.10 s > [2026-08-27 10:07:49.865] @gammalooprs::model INFO : The following 11 external parameters were forced to zero by the restriction card:
  2382. 168.10 s > lamWS, AWS, rhoWS, etaWS, ymc, yme, ymm, MC, Me, MM, WTau
  2383. 168.10 s > [2026-08-27 10:07:49.865] @gammalooprs::model INFO : The following 34 vertex rules were removed by the restriction card:
  2384. 168.10 s > V_82 -> (c~, d, G+) | V_83 -> (t~, d, G+) | V_84 -> (c~, s, G+) | V_85 -> (t~, s, G+) | V_86 -> (u~, b, G+) | V_87 -> (c~, b, G+) | V_90 -> (c~, d, W+) | V_91 -> (t~, d, W+) | V_92 -> (u~, s, W+) | V_94 -> (t~, s, W+) | V_95 -> (u~, b, W+) | V_96 -> (c~, b, W+) | V_101 -> (e+, e-, G0) | V_102 -> (mu+, mu-, G0) | V_104 -> (e+, e-, H) | V_105 -> (mu+, mu-, H) | V_110 -> (ve~, e-, G+) | V_111 -> (vm~, mu-, G+) | V_116 -> (b~, u, G-) | V_117 -> (d~, c, G-) | V_118 -> (s~, c, G-) | V_119 -> (b~, c, G-) | V_120 -> (d~, t, G-) | V_121 -> (s~, t, G-) | V_124 -> (s~, u, W-) | V_125 -> (b~, u, W-) | V_126 -> (d~, c, W-) | V_128 -> (b~, c, W-) | V_129 -> (d~, t, W-) | V_130 -> (s~, t, W-) | V_138 -> (c~, c, G0) | V_140 -> (c~, c, H) | V_145 -> (e+, ve, G-) | V_146 -> (mu+, vm, G-)
  2385. 168.10 s > [2026-08-27 10:07:49.865] @gammalooprs::model INFO : The following 36 couplings were removed by the restriction card:
  2386. 168.10 s > GC_13, GC_14, GC_16, GC_17, GC_18, GC_19, GC_20, GC_22, GC_23, GC_24, GC_25, GC_26, GC_28, GC_29, GC_42, GC_43, GC_44, GC_46, GC_47, GC_48, GC_84, GC_85, GC_86, GC_87, GC_88, GC_89, GC_90, GC_91, GC_92, GC_93, GC_101, GC_102, GC_103, GC_105, GC_106, GC_107
  2387. 168.10 s > [2026-08-27 10:07:49.866] @gammaloop_api::se... INFO : Running command remove processes
  2388. 168.10 s > [2026-08-27 10:07:49.866] @gammaloop_api::se... INFO : Running command set global kv global.generation.uv.generate_integrated=true
  2389. 168.10 s > [2026-08-27 10:07:49.866] @gammaloop_api::se... INFO : Running command import graphs ./tests/resources/graphs/uv_tests/se1l.dot -p se1l -i se1l
  2390. 168.10 s > [2026-08-27 10:07:49.866] @commands::import INFO : Loading graphs from '/build/source/tests/resources/graphs/uv_tests/se1l.dot'
  2391. 168.10 s > [2026-08-27 10:07:49.881] @gammaloop_api::se... INFO : Running command generate existing -p se1l -i se1l
  2392. 168.10 s > [2026-08-27 10:07:52.471] @commands::generate INFO :
  2393. 168.10 s > Integrand generation summary
  2394. 168.10 s > peak RAM 90.29 MiB | cores 1
  2395. 168.10 s > ╭───────────┬───────┬─────────┬─────────────┬──────────────┬────────────────┬─────────────╮
  2396. 168.10 s > │ integrand │ graph │ # evals │ expr build │ spenso │ symbolica eval │ compile │
  2397. 168.10 s > ├───────────┼───────┼─────────┼─────────────┼──────────────┼────────────────┼─────────────┤
  2398. 168.10 s > │ se1l │ se1l │ 5 │ 2.25s (88%) │ 108ms (4.2%) │ 184ms (7.3%) │ 0ms (0.00%) │
  2399. 168.10 s > ├───────────┼───────┼─────────┼─────────────┼──────────────┼────────────────┼─────────────┤
  2400. 168.10 s > │ Total │ │ 5 │ 2.25s (88%) │ 108ms (4.2%) │ 184ms (7.3%) │ 0ms (0.00%) │
  2401. 168.10 s > ╰───────────┴───────┴─────────┴─────────────┴──────────────┴────────────────┴─────────────╯
  2402. 168.10 s > [2026-08-27 10:07:52.472] @gammaloop_api::se... INFO : Running command set process -p se1l -i se1l kv general.m_uv=0.2
  2403. 168.10 s > [2026-08-27 10:07:52.473] @gammaloop_api::se... INFO : Running command set process -p se1l -i se1l kv general.mu_r=0.2
  2404. 168.10 s > [2026-08-27 10:07:52.474] @gammaloop_api::se... INFO : Running command set process -p se1l -i se1l kv general.renormalization_localization_scale=0.2
  2405. 168.10 s > [2026-08-27 10:07:52.482] @gammaloop_api::se... INFO : Running command duplicate integrand -p se1l -i se1l --output_process_name se1l --output_integrand_name se1l_muv_shifted
  2406. 168.10 s > [2026-08-27 10:07:52.483] @gammaloop_api::se... INFO : Running command set process -p se1l -i se1l_muv_shifted kv general.m_uv=0.5
  2407. 168.10 s > [2026-08-27 10:07:52.484] @gammaloop_api::se... INFO : Running command duplicate integrand -p se1l -i se1l --output_process_name se1l --output_integrand_name se1l_rls_shifted
  2408. 168.10 s > [2026-08-27 10:07:52.493] @gammaloop_api::se... INFO : Running command set process -p se1l -i se1l_rls_shifted kv general.renormalization_localization_scale=1
  2409. 168.10 s > [2026-08-27 10:07:52.494] @gammaloop_api::se... INFO : Running command duplicate integrand -p se1l -i se1l --output_process_name se1l --output_integrand_name se1l_mur_shifted
  2410. 168.10 s > [2026-08-27 10:07:52.499] @gammaloop_api::se... INFO : Running command set process -p se1l -i se1l_mur_shifted kv general.mu_r=0.8
  2411. 168.10 s > [2026-08-27 10:07:52.518] @process::amplitude WARNING : External state 0 ('g', PDG 21, helicity +) is off shell: p^2 = +2.5e5, expected m^2 = +0e0 (|Δ| = +2.5e5). Fixed-helicity spinor/vector/tensor external states may be ill-defined at this kinematic point.
  2412. 168.10 s > field value
  2413. 168.10 s > span warm_up{integrand.name=se1l}
  2414. 168.10 s > [2026-08-27 10:07:52.518] @process::amplitude WARNING : External state 1 ('g', PDG 21, helicity -) is off shell: p^2 = +2.5e5, expected m^2 = +0e0 (|Δ| = +2.5e5). Fixed-helicity spinor/vector/tensor external states may be ill-defined at this kinematic point.
  2415. 168.10 s > field value
  2416. 168.10 s > span warm_up{integrand.name=se1l}
  2417. 168.10 s > [2026-08-27 10:07:52.518] @process::amplitude INFO : Input is above threshold: 1 existing threshold E-surfaces across 1/1 graph groups
  2418. 168.10 s > field value
  2419. 168.10 s > existing_esurfaces 1
  2420. 168.10 s > group_count 1
  2421. 168.10 s > groups_above_threshold 1
  2422. 168.10 s > integrand se1l
  2423. 168.10 s > span warm_up{integrand.name=se1l}
  2424. 168.10 s > threshold_status above threshold
  2425. 168.10 s > [2026-08-27 10:07:52.518] @process::amplitude INFO : overlap structure of group 0: [1: [0(2,3)]]
  2426. 168.10 s > field value
  2427. 168.10 s > span warm_up{integrand.name=se1l}
  2428. 168.10 s > [2026-08-27 10:07:53.426] @commands::profile INFO :
  2429. 168.10 s > ╭───────┬──────┬──────────┬───────┬─────┬──────────┬───────────╮
  2430. 168.10 s > │ fixed │ → ∞ │ slope │ r2 │ DOD │ bare DOD │ inspect │
  2431. 168.10 s > ├───────┼──────┼──────────┼───────┼─────┼──────────┼───────────┤
  2432. 168.10 s > │ {} │ {e3} │ 1.639236 │ 0.904 │ 2 │ 2 │ arb retry │
  2433. 168.10 s > │ {} │ {e2} │ 1.698834 │ 0.902 │ 2 │ 2 │ arb retry │
  2434. 168.10 s > ╰───────┴──────┴──────────┴───────┴─────┴──────────┴───────────╯
  2435. 168.10 s > [2026-08-27 10:07:53.426] @commands::profile INFO :
  2436. 168.10 s > ╭───────┬──────┬─────────────┬──────────┬───────┬─────┬──────────┬───────────╮
  2437. 168.10 s > │ fixed │ → ∞ │ orientation │ slope │ r2 │ DOD │ bare DOD │ inspect │
  2438. 168.10 s > ├───────┼──────┼─────────────┼──────────┼───────┼─────┼──────────┼───────────┤
  2439. 168.10 s > │ {} │ {e3} │ 00-+ │ 0.343429 │ 0.145 │ 0 │ 2 │ arb retry │
  2440. 168.10 s > │ {} │ {e3} │ 00+- │ 0.342577 │ 0.135 │ 0 │ 2 │ arb retry │
  2441. 168.10 s > │ {} │ {e2} │ 00-+ │ 0.385975 │ 0.161 │ 0 │ 2 │ arb retry │
  2442. 168.10 s > │ {} │ {e2} │ 00+- │ 0.384920 │ 0.192 │ 0 │ 2 │ arb retry │
  2443. 168.10 s > ╰───────┴──────┴─────────────┴──────────┴───────┴─────┴──────────┴───────────╯
  2444. 168.10 s > [2026-08-27 10:07:53.427] @gammaloop_api::se... INFO : Running command set process kv integrator.target_relative_accuracy=0.001 integrator.n_increase=0 integrator.n_start=50000 integrator.n_max=400000 integrator.seed=1337
  2445. 168.10 s > [2026-08-27 10:07:53.428] @commands::integrate INFO : Created workspace directory at /build/source/tests/artifacts/se1l/integration_workspace_se1l
  2446. 168.10 s > [2026-08-27 10:07:53.516] @commands::integrate INFO : No integration state found, starting new integration
  2447. 168.10 s > [2026-08-27 10:07:53.516] @commands::integrate INFO : Gammaloop now integrates se1l@se1l, se1l@se1l_muv_shifted, se1l@se1l_rls_shifted
  2448. 168.10 s > [2026-08-27 10:07:53.517] @process::amplitude WARNING : External state 0 ('g', PDG 21, helicity +) is off shell: p^2 = +2.5e5, expected m^2 = +0e0 (|Δ| = +2.5e5). Fixed-helicity spinor/vector/tensor external states may be ill-defined at this kinematic point.
  2449. 168.10 s > field value
  2450. 168.10 s > span warm_up{integrand.name=se1l}
  2451. 168.10 s > [2026-08-27 10:07:53.517] @process::amplitude WARNING : External state 1 ('g', PDG 21, helicity -) is off shell: p^2 = +2.5e5, expected m^2 = +0e0 (|Δ| = +2.5e5). Fixed-helicity spinor/vector/tensor external states may be ill-defined at this kinematic point.
  2452. 168.10 s > field value
  2453. 168.10 s > span warm_up{integrand.name=se1l}
  2454. 168.10 s > [2026-08-27 10:07:53.517] @process::amplitude INFO : Input is above threshold: 1 existing threshold E-surfaces across 1/1 graph groups
  2455. 168.10 s > field value
  2456. 168.10 s > existing_esurfaces 1
  2457. 168.10 s > group_count 1
  2458. 168.10 s > groups_above_threshold 1
  2459. 168.10 s > integrand se1l
  2460. 168.10 s > span warm_up{integrand.name=se1l}
  2461. 168.10 s > threshold_status above threshold
  2462. 168.10 s > [2026-08-27 10:07:53.529] @process::amplitude INFO : overlap structure of group 0: [1: [0(2,3)]]
  2463. 168.10 s > field value
  2464. 168.10 s > span warm_up{integrand.name=se1l}
  2465. 168.10 s > [2026-08-27 10:07:53.530] @process::amplitude WARNING : External state 0 ('g', PDG 21, helicity +) is off shell: p^2 = +2.5e5, expected m^2 = +0e0 (|Δ| = +2.5e5). Fixed-helicity spinor/vector/tensor external states may be ill-defined at this kinematic point.
  2466. 168.10 s > field value
  2467. 168.10 s > span warm_up{integrand.name=se1l_muv_shifted}
  2468. 168.10 s > [2026-08-27 10:07:53.530] @process::amplitude WARNING : External state 1 ('g', PDG 21, helicity -) is off shell: p^2 = +2.5e5, expected m^2 = +0e0 (|Δ| = +2.5e5). Fixed-helicity spinor/vector/tensor external states may be ill-defined at this kinematic point.
  2469. 168.10 s > field value
  2470. 168.10 s > span warm_up{integrand.name=se1l_muv_shifted}
  2471. 168.10 s > [2026-08-27 10:07:53.531] @process::amplitude INFO : Input is above threshold: 1 existing threshold E-surfaces across 1/1 graph groups
  2472. 168.10 s > field value
  2473. 168.10 s > existing_esurfaces 1
  2474. 168.10 s > group_count 1
  2475. 168.10 s > groups_above_threshold 1
  2476. 168.10 s > integrand se1l_muv_shifted
  2477. 168.10 s > span warm_up{integrand.name=se1l_muv_shifted}
  2478. 168.10 s > threshold_status above threshold
  2479. 168.10 s > [2026-08-27 10:07:53.531] @process::amplitude INFO : overlap structure of group 0: [1: [0(2,3)]]
  2480. 168.10 s > field value
  2481. 168.10 s > span warm_up{integrand.name=se1l_muv_shifted}
  2482. 168.10 s > [2026-08-27 10:07:53.532] @process::amplitude WARNING : External state 0 ('g', PDG 21, helicity +) is off shell: p^2 = +2.5e5, expected m^2 = +0e0 (|Δ| = +2.5e5). Fixed-helicity spinor/vector/tensor external states may be ill-defined at this kinematic point.
  2483. 168.10 s > field value
  2484. 168.10 s > span warm_up{integrand.name=se1l_rls_shifted}
  2485. 168.10 s > [2026-08-27 10:07:53.532] @process::amplitude WARNING : External state 1 ('g', PDG 21, helicity -) is off shell: p^2 = +2.5e5, expected m^2 = +0e0 (|Δ| = +2.5e5). Fixed-helicity spinor/vector/tensor external states may be ill-defined at this kinematic point.
  2486. 168.10 s > field value
  2487. 168.10 s > span warm_up{integrand.name=se1l_rls_shifted}
  2488. 168.10 s > [2026-08-27 10:07:53.532] @process::amplitude INFO : Input is above threshold: 1 existing threshold E-surfaces across 1/1 graph groups
  2489. 168.10 s > field value
  2490. 168.10 s > existing_esurfaces 1
  2491. 168.10 s > group_count 1
  2492. 168.10 s > groups_above_threshold 1
  2493. 168.10 s > integrand se1l_rls_shifted
  2494. 168.10 s > span warm_up{integrand.name=se1l_rls_shifted}
  2495. 168.10 s > threshold_status above threshold
  2496. 168.10 s > ... omitted 1410 more lines; see full nextest output above
  2497. 168.10 s > =========================================
  2498. 168.10 s For full logs, run:
  2499. 168.10 s nix log /nix/store/8h9hx82zgi6sfhhm31fs0s7q4qa225j3-gammaloop-nextest-integration.drv
  2500. 168.21 s [0 built (1 failed), 0.0Run failed.