test packages.x86_64-linux.nix-ci-check-gammaloop-nextest-integration

Reproduce this run
Original Run
  1. 158.75 s gammaloop-nextest-integration> | dod2_bubble | rls.integrated | GL0 | pass | 0.0sigma | compatible within 2sigma | - |
  2. 158.75 s gammaloop-nextest-integration> +-------------+-----------------+---------+--------+----------+-----------------------------------------------------------------------------------------------------------------------+-------+
  3. 158.75 s gammaloop-nextest-integration> | dod2_bubble | mu_r.inspect | inspect | pass | - | best inspect relative delta 6.951e-1 >= 1000*accuracy 1.000e-7 (accuracy=1.000e-10, exponent=+0.0, seed=0, probes=10) | - |
  4. 158.75 s gammaloop-nextest-integration> +-------------+-----------------+---------+--------+----------+-----------------------------------------------------------------------------------------------------------------------+-------+
  5. 158.75 s gammaloop-nextest-integration> | dod2_bubble | target | - | pass | - | 2sigma | - |
  6. 158.75 s gammaloop-nextest-integration> +-------------+-----------------+---------+--------+----------+-----------------------------------------------------------------------------------------------------------------------+-------+
  7. 158.75 s gammaloop-nextest-integration> test dod2_bubble_uv ... FAILED
  8. 158.75 s gammaloop-nextest-integration>
  9. 158.75 s gammaloop-nextest-integration> failures:
  10. 158.75 s gammaloop-nextest-integration>
  11. 158.75 s gammaloop-nextest-integration> failures:
  12. 158.75 s gammaloop-nextest-integration> dod2_bubble_uv
  13. 158.75 s gammaloop-nextest-integration>
  14. 158.75 s gammaloop-nextest-integration> test result: FAILED. 0 passed; 1 failed; 0 ignored; 0 measured; 24 filtered out; finished in 59.40s
  15. 158.75 s gammaloop-nextest-integration> system-err
  16. 158.75 s gammaloop-nextest-integration> [2026-08-27 10:10:26.593] @gammaloop_api::se... INFO : Running command run generate
  17. 158.75 s gammaloop-nextest-integration> [2026-08-27 10:10:26.593] @gammaloop_api::se... INFO : Starting command block generate
  18. 158.75 s gammaloop-nextest-integration> [2026-08-27 10:10:26.593] @gammaloop_api::se... INFO : Running command import model scalars-default.json
  19. 158.75 s gammaloop-nextest-integration> [2026-08-27 10:10:26.593] @import::model INFO : Loading built-in JSON model scalars-default
  20. 158.75 s gammaloop-nextest-integration> [2026-08-27 10:10:26.597] @gammalooprs::model INFO : The following 2 external parameters were forced to zero by the restriction card:
  21. 158.75 s gammaloop-nextest-integration> width_scalar_1, width_scalar_2
  22. 158.75 s gammaloop-nextest-integration> [2026-08-27 10:10:26.597] @gammaloop_api::se... INFO : Running command remove processes
  23. 158.75 s gammaloop-nextest-integration> [2026-08-27 10:10:26.597] @gammaloop_api::se... INFO : Running command set global kv global.generation.uv.generate_integrated=true
  24. 158.75 s gammaloop-nextest-integration> [2026-08-27 10:10:26.598] @gammaloop_api::se... INFO : Running command import graphs ./tests/resources/graphs/scalar/dod2_bubble.dot -p bubble_dod2 -i scalar_bubble_below_thres
  25. 158.75 s gammaloop-nextest-integration> [2026-08-27 10:10:26.598] @commands::import INFO : Loading graphs from '/build/source/tests/resources/graphs/scalar/dod2_bubble.dot'
  26. 158.75 s gammaloop-nextest-integration> [2026-08-27 10:10:26.600] @gammaloop_api::se... INFO : Running command generate existing -p bubble_dod2 -i scalar_bubble_below_thres
  27. 158.75 s gammaloop-nextest-integration> [2026-08-27 10:10:26.616] @approx::local_4d [{#uv, #inspect, #integrated}] DEBUG : Rescaled momenta expanded
  28. 158.75 s gammaloop-nextest-integration> field value
  29. 158.75 s gammaloop-nextest-integration> res n-terms: 1, byte size: 3,expr:
  30. 158.75 s gammaloop-nextest-integration> 1
  31. 158.75 s gammaloop-nextest-integration> [2026-08-27 10:10:26.617] @approx::local_4d [{#uv, #inspect, #integrated}] DEBUG : Rescaled momenta expanded
  32. 158.75 s gammaloop-nextest-integration> field value
  33. 158.75 s gammaloop-nextest-integration> res n-terms: 1, byte size: 585,expr:
  34. 158.75 s gammaloop-nextest-integration> -SCALAR_COUPLING²·q₀(αᵉ².¹)·q₀(αᵉ³.¹)·q₂(αᵉ².¹)·q₂(αᵉ³.¹)
  35. 158.75 s gammaloop-nextest-integration> /(t²·denom(3,-q₀-q₂/t,mass_scalar_2²,-mass_scalar_2²+2·(q₀.q₂)/t+(q₂.q₂)/t²+(q₀.q₀))
  36. 158.75 s gammaloop-nextest-integration> ·denom(2,q₂/t,mass_scalar_2²,-mass_scalar_2²+(q₂.q₂)/t²))
  37. 158.75 s gammaloop-nextest-integration> [2026-08-27 10:10:26.620] @approx::final_integrand[{#generation, #profile, #uv, #graph, #summary}] DEBUG : Computed global numerator
  38. 158.75 s gammaloop-nextest-integration> field value
  39. 158.75 s gammaloop-nextest-integration> global_num n-terms: 1, byte size: 4,expr:
  40. 158.75 s gammaloop-nextest-integration> 1/2
  41. 158.75 s gammaloop-nextest-integration> span build_3d{span_context=true graph=GL0 current=subgraph=0, topo_order=0, dod=0}
  42. 158.75 s gammaloop-nextest-integration> [2026-08-27 10:10:26.623] @uv::approx [{#generation, #uv, #fourd}] DEBUG : Computing 4D
  43. 158.75 s gammaloop-nextest-integration> field value
  44. 158.75 s gammaloop-nextest-integration> simple subgraph(S_11,S_y)*Approx(subgraph(S_y,0)) of GL0
  45. 158.75 s gammaloop-nextest-integration> span compute_4d{span_context=true graph=GL0 current=subgraph=y, topo_order=1, dod=2 given=subgraph=0, topo_order=0, dod=0 reduced=SubSet { set: BitVec<usize, bitvec::order::Lsb0> { addr: 0x7fff94011010, head: 000000, bits: 6, capacity: 64 } [0, 0, 1, 1, 1, 1], id: PhantomData<linnet::half_edge::involution::Hedge> }}
  46. 158.75 s gammaloop-nextest-integration> [2026-08-27 10:10:26.624] @approx::local_4d [{#uv, #algebra, #integrated, #start}] DEBUG :
  47. 158.75 s gammaloop-nextest-integration> field value
  48. 158.75 s gammaloop-nextest-integration> integrand n-terms: 1, byte size: 409,expr:
  49. 158.75 s gammaloop-nextest-integration> SCALAR_COUPLING²·(q₀(αᵉ³.¹)+q₃(αᵉ³.¹))·q₀(αᵉ².¹)·q₀(αᵉ³.¹)·q₂(αᵉ².¹)
  50. 158.75 s gammaloop-nextest-integration> /(denom(2,q₂,mass_scalar_2²,-mass_scalar_2²+(q₂.q₂))·denom(3,q₃,mass_scalar_2²,-mass_scalar_2²+(q₃.q₃)))
  51. 158.75 s gammaloop-nextest-integration> reduced y
  52. 158.75 s gammaloop-nextest-integration> span grow{span_context=true current=subgraph=y, topo_order=1, dod=2 given=subgraph=0, topo_order=0, dod=0}
  53. 158.75 s gammaloop-nextest-integration> [2026-08-27 10:10:26.624] @approx::local_4d [{#uv, #inspect, #integrated}] DEBUG : Rescaled momenta expanded
  54. 158.75 s gammaloop-nextest-integration> field value
  55. 158.75 s gammaloop-nextest-integration> res n-terms: 1, byte size: 585,expr:
  56. 158.75 s gammaloop-nextest-integration> -SCALAR_COUPLING²·q₀(αᵉ².¹)·q₀(αᵉ³.¹)·q₂(αᵉ².¹)·q₂(αᵉ³.¹)
  57. 158.75 s gammaloop-nextest-integration> /(t²·denom(3,-q₀-q₂/t,mass_scalar_2²,-mass_scalar_2²+2·(q₀.q₂)/t+(q₂.q₂)/t²+(q₀.q₀))
  58. 158.75 s gammaloop-nextest-integration> ·denom(2,q₂/t,mass_scalar_2²,-mass_scalar_2²+(q₂.q₂)/t²))
  59. 158.75 s gammaloop-nextest-integration> span t{span_context=true current=subgraph=y, topo_order=1, dod=2 given=subgraph=0, topo_order=0, dod=0}
  60. 158.75 s gammaloop-nextest-integration> [2026-08-27 10:10:26.625] @approx::local_4d [{#uv, #integrated, #rescaled}] DEBUG : Rescaled expanded
  61. 158.75 s gammaloop-nextest-integration> field value
  62. 158.75 s gammaloop-nextest-integration> n_loops 1
  63. 158.75 s gammaloop-nextest-integration> res n-terms: 1, byte size: 707,expr:
  64. 158.75 s gammaloop-nextest-integration> -SCALAR_COUPLING²·q₀(αᵉ².¹)·q₀(αᵉ³.¹)·q₂(αᵉ².¹)·q₂(αᵉ³.¹)
  65. 158.75 s gammaloop-nextest-integration> /(t²·denom(3,-q₂,mUVexp²+t²·mass_scalar_2²,-mUV²+t²·(-mass_scalar_2²+2·(q₀.q₂)/t+(q₂.q₂)/t²+(q₀.q₀))+t²·mUVexp²)
  66. 158.75 s gammaloop-nextest-integration> ·denom(2,q₂,mUVexp²+t²·mass_scalar_2²,-mUV²+t²·(-mass_scalar_2²+(q₂.q₂)/t²)+t²·mUVexp²))
  67. 158.75 s gammaloop-nextest-integration> span t{span_context=true current=subgraph=y, topo_order=1, dod=2 given=subgraph=0, topo_order=0, dod=0}
  68. 158.75 s gammaloop-nextest-integration> [2026-08-27 10:10:26.626] @approx::local_4d [{#uv, #integrated, #series}] DEBUG : Series expanded
  69. 158.75 s gammaloop-nextest-integration> field value
  70. 158.75 s gammaloop-nextest-integration> res n-terms: 3, byte size: 1896,expr:
  71. 158.75 s gammaloop-nextest-integration> (1/2·SCALAR_COUPLING²·(2·mUVexp²-2·mass_scalar_2²)/(denom(2,q₂,mUVexp²,-mUV²+(q₂.q₂))²·denom(3,-q₂,mUVexp²,-mUV²+(q₂.q₂)))
  72. 158.75 s gammaloop-nextest-integration> -SCALAR_COUPLING²
  73. 158.75 s gammaloop-nextest-integration> ·(-1/2·(2·mUVexp²-2·mass_scalar_2²+2·(q₀.q₀))/denom(3,-q₂,mUVexp²,-mUV²+(q₂.q₂))
  74. 158.75 s gammaloop-nextest-integration> +4·(q₀.q₂)²/denom(3,-q₂,mUVexp²,-mUV²+(q₂.q₂))²
  75. 158.75 s gammaloop-nextest-integration> )/(denom(2,q₂,mUVexp²,-mUV²+(q₂.q₂))·denom(3,-q₂,mUVexp²,-mUV²+(q₂.q₂)))
  76. 158.75 s gammaloop-nextest-integration> )·q₀(αᵉ².¹)·q₀(αᵉ³.¹)·q₂(αᵉ².¹)·q₂(αᵉ³.¹)
  77. 158.75 s gammaloop-nextest-integration> +2·SCALAR_COUPLING²·(q₀.q₂)·q₀(αᵉ².¹)·q₀(αᵉ³.¹)·q₂(αᵉ².¹)·q₂(αᵉ³.¹)
  78. 158.75 s gammaloop-nextest-integration> /(t·denom(2,q₂,mUVexp²,-mUV²+(q₂.q₂))·denom(3,-q₂,mUVexp²,-mUV²+(q₂.q₂))²)
  79. 158.75 s gammaloop-nextest-integration> -SCALAR_COUPLING²·q₀(αᵉ².¹)·q₀(αᵉ³.¹)·q₂(αᵉ².¹)·q₂(αᵉ³.¹)
  80. 158.75 s gammaloop-nextest-integration> /(t²·denom(2,q₂,mUVexp²,-mUV²+(q₂.q₂))·denom(3,-q₂,mUVexp²,-mUV²+(q₂.q₂)))
  81. 158.75 s gammaloop-nextest-integration> span t{span_context=true current=subgraph=y, topo_order=1, dod=2 given=subgraph=0, topo_order=0, dod=0}
  82. 158.75 s gammaloop-nextest-integration> [2026-08-27 10:10:26.626] @approx::local_4d [{#uv, #integrated, #series}] DEBUG : Evaluated at t = 1
  83. 158.75 s gammaloop-nextest-integration> field value
  84. 158.75 s gammaloop-nextest-integration> res n-terms: 3, byte size: 1880,expr:
  85. 158.75 s gammaloop-nextest-integration> (1/2·SCALAR_COUPLING²·(2·mUVexp²-2·mass_scalar_2²)/(denom(2,q₂,mUVexp²,-mUV²+(q₂.q₂))²·denom(3,-q₂,mUVexp²,-mUV²+(q₂.q₂)))
  86. 158.75 s gammaloop-nextest-integration> -SCALAR_COUPLING²
  87. 158.75 s gammaloop-nextest-integration> ·(-1/2·(2·mUVexp²-2·mass_scalar_2²+2·(q₀.q₀))/denom(3,-q₂,mUVexp²,-mUV²+(q₂.q₂))
  88. 158.75 s gammaloop-nextest-integration> +4·(q₀.q₂)²/denom(3,-q₂,mUVexp²,-mUV²+(q₂.q₂))²
  89. 158.75 s gammaloop-nextest-integration> )/(denom(2,q₂,mUVexp²,-mUV²+(q₂.q₂))·denom(3,-q₂,mUVexp²,-mUV²+(q₂.q₂)))
  90. 158.75 s gammaloop-nextest-integration> )·q₀(αᵉ².¹)·q₀(αᵉ³.¹)·q₂(αᵉ².¹)·q₂(αᵉ³.¹)
  91. 158.75 s gammaloop-nextest-integration> -SCALAR_COUPLING²·q₀(αᵉ².¹)·q₀(αᵉ³.¹)·q₂(αᵉ².¹)·q₂(αᵉ³.¹)
  92. 158.75 s gammaloop-nextest-integration> /(denom(2,q₂,mUVexp²,-mUV²+(q₂.q₂))·denom(3,-q₂,mUVexp²,-mUV²+(q₂.q₂)))
  93. 158.75 s gammaloop-nextest-integration> +2·SCALAR_COUPLING²·(q₀.q₂)·q₀(αᵉ².¹)·q₀(αᵉ³.¹)·q₂(αᵉ².¹)·q₂(αᵉ³.¹)
  94. 158.75 s gammaloop-nextest-integration> /(denom(2,q₂,mUVexp²,-mUV²+(q₂.q₂))·denom(3,-q₂,mUVexp²,-mUV²+(q₂.q₂))²)
  95. 158.75 s gammaloop-nextest-integration> span t{span_context=true current=subgraph=y, topo_order=1, dod=2 given=subgraph=0, topo_order=0, dod=0}
  96. 158.75 s gammaloop-nextest-integration> [2026-08-27 10:10:26.628] @approx::local_4d [{#uv, #collect, #integrated}] DEBUG : After gamma chain collection
  97. 158.75 s gammaloop-nextest-integration> field value
  98. 158.75 s gammaloop-nextest-integration> expr n-terms: 3, byte size: 1880,expr:
  99. 158.75 s gammaloop-nextest-integration> (1/2·SCALAR_COUPLING²·(2·mUVexp²-2·mass_scalar_2²)/(denom(2,q₂,mUVexp²,-mUV²+(q₂.q₂))²·denom(3,-q₂,mUVexp²,-mUV²+(q₂.q₂)))
  100. 158.75 s gammaloop-nextest-integration> -SCALAR_COUPLING²
  101. 158.75 s gammaloop-nextest-integration> ·(-1/2·(2·mUVexp²-2·mass_scalar_2²+2·(q₀.q₀))/denom(3,-q₂,mUVexp²,-mUV²+(q₂.q₂))
  102. 158.75 s gammaloop-nextest-integration> +4·(q₀.q₂)²/denom(3,-q₂,mUVexp²,-mUV²+(q₂.q₂))²
  103. 158.75 s gammaloop-nextest-integration> )/(denom(2,q₂,mUVexp²,-mUV²+(q₂.q₂))·denom(3,-q₂,mUVexp²,-mUV²+(q₂.q₂)))
  104. 158.75 s gammaloop-nextest-integration> )·q₀(αᵉ².¹)·q₀(αᵉ³.¹)·q₂(αᵉ².¹)·q₂(αᵉ³.¹)
  105. 158.75 s gammaloop-nextest-integration> -SCALAR_COUPLING²·q₀(αᵉ².¹)·q₀(αᵉ³.¹)·q₂(αᵉ².¹)·q₂(αᵉ³.¹)
  106. 158.75 s gammaloop-nextest-integration> /(denom(2,q₂,mUVexp²,-mUV²+(q₂.q₂))·denom(3,-q₂,mUVexp²,-mUV²+(q₂.q₂)))
  107. 158.75 s gammaloop-nextest-integration> +2·SCALAR_COUPLING²·(q₀.q₂)·q₀(αᵉ².¹)·q₀(αᵉ³.¹)·q₂(αᵉ².¹)·q₂(αᵉ³.¹)
  108. 158.75 s gammaloop-nextest-integration> /(denom(2,q₂,mUVexp²,-mUV²+(q₂.q₂))·denom(3,-q₂,mUVexp²,-mUV²+(q₂.q₂))²)
  109. 158.75 s gammaloop-nextest-integration> span t{span_context=true current=subgraph=y, topo_order=1, dod=2 given=subgraph=0, topo_order=0, dod=0}
  110. 158.75 s gammaloop-nextest-integration> [2026-08-27 10:10:26.631] @approx::local_4d [{#profile, #uv, #collect, #integrated, #start, #trace}] DEBUG : After gamma schoonschip
  111. 158.75 s gammaloop-nextest-integration> field value
  112. 158.75 s gammaloop-nextest-integration> expr n-terms: 3, byte size: 1631,expr:
  113. 158.75 s gammaloop-nextest-integration> (1/2·SCALAR_COUPLING²·(2·mUVexp²-2·mass_scalar_2²)/(denom(2,q₂,mUVexp²,-mUV²+(q₂.q₂))²·denom(3,-q₂,mUVexp²,-mUV²+(q₂.q₂)))
  114. 158.75 s gammaloop-nextest-integration> -SCALAR_COUPLING²
  115. 158.75 s gammaloop-nextest-integration> ·(-1/2·(2·mUVexp²-2·mass_scalar_2²+2·(q₀.q₀))/denom(3,-q₂,mUVexp²,-mUV²+(q₂.q₂))
  116. 158.75 s gammaloop-nextest-integration> +4·(q₀.q₂)²/denom(3,-q₂,mUVexp²,-mUV²+(q₂.q₂))²
  117. 158.75 s gammaloop-nextest-integration> )/(denom(2,q₂,mUVexp²,-mUV²+(q₂.q₂))·denom(3,-q₂,mUVexp²,-mUV²+(q₂.q₂)))
  118. 158.75 s gammaloop-nextest-integration> )·(q₀.q₂)²
  119. 158.75 s gammaloop-nextest-integration> -SCALAR_COUPLING²·(q₀.q₂)²/(denom(2,q₂,mUVexp²,-mUV²+(q₂.q₂))·denom(3,-q₂,mUVexp²,-mUV²+(q₂.q₂)))
  120. 158.75 s gammaloop-nextest-integration> +2·SCALAR_COUPLING²·(q₀.q₂)·(q₀.q₂)²
  121. 158.75 s gammaloop-nextest-integration> /(denom(2,q₂,mUVexp²,-mUV²+(q₂.q₂))·denom(3,-q₂,mUVexp²,-mUV²+(q₂.q₂))²)
  122. 158.75 s gammaloop-nextest-integration> span t{span_context=true current=subgraph=y, topo_order=1, dod=2 given=subgraph=0, topo_order=0, dod=0}
  123. 158.75 s gammaloop-nextest-integration> [2026-08-27 10:10:26.634] @approx::local_4d [{#profile, #uv, #collect, #integrated, #start, #trace}] DEBUG : After gamma collection
  124. 158.75 s gammaloop-nextest-integration> field value
  125. 158.75 s gammaloop-nextest-integration> expr n-terms: 1, byte size: 1347,expr:
  126. 158.75 s gammaloop-nextest-integration> SCALAR_COUPLING²
  127. 158.75 s gammaloop-nextest-integration> ·(-denom(2,q₂,mUVexp²,-mUV²+(q₂.q₂))·denom(3,-q₂,mUVexp²,-mUV²+(q₂.q₂))²
  128. 158.75 s gammaloop-nextest-integration> +1/2·(2·mUVexp²-2·mass_scalar_2²)·denom(3,-q₂,mUVexp²,-mUV²+(q₂.q₂))²
  129. 158.75 s gammaloop-nextest-integration> -(-1/2·(2·mUVexp²-2·mass_scalar_2²+2·(q₀.q₀))·denom(3,-q₂,mUVexp²,-mUV²+(q₂.q₂))+4·(q₀.q₂)²)
  130. 158.75 s gammaloop-nextest-integration> ·denom(2,q₂,mUVexp²,-mUV²+(q₂.q₂))
  131. 158.75 s gammaloop-nextest-integration> +2·(q₀.q₂)·denom(2,q₂,mUVexp²,-mUV²+(q₂.q₂))·denom(3,-q₂,mUVexp²,-mUV²+(q₂.q₂))
  132. 158.75 s gammaloop-nextest-integration> )·(q₀.q₂)²/(denom(2,q₂,mUVexp²,-mUV²+(q₂.q₂))²·denom(3,-q₂,mUVexp²,-mUV²+(q₂.q₂))³)
  133. 158.75 s gammaloop-nextest-integration> span t{span_context=true current=subgraph=y, topo_order=1, dod=2 given=subgraph=0, topo_order=0, dod=0}
  134. 158.75 s gammaloop-nextest-integration> [2026-08-27 10:10:26.635] @approx::local_4d [{#profile, #uv, #gamma, #integrated, #start, #trace, #vakint}] DEBUG : After gamma simplification
  135. 158.75 s gammaloop-nextest-integration> ... omitted 3263 more lines; see full nextest output above
  136. 158.75 s gammaloop-nextest-integration>
  137. 158.75 s gammaloop-nextest-integration> 8. gammaloop-integration-tests::uv::sunrise_scalar_1_uv
  138. 158.75 s gammaloop-nextest-integration> failure: test failure with exit code 101
  139. 158.75 s gammaloop-nextest-integration> system-out
  140. 158.75 s gammaloop-nextest-integration> running 1 test
  141. 158.75 s gammaloop-nextest-integration> test sunrise_scalar_1_uv has been running for over 60 seconds
  142. 158.75 s gammaloop-nextest-integration> +------------------+------------------------+--------------+--------+----------+----------------------------------------------------------------------------------------------------------------------+-------+
  143. 158.75 s gammaloop-nextest-integration> | case | check | graph | status | sigma | threshold | error |
  144. 158.75 s gammaloop-nextest-integration> +------------------+------------------------+--------------+--------+----------+----------------------------------------------------------------------------------------------------------------------+-------+
  145. 158.75 s gammaloop-nextest-integration> | sunrise_scalar_1 | uv_profile | - | FAIL | - | - | - |
  146. 158.75 s gammaloop-nextest-integration> +------------------+------------------------+--------------+--------+----------+----------------------------------------------------------------------------------------------------------------------+-------+
  147. 158.75 s gammaloop-nextest-integration> | sunrise_scalar_1 | m_uv.inspect | inspect | pass | - | best inspect relative delta 1.624e0 >= 1000*accuracy 1.000e-3 (accuracy=1.000e-6, exponent=+1.0, seed=1, probes=10) | - |
  148. 158.75 s gammaloop-nextest-integration> +------------------+------------------------+--------------+--------+----------+----------------------------------------------------------------------------------------------------------------------+-------+
  149. 158.75 s gammaloop-nextest-integration> | sunrise_scalar_1 | m_uv.integrated | sunrise | pass | 0.1sigma | compatible within 2sigma | - |
  150. 158.75 s gammaloop-nextest-integration> +------------------+------------------------+--------------+--------+----------+----------------------------------------------------------------------------------------------------------------------+-------+
  151. 158.75 s gammaloop-nextest-integration> | sunrise_scalar_1 | rls.inspect | inspect | pass | - | best inspect relative delta 8.682e-1 >= 1000*accuracy 1.000e-3 (accuracy=1.000e-6, exponent=+1.0, seed=1, probes=10) | - |
  152. 158.75 s gammaloop-nextest-integration> +------------------+------------------------+--------------+--------+----------+----------------------------------------------------------------------------------------------------------------------+-------+
  153. 158.75 s gammaloop-nextest-integration> | sunrise_scalar_1 | rls.integrated | sunrise | pass | 0.0sigma | compatible within 2sigma | - |
  154. 158.75 s gammaloop-nextest-integration> +------------------+------------------------+--------------+--------+----------+----------------------------------------------------------------------------------------------------------------------+-------+
  155. 158.75 s gammaloop-nextest-integration> | sunrise_scalar_1 | mu_r.inspect | inspect | pass | - | best inspect relative delta 1.752e0 >= 1000*accuracy 1.000e-3 (accuracy=1.000e-6, exponent=+1.0, seed=1, probes=10) | - |
  156. 158.75 s gammaloop-nextest-integration> +------------------+------------------------+--------------+--------+----------+----------------------------------------------------------------------------------------------------------------------+-------+
  157. 158.75 s gammaloop-nextest-integration> | sunrise_scalar_1 | integrated.relerr | integrated | pass | - | relative error 9.20% <= 10.00% | - |
  158. 158.75 s gammaloop-nextest-integration> +------------------+------------------------+--------------+--------+----------+----------------------------------------------------------------------------------------------------------------------+-------+
  159. 158.75 s gammaloop-nextest-integration> | sunrise_scalar_1 | m_uv.integrated.relerr | m_uv-shifted | pass | - | relative error 5.89% <= 10.00% | - |
  160. 158.75 s gammaloop-nextest-integration> +------------------+------------------------+--------------+--------+----------+----------------------------------------------------------------------------------------------------------------------+-------+
  161. 158.75 s gammaloop-nextest-integration> | sunrise_scalar_1 | target | - | pass | - | 2sigma | - |
  162. 158.75 s gammaloop-nextest-integration> +------------------+------------------------+--------------+--------+----------+----------------------------------------------------------------------------------------------------------------------+-------+
  163. 158.75 s gammaloop-nextest-integration> test sunrise_scalar_1_uv ... FAILED
  164. 158.75 s gammaloop-nextest-integration>
  165. 158.75 s gammaloop-nextest-integration> failures:
  166. 158.75 s gammaloop-nextest-integration>
  167. 158.75 s gammaloop-nextest-integration> failures:
  168. 158.75 s gammaloop-nextest-integration> sunrise_scalar_1_uv
  169. 158.75 s gammaloop-nextest-integration>
  170. 158.75 s gammaloop-nextest-integration> test result: FAILED. 0 passed; 1 failed; 0 ignored; 0 measured; 24 filtered out; finished in 114.66s
  171. 158.75 s gammaloop-nextest-integration> system-err
  172. 158.75 s gammaloop-nextest-integration> [2026-08-27 10:10:36.806] @gammaloop_api::se... INFO : Running command run generate
  173. 158.75 s gammaloop-nextest-integration> [2026-08-27 10:10:36.810] @gammaloop_api::se... INFO : Starting command block generate
  174. 158.75 s gammaloop-nextest-integration> [2026-08-27 10:10:36.810] @gammaloop_api::se... INFO : Running command import model scalars-default.json
  175. 158.75 s gammaloop-nextest-integration> [2026-08-27 10:10:36.810] @import::model INFO : Loading built-in JSON model scalars-default
  176. 158.75 s gammaloop-nextest-integration> [2026-08-27 10:10:36.848] @gammalooprs::model INFO : The following 2 external parameters were forced to zero by the restriction card:
  177. 158.75 s gammaloop-nextest-integration> width_scalar_1, width_scalar_2
  178. 158.75 s gammaloop-nextest-integration> [2026-08-27 10:10:36.849] @gammaloop_api::se... INFO : Running command remove processes
  179. 158.75 s gammaloop-nextest-integration> [2026-08-27 10:10:36.849] @gammaloop_api::se... INFO : Running command set global kv global.generation.uv.generate_integrated=true
  180. 158.75 s gammaloop-nextest-integration> [2026-08-27 10:10:36.862] @gammaloop_api::se... INFO : Running command import graphs ./tests/resources/graphs/scalar_sunrise.dot -p sunrise_scalar_1 -i scalar_sunrise
  181. 158.75 s gammaloop-nextest-integration> [2026-08-27 10:10:36.862] @commands::import INFO : Loading graphs from '/build/source/tests/resources/graphs/scalar_sunrise.dot'
  182. 158.75 s gammaloop-nextest-integration> [2026-08-27 10:10:36.886] @gammaloop_api::se... INFO : Running command generate existing -p sunrise_scalar_1 -i scalar_sunrise
  183. 158.75 s gammaloop-nextest-integration> [2026-08-27 10:10:36.891] @approx::local_4d [{#uv, #inspect, #integrated}] DEBUG : Rescaled momenta expanded
  184. 158.75 s gammaloop-nextest-integration> field value
  185. 158.75 s gammaloop-nextest-integration> res n-terms: 1, byte size: 3,expr:
  186. 158.75 s gammaloop-nextest-integration> 1
  187. 158.75 s gammaloop-nextest-integration> [2026-08-27 10:10:36.895] @approx::local_4d [{#uv, #inspect, #integrated}] DEBUG : Rescaled momenta expanded
  188. 158.75 s gammaloop-nextest-integration> field value
  189. 158.75 s gammaloop-nextest-integration> res n-terms: 1, byte size: 611,expr:
  190. 158.75 s gammaloop-nextest-integration> 1/(denom(0,q₀/t,mass_scalar_1²,-mass_scalar_1²+(q₀.q₀)/t²)
  191. 158.75 s gammaloop-nextest-integration> ·denom(2,-q₁+q₃-q₀/t,mass_scalar_1²,
  192. 158.75 s gammaloop-nextest-integration> -mass_scalar_1²+2·(q₀.q₁)/t-2·(q₀.q₃)/t+(q₀.q₀)/t²+(q₁.q₁)
  193. 158.75 s gammaloop-nextest-integration> -2·(q₁.q₃)+(q₃.q₃)
  194. 158.75 s gammaloop-nextest-integration> ))
  195. 158.75 s gammaloop-nextest-integration> [2026-08-27 10:10:36.896] @approx::local_4d [{#uv, #inspect, #integrated}] DEBUG : Rescaled momenta expanded
  196. 158.75 s gammaloop-nextest-integration> field value
  197. 158.75 s gammaloop-nextest-integration> res n-terms: 1, byte size: 611,expr:
  198. 158.75 s gammaloop-nextest-integration> 1/(denom(0,q₀/t,mass_scalar_1²,-mass_scalar_1²+(q₀.q₀)/t²)
  199. 158.75 s gammaloop-nextest-integration> ·denom(1,-q₂+q₃-q₀/t,mass_scalar_1²,
  200. 158.75 s gammaloop-nextest-integration> -mass_scalar_1²+2·(q₀.q₂)/t-2·(q₀.q₃)/t+(q₀.q₀)/t²+(q₂.q₂)
  201. 158.75 s gammaloop-nextest-integration> -2·(q₂.q₃)+(q₃.q₃)
  202. 158.75 s gammaloop-nextest-integration> ))
  203. 158.75 s gammaloop-nextest-integration> [2026-08-27 10:10:36.902] @approx::local_4d [{#uv, #inspect, #integrated}] DEBUG : Rescaled momenta expanded
  204. 158.75 s gammaloop-nextest-integration> field value
  205. 158.75 s gammaloop-nextest-integration> res n-terms: 1, byte size: 777,expr:
  206. 158.75 s gammaloop-nextest-integration> 1/(denom(0,q₀/t,mass_scalar_1²,-mass_scalar_1²+(q₀.q₀)/t²)·denom(1,q₁/t,mass_scalar_1²,-mass_scalar_1²+(q₁.q₁)/t²)
  207. 158.75 s gammaloop-nextest-integration> ·denom(2,q₄-q₀/t-q₁/t,mass_scalar_1²,
  208. 158.75 s gammaloop-nextest-integration> -mass_scalar_1²-2·(q₀.q₄)/t-2·(q₁.q₄)/t+(q₀.q₀)/t²+2·(q₀.q₁)/t²
  209. 158.75 s gammaloop-nextest-integration> +(q₁.q₁)/t²+(q₄.q₄)
  210. 158.75 s gammaloop-nextest-integration> ))
  211. 158.75 s gammaloop-nextest-integration> [2026-08-27 10:10:36.907] @approx::local_4d [{#uv, #inspect, #integrated}] DEBUG : Rescaled momenta expanded
  212. 158.75 s gammaloop-nextest-integration> field value
  213. 158.75 s gammaloop-nextest-integration> res n-terms: 1, byte size: 611,expr:
  214. 158.75 s gammaloop-nextest-integration> 1/(denom(1,q₁/t,mass_scalar_1²,-mass_scalar_1²+(q₁.q₁)/t²)
  215. 158.75 s gammaloop-nextest-integration> ·denom(2,-q₀+q₃-q₁/t,mass_scalar_1²,
  216. 158.75 s gammaloop-nextest-integration> -mass_scalar_1²+2·(q₀.q₁)/t-2·(q₁.q₃)/t+(q₁.q₁)/t²+(q₀.q₀)
  217. 158.75 s gammaloop-nextest-integration> -2·(q₀.q₃)+(q₃.q₃)
  218. 158.75 s gammaloop-nextest-integration> ))
  219. 158.75 s gammaloop-nextest-integration> [2026-08-27 10:10:36.909] @approx::final_integrand[{#generation, #profile, #uv, #graph, #summary}] DEBUG : Computed global numerator
  220. 158.75 s gammaloop-nextest-integration> field value
  221. 158.75 s gammaloop-nextest-integration> global_num n-terms: 1, byte size: 3,expr:
  222. 158.75 s gammaloop-nextest-integration> 1
  223. 158.75 s gammaloop-nextest-integration> span build_3d{span_context=true graph=sunrise current=subgraph=0, topo_order=0, dod=0}
  224. 158.75 s gammaloop-nextest-integration> [2026-08-27 10:10:36.916] @uv::approx [{#generation, #uv, #fourd}] DEBUG : Computing 4D
  225. 158.75 s gammaloop-nextest-integration> field value
  226. 158.75 s gammaloop-nextest-integration> simple subgraph(S_47,S_3I)*Approx(subgraph(S_3I,0)) of sunrise
  227. 158.75 s gammaloop-nextest-integration> span compute_4d{span_context=true graph=sunrise current=subgraph=3I, topo_order=1, dod=0 given=subgraph=0, topo_order=0, dod=0 reduced=SubSet { set: BitVec<usize, bitvec::order::Lsb0> { addr: 0x7fffec03da60, head: 000000, bits: 8, capacity: 64 } [0, 0, 1, 1, 0, 0, 1, 1], id: PhantomData<linnet::half_edge::involution::Hedge> }}
  228. 158.75 s gammaloop-nextest-integration> [2026-08-27 10:10:36.917] @approx::local_4d [{#uv, #algebra, #integrated, #start}] DEBUG :
  229. 158.75 s gammaloop-nextest-integration> field value
  230. 158.75 s gammaloop-nextest-integration> integrand n-terms: 1, byte size: 217,expr:
  231. 158.75 s gammaloop-nextest-integration> 1/(denom(0,q₀,mass_scalar_1²,-mass_scalar_1²+(q₀.q₀))·denom(2,q₂,mass_scalar_1²,-mass_scalar_1²+(q₂.q₂)))
  232. 158.75 s gammaloop-nextest-integration> reduced 3I
  233. 158.75 s gammaloop-nextest-integration> span grow{span_context=true current=subgraph=3I, topo_order=1, dod=0 given=subgraph=0, topo_order=0, dod=0}
  234. 158.75 s gammaloop-nextest-integration> [2026-08-27 10:10:36.917] @approx::local_4d [{#uv, #inspect, #integrated}] DEBUG : Rescaled momenta expanded
  235. 158.75 s gammaloop-nextest-integration> field value
  236. 158.75 s gammaloop-nextest-integration> res n-terms: 1, byte size: 611,expr:
  237. 158.75 s gammaloop-nextest-integration> 1/(denom(0,q₀/t,mass_scalar_1²,-mass_scalar_1²+(q₀.q₀)/t²)
  238. 158.75 s gammaloop-nextest-integration> ·denom(2,-q₁+q₃-q₀/t,mass_scalar_1²,
  239. 158.75 s gammaloop-nextest-integration> -mass_scalar_1²+2·(q₀.q₁)/t-2·(q₀.q₃)/t+(q₀.q₀)/t²+(q₁.q₁)
  240. 158.75 s gammaloop-nextest-integration> -2·(q₁.q₃)+(q₃.q₃)
  241. 158.75 s gammaloop-nextest-integration> ))
  242. 158.75 s gammaloop-nextest-integration> span t{span_context=true current=subgraph=3I, topo_order=1, dod=0 given=subgraph=0, topo_order=0, dod=0}
  243. 158.75 s gammaloop-nextest-integration> [2026-08-27 10:10:36.918] @approx::local_4d [{#uv, #integrated, #rescaled}] DEBUG : Rescaled expanded
  244. 158.75 s gammaloop-nextest-integration> field value
  245. 158.75 s gammaloop-nextest-integration> n_loops 1
  246. 158.75 s gammaloop-nextest-integration> res n-terms: 1, byte size: 723,expr:
  247. 158.75 s gammaloop-nextest-integration> 1/(denom(0,q₀,mUVexp²+t²·mass_scalar_1²,-mUV²+t²·(-mass_scalar_1²+(q₀.q₀)/t²)+t²·mUVexp²)
  248. 158.75 s gammaloop-nextest-integration> ·denom(2,-q₀,mUVexp²+t²·mass_scalar_1²,
  249. 158.75 s gammaloop-nextest-integration> -mUV²
  250. 158.75 s gammaloop-nextest-integration> +t²
  251. 158.75 s gammaloop-nextest-integration> ·(-mass_scalar_1²+2·(q₀.q₁)/t-2·(q₀.q₃)/t+(q₀.q₀)/t²+(q₁.q₁)
  252. 158.75 s gammaloop-nextest-integration> -2·(q₁.q₃)+(q₃.q₃)
  253. 158.75 s gammaloop-nextest-integration> )
  254. 158.75 s gammaloop-nextest-integration> +t²·mUVexp²
  255. 158.75 s gammaloop-nextest-integration> ))
  256. 158.75 s gammaloop-nextest-integration> span t{span_context=true current=subgraph=3I, topo_order=1, dod=0 given=subgraph=0, topo_order=0, dod=0}
  257. 158.75 s gammaloop-nextest-integration> [2026-08-27 10:10:36.918] @approx::local_4d [{#uv, #integrated, #series}] DEBUG : Series expanded
  258. 158.75 s gammaloop-nextest-integration> field value
  259. 158.75 s gammaloop-nextest-integration> res n-terms: 1, byte size: 223,expr:
  260. 158.75 s gammaloop-nextest-integration> 1/(denom(0,q₀,mUVexp²,-mUV²+(q₀.q₀))·denom(2,-q₀,mUVexp²,-mUV²+(q₀.q₀)))
  261. 158.75 s gammaloop-nextest-integration> span t{span_context=true current=subgraph=3I, topo_order=1, dod=0 given=subgraph=0, topo_order=0, dod=0}
  262. 158.75 s gammaloop-nextest-integration> [2026-08-27 10:10:36.918] @approx::local_4d [{#uv, #integrated, #series}] DEBUG : Evaluated at t = 1
  263. 158.75 s gammaloop-nextest-integration> field value
  264. 158.75 s gammaloop-nextest-integration> res n-terms: 1, byte size: 223,expr:
  265. 158.75 s gammaloop-nextest-integration> 1/(denom(0,q₀,mUVexp²,-mUV²+(q₀.q₀))·denom(2,-q₀,mUVexp²,-mUV²+(q₀.q₀)))
  266. 158.75 s gammaloop-nextest-integration> span t{span_context=true current=subgraph=3I, topo_order=1, dod=0 given=subgraph=0, topo_order=0, dod=0}
  267. 158.75 s gammaloop-nextest-integration> [2026-08-27 10:10:36.920] @approx::local_4d [{#uv, #collect, #integrated}] DEBUG : After gamma chain collection
  268. 158.75 s gammaloop-nextest-integration> field value
  269. 158.75 s gammaloop-nextest-integration> expr n-terms: 1, byte size: 223,expr:
  270. 158.75 s gammaloop-nextest-integration> 1/(denom(0,q₀,mUVexp²,-mUV²+(q₀.q₀))·denom(2,-q₀,mUVexp²,-mUV²+(q₀.q₀)))
  271. 158.75 s gammaloop-nextest-integration> span t{span_context=true current=subgraph=3I, topo_order=1, dod=0 given=subgraph=0, topo_order=0, dod=0}
  272. 158.75 s gammaloop-nextest-integration> [2026-08-27 10:10:36.921] @approx::local_4d [{#profile, #uv, #collect, #integrated, #start, #trace}] DEBUG : After gamma schoonschip
  273. 158.75 s gammaloop-nextest-integration> field value
  274. 158.75 s gammaloop-nextest-integration> expr n-terms: 1, byte size: 223,expr:
  275. 158.75 s gammaloop-nextest-integration> 1/(denom(0,q₀,mUVexp²,-mUV²+(q₀.q₀))·denom(2,-q₀,mUVexp²,-mUV²+(q₀.q₀)))
  276. 158.75 s gammaloop-nextest-integration> span t{span_context=true current=subgraph=3I, topo_order=1, dod=0 given=subgraph=0, topo_order=0, dod=0}
  277. 158.75 s gammaloop-nextest-integration> [2026-08-27 10:10:36.921] @approx::local_4d [{#profile, #uv, #collect, #integrated, #start, #trace}] DEBUG : After gamma collection
  278. 158.75 s gammaloop-nextest-integration> field value
  279. 158.75 s gammaloop-nextest-integration> expr n-terms: 1, byte size: 223,expr:
  280. 158.75 s gammaloop-nextest-integration> 1/(denom(0,q₀,mUVexp²,-mUV²+(q₀.q₀))·denom(2,-q₀,mUVexp²,-mUV²+(q₀.q₀)))
  281. 158.75 s gammaloop-nextest-integration> span t{span_context=true current=subgraph=3I, topo_order=1, dod=0 given=subgraph=0, topo_order=0, dod=0}
  282. 158.75 s gammaloop-nextest-integration> [2026-08-27 10:10:36.921] @approx::local_4d [{#profile, #uv, #gamma, #integrated, #start, #trace, #vakint}] DEBUG : After gamma simplification
  283. 158.75 s gammaloop-nextest-integration> field value
  284. 158.75 s gammaloop-nextest-integration> expr n-terms: 1, byte size: 223,expr:
  285. 158.75 s gammaloop-nextest-integration> 1/(denom(0,q₀,mUVexp²,-mUV²+(q₀.q₀))·denom(2,-q₀,mUVexp²,-mUV²+(q₀.q₀)))
  286. 158.75 s gammaloop-nextest-integration> span t{span_context=true current=subgraph=3I, topo_order=1, dod=0 given=subgraph=0, topo_order=0, dod=0}
  287. 158.75 s gammaloop-nextest-integration> [2026-08-27 10:10:36.921] @approx::local_4d [{#profile, #uv, #integrated, #schoonschip, #start, #trace, #vakint}] DEBUG : After Schoonschip net
  288. 158.75 s gammaloop-nextest-integration> field value
  289. 158.75 s gammaloop-nextest-integration> expr n-terms: 1, byte size: 223,expr:
  290. 158.75 s gammaloop-nextest-integration> 1/(denom(0,q₀,mUVexp²,-mUV²+(q₀.q₀))·denom(2,-q₀,mUVexp²,-mUV²+(q₀.q₀)))
  291. 158.75 s gammaloop-nextest-integration> ... omitted 20095 more lines; see full nextest output above
  292. 158.75 s gammaloop-nextest-integration>
  293. 158.75 s gammaloop-nextest-integration> 9. gammaloop-integration-tests::uv::se1l_uv
  294. 158.75 s gammaloop-nextest-integration> failure: test failure with exit code 101
  295. 158.75 s gammaloop-nextest-integration> system-out
  296. 158.75 s gammaloop-nextest-integration> running 1 test
  297. 158.75 s gammaloop-nextest-integration> test se1l_uv has been running for over 60 seconds
  298. 158.75 s gammaloop-nextest-integration> +------+-----------------+---------+--------+----------+-----------------------------------------------------------------------------------------------------------------------+-------+
  299. 158.75 s gammaloop-nextest-integration> | case | check | graph | status | sigma | threshold | error |
  300. 158.75 s gammaloop-nextest-integration> +------+-----------------+---------+--------+----------+-----------------------------------------------------------------------------------------------------------------------+-------+
  301. 158.75 s gammaloop-nextest-integration> | se1l | uv_profile | - | FAIL | - | - | - |
  302. 158.75 s gammaloop-nextest-integration> +------+-----------------+---------+--------+----------+-----------------------------------------------------------------------------------------------------------------------+-------+
  303. 158.75 s gammaloop-nextest-integration> | se1l | m_uv.inspect | inspect | pass | - | best inspect relative delta 1.097e-1 >= 1000*accuracy 1.000e-7 (accuracy=1.000e-10, exponent=+2.0, seed=1, probes=10) | - |
  304. 158.75 s gammaloop-nextest-integration> +------+-----------------+---------+--------+----------+-----------------------------------------------------------------------------------------------------------------------+-------+
  305. 158.75 s gammaloop-nextest-integration> | se1l | m_uv.integrated | se1l | pass | 0.1sigma | compatible within 2sigma | - |
  306. 158.75 s gammaloop-nextest-integration> +------+-----------------+---------+--------+----------+-----------------------------------------------------------------------------------------------------------------------+-------+
  307. 158.75 s gammaloop-nextest-integration> | se1l | rls.inspect | inspect | pass | - | best inspect relative delta 4.499e-2 >= 1000*accuracy 1.000e-7 (accuracy=1.000e-10, exponent=+2.0, seed=1, probes=10) | - |
  308. 158.75 s gammaloop-nextest-integration> +------+-----------------+---------+--------+----------+-----------------------------------------------------------------------------------------------------------------------+-------+
  309. 158.75 s gammaloop-nextest-integration> | se1l | rls.integrated | se1l | pass | 0.0sigma | compatible within 2sigma | - |
  310. 158.75 s gammaloop-nextest-integration> +------+-----------------+---------+--------+----------+-----------------------------------------------------------------------------------------------------------------------+-------+
  311. 158.75 s gammaloop-nextest-integration> | se1l | mu_r.inspect | inspect | pass | - | best inspect relative delta 1.424e-1 >= 1000*accuracy 1.000e-7 (accuracy=1.000e-10, exponent=+2.0, seed=1, probes=10) | - |
  312. 158.75 s gammaloop-nextest-integration> +------+-----------------+---------+--------+----------+-----------------------------------------------------------------------------------------------------------------------+-------+
  313. 158.75 s gammaloop-nextest-integration> | se1l | target | - | pass | - | 2sigma | - |
  314. 158.75 s gammaloop-nextest-integration> +------+-----------------+---------+--------+----------+-----------------------------------------------------------------------------------------------------------------------+-------+
  315. 158.75 s gammaloop-nextest-integration> test se1l_uv ... FAILED
  316. 158.75 s gammaloop-nextest-integration>
  317. 158.75 s gammaloop-nextest-integration> failures:
  318. 158.75 s gammaloop-nextest-integration>
  319. 158.75 s gammaloop-nextest-integration> failures:
  320. 158.75 s gammaloop-nextest-integration> se1l_uv
  321. 158.75 s gammaloop-nextest-integration>
  322. 158.75 s gammaloop-nextest-integration> test result: FAILED. 0 passed; 1 failed; 0 ignored; 0 measured; 24 filtered out; finished in 119.48s
  323. 158.75 s gammaloop-nextest-integration> system-err
  324. 158.75 s gammaloop-nextest-integration> [2026-08-27 10:10:36.528] @gammaloop_api::se... INFO : Running command run generate
  325. 158.75 s gammaloop-nextest-integration> [2026-08-27 10:10:36.528] @gammaloop_api::se... INFO : Starting command block generate
  326. 158.75 s gammaloop-nextest-integration> [2026-08-27 10:10:36.528] @gammaloop_api::se... INFO : Running command import model sm-default
  327. 158.75 s gammaloop-nextest-integration> [2026-08-27 10:10:36.528] @import::model INFO : Loading built-in JSON model sm-default
  328. 158.75 s gammaloop-nextest-integration> [2026-08-27 10:10:36.550] @gammalooprs::model INFO : The following 11 external parameters were forced to zero by the restriction card:
  329. 158.75 s gammaloop-nextest-integration> lamWS, AWS, rhoWS, etaWS, ymc, yme, ymm, MC, Me, MM, WTau
  330. 158.75 s gammaloop-nextest-integration> [2026-08-27 10:10:36.551] @gammalooprs::model INFO : The following 34 vertex rules were removed by the restriction card:
  331. 158.75 s gammaloop-nextest-integration> V_82 -> (c~, d, G+) | V_83 -> (t~, d, G+) | V_84 -> (c~, s, G+) | V_85 -> (t~, s, G+) | V_86 -> (u~, b, G+) | V_87 -> (c~, b, G+) | V_90 -> (c~, d, W+) | V_91 -> (t~, d, W+) | V_92 -> (u~, s, W+) | V_94 -> (t~, s, W+) | V_95 -> (u~, b, W+) | V_96 -> (c~, b, W+) | V_101 -> (e+, e-, G0) | V_102 -> (mu+, mu-, G0) | V_104 -> (e+, e-, H) | V_105 -> (mu+, mu-, H) | V_110 -> (ve~, e-, G+) | V_111 -> (vm~, mu-, G+) | V_116 -> (b~, u, G-) | V_117 -> (d~, c, G-) | V_118 -> (s~, c, G-) | V_119 -> (b~, c, G-) | V_120 -> (d~, t, G-) | V_121 -> (s~, t, G-) | V_124 -> (s~, u, W-) | V_125 -> (b~, u, W-) | V_126 -> (d~, c, W-) | V_128 -> (b~, c, W-) | V_129 -> (d~, t, W-) | V_130 -> (s~, t, W-) | V_138 -> (c~, c, G0) | V_140 -> (c~, c, H) | V_145 -> (e+, ve, G-) | V_146 -> (mu+, vm, G-)
  332. 158.75 s gammaloop-nextest-integration> [2026-08-27 10:10:36.551] @gammalooprs::model INFO : The following 36 couplings were removed by the restriction card:
  333. 158.75 s gammaloop-nextest-integration> GC_13, GC_14, GC_16, GC_17, GC_18, GC_19, GC_20, GC_22, GC_23, GC_24, GC_25, GC_26, GC_28, GC_29, GC_42, GC_43, GC_44, GC_46, GC_47, GC_48, GC_84, GC_85, GC_86, GC_87, GC_88, GC_89, GC_90, GC_91, GC_92, GC_93, GC_101, GC_102, GC_103, GC_105, GC_106, GC_107
  334. 158.75 s gammaloop-nextest-integration> [2026-08-27 10:10:36.551] @gammaloop_api::se... INFO : Running command remove processes
  335. 158.75 s gammaloop-nextest-integration> [2026-08-27 10:10:36.551] @gammaloop_api::se... INFO : Running command set global kv global.generation.uv.generate_integrated=true
  336. 158.75 s gammaloop-nextest-integration> [2026-08-27 10:10:36.552] @gammaloop_api::se... INFO : Running command import graphs ./tests/resources/graphs/uv_tests/se1l.dot -p se1l -i se1l
  337. 158.75 s gammaloop-nextest-integration> [2026-08-27 10:10:36.552] @commands::import INFO : Loading graphs from '/build/source/tests/resources/graphs/uv_tests/se1l.dot'
  338. 158.75 s gammaloop-nextest-integration> [2026-08-27 10:10:36.554] @gammaloop_api::se... INFO : Running command generate existing -p se1l -i se1l
  339. 158.75 s gammaloop-nextest-integration> [2026-08-27 10:10:38.018] @commands::generate INFO :
  340. 158.75 s gammaloop-nextest-integration> Integrand generation summary
  341. 158.75 s gammaloop-nextest-integration> peak RAM 86.07 MiB | cores 1
  342. 158.75 s gammaloop-nextest-integration> ╭───────────┬───────┬─────────┬─────────────┬─────────────┬────────────────┬─────────────╮
  343. 158.75 s gammaloop-nextest-integration> │ integrand │ graph │ # evals │ expr build │ spenso │ symbolica eval │ compile │
  344. 158.75 s gammaloop-nextest-integration> ├───────────┼───────┼─────────┼─────────────┼─────────────┼────────────────┼─────────────┤
  345. 158.75 s gammaloop-nextest-integration> │ se1l │ se1l │ 5 │ 1.33s (94%) │ 33ms (2.4%) │ 54ms (3.9%) │ 0ms (0.00%) │
  346. 158.75 s gammaloop-nextest-integration> ├───────────┼───────┼─────────┼─────────────┼─────────────┼────────────────┼─────────────┤
  347. 158.75 s gammaloop-nextest-integration> │ Total │ │ 5 │ 1.33s (94%) │ 33ms (2.4%) │ 54ms (3.9%) │ 0ms (0.00%) │
  348. 158.75 s gammaloop-nextest-integration> ╰───────────┴───────┴─────────┴─────────────┴─────────────┴────────────────┴─────────────╯
  349. 158.75 s gammaloop-nextest-integration> [2026-08-27 10:10:38.019] @gammaloop_api::se... INFO : Running command set process -p se1l -i se1l kv general.m_uv=0.2
  350. 158.75 s gammaloop-nextest-integration> [2026-08-27 10:10:38.020] @gammaloop_api::se... INFO : Running command set process -p se1l -i se1l kv general.mu_r=0.2
  351. 158.75 s gammaloop-nextest-integration> [2026-08-27 10:10:38.021] @gammaloop_api::se... INFO : Running command set process -p se1l -i se1l kv general.renormalization_localization_scale=0.2
  352. 158.75 s gammaloop-nextest-integration> [2026-08-27 10:10:38.022] @gammaloop_api::se... INFO : Running command duplicate integrand -p se1l -i se1l --output_process_name se1l --output_integrand_name se1l_muv_shifted
  353. 158.75 s gammaloop-nextest-integration> [2026-08-27 10:10:38.023] @gammaloop_api::se... INFO : Running command set process -p se1l -i se1l_muv_shifted kv general.m_uv=0.5
  354. 158.75 s gammaloop-nextest-integration> [2026-08-27 10:10:38.024] @gammaloop_api::se... INFO : Running command duplicate integrand -p se1l -i se1l --output_process_name se1l --output_integrand_name se1l_rls_shifted
  355. 158.75 s gammaloop-nextest-integration> [2026-08-27 10:10:38.025] @gammaloop_api::se... INFO : Running command set process -p se1l -i se1l_rls_shifted kv general.renormalization_localization_scale=1
  356. 158.75 s gammaloop-nextest-integration> [2026-08-27 10:10:38.026] @gammaloop_api::se... INFO : Running command duplicate integrand -p se1l -i se1l --output_process_name se1l --output_integrand_name se1l_mur_shifted
  357. 158.75 s gammaloop-nextest-integration> [2026-08-27 10:10:38.028] @gammaloop_api::se... INFO : Running command set process -p se1l -i se1l_mur_shifted kv general.mu_r=0.8
  358. 158.75 s gammaloop-nextest-integration> [2026-08-27 10:10:38.033] @process::amplitude WARNING : External state 0 ('g', PDG 21, helicity +) is off shell: p^2 = +2.5e5, expected m^2 = +0e0 (|Δ| = +2.5e5). Fixed-helicity spinor/vector/tensor external states may be ill-defined at this kinematic point.
  359. 158.75 s gammaloop-nextest-integration> field value
  360. 158.75 s gammaloop-nextest-integration> span warm_up{integrand.name=se1l}
  361. 158.75 s gammaloop-nextest-integration> [2026-08-27 10:10:38.033] @process::amplitude WARNING : External state 1 ('g', PDG 21, helicity -) is off shell: p^2 = +2.5e5, expected m^2 = +0e0 (|Δ| = +2.5e5). Fixed-helicity spinor/vector/tensor external states may be ill-defined at this kinematic point.
  362. 158.75 s gammaloop-nextest-integration> field value
  363. 158.75 s gammaloop-nextest-integration> span warm_up{integrand.name=se1l}
  364. 158.75 s gammaloop-nextest-integration> [2026-08-27 10:10:38.033] @process::amplitude INFO : Input is above threshold: 1 existing threshold E-surfaces across 1/1 graph groups
  365. 158.75 s gammaloop-nextest-integration> field value
  366. 158.75 s gammaloop-nextest-integration> existing_esurfaces 1
  367. 158.75 s gammaloop-nextest-integration> group_count 1
  368. 158.75 s gammaloop-nextest-integration> groups_above_threshold 1
  369. 158.75 s gammaloop-nextest-integration> integrand se1l
  370. 158.75 s gammaloop-nextest-integration> span warm_up{integrand.name=se1l}
  371. 158.75 s gammaloop-nextest-integration> threshold_status above threshold
  372. 158.75 s gammaloop-nextest-integration> [2026-08-27 10:10:38.033] @process::amplitude INFO : overlap structure of group 0: [1: [0(2,3)]]
  373. 158.75 s gammaloop-nextest-integration> field value
  374. 158.75 s gammaloop-nextest-integration> span warm_up{integrand.name=se1l}
  375. 158.75 s gammaloop-nextest-integration> [2026-08-27 10:10:38.372] @commands::profile INFO :
  376. 158.75 s gammaloop-nextest-integration> ╭───────┬──────┬──────────┬───────┬─────┬──────────┬───────────╮
  377. 158.75 s gammaloop-nextest-integration> │ fixed │ → ∞ │ slope │ r2 │ DOD │ bare DOD │ inspect │
  378. 158.75 s gammaloop-nextest-integration> ├───────┼──────┼──────────┼───────┼─────┼──────────┼───────────┤
  379. 158.75 s gammaloop-nextest-integration> │ {} │ {e3} │ 1.639236 │ 0.904 │ 2 │ 2 │ arb retry │
  380. 158.75 s gammaloop-nextest-integration> │ {} │ {e2} │ 1.698834 │ 0.902 │ 2 │ 2 │ arb retry │
  381. 158.75 s gammaloop-nextest-integration> ╰───────┴──────┴──────────┴───────┴─────┴──────────┴───────────╯
  382. 158.75 s gammaloop-nextest-integration> [2026-08-27 10:10:38.372] @commands::profile INFO :
  383. 158.75 s gammaloop-nextest-integration> ╭───────┬──────┬─────────────┬──────────┬───────┬─────┬──────────┬───────────╮
  384. 158.75 s gammaloop-nextest-integration> │ fixed │ → ∞ │ orientation │ slope │ r2 │ DOD │ bare DOD │ inspect │
  385. 158.75 s gammaloop-nextest-integration> ├───────┼──────┼─────────────┼──────────┼───────┼─────┼──────────┼───────────┤
  386. 158.75 s gammaloop-nextest-integration> │ {} │ {e3} │ 00-+ │ 0.343429 │ 0.145 │ 0 │ 2 │ arb retry │
  387. 158.75 s gammaloop-nextest-integration> │ {} │ {e3} │ 00+- │ 0.342577 │ 0.135 │ 0 │ 2 │ arb retry │
  388. 158.75 s gammaloop-nextest-integration> │ {} │ {e2} │ 00-+ │ 0.385975 │ 0.161 │ 0 │ 2 │ arb retry │
  389. 158.75 s gammaloop-nextest-integration> │ {} │ {e2} │ 00+- │ 0.384920 │ 0.192 │ 0 │ 2 │ arb retry │
  390. 158.75 s gammaloop-nextest-integration> ╰───────┴──────┴─────────────┴──────────┴───────┴─────┴──────────┴───────────╯
  391. 158.75 s gammaloop-nextest-integration> [2026-08-27 10:10:38.373] @gammaloop_api::se... INFO : Running command set process kv integrator.target_relative_accuracy=0.001 integrator.n_increase=0 integrator.n_start=50000 integrator.n_max=400000 integrator.seed=1337
  392. 158.75 s gammaloop-nextest-integration> [2026-08-27 10:10:38.374] @commands::integrate INFO : Created workspace directory at /build/source/tests/artifacts/se1l/integration_workspace_se1l
  393. 158.75 s gammaloop-nextest-integration> [2026-08-27 10:10:38.472] @commands::integrate INFO : No integration state found, starting new integration
  394. 158.75 s gammaloop-nextest-integration> [2026-08-27 10:10:38.473] @commands::integrate INFO : Gammaloop now integrates se1l@se1l, se1l@se1l_muv_shifted, se1l@se1l_rls_shifted
  395. 158.75 s gammaloop-nextest-integration> [2026-08-27 10:10:38.474] @process::amplitude WARNING : External state 0 ('g', PDG 21, helicity +) is off shell: p^2 = +2.5e5, expected m^2 = +0e0 (|Δ| = +2.5e5). Fixed-helicity spinor/vector/tensor external states may be ill-defined at this kinematic point.
  396. 158.75 s gammaloop-nextest-integration> field value
  397. 158.75 s gammaloop-nextest-integration> span warm_up{integrand.name=se1l}
  398. 158.75 s gammaloop-nextest-integration> [2026-08-27 10:10:38.474] @process::amplitude WARNING : External state 1 ('g', PDG 21, helicity -) is off shell: p^2 = +2.5e5, expected m^2 = +0e0 (|Δ| = +2.5e5). Fixed-helicity spinor/vector/tensor external states may be ill-defined at this kinematic point.
  399. 158.75 s gammaloop-nextest-integration> field value
  400. 158.75 s gammaloop-nextest-integration> span warm_up{integrand.name=se1l}
  401. 158.75 s gammaloop-nextest-integration> [2026-08-27 10:10:38.476] @process::amplitude INFO : Input is above threshold: 1 existing threshold E-surfaces across 1/1 graph groups
  402. 158.75 s gammaloop-nextest-integration> field value
  403. 158.75 s gammaloop-nextest-integration> existing_esurfaces 1
  404. 158.75 s gammaloop-nextest-integration> group_count 1
  405. 158.75 s gammaloop-nextest-integration> groups_above_threshold 1
  406. 158.75 s gammaloop-nextest-integration> integrand se1l
  407. 158.75 s gammaloop-nextest-integration> span warm_up{integrand.name=se1l}
  408. 158.75 s gammaloop-nextest-integration> threshold_status above threshold
  409. 158.75 s gammaloop-nextest-integration> [2026-08-27 10:10:38.476] @process::amplitude INFO : overlap structure of group 0: [1: [0(2,3)]]
  410. 158.75 s gammaloop-nextest-integration> field value
  411. 158.75 s gammaloop-nextest-integration> span warm_up{integrand.name=se1l}
  412. 158.75 s gammaloop-nextest-integration> [2026-08-27 10:10:38.477] @process::amplitude WARNING : External state 0 ('g', PDG 21, helicity +) is off shell: p^2 = +2.5e5, expected m^2 = +0e0 (|Δ| = +2.5e5). Fixed-helicity spinor/vector/tensor external states may be ill-defined at this kinematic point.
  413. 158.75 s gammaloop-nextest-integration> field value
  414. 158.75 s gammaloop-nextest-integration> span warm_up{integrand.name=se1l_muv_shifted}
  415. 158.75 s gammaloop-nextest-integration> [2026-08-27 10:10:38.477] @process::amplitude WARNING : External state 1 ('g', PDG 21, helicity -) is off shell: p^2 = +2.5e5, expected m^2 = +0e0 (|Δ| = +2.5e5). Fixed-helicity spinor/vector/tensor external states may be ill-defined at this kinematic point.
  416. 158.75 s gammaloop-nextest-integration> field value
  417. 158.75 s gammaloop-nextest-integration> span warm_up{integrand.name=se1l_muv_shifted}
  418. 158.75 s gammaloop-nextest-integration> [2026-08-27 10:10:38.478] @process::amplitude INFO : Input is above threshold: 1 existing threshold E-surfaces across 1/1 graph groups
  419. 158.75 s gammaloop-nextest-integration> field value
  420. 158.75 s gammaloop-nextest-integration> existing_esurfaces 1
  421. 158.75 s gammaloop-nextest-integration> group_count 1
  422. 158.75 s gammaloop-nextest-integration> groups_above_threshold 1
  423. 158.75 s gammaloop-nextest-integration> integrand se1l_muv_shifted
  424. 158.75 s gammaloop-nextest-integration> span warm_up{integrand.name=se1l_muv_shifted}
  425. 158.75 s gammaloop-nextest-integration> threshold_status above threshold
  426. 158.75 s gammaloop-nextest-integration> [2026-08-27 10:10:38.478] @process::amplitude INFO : overlap structure of group 0: [1: [0(2,3)]]
  427. 158.75 s gammaloop-nextest-integration> field value
  428. 158.75 s gammaloop-nextest-integration> span warm_up{integrand.name=se1l_muv_shifted}
  429. 158.75 s gammaloop-nextest-integration> [2026-08-27 10:10:38.479] @process::amplitude WARNING : External state 0 ('g', PDG 21, helicity +) is off shell: p^2 = +2.5e5, expected m^2 = +0e0 (|Δ| = +2.5e5). Fixed-helicity spinor/vector/tensor external states may be ill-defined at this kinematic point.
  430. 158.75 s gammaloop-nextest-integration> field value
  431. 158.75 s gammaloop-nextest-integration> span warm_up{integrand.name=se1l_rls_shifted}
  432. 158.75 s gammaloop-nextest-integration> [2026-08-27 10:10:38.479] @process::amplitude WARNING : External state 1 ('g', PDG 21, helicity -) is off shell: p^2 = +2.5e5, expected m^2 = +0e0 (|Δ| = +2.5e5). Fixed-helicity spinor/vector/tensor external states may be ill-defined at this kinematic point.
  433. 158.75 s gammaloop-nextest-integration> field value
  434. 158.75 s gammaloop-nextest-integration> span warm_up{integrand.name=se1l_rls_shifted}
  435. 158.75 s gammaloop-nextest-integration> [2026-08-27 10:10:38.479] @process::amplitude INFO : Input is above threshold: 1 existing threshold E-surfaces across 1/1 graph groups
  436. 158.75 s gammaloop-nextest-integration> field value
  437. 158.75 s gammaloop-nextest-integration> existing_esurfaces 1
  438. 158.75 s gammaloop-nextest-integration> group_count 1
  439. 158.75 s gammaloop-nextest-integration> groups_above_threshold 1
  440. 158.75 s gammaloop-nextest-integration> integrand se1l_rls_shifted
  441. 158.75 s gammaloop-nextest-integration> span warm_up{integrand.name=se1l_rls_shifted}
  442. 158.75 s gammaloop-nextest-integration> threshold_status above threshold
  443. 158.75 s gammaloop-nextest-integration> ... omitted 1410 more lines; see full nextest output above
  444. 158.75 s gammaloop-nextest-integration> =========================================
  445. 158.75 s error: Cannot build '/nix/store/8h9hx82zgi6sfhhm31fs0s7q4qa225j3-gammaloop-nextest-integration.drv'.
  446. 158.75 s Reason: builder failed with exit code 100.
  447. 158.75 s Output paths:
  448. 158.75 s /nix/store/ysdxdji6v6hcl8m5v9j2vlz012z5wc1w-gammaloop-nextest-integration
  449. 158.75 s Last 2048 log lines:
  450. 158.75 s > span warm_up{integrand.name=se1l_muv_shifted}
  451. 158.75 s > threshold_status above threshold
  452. 158.75 s > [2026-08-27 10:12:35.508] @process::amplitude INFO : overlap structure of group 0: [1: [0(2,3)]]
  453. 158.75 s > field value
  454. 158.75 s > span warm_up{integrand.name=se1l_muv_shifted}
  455. 158.75 s > [2026-08-27 10:12:35.513] @process::amplitude WARNING : External state 0 ('g', PDG 21, helicity +) is off shell: p^2 = +2.5e5, expected m^2 = +0e0 (|Δ| = +2.5e5). Fixed-helicity spinor/vector/tensor external states may be ill-defined at this kinematic point.
  456. 158.75 s > field value
  457. 158.75 s > span warm_up{integrand.name=se1l}
  458. 158.75 s > [2026-08-27 10:12:35.513] @process::amplitude WARNING : External state 1 ('g', PDG 21, helicity -) is off shell: p^2 = +2.5e5, expected m^2 = +0e0 (|Δ| = +2.5e5). Fixed-helicity spinor/vector/tensor external states may be ill-defined at this kinematic point.
  459. 158.75 s > field value
  460. 158.75 s > span warm_up{integrand.name=se1l}
  461. 158.75 s > [2026-08-27 10:12:35.513] @process::amplitude INFO : Input is above threshold: 1 existing threshold E-surfaces across 1/1 graph groups
  462. 158.75 s > field value
  463. 158.75 s > existing_esurfaces 1
  464. 158.75 s > group_count 1
  465. 158.75 s > groups_above_threshold 1
  466. 158.75 s > integrand se1l
  467. 158.75 s > span warm_up{integrand.name=se1l}
  468. 158.75 s > threshold_status above threshold
  469. 158.75 s > [2026-08-27 10:12:35.513] @process::amplitude INFO : overlap structure of group 0: [1: [0(2,3)]]
  470. 158.75 s > field value
  471. 158.75 s > span warm_up{integrand.name=se1l}
  472. 158.75 s > [2026-08-27 10:12:35.517] @process::amplitude WARNING : External state 0 ('g', PDG 21, helicity +) is off shell: p^2 = +2.5e5, expected m^2 = +0e0 (|Δ| = +2.5e5). Fixed-helicity spinor/vector/tensor external states may be ill-defined at this kinematic point.
  473. 158.75 s > field value
  474. 158.75 s > span warm_up{integrand.name=se1l_muv_shifted}
  475. 158.75 s > [2026-08-27 10:12:35.517] @process::amplitude WARNING : External state 1 ('g', PDG 21, helicity -) is off shell: p^2 = +2.5e5, expected m^2 = +0e0 (|Δ| = +2.5e5). Fixed-helicity spinor/vector/tensor external states may be ill-defined at this kinematic point.
  476. 158.75 s > field value
  477. 158.75 s > span warm_up{integrand.name=se1l_muv_shifted}
  478. 158.75 s > [2026-08-27 10:12:35.517] @process::amplitude INFO : Input is above threshold: 1 existing threshold E-surfaces across 1/1 graph groups
  479. 158.75 s > field value
  480. 158.75 s > existing_esurfaces 1
  481. 158.75 s > group_count 1
  482. 158.75 s > groups_above_threshold 1
  483. 158.75 s > integrand se1l_muv_shifted
  484. 158.75 s > span warm_up{integrand.name=se1l_muv_shifted}
  485. 158.75 s > threshold_status above threshold
  486. 158.75 s > [2026-08-27 10:12:35.517] @process::amplitude INFO : overlap structure of group 0: [1: [0(2,3)]]
  487. 158.75 s > field value
  488. 158.75 s > span warm_up{integrand.name=se1l_muv_shifted}
  489. 158.75 s > [2026-08-27 10:12:35.521] @process::amplitude WARNING : External state 0 ('g', PDG 21, helicity +) is off shell: p^2 = +2.5e5, expected m^2 = +0e0 (|Δ| = +2.5e5). Fixed-helicity spinor/vector/tensor external states may be ill-defined at this kinematic point.
  490. 158.75 s > field value
  491. 158.75 s > span warm_up{integrand.name=se1l}
  492. 158.75 s > [2026-08-27 10:12:35.521] @process::amplitude WARNING : External state 1 ('g', PDG 21, helicity -) is off shell: p^2 = +2.5e5, expected m^2 = +0e0 (|Δ| = +2.5e5). Fixed-helicity spinor/vector/tensor external states may be ill-defined at this kinematic point.
  493. 158.75 s > field value
  494. 158.75 s > span warm_up{integrand.name=se1l}
  495. 158.75 s > [2026-08-27 10:12:35.522] @process::amplitude INFO : Input is above threshold: 1 existing threshold E-surfaces across 1/1 graph groups
  496. 158.75 s > field value
  497. 158.75 s > existing_esurfaces 1
  498. 158.75 s > group_count 1
  499. 158.75 s > groups_above_threshold 1
  500. 158.75 s > integrand se1l
  501. 158.75 s > span warm_up{integrand.name=se1l}
  502. 158.75 s > threshold_status above threshold
  503. 158.75 s > [2026-08-27 10:12:35.522] @process::amplitude INFO : overlap structure of group 0: [1: [0(2,3)]]
  504. 158.75 s > field value
  505. 158.75 s > span warm_up{integrand.name=se1l}
  506. 158.75 s > [2026-08-27 10:12:35.526] @process::amplitude WARNING : External state 0 ('g', PDG 21, helicity +) is off shell: p^2 = +2.5e5, expected m^2 = +0e0 (|Δ| = +2.5e5). Fixed-helicity spinor/vector/tensor external states may be ill-defined at this kinematic point.
  507. 158.75 s > field value
  508. 158.75 s > span warm_up{integrand.name=se1l_muv_shifted}
  509. 158.75 s > [2026-08-27 10:12:35.526] @process::amplitude WARNING : External state 1 ('g', PDG 21, helicity -) is off shell: p^2 = +2.5e5, expected m^2 = +0e0 (|Δ| = +2.5e5). Fixed-helicity spinor/vector/tensor external states may be ill-defined at this kinematic point.
  510. 158.75 s > field value
  511. 158.75 s > span warm_up{integrand.name=se1l_muv_shifted}
  512. 158.75 s > [2026-08-27 10:12:35.526] @process::amplitude INFO : Input is above threshold: 1 existing threshold E-surfaces across 1/1 graph groups
  513. 158.75 s > field value
  514. 158.75 s > existing_esurfaces 1
  515. 158.75 s > group_count 1
  516. 158.75 s > groups_above_threshold 1
  517. 158.75 s > integrand se1l_muv_shifted
  518. 158.75 s > span warm_up{integrand.name=se1l_muv_shifted}
  519. 158.75 s > threshold_status above threshold
  520. 158.75 s > [2026-08-27 10:12:35.526] @process::amplitude INFO : overlap structure of group 0: [1: [0(2,3)]]
  521. 158.75 s > field value
  522. 158.75 s > span warm_up{integrand.name=se1l_muv_shifted}
  523. 158.75 s > [2026-08-27 10:12:35.530] @process::amplitude WARNING : External state 0 ('g', PDG 21, helicity +) is off shell: p^2 = +2.5e5, expected m^2 = +0e0 (|Δ| = +2.5e5). Fixed-helicity spinor/vector/tensor external states may be ill-defined at this kinematic point.
  524. 158.75 s > field value
  525. 158.75 s > span warm_up{integrand.name=se1l}
  526. 158.75 s > [2026-08-27 10:12:35.530] @process::amplitude WARNING : External state 1 ('g', PDG 21, helicity -) is off shell: p^2 = +2.5e5, expected m^2 = +0e0 (|Δ| = +2.5e5). Fixed-helicity spinor/vector/tensor external states may be ill-defined at this kinematic point.
  527. 158.75 s > field value
  528. 158.75 s > span warm_up{integrand.name=se1l}
  529. 158.75 s > [2026-08-27 10:12:35.530] @process::amplitude INFO : Input is above threshold: 1 existing threshold E-surfaces across 1/1 graph groups
  530. 158.75 s > field value
  531. 158.75 s > existing_esurfaces 1
  532. 158.75 s > group_count 1
  533. 158.75 s > groups_above_threshold 1
  534. 158.75 s > integrand se1l
  535. 158.75 s > span warm_up{integrand.name=se1l}
  536. 158.75 s > threshold_status above threshold
  537. 158.75 s > [2026-08-27 10:12:35.530] @process::amplitude INFO : overlap structure of group 0: [1: [0(2,3)]]
  538. 158.75 s > field value
  539. 158.75 s > span warm_up{integrand.name=se1l}
  540. 158.75 s > [2026-08-27 10:12:35.534] @process::amplitude WARNING : External state 0 ('g', PDG 21, helicity +) is off shell: p^2 = +2.5e5, expected m^2 = +0e0 (|Δ| = +2.5e5). Fixed-helicity spinor/vector/tensor external states may be ill-defined at this kinematic point.
  541. 158.75 s > field value
  542. 158.75 s > span warm_up{integrand.name=se1l_muv_shifted}
  543. 158.75 s > [2026-08-27 10:12:35.535] @process::amplitude WARNING : External state 1 ('g', PDG 21, helicity -) is off shell: p^2 = +2.5e5, expected m^2 = +0e0 (|Δ| = +2.5e5). Fixed-helicity spinor/vector/tensor external states may be ill-defined at this kinematic point.
  544. 158.75 s > field value
  545. 158.75 s > span warm_up{integrand.name=se1l_muv_shifted}
  546. 158.75 s > [2026-08-27 10:12:35.535] @process::amplitude INFO : Input is above threshold: 1 existing threshold E-surfaces across 1/1 graph groups
  547. 158.75 s > field value
  548. 158.75 s > existing_esurfaces 1
  549. 158.75 s > group_count 1
  550. 158.75 s > groups_above_threshold 1
  551. 158.75 s > integrand se1l_muv_shifted
  552. 158.75 s > span warm_up{integrand.name=se1l_muv_shifted}
  553. 158.75 s > threshold_status above threshold
  554. 158.75 s > [2026-08-27 10:12:35.535] @process::amplitude INFO : overlap structure of group 0: [1: [0(2,3)]]
  555. 158.75 s > field value
  556. 158.75 s > span warm_up{integrand.name=se1l_muv_shifted}
  557. 158.75 s > [2026-08-27 10:12:35.539] @process::amplitude WARNING : External state 0 ('g', PDG 21, helicity +) is off shell: p^2 = +2.5e5, expected m^2 = +0e0 (|Δ| = +2.5e5). Fixed-helicity spinor/vector/tensor external states may be ill-defined at this kinematic point.
  558. 158.75 s > field value
  559. 158.75 s > span warm_up{integrand.name=se1l}
  560. 158.75 s > [2026-08-27 10:12:35.539] @process::amplitude WARNING : External state 1 ('g', PDG 21, helicity -) is off shell: p^2 = +2.5e5, expected m^2 = +0e0 (|Δ| = +2.5e5). Fixed-helicity spinor/vector/tensor external states may be ill-defined at this kinematic point.
  561. 158.75 s > field value
  562. 158.75 s > span warm_up{integrand.name=se1l}
  563. 158.75 s > [2026-08-27 10:12:35.539] @process::amplitude INFO : Input is above threshold: 1 existing threshold E-surfaces across 1/1 graph groups
  564. 158.75 s > field value
  565. 158.75 s > existing_esurfaces 1
  566. 158.75 s > group_count 1
  567. 158.75 s > groups_above_threshold 1
  568. 158.75 s > integrand se1l
  569. 158.75 s > span warm_up{integrand.name=se1l}
  570. 158.75 s > threshold_status above threshold
  571. 158.75 s > [2026-08-27 10:12:35.539] @process::amplitude INFO : overlap structure of group 0: [1: [0(2,3)]]
  572. 158.75 s > field value
  573. 158.75 s > span warm_up{integrand.name=se1l}
  574. 158.75 s > [2026-08-27 10:12:35.543] @process::amplitude WARNING : External state 0 ('g', PDG 21, helicity +) is off shell: p^2 = +2.5e5, expected m^2 = +0e0 (|Δ| = +2.5e5). Fixed-helicity spinor/vector/tensor external states may be ill-defined at this kinematic point.
  575. 158.75 s > field value
  576. 158.75 s > span warm_up{integrand.name=se1l_rls_shifted}
  577. 158.75 s > [2026-08-27 10:12:35.543] @process::amplitude WARNING : External state 1 ('g', PDG 21, helicity -) is off shell: p^2 = +2.5e5, expected m^2 = +0e0 (|Δ| = +2.5e5). Fixed-helicity spinor/vector/tensor external states may be ill-defined at this kinematic point.
  578. 158.75 s > field value
  579. 158.75 s > span warm_up{integrand.name=se1l_rls_shifted}
  580. 158.75 s > [2026-08-27 10:12:35.543] @process::amplitude INFO : Input is above threshold: 1 existing threshold E-surfaces across 1/1 graph groups
  581. 158.75 s > field value
  582. 158.75 s > existing_esurfaces 1
  583. 158.75 s > group_count 1
  584. 158.75 s > groups_above_threshold 1
  585. 158.75 s > integrand se1l_rls_shifted
  586. 158.75 s > span warm_up{integrand.name=se1l_rls_shifted}
  587. 158.75 s > threshold_status above threshold
  588. 158.75 s > [2026-08-27 10:12:35.543] @process::amplitude INFO : overlap structure of group 0: [1: [0(2,3)]]
  589. 158.75 s > field value
  590. 158.75 s > span warm_up{integrand.name=se1l_rls_shifted}
  591. 158.75 s > [2026-08-27 10:12:35.547] @process::amplitude WARNING : External state 0 ('g', PDG 21, helicity +) is off shell: p^2 = +2.5e5, expected m^2 = +0e0 (|Δ| = +2.5e5). Fixed-helicity spinor/vector/tensor external states may be ill-defined at this kinematic point.
  592. 158.75 s > field value
  593. 158.75 s > span warm_up{integrand.name=se1l}
  594. 158.75 s > [2026-08-27 10:12:35.547] @process::amplitude WARNING : External state 1 ('g', PDG 21, helicity -) is off shell: p^2 = +2.5e5, expected m^2 = +0e0 (|Δ| = +2.5e5). Fixed-helicity spinor/vector/tensor external states may be ill-defined at this kinematic point.
  595. 158.75 s > field value
  596. 158.75 s > span warm_up{integrand.name=se1l}
  597. 158.75 s > [2026-08-27 10:12:35.548] @process::amplitude INFO : Input is above threshold: 1 existing threshold E-surfaces across 1/1 graph groups
  598. 158.75 s > field value
  599. 158.75 s > existing_esurfaces 1
  600. 158.75 s > group_count 1
  601. 158.75 s > groups_above_threshold 1
  602. 158.75 s > integrand se1l
  603. 158.75 s > span warm_up{integrand.name=se1l}
  604. 158.75 s > threshold_status above threshold
  605. 158.75 s > [2026-08-27 10:12:35.548] @process::amplitude INFO : overlap structure of group 0: [1: [0(2,3)]]
  606. 158.75 s > field value
  607. 158.75 s > span warm_up{integrand.name=se1l}
  608. 158.75 s > [2026-08-27 10:12:35.552] @process::amplitude WARNING : External state 0 ('g', PDG 21, helicity +) is off shell: p^2 = +2.5e5, expected m^2 = +0e0 (|Δ| = +2.5e5). Fixed-helicity spinor/vector/tensor external states may be ill-defined at this kinematic point.
  609. 158.75 s > field value
  610. 158.75 s > span warm_up{integrand.name=se1l_rls_shifted}
  611. 158.75 s > [2026-08-27 10:12:35.552] @process::amplitude WARNING : External state 1 ('g', PDG 21, helicity -) is off shell: p^2 = +2.5e5, expected m^2 = +0e0 (|Δ| = +2.5e5). Fixed-helicity spinor/vector/tensor external states may be ill-defined at this kinematic point.
  612. 158.75 s > field value
  613. 158.75 s > span warm_up{integrand.name=se1l_rls_shifted}
  614. 158.75 s > [2026-08-27 10:12:35.552] @process::amplitude INFO : Input is above threshold: 1 existing threshold E-surfaces across 1/1 graph groups
  615. 158.75 s > field value
  616. 158.75 s > existing_esurfaces 1
  617. 158.75 s > group_count 1
  618. 158.75 s > groups_above_threshold 1
  619. 158.75 s > integrand se1l_rls_shifted
  620. 158.75 s > span warm_up{integrand.name=se1l_rls_shifted}
  621. 158.75 s > threshold_status above threshold
  622. 158.75 s > [2026-08-27 10:12:35.552] @process::amplitude INFO : overlap structure of group 0: [1: [0(2,3)]]
  623. 158.75 s > field value
  624. 158.75 s > span warm_up{integrand.name=se1l_rls_shifted}
  625. 158.75 s > [2026-08-27 10:12:35.556] @process::amplitude WARNING : External state 0 ('g', PDG 21, helicity +) is off shell: p^2 = +2.5e5, expected m^2 = +0e0 (|Δ| = +2.5e5). Fixed-helicity spinor/vector/tensor external states may be ill-defined at this kinematic point.
  626. 158.75 s > field value
  627. 158.75 s > span warm_up{integrand.name=se1l}
  628. 158.75 s > [2026-08-27 10:12:35.556] @process::amplitude WARNING : External state 1 ('g', PDG 21, helicity -) is off shell: p^2 = +2.5e5, expected m^2 = +0e0 (|Δ| = +2.5e5). Fixed-helicity spinor/vector/tensor external states may be ill-defined at this kinematic point.
  629. 158.75 s > field value
  630. 158.75 s > span warm_up{integrand.name=se1l}
  631. 158.75 s > [2026-08-27 10:12:35.556] @process::amplitude INFO : Input is above threshold: 1 existing threshold E-surfaces across 1/1 graph groups
  632. 158.75 s > field value
  633. 158.75 s > existing_esurfaces 1
  634. 158.75 s > group_count 1
  635. 158.75 s > groups_above_threshold 1
  636. 158.75 s > integrand se1l
  637. 158.75 s > span warm_up{integrand.name=se1l}
  638. 158.75 s > threshold_status above threshold
  639. 158.75 s > [2026-08-27 10:12:35.556] @process::amplitude INFO : overlap structure of group 0: [1: [0(2,3)]]
  640. 158.75 s > field value
  641. 158.75 s > span warm_up{integrand.name=se1l}
  642. 158.75 s > [2026-08-27 10:12:35.560] @process::amplitude WARNING : External state 0 ('g', PDG 21, helicity +) is off shell: p^2 = +2.5e5, expected m^2 = +0e0 (|Δ| = +2.5e5). Fixed-helicity spinor/vector/tensor external states may be ill-defined at this kinematic point.
  643. 158.75 s > field value
  644. 158.75 s > span warm_up{integrand.name=se1l_rls_shifted}
  645. 158.75 s > [2026-08-27 10:12:35.560] @process::amplitude WARNING : External state 1 ('g', PDG 21, helicity -) is off shell: p^2 = +2.5e5, expected m^2 = +0e0 (|Δ| = +2.5e5). Fixed-helicity spinor/vector/tensor external states may be ill-defined at this kinematic point.
  646. 158.75 s > field value
  647. 158.75 s > span warm_up{integrand.name=se1l_rls_shifted}
  648. 158.75 s > [2026-08-27 10:12:35.561] @process::amplitude INFO : Input is above threshold: 1 existing threshold E-surfaces across 1/1 graph groups
  649. 158.75 s > field value
  650. 158.75 s > existing_esurfaces 1
  651. 158.75 s > group_count 1
  652. 158.75 s > groups_above_threshold 1
  653. 158.75 s > integrand se1l_rls_shifted
  654. 158.75 s > span warm_up{integrand.name=se1l_rls_shifted}
  655. 158.75 s > threshold_status above threshold
  656. 158.75 s > [2026-08-27 10:12:35.561] @process::amplitude INFO : overlap structure of group 0: [1: [0(2,3)]]
  657. 158.75 s > field value
  658. 158.75 s > span warm_up{integrand.name=se1l_rls_shifted}
  659. 158.75 s > [2026-08-27 10:12:35.565] @process::amplitude WARNING : External state 0 ('g', PDG 21, helicity +) is off shell: p^2 = +2.5e5, expected m^2 = +0e0 (|Δ| = +2.5e5). Fixed-helicity spinor/vector/tensor external states may be ill-defined at this kinematic point.
  660. 158.75 s > field value
  661. 158.75 s > span warm_up{integrand.name=se1l}
  662. 158.75 s > [2026-08-27 10:12:35.565] @process::amplitude WARNING : External state 1 ('g', PDG 21, helicity -) is off shell: p^2 = +2.5e5, expected m^2 = +0e0 (|Δ| = +2.5e5). Fixed-helicity spinor/vector/tensor external states may be ill-defined at this kinematic point.
  663. 158.75 s > field value
  664. 158.75 s > span warm_up{integrand.name=se1l}
  665. 158.75 s > [2026-08-27 10:12:35.565] @process::amplitude INFO : Input is above threshold: 1 existing threshold E-surfaces across 1/1 graph groups
  666. 158.75 s > field value
  667. 158.75 s > existing_esurfaces 1
  668. 158.75 s > group_count 1
  669. 158.75 s > groups_above_threshold 1
  670. 158.75 s > integrand se1l
  671. 158.75 s > span warm_up{integrand.name=se1l}
  672. 158.75 s > threshold_status above threshold
  673. 158.75 s > [2026-08-27 10:12:35.565] @process::amplitude INFO : overlap structure of group 0: [1: [0(2,3)]]
  674. 158.75 s > field value
  675. 158.75 s > span warm_up{integrand.name=se1l}
  676. 158.75 s > [2026-08-27 10:12:35.569] @process::amplitude WARNING : External state 0 ('g', PDG 21, helicity +) is off shell: p^2 = +2.5e5, expected m^2 = +0e0 (|Δ| = +2.5e5). Fixed-helicity spinor/vector/tensor external states may be ill-defined at this kinematic point.
  677. 158.75 s > field value
  678. 158.75 s > span warm_up{integrand.name=se1l_rls_shifted}
  679. 158.75 s > [2026-08-27 10:12:35.569] @process::amplitude WARNING : External state 1 ('g', PDG 21, helicity -) is off shell: p^2 = +2.5e5, expected m^2 = +0e0 (|Δ| = +2.5e5). Fixed-helicity spinor/vector/tensor external states may be ill-defined at this kinematic point.
  680. 158.75 s > field value
  681. 158.75 s > span warm_up{integrand.name=se1l_rls_shifted}
  682. 158.75 s > [2026-08-27 10:12:35.569] @process::amplitude INFO : Input is above threshold: 1 existing threshold E-surfaces across 1/1 graph groups
  683. 158.75 s > field value
  684. 158.75 s > existing_esurfaces 1
  685. 158.75 s > group_count 1
  686. 158.75 s > groups_above_threshold 1
  687. 158.75 s > integrand se1l_rls_shifted
  688. 158.75 s > span warm_up{integrand.name=se1l_rls_shifted}
  689. 158.75 s > threshold_status above threshold
  690. 158.75 s > [2026-08-27 10:12:35.569] @process::amplitude INFO : overlap structure of group 0: [1: [0(2,3)]]
  691. 158.75 s > field value
  692. 158.75 s > span warm_up{integrand.name=se1l_rls_shifted}
  693. 158.75 s > [2026-08-27 10:12:35.573] @process::amplitude WARNING : External state 0 ('g', PDG 21, helicity +) is off shell: p^2 = +2.5e5, expected m^2 = +0e0 (|Δ| = +2.5e5). Fixed-helicity spinor/vector/tensor external states may be ill-defined at this kinematic point.
  694. 158.75 s > field value
  695. 158.75 s > span warm_up{integrand.name=se1l}
  696. 158.75 s > [2026-08-27 10:12:35.573] @process::amplitude WARNING : External state 1 ('g', PDG 21, helicity -) is off shell: p^2 = +2.5e5, expected m^2 = +0e0 (|Δ| = +2.5e5). Fixed-helicity spinor/vector/tensor external states may be ill-defined at this kinematic point.
  697. 158.75 s > field value
  698. 158.75 s > span warm_up{integrand.name=se1l}
  699. 158.75 s > [2026-08-27 10:12:35.573] @process::amplitude INFO : Input is above threshold: 1 existing threshold E-surfaces across 1/1 graph groups
  700. 158.75 s > field value
  701. 158.75 s > existing_esurfaces 1
  702. 158.75 s > group_count 1
  703. 158.75 s > groups_above_threshold 1
  704. 158.75 s > integrand se1l
  705. 158.75 s > span warm_up{integrand.name=se1l}
  706. 158.75 s > threshold_status above threshold
  707. 158.75 s > [2026-08-27 10:12:35.573] @process::amplitude INFO : overlap structure of group 0: [1: [0(2,3)]]
  708. 158.75 s > field value
  709. 158.75 s > span warm_up{integrand.name=se1l}
  710. 158.75 s > [2026-08-27 10:12:35.577] @process::amplitude WARNING : External state 0 ('g', PDG 21, helicity +) is off shell: p^2 = +2.5e5, expected m^2 = +0e0 (|Δ| = +2.5e5). Fixed-helicity spinor/vector/tensor external states may be ill-defined at this kinematic point.
  711. 158.75 s > field value
  712. 158.75 s > span warm_up{integrand.name=se1l_rls_shifted}
  713. 158.75 s > [2026-08-27 10:12:35.577] @process::amplitude WARNING : External state 1 ('g', PDG 21, helicity -) is off shell: p^2 = +2.5e5, expected m^2 = +0e0 (|Δ| = +2.5e5). Fixed-helicity spinor/vector/tensor external states may be ill-defined at this kinematic point.
  714. 158.75 s > field value
  715. 158.75 s > span warm_up{integrand.name=se1l_rls_shifted}
  716. 158.75 s > [2026-08-27 10:12:35.577] @process::amplitude INFO : Input is above threshold: 1 existing threshold E-surfaces across 1/1 graph groups
  717. 158.75 s > field value
  718. 158.75 s > existing_esurfaces 1
  719. 158.75 s > group_count 1
  720. 158.75 s > groups_above_threshold 1
  721. 158.75 s > integrand se1l_rls_shifted
  722. 158.75 s > span warm_up{integrand.name=se1l_rls_shifted}
  723. 158.75 s > threshold_status above threshold
  724. 158.75 s > [2026-08-27 10:12:35.577] @process::amplitude INFO : overlap structure of group 0: [1: [0(2,3)]]
  725. 158.75 s > field value
  726. 158.75 s > span warm_up{integrand.name=se1l_rls_shifted}
  727. 158.75 s > [2026-08-27 10:12:35.583] @process::amplitude WARNING : External state 0 ('g', PDG 21, helicity +) is off shell: p^2 = +2.5e5, expected m^2 = +0e0 (|Δ| = +2.5e5). Fixed-helicity spinor/vector/tensor external states may be ill-defined at this kinematic point.
  728. 158.75 s > field value
  729. 158.75 s > span warm_up{integrand.name=se1l}
  730. 158.75 s > [2026-08-27 10:12:35.583] @process::amplitude WARNING : External state 1 ('g', PDG 21, helicity -) is off shell: p^2 = +2.5e5, expected m^2 = +0e0 (|Δ| = +2.5e5). Fixed-helicity spinor/vector/tensor external states may be ill-defined at this kinematic point.
  731. 158.75 s > field value
  732. 158.75 s > span warm_up{integrand.name=se1l}
  733. 158.75 s > [2026-08-27 10:12:35.583] @process::amplitude INFO : Input is above threshold: 1 existing threshold E-surfaces across 1/1 graph groups
  734. 158.75 s > field value
  735. 158.75 s > existing_esurfaces 1
  736. 158.75 s > group_count 1
  737. 158.75 s > groups_above_threshold 1
  738. 158.75 s > integrand se1l
  739. 158.75 s > span warm_up{integrand.name=se1l}
  740. 158.75 s > threshold_status above threshold
  741. 158.75 s > [2026-08-27 10:12:35.583] @process::amplitude INFO : overlap structure of group 0: [1: [0(2,3)]]
  742. 158.75 s > field value
  743. 158.75 s > span warm_up{integrand.name=se1l}
  744. 158.75 s > [2026-08-27 10:12:35.587] @process::amplitude WARNING : External state 0 ('g', PDG 21, helicity +) is off shell: p^2 = +2.5e5, expected m^2 = +0e0 (|Δ| = +2.5e5). Fixed-helicity spinor/vector/tensor external states may be ill-defined at this kinematic point.
  745. 158.75 s > field value
  746. 158.75 s > span warm_up{integrand.name=se1l_rls_shifted}
  747. 158.75 s > [2026-08-27 10:12:35.588] @process::amplitude WARNING : External state 1 ('g', PDG 21, helicity -) is off shell: p^2 = +2.5e5, expected m^2 = +0e0 (|Δ| = +2.5e5). Fixed-helicity spinor/vector/tensor external states may be ill-defined at this kinematic point.
  748. 158.75 s > field value
  749. 158.75 s > span warm_up{integrand.name=se1l_rls_shifted}
  750. 158.75 s > [2026-08-27 10:12:35.588] @process::amplitude INFO : Input is above threshold: 1 existing threshold E-surfaces across 1/1 graph groups
  751. 158.75 s > field value
  752. 158.75 s > existing_esurfaces 1
  753. 158.75 s > group_count 1
  754. 158.75 s > groups_above_threshold 1
  755. 158.75 s > integrand se1l_rls_shifted
  756. 158.75 s > span warm_up{integrand.name=se1l_rls_shifted}
  757. 158.75 s > threshold_status above threshold
  758. 158.75 s > [2026-08-27 10:12:35.588] @process::amplitude INFO : overlap structure of group 0: [1: [0(2,3)]]
  759. 158.75 s > field value
  760. 158.75 s > span warm_up{integrand.name=se1l_rls_shifted}
  761. 158.75 s > [2026-08-27 10:12:35.592] @process::amplitude WARNING : External state 0 ('g', PDG 21, helicity +) is off shell: p^2 = +2.5e5, expected m^2 = +0e0 (|Δ| = +2.5e5). Fixed-helicity spinor/vector/tensor external states may be ill-defined at this kinematic point.
  762. 158.75 s > field value
  763. 158.75 s > span warm_up{integrand.name=se1l}
  764. 158.75 s > [2026-08-27 10:12:35.592] @process::amplitude WARNING : External state 1 ('g', PDG 21, helicity -) is off shell: p^2 = +2.5e5, expected m^2 = +0e0 (|Δ| = +2.5e5). Fixed-helicity spinor/vector/tensor external states may be ill-defined at this kinematic point.
  765. 158.75 s > field value
  766. 158.75 s > span warm_up{integrand.name=se1l}
  767. 158.75 s > [2026-08-27 10:12:35.592] @process::amplitude INFO : Input is above threshold: 1 existing threshold E-surfaces across 1/1 graph groups
  768. 158.75 s > field value
  769. 158.75 s > existing_esurfaces 1
  770. 158.75 s > group_count 1
  771. 158.75 s > groups_above_threshold 1
  772. 158.75 s > integrand se1l
  773. 158.75 s > span warm_up{integrand.name=se1l}
  774. 158.75 s > threshold_status above threshold
  775. 158.75 s > [2026-08-27 10:12:35.592] @process::amplitude INFO : overlap structure of group 0: [1: [0(2,3)]]
  776. 158.75 s > field value
  777. 158.75 s > span warm_up{integrand.name=se1l}
  778. 158.75 s > [2026-08-27 10:12:35.596] @process::amplitude WARNING : External state 0 ('g', PDG 21, helicity +) is off shell: p^2 = +2.5e5, expected m^2 = +0e0 (|Δ| = +2.5e5). Fixed-helicity spinor/vector/tensor external states may be ill-defined at this kinematic point.
  779. 158.75 s > field value
  780. 158.75 s > span warm_up{integrand.name=se1l_rls_shifted}
  781. 158.75 s > [2026-08-27 10:12:35.596] @process::amplitude WARNING : External state 1 ('g', PDG 21, helicity -) is off shell: p^2 = +2.5e5, expected m^2 = +0e0 (|Δ| = +2.5e5). Fixed-helicity spinor/vector/tensor external states may be ill-defined at this kinematic point.
  782. 158.75 s > field value
  783. 158.75 s > span warm_up{integrand.name=se1l_rls_shifted}
  784. 158.75 s > [2026-08-27 10:12:35.596] @process::amplitude INFO : Input is above threshold: 1 existing threshold E-surfaces across 1/1 graph groups
  785. 158.75 s > field value
  786. 158.75 s > existing_esurfaces 1
  787. 158.75 s > group_count 1
  788. 158.75 s > groups_above_threshold 1
  789. 158.75 s > integrand se1l_rls_shifted
  790. 158.75 s > span warm_up{integrand.name=se1l_rls_shifted}
  791. 158.75 s > threshold_status above threshold
  792. 158.75 s > [2026-08-27 10:12:35.596] @process::amplitude INFO : overlap structure of group 0: [1: [0(2,3)]]
  793. 158.75 s > field value
  794. 158.75 s > span warm_up{integrand.name=se1l_rls_shifted}
  795. 158.75 s > [2026-08-27 10:12:35.600] @process::amplitude WARNING : External state 0 ('g', PDG 21, helicity +) is off shell: p^2 = +2.5e5, expected m^2 = +0e0 (|Δ| = +2.5e5). Fixed-helicity spinor/vector/tensor external states may be ill-defined at this kinematic point.
  796. 158.75 s > field value
  797. 158.75 s > span warm_up{integrand.name=se1l}
  798. 158.75 s > [2026-08-27 10:12:35.601] @process::amplitude WARNING : External state 1 ('g', PDG 21, helicity -) is off shell: p^2 = +2.5e5, expected m^2 = +0e0 (|Δ| = +2.5e5). Fixed-helicity spinor/vector/tensor external states may be ill-defined at this kinematic point.
  799. 158.75 s > field value
  800. 158.75 s > span warm_up{integrand.name=se1l}
  801. 158.75 s > [2026-08-27 10:12:35.601] @process::amplitude INFO : Input is above threshold: 1 existing threshold E-surfaces across 1/1 graph groups
  802. 158.75 s > field value
  803. 158.75 s > existing_esurfaces 1
  804. 158.75 s > group_count 1
  805. 158.75 s > groups_above_threshold 1
  806. 158.75 s > integrand se1l
  807. 158.75 s > span warm_up{integrand.name=se1l}
  808. 158.75 s > threshold_status above threshold
  809. 158.75 s > [2026-08-27 10:12:35.601] @process::amplitude INFO : overlap structure of group 0: [1: [0(2,3)]]
  810. 158.75 s > field value
  811. 158.75 s > span warm_up{integrand.name=se1l}
  812. 158.75 s > [2026-08-27 10:12:35.605] @process::amplitude WARNING : External state 0 ('g', PDG 21, helicity +) is off shell: p^2 = +2.5e5, expected m^2 = +0e0 (|Δ| = +2.5e5). Fixed-helicity spinor/vector/tensor external states may be ill-defined at this kinematic point.
  813. 158.75 s > field value
  814. 158.75 s > span warm_up{integrand.name=se1l_rls_shifted}
  815. 158.75 s > [2026-08-27 10:12:35.605] @process::amplitude WARNING : External state 1 ('g', PDG 21, helicity -) is off shell: p^2 = +2.5e5, expected m^2 = +0e0 (|Δ| = +2.5e5). Fixed-helicity spinor/vector/tensor external states may be ill-defined at this kinematic point.
  816. 158.75 s > field value
  817. 158.75 s > span warm_up{integrand.name=se1l_rls_shifted}
  818. 158.75 s > [2026-08-27 10:12:35.605] @process::amplitude INFO : Input is above threshold: 1 existing threshold E-surfaces across 1/1 graph groups
  819. 158.75 s > field value
  820. 158.75 s > existing_esurfaces 1
  821. 158.75 s > group_count 1
  822. 158.75 s > groups_above_threshold 1
  823. 158.75 s > integrand se1l_rls_shifted
  824. 158.75 s > span warm_up{integrand.name=se1l_rls_shifted}
  825. 158.75 s > threshold_status above threshold
  826. 158.75 s > [2026-08-27 10:12:35.605] @process::amplitude INFO : overlap structure of group 0: [1: [0(2,3)]]
  827. 158.75 s > field value
  828. 158.75 s > span warm_up{integrand.name=se1l_rls_shifted}
  829. 158.75 s > [2026-08-27 10:12:35.609] @process::amplitude WARNING : External state 0 ('g', PDG 21, helicity +) is off shell: p^2 = +2.5e5, expected m^2 = +0e0 (|Δ| = +2.5e5). Fixed-helicity spinor/vector/tensor external states may be ill-defined at this kinematic point.
  830. 158.75 s > field value
  831. 158.75 s > span warm_up{integrand.name=se1l}
  832. 158.75 s > [2026-08-27 10:12:35.609] @process::amplitude WARNING : External state 1 ('g', PDG 21, helicity -) is off shell: p^2 = +2.5e5, expected m^2 = +0e0 (|Δ| = +2.5e5). Fixed-helicity spinor/vector/tensor external states may be ill-defined at this kinematic point.
  833. 158.75 s > field value
  834. 158.75 s > span warm_up{integrand.name=se1l}
  835. 158.75 s > [2026-08-27 10:12:35.609] @process::amplitude INFO : Input is above threshold: 1 existing threshold E-surfaces across 1/1 graph groups
  836. 158.75 s > field value
  837. 158.75 s > existing_esurfaces 1
  838. 158.75 s > group_count 1
  839. 158.75 s > groups_above_threshold 1
  840. 158.75 s > integrand se1l
  841. 158.75 s > span warm_up{integrand.name=se1l}
  842. 158.75 s > threshold_status above threshold
  843. 158.75 s > [2026-08-27 10:12:35.609] @process::amplitude INFO : overlap structure of group 0: [1: [0(2,3)]]
  844. 158.75 s > field value
  845. 158.75 s > span warm_up{integrand.name=se1l}
  846. 158.75 s > [2026-08-27 10:12:35.614] @process::amplitude WARNING : External state 0 ('g', PDG 21, helicity +) is off shell: p^2 = +2.5e5, expected m^2 = +0e0 (|Δ| = +2.5e5). Fixed-helicity spinor/vector/tensor external states may be ill-defined at this kinematic point.
  847. 158.75 s > field value
  848. 158.75 s > span warm_up{integrand.name=se1l_rls_shifted}
  849. 158.75 s > [2026-08-27 10:12:35.614] @process::amplitude WARNING : External state 1 ('g', PDG 21, helicity -) is off shell: p^2 = +2.5e5, expected m^2 = +0e0 (|Δ| = +2.5e5). Fixed-helicity spinor/vector/tensor external states may be ill-defined at this kinematic point.
  850. 158.75 s > field value
  851. 158.75 s > span warm_up{integrand.name=se1l_rls_shifted}
  852. 158.75 s > [2026-08-27 10:12:35.614] @process::amplitude INFO : Input is above threshold: 1 existing threshold E-surfaces across 1/1 graph groups
  853. 158.75 s > field value
  854. 158.75 s > existing_esurfaces 1
  855. 158.75 s > group_count 1
  856. 158.75 s > groups_above_threshold 1
  857. 158.75 s > integrand se1l_rls_shifted
  858. 158.75 s > span warm_up{integrand.name=se1l_rls_shifted}
  859. 158.75 s > threshold_status above threshold
  860. 158.75 s > [2026-08-27 10:12:35.614] @process::amplitude INFO : overlap structure of group 0: [1: [0(2,3)]]
  861. 158.75 s > field value
  862. 158.75 s > span warm_up{integrand.name=se1l_rls_shifted}
  863. 158.75 s > [2026-08-27 10:12:35.618] @process::amplitude WARNING : External state 0 ('g', PDG 21, helicity +) is off shell: p^2 = +2.5e5, expected m^2 = +0e0 (|Δ| = +2.5e5). Fixed-helicity spinor/vector/tensor external states may be ill-defined at this kinematic point.
  864. 158.75 s > field value
  865. 158.75 s > span warm_up{integrand.name=se1l}
  866. 158.75 s > [2026-08-27 10:12:35.618] @process::amplitude WARNING : External state 1 ('g', PDG 21, helicity -) is off shell: p^2 = +2.5e5, expected m^2 = +0e0 (|Δ| = +2.5e5). Fixed-helicity spinor/vector/tensor external states may be ill-defined at this kinematic point.
  867. 158.75 s > field value
  868. 158.75 s > span warm_up{integrand.name=se1l}
  869. 158.75 s > [2026-08-27 10:12:35.618] @process::amplitude INFO : Input is above threshold: 1 existing threshold E-surfaces across 1/1 graph groups
  870. 158.75 s > field value
  871. 158.75 s > existing_esurfaces 1
  872. 158.75 s > group_count 1
  873. 158.75 s > groups_above_threshold 1
  874. 158.75 s > integrand se1l
  875. 158.75 s > span warm_up{integrand.name=se1l}
  876. 158.75 s > threshold_status above threshold
  877. 158.75 s > [2026-08-27 10:12:35.618] @process::amplitude INFO : overlap structure of group 0: [1: [0(2,3)]]
  878. 158.75 s > field value
  879. 158.75 s > span warm_up{integrand.name=se1l}
  880. 158.75 s > [2026-08-27 10:12:35.622] @process::amplitude WARNING : External state 0 ('g', PDG 21, helicity +) is off shell: p^2 = +2.5e5, expected m^2 = +0e0 (|Δ| = +2.5e5). Fixed-helicity spinor/vector/tensor external states may be ill-defined at this kinematic point.
  881. 158.75 s > field value
  882. 158.75 s > span warm_up{integrand.name=se1l_rls_shifted}
  883. 158.75 s > [2026-08-27 10:12:35.622] @process::amplitude WARNING : External state 1 ('g', PDG 21, helicity -) is off shell: p^2 = +2.5e5, expected m^2 = +0e0 (|Δ| = +2.5e5). Fixed-helicity spinor/vector/tensor external states may be ill-defined at this kinematic point.
  884. 158.75 s > field value
  885. 158.75 s > span warm_up{integrand.name=se1l_rls_shifted}
  886. 158.75 s > [2026-08-27 10:12:35.622] @process::amplitude INFO : Input is above threshold: 1 existing threshold E-surfaces across 1/1 graph groups
  887. 158.75 s > field value
  888. 158.75 s > existing_esurfaces 1
  889. 158.75 s > group_count 1
  890. 158.75 s > groups_above_threshold 1
  891. 158.75 s > integrand se1l_rls_shifted
  892. 158.75 s > span warm_up{integrand.name=se1l_rls_shifted}
  893. 158.75 s > threshold_status above threshold
  894. 158.75 s > [2026-08-27 10:12:35.622] @process::amplitude INFO : overlap structure of group 0: [1: [0(2,3)]]
  895. 158.75 s > field value
  896. 158.75 s > span warm_up{integrand.name=se1l_rls_shifted}
  897. 158.75 s > [2026-08-27 10:12:35.626] @process::amplitude WARNING : External state 0 ('g', PDG 21, helicity +) is off shell: p^2 = +2.5e5, expected m^2 = +0e0 (|Δ| = +2.5e5). Fixed-helicity spinor/vector/tensor external states may be ill-defined at this kinematic point.
  898. 158.75 s > field value
  899. 158.75 s > span warm_up{integrand.name=se1l}
  900. 158.75 s > [2026-08-27 10:12:35.626] @process::amplitude WARNING : External state 1 ('g', PDG 21, helicity -) is off shell: p^2 = +2.5e5, expected m^2 = +0e0 (|Δ| = +2.5e5). Fixed-helicity spinor/vector/tensor external states may be ill-defined at this kinematic point.
  901. 158.75 s > field value
  902. 158.75 s > span warm_up{integrand.name=se1l}
  903. 158.75 s > [2026-08-27 10:12:35.627] @process::amplitude INFO : Input is above threshold: 1 existing threshold E-surfaces across 1/1 graph groups
  904. 158.75 s > field value
  905. 158.75 s > existing_esurfaces 1
  906. 158.75 s > group_count 1
  907. 158.75 s > groups_above_threshold 1
  908. 158.75 s > integrand se1l
  909. 158.75 s > span warm_up{integrand.name=se1l}
  910. 158.75 s > threshold_status above threshold
  911. 158.75 s > [2026-08-27 10:12:35.627] @process::amplitude INFO : overlap structure of group 0: [1: [0(2,3)]]
  912. 158.75 s > field value
  913. 158.75 s > span warm_up{integrand.name=se1l}
  914. 158.75 s > [2026-08-27 10:12:35.631] @process::amplitude WARNING : External state 0 ('g', PDG 21, helicity +) is off shell: p^2 = +2.5e5, expected m^2 = +0e0 (|Δ| = +2.5e5). Fixed-helicity spinor/vector/tensor external states may be ill-defined at this kinematic point.
  915. 158.75 s > field value
  916. 158.75 s > span warm_up{integrand.name=se1l_mur_shifted}
  917. 158.75 s > [2026-08-27 10:12:35.631] @process::amplitude WARNING : External state 1 ('g', PDG 21, helicity -) is off shell: p^2 = +2.5e5, expected m^2 = +0e0 (|Δ| = +2.5e5). Fixed-helicity spinor/vector/tensor external states may be ill-defined at this kinematic point.
  918. 158.75 s > field value
  919. 158.75 s > span warm_up{integrand.name=se1l_mur_shifted}
  920. 158.75 s > [2026-08-27 10:12:35.631] @process::amplitude INFO : Input is above threshold: 1 existing threshold E-surfaces across 1/1 graph groups
  921. 158.75 s > field value
  922. 158.75 s > existing_esurfaces 1
  923. 158.75 s > group_count 1
  924. 158.75 s > groups_above_threshold 1
  925. 158.75 s > integrand se1l_mur_shifted
  926. 158.75 s > span warm_up{integrand.name=se1l_mur_shifted}
  927. 158.75 s > threshold_status above threshold
  928. 158.75 s > [2026-08-27 10:12:35.631] @process::amplitude INFO : overlap structure of group 0: [1: [0(2,3)]]
  929. 158.75 s > field value
  930. 158.75 s > span warm_up{integrand.name=se1l_mur_shifted}
  931. 158.75 s > [2026-08-27 10:12:35.635] @process::amplitude WARNING : External state 0 ('g', PDG 21, helicity +) is off shell: p^2 = +2.5e5, expected m^2 = +0e0 (|Δ| = +2.5e5). Fixed-helicity spinor/vector/tensor external states may be ill-defined at this kinematic point.
  932. 158.75 s > field value
  933. 158.75 s > span warm_up{integrand.name=se1l}
  934. 158.75 s > [2026-08-27 10:12:35.635] @process::amplitude WARNING : External state 1 ('g', PDG 21, helicity -) is off shell: p^2 = +2.5e5, expected m^2 = +0e0 (|Δ| = +2.5e5). Fixed-helicity spinor/vector/tensor external states may be ill-defined at this kinematic point.
  935. 158.75 s > field value
  936. 158.75 s > span warm_up{integrand.name=se1l}
  937. 158.75 s > [2026-08-27 10:12:35.635] @process::amplitude INFO : Input is above threshold: 1 existing threshold E-surfaces across 1/1 graph groups
  938. 158.75 s > field value
  939. 158.75 s > existing_esurfaces 1
  940. 158.75 s > group_count 1
  941. 158.75 s > groups_above_threshold 1
  942. 158.75 s > integrand se1l
  943. 158.75 s > span warm_up{integrand.name=se1l}
  944. 158.75 s > threshold_status above threshold
  945. 158.75 s > [2026-08-27 10:12:35.636] @process::amplitude INFO : overlap structure of group 0: [1: [0(2,3)]]
  946. 158.75 s > field value
  947. 158.75 s > span warm_up{integrand.name=se1l}
  948. 158.75 s > [2026-08-27 10:12:35.640] @process::amplitude WARNING : External state 0 ('g', PDG 21, helicity +) is off shell: p^2 = +2.5e5, expected m^2 = +0e0 (|Δ| = +2.5e5). Fixed-helicity spinor/vector/tensor external states may be ill-defined at this kinematic point.
  949. 158.75 s > field value
  950. 158.75 s > span warm_up{integrand.name=se1l_mur_shifted}
  951. 158.75 s > [2026-08-27 10:12:35.640] @process::amplitude WARNING : External state 1 ('g', PDG 21, helicity -) is off shell: p^2 = +2.5e5, expected m^2 = +0e0 (|Δ| = +2.5e5). Fixed-helicity spinor/vector/tensor external states may be ill-defined at this kinematic point.
  952. 158.75 s > field value
  953. 158.75 s > span warm_up{integrand.name=se1l_mur_shifted}
  954. 158.75 s > [2026-08-27 10:12:35.640] @process::amplitude INFO : Input is above threshold: 1 existing threshold E-surfaces across 1/1 graph groups
  955. 158.75 s > field value
  956. 158.75 s > existing_esurfaces 1
  957. 158.75 s > group_count 1
  958. 158.75 s > groups_above_threshold 1
  959. 158.75 s > integrand se1l_mur_shifted
  960. 158.75 s > span warm_up{integrand.name=se1l_mur_shifted}
  961. 158.75 s > threshold_status above threshold
  962. 158.75 s > [2026-08-27 10:12:35.640] @process::amplitude INFO : overlap structure of group 0: [1: [0(2,3)]]
  963. 158.75 s > field value
  964. 158.75 s > span warm_up{integrand.name=se1l_mur_shifted}
  965. 158.75 s > [2026-08-27 10:12:35.644] @process::amplitude WARNING : External state 0 ('g', PDG 21, helicity +) is off shell: p^2 = +2.5e5, expected m^2 = +0e0 (|Δ| = +2.5e5). Fixed-helicity spinor/vector/tensor external states may be ill-defined at this kinematic point.
  966. 158.75 s > field value
  967. 158.75 s > span warm_up{integrand.name=se1l}
  968. 158.75 s > [2026-08-27 10:12:35.644] @process::amplitude WARNING : External state 1 ('g', PDG 21, helicity -) is off shell: p^2 = +2.5e5, expected m^2 = +0e0 (|Δ| = +2.5e5). Fixed-helicity spinor/vector/tensor external states may be ill-defined at this kinematic point.
  969. 158.75 s > field value
  970. 158.75 s > span warm_up{integrand.name=se1l}
  971. 158.75 s > [2026-08-27 10:12:35.644] @process::amplitude INFO : Input is above threshold: 1 existing threshold E-surfaces across 1/1 graph groups
  972. 158.75 s > field value
  973. 158.75 s > existing_esurfaces 1
  974. 158.75 s > group_count 1
  975. 158.75 s > groups_above_threshold 1
  976. 158.75 s > integrand se1l
  977. 158.75 s > span warm_up{integrand.name=se1l}
  978. 158.75 s > threshold_status above threshold
  979. 158.75 s > [2026-08-27 10:12:35.644] @process::amplitude INFO : overlap structure of group 0: [1: [0(2,3)]]
  980. 158.75 s > field value
  981. 158.75 s > span warm_up{integrand.name=se1l}
  982. 158.75 s > [2026-08-27 10:12:35.648] @process::amplitude WARNING : External state 0 ('g', PDG 21, helicity +) is off shell: p^2 = +2.5e5, expected m^2 = +0e0 (|Δ| = +2.5e5). Fixed-helicity spinor/vector/tensor external states may be ill-defined at this kinematic point.
  983. 158.75 s > field value
  984. 158.75 s > span warm_up{integrand.name=se1l_mur_shifted}
  985. 158.75 s > [2026-08-27 10:12:35.648] @process::amplitude WARNING : External state 1 ('g', PDG 21, helicity -) is off shell: p^2 = +2.5e5, expected m^2 = +0e0 (|Δ| = +2.5e5). Fixed-helicity spinor/vector/tensor external states may be ill-defined at this kinematic point.
  986. 158.75 s > field value
  987. 158.75 s > span warm_up{integrand.name=se1l_mur_shifted}
  988. 158.75 s > [2026-08-27 10:12:35.648] @process::amplitude INFO : Input is above threshold: 1 existing threshold E-surfaces across 1/1 graph groups
  989. 158.75 s > field value
  990. 158.75 s > existing_esurfaces 1
  991. 158.75 s > group_count 1
  992. 158.75 s > groups_above_threshold 1
  993. 158.75 s > integrand se1l_mur_shifted
  994. 158.75 s > span warm_up{integrand.name=se1l_mur_shifted}
  995. 158.75 s > threshold_status above threshold
  996. 158.75 s > [2026-08-27 10:12:35.648] @process::amplitude INFO : overlap structure of group 0: [1: [0(2,3)]]
  997. 158.75 s > field value
  998. 158.75 s > span warm_up{integrand.name=se1l_mur_shifted}
  999. 158.75 s > [2026-08-27 10:12:35.652] @process::amplitude WARNING : External state 0 ('g', PDG 21, helicity +) is off shell: p^2 = +2.5e5, expected m^2 = +0e0 (|Δ| = +2.5e5). Fixed-helicity spinor/vector/tensor external states may be ill-defined at this kinematic point.
  1000. 158.75 s > field value
  1001. 158.75 s > span warm_up{integrand.name=se1l}
  1002. 158.75 s > [2026-08-27 10:12:35.652] @process::amplitude WARNING : External state 1 ('g', PDG 21, helicity -) is off shell: p^2 = +2.5e5, expected m^2 = +0e0 (|Δ| = +2.5e5). Fixed-helicity spinor/vector/tensor external states may be ill-defined at this kinematic point.
  1003. 158.75 s > field value
  1004. 158.75 s > span warm_up{integrand.name=se1l}
  1005. 158.75 s > [2026-08-27 10:12:35.653] @process::amplitude INFO : Input is above threshold: 1 existing threshold E-surfaces across 1/1 graph groups
  1006. 158.75 s > field value
  1007. 158.75 s > existing_esurfaces 1
  1008. 158.75 s > group_count 1
  1009. 158.75 s > groups_above_threshold 1
  1010. 158.75 s > integrand se1l
  1011. 158.75 s > span warm_up{integrand.name=se1l}
  1012. 158.75 s > threshold_status above threshold
  1013. 158.75 s > [2026-08-27 10:12:35.653] @process::amplitude INFO : overlap structure of group 0: [1: [0(2,3)]]
  1014. 158.75 s > field value
  1015. 158.75 s > span warm_up{integrand.name=se1l}
  1016. 158.75 s > [2026-08-27 10:12:35.657] @process::amplitude WARNING : External state 0 ('g', PDG 21, helicity +) is off shell: p^2 = +2.5e5, expected m^2 = +0e0 (|Δ| = +2.5e5). Fixed-helicity spinor/vector/tensor external states may be ill-defined at this kinematic point.
  1017. 158.75 s > field value
  1018. 158.75 s > span warm_up{integrand.name=se1l_mur_shifted}
  1019. 158.75 s > [2026-08-27 10:12:35.657] @process::amplitude WARNING : External state 1 ('g', PDG 21, helicity -) is off shell: p^2 = +2.5e5, expected m^2 = +0e0 (|Δ| = +2.5e5). Fixed-helicity spinor/vector/tensor external states may be ill-defined at this kinematic point.
  1020. 158.75 s > field value
  1021. 158.75 s > span warm_up{integrand.name=se1l_mur_shifted}
  1022. 158.75 s > [2026-08-27 10:12:35.657] @process::amplitude INFO : Input is above threshold: 1 existing threshold E-surfaces across 1/1 graph groups
  1023. 158.75 s > field value
  1024. 158.75 s > existing_esurfaces 1
  1025. 158.75 s > group_count 1
  1026. 158.75 s > groups_above_threshold 1
  1027. 158.75 s > integrand se1l_mur_shifted
  1028. 158.75 s > span warm_up{integrand.name=se1l_mur_shifted}
  1029. 158.75 s > threshold_status above threshold
  1030. 158.75 s > [2026-08-27 10:12:35.657] @process::amplitude INFO : overlap structure of group 0: [1: [0(2,3)]]
  1031. 158.75 s > field value
  1032. 158.75 s > span warm_up{integrand.name=se1l_mur_shifted}
  1033. 158.75 s > [2026-08-27 10:12:35.661] @process::amplitude WARNING : External state 0 ('g', PDG 21, helicity +) is off shell: p^2 = +2.5e5, expected m^2 = +0e0 (|Δ| = +2.5e5). Fixed-helicity spinor/vector/tensor external states may be ill-defined at this kinematic point.
  1034. 158.75 s > field value
  1035. 158.75 s > span warm_up{integrand.name=se1l}
  1036. 158.75 s > [2026-08-27 10:12:35.661] @process::amplitude WARNING : External state 1 ('g', PDG 21, helicity -) is off shell: p^2 = +2.5e5, expected m^2 = +0e0 (|Δ| = +2.5e5). Fixed-helicity spinor/vector/tensor external states may be ill-defined at this kinematic point.
  1037. 158.75 s > field value
  1038. 158.75 s > span warm_up{integrand.name=se1l}
  1039. 158.75 s > [2026-08-27 10:12:35.661] @process::amplitude INFO : Input is above threshold: 1 existing threshold E-surfaces across 1/1 graph groups
  1040. 158.75 s > field value
  1041. 158.75 s > existing_esurfaces 1
  1042. 158.75 s > group_count 1
  1043. 158.75 s > groups_above_threshold 1
  1044. 158.75 s > integrand se1l
  1045. 158.75 s > span warm_up{integrand.name=se1l}
  1046. 158.75 s > threshold_status above threshold
  1047. 158.75 s > [2026-08-27 10:12:35.661] @process::amplitude INFO : overlap structure of group 0: [1: [0(2,3)]]
  1048. 158.75 s > field value
  1049. 158.75 s > span warm_up{integrand.name=se1l}
  1050. 158.75 s > [2026-08-27 10:12:35.665] @process::amplitude WARNING : External state 0 ('g', PDG 21, helicity +) is off shell: p^2 = +2.5e5, expected m^2 = +0e0 (|Δ| = +2.5e5). Fixed-helicity spinor/vector/tensor external states may be ill-defined at this kinematic point.
  1051. 158.75 s > field value
  1052. 158.75 s > span warm_up{integrand.name=se1l_mur_shifted}
  1053. 158.75 s > [2026-08-27 10:12:35.665] @process::amplitude WARNING : External state 1 ('g', PDG 21, helicity -) is off shell: p^2 = +2.5e5, expected m^2 = +0e0 (|Δ| = +2.5e5). Fixed-helicity spinor/vector/tensor external states may be ill-defined at this kinematic point.
  1054. 158.75 s > field value
  1055. 158.75 s > span warm_up{integrand.name=se1l_mur_shifted}
  1056. 158.75 s > [2026-08-27 10:12:35.665] @process::amplitude INFO : Input is above threshold: 1 existing threshold E-surfaces across 1/1 graph groups
  1057. 158.75 s > field value
  1058. 158.75 s > existing_esurfaces 1
  1059. 158.75 s > group_count 1
  1060. 158.75 s > groups_above_threshold 1
  1061. 158.75 s > integrand se1l_mur_shifted
  1062. 158.75 s > span warm_up{integrand.name=se1l_mur_shifted}
  1063. 158.75 s > threshold_status above threshold
  1064. 158.75 s > [2026-08-27 10:12:35.665] @process::amplitude INFO : overlap structure of group 0: [1: [0(2,3)]]
  1065. 158.75 s > field value
  1066. 158.75 s > span warm_up{integrand.name=se1l_mur_shifted}
  1067. 158.75 s > [2026-08-27 10:12:35.669] @process::amplitude WARNING : External state 0 ('g', PDG 21, helicity +) is off shell: p^2 = +2.5e5, expected m^2 = +0e0 (|Δ| = +2.5e5). Fixed-helicity spinor/vector/tensor external states may be ill-defined at this kinematic point.
  1068. 158.75 s > field value
  1069. 158.75 s > span warm_up{integrand.name=se1l}
  1070. 158.75 s > [2026-08-27 10:12:35.669] @process::amplitude WARNING : External state 1 ('g', PDG 21, helicity -) is off shell: p^2 = +2.5e5, expected m^2 = +0e0 (|Δ| = +2.5e5). Fixed-helicity spinor/vector/tensor external states may be ill-defined at this kinematic point.
  1071. 158.75 s > field value
  1072. 158.75 s > span warm_up{integrand.name=se1l}
  1073. 158.75 s > [2026-08-27 10:12:35.669] @process::amplitude INFO : Input is above threshold: 1 existing threshold E-surfaces across 1/1 graph groups
  1074. 158.75 s > field value
  1075. 158.75 s > existing_esurfaces 1
  1076. 158.75 s > group_count 1
  1077. 158.75 s > groups_above_threshold 1
  1078. 158.75 s > integrand se1l
  1079. 158.75 s > span warm_up{integrand.name=se1l}
  1080. 158.75 s > threshold_status above threshold
  1081. 158.75 s > [2026-08-27 10:12:35.670] @process::amplitude INFO : overlap structure of group 0: [1: [0(2,3)]]
  1082. 158.75 s > field value
  1083. 158.75 s > span warm_up{integrand.name=se1l}
  1084. 158.75 s > [2026-08-27 10:12:35.674] @process::amplitude WARNING : External state 0 ('g', PDG 21, helicity +) is off shell: p^2 = +2.5e5, expected m^2 = +0e0 (|Δ| = +2.5e5). Fixed-helicity spinor/vector/tensor external states may be ill-defined at this kinematic point.
  1085. 158.75 s > field value
  1086. 158.75 s > span warm_up{integrand.name=se1l_mur_shifted}
  1087. 158.75 s > [2026-08-27 10:12:35.674] @process::amplitude WARNING : External state 1 ('g', PDG 21, helicity -) is off shell: p^2 = +2.5e5, expected m^2 = +0e0 (|Δ| = +2.5e5). Fixed-helicity spinor/vector/tensor external states may be ill-defined at this kinematic point.
  1088. 158.75 s > field value
  1089. 158.75 s > span warm_up{integrand.name=se1l_mur_shifted}
  1090. 158.75 s > [2026-08-27 10:12:35.674] @process::amplitude INFO : Input is above threshold: 1 existing threshold E-surfaces across 1/1 graph groups
  1091. 158.75 s > field value
  1092. 158.75 s > existing_esurfaces 1
  1093. 158.75 s > group_count 1
  1094. 158.75 s > groups_above_threshold 1
  1095. 158.75 s > integrand se1l_mur_shifted
  1096. 158.75 s > span warm_up{integrand.name=se1l_mur_shifted}
  1097. 158.75 s > threshold_status above threshold
  1098. 158.75 s > [2026-08-27 10:12:35.674] @process::amplitude INFO : overlap structure of group 0: [1: [0(2,3)]]
  1099. 158.75 s > field value
  1100. 158.75 s > span warm_up{integrand.name=se1l_mur_shifted}
  1101. 158.75 s > [2026-08-27 10:12:35.678] @process::amplitude WARNING : External state 0 ('g', PDG 21, helicity +) is off shell: p^2 = +2.5e5, expected m^2 = +0e0 (|Δ| = +2.5e5). Fixed-helicity spinor/vector/tensor external states may be ill-defined at this kinematic point.
  1102. 158.75 s > field value
  1103. 158.75 s > span warm_up{integrand.name=se1l}
  1104. 158.75 s > [2026-08-27 10:12:35.678] @process::amplitude WARNING : External state 1 ('g', PDG 21, helicity -) is off shell: p^2 = +2.5e5, expected m^2 = +0e0 (|Δ| = +2.5e5). Fixed-helicity spinor/vector/tensor external states may be ill-defined at this kinematic point.
  1105. 158.75 s > field value
  1106. 158.75 s > span warm_up{integrand.name=se1l}
  1107. 158.75 s > [2026-08-27 10:12:35.678] @process::amplitude INFO : Input is above threshold: 1 existing threshold E-surfaces across 1/1 graph groups
  1108. 158.75 s > field value
  1109. 158.75 s > existing_esurfaces 1
  1110. 158.75 s > group_count 1
  1111. 158.75 s > groups_above_threshold 1
  1112. 158.75 s > integrand se1l
  1113. 158.75 s > span warm_up{integrand.name=se1l}
  1114. 158.75 s > threshold_status above threshold
  1115. 158.75 s > [2026-08-27 10:12:35.678] @process::amplitude INFO : overlap structure of group 0: [1: [0(2,3)]]
  1116. 158.75 s > field value
  1117. 158.75 s > span warm_up{integrand.name=se1l}
  1118. 158.75 s > [2026-08-27 10:12:35.682] @process::amplitude WARNING : External state 0 ('g', PDG 21, helicity +) is off shell: p^2 = +2.5e5, expected m^2 = +0e0 (|Δ| = +2.5e5). Fixed-helicity spinor/vector/tensor external states may be ill-defined at this kinematic point.
  1119. 158.75 s > field value
  1120. 158.75 s > span warm_up{integrand.name=se1l_mur_shifted}
  1121. 158.75 s > [2026-08-27 10:12:35.682] @process::amplitude WARNING : External state 1 ('g', PDG 21, helicity -) is off shell: p^2 = +2.5e5, expected m^2 = +0e0 (|Δ| = +2.5e5). Fixed-helicity spinor/vector/tensor external states may be ill-defined at this kinematic point.
  1122. 158.75 s > field value
  1123. 158.75 s > span warm_up{integrand.name=se1l_mur_shifted}
  1124. 158.75 s > [2026-08-27 10:12:35.682] @process::amplitude INFO : Input is above threshold: 1 existing threshold E-surfaces across 1/1 graph groups
  1125. 158.75 s > field value
  1126. 158.75 s > existing_esurfaces 1
  1127. 158.75 s > group_count 1
  1128. 158.75 s > groups_above_threshold 1
  1129. 158.75 s > integrand se1l_mur_shifted
  1130. 158.75 s > span warm_up{integrand.name=se1l_mur_shifted}
  1131. 158.75 s > threshold_status above threshold
  1132. 158.75 s > [2026-08-27 10:12:35.682] @process::amplitude INFO : overlap structure of group 0: [1: [0(2,3)]]
  1133. 158.75 s > field value
  1134. 158.75 s > span warm_up{integrand.name=se1l_mur_shifted}
  1135. 158.75 s > [2026-08-27 10:12:35.686] @process::amplitude WARNING : External state 0 ('g', PDG 21, helicity +) is off shell: p^2 = +2.5e5, expected m^2 = +0e0 (|Δ| = +2.5e5). Fixed-helicity spinor/vector/tensor external states may be ill-defined at this kinematic point.
  1136. 158.75 s > field value
  1137. 158.75 s > span warm_up{integrand.name=se1l}
  1138. 158.75 s > [2026-08-27 10:12:35.686] @process::amplitude WARNING : External state 1 ('g', PDG 21, helicity -) is off shell: p^2 = +2.5e5, expected m^2 = +0e0 (|Δ| = +2.5e5). Fixed-helicity spinor/vector/tensor external states may be ill-defined at this kinematic point.
  1139. 158.75 s > field value
  1140. 158.75 s > span warm_up{integrand.name=se1l}
  1141. 158.75 s > [2026-08-27 10:12:35.687] @process::amplitude INFO : Input is above threshold: 1 existing threshold E-surfaces across 1/1 graph groups
  1142. 158.75 s > field value
  1143. 158.75 s > existing_esurfaces 1
  1144. 158.75 s > group_count 1
  1145. 158.75 s > groups_above_threshold 1
  1146. 158.75 s > integrand se1l
  1147. 158.75 s > span warm_up{integrand.name=se1l}
  1148. 158.75 s > threshold_status above threshold
  1149. 158.75 s > [2026-08-27 10:12:35.687] @process::amplitude INFO : overlap structure of group 0: [1: [0(2,3)]]
  1150. 158.75 s > field value
  1151. 158.75 s > span warm_up{integrand.name=se1l}
  1152. 158.75 s > [2026-08-27 10:12:35.691] @process::amplitude WARNING : External state 0 ('g', PDG 21, helicity +) is off shell: p^2 = +2.5e5, expected m^2 = +0e0 (|Δ| = +2.5e5). Fixed-helicity spinor/vector/tensor external states may be ill-defined at this kinematic point.
  1153. 158.75 s > field value
  1154. 158.75 s > span warm_up{integrand.name=se1l_mur_shifted}
  1155. 158.75 s > [2026-08-27 10:12:35.691] @process::amplitude WARNING : External state 1 ('g', PDG 21, helicity -) is off shell: p^2 = +2.5e5, expected m^2 = +0e0 (|Δ| = +2.5e5). Fixed-helicity spinor/vector/tensor external states may be ill-defined at this kinematic point.
  1156. 158.75 s > field value
  1157. 158.75 s > span warm_up{integrand.name=se1l_mur_shifted}
  1158. 158.75 s > [2026-08-27 10:12:35.691] @process::amplitude INFO : Input is above threshold: 1 existing threshold E-surfaces across 1/1 graph groups
  1159. 158.75 s > field value
  1160. 158.75 s > existing_esurfaces 1
  1161. 158.75 s > group_count 1
  1162. 158.75 s > groups_above_threshold 1
  1163. 158.75 s > integrand se1l_mur_shifted
  1164. 158.75 s > span warm_up{integrand.name=se1l_mur_shifted}
  1165. 158.75 s > threshold_status above threshold
  1166. 158.75 s > [2026-08-27 10:12:35.691] @process::amplitude INFO : overlap structure of group 0: [1: [0(2,3)]]
  1167. 158.75 s > field value
  1168. 158.75 s > span warm_up{integrand.name=se1l_mur_shifted}
  1169. 158.75 s > [2026-08-27 10:12:35.695] @process::amplitude WARNING : External state 0 ('g', PDG 21, helicity +) is off shell: p^2 = +2.5e5, expected m^2 = +0e0 (|Δ| = +2.5e5). Fixed-helicity spinor/vector/tensor external states may be ill-defined at this kinematic point.
  1170. 158.75 s > field value
  1171. 158.75 s > span warm_up{integrand.name=se1l}
  1172. 158.75 s > [2026-08-27 10:12:35.695] @process::amplitude WARNING : External state 1 ('g', PDG 21, helicity -) is off shell: p^2 = +2.5e5, expected m^2 = +0e0 (|Δ| = +2.5e5). Fixed-helicity spinor/vector/tensor external states may be ill-defined at this kinematic point.
  1173. 158.75 s > field value
  1174. 158.75 s > span warm_up{integrand.name=se1l}
  1175. 158.75 s > [2026-08-27 10:12:35.695] @process::amplitude INFO : Input is above threshold: 1 existing threshold E-surfaces across 1/1 graph groups
  1176. 158.75 s > field value
  1177. 158.75 s > existing_esurfaces 1
  1178. 158.75 s > group_count 1
  1179. 158.75 s > groups_above_threshold 1
  1180. 158.75 s > integrand se1l
  1181. 158.75 s > span warm_up{integrand.name=se1l}
  1182. 158.75 s > threshold_status above threshold
  1183. 158.75 s > [2026-08-27 10:12:35.695] @process::amplitude INFO : overlap structure of group 0: [1: [0(2,3)]]
  1184. 158.75 s > field value
  1185. 158.75 s > span warm_up{integrand.name=se1l}
  1186. 158.75 s > [2026-08-27 10:12:35.699] @process::amplitude WARNING : External state 0 ('g', PDG 21, helicity +) is off shell: p^2 = +2.5e5, expected m^2 = +0e0 (|Δ| = +2.5e5). Fixed-helicity spinor/vector/tensor external states may be ill-defined at this kinematic point.
  1187. 158.75 s > field value
  1188. 158.75 s > span warm_up{integrand.name=se1l_mur_shifted}
  1189. 158.75 s > [2026-08-27 10:12:35.699] @process::amplitude WARNING : External state 1 ('g', PDG 21, helicity -) is off shell: p^2 = +2.5e5, expected m^2 = +0e0 (|Δ| = +2.5e5). Fixed-helicity spinor/vector/tensor external states may be ill-defined at this kinematic point.
  1190. 158.75 s > field value
  1191. 158.75 s > span warm_up{integrand.name=se1l_mur_shifted}
  1192. 158.75 s > [2026-08-27 10:12:35.699] @process::amplitude INFO : Input is above threshold: 1 existing threshold E-surfaces across 1/1 graph groups
  1193. 158.75 s > field value
  1194. 158.75 s > existing_esurfaces 1
  1195. 158.75 s > group_count 1
  1196. 158.75 s > groups_above_threshold 1
  1197. 158.75 s > integrand se1l_mur_shifted
  1198. 158.75 s > span warm_up{integrand.name=se1l_mur_shifted}
  1199. 158.75 s > threshold_status above threshold
  1200. 158.75 s > [2026-08-27 10:12:35.699] @process::amplitude INFO : overlap structure of group 0: [1: [0(2,3)]]
  1201. 158.75 s > field value
  1202. 158.75 s > span warm_up{integrand.name=se1l_mur_shifted}
  1203. 158.75 s > [2026-08-27 10:12:35.703] @process::amplitude WARNING : External state 0 ('g', PDG 21, helicity +) is off shell: p^2 = +2.5e5, expected m^2 = +0e0 (|Δ| = +2.5e5). Fixed-helicity spinor/vector/tensor external states may be ill-defined at this kinematic point.
  1204. 158.75 s > field value
  1205. 158.75 s > span warm_up{integrand.name=se1l}
  1206. 158.75 s > [2026-08-27 10:12:35.703] @process::amplitude WARNING : External state 1 ('g', PDG 21, helicity -) is off shell: p^2 = +2.5e5, expected m^2 = +0e0 (|Δ| = +2.5e5). Fixed-helicity spinor/vector/tensor external states may be ill-defined at this kinematic point.
  1207. 158.75 s > field value
  1208. 158.75 s > span warm_up{integrand.name=se1l}
  1209. 158.75 s > [2026-08-27 10:12:35.703] @process::amplitude INFO : Input is above threshold: 1 existing threshold E-surfaces across 1/1 graph groups
  1210. 158.75 s > field value
  1211. 158.75 s > existing_esurfaces 1
  1212. 158.75 s > group_count 1
  1213. 158.75 s > groups_above_threshold 1
  1214. 158.75 s > integrand se1l
  1215. 158.75 s > span warm_up{integrand.name=se1l}
  1216. 158.75 s > threshold_status above threshold
  1217. 158.75 s > [2026-08-27 10:12:35.703] @process::amplitude INFO : overlap structure of group 0: [1: [0(2,3)]]
  1218. 158.75 s > field value
  1219. 158.75 s > span warm_up{integrand.name=se1l}
  1220. 158.75 s > [2026-08-27 10:12:35.707] @process::amplitude WARNING : External state 0 ('g', PDG 21, helicity +) is off shell: p^2 = +2.5e5, expected m^2 = +0e0 (|Δ| = +2.5e5). Fixed-helicity spinor/vector/tensor external states may be ill-defined at this kinematic point.
  1221. 158.75 s > field value
  1222. 158.75 s > span warm_up{integrand.name=se1l_mur_shifted}
  1223. 158.75 s > [2026-08-27 10:12:35.707] @process::amplitude WARNING : External state 1 ('g', PDG 21, helicity -) is off shell: p^2 = +2.5e5, expected m^2 = +0e0 (|Δ| = +2.5e5). Fixed-helicity spinor/vector/tensor external states may be ill-defined at this kinematic point.
  1224. 158.75 s > field value
  1225. 158.75 s > span warm_up{integrand.name=se1l_mur_shifted}
  1226. 158.75 s > [2026-08-27 10:12:35.708] @process::amplitude INFO : Input is above threshold: 1 existing threshold E-surfaces across 1/1 graph groups
  1227. 158.75 s > field value
  1228. 158.75 s > existing_esurfaces 1
  1229. 158.75 s > group_count 1
  1230. 158.75 s > groups_above_threshold 1
  1231. 158.75 s > integrand se1l_mur_shifted
  1232. 158.75 s > span warm_up{integrand.name=se1l_mur_shifted}
  1233. 158.75 s > threshold_status above threshold
  1234. 158.75 s > [2026-08-27 10:12:35.708] @process::amplitude INFO : overlap structure of group 0: [1: [0(2,3)]]
  1235. 158.75 s > field value
  1236. 158.75 s > span warm_up{integrand.name=se1l_mur_shifted}
  1237. 158.75 s > The application panicked (crashed).
  1238. 158.75 s > Message: Integrated UV case failed: se1l
  1239. 158.75 s > Location: tests/tests/uv.rs:1068
  1240. 158.75 s >
  1241. 158.75 s > ━━━━━━━━━━━━━━━━━━━━━━━━━━━━━━━━━━ BACKTRACE ━━━━━━━━━━━━━━━━━━━━━━━━━━━━━━━━━━━
  1242. 158.75 s > 1: <color_eyre[51793ea62743adbd]::config::PanicHook>::panic_report<unknown>
  1243. 158.75 s > at <unknown source file>:<unknown line>
  1244. 158.75 s > 2: <color_eyre[51793ea62743adbd]::config::PanicHook>::into_panic_hook::{closure#0}<unknown>
  1245. 158.75 s > at <unknown source file>:<unknown line>
  1246. 158.75 s > 3: std[bcb96dfbba0ab899]::panicking::panic_with_hook<unknown>
  1247. 158.75 s > at <unknown source file>:<unknown line>
  1248. 158.75 s > 4: std[bcb96dfbba0ab899]::panicking::panic_handler::{closure#0}<unknown>
  1249. 158.75 s > at <unknown source file>:<unknown line>
  1250. 158.75 s > 5: std[bcb96dfbba0ab899]::sys::backtrace::__rust_end_short_backtrace::<std[bcb96dfbba0ab899]::panicking::panic_handler::{closure#0}, !><unknown>
  1251. 158.75 s > at <unknown source file>:<unknown line>
  1252. 158.75 s > 6: __rustc[6c289b9f9c454d21]::rust_begin_unwind<unknown>
  1253. 158.75 s > at <unknown source file>:<unknown line>
  1254. 158.75 s > 7: core[940e698046960fd5]::panicking::panic_fmt<unknown>
  1255. 158.75 s > at <unknown source file>:<unknown line>
  1256. 158.75 s > 8: uv[52cf2b63f0104e31]::run_single_integrated_uv_case<unknown>
  1257. 158.75 s > at <unknown source file>:<unknown line>
  1258. 158.75 s > 9: <uv[52cf2b63f0104e31]::se1l_uv::{closure#0} as core[940e698046960fd5]::ops::function::FnOnce<()>>::call_once<unknown>
  1259. 158.75 s > at <unknown source file>:<unknown line>
  1260. 158.75 s > 10: test[75d6903177b1d7e9]::__rust_begin_short_backtrace::<core[940e698046960fd5]::result::Result<(), alloc[2ea6bcb46fca0c42]::string::String>, fn() -> core[940e698046960fd5]::result::Result<(), alloc[2ea6bcb46fca0c42]::string::String>><unknown>
  1261. 158.75 s > at <unknown source file>:<unknown line>
  1262. 158.75 s > 11: test[75d6903177b1d7e9]::run_test::{closure#0}<unknown>
  1263. 158.75 s > at <unknown source file>:<unknown line>
  1264. 158.75 s > 12: std[bcb96dfbba0ab899]::sys::backtrace::__rust_begin_short_backtrace::<test[75d6903177b1d7e9]::run_test::{closure#1}, ()><unknown>
  1265. 158.75 s > at <unknown source file>:<unknown line>
  1266. 158.75 s > 13: <std[bcb96dfbba0ab899]::thread::lifecycle::spawn_unchecked<test[75d6903177b1d7e9]::run_test::{closure#1}, ()>::{closure#1} as core[940e698046960fd5]::ops::function::FnOnce<()>>::call_once::{shim:vtable#0}<unknown>
  1267. 158.75 s > at <unknown source file>:<unknown line>
  1268. 158.75 s > 14: <std[bcb96dfbba0ab899]::sys::thread::unix::Thread>::new::thread_start<unknown>
  1269. 158.75 s > at <unknown source file>:<unknown line>
  1270. 158.75 s > 15: start_thread<unknown>
  1271. 158.75 s > at <unknown source file>:<unknown line>
  1272. 158.75 s > 16: __clone3<unknown>
  1273. 158.75 s > at <unknown source file>:<unknown line>
  1274. 158.75 s >
  1275. 158.75 s > Run with COLORBT_SHOW_HIDDEN=1 environment variable to disable frame filtering.
  1276. 158.75 s > Run with RUST_BACKTRACE=full to include source snippets.
  1277. 158.75 s >
  1278. 158.75 s > error: test run failed
  1279. 158.75 s >
  1280. 158.75 s > ========== nextest test summary ==========
  1281. 158.75 s > report: target/nextest/ci_gammaloop/junit.xml
  1282. 158.75 s > tests: 106, failures: 9, errors: 0
  1283. 158.75 s >
  1284. 158.75 s > 1. gammaloop-integration-tests::test_runs::approach::approach_momentum_space_reports_incomplete_triplet_cleanly
  1285. 158.75 s > failure: test failure with exit code 101
  1286. 158.75 s > system-out
  1287. 158.75 s > running 1 test
  1288. 158.75 s > test approach::approach_momentum_space_reports_incomplete_triplet_cleanly ... FAILED
  1289. 158.75 s >
  1290. 158.75 s > failures:
  1291. 158.75 s >
  1292. 158.75 s > failures:
  1293. 158.75 s > approach::approach_momentum_space_reports_incomplete_triplet_cleanly
  1294. 158.75 s >
  1295. 158.75 s > test result: FAILED. 0 passed; 1 failed; 0 ignored; 0 measured; 82 filtered out; finished in 0.93s
  1296. 158.75 s > system-err
  1297. 158.75 s > [2026-08-27 10:10:19.162] @gammaloop_api::se... INFO : Running command import model scalars-default.json
  1298. 158.75 s > [2026-08-27 10:10:19.162] @import::model INFO : Loading built-in JSON model scalars-default
  1299. 158.75 s > [2026-08-27 10:10:19.166] @gammalooprs::model INFO : The following 2 external parameters were forced to zero by the restriction card:
  1300. 158.75 s > width_scalar_1, width_scalar_2
  1301. 158.75 s > [2026-08-27 10:10:19.167] @gammaloop_api::se... INFO : Running command remove processes
  1302. 158.75 s > [2026-08-27 10:10:19.168] @gammaloop_api::se... INFO : Running command generate amp scalar_1 > scalar_0 scalar_0 [{1}] --allowed-vertex-interactions V_3_SCALAR_022 V_3_SCALAR_122 -p triangle -i scalar_tri
  1303. 158.75 s > [2026-08-27 10:10:19.177] @feyngen::diagram_... INFO : 0s | Δ=0s | Starting Feynman graph generation with Symbolica...
  1304. 158.75 s > [2026-08-27 10:10:19.177] @feyngen::diagram_... INFO : 0s | Δ=0s | Number of graphs resulting from Symbolica generation: 1
  1305. 158.75 s > [2026-08-27 10:10:19.184] @feyngen::diagram_... INFO : 0s | Δ=0s | Number of graphs retained after removal of vetoed topologies: 1
  1306. 158.75 s > [2026-08-27 10:10:19.184] @feyngen::diagram_... INFO : 0s | Δ=0s | Number of graphs after vertex info assignment: 1
  1307. 158.75 s > [2026-08-27 10:10:19.184] @feyngen::diagram_... INFO : 0s | Δ=0s | Number of graphs after all complete graphs filters are applied: 1
  1308. 158.75 s > [2026-08-27 10:10:19.188] @feyngen::diagram_... INFO : 0s | Δ=0s | Number of graphs after closed fermion chains analysis: 1
  1309. 158.75 s > [2026-08-27 10:10:19.188] @feyngen::diagram_... INFO : 0s | Δ=0s | Number of graphs after symmetrization of external states: 1
  1310. 158.75 s > [2026-08-27 10:10:19.191] @feyngen::diagram_... INFO : 0s | Δ=0s | Number of graphs after canonization of vertices, edges and flows (graph labels assigned here): 1
  1311. 158.75 s > [2026-08-27 10:10:19.203] @feyngen::diagram_... INFO : 0s | Δ=0s | Number of graphs after numerator-aware grouping with strategy 'up to a scalar rescaling': 1 (1 isomorphically unique graph, 0 color zero, 0 lorentz zero, 0 grouped and 0 cancellation)
  1312. 158.75 s > [2026-08-27 10:10:19.203] @feyngen::diagram_... INFO : ( Sum of the symmetry factors from each graph generated = 1 )
  1313. 158.75 s > [2026-08-27 10:10:19.203] @commands::generate INFO : Generated amplitude 1 graphs.
  1314. 158.75 s > [2026-08-27 10:10:19.235] @settings::runtime WARNING : No external kinematics were provided; using default-generated external momenta and helicities.
  1315. 158.75 s > [2026-08-27 10:10:19.316] @commands::generate INFO :
  1316. 158.75 s > Integrand generation summary
  1317. 158.75 s > peak RAM 66.33 MiB | cores 1
  1318. 158.75 s > ╭────────────┬───────┬─────────┬────────────┬────────────┬────────────────┬─────────────╮
  1319. 158.75 s > │ integrand │ graph │ # evals │ expr build │ spenso │ symbolica eval │ compile │
  1320. 158.75 s > ├────────────┼───────┼─────────┼────────────┼────────────┼────────────────┼─────────────┤
  1321. 158.75 s > │ scalar_tri │ GL0 │ 9 │ 12ms (46%) │ 1ms (6.7%) │ 12ms (47%) │ 0ms (0.00%) │
  1322. 158.75 s > ├────────────┼───────┼─────────┼────────────┼────────────┼────────────────┼─────────────┤
  1323. 158.75 s > │ Total │ │ 9 │ 12ms (46%) │ 1ms (6.7%) │ 12ms (47%) │ 0ms (0.00%) │
  1324. 158.75 s > ╰────────────┴───────┴─────────┴────────────┴────────────┴────────────────┴─────────────╯
  1325. 158.75 s > [2026-08-27 10:10:19.317] @gammaloop_api::se... INFO : Running command generate amp scalar_0 scalar_0 > scalar_0 scalar_0 [{1}] --allowed-vertex-interactions V_3_SCALAR_022 -p box -i scalar_box --select-graphs GL0
  1326. 158.75 s > [2026-08-27 10:10:19.318] @feyngen::diagram_... INFO : 0s | Δ=0s | Starting Feynman graph generation with Symbolica...
  1327. 158.75 s > [2026-08-27 10:10:19.319] @feyngen::diagram_... INFO : 0s | Δ=0s | Number of graphs resulting from Symbolica generation: 3
  1328. 158.75 s > [2026-08-27 10:10:19.319] @feyngen::diagram_... INFO : 0s | Δ=0s | Number of graphs retained after removal of vetoed topologies: 3
  1329. 158.75 s > [2026-08-27 10:10:19.319] @feyngen::diagram_... INFO : 0s | Δ=0s | Number of graphs after vertex info assignment: 3
  1330. 158.75 s > [2026-08-27 10:10:19.319] @feyngen::diagram_... INFO : 0s | Δ=0s | Number of graphs after all complete graphs filters are applied: 3
  1331. 158.75 s > [2026-08-27 10:10:19.319] @feyngen::diagram_... INFO : 0s | Δ=0s | Number of graphs after closed fermion chains analysis: 3
  1332. 158.75 s > [2026-08-27 10:10:19.319] @feyngen::diagram_... INFO : 0s | Δ=0s | Number of graphs after symmetrization of external states: 3
  1333. 158.75 s > [2026-08-27 10:10:19.320] @feyngen::diagram_... INFO : 0s | Δ=0s | Number of graphs after canonization of vertices, edges and flows (graph labels assigned here): 3
  1334. 158.75 s > [2026-08-27 10:10:19.326] @feyngen::diagram_... INFO : 0s | Δ=0s | Number of graphs after numerator-aware grouping with strategy 'up to a scalar rescaling': 1 (1 isomorphically unique graph, 0 color zero, 0 lorentz zero, 0 grouped and 0 cancellation)
  1335. 158.75 s > [2026-08-27 10:10:19.326] @feyngen::diagram_... INFO : ( Sum of the symmetry factors from each graph generated = 1 )
  1336. 158.75 s > [2026-08-27 10:10:19.326] @commands::generate INFO : Generated amplitude 1 graphs.
  1337. 158.75 s > [2026-08-27 10:10:19.580] @settings::runtime WARNING : No external kinematics were provided; using default-generated external momenta and helicities.
  1338. 158.75 s > [2026-08-27 10:10:19.648] @commands::generate INFO :
  1339. 158.75 s > Integrand generation summary
  1340. 158.75 s > peak RAM 69.12 MiB | cores 1
  1341. 158.75 s > ╭────────────┬───────┬─────────┬────────────┬─────────────┬────────────────┬─────────────╮
  1342. 158.75 s > │ integrand │ graph │ # evals │ expr build │ spenso │ symbolica eval │ compile │
  1343. 158.75 s > ├────────────┼───────┼─────────┼────────────┼─────────────┼────────────────┼─────────────┤
  1344. 158.75 s > │ scalar_box │ GL0 │ 13 │ 47ms (19%) │ 13ms (5.5%) │ 187ms (75%) │ 0ms (0.00%) │
  1345. 158.75 s > ├────────────┼───────┼─────────┼────────────┼─────────────┼────────────────┼─────────────┤
  1346. 158.75 s > │ Total │ │ 13 │ 47ms (19%) │ 13ms (5.5%) │ 187ms (75%) │ 0ms (0.00%) │
  1347. 158.75 s > ╰────────────┴───────┴─────────┴────────────┴─────────────┴────────────────┴─────────────╯
  1348. 158.75 s > [2026-08-27 10:10:19.649] @gammaloop_api::se... INFO : Running command generate
  1349. 158.75 s > [2026-08-27 10:10:19.730] @settings::runtime WARNING : No external kinematics were provided; using default-generated external momenta and helicities.
  1350. 158.75 s > [2026-08-27 10:10:19.765] @settings::runtime WARNING : No external kinematics were provided; using default-generated external momenta and helicities.
  1351. 158.75 s > [2026-08-27 10:10:19.858] @commands::generate INFO :
  1352. 158.75 s > Integrand generation summary
  1353. 158.75 s > peak RAM 72.04 MiB | cores 1
  1354. 158.75 s > ╭────────────┬───────┬─────────┬────────────┬────────────┬────────────────┬─────────────╮
  1355. 158.75 s > │ integrand │ graph │ # evals │ expr build │ spenso │ symbolica eval │ compile │
  1356. 158.75 s > ├────────────┼───────┼─────────┼────────────┼────────────┼────────────────┼─────────────┤
  1357. 158.75 s > │ scalar_tri │ GL0 │ 9 │ 26ms (78%) │ 1ms (4.5%) │ 5ms (17%) │ 0ms (0.00%) │
  1358. 158.75 s > │ scalar_box │ GL0 │ 13 │ 43ms (56%) │ 7ms (9.8%) │ 26ms (34%) │ 0ms (0.00%) │
  1359. 158.75 s > ├────────────┼───────┼─────────┼────────────┼────────────┼────────────────┼─────────────┤
  1360. 158.75 s > │ Total │ │ 22 │ 70ms (63%) │ 9ms (8.2%) │ 32ms (29%) │ 0ms (0.00%) │
  1361. 158.75 s > ╰────────────┴───────┴─────────┴────────────┴────────────┴────────────────┴─────────────╯
  1362. 158.75 s > [2026-08-27 10:10:19.859] @gammaloop_api::se... INFO : Running command set model mass_scalar_2=2.0
  1363. 158.75 s > [2026-08-27 10:10:19.860] @gammaloop_api::se... INFO : Running command set model mass_scalar_1=1.0
  1364. 158.75 s > [2026-08-27 10:10:19.862] @gammaloop_api::se... INFO : Running command set process -p triangle -i scalar_tri string '
  1365. 158.75 s > [kinematics.externals]
  1366. 158.75 s > type = "constant"
  1367. 158.75 s >
  1368. 158.75 s > [kinematics.externals.data]
  1369. 158.75 s > [...]
  1370. 158.75 s > [2026-08-27 10:10:19.866] @gammaloop_api::se... INFO : Running command set process -p box -i scalar_box string '
  1371. 158.75 s > [kinematics.externals]
  1372. 158.75 s > type = "constant"
  1373. 158.75 s >
  1374. 158.75 s > [kinematics.externals.data]
  1375. 158.75 s > [...]
  1376. 158.75 s > [2026-08-27 10:10:19.867] @gammaloop_api::se... INFO : Running command approach -x 1.0000000000000001e-1,2.0000000000000001e-1,2.9999999999999999e-1,4.0000000000000002e-1 --approach-axis 1.0000000000000000e-3,0.0000000000000000e0,0.0000000000000000e0,0.0000000000000000e0 --n-points 1 --n-cores 1 --output-results /build/source/tests/artifacts/scalar_box_invalid_momentum_approach/approach_momentum.json --momentum-space --graph-id 0
  1377. 158.75 s > The application panicked (crashed).
  1378. 158.75 s > Message: There are 2 processes available. Please specify a process.
  1379. 158.75 s > Location: tests/tests/test_runs/approach.rs:332
  1380. 158.75 s >
  1381. 158.75 s > ━━━━━━━━━━━━━━━━━━━━━━━━━━━━━━━━━━ BACKTRACE ━━━━━━━━━━━━━━━━━━━━━━━━━━━━━━━━━━━
  1382. 158.75 s > 1: <color_eyre[51793ea62743adbd]::config::PanicHook>::panic_report<unknown>
  1383. 158.75 s > at <unknown source file>:<unknown line>
  1384. 158.75 s > 2: <color_eyre[51793ea62743adbd]::config::PanicHook>::into_panic_hook::{closure#0}<unknown>
  1385. 158.75 s > at <unknown source file>:<unknown line>
  1386. 158.75 s > 3: std[bcb96dfbba0ab899]::panicking::panic_with_hook<unknown>
  1387. 158.75 s > at <unknown source file>:<unknown line>
  1388. 158.75 s > 4: std[bcb96dfbba0ab899]::panicking::panic_handler::{closure#0}<unknown>
  1389. 158.75 s > at <unknown source file>:<unknown line>
  1390. 158.75 s > 5: std[bcb96dfbba0ab899]::sys::backtrace::__rust_end_short_backtrace::<std[bcb96dfbba0ab899]::panicking::panic_handler::{closure#0}, !><unknown>
  1391. 158.75 s > at <unknown source file>:<unknown line>
  1392. 158.75 s > 6: __rustc[6c289b9f9c454d21]::rust_begin_unwind<unknown>
  1393. 158.75 s > at <unknown source file>:<unknown line>
  1394. 158.75 s > 7: core[940e698046960fd5]::panicking::panic_fmt<unknown>
  1395. 158.75 s > at <unknown source file>:<unknown line>
  1396. 158.75 s > 8: test_runs[3e7a390caee4e338]::approach::approach_momentum_space_reports_incomplete_triplet_cleanly<unknown>
  1397. 158.75 s > at <unknown source file>:<unknown line>
  1398. 158.75 s > 9: <test_runs[3e7a390caee4e338]::approach::approach_momentum_space_reports_incomplete_triplet_cleanly::{closure#0} as core[940e698046960fd5]::ops::function::FnOnce<()>>::call_once<unknown>
  1399. 158.75 s > at <unknown source file>:<unknown line>
  1400. 158.75 s > 10: test[75d6903177b1d7e9]::__rust_begin_short_backtrace::<core[940e698046960fd5]::result::Result<(), alloc[2ea6bcb46fca0c42]::string::String>, fn() -> core[940e698046960fd5]::result::Result<(), alloc[2ea6bcb46fca0c42]::string::String>><unknown>
  1401. 158.75 s > at <unknown source file>:<unknown line>
  1402. 158.75 s > 11: test[75d6903177b1d7e9]::run_test::{closure#0}<unknown>
  1403. 158.75 s > at <unknown source file>:<unknown line>
  1404. 158.75 s > 12: std[bcb96dfbba0ab899]::sys::backtrace::__rust_begin_short_backtrace::<test[75d6903177b1d7e9]::run_test::{closure#1}, ()><unknown>
  1405. 158.75 s > at <unknown source file>:<unknown line>
  1406. 158.75 s > 13: <std[bcb96dfbba0ab899]::thread::lifecycle::spawn_unchecked<test[75d6903177b1d7e9]::run_test::{closure#1}, ()>::{closure#1} as core[940e698046960fd5]::ops::function::FnOnce<()>>::call_once::{shim:vtable#0}<unknown>
  1407. 158.75 s > at <unknown source file>:<unknown line>
  1408. 158.75 s > 14: <std[bcb96dfbba0ab899]::sys::thread::unix::Thread>::new::thread_start<unknown>
  1409. 158.75 s > at <unknown source file>:<unknown line>
  1410. 158.75 s > 15: start_thread<unknown>
  1411. 158.75 s > at <unknown source file>:<unknown line>
  1412. 158.75 s > 16: __clone3<unknown>
  1413. 158.75 s > at <unknown source file>:<unknown line>
  1414. 158.75 s >
  1415. 158.75 s > Run with COLORBT_SHOW_HIDDEN=1 environment variable to disable frame filtering.
  1416. 158.75 s > ... omitted 1 more lines; see full nextest output above
  1417. 158.75 s >
  1418. 158.75 s > 2. gammaloop-integration-tests::test_runs::profile_bulk::dotted_bubble_amp_bulk_profile_passes
  1419. 158.75 s > failure: test failure with exit code 101
  1420. 158.75 s > Error:
  1421. 158.75 s > 0: IR profiling requested arbitrary precision but received a quad-precision result
  1422. 158.75 s >
  1423. 158.75 s > Location:
  1424. 158.75 s > crates/gammalooprs/src/integrands/process/ir.rs:2123
  1425. 158.75 s >
  1426. 158.75 s > ━━━━━━━━━━━━━━━━━━━━━━━━━━━━━━━━━━ BACKTRACE ━━━━━━━━━━━━━━━━━━━━━━━━━━━━━━━━━━━
  1427. 158.75 s > 1: <color_eyre[51793ea62743adbd]::config::EyreHook>::into_eyre_hook::{closure#0}<unknown>
  1428. 158.75 s > at <unknown source file>:<unknown line>
  1429. 158.75 s > 2: eyre[cb2fd339c0c40fca]::capture_handler<unknown>
  1430. 158.75 s > at <unknown source file>:<unknown line>
  1431. 158.75 s > 3: eyre[cb2fd339c0c40fca]::private::format_err<unknown>
  1432. 158.75 s > at <unknown source file>:<unknown line>
  1433. 158.75 s > 4: gammalooprs[d7a7c067ebd19583]::integrands::process::ir::evaluate_profile_momentum_point_arb::<gammalooprs[d7a7c067ebd19583]::integrands::process::amplitude::AmplitudeIntegrand><unknown>
  1434. 158.75 s > at <unknown source file>:<unknown line>
  1435. 158.75 s > 5: <gammalooprs[d7a7c067ebd19583]::integrands::process::amplitude::AmplitudeIntegrand>::test_single_ir_limit_impl<unknown>
  1436. 158.75 s > at <unknown source file>:<unknown line>
  1437. 158.75 s > 6: gammalooprs[d7a7c067ebd19583]::integrands::process::ir::run_ir_profile::<gammalooprs[d7a7c067ebd19583]::integrands::process::amplitude::AmplitudeIntegrand, <gammalooprs[d7a7c067ebd19583]::integrands::process::amplitude::AmplitudeIntegrand>::enumerate_ir_limits, <gammalooprs[d7a7c067ebd19583]::integrands::process::amplitude::AmplitudeIntegrand>::graph_cut_definitions, <gammalooprs[d7a7c067ebd19583]::integrands::process::amplitude::AmplitudeIntegrand>::test_single_ir_limit_impl><unknown>
  1438. 158.75 s > at <unknown source file>:<unknown line>
  1439. 158.75 s > 7: <gammalooprs[d7a7c067ebd19583]::integrands::process::amplitude::AmplitudeIntegrand>::test_ir<unknown>
  1440. 158.75 s > at <unknown source file>:<unknown line>
  1441. 158.75 s > 8: <gammaloop_api[92ae732909e47e14]::commands::profile::Profile>::run<unknown>
  1442. 158.75 s > at <unknown source file>:<unknown line>
  1443. 158.75 s > 9: test_runs[3e7a390caee4e338]::profile_bulk::dotted_bubble_amp_bulk_profile_passes<unknown>
  1444. 158.75 s > at <unknown source file>:<unknown line>
  1445. 158.75 s > 10: <test_runs[3e7a390caee4e338]::profile_bulk::dotted_bubble_amp_bulk_profile_passes::{closure#0} as core[940e698046960fd5]::ops::function::FnOnce<()>>::call_once<unknown>
  1446. 158.75 s > at <unknown source file>:<unknown line>
  1447. 158.75 s > 11: test[75d6903177b1d7e9]::__rust_begin_short_backtrace::<core[940e698046960fd5]::result::Result<(), alloc[2ea6bcb46fca0c42]::string::String>, fn() -> core[940e698046960fd5]::result::Result<(), alloc[2ea6bcb46fca0c42]::string::String>><unknown>
  1448. 158.75 s > at <unknown source file>:<unknown line>
  1449. 158.75 s > 12: test[75d6903177b1d7e9]::run_test::{closure#0}<unknown>
  1450. 158.75 s > at <unknown source file>:<unknown line>
  1451. 158.75 s > 13: std[bcb96dfbba0ab899]::sys::backtrace::__rust_begin_short_backtrace::<test[75d6903177b1d7e9]::run_test::{closure#1}, ()><unknown>
  1452. 158.75 s > at <unknown source file>:<unknown line>
  1453. 158.75 s > 14: <std[bcb96dfbba0ab899]::thread::lifecycle::spawn_unchecked<test[75d6903177b1d7e9]::run_test::{closure#1}, ()>::{closure#1} as core[940e698046960fd5]::ops::function::FnOnce<()>>::call_once::{shim:vtable#0}<unknown>
  1454. 158.75 s > at <unknown source file>:<unknown line>
  1455. 158.75 s > 15: <std[bcb96dfbba0ab899]::sys::thread::unix::Thread>::new::thread_start<unknown>
  1456. 158.75 s > at <unknown source file>:<unknown line>
  1457. 158.75 s > 16: start_thread<unknown>
  1458. 158.75 s > at <unknown source file>:<unknown line>
  1459. 158.75 s > 17: __clone3<unknown>
  1460. 158.75 s > at <unknown source file>:<unknown line>
  1461. 158.75 s >
  1462. 158.75 s > Run with COLORBT_SHOW_HIDDEN=1 environment variable to disable frame filtering.
  1463. 158.75 s > Run with RUST_BACKTRACE=full to include source snippets.
  1464. 158.75 s > Warning: SpanTrace capture is Unsupported.
  1465. 158.75 s > Ensure that you've setup a tracing-error ErrorLayer and the semver versions are compatible
  1466. 158.75 s > system-out
  1467. 158.75 s > running 1 test
  1468. 158.75 s > test profile_bulk::dotted_bubble_amp_bulk_profile_passes ... FAILED
  1469. 158.75 s >
  1470. 158.75 s > failures:
  1471. 158.75 s >
  1472. 158.75 s > failures:
  1473. 158.75 s > profile_bulk::dotted_bubble_amp_bulk_profile_passes
  1474. 158.75 s >
  1475. 158.75 s > test result: FAILED. 0 passed; 1 failed; 0 ignored; 0 measured; 82 filtered out; finished in 0.37s
  1476. 158.75 s > system-err
  1477. 158.75 s > [2026-08-27 10:10:21.899] @gammaloop_api::se... INFO : Running command import model ./assets/models/json/scalars/scalars_2p_3p.json
  1478. 158.75 s > [2026-08-27 10:10:21.899] @import::model INFO : Loading JSON model scalars_2p_3p-default from /build/source/assets/models/json/scalars/scalars_2p_3p
  1479. 158.75 s > [2026-08-27 10:10:21.901] @gammaloop_api::se... INFO : Running command import graphs ./tests/resources/graphs/dotted_bubble_amp.dot
  1480. 158.75 s > [2026-08-27 10:10:21.901] @commands::import INFO : Loading graphs from '/build/source/tests/resources/graphs/dotted_bubble_amp.dot'
  1481. 158.75 s > [2026-08-27 10:10:21.904] @gammaloop_api::se... INFO : Running command generate
  1482. 158.75 s > [2026-08-27 10:10:22.014] @commands::generate INFO :
  1483. 158.75 s > Integrand generation summary
  1484. 158.75 s > peak RAM 63.98 MiB | cores 1
  1485. 158.75 s > ╭───────────┬───────────────────┬─────────┬────────────┬────────────┬────────────────┬─────────────╮
  1486. 158.75 s > │ integrand │ graph │ # evals │ expr build │ spenso │ symbolica eval │ compile │
  1487. 158.75 s > ├───────────┼───────────────────┼─────────┼────────────┼────────────┼────────────────┼─────────────┤
  1488. 158.75 s > │ default │ dotted_bubble_amp │ 8 │ 43ms (84%) │ 1ms (2.0%) │ 6ms (13%) │ 0ms (0.00%) │
  1489. 158.75 s > ├───────────┼───────────────────┼─────────┼────────────┼────────────┼────────────────┼─────────────┤
  1490. 158.75 s > │ Total │ │ 8 │ 43ms (84%) │ 1ms (2.0%) │ 6ms (13%) │ 0ms (0.00%) │
  1491. 158.75 s > ╰───────────┴───────────────────┴─────────┴────────────┴────────────┴────────────────┴─────────────╯
  1492. 158.75 s > [2026-08-27 10:10:22.015] @process::amplitude INFO : Input is above threshold: 1 existing threshold E-surfaces across 1/1 graph groups
  1493. 158.75 s > [2026-08-27 10:10:22.015] @process::amplitude INFO : overlap structure of group 0: [1: [1(1,3)]]
  1494. 158.75 s > Error:
  1495. 158.75 s > 0: IR profiling requested arbitrary precision but received a quad-precision result
  1496. 158.75 s >
  1497. 158.75 s > Location:
  1498. 158.75 s > crates/gammalooprs/src/integrands/process/ir.rs:2123
  1499. 158.75 s >
  1500. 158.75 s > ━━━━━━━━━━━━━━━━━━━━━━━━━━━━━━━━━━ BACKTRACE ━━━━━━━━━━━━━━━━━━━━━━━━━━━━━━━━━━━
  1501. 158.75 s > 1: <color_eyre[51793ea62743adbd]::config::EyreHook>::into_eyre_hook::{closure#0}<unknown>
  1502. 158.75 s > at <unknown source file>:<unknown line>
  1503. 158.75 s > 2: eyre[cb2fd339c0c40fca]::capture_handler<unknown>
  1504. 158.75 s > at <unknown source file>:<unknown line>
  1505. 158.75 s > 3: eyre[cb2fd339c0c40fca]::private::format_err<unknown>
  1506. 158.75 s > at <unknown source file>:<unknown line>
  1507. 158.75 s > 4: gammalooprs[d7a7c067ebd19583]::integrands::process::ir::evaluate_profile_momentum_point_arb::<gammalooprs[d7a7c067ebd19583]::integrands::process::amplitude::AmplitudeIntegrand><unknown>
  1508. 158.75 s > at <unknown source file>:<unknown line>
  1509. 158.75 s > 5: <gammalooprs[d7a7c067ebd19583]::integrands::process::amplitude::AmplitudeIntegrand>::test_single_ir_limit_impl<unknown>
  1510. 158.75 s > at <unknown source file>:<unknown line>
  1511. 158.75 s > 6: gammalooprs[d7a7c067ebd19583]::integrands::process::ir::run_ir_profile::<gammalooprs[d7a7c067ebd19583]::integrands::process::amplitude::AmplitudeIntegrand, <gammalooprs[d7a7c067ebd19583]::integrands::process::amplitude::AmplitudeIntegrand>::enumerate_ir_limits, <gammalooprs[d7a7c067ebd19583]::integrands::process::amplitude::AmplitudeIntegrand>::graph_cut_definitions, <gammalooprs[d7a7c067ebd19583]::integrands::process::amplitude::AmplitudeIntegrand>::test_single_ir_limit_impl><unknown>
  1512. 158.75 s > at <unknown source file>:<unknown line>
  1513. 158.75 s > 7: <gammalooprs[d7a7c067ebd19583]::integrands::process::amplitude::AmplitudeIntegrand>::test_ir<unknown>
  1514. 158.75 s > at <unknown source file>:<unknown line>
  1515. 158.75 s > 8: <gammaloop_api[92ae732909e47e14]::commands::profile::Profile>::run<unknown>
  1516. 158.75 s > at <unknown source file>:<unknown line>
  1517. 158.75 s > 9: test_runs[3e7a390caee4e338]::profile_bulk::dotted_bubble_amp_bulk_profile_passes<unknown>
  1518. 158.75 s > at <unknown source file>:<unknown line>
  1519. 158.75 s > 10: <test_runs[3e7a390caee4e338]::profile_bulk::dotted_bubble_amp_bulk_profile_passes::{closure#0} as core[940e698046960fd5]::ops::function::FnOnce<()>>::call_once<unknown>
  1520. 158.75 s > at <unknown source file>:<unknown line>
  1521. 158.75 s > 11: test[75d6903177b1d7e9]::__rust_begin_short_backtrace::<core[940e698046960fd5]::result::Result<(), alloc[2ea6bcb46fca0c42]::string::String>, fn() -> core[940e698046960fd5]::result::Result<(), alloc[2ea6bcb46fca0c42]::string::String>><unknown>
  1522. 158.75 s > at <unknown source file>:<unknown line>
  1523. 158.75 s > 12: test[75d6903177b1d7e9]::run_test::{closure#0}<unknown>
  1524. 158.75 s > at <unknown source file>:<unknown line>
  1525. 158.75 s > 13: std[bcb96dfbba0ab899]::sys::backtrace::__rust_begin_short_backtrace::<test[75d6903177b1d7e9]::run_test::{closure#1}, ()><unknown>
  1526. 158.75 s > at <unknown source file>:<unknown line>
  1527. 158.75 s > 14: <std[bcb96dfbba0ab899]::thread::lifecycle::spawn_unchecked<test[75d6903177b1d7e9]::run_test::{closure#1}, ()>::{closure#1} as core[940e698046960fd5]::ops::function::FnOnce<()>>::call_once::{shim:vtable#0}<unknown>
  1528. 158.75 s > at <unknown source file>:<unknown line>
  1529. 158.75 s > 15: <std[bcb96dfbba0ab899]::sys::thread::unix::Thread>::new::thread_start<unknown>
  1530. 158.75 s > at <unknown source file>:<unknown line>
  1531. 158.75 s > 16: start_thread<unknown>
  1532. 158.75 s > at <unknown source file>:<unknown line>
  1533. 158.75 s > 17: __clone3<unknown>
  1534. 158.75 s > at <unknown source file>:<unknown line>
  1535. 158.75 s >
  1536. 158.75 s > Run with COLORBT_SHOW_HIDDEN=1 environment variable to disable frame filtering.
  1537. 158.75 s > Run with RUST_BACKTRACE=full to include source snippets.
  1538. 158.75 s > Warning: SpanTrace capture is Unsupported.
  1539. 158.75 s > Ensure that you've setup a tracing-error ErrorLayer and the semver versions are compatible
  1540. 158.75 s >
  1541. 158.75 s > 3. gammaloop-integration-tests::test_runs::profile_bulk::double_dotted_bubble_amp_bulk_profile_passes
  1542. 158.75 s > failure: test failure with exit code 101
  1543. 158.75 s > Error:
  1544. 158.75 s > 0: IR profiling requested arbitrary precision but received a quad-precision result
  1545. 158.75 s >
  1546. 158.75 s > Location:
  1547. 158.75 s > crates/gammalooprs/src/integrands/process/ir.rs:2123
  1548. 158.75 s >
  1549. 158.75 s > ━━━━━━━━━━━━━━━━━━━━━━━━━━━━━━━━━━ BACKTRACE ━━━━━━━━━━━━━━━━━━━━━━━━━━━━━━━━━━━
  1550. 158.75 s > 1: <color_eyre[51793ea62743adbd]::config::EyreHook>::into_eyre_hook::{closure#0}<unknown>
  1551. 158.75 s > at <unknown source file>:<unknown line>
  1552. 158.75 s > 2: eyre[cb2fd339c0c40fca]::capture_handler<unknown>
  1553. 158.75 s > at <unknown source file>:<unknown line>
  1554. 158.75 s > 3: eyre[cb2fd339c0c40fca]::private::format_err<unknown>
  1555. 158.75 s > at <unknown source file>:<unknown line>
  1556. 158.75 s > 4: gammalooprs[d7a7c067ebd19583]::integrands::process::ir::evaluate_profile_momentum_point_arb::<gammalooprs[d7a7c067ebd19583]::integrands::process::amplitude::AmplitudeIntegrand><unknown>
  1557. 158.75 s > at <unknown source file>:<unknown line>
  1558. 158.75 s > 5: <gammalooprs[d7a7c067ebd19583]::integrands::process::amplitude::AmplitudeIntegrand>::test_single_ir_limit_impl<unknown>
  1559. 158.75 s > at <unknown source file>:<unknown line>
  1560. 158.75 s > 6: gammalooprs[d7a7c067ebd19583]::integrands::process::ir::run_ir_profile::<gammalooprs[d7a7c067ebd19583]::integrands::process::amplitude::AmplitudeIntegrand, <gammalooprs[d7a7c067ebd19583]::integrands::process::amplitude::AmplitudeIntegrand>::enumerate_ir_limits, <gammalooprs[d7a7c067ebd19583]::integrands::process::amplitude::AmplitudeIntegrand>::graph_cut_definitions, <gammalooprs[d7a7c067ebd19583]::integrands::process::amplitude::AmplitudeIntegrand>::test_single_ir_limit_impl><unknown>
  1561. 158.75 s > at <unknown source file>:<unknown line>
  1562. 158.75 s > 7: <gammalooprs[d7a7c067ebd19583]::integrands::process::amplitude::AmplitudeIntegrand>::test_ir<unknown>
  1563. 158.75 s > at <unknown source file>:<unknown line>
  1564. 158.75 s > 8: <gammaloop_api[92ae732909e47e14]::commands::profile::Profile>::run<unknown>
  1565. 158.75 s > at <unknown source file>:<unknown line>
  1566. 158.75 s > 9: test_runs[3e7a390caee4e338]::profile_bulk::double_dotted_bubble_amp_bulk_profile_passes<unknown>
  1567. 158.75 s > at <unknown source file>:<unknown line>
  1568. 158.75 s > 10: <test_runs[3e7a390caee4e338]::profile_bulk::double_dotted_bubble_amp_bulk_profile_passes::{closure#0} as core[940e698046960fd5]::ops::function::FnOnce<()>>::call_once<unknown>
  1569. 158.75 s > at <unknown source file>:<unknown line>
  1570. 158.75 s > 11: test[75d6903177b1d7e9]::__rust_begin_short_backtrace::<core[940e698046960fd5]::result::Result<(), alloc[2ea6bcb46fca0c42]::string::String>, fn() -> core[940e698046960fd5]::result::Result<(), alloc[2ea6bcb46fca0c42]::string::String>><unknown>
  1571. 158.75 s > at <unknown source file>:<unknown line>
  1572. 158.75 s > 12: test[75d6903177b1d7e9]::run_test::{closure#0}<unknown>
  1573. 158.75 s > at <unknown source file>:<unknown line>
  1574. 158.75 s > 13: std[bcb96dfbba0ab899]::sys::backtrace::__rust_begin_short_backtrace::<test[75d6903177b1d7e9]::run_test::{closure#1}, ()><unknown>
  1575. 158.75 s > at <unknown source file>:<unknown line>
  1576. 158.75 s > 14: <std[bcb96dfbba0ab899]::thread::lifecycle::spawn_unchecked<test[75d6903177b1d7e9]::run_test::{closure#1}, ()>::{closure#1} as core[940e698046960fd5]::ops::function::FnOnce<()>>::call_once::{shim:vtable#0}<unknown>
  1577. 158.75 s > at <unknown source file>:<unknown line>
  1578. 158.75 s > 15: <std[bcb96dfbba0ab899]::sys::thread::unix::Thread>::new::thread_start<unknown>
  1579. 158.75 s > at <unknown source file>:<unknown line>
  1580. 158.75 s > 16: start_thread<unknown>
  1581. 158.75 s > at <unknown source file>:<unknown line>
  1582. 158.75 s > 17: __clone3<unknown>
  1583. 158.75 s > at <unknown source file>:<unknown line>
  1584. 158.75 s >
  1585. 158.75 s > Run with COLORBT_SHOW_HIDDEN=1 environment variable to disable frame filtering.
  1586. 158.75 s > Run with RUST_BACKTRACE=full to include source snippets.
  1587. 158.75 s > Warning: SpanTrace capture is Unsupported.
  1588. 158.75 s > Ensure that you've setup a tracing-error ErrorLayer and the semver versions are compatible
  1589. 158.75 s > system-out
  1590. 158.75 s > running 1 test
  1591. 158.75 s > test profile_bulk::double_dotted_bubble_amp_bulk_profile_passes ... FAILED
  1592. 158.75 s >
  1593. 158.75 s > failures:
  1594. 158.75 s >
  1595. 158.75 s > failures:
  1596. 158.75 s > profile_bulk::double_dotted_bubble_amp_bulk_profile_passes
  1597. 158.75 s >
  1598. 158.75 s > test result: FAILED. 0 passed; 1 failed; 0 ignored; 0 measured; 82 filtered out; finished in 0.37s
  1599. 158.75 s > system-err
  1600. 158.75 s > [2026-08-27 10:10:21.873] @gammaloop_api::se... INFO : Running command import model ./assets/models/json/scalars/scalars_2p_3p.json
  1601. 158.75 s > [2026-08-27 10:10:21.873] @import::model INFO : Loading JSON model scalars_2p_3p-default from /build/source/assets/models/json/scalars/scalars_2p_3p
  1602. 158.75 s > [2026-08-27 10:10:21.881] @gammaloop_api::se... INFO : Running command import graphs ./tests/resources/graphs/double_dotted_bubble_amp.dot
  1603. 158.75 s > [2026-08-27 10:10:21.881] @commands::import INFO : Loading graphs from '/build/source/tests/resources/graphs/double_dotted_bubble_amp.dot'
  1604. 158.75 s > [2026-08-27 10:10:21.900] @gammaloop_api::se... INFO : Running command generate
  1605. 158.75 s > [2026-08-27 10:10:22.025] @commands::generate INFO :
  1606. 158.75 s > Integrand generation summary
  1607. 158.75 s > peak RAM 64.18 MiB | cores 1
  1608. 158.75 s > ╭───────────┬──────────────────────────┬─────────┬────────────┬────────────┬────────────────┬─────────────╮
  1609. 158.75 s > │ integrand │ graph │ # evals │ expr build │ spenso │ symbolica eval │ compile │
  1610. 158.75 s > ├───────────┼──────────────────────────┼─────────┼────────────┼────────────┼────────────────┼─────────────┤
  1611. 158.75 s > │ default │ double_dotted_bubble_amp │ 11 │ 31ms (46%) │ 5ms (8.2%) │ 31ms (45%) │ 0ms (0.00%) │
  1612. 158.75 s > ├───────────┼──────────────────────────┼─────────┼────────────┼────────────┼────────────────┼─────────────┤
  1613. 158.75 s > │ Total │ │ 11 │ 31ms (46%) │ 5ms (8.2%) │ 31ms (45%) │ 0ms (0.00%) │
  1614. 158.75 s > ╰───────────┴──────────────────────────┴─────────┴────────────┴────────────┴────────────────┴─────────────╯
  1615. 158.75 s > [2026-08-27 10:10:22.026] @process::amplitude INFO : Input is above threshold: 1 existing threshold E-surfaces across 1/1 graph groups
  1616. 158.75 s > [2026-08-27 10:10:22.027] @process::amplitude INFO : overlap structure of group 0: [1: [1(1,4)]]
  1617. 158.75 s > Error:
  1618. 158.75 s > 0: IR profiling requested arbitrary precision but received a quad-precision result
  1619. 158.75 s >
  1620. 158.75 s > Location:
  1621. 158.75 s > crates/gammalooprs/src/integrands/process/ir.rs:2123
  1622. 158.75 s >
  1623. 158.75 s > ━━━━━━━━━━━━━━━━━━━━━━━━━━━━━━━━━━ BACKTRACE ━━━━━━━━━━━━━━━━━━━━━━━━━━━━━━━━━━━
  1624. 158.75 s > 1: <color_eyre[51793ea62743adbd]::config::EyreHook>::into_eyre_hook::{closure#0}<unknown>
  1625. 158.75 s > at <unknown source file>:<unknown line>
  1626. 158.75 s > 2: eyre[cb2fd339c0c40fca]::capture_handler<unknown>
  1627. 158.75 s > at <unknown source file>:<unknown line>
  1628. 158.75 s > 3: eyre[cb2fd339c0c40fca]::private::format_err<unknown>
  1629. 158.75 s > at <unknown source file>:<unknown line>
  1630. 158.75 s > 4: gammalooprs[d7a7c067ebd19583]::integrands::process::ir::evaluate_profile_momentum_point_arb::<gammalooprs[d7a7c067ebd19583]::integrands::process::amplitude::AmplitudeIntegrand><unknown>
  1631. 158.75 s > at <unknown source file>:<unknown line>
  1632. 158.75 s > 5: <gammalooprs[d7a7c067ebd19583]::integrands::process::amplitude::AmplitudeIntegrand>::test_single_ir_limit_impl<unknown>
  1633. 158.75 s > at <unknown source file>:<unknown line>
  1634. 158.75 s > 6: gammalooprs[d7a7c067ebd19583]::integrands::process::ir::run_ir_profile::<gammalooprs[d7a7c067ebd19583]::integrands::process::amplitude::AmplitudeIntegrand, <gammalooprs[d7a7c067ebd19583]::integrands::process::amplitude::AmplitudeIntegrand>::enumerate_ir_limits, <gammalooprs[d7a7c067ebd19583]::integrands::process::amplitude::AmplitudeIntegrand>::graph_cut_definitions, <gammalooprs[d7a7c067ebd19583]::integrands::process::amplitude::AmplitudeIntegrand>::test_single_ir_limit_impl><unknown>
  1635. 158.75 s > at <unknown source file>:<unknown line>
  1636. 158.75 s > 7: <gammalooprs[d7a7c067ebd19583]::integrands::process::amplitude::AmplitudeIntegrand>::test_ir<unknown>
  1637. 158.75 s > at <unknown source file>:<unknown line>
  1638. 158.75 s > 8: <gammaloop_api[92ae732909e47e14]::commands::profile::Profile>::run<unknown>
  1639. 158.75 s > at <unknown source file>:<unknown line>
  1640. 158.75 s > 9: test_runs[3e7a390caee4e338]::profile_bulk::double_dotted_bubble_amp_bulk_profile_passes<unknown>
  1641. 158.75 s > at <unknown source file>:<unknown line>
  1642. 158.75 s > 10: <test_runs[3e7a390caee4e338]::profile_bulk::double_dotted_bubble_amp_bulk_profile_passes::{closure#0} as core[940e698046960fd5]::ops::function::FnOnce<()>>::call_once<unknown>
  1643. 158.75 s > at <unknown source file>:<unknown line>
  1644. 158.75 s > 11: test[75d6903177b1d7e9]::__rust_begin_short_backtrace::<core[940e698046960fd5]::result::Result<(), alloc[2ea6bcb46fca0c42]::string::String>, fn() -> core[940e698046960fd5]::result::Result<(), alloc[2ea6bcb46fca0c42]::string::String>><unknown>
  1645. 158.75 s > at <unknown source file>:<unknown line>
  1646. 158.75 s > 12: test[75d6903177b1d7e9]::run_test::{closure#0}<unknown>
  1647. 158.75 s > at <unknown source file>:<unknown line>
  1648. 158.75 s > 13: std[bcb96dfbba0ab899]::sys::backtrace::__rust_begin_short_backtrace::<test[75d6903177b1d7e9]::run_test::{closure#1}, ()><unknown>
  1649. 158.75 s > at <unknown source file>:<unknown line>
  1650. 158.75 s > 14: <std[bcb96dfbba0ab899]::thread::lifecycle::spawn_unchecked<test[75d6903177b1d7e9]::run_test::{closure#1}, ()>::{closure#1} as core[940e698046960fd5]::ops::function::FnOnce<()>>::call_once::{shim:vtable#0}<unknown>
  1651. 158.75 s > at <unknown source file>:<unknown line>
  1652. 158.75 s > 15: <std[bcb96dfbba0ab899]::sys::thread::unix::Thread>::new::thread_start<unknown>
  1653. 158.75 s > at <unknown source file>:<unknown line>
  1654. 158.75 s > 16: start_thread<unknown>
  1655. 158.75 s > at <unknown source file>:<unknown line>
  1656. 158.75 s > 17: __clone3<unknown>
  1657. 158.75 s > at <unknown source file>:<unknown line>
  1658. 158.75 s >
  1659. 158.75 s > Run with COLORBT_SHOW_HIDDEN=1 environment variable to disable frame filtering.
  1660. 158.75 s > Run with RUST_BACKTRACE=full to include source snippets.
  1661. 158.75 s > Warning: SpanTrace capture is Unsupported.
  1662. 158.75 s > Ensure that you've setup a tracing-error ErrorLayer and the semver versions are compatible
  1663. 158.75 s >
  1664. 158.75 s > 4. gammaloop-integration-tests::test_runs::profile_bulk::box_4e_bulk_profile_passes
  1665. 158.75 s > failure: test failure with exit code 101
  1666. 158.75 s > Error:
  1667. 158.75 s > 0: IR profiling requested arbitrary precision but received a quad-precision result
  1668. 158.75 s >
  1669. 158.75 s > Location:
  1670. 158.75 s > crates/gammalooprs/src/integrands/process/ir.rs:2123
  1671. 158.75 s >
  1672. 158.75 s > ━━━━━━━━━━━━━━━━━━━━━━━━━━━━━━━━━━ BACKTRACE ━━━━━━━━━━━━━━━━━━━━━━━━━━━━━━━━━━━
  1673. 158.75 s > 1: <color_eyre[51793ea62743adbd]::config::EyreHook>::into_eyre_hook::{closure#0}<unknown>
  1674. 158.75 s > at <unknown source file>:<unknown line>
  1675. 158.75 s > 2: eyre[cb2fd339c0c40fca]::capture_handler<unknown>
  1676. 158.75 s > at <unknown source file>:<unknown line>
  1677. 158.75 s > 3: eyre[cb2fd339c0c40fca]::private::format_err<unknown>
  1678. 158.75 s > at <unknown source file>:<unknown line>
  1679. 158.75 s > 4: gammalooprs[d7a7c067ebd19583]::integrands::process::ir::evaluate_profile_momentum_point_arb::<gammalooprs[d7a7c067ebd19583]::integrands::process::amplitude::AmplitudeIntegrand><unknown>
  1680. 158.75 s > at <unknown source file>:<unknown line>
  1681. 158.75 s > 5: <gammalooprs[d7a7c067ebd19583]::integrands::process::amplitude::AmplitudeIntegrand>::test_single_ir_limit_impl<unknown>
  1682. 158.75 s > at <unknown source file>:<unknown line>
  1683. 158.75 s > 6: gammalooprs[d7a7c067ebd19583]::integrands::process::ir::run_ir_profile::<gammalooprs[d7a7c067ebd19583]::integrands::process::amplitude::AmplitudeIntegrand, <gammalooprs[d7a7c067ebd19583]::integrands::process::amplitude::AmplitudeIntegrand>::enumerate_ir_limits, <gammalooprs[d7a7c067ebd19583]::integrands::process::amplitude::AmplitudeIntegrand>::graph_cut_definitions, <gammalooprs[d7a7c067ebd19583]::integrands::process::amplitude::AmplitudeIntegrand>::test_single_ir_limit_impl><unknown>
  1684. 158.75 s > at <unknown source file>:<unknown line>
  1685. 158.75 s > 7: <gammalooprs[d7a7c067ebd19583]::integrands::process::amplitude::AmplitudeIntegrand>::test_ir<unknown>
  1686. 158.75 s > at <unknown source file>:<unknown line>
  1687. 158.75 s > 8: <gammaloop_api[92ae732909e47e14]::commands::profile::Profile>::run<unknown>
  1688. 158.75 s > at <unknown source file>:<unknown line>
  1689. 158.75 s > 9: test_runs[3e7a390caee4e338]::profile_bulk::box_4e_bulk_profile_passes<unknown>
  1690. 158.75 s > at <unknown source file>:<unknown line>
  1691. 158.75 s > 10: <test_runs[3e7a390caee4e338]::profile_bulk::box_4e_bulk_profile_passes::{closure#0} as core[940e698046960fd5]::ops::function::FnOnce<()>>::call_once<unknown>
  1692. 158.75 s > at <unknown source file>:<unknown line>
  1693. 158.75 s > 11: test[75d6903177b1d7e9]::__rust_begin_short_backtrace::<core[940e698046960fd5]::result::Result<(), alloc[2ea6bcb46fca0c42]::string::String>, fn() -> core[940e698046960fd5]::result::Result<(), alloc[2ea6bcb46fca0c42]::string::String>><unknown>
  1694. 158.75 s > at <unknown source file>:<unknown line>
  1695. 158.75 s > 12: test[75d6903177b1d7e9]::run_test::{closure#0}<unknown>
  1696. 158.75 s > at <unknown source file>:<unknown line>
  1697. 158.75 s > 13: std[bcb96dfbba0ab899]::sys::backtrace::__rust_begin_short_backtrace::<test[75d6903177b1d7e9]::run_test::{closure#1}, ()><unknown>
  1698. 158.75 s > at <unknown source file>:<unknown line>
  1699. 158.75 s > 14: <std[bcb96dfbba0ab899]::thread::lifecycle::spawn_unchecked<test[75d6903177b1d7e9]::run_test::{closure#1}, ()>::{closure#1} as core[940e698046960fd5]::ops::function::FnOnce<()>>::call_once::{shim:vtable#0}<unknown>
  1700. 158.75 s > at <unknown source file>:<unknown line>
  1701. 158.75 s > 15: <std[bcb96dfbba0ab899]::sys::thread::unix::Thread>::new::thread_start<unknown>
  1702. 158.75 s > at <unknown source file>:<unknown line>
  1703. 158.75 s > 16: start_thread<unknown>
  1704. 158.75 s > at <unknown source file>:<unknown line>
  1705. 158.75 s > 17: __clone3<unknown>
  1706. 158.75 s > at <unknown source file>:<unknown line>
  1707. 158.75 s >
  1708. 158.75 s > Run with COLORBT_SHOW_HIDDEN=1 environment variable to disable frame filtering.
  1709. 158.75 s > Run with RUST_BACKTRACE=full to include source snippets.
  1710. 158.75 s > Warning: SpanTrace capture is Unsupported.
  1711. 158.75 s > Ensure that you've setup a tracing-error ErrorLayer and the semver versions are compatible
  1712. 158.75 s > system-out
  1713. 158.75 s > running 1 test
  1714. 158.75 s > test profile_bulk::box_4e_bulk_profile_passes ... FAILED
  1715. 158.75 s >
  1716. 158.75 s > failures:
  1717. 158.75 s >
  1718. 158.75 s > failures:
  1719. 158.75 s > profile_bulk::box_4e_bulk_profile_passes
  1720. 158.75 s >
  1721. 158.75 s > test result: FAILED. 0 passed; 1 failed; 0 ignored; 0 measured; 82 filtered out; finished in 0.49s
  1722. 158.75 s > system-err
  1723. 158.75 s > [2026-08-27 10:10:21.981] @gammaloop_api::se... INFO : Running command import model ./assets/models/json/scalars/scalars.json
  1724. 158.75 s > [2026-08-27 10:10:21.981] @import::model INFO : Loading JSON model scalars-default from /build/source/assets/models/json/scalars/scalars
  1725. 158.75 s > [2026-08-27 10:10:21.988] @gammalooprs::model INFO : The following 2 external parameters were forced to zero by the restriction card:
  1726. 158.75 s > width_scalar_1, width_scalar_2
  1727. 158.75 s > [2026-08-27 10:10:21.989] @gammaloop_api::se... INFO : Running command import graphs ./tests/resources/graphs/massless_box.dot
  1728. 158.75 s > [2026-08-27 10:10:21.990] @commands::import INFO : Loading graphs from '/build/source/tests/resources/graphs/massless_box.dot'
  1729. 158.75 s > [2026-08-27 10:10:21.999] @gammaloop_api::se... INFO : Running command generate
  1730. 158.75 s > [2026-08-27 10:10:22.110] @commands::generate INFO :
  1731. 158.75 s > Integrand generation summary
  1732. 158.75 s > peak RAM 64.29 MiB | cores 1
  1733. 158.75 s > ╭───────────┬────────────────┬─────────┬────────────┬────────────┬────────────────┬─────────────╮
  1734. 158.75 s > │ integrand │ graph │ # evals │ expr build │ spenso │ symbolica eval │ compile │
  1735. 158.75 s > ├───────────┼────────────────┼─────────┼────────────┼────────────┼────────────────┼─────────────┤
  1736. 158.75 s > │ default │ massless_box_0 │ 14 │ 71ms (72%) │ 18ms (19%) │ 8ms (8.8%) │ 0ms (0.00%) │
  1737. 158.75 s > ├───────────┼────────────────┼─────────┼────────────┼────────────┼────────────────┼─────────────┤
  1738. 158.75 s > │ Total │ │ 14 │ 71ms (72%) │ 18ms (19%) │ 8ms (8.8%) │ 0ms (0.00%) │
  1739. 158.75 s > ╰───────────┴────────────────┴─────────┴────────────┴────────────┴────────────────┴─────────────╯
  1740. 158.75 s > [2026-08-27 10:10:22.113] @process::amplitude INFO : Input is above threshold: 4 existing threshold E-surfaces across 1/1 graph groups
  1741. 158.75 s > [2026-08-27 10:10:22.114] @process::amplitude INFO : overlap structure of group 0: [2: [4(3,4), 8(4,6)], 2: [8(4,6), 11(5,6)], 2: [4(3,4), 9(3,5)], 2: [9(3,5), 11(5,6)]]
  1742. 158.75 s > Error:
  1743. 158.75 s > 0: IR profiling requested arbitrary precision but received a quad-precision result
  1744. 158.75 s >
  1745. 158.75 s > Location:
  1746. 158.75 s > crates/gammalooprs/src/integrands/process/ir.rs:2123
  1747. 158.75 s >
  1748. 158.75 s > ━━━━━━━━━━━━━━━━━━━━━━━━━━━━━━━━━━ BACKTRACE ━━━━━━━━━━━━━━━━━━━━━━━━━━━━━━━━━━━
  1749. 158.75 s > 1: <color_eyre[51793ea62743adbd]::config::EyreHook>::into_eyre_hook::{closure#0}<unknown>
  1750. 158.75 s > at <unknown source file>:<unknown line>
  1751. 158.75 s > 2: eyre[cb2fd339c0c40fca]::capture_handler<unknown>
  1752. 158.75 s > at <unknown source file>:<unknown line>
  1753. 158.75 s > 3: eyre[cb2fd339c0c40fca]::private::format_err<unknown>
  1754. 158.75 s > at <unknown source file>:<unknown line>
  1755. 158.75 s > 4: gammalooprs[d7a7c067ebd19583]::integrands::process::ir::evaluate_profile_momentum_point_arb::<gammalooprs[d7a7c067ebd19583]::integrands::process::amplitude::AmplitudeIntegrand><unknown>
  1756. 158.75 s > at <unknown source file>:<unknown line>
  1757. 158.75 s > 5: <gammalooprs[d7a7c067ebd19583]::integrands::process::amplitude::AmplitudeIntegrand>::test_single_ir_limit_impl<unknown>
  1758. 158.75 s > at <unknown source file>:<unknown line>
  1759. 158.75 s > 6: gammalooprs[d7a7c067ebd19583]::integrands::process::ir::run_ir_profile::<gammalooprs[d7a7c067ebd19583]::integrands::process::amplitude::AmplitudeIntegrand, <gammalooprs[d7a7c067ebd19583]::integrands::process::amplitude::AmplitudeIntegrand>::enumerate_ir_limits, <gammalooprs[d7a7c067ebd19583]::integrands::process::amplitude::AmplitudeIntegrand>::graph_cut_definitions, <gammalooprs[d7a7c067ebd19583]::integrands::process::amplitude::AmplitudeIntegrand>::test_single_ir_limit_impl><unknown>
  1760. 158.75 s > at <unknown source file>:<unknown line>
  1761. 158.75 s > 7: <gammalooprs[d7a7c067ebd19583]::integrands::process::amplitude::AmplitudeIntegrand>::test_ir<unknown>
  1762. 158.75 s > at <unknown source file>:<unknown line>
  1763. 158.75 s > 8: <gammaloop_api[92ae732909e47e14]::commands::profile::Profile>::run<unknown>
  1764. 158.75 s > at <unknown source file>:<unknown line>
  1765. 158.75 s > 9: test_runs[3e7a390caee4e338]::profile_bulk::box_4e_bulk_profile_passes<unknown>
  1766. 158.75 s > at <unknown source file>:<unknown line>
  1767. 158.75 s > 10: <test_runs[3e7a390caee4e338]::profile_bulk::box_4e_bulk_profile_passes::{closure#0} as core[940e698046960fd5]::ops::function::FnOnce<()>>::call_once<unknown>
  1768. 158.75 s > at <unknown source file>:<unknown line>
  1769. 158.75 s > 11: test[75d6903177b1d7e9]::__rust_begin_short_backtrace::<core[940e698046960fd5]::result::Result<(), alloc[2ea6bcb46fca0c42]::string::String>, fn() -> core[940e698046960fd5]::result::Result<(), alloc[2ea6bcb46fca0c42]::string::String>><unknown>
  1770. 158.75 s > at <unknown source file>:<unknown line>
  1771. 158.75 s > 12: test[75d6903177b1d7e9]::run_test::{closure#0}<unknown>
  1772. 158.75 s > at <unknown source file>:<unknown line>
  1773. 158.75 s > 13: std[bcb96dfbba0ab899]::sys::backtrace::__rust_begin_short_backtrace::<test[75d6903177b1d7e9]::run_test::{closure#1}, ()><unknown>
  1774. 158.75 s > at <unknown source file>:<unknown line>
  1775. 158.75 s > 14: <std[bcb96dfbba0ab899]::thread::lifecycle::spawn_unchecked<test[75d6903177b1d7e9]::run_test::{closure#1}, ()>::{closure#1} as core[940e698046960fd5]::ops::function::FnOnce<()>>::call_once::{shim:vtable#0}<unknown>
  1776. 158.75 s > at <unknown source file>:<unknown line>
  1777. 158.75 s > 15: <std[bcb96dfbba0ab899]::sys::thread::unix::Thread>::new::thread_start<unknown>
  1778. 158.75 s > at <unknown source file>:<unknown line>
  1779. 158.75 s > 16: start_thread<unknown>
  1780. 158.75 s > at <unknown source file>:<unknown line>
  1781. 158.75 s > 17: __clone3<unknown>
  1782. 158.75 s > at <unknown source file>:<unknown line>
  1783. 158.75 s >
  1784. 158.75 s > Run with COLORBT_SHOW_HIDDEN=1 environment variable to disable frame filtering.
  1785. 158.75 s > Run with RUST_BACKTRACE=full to include source snippets.
  1786. 158.75 s > Warning: SpanTrace capture is Unsupported.
  1787. 158.75 s > Ensure that you've setup a tracing-error ErrorLayer and the semver versions are compatible
  1788. 158.75 s >
  1789. 158.75 s > 5. gammaloop-integration-tests::test_runs::profile_bulk::massless_triangle_bulk_profile_passes
  1790. 158.75 s > failure: test failure with exit code 101
  1791. 158.75 s > Error:
  1792. 158.75 s > 0: IR profiling requested arbitrary precision but received a quad-precision result
  1793. 158.75 s >
  1794. 158.75 s > Location:
  1795. 158.75 s > crates/gammalooprs/src/integrands/process/ir.rs:2123
  1796. 158.75 s >
  1797. 158.75 s > ━━━━━━━━━━━━━━━━━━━━━━━━━━━━━━━━━━ BACKTRACE ━━━━━━━━━━━━━━━━━━━━━━━━━━━━━━━━━━━
  1798. 158.75 s > 1: <color_eyre[51793ea62743adbd]::config::EyreHook>::into_eyre_hook::{closure#0}<unknown>
  1799. 158.75 s > at <unknown source file>:<unknown line>
  1800. 158.75 s > 2: eyre[cb2fd339c0c40fca]::capture_handler<unknown>
  1801. 158.75 s > at <unknown source file>:<unknown line>
  1802. 158.75 s > 3: eyre[cb2fd339c0c40fca]::private::format_err<unknown>
  1803. 158.75 s > at <unknown source file>:<unknown line>
  1804. 158.75 s > 4: gammalooprs[d7a7c067ebd19583]::integrands::process::ir::evaluate_profile_momentum_point_arb::<gammalooprs[d7a7c067ebd19583]::integrands::process::amplitude::AmplitudeIntegrand><unknown>
  1805. 158.75 s > at <unknown source file>:<unknown line>
  1806. 158.75 s > 5: <gammalooprs[d7a7c067ebd19583]::integrands::process::amplitude::AmplitudeIntegrand>::test_single_ir_limit_impl<unknown>
  1807. 158.75 s > at <unknown source file>:<unknown line>
  1808. 158.75 s > 6: gammalooprs[d7a7c067ebd19583]::integrands::process::ir::run_ir_profile::<gammalooprs[d7a7c067ebd19583]::integrands::process::amplitude::AmplitudeIntegrand, <gammalooprs[d7a7c067ebd19583]::integrands::process::amplitude::AmplitudeIntegrand>::enumerate_ir_limits, <gammalooprs[d7a7c067ebd19583]::integrands::process::amplitude::AmplitudeIntegrand>::graph_cut_definitions, <gammalooprs[d7a7c067ebd19583]::integrands::process::amplitude::AmplitudeIntegrand>::test_single_ir_limit_impl><unknown>
  1809. 158.75 s > at <unknown source file>:<unknown line>
  1810. 158.75 s > 7: <gammalooprs[d7a7c067ebd19583]::integrands::process::amplitude::AmplitudeIntegrand>::test_ir<unknown>
  1811. 158.75 s > at <unknown source file>:<unknown line>
  1812. 158.75 s > 8: <gammaloop_api[92ae732909e47e14]::commands::profile::Profile>::run<unknown>
  1813. 158.75 s > at <unknown source file>:<unknown line>
  1814. 158.75 s > 9: test_runs[3e7a390caee4e338]::profile_bulk::massless_triangle_bulk_profile_passes<unknown>
  1815. 158.75 s > at <unknown source file>:<unknown line>
  1816. 158.75 s > 10: <test_runs[3e7a390caee4e338]::profile_bulk::massless_triangle_bulk_profile_passes::{closure#0} as core[940e698046960fd5]::ops::function::FnOnce<()>>::call_once<unknown>
  1817. 158.75 s > at <unknown source file>:<unknown line>
  1818. 158.75 s > 11: test[75d6903177b1d7e9]::__rust_begin_short_backtrace::<core[940e698046960fd5]::result::Result<(), alloc[2ea6bcb46fca0c42]::string::String>, fn() -> core[940e698046960fd5]::result::Result<(), alloc[2ea6bcb46fca0c42]::string::String>><unknown>
  1819. 158.75 s > at <unknown source file>:<unknown line>
  1820. 158.75 s > 12: test[75d6903177b1d7e9]::run_test::{closure#0}<unknown>
  1821. 158.75 s > at <unknown source file>:<unknown line>
  1822. 158.75 s > 13: std[bcb96dfbba0ab899]::sys::backtrace::__rust_begin_short_backtrace::<test[75d6903177b1d7e9]::run_test::{closure#1}, ()><unknown>
  1823. 158.75 s > at <unknown source file>:<unknown line>
  1824. 158.75 s > 14: <std[bcb96dfbba0ab899]::thread::lifecycle::spawn_unchecked<test[75d6903177b1d7e9]::run_test::{closure#1}, ()>::{closure#1} as core[940e698046960fd5]::ops::function::FnOnce<()>>::call_once::{shim:vtable#0}<unknown>
  1825. 158.75 s > at <unknown source file>:<unknown line>
  1826. 158.75 s > 15: <std[bcb96dfbba0ab899]::sys::thread::unix::Thread>::new::thread_start<unknown>
  1827. 158.75 s > at <unknown source file>:<unknown line>
  1828. 158.75 s > 16: start_thread<unknown>
  1829. 158.75 s > at <unknown source file>:<unknown line>
  1830. 158.75 s > 17: __clone3<unknown>
  1831. 158.75 s > at <unknown source file>:<unknown line>
  1832. 158.75 s >
  1833. 158.75 s > Run with COLORBT_SHOW_HIDDEN=1 environment variable to disable frame filtering.
  1834. 158.75 s > Run with RUST_BACKTRACE=full to include source snippets.
  1835. 158.75 s > Warning: SpanTrace capture is Unsupported.
  1836. 158.75 s > Ensure that you've setup a tracing-error ErrorLayer and the semver versions are compatible
  1837. 158.75 s > system-out
  1838. 158.75 s > running 1 test
  1839. 158.75 s > test profile_bulk::massless_triangle_bulk_profile_passes ... FAILED
  1840. 158.75 s >
  1841. 158.75 s > failures:
  1842. 158.75 s >
  1843. 158.75 s > failures:
  1844. 158.75 s > profile_bulk::massless_triangle_bulk_profile_passes
  1845. 158.75 s >
  1846. 158.75 s > test result: FAILED. 0 passed; 1 failed; 0 ignored; 0 measured; 82 filtered out; finished in 0.27s
  1847. 158.75 s > system-err
  1848. 158.75 s > [2026-08-27 10:10:22.190] @gammaloop_api::se... INFO : Running command import model scalars
  1849. 158.75 s > [2026-08-27 10:10:22.190] @import::model INFO : Loading built-in JSON model scalars-default
  1850. 158.75 s > [2026-08-27 10:10:22.199] @gammalooprs::model INFO : The following 2 external parameters were forced to zero by the restriction card:
  1851. 158.75 s > width_scalar_1, width_scalar_2
  1852. 158.75 s > [2026-08-27 10:10:22.200] @gammaloop_api::se... INFO : Running command import graphs ./tests/resources/graphs/massless_triangle.dot
  1853. 158.75 s > [2026-08-27 10:10:22.200] @commands::import INFO : Loading graphs from '/build/source/tests/resources/graphs/massless_triangle.dot'
  1854. 158.75 s > [2026-08-27 10:10:22.208] @gammaloop_api::se... INFO : Running command generate
  1855. 158.75 s > [2026-08-27 10:10:22.312] @commands::generate INFO :
  1856. 158.75 s > Integrand generation summary
  1857. 158.75 s > peak RAM 63.09 MiB | cores 1
  1858. 158.75 s > ╭───────────┬─────────────────────┬─────────┬────────────┬────────────┬────────────────┬─────────────╮
  1859. 158.75 s > │ integrand │ graph │ # evals │ expr build │ spenso │ symbolica eval │ compile │
  1860. 158.75 s > ├───────────┼─────────────────────┼─────────┼────────────┼────────────┼────────────────┼─────────────┤
  1861. 158.75 s > │ default │ massless_triangle_0 │ 9 │ 15ms (52%) │ 1ms (5.9%) │ 12ms (42%) │ 0ms (0.00%) │
  1862. 158.75 s > ├───────────┼─────────────────────┼─────────┼────────────┼────────────┼────────────────┼─────────────┤
  1863. 158.75 s > │ Total │ │ 9 │ 15ms (52%) │ 1ms (5.9%) │ 12ms (42%) │ 0ms (0.00%) │
  1864. 158.75 s > ╰───────────┴─────────────────────┴─────────┴────────────┴────────────┴────────────────┴─────────────╯
  1865. 158.75 s > [2026-08-27 10:10:22.314] @process::amplitude INFO : Input is above threshold: 2 existing threshold E-surfaces across 1/1 graph groups
  1866. 158.75 s > [2026-08-27 10:10:22.314] @process::amplitude INFO : overlap structure of group 0: [2: [0(1,5), 1(1,3)]]
  1867. 158.75 s > Error:
  1868. 158.75 s > 0: IR profiling requested arbitrary precision but received a quad-precision result
  1869. 158.75 s >
  1870. 158.75 s > Location:
  1871. 158.75 s > crates/gammalooprs/src/integrands/process/ir.rs:2123
  1872. 158.75 s >
  1873. 158.75 s > ━━━━━━━━━━━━━━━━━━━━━━━━━━━━━━━━━━ BACKTRACE ━━━━━━━━━━━━━━━━━━━━━━━━━━━━━━━━━━━
  1874. 158.75 s > 1: <color_eyre[51793ea62743adbd]::config::EyreHook>::into_eyre_hook::{closure#0}<unknown>
  1875. 158.75 s > at <unknown source file>:<unknown line>
  1876. 158.75 s > 2: eyre[cb2fd339c0c40fca]::capture_handler<unknown>
  1877. 158.75 s > at <unknown source file>:<unknown line>
  1878. 158.75 s > 3: eyre[cb2fd339c0c40fca]::private::format_err<unknown>
  1879. 158.75 s > at <unknown source file>:<unknown line>
  1880. 158.75 s > 4: gammalooprs[d7a7c067ebd19583]::integrands::process::ir::evaluate_profile_momentum_point_arb::<gammalooprs[d7a7c067ebd19583]::integrands::process::amplitude::AmplitudeIntegrand><unknown>
  1881. 158.75 s > at <unknown source file>:<unknown line>
  1882. 158.75 s > 5: <gammalooprs[d7a7c067ebd19583]::integrands::process::amplitude::AmplitudeIntegrand>::test_single_ir_limit_impl<unknown>
  1883. 158.75 s > at <unknown source file>:<unknown line>
  1884. 158.75 s > 6: gammalooprs[d7a7c067ebd19583]::integrands::process::ir::run_ir_profile::<gammalooprs[d7a7c067ebd19583]::integrands::process::amplitude::AmplitudeIntegrand, <gammalooprs[d7a7c067ebd19583]::integrands::process::amplitude::AmplitudeIntegrand>::enumerate_ir_limits, <gammalooprs[d7a7c067ebd19583]::integrands::process::amplitude::AmplitudeIntegrand>::graph_cut_definitions, <gammalooprs[d7a7c067ebd19583]::integrands::process::amplitude::AmplitudeIntegrand>::test_single_ir_limit_impl><unknown>
  1885. 158.75 s > at <unknown source file>:<unknown line>
  1886. 158.75 s > 7: <gammalooprs[d7a7c067ebd19583]::integrands::process::amplitude::AmplitudeIntegrand>::test_ir<unknown>
  1887. 158.75 s > at <unknown source file>:<unknown line>
  1888. 158.75 s > 8: <gammaloop_api[92ae732909e47e14]::commands::profile::Profile>::run<unknown>
  1889. 158.75 s > at <unknown source file>:<unknown line>
  1890. 158.75 s > 9: test_runs[3e7a390caee4e338]::profile_bulk::massless_triangle_bulk_profile_passes<unknown>
  1891. 158.75 s > at <unknown source file>:<unknown line>
  1892. 158.75 s > 10: <test_runs[3e7a390caee4e338]::profile_bulk::massless_triangle_bulk_profile_passes::{closure#0} as core[940e698046960fd5]::ops::function::FnOnce<()>>::call_once<unknown>
  1893. 158.75 s > at <unknown source file>:<unknown line>
  1894. 158.75 s > 11: test[75d6903177b1d7e9]::__rust_begin_short_backtrace::<core[940e698046960fd5]::result::Result<(), alloc[2ea6bcb46fca0c42]::string::String>, fn() -> core[940e698046960fd5]::result::Result<(), alloc[2ea6bcb46fca0c42]::string::String>><unknown>
  1895. 158.75 s > at <unknown source file>:<unknown line>
  1896. 158.75 s > 12: test[75d6903177b1d7e9]::run_test::{closure#0}<unknown>
  1897. 158.75 s > at <unknown source file>:<unknown line>
  1898. 158.75 s > 13: std[bcb96dfbba0ab899]::sys::backtrace::__rust_begin_short_backtrace::<test[75d6903177b1d7e9]::run_test::{closure#1}, ()><unknown>
  1899. 158.75 s > at <unknown source file>:<unknown line>
  1900. 158.75 s > 14: <std[bcb96dfbba0ab899]::thread::lifecycle::spawn_unchecked<test[75d6903177b1d7e9]::run_test::{closure#1}, ()>::{closure#1} as core[940e698046960fd5]::ops::function::FnOnce<()>>::call_once::{shim:vtable#0}<unknown>
  1901. 158.75 s > at <unknown source file>:<unknown line>
  1902. 158.75 s > 15: <std[bcb96dfbba0ab899]::sys::thread::unix::Thread>::new::thread_start<unknown>
  1903. 158.75 s > at <unknown source file>:<unknown line>
  1904. 158.75 s > 16: start_thread<unknown>
  1905. 158.75 s > at <unknown source file>:<unknown line>
  1906. 158.75 s > 17: __clone3<unknown>
  1907. 158.75 s > at <unknown source file>:<unknown line>
  1908. 158.75 s >
  1909. 158.75 s > Run with COLORBT_SHOW_HIDDEN=1 environment variable to disable frame filtering.
  1910. 158.75 s > Run with RUST_BACKTRACE=full to include source snippets.
  1911. 158.75 s > Warning: SpanTrace capture is Unsupported.
  1912. 158.75 s > Ensure that you've setup a tracing-error ErrorLayer and the semver versions are compatible
  1913. 158.75 s >
  1914. 158.75 s > 6. gammaloop-integration-tests::test_runs::profile_bulk::scalar_self_energy_amp_bulk_profile_passes
  1915. 158.75 s > failure: test failure with exit code 101
  1916. 158.75 s > Error:
  1917. 158.75 s > 0: IR profiling requested arbitrary precision but received a quad-precision result
  1918. 158.75 s >
  1919. 158.75 s > Location:
  1920. 158.75 s > crates/gammalooprs/src/integrands/process/ir.rs:2123
  1921. 158.75 s >
  1922. 158.75 s > ━━━━━━━━━━━━━━━━━━━━━━━━━━━━━━━━━━ BACKTRACE ━━━━━━━━━━━━━━━━━━━━━━━━━━━━━━━━━━━
  1923. 158.75 s > 1: <color_eyre[51793ea62743adbd]::config::EyreHook>::into_eyre_hook::{closure#0}<unknown>
  1924. 158.75 s > at <unknown source file>:<unknown line>
  1925. 158.75 s > 2: eyre[cb2fd339c0c40fca]::capture_handler<unknown>
  1926. 158.75 s > at <unknown source file>:<unknown line>
  1927. 158.75 s > 3: eyre[cb2fd339c0c40fca]::private::format_err<unknown>
  1928. 158.75 s > at <unknown source file>:<unknown line>
  1929. 158.75 s > 4: gammalooprs[d7a7c067ebd19583]::integrands::process::ir::evaluate_profile_momentum_point_arb::<gammalooprs[d7a7c067ebd19583]::integrands::process::amplitude::AmplitudeIntegrand><unknown>
  1930. 158.75 s > at <unknown source file>:<unknown line>
  1931. 158.75 s > 5: <gammalooprs[d7a7c067ebd19583]::integrands::process::amplitude::AmplitudeIntegrand>::test_single_ir_limit_impl<unknown>
  1932. 158.75 s > at <unknown source file>:<unknown line>
  1933. 158.75 s > 6: gammalooprs[d7a7c067ebd19583]::integrands::process::ir::run_ir_profile::<gammalooprs[d7a7c067ebd19583]::integrands::process::amplitude::AmplitudeIntegrand, <gammalooprs[d7a7c067ebd19583]::integrands::process::amplitude::AmplitudeIntegrand>::enumerate_ir_limits, <gammalooprs[d7a7c067ebd19583]::integrands::process::amplitude::AmplitudeIntegrand>::graph_cut_definitions, <gammalooprs[d7a7c067ebd19583]::integrands::process::amplitude::AmplitudeIntegrand>::test_single_ir_limit_impl><unknown>
  1934. 158.75 s > at <unknown source file>:<unknown line>
  1935. 158.75 s > 7: <gammalooprs[d7a7c067ebd19583]::integrands::process::amplitude::AmplitudeIntegrand>::test_ir<unknown>
  1936. 158.75 s > at <unknown source file>:<unknown line>
  1937. 158.75 s > 8: <gammaloop_api[92ae732909e47e14]::commands::profile::Profile>::run<unknown>
  1938. 158.75 s > at <unknown source file>:<unknown line>
  1939. 158.75 s > 9: test_runs[3e7a390caee4e338]::profile_bulk::scalar_self_energy_amp_bulk_profile_passes<unknown>
  1940. 158.75 s > at <unknown source file>:<unknown line>
  1941. 158.75 s > 10: <test_runs[3e7a390caee4e338]::profile_bulk::scalar_self_energy_amp_bulk_profile_passes::{closure#0} as core[940e698046960fd5]::ops::function::FnOnce<()>>::call_once<unknown>
  1942. 158.75 s > at <unknown source file>:<unknown line>
  1943. 158.75 s > 11: test[75d6903177b1d7e9]::__rust_begin_short_backtrace::<core[940e698046960fd5]::result::Result<(), alloc[2ea6bcb46fca0c42]::string::String>, fn() -> core[940e698046960fd5]::result::Result<(), alloc[2ea6bcb46fca0c42]::string::String>><unknown>
  1944. 158.75 s > at <unknown source file>:<unknown line>
  1945. 158.75 s > 12: test[75d6903177b1d7e9]::run_test::{closure#0}<unknown>
  1946. 158.75 s > at <unknown source file>:<unknown line>
  1947. 158.75 s > 13: std[bcb96dfbba0ab899]::sys::backtrace::__rust_begin_short_backtrace::<test[75d6903177b1d7e9]::run_test::{closure#1}, ()><unknown>
  1948. 158.75 s > at <unknown source file>:<unknown line>
  1949. 158.75 s > 14: <std[bcb96dfbba0ab899]::thread::lifecycle::spawn_unchecked<test[75d6903177b1d7e9]::run_test::{closure#1}, ()>::{closure#1} as core[940e698046960fd5]::ops::function::FnOnce<()>>::call_once::{shim:vtable#0}<unknown>
  1950. 158.75 s > at <unknown source file>:<unknown line>
  1951. 158.75 s > 15: <std[bcb96dfbba0ab899]::sys::thread::unix::Thread>::new::thread_start<unknown>
  1952. 158.75 s > at <unknown source file>:<unknown line>
  1953. 158.75 s > 16: start_thread<unknown>
  1954. 158.75 s > at <unknown source file>:<unknown line>
  1955. 158.75 s > 17: __clone3<unknown>
  1956. 158.75 s > at <unknown source file>:<unknown line>
  1957. 158.75 s >
  1958. 158.75 s > Run with COLORBT_SHOW_HIDDEN=1 environment variable to disable frame filtering.
  1959. 158.75 s > Run with RUST_BACKTRACE=full to include source snippets.
  1960. 158.75 s > Warning: SpanTrace capture is Unsupported.
  1961. 158.75 s > Ensure that you've setup a tracing-error ErrorLayer and the semver versions are compatible
  1962. 158.75 s > system-out
  1963. 158.75 s > running 1 test
  1964. 158.75 s > test profile_bulk::scalar_self_energy_amp_bulk_profile_passes ... FAILED
  1965. 158.75 s >
  1966. 158.75 s > failures:
  1967. 158.75 s >
  1968. 158.75 s > failures:
  1969. 158.75 s > profile_bulk::scalar_self_energy_amp_bulk_profile_passes
  1970. 158.75 s >
  1971. 158.75 s > test result: FAILED. 0 passed; 1 failed; 0 ignored; 0 measured; 82 filtered out; finished in 0.69s
  1972. 158.75 s > system-err
  1973. 158.75 s > [2026-08-27 10:10:22.373] @gammaloop_api::se... INFO : Running command import model ./assets/models/json/scalars/scalars.json
  1974. 158.75 s > [2026-08-27 10:10:22.373] @import::model INFO : Loading JSON model scalars-default from /build/source/assets/models/json/scalars/scalars
  1975. 158.75 s > [2026-08-27 10:10:22.377] @gammalooprs::model INFO : The following 2 external parameters were forced to zero by the restriction card:
  1976. 158.75 s > width_scalar_1, width_scalar_2
  1977. 158.75 s > [2026-08-27 10:10:22.378] @gammaloop_api::se... INFO : Running command import graphs ./tests/resources/graphs/scalar_self_energy_amp.dot
  1978. 158.75 s > [2026-08-27 10:10:22.378] @commands::import INFO : Loading graphs from '/build/source/tests/resources/graphs/scalar_self_energy_amp.dot'
  1979. 158.75 s > [2026-08-27 10:10:22.383] @gammaloop_api::se... INFO : Running command generate
  1980. 158.75 s > [2026-08-27 10:10:22.739] @commands::generate INFO :
  1981. 158.75 s > Integrand generation summary
  1982. 158.75 s > peak RAM 70.84 MiB | cores 1
  1983. 158.75 s > ╭───────────┬────────────────────────┬─────────┬─────────────┬────────────┬────────────────┬─────────────╮
  1984. 158.75 s > │ integrand │ graph │ # evals │ expr build │ spenso │ symbolica eval │ compile │
  1985. 158.75 s > ├───────────┼────────────────────────┼─────────┼─────────────┼────────────┼────────────────┼─────────────┤
  1986. 158.75 s > │ default │ scalar_self_energy_amp │ 6 │ 245ms (96%) │ 5ms (2.0%) │ 4ms (1.8%) │ 0ms (0.00%) │
  1987. 158.75 s > ├───────────┼────────────────────────┼─────────┼─────────────┼────────────┼────────────────┼─────────────┤
  1988. 158.75 s > │ Total │ │ 6 │ 245ms (96%) │ 5ms (2.0%) │ 4ms (1.8%) │ 0ms (0.00%) │
  1989. 158.75 s > ╰───────────┴────────────────────────┴─────────┴─────────────┴────────────┴────────────────┴─────────────╯
  1990. 158.75 s > [2026-08-27 10:10:22.740] @process::amplitude INFO : Input is above threshold: 2 existing threshold E-surfaces across 1/1 graph groups
  1991. 158.75 s > [2026-08-27 10:10:22.741] @process::amplitude INFO : overlap structure of group 0: [2: [2(1,5), 4(2,3,5)]]
  1992. 158.75 s > Error:
  1993. 158.75 s > 0: IR profiling requested arbitrary precision but received a quad-precision result
  1994. 158.75 s >
  1995. 158.75 s > Location:
  1996. 158.75 s > crates/gammalooprs/src/integrands/process/ir.rs:2123
  1997. 158.75 s >
  1998. 158.75 s > ━━━━━━━━━━━━━━━━━━━━━━━━━━━━━━━━━━ BACKTRACE ━━━━━━━━━━━━━━━━━━━━━━━━━━━━━━━━━━━
  1999. 158.75 s > 1: <color_eyre[51793ea62743adbd]::config::EyreHook>::into_eyre_hook::{closure#0}<unknown>
  2000. 158.75 s > at <unknown source file>:<unknown line>
  2001. 158.75 s > 2: eyre[cb2fd339c0c40fca]::capture_handler<unknown>
  2002. 158.75 s > at <unknown source file>:<unknown line>
  2003. 158.75 s > 3: eyre[cb2fd339c0c40fca]::private::format_err<unknown>
  2004. 158.75 s > at <unknown source file>:<unknown line>
  2005. 158.75 s > 4: gammalooprs[d7a7c067ebd19583]::integrands::process::ir::evaluate_profile_momentum_point_arb::<gammalooprs[d7a7c067ebd19583]::integrands::process::amplitude::AmplitudeIntegrand><unknown>
  2006. 158.75 s > at <unknown source file>:<unknown line>
  2007. 158.75 s > 5: <gammalooprs[d7a7c067ebd19583]::integrands::process::amplitude::AmplitudeIntegrand>::test_single_ir_limit_impl<unknown>
  2008. 158.75 s > at <unknown source file>:<unknown line>
  2009. 158.75 s > 6: gammalooprs[d7a7c067ebd19583]::integrands::process::ir::run_ir_profile::<gammalooprs[d7a7c067ebd19583]::integrands::process::amplitude::AmplitudeIntegrand, <gammalooprs[d7a7c067ebd19583]::integrands::process::amplitude::AmplitudeIntegrand>::enumerate_ir_limits, <gammalooprs[d7a7c067ebd19583]::integrands::process::amplitude::AmplitudeIntegrand>::graph_cut_definitions, <gammalooprs[d7a7c067ebd19583]::integrands::process::amplitude::AmplitudeIntegrand>::test_single_ir_limit_impl><unknown>
  2010. 158.75 s > at <unknown source file>:<unknown line>
  2011. 158.75 s > 7: <gammalooprs[d7a7c067ebd19583]::integrands::process::amplitude::AmplitudeIntegrand>::test_ir<unknown>
  2012. 158.75 s > at <unknown source file>:<unknown line>
  2013. 158.75 s > 8: <gammaloop_api[92ae732909e47e14]::commands::profile::Profile>::run<unknown>
  2014. 158.75 s > at <unknown source file>:<unknown line>
  2015. 158.75 s > 9: test_runs[3e7a390caee4e338]::profile_bulk::scalar_self_energy_amp_bulk_profile_passes<unknown>
  2016. 158.75 s > at <unknown source file>:<unknown line>
  2017. 158.75 s > 10: <test_runs[3e7a390caee4e338]::profile_bulk::scalar_self_energy_amp_bulk_profile_passes::{closure#0} as core[940e698046960fd5]::ops::function::FnOnce<()>>::call_once<unknown>
  2018. 158.75 s > at <unknown source file>:<unknown line>
  2019. 158.75 s > 11: test[75d6903177b1d7e9]::__rust_begin_short_backtrace::<core[940e698046960fd5]::result::Result<(), alloc[2ea6bcb46fca0c42]::string::String>, fn() -> core[940e698046960fd5]::result::Result<(), alloc[2ea6bcb46fca0c42]::string::String>><unknown>
  2020. 158.75 s > at <unknown source file>:<unknown line>
  2021. 158.75 s > 12: test[75d6903177b1d7e9]::run_test::{closure#0}<unknown>
  2022. 158.75 s > at <unknown source file>:<unknown line>
  2023. 158.75 s > 13: std[bcb96dfbba0ab899]::sys::backtrace::__rust_begin_short_backtrace::<test[75d6903177b1d7e9]::run_test::{closure#1}, ()><unknown>
  2024. 158.75 s > at <unknown source file>:<unknown line>
  2025. 158.75 s > 14: <std[bcb96dfbba0ab899]::thread::lifecycle::spawn_unchecked<test[75d6903177b1d7e9]::run_test::{closure#1}, ()>::{closure#1} as core[940e698046960fd5]::ops::function::FnOnce<()>>::call_once::{shim:vtable#0}<unknown>
  2026. 158.75 s > at <unknown source file>:<unknown line>
  2027. 158.75 s > 15: <std[bcb96dfbba0ab899]::sys::thread::unix::Thread>::new::thread_start<unknown>
  2028. 158.75 s > at <unknown source file>:<unknown line>
  2029. 158.75 s > 16: start_thread<unknown>
  2030. 158.75 s > at <unknown source file>:<unknown line>
  2031. 158.75 s > 17: __clone3<unknown>
  2032. 158.75 s > at <unknown source file>:<unknown line>
  2033. 158.75 s >
  2034. 158.75 s > Run with COLORBT_SHOW_HIDDEN=1 environment variable to disable frame filtering.
  2035. 158.75 s > Run with RUST_BACKTRACE=full to include source snippets.
  2036. 158.75 s > Warning: SpanTrace capture is Unsupported.
  2037. 158.75 s > Ensure that you've setup a tracing-error ErrorLayer and the semver versions are compatible
  2038. 158.75 s >
  2039. 158.75 s > 7. gammaloop-integration-tests::uv::dod2_bubble_uv
  2040. 158.75 s > failure: test failure with exit code 101
  2041. 158.75 s > system-out
  2042. 158.75 s > running 1 test
  2043. 158.75 s > +-------------+-----------------+---------+--------+----------+-----------------------------------------------------------------------------------------------------------------------+-------+
  2044. 158.75 s > | case | check | graph | status | sigma | threshold | error |
  2045. 158.75 s > +-------------+-----------------+---------+--------+----------+-----------------------------------------------------------------------------------------------------------------------+-------+
  2046. 158.75 s > | dod2_bubble | uv_profile | - | FAIL | - | - | - |
  2047. 158.75 s > +-------------+-----------------+---------+--------+----------+-----------------------------------------------------------------------------------------------------------------------+-------+
  2048. 158.75 s > | dod2_bubble | m_uv.inspect | inspect | pass | - | best inspect relative delta 1.000e0 >= 1000*accuracy 1.000e-7 (accuracy=1.000e-10, exponent=+8.0, seed=0, probes=10) | - |
  2049. 158.75 s > +-------------+-----------------+---------+--------+----------+-----------------------------------------------------------------------------------------------------------------------+-------+
  2050. 158.75 s > | dod2_bubble | m_uv.integrated | GL0 | pass | 0.0sigma | compatible within 2sigma | - |
  2051. 158.75 s > +-------------+-----------------+---------+--------+----------+-----------------------------------------------------------------------------------------------------------------------+-------+
  2052. 158.75 s > | dod2_bubble | rls.inspect | inspect | pass | - | best inspect relative delta 2.822e-3 >= 1000*accuracy 1.000e-7 (accuracy=1.000e-10, exponent=+2.0, seed=1, probes=10) | - |
  2053. 158.75 s > +-------------+-----------------+---------+--------+----------+-----------------------------------------------------------------------------------------------------------------------+-------+
  2054. 158.75 s > | dod2_bubble | rls.integrated | GL0 | pass | 0.0sigma | compatible within 2sigma | - |
  2055. 158.75 s > +-------------+-----------------+---------+--------+----------+-----------------------------------------------------------------------------------------------------------------------+-------+
  2056. 158.75 s > | dod2_bubble | mu_r.inspect | inspect | pass | - | best inspect relative delta 6.951e-1 >= 1000*accuracy 1.000e-7 (accuracy=1.000e-10, exponent=+0.0, seed=0, probes=10) | - |
  2057. 158.75 s > +-------------+-----------------+---------+--------+----------+-----------------------------------------------------------------------------------------------------------------------+-------+
  2058. 158.75 s > | dod2_bubble | target | - | pass | - | 2sigma | - |
  2059. 158.75 s > +-------------+-----------------+---------+--------+----------+-----------------------------------------------------------------------------------------------------------------------+-------+
  2060. 158.75 s > test dod2_bubble_uv ... FAILED
  2061. 158.75 s >
  2062. 158.75 s > failures:
  2063. 158.75 s >
  2064. 158.75 s > failures:
  2065. 158.75 s > dod2_bubble_uv
  2066. 158.75 s >
  2067. 158.75 s > test result: FAILED. 0 passed; 1 failed; 0 ignored; 0 measured; 24 filtered out; finished in 59.40s
  2068. 158.75 s > system-err
  2069. 158.75 s > [2026-08-27 10:10:26.593] @gammaloop_api::se... INFO : Running command run generate
  2070. 158.75 s > [2026-08-27 10:10:26.593] @gammaloop_api::se... INFO : Starting command block generate
  2071. 158.75 s > [2026-08-27 10:10:26.593] @gammaloop_api::se... INFO : Running command import model scalars-default.json
  2072. 158.75 s > [2026-08-27 10:10:26.593] @import::model INFO : Loading built-in JSON model scalars-default
  2073. 158.75 s > [2026-08-27 10:10:26.597] @gammalooprs::model INFO : The following 2 external parameters were forced to zero by the restriction card:
  2074. 158.75 s > width_scalar_1, width_scalar_2
  2075. 158.75 s > [2026-08-27 10:10:26.597] @gammaloop_api::se... INFO : Running command remove processes
  2076. 158.75 s > [2026-08-27 10:10:26.597] @gammaloop_api::se... INFO : Running command set global kv global.generation.uv.generate_integrated=true
  2077. 158.75 s > [2026-08-27 10:10:26.598] @gammaloop_api::se... INFO : Running command import graphs ./tests/resources/graphs/scalar/dod2_bubble.dot -p bubble_dod2 -i scalar_bubble_below_thres
  2078. 158.75 s > [2026-08-27 10:10:26.598] @commands::import INFO : Loading graphs from '/build/source/tests/resources/graphs/scalar/dod2_bubble.dot'
  2079. 158.75 s > [2026-08-27 10:10:26.600] @gammaloop_api::se... INFO : Running command generate existing -p bubble_dod2 -i scalar_bubble_below_thres
  2080. 158.75 s > [2026-08-27 10:10:26.616] @approx::local_4d [{#uv, #inspect, #integrated}] DEBUG : Rescaled momenta expanded
  2081. 158.75 s > field value
  2082. 158.75 s > res n-terms: 1, byte size: 3,expr:
  2083. 158.75 s > 1
  2084. 158.75 s > [2026-08-27 10:10:26.617] @approx::local_4d [{#uv, #inspect, #integrated}] DEBUG : Rescaled momenta expanded
  2085. 158.75 s > field value
  2086. 158.75 s > res n-terms: 1, byte size: 585,expr:
  2087. 158.75 s > -SCALAR_COUPLING²·q₀(αᵉ².¹)·q₀(αᵉ³.¹)·q₂(αᵉ².¹)·q₂(αᵉ³.¹)
  2088. 158.75 s > /(t²·denom(3,-q₀-q₂/t,mass_scalar_2²,-mass_scalar_2²+2·(q₀.q₂)/t+(q₂.q₂)/t²+(q₀.q₀))
  2089. 158.75 s > ·denom(2,q₂/t,mass_scalar_2²,-mass_scalar_2²+(q₂.q₂)/t²))
  2090. 158.75 s > [2026-08-27 10:10:26.620] @approx::final_integrand[{#generation, #profile, #uv, #graph, #summary}] DEBUG : Computed global numerator
  2091. 158.75 s > field value
  2092. 158.75 s > global_num n-terms: 1, byte size: 4,expr:
  2093. 158.75 s > 1/2
  2094. 158.75 s > span build_3d{span_context=true graph=GL0 current=subgraph=0, topo_order=0, dod=0}
  2095. 158.75 s > [2026-08-27 10:10:26.623] @uv::approx [{#generation, #uv, #fourd}] DEBUG : Computing 4D
  2096. 158.75 s > field value
  2097. 158.75 s > simple subgraph(S_11,S_y)*Approx(subgraph(S_y,0)) of GL0
  2098. 158.75 s > span compute_4d{span_context=true graph=GL0 current=subgraph=y, topo_order=1, dod=2 given=subgraph=0, topo_order=0, dod=0 reduced=SubSet { set: BitVec<usize, bitvec::order::Lsb0> { addr: 0x7fff94011010, head: 000000, bits: 6, capacity: 64 } [0, 0, 1, 1, 1, 1], id: PhantomData<linnet::half_edge::involution::Hedge> }}
  2099. 158.75 s > [2026-08-27 10:10:26.624] @approx::local_4d [{#uv, #algebra, #integrated, #start}] DEBUG :
  2100. 158.75 s > field value
  2101. 158.75 s > integrand n-terms: 1, byte size: 409,expr:
  2102. 158.75 s > SCALAR_COUPLING²·(q₀(αᵉ³.¹)+q₃(αᵉ³.¹))·q₀(αᵉ².¹)·q₀(αᵉ³.¹)·q₂(αᵉ².¹)
  2103. 158.75 s > /(denom(2,q₂,mass_scalar_2²,-mass_scalar_2²+(q₂.q₂))·denom(3,q₃,mass_scalar_2²,-mass_scalar_2²+(q₃.q₃)))
  2104. 158.75 s > reduced y
  2105. 158.75 s > span grow{span_context=true current=subgraph=y, topo_order=1, dod=2 given=subgraph=0, topo_order=0, dod=0}
  2106. 158.75 s > [2026-08-27 10:10:26.624] @approx::local_4d [{#uv, #inspect, #integrated}] DEBUG : Rescaled momenta expanded
  2107. 158.75 s > field value
  2108. 158.75 s > res n-terms: 1, byte size: 585,expr:
  2109. 158.75 s > -SCALAR_COUPLING²·q₀(αᵉ².¹)·q₀(αᵉ³.¹)·q₂(αᵉ².¹)·q₂(αᵉ³.¹)
  2110. 158.75 s > /(t²·denom(3,-q₀-q₂/t,mass_scalar_2²,-mass_scalar_2²+2·(q₀.q₂)/t+(q₂.q₂)/t²+(q₀.q₀))
  2111. 158.75 s > ·denom(2,q₂/t,mass_scalar_2²,-mass_scalar_2²+(q₂.q₂)/t²))
  2112. 158.75 s > span t{span_context=true current=subgraph=y, topo_order=1, dod=2 given=subgraph=0, topo_order=0, dod=0}
  2113. 158.75 s > [2026-08-27 10:10:26.625] @approx::local_4d [{#uv, #integrated, #rescaled}] DEBUG : Rescaled expanded
  2114. 158.75 s > field value
  2115. 158.75 s > n_loops 1
  2116. 158.75 s > res n-terms: 1, byte size: 707,expr:
  2117. 158.75 s > -SCALAR_COUPLING²·q₀(αᵉ².¹)·q₀(αᵉ³.¹)·q₂(αᵉ².¹)·q₂(αᵉ³.¹)
  2118. 158.75 s > /(t²·denom(3,-q₂,mUVexp²+t²·mass_scalar_2²,-mUV²+t²·(-mass_scalar_2²+2·(q₀.q₂)/t+(q₂.q₂)/t²+(q₀.q₀))+t²·mUVexp²)
  2119. 158.75 s > ·denom(2,q₂,mUVexp²+t²·mass_scalar_2²,-mUV²+t²·(-mass_scalar_2²+(q₂.q₂)/t²)+t²·mUVexp²))
  2120. 158.75 s > span t{span_context=true current=subgraph=y, topo_order=1, dod=2 given=subgraph=0, topo_order=0, dod=0}
  2121. 158.75 s > [2026-08-27 10:10:26.626] @approx::local_4d [{#uv, #integrated, #series}] DEBUG : Series expanded
  2122. 158.75 s > field value
  2123. 158.75 s > res n-terms: 3, byte size: 1896,expr:
  2124. 158.75 s > (1/2·SCALAR_COUPLING²·(2·mUVexp²-2·mass_scalar_2²)/(denom(2,q₂,mUVexp²,-mUV²+(q₂.q₂))²·denom(3,-q₂,mUVexp²,-mUV²+(q₂.q₂)))
  2125. 158.75 s > -SCALAR_COUPLING²
  2126. 158.75 s > ·(-1/2·(2·mUVexp²-2·mass_scalar_2²+2·(q₀.q₀))/denom(3,-q₂,mUVexp²,-mUV²+(q₂.q₂))
  2127. 158.75 s > +4·(q₀.q₂)²/denom(3,-q₂,mUVexp²,-mUV²+(q₂.q₂))²
  2128. 158.75 s > )/(denom(2,q₂,mUVexp²,-mUV²+(q₂.q₂))·denom(3,-q₂,mUVexp²,-mUV²+(q₂.q₂)))
  2129. 158.75 s > )·q₀(αᵉ².¹)·q₀(αᵉ³.¹)·q₂(αᵉ².¹)·q₂(αᵉ³.¹)
  2130. 158.75 s > +2·SCALAR_COUPLING²·(q₀.q₂)·q₀(αᵉ².¹)·q₀(αᵉ³.¹)·q₂(αᵉ².¹)·q₂(αᵉ³.¹)
  2131. 158.75 s > /(t·denom(2,q₂,mUVexp²,-mUV²+(q₂.q₂))·denom(3,-q₂,mUVexp²,-mUV²+(q₂.q₂))²)
  2132. 158.75 s > -SCALAR_COUPLING²·q₀(αᵉ².¹)·q₀(αᵉ³.¹)·q₂(αᵉ².¹)·q₂(αᵉ³.¹)
  2133. 158.75 s > /(t²·denom(2,q₂,mUVexp²,-mUV²+(q₂.q₂))·denom(3,-q₂,mUVexp²,-mUV²+(q₂.q₂)))
  2134. 158.75 s > span t{span_context=true current=subgraph=y, topo_order=1, dod=2 given=subgraph=0, topo_order=0, dod=0}
  2135. 158.75 s > [2026-08-27 10:10:26.626] @approx::local_4d [{#uv, #integrated, #series}] DEBUG : Evaluated at t = 1
  2136. 158.75 s > field value
  2137. 158.75 s > res n-terms: 3, byte size: 1880,expr:
  2138. 158.75 s > (1/2·SCALAR_COUPLING²·(2·mUVexp²-2·mass_scalar_2²)/(denom(2,q₂,mUVexp²,-mUV²+(q₂.q₂))²·denom(3,-q₂,mUVexp²,-mUV²+(q₂.q₂)))
  2139. 158.75 s > -SCALAR_COUPLING²
  2140. 158.75 s > ·(-1/2·(2·mUVexp²-2·mass_scalar_2²+2·(q₀.q₀))/denom(3,-q₂,mUVexp²,-mUV²+(q₂.q₂))
  2141. 158.75 s > +4·(q₀.q₂)²/denom(3,-q₂,mUVexp²,-mUV²+(q₂.q₂))²
  2142. 158.75 s > )/(denom(2,q₂,mUVexp²,-mUV²+(q₂.q₂))·denom(3,-q₂,mUVexp²,-mUV²+(q₂.q₂)))
  2143. 158.75 s > )·q₀(αᵉ².¹)·q₀(αᵉ³.¹)·q₂(αᵉ².¹)·q₂(αᵉ³.¹)
  2144. 158.75 s > -SCALAR_COUPLING²·q₀(αᵉ².¹)·q₀(αᵉ³.¹)·q₂(αᵉ².¹)·q₂(αᵉ³.¹)
  2145. 158.75 s > /(denom(2,q₂,mUVexp²,-mUV²+(q₂.q₂))·denom(3,-q₂,mUVexp²,-mUV²+(q₂.q₂)))
  2146. 158.75 s > +2·SCALAR_COUPLING²·(q₀.q₂)·q₀(αᵉ².¹)·q₀(αᵉ³.¹)·q₂(αᵉ².¹)·q₂(αᵉ³.¹)
  2147. 158.75 s > /(denom(2,q₂,mUVexp²,-mUV²+(q₂.q₂))·denom(3,-q₂,mUVexp²,-mUV²+(q₂.q₂))²)
  2148. 158.75 s > span t{span_context=true current=subgraph=y, topo_order=1, dod=2 given=subgraph=0, topo_order=0, dod=0}
  2149. 158.75 s > [2026-08-27 10:10:26.628] @approx::local_4d [{#uv, #collect, #integrated}] DEBUG : After gamma chain collection
  2150. 158.75 s > field value
  2151. 158.75 s > expr n-terms: 3, byte size: 1880,expr:
  2152. 158.75 s > (1/2·SCALAR_COUPLING²·(2·mUVexp²-2·mass_scalar_2²)/(denom(2,q₂,mUVexp²,-mUV²+(q₂.q₂))²·denom(3,-q₂,mUVexp²,-mUV²+(q₂.q₂)))
  2153. 158.75 s > -SCALAR_COUPLING²
  2154. 158.75 s > ·(-1/2·(2·mUVexp²-2·mass_scalar_2²+2·(q₀.q₀))/denom(3,-q₂,mUVexp²,-mUV²+(q₂.q₂))
  2155. 158.75 s > +4·(q₀.q₂)²/denom(3,-q₂,mUVexp²,-mUV²+(q₂.q₂))²
  2156. 158.75 s > )/(denom(2,q₂,mUVexp²,-mUV²+(q₂.q₂))·denom(3,-q₂,mUVexp²,-mUV²+(q₂.q₂)))
  2157. 158.75 s > )·q₀(αᵉ².¹)·q₀(αᵉ³.¹)·q₂(αᵉ².¹)·q₂(αᵉ³.¹)
  2158. 158.75 s > -SCALAR_COUPLING²·q₀(αᵉ².¹)·q₀(αᵉ³.¹)·q₂(αᵉ².¹)·q₂(αᵉ³.¹)
  2159. 158.75 s > /(denom(2,q₂,mUVexp²,-mUV²+(q₂.q₂))·denom(3,-q₂,mUVexp²,-mUV²+(q₂.q₂)))
  2160. 158.75 s > +2·SCALAR_COUPLING²·(q₀.q₂)·q₀(αᵉ².¹)·q₀(αᵉ³.¹)·q₂(αᵉ².¹)·q₂(αᵉ³.¹)
  2161. 158.75 s > /(denom(2,q₂,mUVexp²,-mUV²+(q₂.q₂))·denom(3,-q₂,mUVexp²,-mUV²+(q₂.q₂))²)
  2162. 158.75 s > span t{span_context=true current=subgraph=y, topo_order=1, dod=2 given=subgraph=0, topo_order=0, dod=0}
  2163. 158.75 s > [2026-08-27 10:10:26.631] @approx::local_4d [{#profile, #uv, #collect, #integrated, #start, #trace}] DEBUG : After gamma schoonschip
  2164. 158.75 s > field value
  2165. 158.75 s > expr n-terms: 3, byte size: 1631,expr:
  2166. 158.75 s > (1/2·SCALAR_COUPLING²·(2·mUVexp²-2·mass_scalar_2²)/(denom(2,q₂,mUVexp²,-mUV²+(q₂.q₂))²·denom(3,-q₂,mUVexp²,-mUV²+(q₂.q₂)))
  2167. 158.75 s > -SCALAR_COUPLING²
  2168. 158.75 s > ·(-1/2·(2·mUVexp²-2·mass_scalar_2²+2·(q₀.q₀))/denom(3,-q₂,mUVexp²,-mUV²+(q₂.q₂))
  2169. 158.75 s > +4·(q₀.q₂)²/denom(3,-q₂,mUVexp²,-mUV²+(q₂.q₂))²
  2170. 158.75 s > )/(denom(2,q₂,mUVexp²,-mUV²+(q₂.q₂))·denom(3,-q₂,mUVexp²,-mUV²+(q₂.q₂)))
  2171. 158.75 s > )·(q₀.q₂)²
  2172. 158.75 s > -SCALAR_COUPLING²·(q₀.q₂)²/(denom(2,q₂,mUVexp²,-mUV²+(q₂.q₂))·denom(3,-q₂,mUVexp²,-mUV²+(q₂.q₂)))
  2173. 158.75 s > +2·SCALAR_COUPLING²·(q₀.q₂)·(q₀.q₂)²
  2174. 158.75 s > /(denom(2,q₂,mUVexp²,-mUV²+(q₂.q₂))·denom(3,-q₂,mUVexp²,-mUV²+(q₂.q₂))²)
  2175. 158.75 s > span t{span_context=true current=subgraph=y, topo_order=1, dod=2 given=subgraph=0, topo_order=0, dod=0}
  2176. 158.75 s > [2026-08-27 10:10:26.634] @approx::local_4d [{#profile, #uv, #collect, #integrated, #start, #trace}] DEBUG : After gamma collection
  2177. 158.75 s > field value
  2178. 158.75 s > expr n-terms: 1, byte size: 1347,expr:
  2179. 158.75 s > SCALAR_COUPLING²
  2180. 158.75 s > ·(-denom(2,q₂,mUVexp²,-mUV²+(q₂.q₂))·denom(3,-q₂,mUVexp²,-mUV²+(q₂.q₂))²
  2181. 158.75 s > +1/2·(2·mUVexp²-2·mass_scalar_2²)·denom(3,-q₂,mUVexp²,-mUV²+(q₂.q₂))²
  2182. 158.75 s > -(-1/2·(2·mUVexp²-2·mass_scalar_2²+2·(q₀.q₀))·denom(3,-q₂,mUVexp²,-mUV²+(q₂.q₂))+4·(q₀.q₂)²)
  2183. 158.75 s > ·denom(2,q₂,mUVexp²,-mUV²+(q₂.q₂))
  2184. 158.75 s > +2·(q₀.q₂)·denom(2,q₂,mUVexp²,-mUV²+(q₂.q₂))·denom(3,-q₂,mUVexp²,-mUV²+(q₂.q₂))
  2185. 158.75 s > )·(q₀.q₂)²/(denom(2,q₂,mUVexp²,-mUV²+(q₂.q₂))²·denom(3,-q₂,mUVexp²,-mUV²+(q₂.q₂))³)
  2186. 158.75 s > span t{span_context=true current=subgraph=y, topo_order=1, dod=2 given=subgraph=0, topo_order=0, dod=0}
  2187. 158.75 s > [2026-08-27 10:10:26.635] @approx::local_4d [{#profile, #uv, #gamma, #integrated, #start, #trace, #vakint}] DEBUG : After gamma simplification
  2188. 158.75 s > ... omitted 3263 more lines; see full nextest output above
  2189. 158.75 s >
  2190. 158.75 s > 8. gammaloop-integration-tests::uv::sunrise_scalar_1_uv
  2191. 158.75 s > failure: test failure with exit code 101
  2192. 158.75 s > system-out
  2193. 158.75 s > running 1 test
  2194. 158.75 s > test sunrise_scalar_1_uv has been running for over 60 seconds
  2195. 158.75 s > +------------------+------------------------+--------------+--------+----------+----------------------------------------------------------------------------------------------------------------------+-------+
  2196. 158.75 s > | case | check | graph | status | sigma | threshold | error |
  2197. 158.75 s > +------------------+------------------------+--------------+--------+----------+----------------------------------------------------------------------------------------------------------------------+-------+
  2198. 158.75 s > | sunrise_scalar_1 | uv_profile | - | FAIL | - | - | - |
  2199. 158.75 s > +------------------+------------------------+--------------+--------+----------+----------------------------------------------------------------------------------------------------------------------+-------+
  2200. 158.75 s > | sunrise_scalar_1 | m_uv.inspect | inspect | pass | - | best inspect relative delta 1.624e0 >= 1000*accuracy 1.000e-3 (accuracy=1.000e-6, exponent=+1.0, seed=1, probes=10) | - |
  2201. 158.75 s > +------------------+------------------------+--------------+--------+----------+----------------------------------------------------------------------------------------------------------------------+-------+
  2202. 158.75 s > | sunrise_scalar_1 | m_uv.integrated | sunrise | pass | 0.1sigma | compatible within 2sigma | - |
  2203. 158.75 s > +------------------+------------------------+--------------+--------+----------+----------------------------------------------------------------------------------------------------------------------+-------+
  2204. 158.75 s > | sunrise_scalar_1 | rls.inspect | inspect | pass | - | best inspect relative delta 8.682e-1 >= 1000*accuracy 1.000e-3 (accuracy=1.000e-6, exponent=+1.0, seed=1, probes=10) | - |
  2205. 158.75 s > +------------------+------------------------+--------------+--------+----------+----------------------------------------------------------------------------------------------------------------------+-------+
  2206. 158.75 s > | sunrise_scalar_1 | rls.integrated | sunrise | pass | 0.0sigma | compatible within 2sigma | - |
  2207. 158.75 s > +------------------+------------------------+--------------+--------+----------+----------------------------------------------------------------------------------------------------------------------+-------+
  2208. 158.75 s > | sunrise_scalar_1 | mu_r.inspect | inspect | pass | - | best inspect relative delta 1.752e0 >= 1000*accuracy 1.000e-3 (accuracy=1.000e-6, exponent=+1.0, seed=1, probes=10) | - |
  2209. 158.75 s > +------------------+------------------------+--------------+--------+----------+----------------------------------------------------------------------------------------------------------------------+-------+
  2210. 158.75 s > | sunrise_scalar_1 | integrated.relerr | integrated | pass | - | relative error 9.20% <= 10.00% | - |
  2211. 158.75 s > +------------------+------------------------+--------------+--------+----------+----------------------------------------------------------------------------------------------------------------------+-------+
  2212. 158.75 s > | sunrise_scalar_1 | m_uv.integrated.relerr | m_uv-shifted | pass | - | relative error 5.89% <= 10.00% | - |
  2213. 158.75 s > +------------------+------------------------+--------------+--------+----------+----------------------------------------------------------------------------------------------------------------------+-------+
  2214. 158.75 s > | sunrise_scalar_1 | target | - | pass | - | 2sigma | - |
  2215. 158.75 s > +------------------+------------------------+--------------+--------+----------+----------------------------------------------------------------------------------------------------------------------+-------+
  2216. 158.75 s > test sunrise_scalar_1_uv ... FAILED
  2217. 158.75 s >
  2218. 158.75 s > failures:
  2219. 158.75 s >
  2220. 158.75 s > failures:
  2221. 158.75 s > sunrise_scalar_1_uv
  2222. 158.75 s >
  2223. 158.75 s > test result: FAILED. 0 passed; 1 failed; 0 ignored; 0 measured; 24 filtered out; finished in 114.66s
  2224. 158.75 s > system-err
  2225. 158.75 s > [2026-08-27 10:10:36.806] @gammaloop_api::se... INFO : Running command run generate
  2226. 158.75 s > [2026-08-27 10:10:36.810] @gammaloop_api::se... INFO : Starting command block generate
  2227. 158.75 s > [2026-08-27 10:10:36.810] @gammaloop_api::se... INFO : Running command import model scalars-default.json
  2228. 158.75 s > [2026-08-27 10:10:36.810] @import::model INFO : Loading built-in JSON model scalars-default
  2229. 158.75 s > [2026-08-27 10:10:36.848] @gammalooprs::model INFO : The following 2 external parameters were forced to zero by the restriction card:
  2230. 158.75 s > width_scalar_1, width_scalar_2
  2231. 158.75 s > [2026-08-27 10:10:36.849] @gammaloop_api::se... INFO : Running command remove processes
  2232. 158.75 s > [2026-08-27 10:10:36.849] @gammaloop_api::se... INFO : Running command set global kv global.generation.uv.generate_integrated=true
  2233. 158.75 s > [2026-08-27 10:10:36.862] @gammaloop_api::se... INFO : Running command import graphs ./tests/resources/graphs/scalar_sunrise.dot -p sunrise_scalar_1 -i scalar_sunrise
  2234. 158.75 s > [2026-08-27 10:10:36.862] @commands::import INFO : Loading graphs from '/build/source/tests/resources/graphs/scalar_sunrise.dot'
  2235. 158.75 s > [2026-08-27 10:10:36.886] @gammaloop_api::se... INFO : Running command generate existing -p sunrise_scalar_1 -i scalar_sunrise
  2236. 158.75 s > [2026-08-27 10:10:36.891] @approx::local_4d [{#uv, #inspect, #integrated}] DEBUG : Rescaled momenta expanded
  2237. 158.75 s > field value
  2238. 158.75 s > res n-terms: 1, byte size: 3,expr:
  2239. 158.75 s > 1
  2240. 158.75 s > [2026-08-27 10:10:36.895] @approx::local_4d [{#uv, #inspect, #integrated}] DEBUG : Rescaled momenta expanded
  2241. 158.75 s > field value
  2242. 158.75 s > res n-terms: 1, byte size: 611,expr:
  2243. 158.75 s > 1/(denom(0,q₀/t,mass_scalar_1²,-mass_scalar_1²+(q₀.q₀)/t²)
  2244. 158.75 s > ·denom(2,-q₁+q₃-q₀/t,mass_scalar_1²,
  2245. 158.75 s > -mass_scalar_1²+2·(q₀.q₁)/t-2·(q₀.q₃)/t+(q₀.q₀)/t²+(q₁.q₁)
  2246. 158.75 s > -2·(q₁.q₃)+(q₃.q₃)
  2247. 158.75 s > ))
  2248. 158.75 s > [2026-08-27 10:10:36.896] @approx::local_4d [{#uv, #inspect, #integrated}] DEBUG : Rescaled momenta expanded
  2249. 158.75 s > field value
  2250. 158.75 s > res n-terms: 1, byte size: 611,expr:
  2251. 158.75 s > 1/(denom(0,q₀/t,mass_scalar_1²,-mass_scalar_1²+(q₀.q₀)/t²)
  2252. 158.75 s > ·denom(1,-q₂+q₃-q₀/t,mass_scalar_1²,
  2253. 158.75 s > -mass_scalar_1²+2·(q₀.q₂)/t-2·(q₀.q₃)/t+(q₀.q₀)/t²+(q₂.q₂)
  2254. 158.75 s > -2·(q₂.q₃)+(q₃.q₃)
  2255. 158.75 s > ))
  2256. 158.75 s > [2026-08-27 10:10:36.902] @approx::local_4d [{#uv, #inspect, #integrated}] DEBUG : Rescaled momenta expanded
  2257. 158.75 s > field value
  2258. 158.75 s > res n-terms: 1, byte size: 777,expr:
  2259. 158.75 s > 1/(denom(0,q₀/t,mass_scalar_1²,-mass_scalar_1²+(q₀.q₀)/t²)·denom(1,q₁/t,mass_scalar_1²,-mass_scalar_1²+(q₁.q₁)/t²)
  2260. 158.75 s > ·denom(2,q₄-q₀/t-q₁/t,mass_scalar_1²,
  2261. 158.75 s > -mass_scalar_1²-2·(q₀.q₄)/t-2·(q₁.q₄)/t+(q₀.q₀)/t²+2·(q₀.q₁)/t²
  2262. 158.75 s > +(q₁.q₁)/t²+(q₄.q₄)
  2263. 158.75 s > ))
  2264. 158.75 s > [2026-08-27 10:10:36.907] @approx::local_4d [{#uv, #inspect, #integrated}] DEBUG : Rescaled momenta expanded
  2265. 158.75 s > field value
  2266. 158.75 s > res n-terms: 1, byte size: 611,expr:
  2267. 158.75 s > 1/(denom(1,q₁/t,mass_scalar_1²,-mass_scalar_1²+(q₁.q₁)/t²)
  2268. 158.75 s > ·denom(2,-q₀+q₃-q₁/t,mass_scalar_1²,
  2269. 158.75 s > -mass_scalar_1²+2·(q₀.q₁)/t-2·(q₁.q₃)/t+(q₁.q₁)/t²+(q₀.q₀)
  2270. 158.75 s > -2·(q₀.q₃)+(q₃.q₃)
  2271. 158.75 s > ))
  2272. 158.75 s > [2026-08-27 10:10:36.909] @approx::final_integrand[{#generation, #profile, #uv, #graph, #summary}] DEBUG : Computed global numerator
  2273. 158.75 s > field value
  2274. 158.75 s > global_num n-terms: 1, byte size: 3,expr:
  2275. 158.75 s > 1
  2276. 158.75 s > span build_3d{span_context=true graph=sunrise current=subgraph=0, topo_order=0, dod=0}
  2277. 158.75 s > [2026-08-27 10:10:36.916] @uv::approx [{#generation, #uv, #fourd}] DEBUG : Computing 4D
  2278. 158.75 s > field value
  2279. 158.75 s > simple subgraph(S_47,S_3I)*Approx(subgraph(S_3I,0)) of sunrise
  2280. 158.75 s > span compute_4d{span_context=true graph=sunrise current=subgraph=3I, topo_order=1, dod=0 given=subgraph=0, topo_order=0, dod=0 reduced=SubSet { set: BitVec<usize, bitvec::order::Lsb0> { addr: 0x7fffec03da60, head: 000000, bits: 8, capacity: 64 } [0, 0, 1, 1, 0, 0, 1, 1], id: PhantomData<linnet::half_edge::involution::Hedge> }}
  2281. 158.75 s > [2026-08-27 10:10:36.917] @approx::local_4d [{#uv, #algebra, #integrated, #start}] DEBUG :
  2282. 158.75 s > field value
  2283. 158.75 s > integrand n-terms: 1, byte size: 217,expr:
  2284. 158.75 s > 1/(denom(0,q₀,mass_scalar_1²,-mass_scalar_1²+(q₀.q₀))·denom(2,q₂,mass_scalar_1²,-mass_scalar_1²+(q₂.q₂)))
  2285. 158.75 s > reduced 3I
  2286. 158.75 s > span grow{span_context=true current=subgraph=3I, topo_order=1, dod=0 given=subgraph=0, topo_order=0, dod=0}
  2287. 158.75 s > [2026-08-27 10:10:36.917] @approx::local_4d [{#uv, #inspect, #integrated}] DEBUG : Rescaled momenta expanded
  2288. 158.75 s > field value
  2289. 158.75 s > res n-terms: 1, byte size: 611,expr:
  2290. 158.75 s > 1/(denom(0,q₀/t,mass_scalar_1²,-mass_scalar_1²+(q₀.q₀)/t²)
  2291. 158.75 s > ·denom(2,-q₁+q₃-q₀/t,mass_scalar_1²,
  2292. 158.75 s > -mass_scalar_1²+2·(q₀.q₁)/t-2·(q₀.q₃)/t+(q₀.q₀)/t²+(q₁.q₁)
  2293. 158.75 s > -2·(q₁.q₃)+(q₃.q₃)
  2294. 158.75 s > ))
  2295. 158.75 s > span t{span_context=true current=subgraph=3I, topo_order=1, dod=0 given=subgraph=0, topo_order=0, dod=0}
  2296. 158.75 s > [2026-08-27 10:10:36.918] @approx::local_4d [{#uv, #integrated, #rescaled}] DEBUG : Rescaled expanded
  2297. 158.75 s > field value
  2298. 158.75 s > n_loops 1
  2299. 158.75 s > res n-terms: 1, byte size: 723,expr:
  2300. 158.75 s > 1/(denom(0,q₀,mUVexp²+t²·mass_scalar_1²,-mUV²+t²·(-mass_scalar_1²+(q₀.q₀)/t²)+t²·mUVexp²)
  2301. 158.75 s > ·denom(2,-q₀,mUVexp²+t²·mass_scalar_1²,
  2302. 158.75 s > -mUV²
  2303. 158.75 s > +t²
  2304. 158.75 s > ·(-mass_scalar_1²+2·(q₀.q₁)/t-2·(q₀.q₃)/t+(q₀.q₀)/t²+(q₁.q₁)
  2305. 158.75 s > -2·(q₁.q₃)+(q₃.q₃)
  2306. 158.75 s > )
  2307. 158.75 s > +t²·mUVexp²
  2308. 158.75 s > ))
  2309. 158.75 s > span t{span_context=true current=subgraph=3I, topo_order=1, dod=0 given=subgraph=0, topo_order=0, dod=0}
  2310. 158.75 s > [2026-08-27 10:10:36.918] @approx::local_4d [{#uv, #integrated, #series}] DEBUG : Series expanded
  2311. 158.75 s > field value
  2312. 158.75 s > res n-terms: 1, byte size: 223,expr:
  2313. 158.75 s > 1/(denom(0,q₀,mUVexp²,-mUV²+(q₀.q₀))·denom(2,-q₀,mUVexp²,-mUV²+(q₀.q₀)))
  2314. 158.75 s > span t{span_context=true current=subgraph=3I, topo_order=1, dod=0 given=subgraph=0, topo_order=0, dod=0}
  2315. 158.75 s > [2026-08-27 10:10:36.918] @approx::local_4d [{#uv, #integrated, #series}] DEBUG : Evaluated at t = 1
  2316. 158.75 s > field value
  2317. 158.75 s > res n-terms: 1, byte size: 223,expr:
  2318. 158.75 s > 1/(denom(0,q₀,mUVexp²,-mUV²+(q₀.q₀))·denom(2,-q₀,mUVexp²,-mUV²+(q₀.q₀)))
  2319. 158.75 s > span t{span_context=true current=subgraph=3I, topo_order=1, dod=0 given=subgraph=0, topo_order=0, dod=0}
  2320. 158.75 s > [2026-08-27 10:10:36.920] @approx::local_4d [{#uv, #collect, #integrated}] DEBUG : After gamma chain collection
  2321. 158.75 s > field value
  2322. 158.75 s > expr n-terms: 1, byte size: 223,expr:
  2323. 158.75 s > 1/(denom(0,q₀,mUVexp²,-mUV²+(q₀.q₀))·denom(2,-q₀,mUVexp²,-mUV²+(q₀.q₀)))
  2324. 158.75 s > span t{span_context=true current=subgraph=3I, topo_order=1, dod=0 given=subgraph=0, topo_order=0, dod=0}
  2325. 158.75 s > [2026-08-27 10:10:36.921] @approx::local_4d [{#profile, #uv, #collect, #integrated, #start, #trace}] DEBUG : After gamma schoonschip
  2326. 158.75 s > field value
  2327. 158.75 s > expr n-terms: 1, byte size: 223,expr:
  2328. 158.75 s > 1/(denom(0,q₀,mUVexp²,-mUV²+(q₀.q₀))·denom(2,-q₀,mUVexp²,-mUV²+(q₀.q₀)))
  2329. 158.75 s > span t{span_context=true current=subgraph=3I, topo_order=1, dod=0 given=subgraph=0, topo_order=0, dod=0}
  2330. 158.75 s > [2026-08-27 10:10:36.921] @approx::local_4d [{#profile, #uv, #collect, #integrated, #start, #trace}] DEBUG : After gamma collection
  2331. 158.75 s > field value
  2332. 158.75 s > expr n-terms: 1, byte size: 223,expr:
  2333. 158.75 s > 1/(denom(0,q₀,mUVexp²,-mUV²+(q₀.q₀))·denom(2,-q₀,mUVexp²,-mUV²+(q₀.q₀)))
  2334. 158.75 s > span t{span_context=true current=subgraph=3I, topo_order=1, dod=0 given=subgraph=0, topo_order=0, dod=0}
  2335. 158.75 s > [2026-08-27 10:10:36.921] @approx::local_4d [{#profile, #uv, #gamma, #integrated, #start, #trace, #vakint}] DEBUG : After gamma simplification
  2336. 158.75 s > field value
  2337. 158.75 s > expr n-terms: 1, byte size: 223,expr:
  2338. 158.75 s > 1/(denom(0,q₀,mUVexp²,-mUV²+(q₀.q₀))·denom(2,-q₀,mUVexp²,-mUV²+(q₀.q₀)))
  2339. 158.75 s > span t{span_context=true current=subgraph=3I, topo_order=1, dod=0 given=subgraph=0, topo_order=0, dod=0}
  2340. 158.75 s > [2026-08-27 10:10:36.921] @approx::local_4d [{#profile, #uv, #integrated, #schoonschip, #start, #trace, #vakint}] DEBUG : After Schoonschip net
  2341. 158.75 s > field value
  2342. 158.75 s > expr n-terms: 1, byte size: 223,expr:
  2343. 158.75 s > 1/(denom(0,q₀,mUVexp²,-mUV²+(q₀.q₀))·denom(2,-q₀,mUVexp²,-mUV²+(q₀.q₀)))
  2344. 158.75 s > ... omitted 20095 more lines; see full nextest output above
  2345. 158.75 s >
  2346. 158.75 s > 9. gammaloop-integration-tests::uv::se1l_uv
  2347. 158.75 s > failure: test failure with exit code 101
  2348. 158.75 s > system-out
  2349. 158.75 s > running 1 test
  2350. 158.75 s > test se1l_uv has been running for over 60 seconds
  2351. 158.75 s > +------+-----------------+---------+--------+----------+-----------------------------------------------------------------------------------------------------------------------+-------+
  2352. 158.75 s > | case | check | graph | status | sigma | threshold | error |
  2353. 158.75 s > +------+-----------------+---------+--------+----------+-----------------------------------------------------------------------------------------------------------------------+-------+
  2354. 158.75 s > | se1l | uv_profile | - | FAIL | - | - | - |
  2355. 158.75 s > +------+-----------------+---------+--------+----------+-----------------------------------------------------------------------------------------------------------------------+-------+
  2356. 158.75 s > | se1l | m_uv.inspect | inspect | pass | - | best inspect relative delta 1.097e-1 >= 1000*accuracy 1.000e-7 (accuracy=1.000e-10, exponent=+2.0, seed=1, probes=10) | - |
  2357. 158.75 s > +------+-----------------+---------+--------+----------+-----------------------------------------------------------------------------------------------------------------------+-------+
  2358. 158.75 s > | se1l | m_uv.integrated | se1l | pass | 0.1sigma | compatible within 2sigma | - |
  2359. 158.75 s > +------+-----------------+---------+--------+----------+-----------------------------------------------------------------------------------------------------------------------+-------+
  2360. 158.75 s > | se1l | rls.inspect | inspect | pass | - | best inspect relative delta 4.499e-2 >= 1000*accuracy 1.000e-7 (accuracy=1.000e-10, exponent=+2.0, seed=1, probes=10) | - |
  2361. 158.75 s > +------+-----------------+---------+--------+----------+-----------------------------------------------------------------------------------------------------------------------+-------+
  2362. 158.75 s > | se1l | rls.integrated | se1l | pass | 0.0sigma | compatible within 2sigma | - |
  2363. 158.75 s > +------+-----------------+---------+--------+----------+-----------------------------------------------------------------------------------------------------------------------+-------+
  2364. 158.75 s > | se1l | mu_r.inspect | inspect | pass | - | best inspect relative delta 1.424e-1 >= 1000*accuracy 1.000e-7 (accuracy=1.000e-10, exponent=+2.0, seed=1, probes=10) | - |
  2365. 158.75 s > +------+-----------------+---------+--------+----------+-----------------------------------------------------------------------------------------------------------------------+-------+
  2366. 158.75 s > | se1l | target | - | pass | - | 2sigma | - |
  2367. 158.75 s > +------+-----------------+---------+--------+----------+-----------------------------------------------------------------------------------------------------------------------+-------+
  2368. 158.75 s > test se1l_uv ... FAILED
  2369. 158.75 s >
  2370. 158.75 s > failures:
  2371. 158.75 s >
  2372. 158.75 s > failures:
  2373. 158.75 s > se1l_uv
  2374. 158.75 s >
  2375. 158.75 s > test result: FAILED. 0 passed; 1 failed; 0 ignored; 0 measured; 24 filtered out; finished in 119.48s
  2376. 158.75 s > system-err
  2377. 158.75 s > [2026-08-27 10:10:36.528] @gammaloop_api::se... INFO : Running command run generate
  2378. 158.75 s > [2026-08-27 10:10:36.528] @gammaloop_api::se... INFO : Starting command block generate
  2379. 158.75 s > [2026-08-27 10:10:36.528] @gammaloop_api::se... INFO : Running command import model sm-default
  2380. 158.75 s > [2026-08-27 10:10:36.528] @import::model INFO : Loading built-in JSON model sm-default
  2381. 158.75 s > [2026-08-27 10:10:36.550] @gammalooprs::model INFO : The following 11 external parameters were forced to zero by the restriction card:
  2382. 158.75 s > lamWS, AWS, rhoWS, etaWS, ymc, yme, ymm, MC, Me, MM, WTau
  2383. 158.75 s > [2026-08-27 10:10:36.551] @gammalooprs::model INFO : The following 34 vertex rules were removed by the restriction card:
  2384. 158.75 s > V_82 -> (c~, d, G+) | V_83 -> (t~, d, G+) | V_84 -> (c~, s, G+) | V_85 -> (t~, s, G+) | V_86 -> (u~, b, G+) | V_87 -> (c~, b, G+) | V_90 -> (c~, d, W+) | V_91 -> (t~, d, W+) | V_92 -> (u~, s, W+) | V_94 -> (t~, s, W+) | V_95 -> (u~, b, W+) | V_96 -> (c~, b, W+) | V_101 -> (e+, e-, G0) | V_102 -> (mu+, mu-, G0) | V_104 -> (e+, e-, H) | V_105 -> (mu+, mu-, H) | V_110 -> (ve~, e-, G+) | V_111 -> (vm~, mu-, G+) | V_116 -> (b~, u, G-) | V_117 -> (d~, c, G-) | V_118 -> (s~, c, G-) | V_119 -> (b~, c, G-) | V_120 -> (d~, t, G-) | V_121 -> (s~, t, G-) | V_124 -> (s~, u, W-) | V_125 -> (b~, u, W-) | V_126 -> (d~, c, W-) | V_128 -> (b~, c, W-) | V_129 -> (d~, t, W-) | V_130 -> (s~, t, W-) | V_138 -> (c~, c, G0) | V_140 -> (c~, c, H) | V_145 -> (e+, ve, G-) | V_146 -> (mu+, vm, G-)
  2385. 158.75 s > [2026-08-27 10:10:36.551] @gammalooprs::model INFO : The following 36 couplings were removed by the restriction card:
  2386. 158.75 s > GC_13, GC_14, GC_16, GC_17, GC_18, GC_19, GC_20, GC_22, GC_23, GC_24, GC_25, GC_26, GC_28, GC_29, GC_42, GC_43, GC_44, GC_46, GC_47, GC_48, GC_84, GC_85, GC_86, GC_87, GC_88, GC_89, GC_90, GC_91, GC_92, GC_93, GC_101, GC_102, GC_103, GC_105, GC_106, GC_107
  2387. 158.75 s > [2026-08-27 10:10:36.551] @gammaloop_api::se... INFO : Running command remove processes
  2388. 158.75 s > [2026-08-27 10:10:36.551] @gammaloop_api::se... INFO : Running command set global kv global.generation.uv.generate_integrated=true
  2389. 158.75 s > [2026-08-27 10:10:36.552] @gammaloop_api::se... INFO : Running command import graphs ./tests/resources/graphs/uv_tests/se1l.dot -p se1l -i se1l
  2390. 158.75 s > [2026-08-27 10:10:36.552] @commands::import INFO : Loading graphs from '/build/source/tests/resources/graphs/uv_tests/se1l.dot'
  2391. 158.75 s > [2026-08-27 10:10:36.554] @gammaloop_api::se... INFO : Running command generate existing -p se1l -i se1l
  2392. 158.75 s > [2026-08-27 10:10:38.018] @commands::generate INFO :
  2393. 158.75 s > Integrand generation summary
  2394. 158.75 s > peak RAM 86.07 MiB | cores 1
  2395. 158.75 s > ╭───────────┬───────┬─────────┬─────────────┬─────────────┬────────────────┬─────────────╮
  2396. 158.75 s > │ integrand │ graph │ # evals │ expr build │ spenso │ symbolica eval │ compile │
  2397. 158.75 s > ├───────────┼───────┼─────────┼─────────────┼─────────────┼────────────────┼─────────────┤
  2398. 158.75 s > │ se1l │ se1l │ 5 │ 1.33s (94%) │ 33ms (2.4%) │ 54ms (3.9%) │ 0ms (0.00%) │
  2399. 158.75 s > ├───────────┼───────┼─────────┼─────────────┼─────────────┼────────────────┼─────────────┤
  2400. 158.75 s > │ Total │ │ 5 │ 1.33s (94%) │ 33ms (2.4%) │ 54ms (3.9%) │ 0ms (0.00%) │
  2401. 158.75 s > ╰───────────┴───────┴─────────┴─────────────┴─────────────┴────────────────┴─────────────╯
  2402. 158.75 s > [2026-08-27 10:10:38.019] @gammaloop_api::se... INFO : Running command set process -p se1l -i se1l kv general.m_uv=0.2
  2403. 158.75 s > [2026-08-27 10:10:38.020] @gammaloop_api::se... INFO : Running command set process -p se1l -i se1l kv general.mu_r=0.2
  2404. 158.75 s > [2026-08-27 10:10:38.021] @gammaloop_api::se... INFO : Running command set process -p se1l -i se1l kv general.renormalization_localization_scale=0.2
  2405. 158.75 s > [2026-08-27 10:10:38.022] @gammaloop_api::se... INFO : Running command duplicate integrand -p se1l -i se1l --output_process_name se1l --output_integrand_name se1l_muv_shifted
  2406. 158.75 s > [2026-08-27 10:10:38.023] @gammaloop_api::se... INFO : Running command set process -p se1l -i se1l_muv_shifted kv general.m_uv=0.5
  2407. 158.75 s > [2026-08-27 10:10:38.024] @gammaloop_api::se... INFO : Running command duplicate integrand -p se1l -i se1l --output_process_name se1l --output_integrand_name se1l_rls_shifted
  2408. 158.75 s > [2026-08-27 10:10:38.025] @gammaloop_api::se... INFO : Running command set process -p se1l -i se1l_rls_shifted kv general.renormalization_localization_scale=1
  2409. 158.75 s > [2026-08-27 10:10:38.026] @gammaloop_api::se... INFO : Running command duplicate integrand -p se1l -i se1l --output_process_name se1l --output_integrand_name se1l_mur_shifted
  2410. 158.75 s > [2026-08-27 10:10:38.028] @gammaloop_api::se... INFO : Running command set process -p se1l -i se1l_mur_shifted kv general.mu_r=0.8
  2411. 158.75 s > [2026-08-27 10:10:38.033] @process::amplitude WARNING : External state 0 ('g', PDG 21, helicity +) is off shell: p^2 = +2.5e5, expected m^2 = +0e0 (|Δ| = +2.5e5). Fixed-helicity spinor/vector/tensor external states may be ill-defined at this kinematic point.
  2412. 158.75 s > field value
  2413. 158.75 s > span warm_up{integrand.name=se1l}
  2414. 158.75 s > [2026-08-27 10:10:38.033] @process::amplitude WARNING : External state 1 ('g', PDG 21, helicity -) is off shell: p^2 = +2.5e5, expected m^2 = +0e0 (|Δ| = +2.5e5). Fixed-helicity spinor/vector/tensor external states may be ill-defined at this kinematic point.
  2415. 158.75 s > field value
  2416. 158.75 s > span warm_up{integrand.name=se1l}
  2417. 158.75 s > [2026-08-27 10:10:38.033] @process::amplitude INFO : Input is above threshold: 1 existing threshold E-surfaces across 1/1 graph groups
  2418. 158.75 s > field value
  2419. 158.75 s > existing_esurfaces 1
  2420. 158.75 s > group_count 1
  2421. 158.75 s > groups_above_threshold 1
  2422. 158.75 s > integrand se1l
  2423. 158.75 s > span warm_up{integrand.name=se1l}
  2424. 158.75 s > threshold_status above threshold
  2425. 158.75 s > [2026-08-27 10:10:38.033] @process::amplitude INFO : overlap structure of group 0: [1: [0(2,3)]]
  2426. 158.75 s > field value
  2427. 158.75 s > span warm_up{integrand.name=se1l}
  2428. 158.75 s > [2026-08-27 10:10:38.372] @commands::profile INFO :
  2429. 158.75 s > ╭───────┬──────┬──────────┬───────┬─────┬──────────┬───────────╮
  2430. 158.75 s > │ fixed │ → ∞ │ slope │ r2 │ DOD │ bare DOD │ inspect │
  2431. 158.75 s > ├───────┼──────┼──────────┼───────┼─────┼──────────┼───────────┤
  2432. 158.75 s > │ {} │ {e3} │ 1.639236 │ 0.904 │ 2 │ 2 │ arb retry │
  2433. 158.75 s > │ {} │ {e2} │ 1.698834 │ 0.902 │ 2 │ 2 │ arb retry │
  2434. 158.75 s > ╰───────┴──────┴──────────┴───────┴─────┴──────────┴───────────╯
  2435. 158.75 s > [2026-08-27 10:10:38.372] @commands::profile INFO :
  2436. 158.75 s > ╭───────┬──────┬─────────────┬──────────┬───────┬─────┬──────────┬───────────╮
  2437. 158.75 s > │ fixed │ → ∞ │ orientation │ slope │ r2 │ DOD │ bare DOD │ inspect │
  2438. 158.75 s > ├───────┼──────┼─────────────┼──────────┼───────┼─────┼──────────┼───────────┤
  2439. 158.75 s > │ {} │ {e3} │ 00-+ │ 0.343429 │ 0.145 │ 0 │ 2 │ arb retry │
  2440. 158.75 s > │ {} │ {e3} │ 00+- │ 0.342577 │ 0.135 │ 0 │ 2 │ arb retry │
  2441. 158.75 s > │ {} │ {e2} │ 00-+ │ 0.385975 │ 0.161 │ 0 │ 2 │ arb retry │
  2442. 158.75 s > │ {} │ {e2} │ 00+- │ 0.384920 │ 0.192 │ 0 │ 2 │ arb retry │
  2443. 158.75 s > ╰───────┴──────┴─────────────┴──────────┴───────┴─────┴──────────┴───────────╯
  2444. 158.75 s > [2026-08-27 10:10:38.373] @gammaloop_api::se... INFO : Running command set process kv integrator.target_relative_accuracy=0.001 integrator.n_increase=0 integrator.n_start=50000 integrator.n_max=400000 integrator.seed=1337
  2445. 158.75 s > [2026-08-27 10:10:38.374] @commands::integrate INFO : Created workspace directory at /build/source/tests/artifacts/se1l/integration_workspace_se1l
  2446. 158.75 s > [2026-08-27 10:10:38.472] @commands::integrate INFO : No integration state found, starting new integration
  2447. 158.75 s > [2026-08-27 10:10:38.473] @commands::integrate INFO : Gammaloop now integrates se1l@se1l, se1l@se1l_muv_shifted, se1l@se1l_rls_shifted
  2448. 158.75 s > [2026-08-27 10:10:38.474] @process::amplitude WARNING : External state 0 ('g', PDG 21, helicity +) is off shell: p^2 = +2.5e5, expected m^2 = +0e0 (|Δ| = +2.5e5). Fixed-helicity spinor/vector/tensor external states may be ill-defined at this kinematic point.
  2449. 158.75 s > field value
  2450. 158.75 s > span warm_up{integrand.name=se1l}
  2451. 158.75 s > [2026-08-27 10:10:38.474] @process::amplitude WARNING : External state 1 ('g', PDG 21, helicity -) is off shell: p^2 = +2.5e5, expected m^2 = +0e0 (|Δ| = +2.5e5). Fixed-helicity spinor/vector/tensor external states may be ill-defined at this kinematic point.
  2452. 158.75 s > field value
  2453. 158.75 s > span warm_up{integrand.name=se1l}
  2454. 158.75 s > [2026-08-27 10:10:38.476] @process::amplitude INFO : Input is above threshold: 1 existing threshold E-surfaces across 1/1 graph groups
  2455. 158.75 s > field value
  2456. 158.75 s > existing_esurfaces 1
  2457. 158.75 s > group_count 1
  2458. 158.75 s > groups_above_threshold 1
  2459. 158.75 s > integrand se1l
  2460. 158.75 s > span warm_up{integrand.name=se1l}
  2461. 158.75 s > threshold_status above threshold
  2462. 158.75 s > [2026-08-27 10:10:38.476] @process::amplitude INFO : overlap structure of group 0: [1: [0(2,3)]]
  2463. 158.75 s > field value
  2464. 158.75 s > span warm_up{integrand.name=se1l}
  2465. 158.75 s > [2026-08-27 10:10:38.477] @process::amplitude WARNING : External state 0 ('g', PDG 21, helicity +) is off shell: p^2 = +2.5e5, expected m^2 = +0e0 (|Δ| = +2.5e5). Fixed-helicity spinor/vector/tensor external states may be ill-defined at this kinematic point.
  2466. 158.75 s > field value
  2467. 158.75 s > span warm_up{integrand.name=se1l_muv_shifted}
  2468. 158.75 s > [2026-08-27 10:10:38.477] @process::amplitude WARNING : External state 1 ('g', PDG 21, helicity -) is off shell: p^2 = +2.5e5, expected m^2 = +0e0 (|Δ| = +2.5e5). Fixed-helicity spinor/vector/tensor external states may be ill-defined at this kinematic point.
  2469. 158.75 s > field value
  2470. 158.75 s > span warm_up{integrand.name=se1l_muv_shifted}
  2471. 158.75 s > [2026-08-27 10:10:38.478] @process::amplitude INFO : Input is above threshold: 1 existing threshold E-surfaces across 1/1 graph groups
  2472. 158.75 s > field value
  2473. 158.75 s > existing_esurfaces 1
  2474. 158.75 s > group_count 1
  2475. 158.75 s > groups_above_threshold 1
  2476. 158.75 s > integrand se1l_muv_shifted
  2477. 158.75 s > span warm_up{integrand.name=se1l_muv_shifted}
  2478. 158.75 s > threshold_status above threshold
  2479. 158.75 s > [2026-08-27 10:10:38.478] @process::amplitude INFO : overlap structure of group 0: [1: [0(2,3)]]
  2480. 158.75 s > field value
  2481. 158.75 s > span warm_up{integrand.name=se1l_muv_shifted}
  2482. 158.75 s > [2026-08-27 10:10:38.479] @process::amplitude WARNING : External state 0 ('g', PDG 21, helicity +) is off shell: p^2 = +2.5e5, expected m^2 = +0e0 (|Δ| = +2.5e5). Fixed-helicity spinor/vector/tensor external states may be ill-defined at this kinematic point.
  2483. 158.75 s > field value
  2484. 158.75 s > span warm_up{integrand.name=se1l_rls_shifted}
  2485. 158.75 s > [2026-08-27 10:10:38.479] @process::amplitude WARNING : External state 1 ('g', PDG 21, helicity -) is off shell: p^2 = +2.5e5, expected m^2 = +0e0 (|Δ| = +2.5e5). Fixed-helicity spinor/vector/tensor external states may be ill-defined at this kinematic point.
  2486. 158.75 s > field value
  2487. 158.75 s > span warm_up{integrand.name=se1l_rls_shifted}
  2488. 158.75 s > [2026-08-27 10:10:38.479] @process::amplitude INFO : Input is above threshold: 1 existing threshold E-surfaces across 1/1 graph groups
  2489. 158.75 s > field value
  2490. 158.75 s > existing_esurfaces 1
  2491. 158.75 s > group_count 1
  2492. 158.75 s > groups_above_threshold 1
  2493. 158.75 s > integrand se1l_rls_shifted
  2494. 158.75 s > span warm_up{integrand.name=se1l_rls_shifted}
  2495. 158.75 s > threshold_status above threshold
  2496. 158.75 s > ... omitted 1410 more lines; see full nextest output above
  2497. 158.75 s > =========================================
  2498. 158.75 s For full logs, run:
  2499. 158.75 s nix log /nix/store/8h9hx82zgi6sfhhm31fs0s7q4qa225j3-gammaloop-nextest-integration.drv
  2500. 158.75 s [0 built (1 failed)]Run failed.