test packages.x86_64-linux.nix-ci-check-gammaloop-nextest-integration

Reproduce this run
Original Run
  1. 131.58 s gammaloop-nextest-integration> | dod2_bubble | rls.integrated | GL0 | pass | 0.0sigma | compatible within 2sigma | - |
  2. 131.58 s gammaloop-nextest-integration> +-------------+-----------------+---------+--------+----------+-----------------------------------------------------------------------------------------------------------------------+-------+
  3. 131.58 s gammaloop-nextest-integration> | dod2_bubble | mu_r.inspect | inspect | pass | - | best inspect relative delta 6.951e-1 >= 1000*accuracy 1.000e-7 (accuracy=1.000e-10, exponent=+0.0, seed=0, probes=10) | - |
  4. 131.58 s gammaloop-nextest-integration> +-------------+-----------------+---------+--------+----------+-----------------------------------------------------------------------------------------------------------------------+-------+
  5. 131.58 s gammaloop-nextest-integration> | dod2_bubble | target | - | pass | - | 2sigma | - |
  6. 131.58 s gammaloop-nextest-integration> +-------------+-----------------+---------+--------+----------+-----------------------------------------------------------------------------------------------------------------------+-------+
  7. 131.58 s gammaloop-nextest-integration> test dod2_bubble_uv ... FAILED
  8. 131.58 s gammaloop-nextest-integration>
  9. 131.58 s gammaloop-nextest-integration> failures:
  10. 131.58 s gammaloop-nextest-integration>
  11. 131.58 s gammaloop-nextest-integration> failures:
  12. 131.58 s gammaloop-nextest-integration> dod2_bubble_uv
  13. 131.58 s gammaloop-nextest-integration>
  14. 131.58 s gammaloop-nextest-integration> test result: FAILED. 0 passed; 1 failed; 0 ignored; 0 measured; 24 filtered out; finished in 40.77s
  15. 131.58 s gammaloop-nextest-integration> system-err
  16. 131.58 s gammaloop-nextest-integration> [2026-08-28 15:33:13.375] @gammaloop_api::se... INFO : Running command run generate
  17. 131.58 s gammaloop-nextest-integration> [2026-08-28 15:33:13.375] @gammaloop_api::se... INFO : Starting command block generate
  18. 131.58 s gammaloop-nextest-integration> [2026-08-28 15:33:13.375] @gammaloop_api::se... INFO : Running command import model scalars-default.json
  19. 131.58 s gammaloop-nextest-integration> [2026-08-28 15:33:13.375] @import::model INFO : Loading built-in JSON model scalars-default
  20. 131.58 s gammaloop-nextest-integration> [2026-08-28 15:33:13.378] @gammalooprs::model INFO : The following 2 external parameters were forced to zero by the restriction card:
  21. 131.58 s gammaloop-nextest-integration> width_scalar_1, width_scalar_2
  22. 131.58 s gammaloop-nextest-integration> [2026-08-28 15:33:13.379] @gammaloop_api::se... INFO : Running command remove processes
  23. 131.58 s gammaloop-nextest-integration> [2026-08-28 15:33:13.379] @gammaloop_api::se... INFO : Running command set global kv global.generation.uv.generate_integrated=true
  24. 131.58 s gammaloop-nextest-integration> [2026-08-28 15:33:13.379] @gammaloop_api::se... INFO : Running command import graphs ./tests/resources/graphs/scalar/dod2_bubble.dot -p bubble_dod2 -i scalar_bubble_below_thres
  25. 131.58 s gammaloop-nextest-integration> [2026-08-28 15:33:13.379] @commands::import INFO : Loading graphs from '/build/source/tests/resources/graphs/scalar/dod2_bubble.dot'
  26. 131.58 s gammaloop-nextest-integration> [2026-08-28 15:33:13.382] @gammaloop_api::se... INFO : Running command generate existing -p bubble_dod2 -i scalar_bubble_below_thres
  27. 131.58 s gammaloop-nextest-integration> [2026-08-28 15:33:13.383] @approx::local_4d [{#uv, #inspect, #integrated}] DEBUG : Rescaled momenta expanded
  28. 131.58 s gammaloop-nextest-integration> field value
  29. 131.58 s gammaloop-nextest-integration> res n-terms: 1, byte size: 3,expr:
  30. 131.58 s gammaloop-nextest-integration> 1
  31. 131.58 s gammaloop-nextest-integration> [2026-08-28 15:33:13.386] @approx::local_4d [{#uv, #inspect, #integrated}] DEBUG : Rescaled momenta expanded
  32. 131.58 s gammaloop-nextest-integration> field value
  33. 131.58 s gammaloop-nextest-integration> res n-terms: 1, byte size: 585,expr:
  34. 131.58 s gammaloop-nextest-integration> -SCALAR_COUPLING²·q₀(αᵉ².¹)·q₀(αᵉ³.¹)·q₂(αᵉ².¹)·q₂(αᵉ³.¹)
  35. 131.58 s gammaloop-nextest-integration> /(t²·denom(3,-q₀-q₂/t,mass_scalar_2²,-mass_scalar_2²+2·(q₀.q₂)/t+(q₂.q₂)/t²+(q₀.q₀))
  36. 131.58 s gammaloop-nextest-integration> ·denom(2,q₂/t,mass_scalar_2²,-mass_scalar_2²+(q₂.q₂)/t²))
  37. 131.58 s gammaloop-nextest-integration> [2026-08-28 15:33:13.387] @approx::final_integrand[{#generation, #profile, #uv, #graph, #summary}] DEBUG : Computed global numerator
  38. 131.58 s gammaloop-nextest-integration> field value
  39. 131.58 s gammaloop-nextest-integration> global_num n-terms: 1, byte size: 4,expr:
  40. 131.58 s gammaloop-nextest-integration> 1/2
  41. 131.58 s gammaloop-nextest-integration> span build_3d{span_context=true graph=GL0 current=subgraph=0, topo_order=0, dod=0}
  42. 131.58 s gammaloop-nextest-integration> [2026-08-28 15:33:13.389] @uv::approx [{#generation, #uv, #fourd}] DEBUG : Computing 4D
  43. 131.58 s gammaloop-nextest-integration> field value
  44. 131.58 s gammaloop-nextest-integration> simple subgraph(S_11,S_y)*Approx(subgraph(S_y,0)) of GL0
  45. 131.58 s gammaloop-nextest-integration> span compute_4d{span_context=true graph=GL0 current=subgraph=y, topo_order=1, dod=2 given=subgraph=0, topo_order=0, dod=0 reduced=SubSet { set: BitVec<usize, bitvec::order::Lsb0> { addr: 0x7fffec023490, head: 000000, bits: 6, capacity: 64 } [0, 0, 1, 1, 1, 1], id: PhantomData<linnet::half_edge::involution::Hedge> }}
  46. 131.58 s gammaloop-nextest-integration> [2026-08-28 15:33:13.394] @approx::local_4d [{#uv, #algebra, #integrated, #start}] DEBUG :
  47. 131.58 s gammaloop-nextest-integration> field value
  48. 131.58 s gammaloop-nextest-integration> integrand n-terms: 1, byte size: 409,expr:
  49. 131.58 s gammaloop-nextest-integration> SCALAR_COUPLING²·(q₀(αᵉ³.¹)+q₃(αᵉ³.¹))·q₀(αᵉ².¹)·q₀(αᵉ³.¹)·q₂(αᵉ².¹)
  50. 131.58 s gammaloop-nextest-integration> /(denom(2,q₂,mass_scalar_2²,-mass_scalar_2²+(q₂.q₂))·denom(3,q₃,mass_scalar_2²,-mass_scalar_2²+(q₃.q₃)))
  51. 131.58 s gammaloop-nextest-integration> reduced y
  52. 131.58 s gammaloop-nextest-integration> span grow{span_context=true current=subgraph=y, topo_order=1, dod=2 given=subgraph=0, topo_order=0, dod=0}
  53. 131.58 s gammaloop-nextest-integration> [2026-08-28 15:33:13.394] @approx::local_4d [{#uv, #inspect, #integrated}] DEBUG : Rescaled momenta expanded
  54. 131.58 s gammaloop-nextest-integration> field value
  55. 131.58 s gammaloop-nextest-integration> res n-terms: 1, byte size: 585,expr:
  56. 131.58 s gammaloop-nextest-integration> -SCALAR_COUPLING²·q₀(αᵉ².¹)·q₀(αᵉ³.¹)·q₂(αᵉ².¹)·q₂(αᵉ³.¹)
  57. 131.58 s gammaloop-nextest-integration> /(t²·denom(3,-q₀-q₂/t,mass_scalar_2²,-mass_scalar_2²+2·(q₀.q₂)/t+(q₂.q₂)/t²+(q₀.q₀))
  58. 131.58 s gammaloop-nextest-integration> ·denom(2,q₂/t,mass_scalar_2²,-mass_scalar_2²+(q₂.q₂)/t²))
  59. 131.58 s gammaloop-nextest-integration> span t{span_context=true current=subgraph=y, topo_order=1, dod=2 given=subgraph=0, topo_order=0, dod=0}
  60. 131.58 s gammaloop-nextest-integration> [2026-08-28 15:33:13.398] @approx::local_4d [{#uv, #integrated, #rescaled}] DEBUG : Rescaled expanded
  61. 131.58 s gammaloop-nextest-integration> field value
  62. 131.58 s gammaloop-nextest-integration> n_loops 1
  63. 131.58 s gammaloop-nextest-integration> res n-terms: 1, byte size: 707,expr:
  64. 131.58 s gammaloop-nextest-integration> -SCALAR_COUPLING²·q₀(αᵉ².¹)·q₀(αᵉ³.¹)·q₂(αᵉ².¹)·q₂(αᵉ³.¹)
  65. 131.58 s gammaloop-nextest-integration> /(t²·denom(3,-q₂,mUVexp²+t²·mass_scalar_2²,-mUV²+t²·(-mass_scalar_2²+2·(q₀.q₂)/t+(q₂.q₂)/t²+(q₀.q₀))+t²·mUVexp²)
  66. 131.58 s gammaloop-nextest-integration> ·denom(2,q₂,mUVexp²+t²·mass_scalar_2²,-mUV²+t²·(-mass_scalar_2²+(q₂.q₂)/t²)+t²·mUVexp²))
  67. 131.58 s gammaloop-nextest-integration> span t{span_context=true current=subgraph=y, topo_order=1, dod=2 given=subgraph=0, topo_order=0, dod=0}
  68. 131.58 s gammaloop-nextest-integration> [2026-08-28 15:33:13.399] @approx::local_4d [{#uv, #integrated, #series}] DEBUG : Series expanded
  69. 131.58 s gammaloop-nextest-integration> field value
  70. 131.58 s gammaloop-nextest-integration> res n-terms: 3, byte size: 1896,expr:
  71. 131.58 s gammaloop-nextest-integration> (1/2·SCALAR_COUPLING²·(2·mUVexp²-2·mass_scalar_2²)/(denom(2,q₂,mUVexp²,-mUV²+(q₂.q₂))²·denom(3,-q₂,mUVexp²,-mUV²+(q₂.q₂)))
  72. 131.58 s gammaloop-nextest-integration> -SCALAR_COUPLING²
  73. 131.58 s gammaloop-nextest-integration> ·(-1/2·(2·mUVexp²-2·mass_scalar_2²+2·(q₀.q₀))/denom(3,-q₂,mUVexp²,-mUV²+(q₂.q₂))
  74. 131.58 s gammaloop-nextest-integration> +4·(q₀.q₂)²/denom(3,-q₂,mUVexp²,-mUV²+(q₂.q₂))²
  75. 131.58 s gammaloop-nextest-integration> )/(denom(2,q₂,mUVexp²,-mUV²+(q₂.q₂))·denom(3,-q₂,mUVexp²,-mUV²+(q₂.q₂)))
  76. 131.58 s gammaloop-nextest-integration> )·q₀(αᵉ².¹)·q₀(αᵉ³.¹)·q₂(αᵉ².¹)·q₂(αᵉ³.¹)
  77. 131.58 s gammaloop-nextest-integration> +2·SCALAR_COUPLING²·(q₀.q₂)·q₀(αᵉ².¹)·q₀(αᵉ³.¹)·q₂(αᵉ².¹)·q₂(αᵉ³.¹)
  78. 131.58 s gammaloop-nextest-integration> /(t·denom(2,q₂,mUVexp²,-mUV²+(q₂.q₂))·denom(3,-q₂,mUVexp²,-mUV²+(q₂.q₂))²)
  79. 131.58 s gammaloop-nextest-integration> -SCALAR_COUPLING²·q₀(αᵉ².¹)·q₀(αᵉ³.¹)·q₂(αᵉ².¹)·q₂(αᵉ³.¹)
  80. 131.58 s gammaloop-nextest-integration> /(t²·denom(2,q₂,mUVexp²,-mUV²+(q₂.q₂))·denom(3,-q₂,mUVexp²,-mUV²+(q₂.q₂)))
  81. 131.58 s gammaloop-nextest-integration> span t{span_context=true current=subgraph=y, topo_order=1, dod=2 given=subgraph=0, topo_order=0, dod=0}
  82. 131.58 s gammaloop-nextest-integration> [2026-08-28 15:33:13.399] @approx::local_4d [{#uv, #integrated, #series}] DEBUG : Evaluated at t = 1
  83. 131.58 s gammaloop-nextest-integration> field value
  84. 131.58 s gammaloop-nextest-integration> res n-terms: 3, byte size: 1880,expr:
  85. 131.58 s gammaloop-nextest-integration> (1/2·SCALAR_COUPLING²·(2·mUVexp²-2·mass_scalar_2²)/(denom(2,q₂,mUVexp²,-mUV²+(q₂.q₂))²·denom(3,-q₂,mUVexp²,-mUV²+(q₂.q₂)))
  86. 131.58 s gammaloop-nextest-integration> -SCALAR_COUPLING²
  87. 131.58 s gammaloop-nextest-integration> ·(-1/2·(2·mUVexp²-2·mass_scalar_2²+2·(q₀.q₀))/denom(3,-q₂,mUVexp²,-mUV²+(q₂.q₂))
  88. 131.58 s gammaloop-nextest-integration> +4·(q₀.q₂)²/denom(3,-q₂,mUVexp²,-mUV²+(q₂.q₂))²
  89. 131.58 s gammaloop-nextest-integration> )/(denom(2,q₂,mUVexp²,-mUV²+(q₂.q₂))·denom(3,-q₂,mUVexp²,-mUV²+(q₂.q₂)))
  90. 131.58 s gammaloop-nextest-integration> )·q₀(αᵉ².¹)·q₀(αᵉ³.¹)·q₂(αᵉ².¹)·q₂(αᵉ³.¹)
  91. 131.58 s gammaloop-nextest-integration> -SCALAR_COUPLING²·q₀(αᵉ².¹)·q₀(αᵉ³.¹)·q₂(αᵉ².¹)·q₂(αᵉ³.¹)
  92. 131.58 s gammaloop-nextest-integration> /(denom(2,q₂,mUVexp²,-mUV²+(q₂.q₂))·denom(3,-q₂,mUVexp²,-mUV²+(q₂.q₂)))
  93. 131.58 s gammaloop-nextest-integration> +2·SCALAR_COUPLING²·(q₀.q₂)·q₀(αᵉ².¹)·q₀(αᵉ³.¹)·q₂(αᵉ².¹)·q₂(αᵉ³.¹)
  94. 131.58 s gammaloop-nextest-integration> /(denom(2,q₂,mUVexp²,-mUV²+(q₂.q₂))·denom(3,-q₂,mUVexp²,-mUV²+(q₂.q₂))²)
  95. 131.58 s gammaloop-nextest-integration> span t{span_context=true current=subgraph=y, topo_order=1, dod=2 given=subgraph=0, topo_order=0, dod=0}
  96. 131.58 s gammaloop-nextest-integration> [2026-08-28 15:33:13.400] @approx::local_4d [{#uv, #collect, #integrated}] DEBUG : After gamma chain collection
  97. 131.58 s gammaloop-nextest-integration> field value
  98. 131.58 s gammaloop-nextest-integration> expr n-terms: 3, byte size: 1880,expr:
  99. 131.58 s gammaloop-nextest-integration> (1/2·SCALAR_COUPLING²·(2·mUVexp²-2·mass_scalar_2²)/(denom(2,q₂,mUVexp²,-mUV²+(q₂.q₂))²·denom(3,-q₂,mUVexp²,-mUV²+(q₂.q₂)))
  100. 131.58 s gammaloop-nextest-integration> -SCALAR_COUPLING²
  101. 131.58 s gammaloop-nextest-integration> ·(-1/2·(2·mUVexp²-2·mass_scalar_2²+2·(q₀.q₀))/denom(3,-q₂,mUVexp²,-mUV²+(q₂.q₂))
  102. 131.58 s gammaloop-nextest-integration> +4·(q₀.q₂)²/denom(3,-q₂,mUVexp²,-mUV²+(q₂.q₂))²
  103. 131.58 s gammaloop-nextest-integration> )/(denom(2,q₂,mUVexp²,-mUV²+(q₂.q₂))·denom(3,-q₂,mUVexp²,-mUV²+(q₂.q₂)))
  104. 131.58 s gammaloop-nextest-integration> )·q₀(αᵉ².¹)·q₀(αᵉ³.¹)·q₂(αᵉ².¹)·q₂(αᵉ³.¹)
  105. 131.58 s gammaloop-nextest-integration> -SCALAR_COUPLING²·q₀(αᵉ².¹)·q₀(αᵉ³.¹)·q₂(αᵉ².¹)·q₂(αᵉ³.¹)
  106. 131.58 s gammaloop-nextest-integration> /(denom(2,q₂,mUVexp²,-mUV²+(q₂.q₂))·denom(3,-q₂,mUVexp²,-mUV²+(q₂.q₂)))
  107. 131.58 s gammaloop-nextest-integration> +2·SCALAR_COUPLING²·(q₀.q₂)·q₀(αᵉ².¹)·q₀(αᵉ³.¹)·q₂(αᵉ².¹)·q₂(αᵉ³.¹)
  108. 131.58 s gammaloop-nextest-integration> /(denom(2,q₂,mUVexp²,-mUV²+(q₂.q₂))·denom(3,-q₂,mUVexp²,-mUV²+(q₂.q₂))²)
  109. 131.58 s gammaloop-nextest-integration> span t{span_context=true current=subgraph=y, topo_order=1, dod=2 given=subgraph=0, topo_order=0, dod=0}
  110. 131.58 s gammaloop-nextest-integration> [2026-08-28 15:33:13.404] @approx::local_4d [{#profile, #uv, #collect, #integrated, #start, #trace}] DEBUG : After gamma schoonschip
  111. 131.58 s gammaloop-nextest-integration> field value
  112. 131.58 s gammaloop-nextest-integration> expr n-terms: 3, byte size: 1631,expr:
  113. 131.58 s gammaloop-nextest-integration> (1/2·SCALAR_COUPLING²·(2·mUVexp²-2·mass_scalar_2²)/(denom(2,q₂,mUVexp²,-mUV²+(q₂.q₂))²·denom(3,-q₂,mUVexp²,-mUV²+(q₂.q₂)))
  114. 131.58 s gammaloop-nextest-integration> -SCALAR_COUPLING²
  115. 131.58 s gammaloop-nextest-integration> ·(-1/2·(2·mUVexp²-2·mass_scalar_2²+2·(q₀.q₀))/denom(3,-q₂,mUVexp²,-mUV²+(q₂.q₂))
  116. 131.58 s gammaloop-nextest-integration> +4·(q₀.q₂)²/denom(3,-q₂,mUVexp²,-mUV²+(q₂.q₂))²
  117. 131.58 s gammaloop-nextest-integration> )/(denom(2,q₂,mUVexp²,-mUV²+(q₂.q₂))·denom(3,-q₂,mUVexp²,-mUV²+(q₂.q₂)))
  118. 131.58 s gammaloop-nextest-integration> )·(q₀.q₂)²
  119. 131.58 s gammaloop-nextest-integration> -SCALAR_COUPLING²·(q₀.q₂)²/(denom(2,q₂,mUVexp²,-mUV²+(q₂.q₂))·denom(3,-q₂,mUVexp²,-mUV²+(q₂.q₂)))
  120. 131.58 s gammaloop-nextest-integration> +2·SCALAR_COUPLING²·(q₀.q₂)·(q₀.q₂)²
  121. 131.58 s gammaloop-nextest-integration> /(denom(2,q₂,mUVexp²,-mUV²+(q₂.q₂))·denom(3,-q₂,mUVexp²,-mUV²+(q₂.q₂))²)
  122. 131.58 s gammaloop-nextest-integration> span t{span_context=true current=subgraph=y, topo_order=1, dod=2 given=subgraph=0, topo_order=0, dod=0}
  123. 131.58 s gammaloop-nextest-integration> [2026-08-28 15:33:13.405] @approx::local_4d [{#profile, #uv, #collect, #integrated, #start, #trace}] DEBUG : After gamma collection
  124. 131.58 s gammaloop-nextest-integration> field value
  125. 131.58 s gammaloop-nextest-integration> expr n-terms: 1, byte size: 1347,expr:
  126. 131.58 s gammaloop-nextest-integration> SCALAR_COUPLING²
  127. 131.58 s gammaloop-nextest-integration> ·(-denom(2,q₂,mUVexp²,-mUV²+(q₂.q₂))·denom(3,-q₂,mUVexp²,-mUV²+(q₂.q₂))²
  128. 131.58 s gammaloop-nextest-integration> +1/2·(2·mUVexp²-2·mass_scalar_2²)·denom(3,-q₂,mUVexp²,-mUV²+(q₂.q₂))²
  129. 131.58 s gammaloop-nextest-integration> -(-1/2·(2·mUVexp²-2·mass_scalar_2²+2·(q₀.q₀))·denom(3,-q₂,mUVexp²,-mUV²+(q₂.q₂))+4·(q₀.q₂)²)
  130. 131.58 s gammaloop-nextest-integration> ·denom(2,q₂,mUVexp²,-mUV²+(q₂.q₂))
  131. 131.58 s gammaloop-nextest-integration> +2·(q₀.q₂)·denom(2,q₂,mUVexp²,-mUV²+(q₂.q₂))·denom(3,-q₂,mUVexp²,-mUV²+(q₂.q₂))
  132. 131.58 s gammaloop-nextest-integration> )·(q₀.q₂)²/(denom(2,q₂,mUVexp²,-mUV²+(q₂.q₂))²·denom(3,-q₂,mUVexp²,-mUV²+(q₂.q₂))³)
  133. 131.58 s gammaloop-nextest-integration> span t{span_context=true current=subgraph=y, topo_order=1, dod=2 given=subgraph=0, topo_order=0, dod=0}
  134. 131.58 s gammaloop-nextest-integration> [2026-08-28 15:33:13.406] @approx::local_4d [{#profile, #uv, #gamma, #integrated, #start, #trace, #vakint}] DEBUG : After gamma simplification
  135. 131.58 s gammaloop-nextest-integration> ... omitted 3263 more lines; see full nextest output above
  136. 131.58 s gammaloop-nextest-integration>
  137. 131.58 s gammaloop-nextest-integration> 8. gammaloop-integration-tests::uv::sunrise_scalar_1_uv
  138. 131.61 s gammaloop-nextest-integration> failure: test failure with exit code 101
  139. 131.61 s gammaloop-nextest-integration> system-out
  140. 131.61 s gammaloop-nextest-integration> running 1 test
  141. 131.61 s gammaloop-nextest-integration> test sunrise_scalar_1_uv has been running for over 60 seconds
  142. 131.61 s gammaloop-nextest-integration> +------------------+------------------------+--------------+--------+----------+----------------------------------------------------------------------------------------------------------------------+-------+
  143. 131.61 s gammaloop-nextest-integration> | case | check | graph | status | sigma | threshold | error |
  144. 131.61 s gammaloop-nextest-integration> +------------------+------------------------+--------------+--------+----------+----------------------------------------------------------------------------------------------------------------------+-------+
  145. 131.61 s gammaloop-nextest-integration> | sunrise_scalar_1 | uv_profile | - | FAIL | - | - | - |
  146. 131.61 s gammaloop-nextest-integration> +------------------+------------------------+--------------+--------+----------+----------------------------------------------------------------------------------------------------------------------+-------+
  147. 131.61 s gammaloop-nextest-integration> | sunrise_scalar_1 | m_uv.inspect | inspect | pass | - | best inspect relative delta 1.624e0 >= 1000*accuracy 1.000e-3 (accuracy=1.000e-6, exponent=+1.0, seed=1, probes=10) | - |
  148. 131.61 s gammaloop-nextest-integration> +------------------+------------------------+--------------+--------+----------+----------------------------------------------------------------------------------------------------------------------+-------+
  149. 131.61 s gammaloop-nextest-integration> | sunrise_scalar_1 | m_uv.integrated | sunrise | pass | 0.1sigma | compatible within 2sigma | - |
  150. 131.61 s gammaloop-nextest-integration> +------------------+------------------------+--------------+--------+----------+----------------------------------------------------------------------------------------------------------------------+-------+
  151. 131.61 s gammaloop-nextest-integration> | sunrise_scalar_1 | rls.inspect | inspect | pass | - | best inspect relative delta 8.682e-1 >= 1000*accuracy 1.000e-3 (accuracy=1.000e-6, exponent=+1.0, seed=1, probes=10) | - |
  152. 131.61 s gammaloop-nextest-integration> +------------------+------------------------+--------------+--------+----------+----------------------------------------------------------------------------------------------------------------------+-------+
  153. 131.61 s gammaloop-nextest-integration> | sunrise_scalar_1 | rls.integrated | sunrise | pass | 0.0sigma | compatible within 2sigma | - |
  154. 131.61 s gammaloop-nextest-integration> +------------------+------------------------+--------------+--------+----------+----------------------------------------------------------------------------------------------------------------------+-------+
  155. 131.61 s gammaloop-nextest-integration> | sunrise_scalar_1 | mu_r.inspect | inspect | pass | - | best inspect relative delta 1.752e0 >= 1000*accuracy 1.000e-3 (accuracy=1.000e-6, exponent=+1.0, seed=1, probes=10) | - |
  156. 131.61 s gammaloop-nextest-integration> +------------------+------------------------+--------------+--------+----------+----------------------------------------------------------------------------------------------------------------------+-------+
  157. 131.61 s gammaloop-nextest-integration> | sunrise_scalar_1 | integrated.relerr | integrated | pass | - | relative error 9.20% <= 10.00% | - |
  158. 131.61 s gammaloop-nextest-integration> +------------------+------------------------+--------------+--------+----------+----------------------------------------------------------------------------------------------------------------------+-------+
  159. 131.61 s gammaloop-nextest-integration> | sunrise_scalar_1 | m_uv.integrated.relerr | m_uv-shifted | pass | - | relative error 5.89% <= 10.00% | - |
  160. 131.61 s gammaloop-nextest-integration> +------------------+------------------------+--------------+--------+----------+----------------------------------------------------------------------------------------------------------------------+-------+
  161. 131.61 s gammaloop-nextest-integration> | sunrise_scalar_1 | target | - | pass | - | 2sigma | - |
  162. 131.61 s gammaloop-nextest-integration> +------------------+------------------------+--------------+--------+----------+----------------------------------------------------------------------------------------------------------------------+-------+
  163. 131.61 s gammaloop-nextest-integration> test sunrise_scalar_1_uv ... FAILED
  164. 131.61 s gammaloop-nextest-integration>
  165. 131.61 s gammaloop-nextest-integration> failures:
  166. 131.61 s gammaloop-nextest-integration>
  167. 131.61 s gammaloop-nextest-integration> failures:
  168. 131.61 s gammaloop-nextest-integration> sunrise_scalar_1_uv
  169. 131.61 s gammaloop-nextest-integration>
  170. 131.61 s gammaloop-nextest-integration> test result: FAILED. 0 passed; 1 failed; 0 ignored; 0 measured; 24 filtered out; finished in 92.59s
  171. 131.61 s gammaloop-nextest-integration> system-err
  172. 131.61 s gammaloop-nextest-integration> [2026-08-28 15:33:17.587] @gammaloop_api::se... INFO : Running command run generate
  173. 131.61 s gammaloop-nextest-integration> [2026-08-28 15:33:17.587] @gammaloop_api::se... INFO : Starting command block generate
  174. 131.61 s gammaloop-nextest-integration> [2026-08-28 15:33:17.588] @gammaloop_api::se... INFO : Running command import model scalars-default.json
  175. 131.61 s gammaloop-nextest-integration> [2026-08-28 15:33:17.588] @import::model INFO : Loading built-in JSON model scalars-default
  176. 131.61 s gammaloop-nextest-integration> [2026-08-28 15:33:17.591] @gammalooprs::model INFO : The following 2 external parameters were forced to zero by the restriction card:
  177. 131.61 s gammaloop-nextest-integration> width_scalar_1, width_scalar_2
  178. 131.61 s gammaloop-nextest-integration> [2026-08-28 15:33:17.592] @gammaloop_api::se... INFO : Running command remove processes
  179. 131.61 s gammaloop-nextest-integration> [2026-08-28 15:33:17.592] @gammaloop_api::se... INFO : Running command set global kv global.generation.uv.generate_integrated=true
  180. 131.61 s gammaloop-nextest-integration> [2026-08-28 15:33:17.592] @gammaloop_api::se... INFO : Running command import graphs ./tests/resources/graphs/scalar_sunrise.dot -p sunrise_scalar_1 -i scalar_sunrise
  181. 131.61 s gammaloop-nextest-integration> [2026-08-28 15:33:17.592] @commands::import INFO : Loading graphs from '/build/source/tests/resources/graphs/scalar_sunrise.dot'
  182. 131.61 s gammaloop-nextest-integration> [2026-08-28 15:33:17.595] @gammaloop_api::se... INFO : Running command generate existing -p sunrise_scalar_1 -i scalar_sunrise
  183. 131.61 s gammaloop-nextest-integration> [2026-08-28 15:33:17.601] @approx::local_4d [{#uv, #inspect, #integrated}] DEBUG : Rescaled momenta expanded
  184. 131.61 s gammaloop-nextest-integration> field value
  185. 131.61 s gammaloop-nextest-integration> res n-terms: 1, byte size: 611,expr:
  186. 131.61 s gammaloop-nextest-integration> 1/(denom(1,q₁/t,mass_scalar_1²,-mass_scalar_1²+(q₁.q₁)/t²)
  187. 131.61 s gammaloop-nextest-integration> ·denom(2,-q₀+q₃-q₁/t,mass_scalar_1²,
  188. 131.61 s gammaloop-nextest-integration> -mass_scalar_1²+2·(q₀.q₁)/t-2·(q₁.q₃)/t+(q₁.q₁)/t²+(q₀.q₀)
  189. 131.61 s gammaloop-nextest-integration> -2·(q₀.q₃)+(q₃.q₃)
  190. 131.61 s gammaloop-nextest-integration> ))
  191. 131.61 s gammaloop-nextest-integration> [2026-08-28 15:33:17.602] @approx::local_4d [{#uv, #inspect, #integrated}] DEBUG : Rescaled momenta expanded
  192. 131.61 s gammaloop-nextest-integration> field value
  193. 131.61 s gammaloop-nextest-integration> res n-terms: 1, byte size: 777,expr:
  194. 131.61 s gammaloop-nextest-integration> 1/(denom(0,q₀/t,mass_scalar_1²,-mass_scalar_1²+(q₀.q₀)/t²)·denom(1,q₁/t,mass_scalar_1²,-mass_scalar_1²+(q₁.q₁)/t²)
  195. 131.61 s gammaloop-nextest-integration> ·denom(2,q₄-q₀/t-q₁/t,mass_scalar_1²,
  196. 131.61 s gammaloop-nextest-integration> -mass_scalar_1²-2·(q₀.q₄)/t-2·(q₁.q₄)/t+(q₀.q₀)/t²+2·(q₀.q₁)/t²
  197. 131.61 s gammaloop-nextest-integration> +(q₁.q₁)/t²+(q₄.q₄)
  198. 131.61 s gammaloop-nextest-integration> ))
  199. 131.61 s gammaloop-nextest-integration> [2026-08-28 15:33:17.611] @approx::local_4d [{#uv, #inspect, #integrated}] DEBUG : Rescaled momenta expanded
  200. 131.61 s gammaloop-nextest-integration> field value
  201. 131.61 s gammaloop-nextest-integration> res n-terms: 1, byte size: 3,expr:
  202. 131.61 s gammaloop-nextest-integration> 1
  203. 131.61 s gammaloop-nextest-integration> [2026-08-28 15:33:17.611] @approx::local_4d [{#uv, #inspect, #integrated}] DEBUG : Rescaled momenta expanded
  204. 131.61 s gammaloop-nextest-integration> field value
  205. 131.61 s gammaloop-nextest-integration> res n-terms: 1, byte size: 611,expr:
  206. 131.61 s gammaloop-nextest-integration> 1/(denom(0,q₀/t,mass_scalar_1²,-mass_scalar_1²+(q₀.q₀)/t²)
  207. 131.61 s gammaloop-nextest-integration> ·denom(1,-q₂+q₃-q₀/t,mass_scalar_1²,
  208. 131.61 s gammaloop-nextest-integration> -mass_scalar_1²+2·(q₀.q₂)/t-2·(q₀.q₃)/t+(q₀.q₀)/t²+(q₂.q₂)
  209. 131.61 s gammaloop-nextest-integration> -2·(q₂.q₃)+(q₃.q₃)
  210. 131.61 s gammaloop-nextest-integration> ))
  211. 131.61 s gammaloop-nextest-integration> [2026-08-28 15:33:17.613] @approx::local_4d [{#uv, #inspect, #integrated}] DEBUG : Rescaled momenta expanded
  212. 131.61 s gammaloop-nextest-integration> field value
  213. 131.61 s gammaloop-nextest-integration> res n-terms: 1, byte size: 611,expr:
  214. 131.61 s gammaloop-nextest-integration> 1/(denom(0,q₀/t,mass_scalar_1²,-mass_scalar_1²+(q₀.q₀)/t²)
  215. 131.61 s gammaloop-nextest-integration> ·denom(2,-q₁+q₃-q₀/t,mass_scalar_1²,
  216. 131.61 s gammaloop-nextest-integration> -mass_scalar_1²+2·(q₀.q₁)/t-2·(q₀.q₃)/t+(q₀.q₀)/t²+(q₁.q₁)
  217. 131.61 s gammaloop-nextest-integration> -2·(q₁.q₃)+(q₃.q₃)
  218. 131.61 s gammaloop-nextest-integration> ))
  219. 131.61 s gammaloop-nextest-integration> [2026-08-28 15:33:17.615] @approx::final_integrand[{#generation, #profile, #uv, #graph, #summary}] DEBUG : Computed global numerator
  220. 131.61 s gammaloop-nextest-integration> field value
  221. 131.61 s gammaloop-nextest-integration> global_num n-terms: 1, byte size: 3,expr:
  222. 131.61 s gammaloop-nextest-integration> 1
  223. 131.61 s gammaloop-nextest-integration> span build_3d{span_context=true graph=sunrise current=subgraph=0, topo_order=0, dod=0}
  224. 131.61 s gammaloop-nextest-integration> [2026-08-28 15:33:17.617] @uv::approx [{#generation, #uv, #fourd}] DEBUG : Computing 4D
  225. 131.61 s gammaloop-nextest-integration> field value
  226. 131.61 s gammaloop-nextest-integration> simple subgraph(S_47,S_3s)*Approx(subgraph(S_3s,0)) of sunrise
  227. 131.61 s gammaloop-nextest-integration> span compute_4d{span_context=true graph=sunrise current=subgraph=3s, topo_order=1, dod=0 given=subgraph=0, topo_order=0, dod=0 reduced=SubSet { set: BitVec<usize, bitvec::order::Lsb0> { addr: 0x7fffec011aa0, head: 000000, bits: 8, capacity: 64 } [0, 0, 0, 0, 1, 1, 1, 1], id: PhantomData<linnet::half_edge::involution::Hedge> }}
  228. 131.61 s gammaloop-nextest-integration> [2026-08-28 15:33:17.617] @approx::local_4d [{#uv, #algebra, #integrated, #start}] DEBUG :
  229. 131.61 s gammaloop-nextest-integration> field value
  230. 131.61 s gammaloop-nextest-integration> integrand n-terms: 1, byte size: 217,expr:
  231. 131.61 s gammaloop-nextest-integration> 1/(denom(1,q₁,mass_scalar_1²,-mass_scalar_1²+(q₁.q₁))·denom(2,q₂,mass_scalar_1²,-mass_scalar_1²+(q₂.q₂)))
  232. 131.61 s gammaloop-nextest-integration> reduced 3s
  233. 131.61 s gammaloop-nextest-integration> span grow{span_context=true current=subgraph=3s, topo_order=1, dod=0 given=subgraph=0, topo_order=0, dod=0}
  234. 131.61 s gammaloop-nextest-integration> [2026-08-28 15:33:17.618] @approx::local_4d [{#uv, #inspect, #integrated}] DEBUG : Rescaled momenta expanded
  235. 131.61 s gammaloop-nextest-integration> field value
  236. 131.61 s gammaloop-nextest-integration> res n-terms: 1, byte size: 611,expr:
  237. 131.61 s gammaloop-nextest-integration> 1/(denom(1,q₁/t,mass_scalar_1²,-mass_scalar_1²+(q₁.q₁)/t²)
  238. 131.61 s gammaloop-nextest-integration> ·denom(2,-q₀+q₃-q₁/t,mass_scalar_1²,
  239. 131.61 s gammaloop-nextest-integration> -mass_scalar_1²+2·(q₀.q₁)/t-2·(q₁.q₃)/t+(q₁.q₁)/t²+(q₀.q₀)
  240. 131.61 s gammaloop-nextest-integration> -2·(q₀.q₃)+(q₃.q₃)
  241. 131.61 s gammaloop-nextest-integration> ))
  242. 131.61 s gammaloop-nextest-integration> span t{span_context=true current=subgraph=3s, topo_order=1, dod=0 given=subgraph=0, topo_order=0, dod=0}
  243. 131.61 s gammaloop-nextest-integration> [2026-08-28 15:33:17.621] @approx::local_4d [{#uv, #integrated, #rescaled}] DEBUG : Rescaled expanded
  244. 131.61 s gammaloop-nextest-integration> field value
  245. 131.61 s gammaloop-nextest-integration> n_loops 1
  246. 131.61 s gammaloop-nextest-integration> res n-terms: 1, byte size: 723,expr:
  247. 131.61 s gammaloop-nextest-integration> 1/(denom(1,q₁,mUVexp²+t²·mass_scalar_1²,-mUV²+t²·(-mass_scalar_1²+(q₁.q₁)/t²)+t²·mUVexp²)
  248. 131.61 s gammaloop-nextest-integration> ·denom(2,-q₁,mUVexp²+t²·mass_scalar_1²,
  249. 131.61 s gammaloop-nextest-integration> -mUV²
  250. 131.61 s gammaloop-nextest-integration> +t²
  251. 131.61 s gammaloop-nextest-integration> ·(-mass_scalar_1²+2·(q₀.q₁)/t-2·(q₁.q₃)/t+(q₁.q₁)/t²+(q₀.q₀)
  252. 131.61 s gammaloop-nextest-integration> -2·(q₀.q₃)+(q₃.q₃)
  253. 131.61 s gammaloop-nextest-integration> )
  254. 131.61 s gammaloop-nextest-integration> +t²·mUVexp²
  255. 131.61 s gammaloop-nextest-integration> ))
  256. 131.61 s gammaloop-nextest-integration> span t{span_context=true current=subgraph=3s, topo_order=1, dod=0 given=subgraph=0, topo_order=0, dod=0}
  257. 131.61 s gammaloop-nextest-integration> [2026-08-28 15:33:17.621] @approx::local_4d [{#uv, #integrated, #series}] DEBUG : Series expanded
  258. 131.61 s gammaloop-nextest-integration> field value
  259. 131.61 s gammaloop-nextest-integration> res n-terms: 1, byte size: 223,expr:
  260. 131.61 s gammaloop-nextest-integration> 1/(denom(1,q₁,mUVexp²,-mUV²+(q₁.q₁))·denom(2,-q₁,mUVexp²,-mUV²+(q₁.q₁)))
  261. 131.61 s gammaloop-nextest-integration> span t{span_context=true current=subgraph=3s, topo_order=1, dod=0 given=subgraph=0, topo_order=0, dod=0}
  262. 131.61 s gammaloop-nextest-integration> [2026-08-28 15:33:17.621] @approx::local_4d [{#uv, #integrated, #series}] DEBUG : Evaluated at t = 1
  263. 131.61 s gammaloop-nextest-integration> field value
  264. 131.61 s gammaloop-nextest-integration> res n-terms: 1, byte size: 223,expr:
  265. 131.61 s gammaloop-nextest-integration> 1/(denom(1,q₁,mUVexp²,-mUV²+(q₁.q₁))·denom(2,-q₁,mUVexp²,-mUV²+(q₁.q₁)))
  266. 131.61 s gammaloop-nextest-integration> span t{span_context=true current=subgraph=3s, topo_order=1, dod=0 given=subgraph=0, topo_order=0, dod=0}
  267. 131.61 s gammaloop-nextest-integration> [2026-08-28 15:33:17.621] @approx::local_4d [{#uv, #collect, #integrated}] DEBUG : After gamma chain collection
  268. 131.61 s gammaloop-nextest-integration> field value
  269. 131.61 s gammaloop-nextest-integration> expr n-terms: 1, byte size: 223,expr:
  270. 131.61 s gammaloop-nextest-integration> 1/(denom(1,q₁,mUVexp²,-mUV²+(q₁.q₁))·denom(2,-q₁,mUVexp²,-mUV²+(q₁.q₁)))
  271. 131.61 s gammaloop-nextest-integration> span t{span_context=true current=subgraph=3s, topo_order=1, dod=0 given=subgraph=0, topo_order=0, dod=0}
  272. 131.61 s gammaloop-nextest-integration> [2026-08-28 15:33:17.622] @approx::local_4d [{#profile, #uv, #collect, #integrated, #start, #trace}] DEBUG : After gamma schoonschip
  273. 131.61 s gammaloop-nextest-integration> field value
  274. 131.61 s gammaloop-nextest-integration> expr n-terms: 1, byte size: 223,expr:
  275. 131.61 s gammaloop-nextest-integration> 1/(denom(1,q₁,mUVexp²,-mUV²+(q₁.q₁))·denom(2,-q₁,mUVexp²,-mUV²+(q₁.q₁)))
  276. 131.61 s gammaloop-nextest-integration> span t{span_context=true current=subgraph=3s, topo_order=1, dod=0 given=subgraph=0, topo_order=0, dod=0}
  277. 131.61 s gammaloop-nextest-integration> [2026-08-28 15:33:17.622] @approx::local_4d [{#profile, #uv, #collect, #integrated, #start, #trace}] DEBUG : After gamma collection
  278. 131.61 s gammaloop-nextest-integration> field value
  279. 131.61 s gammaloop-nextest-integration> expr n-terms: 1, byte size: 223,expr:
  280. 131.61 s gammaloop-nextest-integration> 1/(denom(1,q₁,mUVexp²,-mUV²+(q₁.q₁))·denom(2,-q₁,mUVexp²,-mUV²+(q₁.q₁)))
  281. 131.61 s gammaloop-nextest-integration> span t{span_context=true current=subgraph=3s, topo_order=1, dod=0 given=subgraph=0, topo_order=0, dod=0}
  282. 131.61 s gammaloop-nextest-integration> [2026-08-28 15:33:17.622] @approx::local_4d [{#profile, #uv, #gamma, #integrated, #start, #trace, #vakint}] DEBUG : After gamma simplification
  283. 131.61 s gammaloop-nextest-integration> field value
  284. 131.61 s gammaloop-nextest-integration> expr n-terms: 1, byte size: 223,expr:
  285. 131.61 s gammaloop-nextest-integration> 1/(denom(1,q₁,mUVexp²,-mUV²+(q₁.q₁))·denom(2,-q₁,mUVexp²,-mUV²+(q₁.q₁)))
  286. 131.61 s gammaloop-nextest-integration> span t{span_context=true current=subgraph=3s, topo_order=1, dod=0 given=subgraph=0, topo_order=0, dod=0}
  287. 131.61 s gammaloop-nextest-integration> [2026-08-28 15:33:17.622] @approx::local_4d [{#profile, #uv, #integrated, #schoonschip, #start, #trace, #vakint}] DEBUG : After Schoonschip net
  288. 131.61 s gammaloop-nextest-integration> field value
  289. 131.61 s gammaloop-nextest-integration> expr n-terms: 1, byte size: 223,expr:
  290. 131.61 s gammaloop-nextest-integration> 1/(denom(1,q₁,mUVexp²,-mUV²+(q₁.q₁))·denom(2,-q₁,mUVexp²,-mUV²+(q₁.q₁)))
  291. 131.61 s gammaloop-nextest-integration> ... omitted 20090 more lines; see full nextest output above
  292. 131.61 s gammaloop-nextest-integration>
  293. 131.61 s gammaloop-nextest-integration> 9. gammaloop-integration-tests::uv::se1l_uv
  294. 131.61 s gammaloop-nextest-integration> failure: test failure with exit code 101
  295. 131.61 s gammaloop-nextest-integration> system-out
  296. 131.61 s gammaloop-nextest-integration> running 1 test
  297. 131.61 s gammaloop-nextest-integration> test se1l_uv has been running for over 60 seconds
  298. 131.61 s gammaloop-nextest-integration> +------+-----------------+---------+--------+----------+-----------------------------------------------------------------------------------------------------------------------+-------+
  299. 131.61 s gammaloop-nextest-integration> | case | check | graph | status | sigma | threshold | error |
  300. 131.61 s gammaloop-nextest-integration> +------+-----------------+---------+--------+----------+-----------------------------------------------------------------------------------------------------------------------+-------+
  301. 131.61 s gammaloop-nextest-integration> | se1l | uv_profile | - | FAIL | - | - | - |
  302. 131.61 s gammaloop-nextest-integration> +------+-----------------+---------+--------+----------+-----------------------------------------------------------------------------------------------------------------------+-------+
  303. 131.61 s gammaloop-nextest-integration> | se1l | m_uv.inspect | inspect | pass | - | best inspect relative delta 1.097e-1 >= 1000*accuracy 1.000e-7 (accuracy=1.000e-10, exponent=+2.0, seed=1, probes=10) | - |
  304. 131.61 s gammaloop-nextest-integration> +------+-----------------+---------+--------+----------+-----------------------------------------------------------------------------------------------------------------------+-------+
  305. 131.61 s gammaloop-nextest-integration> | se1l | m_uv.integrated | se1l | pass | 0.1sigma | compatible within 2sigma | - |
  306. 131.61 s gammaloop-nextest-integration> +------+-----------------+---------+--------+----------+-----------------------------------------------------------------------------------------------------------------------+-------+
  307. 131.61 s gammaloop-nextest-integration> | se1l | rls.inspect | inspect | pass | - | best inspect relative delta 4.499e-2 >= 1000*accuracy 1.000e-7 (accuracy=1.000e-10, exponent=+2.0, seed=1, probes=10) | - |
  308. 131.61 s gammaloop-nextest-integration> +------+-----------------+---------+--------+----------+-----------------------------------------------------------------------------------------------------------------------+-------+
  309. 131.61 s gammaloop-nextest-integration> | se1l | rls.integrated | se1l | pass | 0.0sigma | compatible within 2sigma | - |
  310. 131.61 s gammaloop-nextest-integration> +------+-----------------+---------+--------+----------+-----------------------------------------------------------------------------------------------------------------------+-------+
  311. 131.61 s gammaloop-nextest-integration> | se1l | mu_r.inspect | inspect | pass | - | best inspect relative delta 1.424e-1 >= 1000*accuracy 1.000e-7 (accuracy=1.000e-10, exponent=+2.0, seed=1, probes=10) | - |
  312. 131.61 s gammaloop-nextest-integration> +------+-----------------+---------+--------+----------+-----------------------------------------------------------------------------------------------------------------------+-------+
  313. 131.61 s gammaloop-nextest-integration> | se1l | target | - | pass | - | 2sigma | - |
  314. 131.61 s gammaloop-nextest-integration> +------+-----------------+---------+--------+----------+-----------------------------------------------------------------------------------------------------------------------+-------+
  315. 131.61 s gammaloop-nextest-integration> test se1l_uv ... FAILED
  316. 131.61 s gammaloop-nextest-integration>
  317. 131.61 s gammaloop-nextest-integration> failures:
  318. 131.61 s gammaloop-nextest-integration>
  319. 131.61 s gammaloop-nextest-integration> failures:
  320. 131.61 s gammaloop-nextest-integration> se1l_uv
  321. 131.61 s gammaloop-nextest-integration>
  322. 131.61 s gammaloop-nextest-integration> test result: FAILED. 0 passed; 1 failed; 0 ignored; 0 measured; 24 filtered out; finished in 103.70s
  323. 131.61 s gammaloop-nextest-integration> system-err
  324. 131.61 s gammaloop-nextest-integration> [2026-08-28 15:33:17.623] @gammaloop_api::se... INFO : Running command run generate
  325. 131.61 s gammaloop-nextest-integration> [2026-08-28 15:33:17.623] @gammaloop_api::se... INFO : Starting command block generate
  326. 131.61 s gammaloop-nextest-integration> [2026-08-28 15:33:17.623] @gammaloop_api::se... INFO : Running command import model sm-default
  327. 131.61 s gammaloop-nextest-integration> [2026-08-28 15:33:17.623] @import::model INFO : Loading built-in JSON model sm-default
  328. 131.61 s gammaloop-nextest-integration> [2026-08-28 15:33:17.651] @gammalooprs::model INFO : The following 11 external parameters were forced to zero by the restriction card:
  329. 131.61 s gammaloop-nextest-integration> lamWS, AWS, rhoWS, etaWS, ymc, yme, ymm, MC, Me, MM, WTau
  330. 131.61 s gammaloop-nextest-integration> [2026-08-28 15:33:17.651] @gammalooprs::model INFO : The following 34 vertex rules were removed by the restriction card:
  331. 131.61 s gammaloop-nextest-integration> V_82 -> (c~, d, G+) | V_83 -> (t~, d, G+) | V_84 -> (c~, s, G+) | V_85 -> (t~, s, G+) | V_86 -> (u~, b, G+) | V_87 -> (c~, b, G+) | V_90 -> (c~, d, W+) | V_91 -> (t~, d, W+) | V_92 -> (u~, s, W+) | V_94 -> (t~, s, W+) | V_95 -> (u~, b, W+) | V_96 -> (c~, b, W+) | V_101 -> (e+, e-, G0) | V_102 -> (mu+, mu-, G0) | V_104 -> (e+, e-, H) | V_105 -> (mu+, mu-, H) | V_110 -> (ve~, e-, G+) | V_111 -> (vm~, mu-, G+) | V_116 -> (b~, u, G-) | V_117 -> (d~, c, G-) | V_118 -> (s~, c, G-) | V_119 -> (b~, c, G-) | V_120 -> (d~, t, G-) | V_121 -> (s~, t, G-) | V_124 -> (s~, u, W-) | V_125 -> (b~, u, W-) | V_126 -> (d~, c, W-) | V_128 -> (b~, c, W-) | V_129 -> (d~, t, W-) | V_130 -> (s~, t, W-) | V_138 -> (c~, c, G0) | V_140 -> (c~, c, H) | V_145 -> (e+, ve, G-) | V_146 -> (mu+, vm, G-)
  332. 131.61 s gammaloop-nextest-integration> [2026-08-28 15:33:17.651] @gammalooprs::model INFO : The following 36 couplings were removed by the restriction card:
  333. 131.61 s gammaloop-nextest-integration> GC_13, GC_14, GC_16, GC_17, GC_18, GC_19, GC_20, GC_22, GC_23, GC_24, GC_25, GC_26, GC_28, GC_29, GC_42, GC_43, GC_44, GC_46, GC_47, GC_48, GC_84, GC_85, GC_86, GC_87, GC_88, GC_89, GC_90, GC_91, GC_92, GC_93, GC_101, GC_102, GC_103, GC_105, GC_106, GC_107
  334. 131.61 s gammaloop-nextest-integration> [2026-08-28 15:33:17.652] @gammaloop_api::se... INFO : Running command remove processes
  335. 131.61 s gammaloop-nextest-integration> [2026-08-28 15:33:17.652] @gammaloop_api::se... INFO : Running command set global kv global.generation.uv.generate_integrated=true
  336. 131.61 s gammaloop-nextest-integration> [2026-08-28 15:33:17.653] @gammaloop_api::se... INFO : Running command import graphs ./tests/resources/graphs/uv_tests/se1l.dot -p se1l -i se1l
  337. 131.61 s gammaloop-nextest-integration> [2026-08-28 15:33:17.653] @commands::import INFO : Loading graphs from '/build/source/tests/resources/graphs/uv_tests/se1l.dot'
  338. 131.61 s gammaloop-nextest-integration> [2026-08-28 15:33:17.656] @gammaloop_api::se... INFO : Running command generate existing -p se1l -i se1l
  339. 131.61 s gammaloop-nextest-integration> [2026-08-28 15:33:18.506] @commands::generate INFO :
  340. 131.61 s gammaloop-nextest-integration> Integrand generation summary
  341. 131.61 s gammaloop-nextest-integration> peak RAM 88.62 MiB | cores 1
  342. 131.61 s gammaloop-nextest-integration> ╭───────────┬───────┬─────────┬─────────────┬─────────────┬────────────────┬─────────────╮
  343. 131.61 s gammaloop-nextest-integration> │ integrand │ graph │ # evals │ expr build │ spenso │ symbolica eval │ compile │
  344. 131.61 s gammaloop-nextest-integration> ├───────────┼───────┼─────────┼─────────────┼─────────────┼────────────────┼─────────────┤
  345. 131.61 s gammaloop-nextest-integration> │ se1l │ se1l │ 5 │ 713ms (89%) │ 32ms (4.1%) │ 53ms (6.7%) │ 0ms (0.00%) │
  346. 131.61 s gammaloop-nextest-integration> ├───────────┼───────┼─────────┼─────────────┼─────────────┼────────────────┼─────────────┤
  347. 131.61 s gammaloop-nextest-integration> │ Total │ │ 5 │ 713ms (89%) │ 32ms (4.1%) │ 53ms (6.7%) │ 0ms (0.00%) │
  348. 131.61 s gammaloop-nextest-integration> ╰───────────┴───────┴─────────┴─────────────┴─────────────┴────────────────┴─────────────╯
  349. 131.61 s gammaloop-nextest-integration> [2026-08-28 15:33:18.507] @gammaloop_api::se... INFO : Running command set process -p se1l -i se1l kv general.m_uv=0.2
  350. 131.61 s gammaloop-nextest-integration> [2026-08-28 15:33:18.508] @gammaloop_api::se... INFO : Running command set process -p se1l -i se1l kv general.mu_r=0.2
  351. 131.61 s gammaloop-nextest-integration> [2026-08-28 15:33:18.509] @gammaloop_api::se... INFO : Running command set process -p se1l -i se1l kv general.renormalization_localization_scale=0.2
  352. 131.61 s gammaloop-nextest-integration> [2026-08-28 15:33:18.510] @gammaloop_api::se... INFO : Running command duplicate integrand -p se1l -i se1l --output_process_name se1l --output_integrand_name se1l_muv_shifted
  353. 131.61 s gammaloop-nextest-integration> [2026-08-28 15:33:18.511] @gammaloop_api::se... INFO : Running command set process -p se1l -i se1l_muv_shifted kv general.m_uv=0.5
  354. 131.61 s gammaloop-nextest-integration> [2026-08-28 15:33:18.512] @gammaloop_api::se... INFO : Running command duplicate integrand -p se1l -i se1l --output_process_name se1l --output_integrand_name se1l_rls_shifted
  355. 131.61 s gammaloop-nextest-integration> [2026-08-28 15:33:18.513] @gammaloop_api::se... INFO : Running command set process -p se1l -i se1l_rls_shifted kv general.renormalization_localization_scale=1
  356. 131.61 s gammaloop-nextest-integration> [2026-08-28 15:33:18.514] @gammaloop_api::se... INFO : Running command duplicate integrand -p se1l -i se1l --output_process_name se1l --output_integrand_name se1l_mur_shifted
  357. 131.61 s gammaloop-nextest-integration> [2026-08-28 15:33:18.517] @gammaloop_api::se... INFO : Running command set process -p se1l -i se1l_mur_shifted kv general.mu_r=0.8
  358. 131.61 s gammaloop-nextest-integration> [2026-08-28 15:33:18.524] @process::amplitude WARNING : External state 0 ('g', PDG 21, helicity +) is off shell: p^2 = +2.5e5, expected m^2 = +0e0 (|Δ| = +2.5e5). Fixed-helicity spinor/vector/tensor external states may be ill-defined at this kinematic point.
  359. 131.61 s gammaloop-nextest-integration> field value
  360. 131.61 s gammaloop-nextest-integration> span warm_up{integrand.name=se1l}
  361. 131.61 s gammaloop-nextest-integration> [2026-08-28 15:33:18.524] @process::amplitude WARNING : External state 1 ('g', PDG 21, helicity -) is off shell: p^2 = +2.5e5, expected m^2 = +0e0 (|Δ| = +2.5e5). Fixed-helicity spinor/vector/tensor external states may be ill-defined at this kinematic point.
  362. 131.61 s gammaloop-nextest-integration> field value
  363. 131.61 s gammaloop-nextest-integration> span warm_up{integrand.name=se1l}
  364. 131.61 s gammaloop-nextest-integration> [2026-08-28 15:33:18.525] @process::amplitude INFO : Input is above threshold: 1 existing threshold E-surfaces across 1/1 graph groups
  365. 131.61 s gammaloop-nextest-integration> field value
  366. 131.61 s gammaloop-nextest-integration> existing_esurfaces 1
  367. 131.61 s gammaloop-nextest-integration> group_count 1
  368. 131.61 s gammaloop-nextest-integration> groups_above_threshold 1
  369. 131.61 s gammaloop-nextest-integration> integrand se1l
  370. 131.61 s gammaloop-nextest-integration> span warm_up{integrand.name=se1l}
  371. 131.61 s gammaloop-nextest-integration> threshold_status above threshold
  372. 131.61 s gammaloop-nextest-integration> [2026-08-28 15:33:18.525] @process::amplitude INFO : overlap structure of group 0: [1: [0(2,3)]]
  373. 131.61 s gammaloop-nextest-integration> field value
  374. 131.61 s gammaloop-nextest-integration> span warm_up{integrand.name=se1l}
  375. 131.61 s gammaloop-nextest-integration> [2026-08-28 15:33:18.682] @commands::profile INFO :
  376. 131.61 s gammaloop-nextest-integration> ╭───────┬──────┬──────────┬───────┬─────┬──────────┬───────────╮
  377. 131.61 s gammaloop-nextest-integration> │ fixed │ → ∞ │ slope │ r2 │ DOD │ bare DOD │ inspect │
  378. 131.61 s gammaloop-nextest-integration> ├───────┼──────┼──────────┼───────┼─────┼──────────┼───────────┤
  379. 131.61 s gammaloop-nextest-integration> │ {} │ {e3} │ 1.639236 │ 0.904 │ 2 │ 2 │ arb retry │
  380. 131.61 s gammaloop-nextest-integration> │ {} │ {e2} │ 1.698834 │ 0.902 │ 2 │ 2 │ arb retry │
  381. 131.61 s gammaloop-nextest-integration> ╰───────┴──────┴──────────┴───────┴─────┴──────────┴───────────╯
  382. 131.61 s gammaloop-nextest-integration> [2026-08-28 15:33:18.682] @commands::profile INFO :
  383. 131.61 s gammaloop-nextest-integration> ╭───────┬──────┬─────────────┬──────────┬───────┬─────┬──────────┬───────────╮
  384. 131.61 s gammaloop-nextest-integration> │ fixed │ → ∞ │ orientation │ slope │ r2 │ DOD │ bare DOD │ inspect │
  385. 131.61 s gammaloop-nextest-integration> ├───────┼──────┼─────────────┼──────────┼───────┼─────┼──────────┼───────────┤
  386. 131.61 s gammaloop-nextest-integration> │ {} │ {e3} │ 00-+ │ 0.343429 │ 0.145 │ 0 │ 2 │ arb retry │
  387. 131.61 s gammaloop-nextest-integration> │ {} │ {e3} │ 00+- │ 0.342577 │ 0.135 │ 0 │ 2 │ arb retry │
  388. 131.61 s gammaloop-nextest-integration> │ {} │ {e2} │ 00-+ │ 0.385975 │ 0.161 │ 0 │ 2 │ arb retry │
  389. 131.61 s gammaloop-nextest-integration> │ {} │ {e2} │ 00+- │ 0.384920 │ 0.192 │ 0 │ 2 │ arb retry │
  390. 131.61 s gammaloop-nextest-integration> ╰───────┴──────┴─────────────┴──────────┴───────┴─────┴──────────┴───────────╯
  391. 131.61 s gammaloop-nextest-integration> [2026-08-28 15:33:18.683] @gammaloop_api::se... INFO : Running command set process kv integrator.target_relative_accuracy=0.001 integrator.n_increase=0 integrator.n_start=50000 integrator.n_max=400000 integrator.seed=1337
  392. 131.61 s gammaloop-nextest-integration> [2026-08-28 15:33:18.684] @commands::integrate INFO : Created workspace directory at /build/source/tests/artifacts/se1l/integration_workspace_se1l
  393. 131.61 s gammaloop-nextest-integration> [2026-08-28 15:33:18.701] @commands::integrate INFO : No integration state found, starting new integration
  394. 131.61 s gammaloop-nextest-integration> [2026-08-28 15:33:18.701] @commands::integrate INFO : Gammaloop now integrates se1l@se1l, se1l@se1l_muv_shifted, se1l@se1l_rls_shifted
  395. 131.61 s gammaloop-nextest-integration> [2026-08-28 15:33:18.701] @process::amplitude WARNING : External state 0 ('g', PDG 21, helicity +) is off shell: p^2 = +2.5e5, expected m^2 = +0e0 (|Δ| = +2.5e5). Fixed-helicity spinor/vector/tensor external states may be ill-defined at this kinematic point.
  396. 131.61 s gammaloop-nextest-integration> field value
  397. 131.61 s gammaloop-nextest-integration> span warm_up{integrand.name=se1l}
  398. 131.61 s gammaloop-nextest-integration> [2026-08-28 15:33:18.701] @process::amplitude WARNING : External state 1 ('g', PDG 21, helicity -) is off shell: p^2 = +2.5e5, expected m^2 = +0e0 (|Δ| = +2.5e5). Fixed-helicity spinor/vector/tensor external states may be ill-defined at this kinematic point.
  399. 131.61 s gammaloop-nextest-integration> field value
  400. 131.61 s gammaloop-nextest-integration> span warm_up{integrand.name=se1l}
  401. 131.61 s gammaloop-nextest-integration> [2026-08-28 15:33:18.701] @process::amplitude INFO : Input is above threshold: 1 existing threshold E-surfaces across 1/1 graph groups
  402. 131.61 s gammaloop-nextest-integration> field value
  403. 131.61 s gammaloop-nextest-integration> existing_esurfaces 1
  404. 131.61 s gammaloop-nextest-integration> group_count 1
  405. 131.61 s gammaloop-nextest-integration> groups_above_threshold 1
  406. 131.61 s gammaloop-nextest-integration> integrand se1l
  407. 131.61 s gammaloop-nextest-integration> span warm_up{integrand.name=se1l}
  408. 131.61 s gammaloop-nextest-integration> threshold_status above threshold
  409. 131.61 s gammaloop-nextest-integration> [2026-08-28 15:33:18.701] @process::amplitude INFO : overlap structure of group 0: [1: [0(2,3)]]
  410. 131.61 s gammaloop-nextest-integration> field value
  411. 131.61 s gammaloop-nextest-integration> span warm_up{integrand.name=se1l}
  412. 131.61 s gammaloop-nextest-integration> [2026-08-28 15:33:18.702] @process::amplitude WARNING : External state 0 ('g', PDG 21, helicity +) is off shell: p^2 = +2.5e5, expected m^2 = +0e0 (|Δ| = +2.5e5). Fixed-helicity spinor/vector/tensor external states may be ill-defined at this kinematic point.
  413. 131.61 s gammaloop-nextest-integration> field value
  414. 131.61 s gammaloop-nextest-integration> span warm_up{integrand.name=se1l_muv_shifted}
  415. 131.61 s gammaloop-nextest-integration> [2026-08-28 15:33:18.702] @process::amplitude WARNING : External state 1 ('g', PDG 21, helicity -) is off shell: p^2 = +2.5e5, expected m^2 = +0e0 (|Δ| = +2.5e5). Fixed-helicity spinor/vector/tensor external states may be ill-defined at this kinematic point.
  416. 131.61 s gammaloop-nextest-integration> field value
  417. 131.61 s gammaloop-nextest-integration> span warm_up{integrand.name=se1l_muv_shifted}
  418. 131.61 s gammaloop-nextest-integration> [2026-08-28 15:33:18.702] @process::amplitude INFO : Input is above threshold: 1 existing threshold E-surfaces across 1/1 graph groups
  419. 131.61 s gammaloop-nextest-integration> field value
  420. 131.61 s gammaloop-nextest-integration> existing_esurfaces 1
  421. 131.61 s gammaloop-nextest-integration> group_count 1
  422. 131.61 s gammaloop-nextest-integration> groups_above_threshold 1
  423. 131.61 s gammaloop-nextest-integration> integrand se1l_muv_shifted
  424. 131.61 s gammaloop-nextest-integration> span warm_up{integrand.name=se1l_muv_shifted}
  425. 131.61 s gammaloop-nextest-integration> threshold_status above threshold
  426. 131.61 s gammaloop-nextest-integration> [2026-08-28 15:33:18.702] @process::amplitude INFO : overlap structure of group 0: [1: [0(2,3)]]
  427. 131.61 s gammaloop-nextest-integration> field value
  428. 131.61 s gammaloop-nextest-integration> span warm_up{integrand.name=se1l_muv_shifted}
  429. 131.61 s gammaloop-nextest-integration> [2026-08-28 15:33:18.703] @process::amplitude WARNING : External state 0 ('g', PDG 21, helicity +) is off shell: p^2 = +2.5e5, expected m^2 = +0e0 (|Δ| = +2.5e5). Fixed-helicity spinor/vector/tensor external states may be ill-defined at this kinematic point.
  430. 131.61 s gammaloop-nextest-integration> field value
  431. 131.61 s gammaloop-nextest-integration> span warm_up{integrand.name=se1l_rls_shifted}
  432. 131.61 s gammaloop-nextest-integration> [2026-08-28 15:33:18.703] @process::amplitude WARNING : External state 1 ('g', PDG 21, helicity -) is off shell: p^2 = +2.5e5, expected m^2 = +0e0 (|Δ| = +2.5e5). Fixed-helicity spinor/vector/tensor external states may be ill-defined at this kinematic point.
  433. 131.61 s gammaloop-nextest-integration> field value
  434. 131.61 s gammaloop-nextest-integration> span warm_up{integrand.name=se1l_rls_shifted}
  435. 131.61 s gammaloop-nextest-integration> [2026-08-28 15:33:18.704] @process::amplitude INFO : Input is above threshold: 1 existing threshold E-surfaces across 1/1 graph groups
  436. 131.61 s gammaloop-nextest-integration> field value
  437. 131.61 s gammaloop-nextest-integration> existing_esurfaces 1
  438. 131.61 s gammaloop-nextest-integration> group_count 1
  439. 131.61 s gammaloop-nextest-integration> groups_above_threshold 1
  440. 131.61 s gammaloop-nextest-integration> integrand se1l_rls_shifted
  441. 131.61 s gammaloop-nextest-integration> span warm_up{integrand.name=se1l_rls_shifted}
  442. 131.61 s gammaloop-nextest-integration> threshold_status above threshold
  443. 131.61 s gammaloop-nextest-integration> ... omitted 1410 more lines; see full nextest output above
  444. 131.61 s gammaloop-nextest-integration> =========================================
  445. 131.99 s error: Cannot build '/nix/store/5lvckp7qh3dqs2nqf61qj4kz6kj46p4q-gammaloop-nextest-integration.drv'.
  446. 131.99 s Reason: builder failed with exit code 100.
  447. 131.99 s Output paths:
  448. 131.99 s /nix/store/q9ndadp0vb7l2ihf07rjiriv26fb03g2-gammaloop-nextest-integration
  449. 131.99 s Last 2048 log lines:
  450. 131.99 s > span warm_up{integrand.name=se1l_muv_shifted}
  451. 131.99 s > threshold_status above threshold
  452. 131.99 s > [2026-08-28 15:35:00.907] @process::amplitude INFO : overlap structure of group 0: [1: [0(2,3)]]
  453. 131.99 s > field value
  454. 131.99 s > span warm_up{integrand.name=se1l_muv_shifted}
  455. 131.99 s > [2026-08-28 15:35:00.910] @process::amplitude WARNING : External state 0 ('g', PDG 21, helicity +) is off shell: p^2 = +2.5e5, expected m^2 = +0e0 (|Δ| = +2.5e5). Fixed-helicity spinor/vector/tensor external states may be ill-defined at this kinematic point.
  456. 131.99 s > field value
  457. 131.99 s > span warm_up{integrand.name=se1l}
  458. 131.99 s > [2026-08-28 15:35:00.910] @process::amplitude WARNING : External state 1 ('g', PDG 21, helicity -) is off shell: p^2 = +2.5e5, expected m^2 = +0e0 (|Δ| = +2.5e5). Fixed-helicity spinor/vector/tensor external states may be ill-defined at this kinematic point.
  459. 131.99 s > field value
  460. 131.99 s > span warm_up{integrand.name=se1l}
  461. 131.99 s > [2026-08-28 15:35:00.910] @process::amplitude INFO : Input is above threshold: 1 existing threshold E-surfaces across 1/1 graph groups
  462. 131.99 s > field value
  463. 131.99 s > existing_esurfaces 1
  464. 131.99 s > group_count 1
  465. 131.99 s > groups_above_threshold 1
  466. 131.99 s > integrand se1l
  467. 131.99 s > span warm_up{integrand.name=se1l}
  468. 131.99 s > threshold_status above threshold
  469. 131.99 s > [2026-08-28 15:35:00.910] @process::amplitude INFO : overlap structure of group 0: [1: [0(2,3)]]
  470. 131.99 s > field value
  471. 131.99 s > span warm_up{integrand.name=se1l}
  472. 131.99 s > [2026-08-28 15:35:00.914] @process::amplitude WARNING : External state 0 ('g', PDG 21, helicity +) is off shell: p^2 = +2.5e5, expected m^2 = +0e0 (|Δ| = +2.5e5). Fixed-helicity spinor/vector/tensor external states may be ill-defined at this kinematic point.
  473. 131.99 s > field value
  474. 131.99 s > span warm_up{integrand.name=se1l_muv_shifted}
  475. 131.99 s > [2026-08-28 15:35:00.914] @process::amplitude WARNING : External state 1 ('g', PDG 21, helicity -) is off shell: p^2 = +2.5e5, expected m^2 = +0e0 (|Δ| = +2.5e5). Fixed-helicity spinor/vector/tensor external states may be ill-defined at this kinematic point.
  476. 131.99 s > field value
  477. 131.99 s > span warm_up{integrand.name=se1l_muv_shifted}
  478. 131.99 s > [2026-08-28 15:35:00.914] @process::amplitude INFO : Input is above threshold: 1 existing threshold E-surfaces across 1/1 graph groups
  479. 131.99 s > field value
  480. 131.99 s > existing_esurfaces 1
  481. 131.99 s > group_count 1
  482. 131.99 s > groups_above_threshold 1
  483. 131.99 s > integrand se1l_muv_shifted
  484. 131.99 s > span warm_up{integrand.name=se1l_muv_shifted}
  485. 131.99 s > threshold_status above threshold
  486. 131.99 s > [2026-08-28 15:35:00.914] @process::amplitude INFO : overlap structure of group 0: [1: [0(2,3)]]
  487. 131.99 s > field value
  488. 131.99 s > span warm_up{integrand.name=se1l_muv_shifted}
  489. 131.99 s > [2026-08-28 15:35:00.918] @process::amplitude WARNING : External state 0 ('g', PDG 21, helicity +) is off shell: p^2 = +2.5e5, expected m^2 = +0e0 (|Δ| = +2.5e5). Fixed-helicity spinor/vector/tensor external states may be ill-defined at this kinematic point.
  490. 131.99 s > field value
  491. 131.99 s > span warm_up{integrand.name=se1l}
  492. 131.99 s > [2026-08-28 15:35:00.918] @process::amplitude WARNING : External state 1 ('g', PDG 21, helicity -) is off shell: p^2 = +2.5e5, expected m^2 = +0e0 (|Δ| = +2.5e5). Fixed-helicity spinor/vector/tensor external states may be ill-defined at this kinematic point.
  493. 131.99 s > field value
  494. 131.99 s > span warm_up{integrand.name=se1l}
  495. 131.99 s > [2026-08-28 15:35:00.918] @process::amplitude INFO : Input is above threshold: 1 existing threshold E-surfaces across 1/1 graph groups
  496. 131.99 s > field value
  497. 131.99 s > existing_esurfaces 1
  498. 131.99 s > group_count 1
  499. 131.99 s > groups_above_threshold 1
  500. 131.99 s > integrand se1l
  501. 131.99 s > span warm_up{integrand.name=se1l}
  502. 131.99 s > threshold_status above threshold
  503. 131.99 s > [2026-08-28 15:35:00.918] @process::amplitude INFO : overlap structure of group 0: [1: [0(2,3)]]
  504. 131.99 s > field value
  505. 131.99 s > span warm_up{integrand.name=se1l}
  506. 131.99 s > [2026-08-28 15:35:00.922] @process::amplitude WARNING : External state 0 ('g', PDG 21, helicity +) is off shell: p^2 = +2.5e5, expected m^2 = +0e0 (|Δ| = +2.5e5). Fixed-helicity spinor/vector/tensor external states may be ill-defined at this kinematic point.
  507. 131.99 s > field value
  508. 131.99 s > span warm_up{integrand.name=se1l_muv_shifted}
  509. 131.99 s > [2026-08-28 15:35:00.922] @process::amplitude WARNING : External state 1 ('g', PDG 21, helicity -) is off shell: p^2 = +2.5e5, expected m^2 = +0e0 (|Δ| = +2.5e5). Fixed-helicity spinor/vector/tensor external states may be ill-defined at this kinematic point.
  510. 131.99 s > field value
  511. 131.99 s > span warm_up{integrand.name=se1l_muv_shifted}
  512. 131.99 s > [2026-08-28 15:35:00.922] @process::amplitude INFO : Input is above threshold: 1 existing threshold E-surfaces across 1/1 graph groups
  513. 131.99 s > field value
  514. 131.99 s > existing_esurfaces 1
  515. 131.99 s > group_count 1
  516. 131.99 s > groups_above_threshold 1
  517. 131.99 s > integrand se1l_muv_shifted
  518. 131.99 s > span warm_up{integrand.name=se1l_muv_shifted}
  519. 131.99 s > threshold_status above threshold
  520. 131.99 s > [2026-08-28 15:35:00.922] @process::amplitude INFO : overlap structure of group 0: [1: [0(2,3)]]
  521. 131.99 s > field value
  522. 131.99 s > span warm_up{integrand.name=se1l_muv_shifted}
  523. 131.99 s > [2026-08-28 15:35:00.925] @process::amplitude WARNING : External state 0 ('g', PDG 21, helicity +) is off shell: p^2 = +2.5e5, expected m^2 = +0e0 (|Δ| = +2.5e5). Fixed-helicity spinor/vector/tensor external states may be ill-defined at this kinematic point.
  524. 131.99 s > field value
  525. 131.99 s > span warm_up{integrand.name=se1l}
  526. 131.99 s > [2026-08-28 15:35:00.925] @process::amplitude WARNING : External state 1 ('g', PDG 21, helicity -) is off shell: p^2 = +2.5e5, expected m^2 = +0e0 (|Δ| = +2.5e5). Fixed-helicity spinor/vector/tensor external states may be ill-defined at this kinematic point.
  527. 131.99 s > field value
  528. 131.99 s > span warm_up{integrand.name=se1l}
  529. 131.99 s > [2026-08-28 15:35:00.925] @process::amplitude INFO : Input is above threshold: 1 existing threshold E-surfaces across 1/1 graph groups
  530. 131.99 s > field value
  531. 131.99 s > existing_esurfaces 1
  532. 131.99 s > group_count 1
  533. 131.99 s > groups_above_threshold 1
  534. 131.99 s > integrand se1l
  535. 131.99 s > span warm_up{integrand.name=se1l}
  536. 131.99 s > threshold_status above threshold
  537. 131.99 s > [2026-08-28 15:35:00.926] @process::amplitude INFO : overlap structure of group 0: [1: [0(2,3)]]
  538. 131.99 s > field value
  539. 131.99 s > span warm_up{integrand.name=se1l}
  540. 131.99 s > [2026-08-28 15:35:00.929] @process::amplitude WARNING : External state 0 ('g', PDG 21, helicity +) is off shell: p^2 = +2.5e5, expected m^2 = +0e0 (|Δ| = +2.5e5). Fixed-helicity spinor/vector/tensor external states may be ill-defined at this kinematic point.
  541. 131.99 s > field value
  542. 131.99 s > span warm_up{integrand.name=se1l_muv_shifted}
  543. 131.99 s > [2026-08-28 15:35:00.929] @process::amplitude WARNING : External state 1 ('g', PDG 21, helicity -) is off shell: p^2 = +2.5e5, expected m^2 = +0e0 (|Δ| = +2.5e5). Fixed-helicity spinor/vector/tensor external states may be ill-defined at this kinematic point.
  544. 131.99 s > field value
  545. 131.99 s > span warm_up{integrand.name=se1l_muv_shifted}
  546. 131.99 s > [2026-08-28 15:35:00.929] @process::amplitude INFO : Input is above threshold: 1 existing threshold E-surfaces across 1/1 graph groups
  547. 131.99 s > field value
  548. 131.99 s > existing_esurfaces 1
  549. 131.99 s > group_count 1
  550. 131.99 s > groups_above_threshold 1
  551. 131.99 s > integrand se1l_muv_shifted
  552. 131.99 s > span warm_up{integrand.name=se1l_muv_shifted}
  553. 131.99 s > threshold_status above threshold
  554. 131.99 s > [2026-08-28 15:35:00.929] @process::amplitude INFO : overlap structure of group 0: [1: [0(2,3)]]
  555. 131.99 s > field value
  556. 131.99 s > span warm_up{integrand.name=se1l_muv_shifted}
  557. 131.99 s > [2026-08-28 15:35:00.933] @process::amplitude WARNING : External state 0 ('g', PDG 21, helicity +) is off shell: p^2 = +2.5e5, expected m^2 = +0e0 (|Δ| = +2.5e5). Fixed-helicity spinor/vector/tensor external states may be ill-defined at this kinematic point.
  558. 131.99 s > field value
  559. 131.99 s > span warm_up{integrand.name=se1l}
  560. 131.99 s > [2026-08-28 15:35:00.933] @process::amplitude WARNING : External state 1 ('g', PDG 21, helicity -) is off shell: p^2 = +2.5e5, expected m^2 = +0e0 (|Δ| = +2.5e5). Fixed-helicity spinor/vector/tensor external states may be ill-defined at this kinematic point.
  561. 131.99 s > field value
  562. 131.99 s > span warm_up{integrand.name=se1l}
  563. 131.99 s > [2026-08-28 15:35:00.933] @process::amplitude INFO : Input is above threshold: 1 existing threshold E-surfaces across 1/1 graph groups
  564. 131.99 s > field value
  565. 131.99 s > existing_esurfaces 1
  566. 131.99 s > group_count 1
  567. 131.99 s > groups_above_threshold 1
  568. 131.99 s > integrand se1l
  569. 131.99 s > span warm_up{integrand.name=se1l}
  570. 131.99 s > threshold_status above threshold
  571. 131.99 s > [2026-08-28 15:35:00.933] @process::amplitude INFO : overlap structure of group 0: [1: [0(2,3)]]
  572. 131.99 s > field value
  573. 131.99 s > span warm_up{integrand.name=se1l}
  574. 131.99 s > [2026-08-28 15:35:00.937] @process::amplitude WARNING : External state 0 ('g', PDG 21, helicity +) is off shell: p^2 = +2.5e5, expected m^2 = +0e0 (|Δ| = +2.5e5). Fixed-helicity spinor/vector/tensor external states may be ill-defined at this kinematic point.
  575. 131.99 s > field value
  576. 131.99 s > span warm_up{integrand.name=se1l_rls_shifted}
  577. 131.99 s > [2026-08-28 15:35:00.937] @process::amplitude WARNING : External state 1 ('g', PDG 21, helicity -) is off shell: p^2 = +2.5e5, expected m^2 = +0e0 (|Δ| = +2.5e5). Fixed-helicity spinor/vector/tensor external states may be ill-defined at this kinematic point.
  578. 131.99 s > field value
  579. 131.99 s > span warm_up{integrand.name=se1l_rls_shifted}
  580. 131.99 s > [2026-08-28 15:35:00.937] @process::amplitude INFO : Input is above threshold: 1 existing threshold E-surfaces across 1/1 graph groups
  581. 131.99 s > field value
  582. 131.99 s > existing_esurfaces 1
  583. 131.99 s > group_count 1
  584. 131.99 s > groups_above_threshold 1
  585. 131.99 s > integrand se1l_rls_shifted
  586. 131.99 s > span warm_up{integrand.name=se1l_rls_shifted}
  587. 131.99 s > threshold_status above threshold
  588. 131.99 s > [2026-08-28 15:35:00.937] @process::amplitude INFO : overlap structure of group 0: [1: [0(2,3)]]
  589. 131.99 s > field value
  590. 131.99 s > span warm_up{integrand.name=se1l_rls_shifted}
  591. 131.99 s > [2026-08-28 15:35:00.941] @process::amplitude WARNING : External state 0 ('g', PDG 21, helicity +) is off shell: p^2 = +2.5e5, expected m^2 = +0e0 (|Δ| = +2.5e5). Fixed-helicity spinor/vector/tensor external states may be ill-defined at this kinematic point.
  592. 131.99 s > field value
  593. 131.99 s > span warm_up{integrand.name=se1l}
  594. 131.99 s > [2026-08-28 15:35:00.941] @process::amplitude WARNING : External state 1 ('g', PDG 21, helicity -) is off shell: p^2 = +2.5e5, expected m^2 = +0e0 (|Δ| = +2.5e5). Fixed-helicity spinor/vector/tensor external states may be ill-defined at this kinematic point.
  595. 131.99 s > field value
  596. 131.99 s > span warm_up{integrand.name=se1l}
  597. 131.99 s > [2026-08-28 15:35:00.941] @process::amplitude INFO : Input is above threshold: 1 existing threshold E-surfaces across 1/1 graph groups
  598. 131.99 s > field value
  599. 131.99 s > existing_esurfaces 1
  600. 131.99 s > group_count 1
  601. 131.99 s > groups_above_threshold 1
  602. 131.99 s > integrand se1l
  603. 131.99 s > span warm_up{integrand.name=se1l}
  604. 131.99 s > threshold_status above threshold
  605. 131.99 s > [2026-08-28 15:35:00.941] @process::amplitude INFO : overlap structure of group 0: [1: [0(2,3)]]
  606. 131.99 s > field value
  607. 131.99 s > span warm_up{integrand.name=se1l}
  608. 131.99 s > [2026-08-28 15:35:00.944] @process::amplitude WARNING : External state 0 ('g', PDG 21, helicity +) is off shell: p^2 = +2.5e5, expected m^2 = +0e0 (|Δ| = +2.5e5). Fixed-helicity spinor/vector/tensor external states may be ill-defined at this kinematic point.
  609. 131.99 s > field value
  610. 131.99 s > span warm_up{integrand.name=se1l_rls_shifted}
  611. 131.99 s > [2026-08-28 15:35:00.944] @process::amplitude WARNING : External state 1 ('g', PDG 21, helicity -) is off shell: p^2 = +2.5e5, expected m^2 = +0e0 (|Δ| = +2.5e5). Fixed-helicity spinor/vector/tensor external states may be ill-defined at this kinematic point.
  612. 131.99 s > field value
  613. 131.99 s > span warm_up{integrand.name=se1l_rls_shifted}
  614. 131.99 s > [2026-08-28 15:35:00.944] @process::amplitude INFO : Input is above threshold: 1 existing threshold E-surfaces across 1/1 graph groups
  615. 131.99 s > field value
  616. 131.99 s > existing_esurfaces 1
  617. 131.99 s > group_count 1
  618. 131.99 s > groups_above_threshold 1
  619. 131.99 s > integrand se1l_rls_shifted
  620. 131.99 s > span warm_up{integrand.name=se1l_rls_shifted}
  621. 131.99 s > threshold_status above threshold
  622. 131.99 s > [2026-08-28 15:35:00.945] @process::amplitude INFO : overlap structure of group 0: [1: [0(2,3)]]
  623. 131.99 s > field value
  624. 131.99 s > span warm_up{integrand.name=se1l_rls_shifted}
  625. 131.99 s > [2026-08-28 15:35:00.948] @process::amplitude WARNING : External state 0 ('g', PDG 21, helicity +) is off shell: p^2 = +2.5e5, expected m^2 = +0e0 (|Δ| = +2.5e5). Fixed-helicity spinor/vector/tensor external states may be ill-defined at this kinematic point.
  626. 131.99 s > field value
  627. 131.99 s > span warm_up{integrand.name=se1l}
  628. 131.99 s > [2026-08-28 15:35:00.948] @process::amplitude WARNING : External state 1 ('g', PDG 21, helicity -) is off shell: p^2 = +2.5e5, expected m^2 = +0e0 (|Δ| = +2.5e5). Fixed-helicity spinor/vector/tensor external states may be ill-defined at this kinematic point.
  629. 131.99 s > field value
  630. 131.99 s > span warm_up{integrand.name=se1l}
  631. 131.99 s > [2026-08-28 15:35:00.948] @process::amplitude INFO : Input is above threshold: 1 existing threshold E-surfaces across 1/1 graph groups
  632. 131.99 s > field value
  633. 131.99 s > existing_esurfaces 1
  634. 131.99 s > group_count 1
  635. 131.99 s > groups_above_threshold 1
  636. 131.99 s > integrand se1l
  637. 131.99 s > span warm_up{integrand.name=se1l}
  638. 131.99 s > threshold_status above threshold
  639. 131.99 s > [2026-08-28 15:35:00.948] @process::amplitude INFO : overlap structure of group 0: [1: [0(2,3)]]
  640. 131.99 s > field value
  641. 131.99 s > span warm_up{integrand.name=se1l}
  642. 131.99 s > [2026-08-28 15:35:00.952] @process::amplitude WARNING : External state 0 ('g', PDG 21, helicity +) is off shell: p^2 = +2.5e5, expected m^2 = +0e0 (|Δ| = +2.5e5). Fixed-helicity spinor/vector/tensor external states may be ill-defined at this kinematic point.
  643. 131.99 s > field value
  644. 131.99 s > span warm_up{integrand.name=se1l_rls_shifted}
  645. 131.99 s > [2026-08-28 15:35:00.952] @process::amplitude WARNING : External state 1 ('g', PDG 21, helicity -) is off shell: p^2 = +2.5e5, expected m^2 = +0e0 (|Δ| = +2.5e5). Fixed-helicity spinor/vector/tensor external states may be ill-defined at this kinematic point.
  646. 131.99 s > field value
  647. 131.99 s > span warm_up{integrand.name=se1l_rls_shifted}
  648. 131.99 s > [2026-08-28 15:35:00.952] @process::amplitude INFO : Input is above threshold: 1 existing threshold E-surfaces across 1/1 graph groups
  649. 131.99 s > field value
  650. 131.99 s > existing_esurfaces 1
  651. 131.99 s > group_count 1
  652. 131.99 s > groups_above_threshold 1
  653. 131.99 s > integrand se1l_rls_shifted
  654. 131.99 s > span warm_up{integrand.name=se1l_rls_shifted}
  655. 131.99 s > threshold_status above threshold
  656. 131.99 s > [2026-08-28 15:35:00.952] @process::amplitude INFO : overlap structure of group 0: [1: [0(2,3)]]
  657. 131.99 s > field value
  658. 131.99 s > span warm_up{integrand.name=se1l_rls_shifted}
  659. 131.99 s > [2026-08-28 15:35:00.956] @process::amplitude WARNING : External state 0 ('g', PDG 21, helicity +) is off shell: p^2 = +2.5e5, expected m^2 = +0e0 (|Δ| = +2.5e5). Fixed-helicity spinor/vector/tensor external states may be ill-defined at this kinematic point.
  660. 131.99 s > field value
  661. 131.99 s > span warm_up{integrand.name=se1l}
  662. 131.99 s > [2026-08-28 15:35:00.956] @process::amplitude WARNING : External state 1 ('g', PDG 21, helicity -) is off shell: p^2 = +2.5e5, expected m^2 = +0e0 (|Δ| = +2.5e5). Fixed-helicity spinor/vector/tensor external states may be ill-defined at this kinematic point.
  663. 131.99 s > field value
  664. 131.99 s > span warm_up{integrand.name=se1l}
  665. 131.99 s > [2026-08-28 15:35:00.956] @process::amplitude INFO : Input is above threshold: 1 existing threshold E-surfaces across 1/1 graph groups
  666. 131.99 s > field value
  667. 131.99 s > existing_esurfaces 1
  668. 131.99 s > group_count 1
  669. 131.99 s > groups_above_threshold 1
  670. 131.99 s > integrand se1l
  671. 131.99 s > span warm_up{integrand.name=se1l}
  672. 131.99 s > threshold_status above threshold
  673. 131.99 s > [2026-08-28 15:35:00.956] @process::amplitude INFO : overlap structure of group 0: [1: [0(2,3)]]
  674. 131.99 s > field value
  675. 131.99 s > span warm_up{integrand.name=se1l}
  676. 131.99 s > [2026-08-28 15:35:00.959] @process::amplitude WARNING : External state 0 ('g', PDG 21, helicity +) is off shell: p^2 = +2.5e5, expected m^2 = +0e0 (|Δ| = +2.5e5). Fixed-helicity spinor/vector/tensor external states may be ill-defined at this kinematic point.
  677. 131.99 s > field value
  678. 131.99 s > span warm_up{integrand.name=se1l_rls_shifted}
  679. 131.99 s > [2026-08-28 15:35:00.959] @process::amplitude WARNING : External state 1 ('g', PDG 21, helicity -) is off shell: p^2 = +2.5e5, expected m^2 = +0e0 (|Δ| = +2.5e5). Fixed-helicity spinor/vector/tensor external states may be ill-defined at this kinematic point.
  680. 131.99 s > field value
  681. 131.99 s > span warm_up{integrand.name=se1l_rls_shifted}
  682. 131.99 s > [2026-08-28 15:35:00.960] @process::amplitude INFO : Input is above threshold: 1 existing threshold E-surfaces across 1/1 graph groups
  683. 131.99 s > field value
  684. 131.99 s > existing_esurfaces 1
  685. 131.99 s > group_count 1
  686. 131.99 s > groups_above_threshold 1
  687. 131.99 s > integrand se1l_rls_shifted
  688. 131.99 s > span warm_up{integrand.name=se1l_rls_shifted}
  689. 131.99 s > threshold_status above threshold
  690. 131.99 s > [2026-08-28 15:35:00.960] @process::amplitude INFO : overlap structure of group 0: [1: [0(2,3)]]
  691. 131.99 s > field value
  692. 131.99 s > span warm_up{integrand.name=se1l_rls_shifted}
  693. 131.99 s > [2026-08-28 15:35:00.963] @process::amplitude WARNING : External state 0 ('g', PDG 21, helicity +) is off shell: p^2 = +2.5e5, expected m^2 = +0e0 (|Δ| = +2.5e5). Fixed-helicity spinor/vector/tensor external states may be ill-defined at this kinematic point.
  694. 131.99 s > field value
  695. 131.99 s > span warm_up{integrand.name=se1l}
  696. 131.99 s > [2026-08-28 15:35:00.963] @process::amplitude WARNING : External state 1 ('g', PDG 21, helicity -) is off shell: p^2 = +2.5e5, expected m^2 = +0e0 (|Δ| = +2.5e5). Fixed-helicity spinor/vector/tensor external states may be ill-defined at this kinematic point.
  697. 131.99 s > field value
  698. 131.99 s > span warm_up{integrand.name=se1l}
  699. 131.99 s > [2026-08-28 15:35:00.963] @process::amplitude INFO : Input is above threshold: 1 existing threshold E-surfaces across 1/1 graph groups
  700. 131.99 s > field value
  701. 131.99 s > existing_esurfaces 1
  702. 131.99 s > group_count 1
  703. 131.99 s > groups_above_threshold 1
  704. 131.99 s > integrand se1l
  705. 131.99 s > span warm_up{integrand.name=se1l}
  706. 131.99 s > threshold_status above threshold
  707. 131.99 s > [2026-08-28 15:35:00.964] @process::amplitude INFO : overlap structure of group 0: [1: [0(2,3)]]
  708. 131.99 s > field value
  709. 131.99 s > span warm_up{integrand.name=se1l}
  710. 131.99 s > [2026-08-28 15:35:00.967] @process::amplitude WARNING : External state 0 ('g', PDG 21, helicity +) is off shell: p^2 = +2.5e5, expected m^2 = +0e0 (|Δ| = +2.5e5). Fixed-helicity spinor/vector/tensor external states may be ill-defined at this kinematic point.
  711. 131.99 s > field value
  712. 131.99 s > span warm_up{integrand.name=se1l_rls_shifted}
  713. 131.99 s > [2026-08-28 15:35:00.967] @process::amplitude WARNING : External state 1 ('g', PDG 21, helicity -) is off shell: p^2 = +2.5e5, expected m^2 = +0e0 (|Δ| = +2.5e5). Fixed-helicity spinor/vector/tensor external states may be ill-defined at this kinematic point.
  714. 131.99 s > field value
  715. 131.99 s > span warm_up{integrand.name=se1l_rls_shifted}
  716. 131.99 s > [2026-08-28 15:35:00.967] @process::amplitude INFO : Input is above threshold: 1 existing threshold E-surfaces across 1/1 graph groups
  717. 131.99 s > field value
  718. 131.99 s > existing_esurfaces 1
  719. 131.99 s > group_count 1
  720. 131.99 s > groups_above_threshold 1
  721. 131.99 s > integrand se1l_rls_shifted
  722. 131.99 s > span warm_up{integrand.name=se1l_rls_shifted}
  723. 131.99 s > threshold_status above threshold
  724. 131.99 s > [2026-08-28 15:35:00.967] @process::amplitude INFO : overlap structure of group 0: [1: [0(2,3)]]
  725. 131.99 s > field value
  726. 131.99 s > span warm_up{integrand.name=se1l_rls_shifted}
  727. 131.99 s > [2026-08-28 15:35:00.971] @process::amplitude WARNING : External state 0 ('g', PDG 21, helicity +) is off shell: p^2 = +2.5e5, expected m^2 = +0e0 (|Δ| = +2.5e5). Fixed-helicity spinor/vector/tensor external states may be ill-defined at this kinematic point.
  728. 131.99 s > field value
  729. 131.99 s > span warm_up{integrand.name=se1l}
  730. 131.99 s > [2026-08-28 15:35:00.971] @process::amplitude WARNING : External state 1 ('g', PDG 21, helicity -) is off shell: p^2 = +2.5e5, expected m^2 = +0e0 (|Δ| = +2.5e5). Fixed-helicity spinor/vector/tensor external states may be ill-defined at this kinematic point.
  731. 131.99 s > field value
  732. 131.99 s > span warm_up{integrand.name=se1l}
  733. 131.99 s > [2026-08-28 15:35:00.971] @process::amplitude INFO : Input is above threshold: 1 existing threshold E-surfaces across 1/1 graph groups
  734. 131.99 s > field value
  735. 131.99 s > existing_esurfaces 1
  736. 131.99 s > group_count 1
  737. 131.99 s > groups_above_threshold 1
  738. 131.99 s > integrand se1l
  739. 131.99 s > span warm_up{integrand.name=se1l}
  740. 131.99 s > threshold_status above threshold
  741. 131.99 s > [2026-08-28 15:35:00.971] @process::amplitude INFO : overlap structure of group 0: [1: [0(2,3)]]
  742. 131.99 s > field value
  743. 131.99 s > span warm_up{integrand.name=se1l}
  744. 131.99 s > [2026-08-28 15:35:00.975] @process::amplitude WARNING : External state 0 ('g', PDG 21, helicity +) is off shell: p^2 = +2.5e5, expected m^2 = +0e0 (|Δ| = +2.5e5). Fixed-helicity spinor/vector/tensor external states may be ill-defined at this kinematic point.
  745. 131.99 s > field value
  746. 131.99 s > span warm_up{integrand.name=se1l_rls_shifted}
  747. 131.99 s > [2026-08-28 15:35:00.975] @process::amplitude WARNING : External state 1 ('g', PDG 21, helicity -) is off shell: p^2 = +2.5e5, expected m^2 = +0e0 (|Δ| = +2.5e5). Fixed-helicity spinor/vector/tensor external states may be ill-defined at this kinematic point.
  748. 131.99 s > field value
  749. 131.99 s > span warm_up{integrand.name=se1l_rls_shifted}
  750. 131.99 s > [2026-08-28 15:35:00.975] @process::amplitude INFO : Input is above threshold: 1 existing threshold E-surfaces across 1/1 graph groups
  751. 131.99 s > field value
  752. 131.99 s > existing_esurfaces 1
  753. 131.99 s > group_count 1
  754. 131.99 s > groups_above_threshold 1
  755. 131.99 s > integrand se1l_rls_shifted
  756. 131.99 s > span warm_up{integrand.name=se1l_rls_shifted}
  757. 131.99 s > threshold_status above threshold
  758. 131.99 s > [2026-08-28 15:35:00.975] @process::amplitude INFO : overlap structure of group 0: [1: [0(2,3)]]
  759. 131.99 s > field value
  760. 131.99 s > span warm_up{integrand.name=se1l_rls_shifted}
  761. 131.99 s > [2026-08-28 15:35:00.978] @process::amplitude WARNING : External state 0 ('g', PDG 21, helicity +) is off shell: p^2 = +2.5e5, expected m^2 = +0e0 (|Δ| = +2.5e5). Fixed-helicity spinor/vector/tensor external states may be ill-defined at this kinematic point.
  762. 131.99 s > field value
  763. 131.99 s > span warm_up{integrand.name=se1l}
  764. 131.99 s > [2026-08-28 15:35:00.978] @process::amplitude WARNING : External state 1 ('g', PDG 21, helicity -) is off shell: p^2 = +2.5e5, expected m^2 = +0e0 (|Δ| = +2.5e5). Fixed-helicity spinor/vector/tensor external states may be ill-defined at this kinematic point.
  765. 131.99 s > field value
  766. 131.99 s > span warm_up{integrand.name=se1l}
  767. 131.99 s > [2026-08-28 15:35:00.978] @process::amplitude INFO : Input is above threshold: 1 existing threshold E-surfaces across 1/1 graph groups
  768. 131.99 s > field value
  769. 131.99 s > existing_esurfaces 1
  770. 131.99 s > group_count 1
  771. 131.99 s > groups_above_threshold 1
  772. 131.99 s > integrand se1l
  773. 131.99 s > span warm_up{integrand.name=se1l}
  774. 131.99 s > threshold_status above threshold
  775. 131.99 s > [2026-08-28 15:35:00.979] @process::amplitude INFO : overlap structure of group 0: [1: [0(2,3)]]
  776. 131.99 s > field value
  777. 131.99 s > span warm_up{integrand.name=se1l}
  778. 131.99 s > [2026-08-28 15:35:00.982] @process::amplitude WARNING : External state 0 ('g', PDG 21, helicity +) is off shell: p^2 = +2.5e5, expected m^2 = +0e0 (|Δ| = +2.5e5). Fixed-helicity spinor/vector/tensor external states may be ill-defined at this kinematic point.
  779. 131.99 s > field value
  780. 131.99 s > span warm_up{integrand.name=se1l_rls_shifted}
  781. 131.99 s > [2026-08-28 15:35:00.982] @process::amplitude WARNING : External state 1 ('g', PDG 21, helicity -) is off shell: p^2 = +2.5e5, expected m^2 = +0e0 (|Δ| = +2.5e5). Fixed-helicity spinor/vector/tensor external states may be ill-defined at this kinematic point.
  782. 131.99 s > field value
  783. 131.99 s > span warm_up{integrand.name=se1l_rls_shifted}
  784. 131.99 s > [2026-08-28 15:35:00.982] @process::amplitude INFO : Input is above threshold: 1 existing threshold E-surfaces across 1/1 graph groups
  785. 131.99 s > field value
  786. 131.99 s > existing_esurfaces 1
  787. 131.99 s > group_count 1
  788. 131.99 s > groups_above_threshold 1
  789. 131.99 s > integrand se1l_rls_shifted
  790. 131.99 s > span warm_up{integrand.name=se1l_rls_shifted}
  791. 131.99 s > threshold_status above threshold
  792. 131.99 s > [2026-08-28 15:35:00.982] @process::amplitude INFO : overlap structure of group 0: [1: [0(2,3)]]
  793. 131.99 s > field value
  794. 131.99 s > span warm_up{integrand.name=se1l_rls_shifted}
  795. 131.99 s > [2026-08-28 15:35:00.986] @process::amplitude WARNING : External state 0 ('g', PDG 21, helicity +) is off shell: p^2 = +2.5e5, expected m^2 = +0e0 (|Δ| = +2.5e5). Fixed-helicity spinor/vector/tensor external states may be ill-defined at this kinematic point.
  796. 131.99 s > field value
  797. 131.99 s > span warm_up{integrand.name=se1l}
  798. 131.99 s > [2026-08-28 15:35:00.986] @process::amplitude WARNING : External state 1 ('g', PDG 21, helicity -) is off shell: p^2 = +2.5e5, expected m^2 = +0e0 (|Δ| = +2.5e5). Fixed-helicity spinor/vector/tensor external states may be ill-defined at this kinematic point.
  799. 131.99 s > field value
  800. 131.99 s > span warm_up{integrand.name=se1l}
  801. 131.99 s > [2026-08-28 15:35:00.986] @process::amplitude INFO : Input is above threshold: 1 existing threshold E-surfaces across 1/1 graph groups
  802. 131.99 s > field value
  803. 131.99 s > existing_esurfaces 1
  804. 131.99 s > group_count 1
  805. 131.99 s > groups_above_threshold 1
  806. 131.99 s > integrand se1l
  807. 131.99 s > span warm_up{integrand.name=se1l}
  808. 131.99 s > threshold_status above threshold
  809. 131.99 s > [2026-08-28 15:35:00.986] @process::amplitude INFO : overlap structure of group 0: [1: [0(2,3)]]
  810. 131.99 s > field value
  811. 131.99 s > span warm_up{integrand.name=se1l}
  812. 131.99 s > [2026-08-28 15:35:00.990] @process::amplitude WARNING : External state 0 ('g', PDG 21, helicity +) is off shell: p^2 = +2.5e5, expected m^2 = +0e0 (|Δ| = +2.5e5). Fixed-helicity spinor/vector/tensor external states may be ill-defined at this kinematic point.
  813. 131.99 s > field value
  814. 131.99 s > span warm_up{integrand.name=se1l_rls_shifted}
  815. 131.99 s > [2026-08-28 15:35:00.990] @process::amplitude WARNING : External state 1 ('g', PDG 21, helicity -) is off shell: p^2 = +2.5e5, expected m^2 = +0e0 (|Δ| = +2.5e5). Fixed-helicity spinor/vector/tensor external states may be ill-defined at this kinematic point.
  816. 131.99 s > field value
  817. 131.99 s > span warm_up{integrand.name=se1l_rls_shifted}
  818. 131.99 s > [2026-08-28 15:35:00.990] @process::amplitude INFO : Input is above threshold: 1 existing threshold E-surfaces across 1/1 graph groups
  819. 131.99 s > field value
  820. 131.99 s > existing_esurfaces 1
  821. 131.99 s > group_count 1
  822. 131.99 s > groups_above_threshold 1
  823. 131.99 s > integrand se1l_rls_shifted
  824. 131.99 s > span warm_up{integrand.name=se1l_rls_shifted}
  825. 131.99 s > threshold_status above threshold
  826. 131.99 s > [2026-08-28 15:35:00.990] @process::amplitude INFO : overlap structure of group 0: [1: [0(2,3)]]
  827. 131.99 s > field value
  828. 131.99 s > span warm_up{integrand.name=se1l_rls_shifted}
  829. 131.99 s > [2026-08-28 15:35:00.993] @process::amplitude WARNING : External state 0 ('g', PDG 21, helicity +) is off shell: p^2 = +2.5e5, expected m^2 = +0e0 (|Δ| = +2.5e5). Fixed-helicity spinor/vector/tensor external states may be ill-defined at this kinematic point.
  830. 131.99 s > field value
  831. 131.99 s > span warm_up{integrand.name=se1l}
  832. 131.99 s > [2026-08-28 15:35:00.993] @process::amplitude WARNING : External state 1 ('g', PDG 21, helicity -) is off shell: p^2 = +2.5e5, expected m^2 = +0e0 (|Δ| = +2.5e5). Fixed-helicity spinor/vector/tensor external states may be ill-defined at this kinematic point.
  833. 131.99 s > field value
  834. 131.99 s > span warm_up{integrand.name=se1l}
  835. 131.99 s > [2026-08-28 15:35:00.993] @process::amplitude INFO : Input is above threshold: 1 existing threshold E-surfaces across 1/1 graph groups
  836. 131.99 s > field value
  837. 131.99 s > existing_esurfaces 1
  838. 131.99 s > group_count 1
  839. 131.99 s > groups_above_threshold 1
  840. 131.99 s > integrand se1l
  841. 131.99 s > span warm_up{integrand.name=se1l}
  842. 131.99 s > threshold_status above threshold
  843. 131.99 s > [2026-08-28 15:35:00.994] @process::amplitude INFO : overlap structure of group 0: [1: [0(2,3)]]
  844. 131.99 s > field value
  845. 131.99 s > span warm_up{integrand.name=se1l}
  846. 131.99 s > [2026-08-28 15:35:00.997] @process::amplitude WARNING : External state 0 ('g', PDG 21, helicity +) is off shell: p^2 = +2.5e5, expected m^2 = +0e0 (|Δ| = +2.5e5). Fixed-helicity spinor/vector/tensor external states may be ill-defined at this kinematic point.
  847. 131.99 s > field value
  848. 131.99 s > span warm_up{integrand.name=se1l_rls_shifted}
  849. 131.99 s > [2026-08-28 15:35:00.997] @process::amplitude WARNING : External state 1 ('g', PDG 21, helicity -) is off shell: p^2 = +2.5e5, expected m^2 = +0e0 (|Δ| = +2.5e5). Fixed-helicity spinor/vector/tensor external states may be ill-defined at this kinematic point.
  850. 131.99 s > field value
  851. 131.99 s > span warm_up{integrand.name=se1l_rls_shifted}
  852. 131.99 s > [2026-08-28 15:35:00.997] @process::amplitude INFO : Input is above threshold: 1 existing threshold E-surfaces across 1/1 graph groups
  853. 131.99 s > field value
  854. 131.99 s > existing_esurfaces 1
  855. 131.99 s > group_count 1
  856. 131.99 s > groups_above_threshold 1
  857. 131.99 s > integrand se1l_rls_shifted
  858. 131.99 s > span warm_up{integrand.name=se1l_rls_shifted}
  859. 131.99 s > threshold_status above threshold
  860. 131.99 s > [2026-08-28 15:35:00.997] @process::amplitude INFO : overlap structure of group 0: [1: [0(2,3)]]
  861. 131.99 s > field value
  862. 131.99 s > span warm_up{integrand.name=se1l_rls_shifted}
  863. 131.99 s > [2026-08-28 15:35:01.001] @process::amplitude WARNING : External state 0 ('g', PDG 21, helicity +) is off shell: p^2 = +2.5e5, expected m^2 = +0e0 (|Δ| = +2.5e5). Fixed-helicity spinor/vector/tensor external states may be ill-defined at this kinematic point.
  864. 131.99 s > field value
  865. 131.99 s > span warm_up{integrand.name=se1l}
  866. 131.99 s > [2026-08-28 15:35:01.001] @process::amplitude WARNING : External state 1 ('g', PDG 21, helicity -) is off shell: p^2 = +2.5e5, expected m^2 = +0e0 (|Δ| = +2.5e5). Fixed-helicity spinor/vector/tensor external states may be ill-defined at this kinematic point.
  867. 131.99 s > field value
  868. 131.99 s > span warm_up{integrand.name=se1l}
  869. 131.99 s > [2026-08-28 15:35:01.001] @process::amplitude INFO : Input is above threshold: 1 existing threshold E-surfaces across 1/1 graph groups
  870. 131.99 s > field value
  871. 131.99 s > existing_esurfaces 1
  872. 131.99 s > group_count 1
  873. 131.99 s > groups_above_threshold 1
  874. 131.99 s > integrand se1l
  875. 131.99 s > span warm_up{integrand.name=se1l}
  876. 131.99 s > threshold_status above threshold
  877. 131.99 s > [2026-08-28 15:35:01.001] @process::amplitude INFO : overlap structure of group 0: [1: [0(2,3)]]
  878. 131.99 s > field value
  879. 131.99 s > span warm_up{integrand.name=se1l}
  880. 131.99 s > [2026-08-28 15:35:01.005] @process::amplitude WARNING : External state 0 ('g', PDG 21, helicity +) is off shell: p^2 = +2.5e5, expected m^2 = +0e0 (|Δ| = +2.5e5). Fixed-helicity spinor/vector/tensor external states may be ill-defined at this kinematic point.
  881. 131.99 s > field value
  882. 131.99 s > span warm_up{integrand.name=se1l_rls_shifted}
  883. 131.99 s > [2026-08-28 15:35:01.005] @process::amplitude WARNING : External state 1 ('g', PDG 21, helicity -) is off shell: p^2 = +2.5e5, expected m^2 = +0e0 (|Δ| = +2.5e5). Fixed-helicity spinor/vector/tensor external states may be ill-defined at this kinematic point.
  884. 131.99 s > field value
  885. 131.99 s > span warm_up{integrand.name=se1l_rls_shifted}
  886. 131.99 s > [2026-08-28 15:35:01.005] @process::amplitude INFO : Input is above threshold: 1 existing threshold E-surfaces across 1/1 graph groups
  887. 131.99 s > field value
  888. 131.99 s > existing_esurfaces 1
  889. 131.99 s > group_count 1
  890. 131.99 s > groups_above_threshold 1
  891. 131.99 s > integrand se1l_rls_shifted
  892. 131.99 s > span warm_up{integrand.name=se1l_rls_shifted}
  893. 131.99 s > threshold_status above threshold
  894. 131.99 s > [2026-08-28 15:35:01.005] @process::amplitude INFO : overlap structure of group 0: [1: [0(2,3)]]
  895. 131.99 s > field value
  896. 131.99 s > span warm_up{integrand.name=se1l_rls_shifted}
  897. 131.99 s > [2026-08-28 15:35:01.008] @process::amplitude WARNING : External state 0 ('g', PDG 21, helicity +) is off shell: p^2 = +2.5e5, expected m^2 = +0e0 (|Δ| = +2.5e5). Fixed-helicity spinor/vector/tensor external states may be ill-defined at this kinematic point.
  898. 131.99 s > field value
  899. 131.99 s > span warm_up{integrand.name=se1l}
  900. 131.99 s > [2026-08-28 15:35:01.008] @process::amplitude WARNING : External state 1 ('g', PDG 21, helicity -) is off shell: p^2 = +2.5e5, expected m^2 = +0e0 (|Δ| = +2.5e5). Fixed-helicity spinor/vector/tensor external states may be ill-defined at this kinematic point.
  901. 131.99 s > field value
  902. 131.99 s > span warm_up{integrand.name=se1l}
  903. 131.99 s > [2026-08-28 15:35:01.008] @process::amplitude INFO : Input is above threshold: 1 existing threshold E-surfaces across 1/1 graph groups
  904. 131.99 s > field value
  905. 131.99 s > existing_esurfaces 1
  906. 131.99 s > group_count 1
  907. 131.99 s > groups_above_threshold 1
  908. 131.99 s > integrand se1l
  909. 131.99 s > span warm_up{integrand.name=se1l}
  910. 131.99 s > threshold_status above threshold
  911. 131.99 s > [2026-08-28 15:35:01.009] @process::amplitude INFO : overlap structure of group 0: [1: [0(2,3)]]
  912. 131.99 s > field value
  913. 131.99 s > span warm_up{integrand.name=se1l}
  914. 131.99 s > [2026-08-28 15:35:01.012] @process::amplitude WARNING : External state 0 ('g', PDG 21, helicity +) is off shell: p^2 = +2.5e5, expected m^2 = +0e0 (|Δ| = +2.5e5). Fixed-helicity spinor/vector/tensor external states may be ill-defined at this kinematic point.
  915. 131.99 s > field value
  916. 131.99 s > span warm_up{integrand.name=se1l_mur_shifted}
  917. 131.99 s > [2026-08-28 15:35:01.012] @process::amplitude WARNING : External state 1 ('g', PDG 21, helicity -) is off shell: p^2 = +2.5e5, expected m^2 = +0e0 (|Δ| = +2.5e5). Fixed-helicity spinor/vector/tensor external states may be ill-defined at this kinematic point.
  918. 131.99 s > field value
  919. 131.99 s > span warm_up{integrand.name=se1l_mur_shifted}
  920. 131.99 s > [2026-08-28 15:35:01.012] @process::amplitude INFO : Input is above threshold: 1 existing threshold E-surfaces across 1/1 graph groups
  921. 131.99 s > field value
  922. 131.99 s > existing_esurfaces 1
  923. 131.99 s > group_count 1
  924. 131.99 s > groups_above_threshold 1
  925. 131.99 s > integrand se1l_mur_shifted
  926. 131.99 s > span warm_up{integrand.name=se1l_mur_shifted}
  927. 131.99 s > threshold_status above threshold
  928. 131.99 s > [2026-08-28 15:35:01.012] @process::amplitude INFO : overlap structure of group 0: [1: [0(2,3)]]
  929. 131.99 s > field value
  930. 131.99 s > span warm_up{integrand.name=se1l_mur_shifted}
  931. 131.99 s > [2026-08-28 15:35:01.016] @process::amplitude WARNING : External state 0 ('g', PDG 21, helicity +) is off shell: p^2 = +2.5e5, expected m^2 = +0e0 (|Δ| = +2.5e5). Fixed-helicity spinor/vector/tensor external states may be ill-defined at this kinematic point.
  932. 131.99 s > field value
  933. 131.99 s > span warm_up{integrand.name=se1l}
  934. 131.99 s > [2026-08-28 15:35:01.016] @process::amplitude WARNING : External state 1 ('g', PDG 21, helicity -) is off shell: p^2 = +2.5e5, expected m^2 = +0e0 (|Δ| = +2.5e5). Fixed-helicity spinor/vector/tensor external states may be ill-defined at this kinematic point.
  935. 131.99 s > field value
  936. 131.99 s > span warm_up{integrand.name=se1l}
  937. 131.99 s > [2026-08-28 15:35:01.016] @process::amplitude INFO : Input is above threshold: 1 existing threshold E-surfaces across 1/1 graph groups
  938. 131.99 s > field value
  939. 131.99 s > existing_esurfaces 1
  940. 131.99 s > group_count 1
  941. 131.99 s > groups_above_threshold 1
  942. 131.99 s > integrand se1l
  943. 131.99 s > span warm_up{integrand.name=se1l}
  944. 131.99 s > threshold_status above threshold
  945. 131.99 s > [2026-08-28 15:35:01.016] @process::amplitude INFO : overlap structure of group 0: [1: [0(2,3)]]
  946. 131.99 s > field value
  947. 131.99 s > span warm_up{integrand.name=se1l}
  948. 131.99 s > [2026-08-28 15:35:01.020] @process::amplitude WARNING : External state 0 ('g', PDG 21, helicity +) is off shell: p^2 = +2.5e5, expected m^2 = +0e0 (|Δ| = +2.5e5). Fixed-helicity spinor/vector/tensor external states may be ill-defined at this kinematic point.
  949. 131.99 s > field value
  950. 131.99 s > span warm_up{integrand.name=se1l_mur_shifted}
  951. 131.99 s > [2026-08-28 15:35:01.020] @process::amplitude WARNING : External state 1 ('g', PDG 21, helicity -) is off shell: p^2 = +2.5e5, expected m^2 = +0e0 (|Δ| = +2.5e5). Fixed-helicity spinor/vector/tensor external states may be ill-defined at this kinematic point.
  952. 131.99 s > field value
  953. 131.99 s > span warm_up{integrand.name=se1l_mur_shifted}
  954. 131.99 s > [2026-08-28 15:35:01.020] @process::amplitude INFO : Input is above threshold: 1 existing threshold E-surfaces across 1/1 graph groups
  955. 131.99 s > field value
  956. 131.99 s > existing_esurfaces 1
  957. 131.99 s > group_count 1
  958. 131.99 s > groups_above_threshold 1
  959. 131.99 s > integrand se1l_mur_shifted
  960. 131.99 s > span warm_up{integrand.name=se1l_mur_shifted}
  961. 131.99 s > threshold_status above threshold
  962. 131.99 s > [2026-08-28 15:35:01.020] @process::amplitude INFO : overlap structure of group 0: [1: [0(2,3)]]
  963. 131.99 s > field value
  964. 131.99 s > span warm_up{integrand.name=se1l_mur_shifted}
  965. 131.99 s > [2026-08-28 15:35:01.024] @process::amplitude WARNING : External state 0 ('g', PDG 21, helicity +) is off shell: p^2 = +2.5e5, expected m^2 = +0e0 (|Δ| = +2.5e5). Fixed-helicity spinor/vector/tensor external states may be ill-defined at this kinematic point.
  966. 131.99 s > field value
  967. 131.99 s > span warm_up{integrand.name=se1l}
  968. 131.99 s > [2026-08-28 15:35:01.024] @process::amplitude WARNING : External state 1 ('g', PDG 21, helicity -) is off shell: p^2 = +2.5e5, expected m^2 = +0e0 (|Δ| = +2.5e5). Fixed-helicity spinor/vector/tensor external states may be ill-defined at this kinematic point.
  969. 131.99 s > field value
  970. 131.99 s > span warm_up{integrand.name=se1l}
  971. 131.99 s > [2026-08-28 15:35:01.024] @process::amplitude INFO : Input is above threshold: 1 existing threshold E-surfaces across 1/1 graph groups
  972. 131.99 s > field value
  973. 131.99 s > existing_esurfaces 1
  974. 131.99 s > group_count 1
  975. 131.99 s > groups_above_threshold 1
  976. 131.99 s > integrand se1l
  977. 131.99 s > span warm_up{integrand.name=se1l}
  978. 131.99 s > threshold_status above threshold
  979. 131.99 s > [2026-08-28 15:35:01.024] @process::amplitude INFO : overlap structure of group 0: [1: [0(2,3)]]
  980. 131.99 s > field value
  981. 131.99 s > span warm_up{integrand.name=se1l}
  982. 131.99 s > [2026-08-28 15:35:01.027] @process::amplitude WARNING : External state 0 ('g', PDG 21, helicity +) is off shell: p^2 = +2.5e5, expected m^2 = +0e0 (|Δ| = +2.5e5). Fixed-helicity spinor/vector/tensor external states may be ill-defined at this kinematic point.
  983. 131.99 s > field value
  984. 131.99 s > span warm_up{integrand.name=se1l_mur_shifted}
  985. 131.99 s > [2026-08-28 15:35:01.027] @process::amplitude WARNING : External state 1 ('g', PDG 21, helicity -) is off shell: p^2 = +2.5e5, expected m^2 = +0e0 (|Δ| = +2.5e5). Fixed-helicity spinor/vector/tensor external states may be ill-defined at this kinematic point.
  986. 131.99 s > field value
  987. 131.99 s > span warm_up{integrand.name=se1l_mur_shifted}
  988. 131.99 s > [2026-08-28 15:35:01.028] @process::amplitude INFO : Input is above threshold: 1 existing threshold E-surfaces across 1/1 graph groups
  989. 131.99 s > field value
  990. 131.99 s > existing_esurfaces 1
  991. 131.99 s > group_count 1
  992. 131.99 s > groups_above_threshold 1
  993. 131.99 s > integrand se1l_mur_shifted
  994. 131.99 s > span warm_up{integrand.name=se1l_mur_shifted}
  995. 131.99 s > threshold_status above threshold
  996. 131.99 s > [2026-08-28 15:35:01.028] @process::amplitude INFO : overlap structure of group 0: [1: [0(2,3)]]
  997. 131.99 s > field value
  998. 131.99 s > span warm_up{integrand.name=se1l_mur_shifted}
  999. 131.99 s > [2026-08-28 15:35:01.031] @process::amplitude WARNING : External state 0 ('g', PDG 21, helicity +) is off shell: p^2 = +2.5e5, expected m^2 = +0e0 (|Δ| = +2.5e5). Fixed-helicity spinor/vector/tensor external states may be ill-defined at this kinematic point.
  1000. 131.99 s > field value
  1001. 131.99 s > span warm_up{integrand.name=se1l}
  1002. 131.99 s > [2026-08-28 15:35:01.031] @process::amplitude WARNING : External state 1 ('g', PDG 21, helicity -) is off shell: p^2 = +2.5e5, expected m^2 = +0e0 (|Δ| = +2.5e5). Fixed-helicity spinor/vector/tensor external states may be ill-defined at this kinematic point.
  1003. 131.99 s > field value
  1004. 131.99 s > span warm_up{integrand.name=se1l}
  1005. 131.99 s > [2026-08-28 15:35:01.031] @process::amplitude INFO : Input is above threshold: 1 existing threshold E-surfaces across 1/1 graph groups
  1006. 131.99 s > field value
  1007. 131.99 s > existing_esurfaces 1
  1008. 131.99 s > group_count 1
  1009. 131.99 s > groups_above_threshold 1
  1010. 131.99 s > integrand se1l
  1011. 131.99 s > span warm_up{integrand.name=se1l}
  1012. 131.99 s > threshold_status above threshold
  1013. 131.99 s > [2026-08-28 15:35:01.031] @process::amplitude INFO : overlap structure of group 0: [1: [0(2,3)]]
  1014. 131.99 s > field value
  1015. 131.99 s > span warm_up{integrand.name=se1l}
  1016. 131.99 s > [2026-08-28 15:35:01.035] @process::amplitude WARNING : External state 0 ('g', PDG 21, helicity +) is off shell: p^2 = +2.5e5, expected m^2 = +0e0 (|Δ| = +2.5e5). Fixed-helicity spinor/vector/tensor external states may be ill-defined at this kinematic point.
  1017. 131.99 s > field value
  1018. 131.99 s > span warm_up{integrand.name=se1l_mur_shifted}
  1019. 131.99 s > [2026-08-28 15:35:01.035] @process::amplitude WARNING : External state 1 ('g', PDG 21, helicity -) is off shell: p^2 = +2.5e5, expected m^2 = +0e0 (|Δ| = +2.5e5). Fixed-helicity spinor/vector/tensor external states may be ill-defined at this kinematic point.
  1020. 131.99 s > field value
  1021. 131.99 s > span warm_up{integrand.name=se1l_mur_shifted}
  1022. 131.99 s > [2026-08-28 15:35:01.035] @process::amplitude INFO : Input is above threshold: 1 existing threshold E-surfaces across 1/1 graph groups
  1023. 131.99 s > field value
  1024. 131.99 s > existing_esurfaces 1
  1025. 131.99 s > group_count 1
  1026. 131.99 s > groups_above_threshold 1
  1027. 131.99 s > integrand se1l_mur_shifted
  1028. 131.99 s > span warm_up{integrand.name=se1l_mur_shifted}
  1029. 131.99 s > threshold_status above threshold
  1030. 131.99 s > [2026-08-28 15:35:01.035] @process::amplitude INFO : overlap structure of group 0: [1: [0(2,3)]]
  1031. 131.99 s > field value
  1032. 131.99 s > span warm_up{integrand.name=se1l_mur_shifted}
  1033. 131.99 s > [2026-08-28 15:35:01.039] @process::amplitude WARNING : External state 0 ('g', PDG 21, helicity +) is off shell: p^2 = +2.5e5, expected m^2 = +0e0 (|Δ| = +2.5e5). Fixed-helicity spinor/vector/tensor external states may be ill-defined at this kinematic point.
  1034. 131.99 s > field value
  1035. 131.99 s > span warm_up{integrand.name=se1l}
  1036. 131.99 s > [2026-08-28 15:35:01.039] @process::amplitude WARNING : External state 1 ('g', PDG 21, helicity -) is off shell: p^2 = +2.5e5, expected m^2 = +0e0 (|Δ| = +2.5e5). Fixed-helicity spinor/vector/tensor external states may be ill-defined at this kinematic point.
  1037. 131.99 s > field value
  1038. 131.99 s > span warm_up{integrand.name=se1l}
  1039. 131.99 s > [2026-08-28 15:35:01.039] @process::amplitude INFO : Input is above threshold: 1 existing threshold E-surfaces across 1/1 graph groups
  1040. 131.99 s > field value
  1041. 131.99 s > existing_esurfaces 1
  1042. 131.99 s > group_count 1
  1043. 131.99 s > groups_above_threshold 1
  1044. 131.99 s > integrand se1l
  1045. 131.99 s > span warm_up{integrand.name=se1l}
  1046. 131.99 s > threshold_status above threshold
  1047. 131.99 s > [2026-08-28 15:35:01.039] @process::amplitude INFO : overlap structure of group 0: [1: [0(2,3)]]
  1048. 131.99 s > field value
  1049. 131.99 s > span warm_up{integrand.name=se1l}
  1050. 131.99 s > [2026-08-28 15:35:01.043] @process::amplitude WARNING : External state 0 ('g', PDG 21, helicity +) is off shell: p^2 = +2.5e5, expected m^2 = +0e0 (|Δ| = +2.5e5). Fixed-helicity spinor/vector/tensor external states may be ill-defined at this kinematic point.
  1051. 131.99 s > field value
  1052. 131.99 s > span warm_up{integrand.name=se1l_mur_shifted}
  1053. 131.99 s > [2026-08-28 15:35:01.043] @process::amplitude WARNING : External state 1 ('g', PDG 21, helicity -) is off shell: p^2 = +2.5e5, expected m^2 = +0e0 (|Δ| = +2.5e5). Fixed-helicity spinor/vector/tensor external states may be ill-defined at this kinematic point.
  1054. 131.99 s > field value
  1055. 131.99 s > span warm_up{integrand.name=se1l_mur_shifted}
  1056. 131.99 s > [2026-08-28 15:35:01.043] @process::amplitude INFO : Input is above threshold: 1 existing threshold E-surfaces across 1/1 graph groups
  1057. 131.99 s > field value
  1058. 131.99 s > existing_esurfaces 1
  1059. 131.99 s > group_count 1
  1060. 131.99 s > groups_above_threshold 1
  1061. 131.99 s > integrand se1l_mur_shifted
  1062. 131.99 s > span warm_up{integrand.name=se1l_mur_shifted}
  1063. 131.99 s > threshold_status above threshold
  1064. 131.99 s > [2026-08-28 15:35:01.043] @process::amplitude INFO : overlap structure of group 0: [1: [0(2,3)]]
  1065. 131.99 s > field value
  1066. 131.99 s > span warm_up{integrand.name=se1l_mur_shifted}
  1067. 131.99 s > [2026-08-28 15:35:01.046] @process::amplitude WARNING : External state 0 ('g', PDG 21, helicity +) is off shell: p^2 = +2.5e5, expected m^2 = +0e0 (|Δ| = +2.5e5). Fixed-helicity spinor/vector/tensor external states may be ill-defined at this kinematic point.
  1068. 131.99 s > field value
  1069. 131.99 s > span warm_up{integrand.name=se1l}
  1070. 131.99 s > [2026-08-28 15:35:01.046] @process::amplitude WARNING : External state 1 ('g', PDG 21, helicity -) is off shell: p^2 = +2.5e5, expected m^2 = +0e0 (|Δ| = +2.5e5). Fixed-helicity spinor/vector/tensor external states may be ill-defined at this kinematic point.
  1071. 131.99 s > field value
  1072. 131.99 s > span warm_up{integrand.name=se1l}
  1073. 131.99 s > [2026-08-28 15:35:01.047] @process::amplitude INFO : Input is above threshold: 1 existing threshold E-surfaces across 1/1 graph groups
  1074. 131.99 s > field value
  1075. 131.99 s > existing_esurfaces 1
  1076. 131.99 s > group_count 1
  1077. 131.99 s > groups_above_threshold 1
  1078. 131.99 s > integrand se1l
  1079. 131.99 s > span warm_up{integrand.name=se1l}
  1080. 131.99 s > threshold_status above threshold
  1081. 131.99 s > [2026-08-28 15:35:01.047] @process::amplitude INFO : overlap structure of group 0: [1: [0(2,3)]]
  1082. 131.99 s > field value
  1083. 131.99 s > span warm_up{integrand.name=se1l}
  1084. 131.99 s > [2026-08-28 15:35:01.050] @process::amplitude WARNING : External state 0 ('g', PDG 21, helicity +) is off shell: p^2 = +2.5e5, expected m^2 = +0e0 (|Δ| = +2.5e5). Fixed-helicity spinor/vector/tensor external states may be ill-defined at this kinematic point.
  1085. 131.99 s > field value
  1086. 131.99 s > span warm_up{integrand.name=se1l_mur_shifted}
  1087. 131.99 s > [2026-08-28 15:35:01.050] @process::amplitude WARNING : External state 1 ('g', PDG 21, helicity -) is off shell: p^2 = +2.5e5, expected m^2 = +0e0 (|Δ| = +2.5e5). Fixed-helicity spinor/vector/tensor external states may be ill-defined at this kinematic point.
  1088. 131.99 s > field value
  1089. 131.99 s > span warm_up{integrand.name=se1l_mur_shifted}
  1090. 131.99 s > [2026-08-28 15:35:01.050] @process::amplitude INFO : Input is above threshold: 1 existing threshold E-surfaces across 1/1 graph groups
  1091. 131.99 s > field value
  1092. 131.99 s > existing_esurfaces 1
  1093. 131.99 s > group_count 1
  1094. 131.99 s > groups_above_threshold 1
  1095. 131.99 s > integrand se1l_mur_shifted
  1096. 131.99 s > span warm_up{integrand.name=se1l_mur_shifted}
  1097. 131.99 s > threshold_status above threshold
  1098. 131.99 s > [2026-08-28 15:35:01.050] @process::amplitude INFO : overlap structure of group 0: [1: [0(2,3)]]
  1099. 131.99 s > field value
  1100. 131.99 s > span warm_up{integrand.name=se1l_mur_shifted}
  1101. 131.99 s > [2026-08-28 15:35:01.054] @process::amplitude WARNING : External state 0 ('g', PDG 21, helicity +) is off shell: p^2 = +2.5e5, expected m^2 = +0e0 (|Δ| = +2.5e5). Fixed-helicity spinor/vector/tensor external states may be ill-defined at this kinematic point.
  1102. 131.99 s > field value
  1103. 131.99 s > span warm_up{integrand.name=se1l}
  1104. 131.99 s > [2026-08-28 15:35:01.054] @process::amplitude WARNING : External state 1 ('g', PDG 21, helicity -) is off shell: p^2 = +2.5e5, expected m^2 = +0e0 (|Δ| = +2.5e5). Fixed-helicity spinor/vector/tensor external states may be ill-defined at this kinematic point.
  1105. 131.99 s > field value
  1106. 131.99 s > span warm_up{integrand.name=se1l}
  1107. 131.99 s > [2026-08-28 15:35:01.054] @process::amplitude INFO : Input is above threshold: 1 existing threshold E-surfaces across 1/1 graph groups
  1108. 131.99 s > field value
  1109. 131.99 s > existing_esurfaces 1
  1110. 131.99 s > group_count 1
  1111. 131.99 s > groups_above_threshold 1
  1112. 131.99 s > integrand se1l
  1113. 131.99 s > span warm_up{integrand.name=se1l}
  1114. 131.99 s > threshold_status above threshold
  1115. 131.99 s > [2026-08-28 15:35:01.054] @process::amplitude INFO : overlap structure of group 0: [1: [0(2,3)]]
  1116. 131.99 s > field value
  1117. 131.99 s > span warm_up{integrand.name=se1l}
  1118. 131.99 s > [2026-08-28 15:35:01.058] @process::amplitude WARNING : External state 0 ('g', PDG 21, helicity +) is off shell: p^2 = +2.5e5, expected m^2 = +0e0 (|Δ| = +2.5e5). Fixed-helicity spinor/vector/tensor external states may be ill-defined at this kinematic point.
  1119. 131.99 s > field value
  1120. 131.99 s > span warm_up{integrand.name=se1l_mur_shifted}
  1121. 131.99 s > [2026-08-28 15:35:01.058] @process::amplitude WARNING : External state 1 ('g', PDG 21, helicity -) is off shell: p^2 = +2.5e5, expected m^2 = +0e0 (|Δ| = +2.5e5). Fixed-helicity spinor/vector/tensor external states may be ill-defined at this kinematic point.
  1122. 131.99 s > field value
  1123. 131.99 s > span warm_up{integrand.name=se1l_mur_shifted}
  1124. 131.99 s > [2026-08-28 15:35:01.058] @process::amplitude INFO : Input is above threshold: 1 existing threshold E-surfaces across 1/1 graph groups
  1125. 131.99 s > field value
  1126. 131.99 s > existing_esurfaces 1
  1127. 131.99 s > group_count 1
  1128. 131.99 s > groups_above_threshold 1
  1129. 131.99 s > integrand se1l_mur_shifted
  1130. 131.99 s > span warm_up{integrand.name=se1l_mur_shifted}
  1131. 131.99 s > threshold_status above threshold
  1132. 131.99 s > [2026-08-28 15:35:01.058] @process::amplitude INFO : overlap structure of group 0: [1: [0(2,3)]]
  1133. 131.99 s > field value
  1134. 131.99 s > span warm_up{integrand.name=se1l_mur_shifted}
  1135. 131.99 s > [2026-08-28 15:35:01.061] @process::amplitude WARNING : External state 0 ('g', PDG 21, helicity +) is off shell: p^2 = +2.5e5, expected m^2 = +0e0 (|Δ| = +2.5e5). Fixed-helicity spinor/vector/tensor external states may be ill-defined at this kinematic point.
  1136. 131.99 s > field value
  1137. 131.99 s > span warm_up{integrand.name=se1l}
  1138. 131.99 s > [2026-08-28 15:35:01.061] @process::amplitude WARNING : External state 1 ('g', PDG 21, helicity -) is off shell: p^2 = +2.5e5, expected m^2 = +0e0 (|Δ| = +2.5e5). Fixed-helicity spinor/vector/tensor external states may be ill-defined at this kinematic point.
  1139. 131.99 s > field value
  1140. 131.99 s > span warm_up{integrand.name=se1l}
  1141. 131.99 s > [2026-08-28 15:35:01.062] @process::amplitude INFO : Input is above threshold: 1 existing threshold E-surfaces across 1/1 graph groups
  1142. 131.99 s > field value
  1143. 131.99 s > existing_esurfaces 1
  1144. 131.99 s > group_count 1
  1145. 131.99 s > groups_above_threshold 1
  1146. 131.99 s > integrand se1l
  1147. 131.99 s > span warm_up{integrand.name=se1l}
  1148. 131.99 s > threshold_status above threshold
  1149. 131.99 s > [2026-08-28 15:35:01.062] @process::amplitude INFO : overlap structure of group 0: [1: [0(2,3)]]
  1150. 131.99 s > field value
  1151. 131.99 s > span warm_up{integrand.name=se1l}
  1152. 131.99 s > [2026-08-28 15:35:01.065] @process::amplitude WARNING : External state 0 ('g', PDG 21, helicity +) is off shell: p^2 = +2.5e5, expected m^2 = +0e0 (|Δ| = +2.5e5). Fixed-helicity spinor/vector/tensor external states may be ill-defined at this kinematic point.
  1153. 131.99 s > field value
  1154. 131.99 s > span warm_up{integrand.name=se1l_mur_shifted}
  1155. 131.99 s > [2026-08-28 15:35:01.065] @process::amplitude WARNING : External state 1 ('g', PDG 21, helicity -) is off shell: p^2 = +2.5e5, expected m^2 = +0e0 (|Δ| = +2.5e5). Fixed-helicity spinor/vector/tensor external states may be ill-defined at this kinematic point.
  1156. 131.99 s > field value
  1157. 131.99 s > span warm_up{integrand.name=se1l_mur_shifted}
  1158. 131.99 s > [2026-08-28 15:35:01.065] @process::amplitude INFO : Input is above threshold: 1 existing threshold E-surfaces across 1/1 graph groups
  1159. 131.99 s > field value
  1160. 131.99 s > existing_esurfaces 1
  1161. 131.99 s > group_count 1
  1162. 131.99 s > groups_above_threshold 1
  1163. 131.99 s > integrand se1l_mur_shifted
  1164. 131.99 s > span warm_up{integrand.name=se1l_mur_shifted}
  1165. 131.99 s > threshold_status above threshold
  1166. 131.99 s > [2026-08-28 15:35:01.065] @process::amplitude INFO : overlap structure of group 0: [1: [0(2,3)]]
  1167. 131.99 s > field value
  1168. 131.99 s > span warm_up{integrand.name=se1l_mur_shifted}
  1169. 131.99 s > [2026-08-28 15:35:01.069] @process::amplitude WARNING : External state 0 ('g', PDG 21, helicity +) is off shell: p^2 = +2.5e5, expected m^2 = +0e0 (|Δ| = +2.5e5). Fixed-helicity spinor/vector/tensor external states may be ill-defined at this kinematic point.
  1170. 131.99 s > field value
  1171. 131.99 s > span warm_up{integrand.name=se1l}
  1172. 131.99 s > [2026-08-28 15:35:01.069] @process::amplitude WARNING : External state 1 ('g', PDG 21, helicity -) is off shell: p^2 = +2.5e5, expected m^2 = +0e0 (|Δ| = +2.5e5). Fixed-helicity spinor/vector/tensor external states may be ill-defined at this kinematic point.
  1173. 131.99 s > field value
  1174. 131.99 s > span warm_up{integrand.name=se1l}
  1175. 131.99 s > [2026-08-28 15:35:01.069] @process::amplitude INFO : Input is above threshold: 1 existing threshold E-surfaces across 1/1 graph groups
  1176. 131.99 s > field value
  1177. 131.99 s > existing_esurfaces 1
  1178. 131.99 s > group_count 1
  1179. 131.99 s > groups_above_threshold 1
  1180. 131.99 s > integrand se1l
  1181. 131.99 s > span warm_up{integrand.name=se1l}
  1182. 131.99 s > threshold_status above threshold
  1183. 131.99 s > [2026-08-28 15:35:01.069] @process::amplitude INFO : overlap structure of group 0: [1: [0(2,3)]]
  1184. 131.99 s > field value
  1185. 131.99 s > span warm_up{integrand.name=se1l}
  1186. 131.99 s > [2026-08-28 15:35:01.073] @process::amplitude WARNING : External state 0 ('g', PDG 21, helicity +) is off shell: p^2 = +2.5e5, expected m^2 = +0e0 (|Δ| = +2.5e5). Fixed-helicity spinor/vector/tensor external states may be ill-defined at this kinematic point.
  1187. 131.99 s > field value
  1188. 131.99 s > span warm_up{integrand.name=se1l_mur_shifted}
  1189. 131.99 s > [2026-08-28 15:35:01.073] @process::amplitude WARNING : External state 1 ('g', PDG 21, helicity -) is off shell: p^2 = +2.5e5, expected m^2 = +0e0 (|Δ| = +2.5e5). Fixed-helicity spinor/vector/tensor external states may be ill-defined at this kinematic point.
  1190. 131.99 s > field value
  1191. 131.99 s > span warm_up{integrand.name=se1l_mur_shifted}
  1192. 131.99 s > [2026-08-28 15:35:01.073] @process::amplitude INFO : Input is above threshold: 1 existing threshold E-surfaces across 1/1 graph groups
  1193. 131.99 s > field value
  1194. 131.99 s > existing_esurfaces 1
  1195. 131.99 s > group_count 1
  1196. 131.99 s > groups_above_threshold 1
  1197. 131.99 s > integrand se1l_mur_shifted
  1198. 131.99 s > span warm_up{integrand.name=se1l_mur_shifted}
  1199. 131.99 s > threshold_status above threshold
  1200. 131.99 s > [2026-08-28 15:35:01.073] @process::amplitude INFO : overlap structure of group 0: [1: [0(2,3)]]
  1201. 131.99 s > field value
  1202. 131.99 s > span warm_up{integrand.name=se1l_mur_shifted}
  1203. 131.99 s > [2026-08-28 15:35:01.077] @process::amplitude WARNING : External state 0 ('g', PDG 21, helicity +) is off shell: p^2 = +2.5e5, expected m^2 = +0e0 (|Δ| = +2.5e5). Fixed-helicity spinor/vector/tensor external states may be ill-defined at this kinematic point.
  1204. 131.99 s > field value
  1205. 131.99 s > span warm_up{integrand.name=se1l}
  1206. 131.99 s > [2026-08-28 15:35:01.077] @process::amplitude WARNING : External state 1 ('g', PDG 21, helicity -) is off shell: p^2 = +2.5e5, expected m^2 = +0e0 (|Δ| = +2.5e5). Fixed-helicity spinor/vector/tensor external states may be ill-defined at this kinematic point.
  1207. 131.99 s > field value
  1208. 131.99 s > span warm_up{integrand.name=se1l}
  1209. 131.99 s > [2026-08-28 15:35:01.077] @process::amplitude INFO : Input is above threshold: 1 existing threshold E-surfaces across 1/1 graph groups
  1210. 131.99 s > field value
  1211. 131.99 s > existing_esurfaces 1
  1212. 131.99 s > group_count 1
  1213. 131.99 s > groups_above_threshold 1
  1214. 131.99 s > integrand se1l
  1215. 131.99 s > span warm_up{integrand.name=se1l}
  1216. 131.99 s > threshold_status above threshold
  1217. 131.99 s > [2026-08-28 15:35:01.077] @process::amplitude INFO : overlap structure of group 0: [1: [0(2,3)]]
  1218. 131.99 s > field value
  1219. 131.99 s > span warm_up{integrand.name=se1l}
  1220. 131.99 s > [2026-08-28 15:35:01.080] @process::amplitude WARNING : External state 0 ('g', PDG 21, helicity +) is off shell: p^2 = +2.5e5, expected m^2 = +0e0 (|Δ| = +2.5e5). Fixed-helicity spinor/vector/tensor external states may be ill-defined at this kinematic point.
  1221. 131.99 s > field value
  1222. 131.99 s > span warm_up{integrand.name=se1l_mur_shifted}
  1223. 131.99 s > [2026-08-28 15:35:01.080] @process::amplitude WARNING : External state 1 ('g', PDG 21, helicity -) is off shell: p^2 = +2.5e5, expected m^2 = +0e0 (|Δ| = +2.5e5). Fixed-helicity spinor/vector/tensor external states may be ill-defined at this kinematic point.
  1224. 131.99 s > field value
  1225. 131.99 s > span warm_up{integrand.name=se1l_mur_shifted}
  1226. 131.99 s > [2026-08-28 15:35:01.081] @process::amplitude INFO : Input is above threshold: 1 existing threshold E-surfaces across 1/1 graph groups
  1227. 131.99 s > field value
  1228. 131.99 s > existing_esurfaces 1
  1229. 131.99 s > group_count 1
  1230. 131.99 s > groups_above_threshold 1
  1231. 131.99 s > integrand se1l_mur_shifted
  1232. 131.99 s > span warm_up{integrand.name=se1l_mur_shifted}
  1233. 131.99 s > threshold_status above threshold
  1234. 131.99 s > [2026-08-28 15:35:01.081] @process::amplitude INFO : overlap structure of group 0: [1: [0(2,3)]]
  1235. 131.99 s > field value
  1236. 131.99 s > span warm_up{integrand.name=se1l_mur_shifted}
  1237. 131.99 s > The application panicked (crashed).
  1238. 131.99 s > Message: Integrated UV case failed: se1l
  1239. 131.99 s > Location: tests/tests/uv.rs:1068
  1240. 131.99 s >
  1241. 131.99 s > ━━━━━━━━━━━━━━━━━━━━━━━━━━━━━━━━━━ BACKTRACE ━━━━━━━━━━━━━━━━━━━━━━━━━━━━━━━━━━━
  1242. 131.99 s > 1: <color_eyre[51793ea62743adbd]::config::PanicHook>::panic_report<unknown>
  1243. 131.99 s > at <unknown source file>:<unknown line>
  1244. 131.99 s > 2: <color_eyre[51793ea62743adbd]::config::PanicHook>::into_panic_hook::{closure#0}<unknown>
  1245. 131.99 s > at <unknown source file>:<unknown line>
  1246. 131.99 s > 3: std[bcb96dfbba0ab899]::panicking::panic_with_hook<unknown>
  1247. 131.99 s > at <unknown source file>:<unknown line>
  1248. 131.99 s > 4: std[bcb96dfbba0ab899]::panicking::panic_handler::{closure#0}<unknown>
  1249. 131.99 s > at <unknown source file>:<unknown line>
  1250. 131.99 s > 5: std[bcb96dfbba0ab899]::sys::backtrace::__rust_end_short_backtrace::<std[bcb96dfbba0ab899]::panicking::panic_handler::{closure#0}, !><unknown>
  1251. 131.99 s > at <unknown source file>:<unknown line>
  1252. 131.99 s > 6: __rustc[6c289b9f9c454d21]::rust_begin_unwind<unknown>
  1253. 131.99 s > at <unknown source file>:<unknown line>
  1254. 131.99 s > 7: core[940e698046960fd5]::panicking::panic_fmt<unknown>
  1255. 131.99 s > at <unknown source file>:<unknown line>
  1256. 131.99 s > 8: uv[52cf2b63f0104e31]::run_single_integrated_uv_case<unknown>
  1257. 131.99 s > at <unknown source file>:<unknown line>
  1258. 131.99 s > 9: <uv[52cf2b63f0104e31]::se1l_uv::{closure#0} as core[940e698046960fd5]::ops::function::FnOnce<()>>::call_once<unknown>
  1259. 131.99 s > at <unknown source file>:<unknown line>
  1260. 131.99 s > 10: test[75d6903177b1d7e9]::__rust_begin_short_backtrace::<core[940e698046960fd5]::result::Result<(), alloc[2ea6bcb46fca0c42]::string::String>, fn() -> core[940e698046960fd5]::result::Result<(), alloc[2ea6bcb46fca0c42]::string::String>><unknown>
  1261. 131.99 s > at <unknown source file>:<unknown line>
  1262. 131.99 s > 11: test[75d6903177b1d7e9]::run_test::{closure#0}<unknown>
  1263. 131.99 s > at <unknown source file>:<unknown line>
  1264. 131.99 s > 12: std[bcb96dfbba0ab899]::sys::backtrace::__rust_begin_short_backtrace::<test[75d6903177b1d7e9]::run_test::{closure#1}, ()><unknown>
  1265. 131.99 s > at <unknown source file>:<unknown line>
  1266. 131.99 s > 13: <std[bcb96dfbba0ab899]::thread::lifecycle::spawn_unchecked<test[75d6903177b1d7e9]::run_test::{closure#1}, ()>::{closure#1} as core[940e698046960fd5]::ops::function::FnOnce<()>>::call_once::{shim:vtable#0}<unknown>
  1267. 131.99 s > at <unknown source file>:<unknown line>
  1268. 131.99 s > 14: <std[bcb96dfbba0ab899]::sys::thread::unix::Thread>::new::thread_start<unknown>
  1269. 131.99 s > at <unknown source file>:<unknown line>
  1270. 131.99 s > 15: start_thread<unknown>
  1271. 131.99 s > at <unknown source file>:<unknown line>
  1272. 131.99 s > 16: __clone3<unknown>
  1273. 131.99 s > at <unknown source file>:<unknown line>
  1274. 131.99 s >
  1275. 131.99 s > Run with COLORBT_SHOW_HIDDEN=1 environment variable to disable frame filtering.
  1276. 131.99 s > Run with RUST_BACKTRACE=full to include source snippets.
  1277. 131.99 s >
  1278. 131.99 s > error: test run failed
  1279. 131.99 s >
  1280. 131.99 s > ========== nextest test summary ==========
  1281. 131.99 s > report: target/nextest/ci_gammaloop/junit.xml
  1282. 131.99 s > tests: 106, failures: 9, errors: 0
  1283. 131.99 s >
  1284. 131.99 s > 1. gammaloop-integration-tests::test_runs::approach::approach_momentum_space_reports_incomplete_triplet_cleanly
  1285. 131.99 s > failure: test failure with exit code 101
  1286. 131.99 s > system-out
  1287. 131.99 s > running 1 test
  1288. 131.99 s > test approach::approach_momentum_space_reports_incomplete_triplet_cleanly ... FAILED
  1289. 131.99 s >
  1290. 131.99 s > failures:
  1291. 131.99 s >
  1292. 131.99 s > failures:
  1293. 131.99 s > approach::approach_momentum_space_reports_incomplete_triplet_cleanly
  1294. 131.99 s >
  1295. 131.99 s > test result: FAILED. 0 passed; 1 failed; 0 ignored; 0 measured; 82 filtered out; finished in 0.58s
  1296. 131.99 s > system-err
  1297. 131.99 s > [2026-08-28 15:33:09.631] @gammaloop_api::se... INFO : Running command import model scalars-default.json
  1298. 131.99 s > [2026-08-28 15:33:09.631] @import::model INFO : Loading built-in JSON model scalars-default
  1299. 131.99 s > [2026-08-28 15:33:09.635] @gammalooprs::model INFO : The following 2 external parameters were forced to zero by the restriction card:
  1300. 131.99 s > width_scalar_1, width_scalar_2
  1301. 131.99 s > [2026-08-28 15:33:09.636] @gammaloop_api::se... INFO : Running command remove processes
  1302. 131.99 s > [2026-08-28 15:33:09.637] @gammaloop_api::se... INFO : Running command generate amp scalar_1 > scalar_0 scalar_0 [{1}] --allowed-vertex-interactions V_3_SCALAR_022 V_3_SCALAR_122 -p triangle -i scalar_tri
  1303. 131.99 s > [2026-08-28 15:33:09.638] @feyngen::diagram_... INFO : 0s | Δ=0s | Starting Feynman graph generation with Symbolica...
  1304. 131.99 s > [2026-08-28 15:33:09.638] @feyngen::diagram_... INFO : 0s | Δ=0s | Number of graphs resulting from Symbolica generation: 1
  1305. 131.99 s > [2026-08-28 15:33:09.638] @feyngen::diagram_... INFO : 0s | Δ=0s | Number of graphs retained after removal of vetoed topologies: 1
  1306. 131.99 s > [2026-08-28 15:33:09.638] @feyngen::diagram_... INFO : 0s | Δ=0s | Number of graphs after vertex info assignment: 1
  1307. 131.99 s > [2026-08-28 15:33:09.638] @feyngen::diagram_... INFO : 0s | Δ=0s | Number of graphs after all complete graphs filters are applied: 1
  1308. 131.99 s > [2026-08-28 15:33:09.638] @feyngen::diagram_... INFO : 0s | Δ=0s | Number of graphs after closed fermion chains analysis: 1
  1309. 131.99 s > [2026-08-28 15:33:09.638] @feyngen::diagram_... INFO : 0s | Δ=0s | Number of graphs after symmetrization of external states: 1
  1310. 132.00 s > [2026-08-28 15:33:09.638] @feyngen::diagram_... INFO : 0s | Δ=0s | Number of graphs after canonization of vertices, edges and flows (graph labels assigned here): 1
  1311. 132.00 s > [2026-08-28 15:33:09.644] @feyngen::diagram_... INFO : 0s | Δ=0s | Number of graphs after numerator-aware grouping with strategy 'up to a scalar rescaling': 1 (1 isomorphically unique graph, 0 color zero, 0 lorentz zero, 0 grouped and 0 cancellation)
  1312. 132.00 s > [2026-08-28 15:33:09.644] @feyngen::diagram_... INFO : ( Sum of the symmetry factors from each graph generated = 1 )
  1313. 132.00 s > [2026-08-28 15:33:09.644] @commands::generate INFO : Generated amplitude 1 graphs.
  1314. 132.00 s > [2026-08-28 15:33:09.665] @settings::runtime WARNING : No external kinematics were provided; using default-generated external momenta and helicities.
  1315. 132.00 s > [2026-08-28 15:33:09.751] @commands::generate INFO :
  1316. 132.00 s > Integrand generation summary
  1317. 132.00 s > peak RAM 65.93 MiB | cores 1
  1318. 132.00 s > ╭────────────┬───────┬─────────┬────────────┬───────────┬────────────────┬─────────────╮
  1319. 132.00 s > │ integrand │ graph │ # evals │ expr build │ spenso │ symbolica eval │ compile │
  1320. 132.00 s > ├────────────┼───────┼─────────┼────────────┼───────────┼────────────────┼─────────────┤
  1321. 132.00 s > │ scalar_tri │ GL0 │ 9 │ 11ms (60%) │ 1ms (10%) │ 5ms (30%) │ 0ms (0.00%) │
  1322. 132.00 s > ├────────────┼───────┼─────────┼────────────┼───────────┼────────────────┼─────────────┤
  1323. 132.00 s > │ Total │ │ 9 │ 11ms (60%) │ 1ms (10%) │ 5ms (30%) │ 0ms (0.00%) │
  1324. 132.00 s > ╰────────────┴───────┴─────────┴────────────┴───────────┴────────────────┴─────────────╯
  1325. 132.00 s > [2026-08-28 15:33:09.753] @gammaloop_api::se... INFO : Running command generate amp scalar_0 scalar_0 > scalar_0 scalar_0 [{1}] --allowed-vertex-interactions V_3_SCALAR_022 -p box -i scalar_box --select-graphs GL0
  1326. 132.00 s > [2026-08-28 15:33:09.758] @feyngen::diagram_... INFO : 0s | Δ=0s | Starting Feynman graph generation with Symbolica...
  1327. 132.00 s > [2026-08-28 15:33:09.758] @feyngen::diagram_... INFO : 0s | Δ=0s | Number of graphs resulting from Symbolica generation: 3
  1328. 132.00 s > [2026-08-28 15:33:09.762] @feyngen::diagram_... INFO : 0s | Δ=0s | Number of graphs retained after removal of vetoed topologies: 3
  1329. 132.00 s > [2026-08-28 15:33:09.762] @feyngen::diagram_... INFO : 0s | Δ=0s | Number of graphs after vertex info assignment: 3
  1330. 132.00 s > [2026-08-28 15:33:09.762] @feyngen::diagram_... INFO : 0s | Δ=0s | Number of graphs after all complete graphs filters are applied: 3
  1331. 132.00 s > [2026-08-28 15:33:09.762] @feyngen::diagram_... INFO : 0s | Δ=0s | Number of graphs after closed fermion chains analysis: 3
  1332. 132.00 s > [2026-08-28 15:33:09.762] @feyngen::diagram_... INFO : 0s | Δ=0s | Number of graphs after symmetrization of external states: 3
  1333. 132.00 s > [2026-08-28 15:33:09.763] @feyngen::diagram_... INFO : 0s | Δ=0s | Number of graphs after canonization of vertices, edges and flows (graph labels assigned here): 3
  1334. 132.00 s > [2026-08-28 15:33:09.772] @feyngen::diagram_... INFO : 0s | Δ=0s | Number of graphs after numerator-aware grouping with strategy 'up to a scalar rescaling': 1 (1 isomorphically unique graph, 0 color zero, 0 lorentz zero, 0 grouped and 0 cancellation)
  1335. 132.00 s > [2026-08-28 15:33:09.772] @feyngen::diagram_... INFO : ( Sum of the symmetry factors from each graph generated = 1 )
  1336. 132.00 s > [2026-08-28 15:33:09.772] @commands::generate INFO : Generated amplitude 1 graphs.
  1337. 132.00 s > [2026-08-28 15:33:09.874] @settings::runtime WARNING : No external kinematics were provided; using default-generated external momenta and helicities.
  1338. 132.00 s > [2026-08-28 15:33:09.877] @commands::generate INFO :
  1339. 132.00 s > Integrand generation summary
  1340. 132.00 s > peak RAM 68.07 MiB | cores 1
  1341. 132.00 s > ╭────────────┬───────┬─────────┬────────────┬────────────┬────────────────┬─────────────╮
  1342. 132.00 s > │ integrand │ graph │ # evals │ expr build │ spenso │ symbolica eval │ compile │
  1343. 132.00 s > ├────────────┼───────┼─────────┼────────────┼────────────┼────────────────┼─────────────┤
  1344. 132.00 s > │ scalar_box │ GL0 │ 13 │ 46ms (48%) │ 10ms (11%) │ 39ms (41%) │ 0ms (0.00%) │
  1345. 132.00 s > ├────────────┼───────┼─────────┼────────────┼────────────┼────────────────┼─────────────┤
  1346. 132.00 s > │ Total │ │ 13 │ 46ms (48%) │ 10ms (11%) │ 39ms (41%) │ 0ms (0.00%) │
  1347. 132.00 s > ╰────────────┴───────┴─────────┴────────────┴────────────┴────────────────┴─────────────╯
  1348. 132.00 s > [2026-08-28 15:33:09.878] @gammaloop_api::se... INFO : Running command generate
  1349. 132.00 s > [2026-08-28 15:33:09.947] @settings::runtime WARNING : No external kinematics were provided; using default-generated external momenta and helicities.
  1350. 132.00 s > [2026-08-28 15:33:09.986] @settings::runtime WARNING : No external kinematics were provided; using default-generated external momenta and helicities.
  1351. 132.00 s > [2026-08-28 15:33:10.083] @commands::generate INFO :
  1352. 132.00 s > Integrand generation summary
  1353. 132.00 s > peak RAM 72.07 MiB | cores 1
  1354. 132.00 s > ╭────────────┬───────┬─────────┬────────────┬────────────┬────────────────┬─────────────╮
  1355. 132.00 s > │ integrand │ graph │ # evals │ expr build │ spenso │ symbolica eval │ compile │
  1356. 132.00 s > ├────────────┼───────┼─────────┼────────────┼────────────┼────────────────┼─────────────┤
  1357. 132.00 s > │ scalar_tri │ GL0 │ 9 │ 12ms (63%) │ 1ms (8.9%) │ 5ms (28%) │ 0ms (0.00%) │
  1358. 132.00 s > │ scalar_box │ GL0 │ 13 │ 44ms (54%) │ 7ms (9.4%) │ 30ms (37%) │ 0ms (0.00%) │
  1359. 132.00 s > ├────────────┼───────┼─────────┼────────────┼────────────┼────────────────┼─────────────┤
  1360. 132.00 s > │ Total │ │ 22 │ 57ms (56%) │ 9ms (9.3%) │ 36ms (35%) │ 0ms (0.00%) │
  1361. 132.00 s > ╰────────────┴───────┴─────────┴────────────┴────────────┴────────────────┴─────────────╯
  1362. 132.00 s > [2026-08-28 15:33:10.084] @gammaloop_api::se... INFO : Running command set model mass_scalar_2=2.0
  1363. 132.00 s > [2026-08-28 15:33:10.084] @gammaloop_api::se... INFO : Running command set model mass_scalar_1=1.0
  1364. 132.00 s > [2026-08-28 15:33:10.085] @gammaloop_api::se... INFO : Running command set process -p triangle -i scalar_tri string '
  1365. 132.00 s > [kinematics.externals]
  1366. 132.00 s > type = "constant"
  1367. 132.00 s >
  1368. 132.00 s > [kinematics.externals.data]
  1369. 132.00 s > [...]
  1370. 132.00 s > [2026-08-28 15:33:10.086] @gammaloop_api::se... INFO : Running command set process -p box -i scalar_box string '
  1371. 132.00 s > [kinematics.externals]
  1372. 132.00 s > type = "constant"
  1373. 132.00 s >
  1374. 132.00 s > [kinematics.externals.data]
  1375. 132.00 s > [...]
  1376. 132.00 s > [2026-08-28 15:33:10.087] @gammaloop_api::se... INFO : Running command approach -x 1.0000000000000001e-1,2.0000000000000001e-1,2.9999999999999999e-1,4.0000000000000002e-1 --approach-axis 1.0000000000000000e-3,0.0000000000000000e0,0.0000000000000000e0,0.0000000000000000e0 --n-points 1 --n-cores 1 --output-results /build/source/tests/artifacts/scalar_box_invalid_momentum_approach/approach_momentum.json --momentum-space --graph-id 0
  1377. 132.00 s > The application panicked (crashed).
  1378. 132.00 s > Message: There are 2 processes available. Please specify a process.
  1379. 132.00 s > Location: tests/tests/test_runs/approach.rs:332
  1380. 132.00 s >
  1381. 132.00 s > ━━━━━━━━━━━━━━━━━━━━━━━━━━━━━━━━━━ BACKTRACE ━━━━━━━━━━━━━━━━━━━━━━━━━━━━━━━━━━━
  1382. 132.00 s > 1: <color_eyre[51793ea62743adbd]::config::PanicHook>::panic_report<unknown>
  1383. 132.00 s > at <unknown source file>:<unknown line>
  1384. 132.00 s > 2: <color_eyre[51793ea62743adbd]::config::PanicHook>::into_panic_hook::{closure#0}<unknown>
  1385. 132.00 s > at <unknown source file>:<unknown line>
  1386. 132.00 s > 3: std[bcb96dfbba0ab899]::panicking::panic_with_hook<unknown>
  1387. 132.00 s > at <unknown source file>:<unknown line>
  1388. 132.00 s > 4: std[bcb96dfbba0ab899]::panicking::panic_handler::{closure#0}<unknown>
  1389. 132.00 s > at <unknown source file>:<unknown line>
  1390. 132.00 s > 5: std[bcb96dfbba0ab899]::sys::backtrace::__rust_end_short_backtrace::<std[bcb96dfbba0ab899]::panicking::panic_handler::{closure#0}, !><unknown>
  1391. 132.00 s > at <unknown source file>:<unknown line>
  1392. 132.00 s > 6: __rustc[6c289b9f9c454d21]::rust_begin_unwind<unknown>
  1393. 132.00 s > at <unknown source file>:<unknown line>
  1394. 132.00 s > 7: core[940e698046960fd5]::panicking::panic_fmt<unknown>
  1395. 132.00 s > at <unknown source file>:<unknown line>
  1396. 132.00 s > 8: test_runs[3e7a390caee4e338]::approach::approach_momentum_space_reports_incomplete_triplet_cleanly<unknown>
  1397. 132.00 s > at <unknown source file>:<unknown line>
  1398. 132.00 s > 9: <test_runs[3e7a390caee4e338]::approach::approach_momentum_space_reports_incomplete_triplet_cleanly::{closure#0} as core[940e698046960fd5]::ops::function::FnOnce<()>>::call_once<unknown>
  1399. 132.00 s > at <unknown source file>:<unknown line>
  1400. 132.00 s > 10: test[75d6903177b1d7e9]::__rust_begin_short_backtrace::<core[940e698046960fd5]::result::Result<(), alloc[2ea6bcb46fca0c42]::string::String>, fn() -> core[940e698046960fd5]::result::Result<(), alloc[2ea6bcb46fca0c42]::string::String>><unknown>
  1401. 132.00 s > at <unknown source file>:<unknown line>
  1402. 132.00 s > 11: test[75d6903177b1d7e9]::run_test::{closure#0}<unknown>
  1403. 132.00 s > at <unknown source file>:<unknown line>
  1404. 132.00 s > 12: std[bcb96dfbba0ab899]::sys::backtrace::__rust_begin_short_backtrace::<test[75d6903177b1d7e9]::run_test::{closure#1}, ()><unknown>
  1405. 132.00 s > at <unknown source file>:<unknown line>
  1406. 132.00 s > 13: <std[bcb96dfbba0ab899]::thread::lifecycle::spawn_unchecked<test[75d6903177b1d7e9]::run_test::{closure#1}, ()>::{closure#1} as core[940e698046960fd5]::ops::function::FnOnce<()>>::call_once::{shim:vtable#0}<unknown>
  1407. 132.00 s > at <unknown source file>:<unknown line>
  1408. 132.00 s > 14: <std[bcb96dfbba0ab899]::sys::thread::unix::Thread>::new::thread_start<unknown>
  1409. 132.00 s > at <unknown source file>:<unknown line>
  1410. 132.00 s > 15: start_thread<unknown>
  1411. 132.00 s > at <unknown source file>:<unknown line>
  1412. 132.00 s > 16: __clone3<unknown>
  1413. 132.00 s > at <unknown source file>:<unknown line>
  1414. 132.00 s >
  1415. 132.00 s > Run with COLORBT_SHOW_HIDDEN=1 environment variable to disable frame filtering.
  1416. 132.00 s > ... omitted 1 more lines; see full nextest output above
  1417. 132.00 s >
  1418. 132.00 s > 2. gammaloop-integration-tests::test_runs::profile_bulk::double_dotted_bubble_amp_bulk_profile_passes
  1419. 132.00 s > failure: test failure with exit code 101
  1420. 132.00 s > Error:
  1421. 132.00 s > 0: IR profiling requested arbitrary precision but received a quad-precision result
  1422. 132.00 s >
  1423. 132.00 s > Location:
  1424. 132.00 s > crates/gammalooprs/src/integrands/process/ir.rs:2123
  1425. 132.00 s >
  1426. 132.00 s > ━━━━━━━━━━━━━━━━━━━━━━━━━━━━━━━━━━ BACKTRACE ━━━━━━━━━━━━━━━━━━━━━━━━━━━━━━━━━━━
  1427. 132.00 s > 1: <color_eyre[51793ea62743adbd]::config::EyreHook>::into_eyre_hook::{closure#0}<unknown>
  1428. 132.00 s > at <unknown source file>:<unknown line>
  1429. 132.00 s > 2: eyre[cb2fd339c0c40fca]::capture_handler<unknown>
  1430. 132.00 s > at <unknown source file>:<unknown line>
  1431. 132.00 s > 3: eyre[cb2fd339c0c40fca]::private::format_err<unknown>
  1432. 132.00 s > at <unknown source file>:<unknown line>
  1433. 132.00 s > 4: gammalooprs[d7a7c067ebd19583]::integrands::process::ir::evaluate_profile_momentum_point_arb::<gammalooprs[d7a7c067ebd19583]::integrands::process::amplitude::AmplitudeIntegrand><unknown>
  1434. 132.00 s > at <unknown source file>:<unknown line>
  1435. 132.00 s > 5: <gammalooprs[d7a7c067ebd19583]::integrands::process::amplitude::AmplitudeIntegrand>::test_single_ir_limit_impl<unknown>
  1436. 132.00 s > at <unknown source file>:<unknown line>
  1437. 132.00 s > 6: gammalooprs[d7a7c067ebd19583]::integrands::process::ir::run_ir_profile::<gammalooprs[d7a7c067ebd19583]::integrands::process::amplitude::AmplitudeIntegrand, <gammalooprs[d7a7c067ebd19583]::integrands::process::amplitude::AmplitudeIntegrand>::enumerate_ir_limits, <gammalooprs[d7a7c067ebd19583]::integrands::process::amplitude::AmplitudeIntegrand>::graph_cut_definitions, <gammalooprs[d7a7c067ebd19583]::integrands::process::amplitude::AmplitudeIntegrand>::test_single_ir_limit_impl><unknown>
  1438. 132.00 s > at <unknown source file>:<unknown line>
  1439. 132.00 s > 7: <gammalooprs[d7a7c067ebd19583]::integrands::process::amplitude::AmplitudeIntegrand>::test_ir<unknown>
  1440. 132.00 s > at <unknown source file>:<unknown line>
  1441. 132.00 s > 8: <gammaloop_api[92ae732909e47e14]::commands::profile::Profile>::run<unknown>
  1442. 132.00 s > at <unknown source file>:<unknown line>
  1443. 132.00 s > 9: test_runs[3e7a390caee4e338]::profile_bulk::double_dotted_bubble_amp_bulk_profile_passes<unknown>
  1444. 132.00 s > at <unknown source file>:<unknown line>
  1445. 132.00 s > 10: <test_runs[3e7a390caee4e338]::profile_bulk::double_dotted_bubble_amp_bulk_profile_passes::{closure#0} as core[940e698046960fd5]::ops::function::FnOnce<()>>::call_once<unknown>
  1446. 132.00 s > at <unknown source file>:<unknown line>
  1447. 132.00 s > 11: test[75d6903177b1d7e9]::__rust_begin_short_backtrace::<core[940e698046960fd5]::result::Result<(), alloc[2ea6bcb46fca0c42]::string::String>, fn() -> core[940e698046960fd5]::result::Result<(), alloc[2ea6bcb46fca0c42]::string::String>><unknown>
  1448. 132.00 s > at <unknown source file>:<unknown line>
  1449. 132.00 s > 12: test[75d6903177b1d7e9]::run_test::{closure#0}<unknown>
  1450. 132.00 s > at <unknown source file>:<unknown line>
  1451. 132.00 s > 13: std[bcb96dfbba0ab899]::sys::backtrace::__rust_begin_short_backtrace::<test[75d6903177b1d7e9]::run_test::{closure#1}, ()><unknown>
  1452. 132.00 s > at <unknown source file>:<unknown line>
  1453. 132.00 s > 14: <std[bcb96dfbba0ab899]::thread::lifecycle::spawn_unchecked<test[75d6903177b1d7e9]::run_test::{closure#1}, ()>::{closure#1} as core[940e698046960fd5]::ops::function::FnOnce<()>>::call_once::{shim:vtable#0}<unknown>
  1454. 132.00 s > at <unknown source file>:<unknown line>
  1455. 132.00 s > 15: <std[bcb96dfbba0ab899]::sys::thread::unix::Thread>::new::thread_start<unknown>
  1456. 132.00 s > at <unknown source file>:<unknown line>
  1457. 132.00 s > 16: start_thread<unknown>
  1458. 132.00 s > at <unknown source file>:<unknown line>
  1459. 132.00 s > 17: __clone3<unknown>
  1460. 132.00 s > at <unknown source file>:<unknown line>
  1461. 132.00 s >
  1462. 132.00 s > Run with COLORBT_SHOW_HIDDEN=1 environment variable to disable frame filtering.
  1463. 132.00 s > Run with RUST_BACKTRACE=full to include source snippets.
  1464. 132.00 s > Warning: SpanTrace capture is Unsupported.
  1465. 132.00 s > Ensure that you've setup a tracing-error ErrorLayer and the semver versions are compatible
  1466. 132.00 s > system-out
  1467. 132.00 s > running 1 test
  1468. 132.00 s > test profile_bulk::double_dotted_bubble_amp_bulk_profile_passes ... FAILED
  1469. 132.00 s >
  1470. 132.00 s > failures:
  1471. 132.00 s >
  1472. 132.00 s > failures:
  1473. 132.00 s > profile_bulk::double_dotted_bubble_amp_bulk_profile_passes
  1474. 132.00 s >
  1475. 132.00 s > test result: FAILED. 0 passed; 1 failed; 0 ignored; 0 measured; 82 filtered out; finished in 0.32s
  1476. 132.00 s > system-err
  1477. 132.00 s > [2026-08-28 15:33:11.576] @gammaloop_api::se... INFO : Running command import model ./assets/models/json/scalars/scalars_2p_3p.json
  1478. 132.00 s > [2026-08-28 15:33:11.576] @import::model INFO : Loading JSON model scalars_2p_3p-default from /build/source/assets/models/json/scalars/scalars_2p_3p
  1479. 132.00 s > [2026-08-28 15:33:11.577] @gammaloop_api::se... INFO : Running command import graphs ./tests/resources/graphs/double_dotted_bubble_amp.dot
  1480. 132.00 s > [2026-08-28 15:33:11.577] @commands::import INFO : Loading graphs from '/build/source/tests/resources/graphs/double_dotted_bubble_amp.dot'
  1481. 132.00 s > [2026-08-28 15:33:11.583] @gammaloop_api::se... INFO : Running command generate
  1482. 132.00 s > [2026-08-28 15:33:11.691] @commands::generate INFO :
  1483. 132.00 s > Integrand generation summary
  1484. 132.00 s > peak RAM 64.02 MiB | cores 1
  1485. 132.00 s > ╭───────────┬──────────────────────────┬─────────┬────────────┬───────────┬────────────────┬─────────────╮
  1486. 132.00 s > │ integrand │ graph │ # evals │ expr build │ spenso │ symbolica eval │ compile │
  1487. 132.00 s > ├───────────┼──────────────────────────┼─────────┼────────────┼───────────┼────────────────┼─────────────┤
  1488. 132.00 s > │ default │ double_dotted_bubble_amp │ 11 │ 49ms (57%) │ 9ms (11%) │ 28ms (32%) │ 0ms (0.00%) │
  1489. 132.00 s > ├───────────┼──────────────────────────┼─────────┼────────────┼───────────┼────────────────┼─────────────┤
  1490. 132.00 s > │ Total │ │ 11 │ 49ms (57%) │ 9ms (11%) │ 28ms (32%) │ 0ms (0.00%) │
  1491. 132.00 s > ╰───────────┴──────────────────────────┴─────────┴────────────┴───────────┴────────────────┴─────────────╯
  1492. 132.00 s > [2026-08-28 15:33:11.692] @process::amplitude INFO : Input is above threshold: 1 existing threshold E-surfaces across 1/1 graph groups
  1493. 132.00 s > [2026-08-28 15:33:11.692] @process::amplitude INFO : overlap structure of group 0: [1: [1(1,4)]]
  1494. 132.00 s > Error:
  1495. 132.00 s > 0: IR profiling requested arbitrary precision but received a quad-precision result
  1496. 132.00 s >
  1497. 132.00 s > Location:
  1498. 132.00 s > crates/gammalooprs/src/integrands/process/ir.rs:2123
  1499. 132.00 s >
  1500. 132.00 s > ━━━━━━━━━━━━━━━━━━━━━━━━━━━━━━━━━━ BACKTRACE ━━━━━━━━━━━━━━━━━━━━━━━━━━━━━━━━━━━
  1501. 132.00 s > 1: <color_eyre[51793ea62743adbd]::config::EyreHook>::into_eyre_hook::{closure#0}<unknown>
  1502. 132.00 s > at <unknown source file>:<unknown line>
  1503. 132.00 s > 2: eyre[cb2fd339c0c40fca]::capture_handler<unknown>
  1504. 132.00 s > at <unknown source file>:<unknown line>
  1505. 132.00 s > 3: eyre[cb2fd339c0c40fca]::private::format_err<unknown>
  1506. 132.00 s > at <unknown source file>:<unknown line>
  1507. 132.00 s > 4: gammalooprs[d7a7c067ebd19583]::integrands::process::ir::evaluate_profile_momentum_point_arb::<gammalooprs[d7a7c067ebd19583]::integrands::process::amplitude::AmplitudeIntegrand><unknown>
  1508. 132.00 s > at <unknown source file>:<unknown line>
  1509. 132.00 s > 5: <gammalooprs[d7a7c067ebd19583]::integrands::process::amplitude::AmplitudeIntegrand>::test_single_ir_limit_impl<unknown>
  1510. 132.00 s > at <unknown source file>:<unknown line>
  1511. 132.00 s > 6: gammalooprs[d7a7c067ebd19583]::integrands::process::ir::run_ir_profile::<gammalooprs[d7a7c067ebd19583]::integrands::process::amplitude::AmplitudeIntegrand, <gammalooprs[d7a7c067ebd19583]::integrands::process::amplitude::AmplitudeIntegrand>::enumerate_ir_limits, <gammalooprs[d7a7c067ebd19583]::integrands::process::amplitude::AmplitudeIntegrand>::graph_cut_definitions, <gammalooprs[d7a7c067ebd19583]::integrands::process::amplitude::AmplitudeIntegrand>::test_single_ir_limit_impl><unknown>
  1512. 132.00 s > at <unknown source file>:<unknown line>
  1513. 132.00 s > 7: <gammalooprs[d7a7c067ebd19583]::integrands::process::amplitude::AmplitudeIntegrand>::test_ir<unknown>
  1514. 132.00 s > at <unknown source file>:<unknown line>
  1515. 132.00 s > 8: <gammaloop_api[92ae732909e47e14]::commands::profile::Profile>::run<unknown>
  1516. 132.00 s > at <unknown source file>:<unknown line>
  1517. 132.00 s > 9: test_runs[3e7a390caee4e338]::profile_bulk::double_dotted_bubble_amp_bulk_profile_passes<unknown>
  1518. 132.00 s > at <unknown source file>:<unknown line>
  1519. 132.00 s > 10: <test_runs[3e7a390caee4e338]::profile_bulk::double_dotted_bubble_amp_bulk_profile_passes::{closure#0} as core[940e698046960fd5]::ops::function::FnOnce<()>>::call_once<unknown>
  1520. 132.00 s > at <unknown source file>:<unknown line>
  1521. 132.00 s > 11: test[75d6903177b1d7e9]::__rust_begin_short_backtrace::<core[940e698046960fd5]::result::Result<(), alloc[2ea6bcb46fca0c42]::string::String>, fn() -> core[940e698046960fd5]::result::Result<(), alloc[2ea6bcb46fca0c42]::string::String>><unknown>
  1522. 132.00 s > at <unknown source file>:<unknown line>
  1523. 132.00 s > 12: test[75d6903177b1d7e9]::run_test::{closure#0}<unknown>
  1524. 132.00 s > at <unknown source file>:<unknown line>
  1525. 132.00 s > 13: std[bcb96dfbba0ab899]::sys::backtrace::__rust_begin_short_backtrace::<test[75d6903177b1d7e9]::run_test::{closure#1}, ()><unknown>
  1526. 132.00 s > at <unknown source file>:<unknown line>
  1527. 132.00 s > 14: <std[bcb96dfbba0ab899]::thread::lifecycle::spawn_unchecked<test[75d6903177b1d7e9]::run_test::{closure#1}, ()>::{closure#1} as core[940e698046960fd5]::ops::function::FnOnce<()>>::call_once::{shim:vtable#0}<unknown>
  1528. 132.00 s > at <unknown source file>:<unknown line>
  1529. 132.00 s > 15: <std[bcb96dfbba0ab899]::sys::thread::unix::Thread>::new::thread_start<unknown>
  1530. 132.00 s > at <unknown source file>:<unknown line>
  1531. 132.00 s > 16: start_thread<unknown>
  1532. 132.00 s > at <unknown source file>:<unknown line>
  1533. 132.00 s > 17: __clone3<unknown>
  1534. 132.00 s > at <unknown source file>:<unknown line>
  1535. 132.00 s >
  1536. 132.00 s > Run with COLORBT_SHOW_HIDDEN=1 environment variable to disable frame filtering.
  1537. 132.00 s > Run with RUST_BACKTRACE=full to include source snippets.
  1538. 132.00 s > Warning: SpanTrace capture is Unsupported.
  1539. 132.00 s > Ensure that you've setup a tracing-error ErrorLayer and the semver versions are compatible
  1540. 132.00 s >
  1541. 132.00 s > 3. gammaloop-integration-tests::test_runs::profile_bulk::dotted_bubble_amp_bulk_profile_passes
  1542. 132.00 s > failure: test failure with exit code 101
  1543. 132.00 s > Error:
  1544. 132.00 s > 0: IR profiling requested arbitrary precision but received a quad-precision result
  1545. 132.00 s >
  1546. 132.00 s > Location:
  1547. 132.00 s > crates/gammalooprs/src/integrands/process/ir.rs:2123
  1548. 132.00 s >
  1549. 132.00 s > ━━━━━━━━━━━━━━━━━━━━━━━━━━━━━━━━━━ BACKTRACE ━━━━━━━━━━━━━━━━━━━━━━━━━━━━━━━━━━━
  1550. 132.00 s > 1: <color_eyre[51793ea62743adbd]::config::EyreHook>::into_eyre_hook::{closure#0}<unknown>
  1551. 132.00 s > at <unknown source file>:<unknown line>
  1552. 132.00 s > 2: eyre[cb2fd339c0c40fca]::capture_handler<unknown>
  1553. 132.00 s > at <unknown source file>:<unknown line>
  1554. 132.00 s > 3: eyre[cb2fd339c0c40fca]::private::format_err<unknown>
  1555. 132.00 s > at <unknown source file>:<unknown line>
  1556. 132.00 s > 4: gammalooprs[d7a7c067ebd19583]::integrands::process::ir::evaluate_profile_momentum_point_arb::<gammalooprs[d7a7c067ebd19583]::integrands::process::amplitude::AmplitudeIntegrand><unknown>
  1557. 132.00 s > at <unknown source file>:<unknown line>
  1558. 132.00 s > 5: <gammalooprs[d7a7c067ebd19583]::integrands::process::amplitude::AmplitudeIntegrand>::test_single_ir_limit_impl<unknown>
  1559. 132.00 s > at <unknown source file>:<unknown line>
  1560. 132.00 s > 6: gammalooprs[d7a7c067ebd19583]::integrands::process::ir::run_ir_profile::<gammalooprs[d7a7c067ebd19583]::integrands::process::amplitude::AmplitudeIntegrand, <gammalooprs[d7a7c067ebd19583]::integrands::process::amplitude::AmplitudeIntegrand>::enumerate_ir_limits, <gammalooprs[d7a7c067ebd19583]::integrands::process::amplitude::AmplitudeIntegrand>::graph_cut_definitions, <gammalooprs[d7a7c067ebd19583]::integrands::process::amplitude::AmplitudeIntegrand>::test_single_ir_limit_impl><unknown>
  1561. 132.00 s > at <unknown source file>:<unknown line>
  1562. 132.00 s > 7: <gammalooprs[d7a7c067ebd19583]::integrands::process::amplitude::AmplitudeIntegrand>::test_ir<unknown>
  1563. 132.00 s > at <unknown source file>:<unknown line>
  1564. 132.00 s > 8: <gammaloop_api[92ae732909e47e14]::commands::profile::Profile>::run<unknown>
  1565. 132.00 s > at <unknown source file>:<unknown line>
  1566. 132.00 s > 9: test_runs[3e7a390caee4e338]::profile_bulk::dotted_bubble_amp_bulk_profile_passes<unknown>
  1567. 132.00 s > at <unknown source file>:<unknown line>
  1568. 132.00 s > 10: <test_runs[3e7a390caee4e338]::profile_bulk::dotted_bubble_amp_bulk_profile_passes::{closure#0} as core[940e698046960fd5]::ops::function::FnOnce<()>>::call_once<unknown>
  1569. 132.00 s > at <unknown source file>:<unknown line>
  1570. 132.00 s > 11: test[75d6903177b1d7e9]::__rust_begin_short_backtrace::<core[940e698046960fd5]::result::Result<(), alloc[2ea6bcb46fca0c42]::string::String>, fn() -> core[940e698046960fd5]::result::Result<(), alloc[2ea6bcb46fca0c42]::string::String>><unknown>
  1571. 132.00 s > at <unknown source file>:<unknown line>
  1572. 132.00 s > 12: test[75d6903177b1d7e9]::run_test::{closure#0}<unknown>
  1573. 132.00 s > at <unknown source file>:<unknown line>
  1574. 132.00 s > 13: std[bcb96dfbba0ab899]::sys::backtrace::__rust_begin_short_backtrace::<test[75d6903177b1d7e9]::run_test::{closure#1}, ()><unknown>
  1575. 132.00 s > at <unknown source file>:<unknown line>
  1576. 132.00 s > 14: <std[bcb96dfbba0ab899]::thread::lifecycle::spawn_unchecked<test[75d6903177b1d7e9]::run_test::{closure#1}, ()>::{closure#1} as core[940e698046960fd5]::ops::function::FnOnce<()>>::call_once::{shim:vtable#0}<unknown>
  1577. 132.00 s > at <unknown source file>:<unknown line>
  1578. 132.00 s > 15: <std[bcb96dfbba0ab899]::sys::thread::unix::Thread>::new::thread_start<unknown>
  1579. 132.00 s > at <unknown source file>:<unknown line>
  1580. 132.00 s > 16: start_thread<unknown>
  1581. 132.00 s > at <unknown source file>:<unknown line>
  1582. 132.00 s > 17: __clone3<unknown>
  1583. 132.00 s > at <unknown source file>:<unknown line>
  1584. 132.00 s >
  1585. 132.00 s > Run with COLORBT_SHOW_HIDDEN=1 environment variable to disable frame filtering.
  1586. 132.00 s > Run with RUST_BACKTRACE=full to include source snippets.
  1587. 132.00 s > Warning: SpanTrace capture is Unsupported.
  1588. 132.00 s > Ensure that you've setup a tracing-error ErrorLayer and the semver versions are compatible
  1589. 132.00 s > system-out
  1590. 132.00 s > running 1 test
  1591. 132.00 s > test profile_bulk::dotted_bubble_amp_bulk_profile_passes ... FAILED
  1592. 132.00 s >
  1593. 132.00 s > failures:
  1594. 132.00 s >
  1595. 132.00 s > failures:
  1596. 132.00 s > profile_bulk::dotted_bubble_amp_bulk_profile_passes
  1597. 132.00 s >
  1598. 132.00 s > test result: FAILED. 0 passed; 1 failed; 0 ignored; 0 measured; 82 filtered out; finished in 0.41s
  1599. 132.00 s > system-err
  1600. 132.00 s > [2026-08-28 15:33:11.660] @gammaloop_api::se... INFO : Running command import model ./assets/models/json/scalars/scalars_2p_3p.json
  1601. 132.00 s > [2026-08-28 15:33:11.660] @import::model INFO : Loading JSON model scalars_2p_3p-default from /build/source/assets/models/json/scalars/scalars_2p_3p
  1602. 132.00 s > [2026-08-28 15:33:11.661] @gammaloop_api::se... INFO : Running command import graphs ./tests/resources/graphs/dotted_bubble_amp.dot
  1603. 132.00 s > [2026-08-28 15:33:11.661] @commands::import INFO : Loading graphs from '/build/source/tests/resources/graphs/dotted_bubble_amp.dot'
  1604. 132.00 s > [2026-08-28 15:33:11.665] @gammaloop_api::se... INFO : Running command generate
  1605. 132.00 s > [2026-08-28 15:33:11.772] @commands::generate INFO :
  1606. 132.00 s > Integrand generation summary
  1607. 132.00 s > peak RAM 65.50 MiB | cores 1
  1608. 132.00 s > ╭───────────┬───────────────────┬─────────┬────────────┬────────────┬────────────────┬─────────────╮
  1609. 132.00 s > │ integrand │ graph │ # evals │ expr build │ spenso │ symbolica eval │ compile │
  1610. 132.00 s > ├───────────┼───────────────────┼─────────┼────────────┼────────────┼────────────────┼─────────────┤
  1611. 132.00 s > │ default │ dotted_bubble_amp │ 8 │ 7ms (58%) │ 1ms (8.5%) │ 4ms (33%) │ 0ms (0.00%) │
  1612. 132.00 s > ├───────────┼───────────────────┼─────────┼────────────┼────────────┼────────────────┼─────────────┤
  1613. 132.00 s > │ Total │ │ 8 │ 7ms (58%) │ 1ms (8.5%) │ 4ms (33%) │ 0ms (0.00%) │
  1614. 132.00 s > ╰───────────┴───────────────────┴─────────┴────────────┴────────────┴────────────────┴─────────────╯
  1615. 132.00 s > [2026-08-28 15:33:11.773] @process::amplitude INFO : Input is above threshold: 1 existing threshold E-surfaces across 1/1 graph groups
  1616. 132.00 s > [2026-08-28 15:33:11.773] @process::amplitude INFO : overlap structure of group 0: [1: [1(1,3)]]
  1617. 132.00 s > Error:
  1618. 132.00 s > 0: IR profiling requested arbitrary precision but received a quad-precision result
  1619. 132.00 s >
  1620. 132.00 s > Location:
  1621. 132.00 s > crates/gammalooprs/src/integrands/process/ir.rs:2123
  1622. 132.00 s >
  1623. 132.00 s > ━━━━━━━━━━━━━━━━━━━━━━━━━━━━━━━━━━ BACKTRACE ━━━━━━━━━━━━━━━━━━━━━━━━━━━━━━━━━━━
  1624. 132.00 s > 1: <color_eyre[51793ea62743adbd]::config::EyreHook>::into_eyre_hook::{closure#0}<unknown>
  1625. 132.00 s > at <unknown source file>:<unknown line>
  1626. 132.00 s > 2: eyre[cb2fd339c0c40fca]::capture_handler<unknown>
  1627. 132.00 s > at <unknown source file>:<unknown line>
  1628. 132.00 s > 3: eyre[cb2fd339c0c40fca]::private::format_err<unknown>
  1629. 132.00 s > at <unknown source file>:<unknown line>
  1630. 132.00 s > 4: gammalooprs[d7a7c067ebd19583]::integrands::process::ir::evaluate_profile_momentum_point_arb::<gammalooprs[d7a7c067ebd19583]::integrands::process::amplitude::AmplitudeIntegrand><unknown>
  1631. 132.00 s > at <unknown source file>:<unknown line>
  1632. 132.00 s > 5: <gammalooprs[d7a7c067ebd19583]::integrands::process::amplitude::AmplitudeIntegrand>::test_single_ir_limit_impl<unknown>
  1633. 132.00 s > at <unknown source file>:<unknown line>
  1634. 132.00 s > 6: gammalooprs[d7a7c067ebd19583]::integrands::process::ir::run_ir_profile::<gammalooprs[d7a7c067ebd19583]::integrands::process::amplitude::AmplitudeIntegrand, <gammalooprs[d7a7c067ebd19583]::integrands::process::amplitude::AmplitudeIntegrand>::enumerate_ir_limits, <gammalooprs[d7a7c067ebd19583]::integrands::process::amplitude::AmplitudeIntegrand>::graph_cut_definitions, <gammalooprs[d7a7c067ebd19583]::integrands::process::amplitude::AmplitudeIntegrand>::test_single_ir_limit_impl><unknown>
  1635. 132.00 s > at <unknown source file>:<unknown line>
  1636. 132.00 s > 7: <gammalooprs[d7a7c067ebd19583]::integrands::process::amplitude::AmplitudeIntegrand>::test_ir<unknown>
  1637. 132.00 s > at <unknown source file>:<unknown line>
  1638. 132.00 s > 8: <gammaloop_api[92ae732909e47e14]::commands::profile::Profile>::run<unknown>
  1639. 132.00 s > at <unknown source file>:<unknown line>
  1640. 132.00 s > 9: test_runs[3e7a390caee4e338]::profile_bulk::dotted_bubble_amp_bulk_profile_passes<unknown>
  1641. 132.00 s > at <unknown source file>:<unknown line>
  1642. 132.00 s > 10: <test_runs[3e7a390caee4e338]::profile_bulk::dotted_bubble_amp_bulk_profile_passes::{closure#0} as core[940e698046960fd5]::ops::function::FnOnce<()>>::call_once<unknown>
  1643. 132.00 s > at <unknown source file>:<unknown line>
  1644. 132.00 s > 11: test[75d6903177b1d7e9]::__rust_begin_short_backtrace::<core[940e698046960fd5]::result::Result<(), alloc[2ea6bcb46fca0c42]::string::String>, fn() -> core[940e698046960fd5]::result::Result<(), alloc[2ea6bcb46fca0c42]::string::String>><unknown>
  1645. 132.00 s > at <unknown source file>:<unknown line>
  1646. 132.00 s > 12: test[75d6903177b1d7e9]::run_test::{closure#0}<unknown>
  1647. 132.00 s > at <unknown source file>:<unknown line>
  1648. 132.00 s > 13: std[bcb96dfbba0ab899]::sys::backtrace::__rust_begin_short_backtrace::<test[75d6903177b1d7e9]::run_test::{closure#1}, ()><unknown>
  1649. 132.00 s > at <unknown source file>:<unknown line>
  1650. 132.00 s > 14: <std[bcb96dfbba0ab899]::thread::lifecycle::spawn_unchecked<test[75d6903177b1d7e9]::run_test::{closure#1}, ()>::{closure#1} as core[940e698046960fd5]::ops::function::FnOnce<()>>::call_once::{shim:vtable#0}<unknown>
  1651. 132.00 s > at <unknown source file>:<unknown line>
  1652. 132.00 s > 15: <std[bcb96dfbba0ab899]::sys::thread::unix::Thread>::new::thread_start<unknown>
  1653. 132.00 s > at <unknown source file>:<unknown line>
  1654. 132.00 s > 16: start_thread<unknown>
  1655. 132.00 s > at <unknown source file>:<unknown line>
  1656. 132.00 s > 17: __clone3<unknown>
  1657. 132.00 s > at <unknown source file>:<unknown line>
  1658. 132.00 s >
  1659. 132.00 s > Run with COLORBT_SHOW_HIDDEN=1 environment variable to disable frame filtering.
  1660. 132.00 s > Run with RUST_BACKTRACE=full to include source snippets.
  1661. 132.00 s > Warning: SpanTrace capture is Unsupported.
  1662. 132.00 s > Ensure that you've setup a tracing-error ErrorLayer and the semver versions are compatible
  1663. 132.00 s >
  1664. 132.00 s > 4. gammaloop-integration-tests::test_runs::profile_bulk::massless_triangle_bulk_profile_passes
  1665. 132.00 s > failure: test failure with exit code 101
  1666. 132.00 s > Error:
  1667. 132.00 s > 0: IR profiling requested arbitrary precision but received a quad-precision result
  1668. 132.00 s >
  1669. 132.00 s > Location:
  1670. 132.00 s > crates/gammalooprs/src/integrands/process/ir.rs:2123
  1671. 132.00 s >
  1672. 132.00 s > ━━━━━━━━━━━━━━━━━━━━━━━━━━━━━━━━━━ BACKTRACE ━━━━━━━━━━━━━━━━━━━━━━━━━━━━━━━━━━━
  1673. 132.00 s > 1: <color_eyre[51793ea62743adbd]::config::EyreHook>::into_eyre_hook::{closure#0}<unknown>
  1674. 132.00 s > at <unknown source file>:<unknown line>
  1675. 132.00 s > 2: eyre[cb2fd339c0c40fca]::capture_handler<unknown>
  1676. 132.00 s > at <unknown source file>:<unknown line>
  1677. 132.00 s > 3: eyre[cb2fd339c0c40fca]::private::format_err<unknown>
  1678. 132.00 s > at <unknown source file>:<unknown line>
  1679. 132.00 s > 4: gammalooprs[d7a7c067ebd19583]::integrands::process::ir::evaluate_profile_momentum_point_arb::<gammalooprs[d7a7c067ebd19583]::integrands::process::amplitude::AmplitudeIntegrand><unknown>
  1680. 132.00 s > at <unknown source file>:<unknown line>
  1681. 132.00 s > 5: <gammalooprs[d7a7c067ebd19583]::integrands::process::amplitude::AmplitudeIntegrand>::test_single_ir_limit_impl<unknown>
  1682. 132.00 s > at <unknown source file>:<unknown line>
  1683. 132.00 s > 6: gammalooprs[d7a7c067ebd19583]::integrands::process::ir::run_ir_profile::<gammalooprs[d7a7c067ebd19583]::integrands::process::amplitude::AmplitudeIntegrand, <gammalooprs[d7a7c067ebd19583]::integrands::process::amplitude::AmplitudeIntegrand>::enumerate_ir_limits, <gammalooprs[d7a7c067ebd19583]::integrands::process::amplitude::AmplitudeIntegrand>::graph_cut_definitions, <gammalooprs[d7a7c067ebd19583]::integrands::process::amplitude::AmplitudeIntegrand>::test_single_ir_limit_impl><unknown>
  1684. 132.00 s > at <unknown source file>:<unknown line>
  1685. 132.00 s > 7: <gammalooprs[d7a7c067ebd19583]::integrands::process::amplitude::AmplitudeIntegrand>::test_ir<unknown>
  1686. 132.00 s > at <unknown source file>:<unknown line>
  1687. 132.00 s > 8: <gammaloop_api[92ae732909e47e14]::commands::profile::Profile>::run<unknown>
  1688. 132.00 s > at <unknown source file>:<unknown line>
  1689. 132.00 s > 9: test_runs[3e7a390caee4e338]::profile_bulk::massless_triangle_bulk_profile_passes<unknown>
  1690. 132.00 s > at <unknown source file>:<unknown line>
  1691. 132.00 s > 10: <test_runs[3e7a390caee4e338]::profile_bulk::massless_triangle_bulk_profile_passes::{closure#0} as core[940e698046960fd5]::ops::function::FnOnce<()>>::call_once<unknown>
  1692. 132.00 s > at <unknown source file>:<unknown line>
  1693. 132.00 s > 11: test[75d6903177b1d7e9]::__rust_begin_short_backtrace::<core[940e698046960fd5]::result::Result<(), alloc[2ea6bcb46fca0c42]::string::String>, fn() -> core[940e698046960fd5]::result::Result<(), alloc[2ea6bcb46fca0c42]::string::String>><unknown>
  1694. 132.00 s > at <unknown source file>:<unknown line>
  1695. 132.00 s > 12: test[75d6903177b1d7e9]::run_test::{closure#0}<unknown>
  1696. 132.00 s > at <unknown source file>:<unknown line>
  1697. 132.00 s > 13: std[bcb96dfbba0ab899]::sys::backtrace::__rust_begin_short_backtrace::<test[75d6903177b1d7e9]::run_test::{closure#1}, ()><unknown>
  1698. 132.00 s > at <unknown source file>:<unknown line>
  1699. 132.00 s > 14: <std[bcb96dfbba0ab899]::thread::lifecycle::spawn_unchecked<test[75d6903177b1d7e9]::run_test::{closure#1}, ()>::{closure#1} as core[940e698046960fd5]::ops::function::FnOnce<()>>::call_once::{shim:vtable#0}<unknown>
  1700. 132.00 s > at <unknown source file>:<unknown line>
  1701. 132.00 s > 15: <std[bcb96dfbba0ab899]::sys::thread::unix::Thread>::new::thread_start<unknown>
  1702. 132.00 s > at <unknown source file>:<unknown line>
  1703. 132.00 s > 16: start_thread<unknown>
  1704. 132.00 s > at <unknown source file>:<unknown line>
  1705. 132.00 s > 17: __clone3<unknown>
  1706. 132.00 s > at <unknown source file>:<unknown line>
  1707. 132.00 s >
  1708. 132.00 s > Run with COLORBT_SHOW_HIDDEN=1 environment variable to disable frame filtering.
  1709. 132.00 s > Run with RUST_BACKTRACE=full to include source snippets.
  1710. 132.00 s > Warning: SpanTrace capture is Unsupported.
  1711. 132.00 s > Ensure that you've setup a tracing-error ErrorLayer and the semver versions are compatible
  1712. 132.00 s > system-out
  1713. 132.00 s > running 1 test
  1714. 132.00 s > test profile_bulk::massless_triangle_bulk_profile_passes ... FAILED
  1715. 132.00 s >
  1716. 132.00 s > failures:
  1717. 132.00 s >
  1718. 132.00 s > failures:
  1719. 132.00 s > profile_bulk::massless_triangle_bulk_profile_passes
  1720. 132.00 s >
  1721. 132.00 s > test result: FAILED. 0 passed; 1 failed; 0 ignored; 0 measured; 82 filtered out; finished in 0.25s
  1722. 132.00 s > system-err
  1723. 132.00 s > [2026-08-28 15:33:11.689] @gammaloop_api::se... INFO : Running command import model scalars
  1724. 132.00 s > [2026-08-28 15:33:11.689] @import::model INFO : Loading built-in JSON model scalars-default
  1725. 132.00 s > [2026-08-28 15:33:11.693] @gammalooprs::model INFO : The following 2 external parameters were forced to zero by the restriction card:
  1726. 132.00 s > width_scalar_1, width_scalar_2
  1727. 132.00 s > [2026-08-28 15:33:11.694] @gammaloop_api::se... INFO : Running command import graphs ./tests/resources/graphs/massless_triangle.dot
  1728. 132.00 s > [2026-08-28 15:33:11.694] @commands::import INFO : Loading graphs from '/build/source/tests/resources/graphs/massless_triangle.dot'
  1729. 132.00 s > [2026-08-28 15:33:11.697] @gammaloop_api::se... INFO : Running command generate
  1730. 132.00 s > [2026-08-28 15:33:11.803] @commands::generate INFO :
  1731. 132.00 s > Integrand generation summary
  1732. 132.00 s > peak RAM 63.73 MiB | cores 1
  1733. 132.00 s > ╭───────────┬─────────────────────┬─────────┬────────────┬───────────┬────────────────┬─────────────╮
  1734. 132.00 s > │ integrand │ graph │ # evals │ expr build │ spenso │ symbolica eval │ compile │
  1735. 132.00 s > ├───────────┼─────────────────────┼─────────┼────────────┼───────────┼────────────────┼─────────────┤
  1736. 132.00 s > │ default │ massless_triangle_0 │ 9 │ 19ms (56%) │ 4ms (14%) │ 10ms (29%) │ 0ms (0.00%) │
  1737. 132.00 s > ├───────────┼─────────────────────┼─────────┼────────────┼───────────┼────────────────┼─────────────┤
  1738. 132.00 s > │ Total │ │ 9 │ 19ms (56%) │ 4ms (14%) │ 10ms (29%) │ 0ms (0.00%) │
  1739. 132.00 s > ╰───────────┴─────────────────────┴─────────┴────────────┴───────────┴────────────────┴─────────────╯
  1740. 132.00 s > [2026-08-28 15:33:11.805] @process::amplitude INFO : Input is above threshold: 2 existing threshold E-surfaces across 1/1 graph groups
  1741. 132.00 s > [2026-08-28 15:33:11.805] @process::amplitude INFO : overlap structure of group 0: [2: [0(1,5), 1(1,3)]]
  1742. 132.00 s > Error:
  1743. 132.00 s > 0: IR profiling requested arbitrary precision but received a quad-precision result
  1744. 132.00 s >
  1745. 132.00 s > Location:
  1746. 132.00 s > crates/gammalooprs/src/integrands/process/ir.rs:2123
  1747. 132.00 s >
  1748. 132.00 s > ━━━━━━━━━━━━━━━━━━━━━━━━━━━━━━━━━━ BACKTRACE ━━━━━━━━━━━━━━━━━━━━━━━━━━━━━━━━━━━
  1749. 132.00 s > 1: <color_eyre[51793ea62743adbd]::config::EyreHook>::into_eyre_hook::{closure#0}<unknown>
  1750. 132.00 s > at <unknown source file>:<unknown line>
  1751. 132.00 s > 2: eyre[cb2fd339c0c40fca]::capture_handler<unknown>
  1752. 132.00 s > at <unknown source file>:<unknown line>
  1753. 132.00 s > 3: eyre[cb2fd339c0c40fca]::private::format_err<unknown>
  1754. 132.00 s > at <unknown source file>:<unknown line>
  1755. 132.00 s > 4: gammalooprs[d7a7c067ebd19583]::integrands::process::ir::evaluate_profile_momentum_point_arb::<gammalooprs[d7a7c067ebd19583]::integrands::process::amplitude::AmplitudeIntegrand><unknown>
  1756. 132.00 s > at <unknown source file>:<unknown line>
  1757. 132.00 s > 5: <gammalooprs[d7a7c067ebd19583]::integrands::process::amplitude::AmplitudeIntegrand>::test_single_ir_limit_impl<unknown>
  1758. 132.00 s > at <unknown source file>:<unknown line>
  1759. 132.00 s > 6: gammalooprs[d7a7c067ebd19583]::integrands::process::ir::run_ir_profile::<gammalooprs[d7a7c067ebd19583]::integrands::process::amplitude::AmplitudeIntegrand, <gammalooprs[d7a7c067ebd19583]::integrands::process::amplitude::AmplitudeIntegrand>::enumerate_ir_limits, <gammalooprs[d7a7c067ebd19583]::integrands::process::amplitude::AmplitudeIntegrand>::graph_cut_definitions, <gammalooprs[d7a7c067ebd19583]::integrands::process::amplitude::AmplitudeIntegrand>::test_single_ir_limit_impl><unknown>
  1760. 132.00 s > at <unknown source file>:<unknown line>
  1761. 132.00 s > 7: <gammalooprs[d7a7c067ebd19583]::integrands::process::amplitude::AmplitudeIntegrand>::test_ir<unknown>
  1762. 132.00 s > at <unknown source file>:<unknown line>
  1763. 132.00 s > 8: <gammaloop_api[92ae732909e47e14]::commands::profile::Profile>::run<unknown>
  1764. 132.00 s > at <unknown source file>:<unknown line>
  1765. 132.00 s > 9: test_runs[3e7a390caee4e338]::profile_bulk::massless_triangle_bulk_profile_passes<unknown>
  1766. 132.00 s > at <unknown source file>:<unknown line>
  1767. 132.00 s > 10: <test_runs[3e7a390caee4e338]::profile_bulk::massless_triangle_bulk_profile_passes::{closure#0} as core[940e698046960fd5]::ops::function::FnOnce<()>>::call_once<unknown>
  1768. 132.00 s > at <unknown source file>:<unknown line>
  1769. 132.00 s > 11: test[75d6903177b1d7e9]::__rust_begin_short_backtrace::<core[940e698046960fd5]::result::Result<(), alloc[2ea6bcb46fca0c42]::string::String>, fn() -> core[940e698046960fd5]::result::Result<(), alloc[2ea6bcb46fca0c42]::string::String>><unknown>
  1770. 132.00 s > at <unknown source file>:<unknown line>
  1771. 132.00 s > 12: test[75d6903177b1d7e9]::run_test::{closure#0}<unknown>
  1772. 132.00 s > at <unknown source file>:<unknown line>
  1773. 132.00 s > 13: std[bcb96dfbba0ab899]::sys::backtrace::__rust_begin_short_backtrace::<test[75d6903177b1d7e9]::run_test::{closure#1}, ()><unknown>
  1774. 132.00 s > at <unknown source file>:<unknown line>
  1775. 132.00 s > 14: <std[bcb96dfbba0ab899]::thread::lifecycle::spawn_unchecked<test[75d6903177b1d7e9]::run_test::{closure#1}, ()>::{closure#1} as core[940e698046960fd5]::ops::function::FnOnce<()>>::call_once::{shim:vtable#0}<unknown>
  1776. 132.00 s > at <unknown source file>:<unknown line>
  1777. 132.00 s > 15: <std[bcb96dfbba0ab899]::sys::thread::unix::Thread>::new::thread_start<unknown>
  1778. 132.00 s > at <unknown source file>:<unknown line>
  1779. 132.00 s > 16: start_thread<unknown>
  1780. 132.00 s > at <unknown source file>:<unknown line>
  1781. 132.00 s > 17: __clone3<unknown>
  1782. 132.00 s > at <unknown source file>:<unknown line>
  1783. 132.00 s >
  1784. 132.00 s > Run with COLORBT_SHOW_HIDDEN=1 environment variable to disable frame filtering.
  1785. 132.00 s > Run with RUST_BACKTRACE=full to include source snippets.
  1786. 132.00 s > Warning: SpanTrace capture is Unsupported.
  1787. 132.00 s > Ensure that you've setup a tracing-error ErrorLayer and the semver versions are compatible
  1788. 132.00 s >
  1789. 132.00 s > 5. gammaloop-integration-tests::test_runs::profile_bulk::box_4e_bulk_profile_passes
  1790. 132.00 s > failure: test failure with exit code 101
  1791. 132.00 s > Error:
  1792. 132.00 s > 0: IR profiling requested arbitrary precision but received a quad-precision result
  1793. 132.00 s >
  1794. 132.00 s > Location:
  1795. 132.00 s > crates/gammalooprs/src/integrands/process/ir.rs:2123
  1796. 132.00 s >
  1797. 132.00 s > ━━━━━━━━━━━━━━━━━━━━━━━━━━━━━━━━━━ BACKTRACE ━━━━━━━━━━━━━━━━━━━━━━━━━━━━━━━━━━━
  1798. 132.00 s > 1: <color_eyre[51793ea62743adbd]::config::EyreHook>::into_eyre_hook::{closure#0}<unknown>
  1799. 132.00 s > at <unknown source file>:<unknown line>
  1800. 132.00 s > 2: eyre[cb2fd339c0c40fca]::capture_handler<unknown>
  1801. 132.00 s > at <unknown source file>:<unknown line>
  1802. 132.00 s > 3: eyre[cb2fd339c0c40fca]::private::format_err<unknown>
  1803. 132.00 s > at <unknown source file>:<unknown line>
  1804. 132.00 s > 4: gammalooprs[d7a7c067ebd19583]::integrands::process::ir::evaluate_profile_momentum_point_arb::<gammalooprs[d7a7c067ebd19583]::integrands::process::amplitude::AmplitudeIntegrand><unknown>
  1805. 132.00 s > at <unknown source file>:<unknown line>
  1806. 132.00 s > 5: <gammalooprs[d7a7c067ebd19583]::integrands::process::amplitude::AmplitudeIntegrand>::test_single_ir_limit_impl<unknown>
  1807. 132.00 s > at <unknown source file>:<unknown line>
  1808. 132.00 s > 6: gammalooprs[d7a7c067ebd19583]::integrands::process::ir::run_ir_profile::<gammalooprs[d7a7c067ebd19583]::integrands::process::amplitude::AmplitudeIntegrand, <gammalooprs[d7a7c067ebd19583]::integrands::process::amplitude::AmplitudeIntegrand>::enumerate_ir_limits, <gammalooprs[d7a7c067ebd19583]::integrands::process::amplitude::AmplitudeIntegrand>::graph_cut_definitions, <gammalooprs[d7a7c067ebd19583]::integrands::process::amplitude::AmplitudeIntegrand>::test_single_ir_limit_impl><unknown>
  1809. 132.00 s > at <unknown source file>:<unknown line>
  1810. 132.00 s > 7: <gammalooprs[d7a7c067ebd19583]::integrands::process::amplitude::AmplitudeIntegrand>::test_ir<unknown>
  1811. 132.00 s > at <unknown source file>:<unknown line>
  1812. 132.00 s > 8: <gammaloop_api[92ae732909e47e14]::commands::profile::Profile>::run<unknown>
  1813. 132.00 s > at <unknown source file>:<unknown line>
  1814. 132.00 s > 9: test_runs[3e7a390caee4e338]::profile_bulk::box_4e_bulk_profile_passes<unknown>
  1815. 132.00 s > at <unknown source file>:<unknown line>
  1816. 132.00 s > 10: <test_runs[3e7a390caee4e338]::profile_bulk::box_4e_bulk_profile_passes::{closure#0} as core[940e698046960fd5]::ops::function::FnOnce<()>>::call_once<unknown>
  1817. 132.00 s > at <unknown source file>:<unknown line>
  1818. 132.00 s > 11: test[75d6903177b1d7e9]::__rust_begin_short_backtrace::<core[940e698046960fd5]::result::Result<(), alloc[2ea6bcb46fca0c42]::string::String>, fn() -> core[940e698046960fd5]::result::Result<(), alloc[2ea6bcb46fca0c42]::string::String>><unknown>
  1819. 132.00 s > at <unknown source file>:<unknown line>
  1820. 132.00 s > 12: test[75d6903177b1d7e9]::run_test::{closure#0}<unknown>
  1821. 132.00 s > at <unknown source file>:<unknown line>
  1822. 132.00 s > 13: std[bcb96dfbba0ab899]::sys::backtrace::__rust_begin_short_backtrace::<test[75d6903177b1d7e9]::run_test::{closure#1}, ()><unknown>
  1823. 132.00 s > at <unknown source file>:<unknown line>
  1824. 132.00 s > 14: <std[bcb96dfbba0ab899]::thread::lifecycle::spawn_unchecked<test[75d6903177b1d7e9]::run_test::{closure#1}, ()>::{closure#1} as core[940e698046960fd5]::ops::function::FnOnce<()>>::call_once::{shim:vtable#0}<unknown>
  1825. 132.00 s > at <unknown source file>:<unknown line>
  1826. 132.00 s > 15: <std[bcb96dfbba0ab899]::sys::thread::unix::Thread>::new::thread_start<unknown>
  1827. 132.00 s > at <unknown source file>:<unknown line>
  1828. 132.00 s > 16: start_thread<unknown>
  1829. 132.00 s > at <unknown source file>:<unknown line>
  1830. 132.00 s > 17: __clone3<unknown>
  1831. 132.00 s > at <unknown source file>:<unknown line>
  1832. 132.00 s >
  1833. 132.00 s > Run with COLORBT_SHOW_HIDDEN=1 environment variable to disable frame filtering.
  1834. 132.00 s > Run with RUST_BACKTRACE=full to include source snippets.
  1835. 132.00 s > Warning: SpanTrace capture is Unsupported.
  1836. 132.00 s > Ensure that you've setup a tracing-error ErrorLayer and the semver versions are compatible
  1837. 132.00 s > system-out
  1838. 132.00 s > running 1 test
  1839. 132.00 s > test profile_bulk::box_4e_bulk_profile_passes ... FAILED
  1840. 132.00 s >
  1841. 132.00 s > failures:
  1842. 132.00 s >
  1843. 132.00 s > failures:
  1844. 132.00 s > profile_bulk::box_4e_bulk_profile_passes
  1845. 132.00 s >
  1846. 132.00 s > test result: FAILED. 0 passed; 1 failed; 0 ignored; 0 measured; 82 filtered out; finished in 0.54s
  1847. 132.00 s > system-err
  1848. 132.00 s > [2026-08-28 15:33:11.423] @gammaloop_api::se... INFO : Running command import model ./assets/models/json/scalars/scalars.json
  1849. 132.00 s > [2026-08-28 15:33:11.423] @import::model INFO : Loading JSON model scalars-default from /build/source/assets/models/json/scalars/scalars
  1850. 132.00 s > [2026-08-28 15:33:11.427] @gammalooprs::model INFO : The following 2 external parameters were forced to zero by the restriction card:
  1851. 132.00 s > width_scalar_1, width_scalar_2
  1852. 132.00 s > [2026-08-28 15:33:11.427] @gammaloop_api::se... INFO : Running command import graphs ./tests/resources/graphs/massless_box.dot
  1853. 132.00 s > [2026-08-28 15:33:11.427] @commands::import INFO : Loading graphs from '/build/source/tests/resources/graphs/massless_box.dot'
  1854. 132.00 s > [2026-08-28 15:33:11.431] @gammaloop_api::se... INFO : Running command generate
  1855. 132.00 s > [2026-08-28 15:33:11.772] @commands::generate INFO :
  1856. 132.00 s > Integrand generation summary
  1857. 132.00 s > peak RAM 67.02 MiB | cores 1
  1858. 132.00 s > ╭───────────┬────────────────┬─────────┬─────────────┬─────────────┬────────────────┬─────────────╮
  1859. 132.00 s > │ integrand │ graph │ # evals │ expr build │ spenso │ symbolica eval │ compile │
  1860. 132.00 s > ├───────────┼────────────────┼─────────┼─────────────┼─────────────┼────────────────┼─────────────┤
  1861. 132.00 s > │ default │ massless_box_0 │ 14 │ 212ms (80%) │ 25ms (9.6%) │ 28ms (11%) │ 0ms (0.00%) │
  1862. 132.00 s > ├───────────┼────────────────┼─────────┼─────────────┼─────────────┼────────────────┼─────────────┤
  1863. 132.00 s > │ Total │ │ 14 │ 212ms (80%) │ 25ms (9.6%) │ 28ms (11%) │ 0ms (0.00%) │
  1864. 132.00 s > ╰───────────┴────────────────┴─────────┴─────────────┴─────────────┴────────────────┴─────────────╯
  1865. 132.00 s > [2026-08-28 15:33:11.779] @process::amplitude INFO : Input is above threshold: 4 existing threshold E-surfaces across 1/1 graph groups
  1866. 132.00 s > [2026-08-28 15:33:11.781] @process::amplitude INFO : overlap structure of group 0: [2: [9(3,5), 11(5,6)], 2: [4(3,4), 9(3,5)], 2: [4(3,4), 8(4,6)], 2: [8(4,6), 11(5,6)]]
  1867. 132.00 s > Error:
  1868. 132.00 s > 0: IR profiling requested arbitrary precision but received a quad-precision result
  1869. 132.00 s >
  1870. 132.00 s > Location:
  1871. 132.00 s > crates/gammalooprs/src/integrands/process/ir.rs:2123
  1872. 132.00 s >
  1873. 132.00 s > ━━━━━━━━━━━━━━━━━━━━━━━━━━━━━━━━━━ BACKTRACE ━━━━━━━━━━━━━━━━━━━━━━━━━━━━━━━━━━━
  1874. 132.00 s > 1: <color_eyre[51793ea62743adbd]::config::EyreHook>::into_eyre_hook::{closure#0}<unknown>
  1875. 132.00 s > at <unknown source file>:<unknown line>
  1876. 132.00 s > 2: eyre[cb2fd339c0c40fca]::capture_handler<unknown>
  1877. 132.00 s > at <unknown source file>:<unknown line>
  1878. 132.00 s > 3: eyre[cb2fd339c0c40fca]::private::format_err<unknown>
  1879. 132.00 s > at <unknown source file>:<unknown line>
  1880. 132.00 s > 4: gammalooprs[d7a7c067ebd19583]::integrands::process::ir::evaluate_profile_momentum_point_arb::<gammalooprs[d7a7c067ebd19583]::integrands::process::amplitude::AmplitudeIntegrand><unknown>
  1881. 132.00 s > at <unknown source file>:<unknown line>
  1882. 132.00 s > 5: <gammalooprs[d7a7c067ebd19583]::integrands::process::amplitude::AmplitudeIntegrand>::test_single_ir_limit_impl<unknown>
  1883. 132.00 s > at <unknown source file>:<unknown line>
  1884. 132.00 s > 6: gammalooprs[d7a7c067ebd19583]::integrands::process::ir::run_ir_profile::<gammalooprs[d7a7c067ebd19583]::integrands::process::amplitude::AmplitudeIntegrand, <gammalooprs[d7a7c067ebd19583]::integrands::process::amplitude::AmplitudeIntegrand>::enumerate_ir_limits, <gammalooprs[d7a7c067ebd19583]::integrands::process::amplitude::AmplitudeIntegrand>::graph_cut_definitions, <gammalooprs[d7a7c067ebd19583]::integrands::process::amplitude::AmplitudeIntegrand>::test_single_ir_limit_impl><unknown>
  1885. 132.00 s > at <unknown source file>:<unknown line>
  1886. 132.00 s > 7: <gammalooprs[d7a7c067ebd19583]::integrands::process::amplitude::AmplitudeIntegrand>::test_ir<unknown>
  1887. 132.00 s > at <unknown source file>:<unknown line>
  1888. 132.00 s > 8: <gammaloop_api[92ae732909e47e14]::commands::profile::Profile>::run<unknown>
  1889. 132.00 s > at <unknown source file>:<unknown line>
  1890. 132.00 s > 9: test_runs[3e7a390caee4e338]::profile_bulk::box_4e_bulk_profile_passes<unknown>
  1891. 132.00 s > at <unknown source file>:<unknown line>
  1892. 132.00 s > 10: <test_runs[3e7a390caee4e338]::profile_bulk::box_4e_bulk_profile_passes::{closure#0} as core[940e698046960fd5]::ops::function::FnOnce<()>>::call_once<unknown>
  1893. 132.00 s > at <unknown source file>:<unknown line>
  1894. 132.00 s > 11: test[75d6903177b1d7e9]::__rust_begin_short_backtrace::<core[940e698046960fd5]::result::Result<(), alloc[2ea6bcb46fca0c42]::string::String>, fn() -> core[940e698046960fd5]::result::Result<(), alloc[2ea6bcb46fca0c42]::string::String>><unknown>
  1895. 132.00 s > at <unknown source file>:<unknown line>
  1896. 132.00 s > 12: test[75d6903177b1d7e9]::run_test::{closure#0}<unknown>
  1897. 132.00 s > at <unknown source file>:<unknown line>
  1898. 132.00 s > 13: std[bcb96dfbba0ab899]::sys::backtrace::__rust_begin_short_backtrace::<test[75d6903177b1d7e9]::run_test::{closure#1}, ()><unknown>
  1899. 132.00 s > at <unknown source file>:<unknown line>
  1900. 132.00 s > 14: <std[bcb96dfbba0ab899]::thread::lifecycle::spawn_unchecked<test[75d6903177b1d7e9]::run_test::{closure#1}, ()>::{closure#1} as core[940e698046960fd5]::ops::function::FnOnce<()>>::call_once::{shim:vtable#0}<unknown>
  1901. 132.00 s > at <unknown source file>:<unknown line>
  1902. 132.00 s > 15: <std[bcb96dfbba0ab899]::sys::thread::unix::Thread>::new::thread_start<unknown>
  1903. 132.00 s > at <unknown source file>:<unknown line>
  1904. 132.00 s > 16: start_thread<unknown>
  1905. 132.00 s > at <unknown source file>:<unknown line>
  1906. 132.00 s > 17: __clone3<unknown>
  1907. 132.00 s > at <unknown source file>:<unknown line>
  1908. 132.00 s >
  1909. 132.00 s > Run with COLORBT_SHOW_HIDDEN=1 environment variable to disable frame filtering.
  1910. 132.00 s > Run with RUST_BACKTRACE=full to include source snippets.
  1911. 132.00 s > Warning: SpanTrace capture is Unsupported.
  1912. 132.00 s > Ensure that you've setup a tracing-error ErrorLayer and the semver versions are compatible
  1913. 132.00 s >
  1914. 132.00 s > 6. gammaloop-integration-tests::test_runs::profile_bulk::scalar_self_energy_amp_bulk_profile_passes
  1915. 132.00 s > failure: test failure with exit code 101
  1916. 132.00 s > Error:
  1917. 132.00 s > 0: IR profiling requested arbitrary precision but received a quad-precision result
  1918. 132.00 s >
  1919. 132.00 s > Location:
  1920. 132.00 s > crates/gammalooprs/src/integrands/process/ir.rs:2123
  1921. 132.00 s >
  1922. 132.00 s > ━━━━━━━━━━━━━━━━━━━━━━━━━━━━━━━━━━ BACKTRACE ━━━━━━━━━━━━━━━━━━━━━━━━━━━━━━━━━━━
  1923. 132.00 s > 1: <color_eyre[51793ea62743adbd]::config::EyreHook>::into_eyre_hook::{closure#0}<unknown>
  1924. 132.00 s > at <unknown source file>:<unknown line>
  1925. 132.00 s > 2: eyre[cb2fd339c0c40fca]::capture_handler<unknown>
  1926. 132.00 s > at <unknown source file>:<unknown line>
  1927. 132.00 s > 3: eyre[cb2fd339c0c40fca]::private::format_err<unknown>
  1928. 132.00 s > at <unknown source file>:<unknown line>
  1929. 132.00 s > 4: gammalooprs[d7a7c067ebd19583]::integrands::process::ir::evaluate_profile_momentum_point_arb::<gammalooprs[d7a7c067ebd19583]::integrands::process::amplitude::AmplitudeIntegrand><unknown>
  1930. 132.00 s > at <unknown source file>:<unknown line>
  1931. 132.00 s > 5: <gammalooprs[d7a7c067ebd19583]::integrands::process::amplitude::AmplitudeIntegrand>::test_single_ir_limit_impl<unknown>
  1932. 132.00 s > at <unknown source file>:<unknown line>
  1933. 132.00 s > 6: gammalooprs[d7a7c067ebd19583]::integrands::process::ir::run_ir_profile::<gammalooprs[d7a7c067ebd19583]::integrands::process::amplitude::AmplitudeIntegrand, <gammalooprs[d7a7c067ebd19583]::integrands::process::amplitude::AmplitudeIntegrand>::enumerate_ir_limits, <gammalooprs[d7a7c067ebd19583]::integrands::process::amplitude::AmplitudeIntegrand>::graph_cut_definitions, <gammalooprs[d7a7c067ebd19583]::integrands::process::amplitude::AmplitudeIntegrand>::test_single_ir_limit_impl><unknown>
  1934. 132.00 s > at <unknown source file>:<unknown line>
  1935. 132.00 s > 7: <gammalooprs[d7a7c067ebd19583]::integrands::process::amplitude::AmplitudeIntegrand>::test_ir<unknown>
  1936. 132.00 s > at <unknown source file>:<unknown line>
  1937. 132.00 s > 8: <gammaloop_api[92ae732909e47e14]::commands::profile::Profile>::run<unknown>
  1938. 132.00 s > at <unknown source file>:<unknown line>
  1939. 132.00 s > 9: test_runs[3e7a390caee4e338]::profile_bulk::scalar_self_energy_amp_bulk_profile_passes<unknown>
  1940. 132.00 s > at <unknown source file>:<unknown line>
  1941. 132.00 s > 10: <test_runs[3e7a390caee4e338]::profile_bulk::scalar_self_energy_amp_bulk_profile_passes::{closure#0} as core[940e698046960fd5]::ops::function::FnOnce<()>>::call_once<unknown>
  1942. 132.00 s > at <unknown source file>:<unknown line>
  1943. 132.00 s > 11: test[75d6903177b1d7e9]::__rust_begin_short_backtrace::<core[940e698046960fd5]::result::Result<(), alloc[2ea6bcb46fca0c42]::string::String>, fn() -> core[940e698046960fd5]::result::Result<(), alloc[2ea6bcb46fca0c42]::string::String>><unknown>
  1944. 132.00 s > at <unknown source file>:<unknown line>
  1945. 132.00 s > 12: test[75d6903177b1d7e9]::run_test::{closure#0}<unknown>
  1946. 132.00 s > at <unknown source file>:<unknown line>
  1947. 132.00 s > 13: std[bcb96dfbba0ab899]::sys::backtrace::__rust_begin_short_backtrace::<test[75d6903177b1d7e9]::run_test::{closure#1}, ()><unknown>
  1948. 132.00 s > at <unknown source file>:<unknown line>
  1949. 132.00 s > 14: <std[bcb96dfbba0ab899]::thread::lifecycle::spawn_unchecked<test[75d6903177b1d7e9]::run_test::{closure#1}, ()>::{closure#1} as core[940e698046960fd5]::ops::function::FnOnce<()>>::call_once::{shim:vtable#0}<unknown>
  1950. 132.00 s > at <unknown source file>:<unknown line>
  1951. 132.00 s > 15: <std[bcb96dfbba0ab899]::sys::thread::unix::Thread>::new::thread_start<unknown>
  1952. 132.00 s > at <unknown source file>:<unknown line>
  1953. 132.00 s > 16: start_thread<unknown>
  1954. 132.00 s > at <unknown source file>:<unknown line>
  1955. 132.00 s > 17: __clone3<unknown>
  1956. 132.00 s > at <unknown source file>:<unknown line>
  1957. 132.00 s >
  1958. 132.00 s > Run with COLORBT_SHOW_HIDDEN=1 environment variable to disable frame filtering.
  1959. 132.00 s > Run with RUST_BACKTRACE=full to include source snippets.
  1960. 132.00 s > Warning: SpanTrace capture is Unsupported.
  1961. 132.00 s > Ensure that you've setup a tracing-error ErrorLayer and the semver versions are compatible
  1962. 132.00 s > system-out
  1963. 132.00 s > running 1 test
  1964. 132.00 s > test profile_bulk::scalar_self_energy_amp_bulk_profile_passes ... FAILED
  1965. 132.00 s >
  1966. 132.00 s > failures:
  1967. 132.00 s >
  1968. 132.00 s > failures:
  1969. 132.00 s > profile_bulk::scalar_self_energy_amp_bulk_profile_passes
  1970. 132.00 s >
  1971. 132.00 s > test result: FAILED. 0 passed; 1 failed; 0 ignored; 0 measured; 82 filtered out; finished in 0.63s
  1972. 132.00 s > system-err
  1973. 132.00 s > [2026-08-28 15:33:11.993] @gammaloop_api::se... INFO : Running command import model ./assets/models/json/scalars/scalars.json
  1974. 132.00 s > [2026-08-28 15:33:11.993] @import::model INFO : Loading JSON model scalars-default from /build/source/assets/models/json/scalars/scalars
  1975. 132.00 s > [2026-08-28 15:33:12.007] @gammalooprs::model INFO : The following 2 external parameters were forced to zero by the restriction card:
  1976. 132.00 s > width_scalar_1, width_scalar_2
  1977. 132.00 s > [2026-08-28 15:33:12.009] @gammaloop_api::se... INFO : Running command import graphs ./tests/resources/graphs/scalar_self_energy_amp.dot
  1978. 132.00 s > [2026-08-28 15:33:12.009] @commands::import INFO : Loading graphs from '/build/source/tests/resources/graphs/scalar_self_energy_amp.dot'
  1979. 132.00 s > [2026-08-28 15:33:12.020] @gammaloop_api::se... INFO : Running command generate
  1980. 132.00 s > [2026-08-28 15:33:12.342] @commands::generate INFO :
  1981. 132.00 s > Integrand generation summary
  1982. 132.00 s > peak RAM 71.84 MiB | cores 1
  1983. 132.00 s > ╭───────────┬────────────────────────┬─────────┬─────────────┬─────────────┬────────────────┬─────────────╮
  1984. 132.00 s > │ integrand │ graph │ # evals │ expr build │ spenso │ symbolica eval │ compile │
  1985. 132.00 s > ├───────────┼────────────────────────┼─────────┼─────────────┼─────────────┼────────────────┼─────────────┤
  1986. 132.00 s > │ default │ scalar_self_energy_amp │ 6 │ 195ms (90%) │ 11ms (5.3%) │ 10ms (5.0%) │ 0ms (0.00%) │
  1987. 132.00 s > ├───────────┼────────────────────────┼─────────┼─────────────┼─────────────┼────────────────┼─────────────┤
  1988. 132.00 s > │ Total │ │ 6 │ 195ms (90%) │ 11ms (5.3%) │ 10ms (5.0%) │ 0ms (0.00%) │
  1989. 132.00 s > ╰───────────┴────────────────────────┴─────────┴─────────────┴─────────────┴────────────────┴─────────────╯
  1990. 132.00 s > [2026-08-28 15:33:12.343] @process::amplitude INFO : Input is above threshold: 2 existing threshold E-surfaces across 1/1 graph groups
  1991. 132.00 s > [2026-08-28 15:33:12.343] @process::amplitude INFO : overlap structure of group 0: [2: [2(1,5), 4(2,3,5)]]
  1992. 132.00 s > Error:
  1993. 132.00 s > 0: IR profiling requested arbitrary precision but received a quad-precision result
  1994. 132.00 s >
  1995. 132.00 s > Location:
  1996. 132.00 s > crates/gammalooprs/src/integrands/process/ir.rs:2123
  1997. 132.00 s >
  1998. 132.00 s > ━━━━━━━━━━━━━━━━━━━━━━━━━━━━━━━━━━ BACKTRACE ━━━━━━━━━━━━━━━━━━━━━━━━━━━━━━━━━━━
  1999. 132.00 s > 1: <color_eyre[51793ea62743adbd]::config::EyreHook>::into_eyre_hook::{closure#0}<unknown>
  2000. 132.00 s > at <unknown source file>:<unknown line>
  2001. 132.00 s > 2: eyre[cb2fd339c0c40fca]::capture_handler<unknown>
  2002. 132.00 s > at <unknown source file>:<unknown line>
  2003. 132.00 s > 3: eyre[cb2fd339c0c40fca]::private::format_err<unknown>
  2004. 132.00 s > at <unknown source file>:<unknown line>
  2005. 132.00 s > 4: gammalooprs[d7a7c067ebd19583]::integrands::process::ir::evaluate_profile_momentum_point_arb::<gammalooprs[d7a7c067ebd19583]::integrands::process::amplitude::AmplitudeIntegrand><unknown>
  2006. 132.00 s > at <unknown source file>:<unknown line>
  2007. 132.00 s > 5: <gammalooprs[d7a7c067ebd19583]::integrands::process::amplitude::AmplitudeIntegrand>::test_single_ir_limit_impl<unknown>
  2008. 132.00 s > at <unknown source file>:<unknown line>
  2009. 132.00 s > 6: gammalooprs[d7a7c067ebd19583]::integrands::process::ir::run_ir_profile::<gammalooprs[d7a7c067ebd19583]::integrands::process::amplitude::AmplitudeIntegrand, <gammalooprs[d7a7c067ebd19583]::integrands::process::amplitude::AmplitudeIntegrand>::enumerate_ir_limits, <gammalooprs[d7a7c067ebd19583]::integrands::process::amplitude::AmplitudeIntegrand>::graph_cut_definitions, <gammalooprs[d7a7c067ebd19583]::integrands::process::amplitude::AmplitudeIntegrand>::test_single_ir_limit_impl><unknown>
  2010. 132.00 s > at <unknown source file>:<unknown line>
  2011. 132.00 s > 7: <gammalooprs[d7a7c067ebd19583]::integrands::process::amplitude::AmplitudeIntegrand>::test_ir<unknown>
  2012. 132.00 s > at <unknown source file>:<unknown line>
  2013. 132.00 s > 8: <gammaloop_api[92ae732909e47e14]::commands::profile::Profile>::run<unknown>
  2014. 132.00 s > at <unknown source file>:<unknown line>
  2015. 132.00 s > 9: test_runs[3e7a390caee4e338]::profile_bulk::scalar_self_energy_amp_bulk_profile_passes<unknown>
  2016. 132.00 s > at <unknown source file>:<unknown line>
  2017. 132.00 s > 10: <test_runs[3e7a390caee4e338]::profile_bulk::scalar_self_energy_amp_bulk_profile_passes::{closure#0} as core[940e698046960fd5]::ops::function::FnOnce<()>>::call_once<unknown>
  2018. 132.00 s > at <unknown source file>:<unknown line>
  2019. 132.00 s > 11: test[75d6903177b1d7e9]::__rust_begin_short_backtrace::<core[940e698046960fd5]::result::Result<(), alloc[2ea6bcb46fca0c42]::string::String>, fn() -> core[940e698046960fd5]::result::Result<(), alloc[2ea6bcb46fca0c42]::string::String>><unknown>
  2020. 132.00 s > at <unknown source file>:<unknown line>
  2021. 132.00 s > 12: test[75d6903177b1d7e9]::run_test::{closure#0}<unknown>
  2022. 132.00 s > at <unknown source file>:<unknown line>
  2023. 132.00 s > 13: std[bcb96dfbba0ab899]::sys::backtrace::__rust_begin_short_backtrace::<test[75d6903177b1d7e9]::run_test::{closure#1}, ()><unknown>
  2024. 132.00 s > at <unknown source file>:<unknown line>
  2025. 132.00 s > 14: <std[bcb96dfbba0ab899]::thread::lifecycle::spawn_unchecked<test[75d6903177b1d7e9]::run_test::{closure#1}, ()>::{closure#1} as core[940e698046960fd5]::ops::function::FnOnce<()>>::call_once::{shim:vtable#0}<unknown>
  2026. 132.00 s > at <unknown source file>:<unknown line>
  2027. 132.00 s > 15: <std[bcb96dfbba0ab899]::sys::thread::unix::Thread>::new::thread_start<unknown>
  2028. 132.00 s > at <unknown source file>:<unknown line>
  2029. 132.00 s > 16: start_thread<unknown>
  2030. 132.00 s > at <unknown source file>:<unknown line>
  2031. 132.00 s > 17: __clone3<unknown>
  2032. 132.00 s > at <unknown source file>:<unknown line>
  2033. 132.00 s >
  2034. 132.00 s > Run with COLORBT_SHOW_HIDDEN=1 environment variable to disable frame filtering.
  2035. 132.00 s > Run with RUST_BACKTRACE=full to include source snippets.
  2036. 132.00 s > Warning: SpanTrace capture is Unsupported.
  2037. 132.00 s > Ensure that you've setup a tracing-error ErrorLayer and the semver versions are compatible
  2038. 132.00 s >
  2039. 132.00 s > 7. gammaloop-integration-tests::uv::dod2_bubble_uv
  2040. 132.00 s > failure: test failure with exit code 101
  2041. 132.00 s > system-out
  2042. 132.00 s > running 1 test
  2043. 132.00 s > +-------------+-----------------+---------+--------+----------+-----------------------------------------------------------------------------------------------------------------------+-------+
  2044. 132.00 s > | case | check | graph | status | sigma | threshold | error |
  2045. 132.00 s > +-------------+-----------------+---------+--------+----------+-----------------------------------------------------------------------------------------------------------------------+-------+
  2046. 132.00 s > | dod2_bubble | uv_profile | - | FAIL | - | - | - |
  2047. 132.00 s > +-------------+-----------------+---------+--------+----------+-----------------------------------------------------------------------------------------------------------------------+-------+
  2048. 132.00 s > | dod2_bubble | m_uv.inspect | inspect | pass | - | best inspect relative delta 1.000e0 >= 1000*accuracy 1.000e-7 (accuracy=1.000e-10, exponent=+8.0, seed=0, probes=10) | - |
  2049. 132.00 s > +-------------+-----------------+---------+--------+----------+-----------------------------------------------------------------------------------------------------------------------+-------+
  2050. 132.00 s > | dod2_bubble | m_uv.integrated | GL0 | pass | 0.0sigma | compatible within 2sigma | - |
  2051. 132.00 s > +-------------+-----------------+---------+--------+----------+-----------------------------------------------------------------------------------------------------------------------+-------+
  2052. 132.00 s > | dod2_bubble | rls.inspect | inspect | pass | - | best inspect relative delta 2.822e-3 >= 1000*accuracy 1.000e-7 (accuracy=1.000e-10, exponent=+2.0, seed=1, probes=10) | - |
  2053. 132.00 s > +-------------+-----------------+---------+--------+----------+-----------------------------------------------------------------------------------------------------------------------+-------+
  2054. 132.00 s > | dod2_bubble | rls.integrated | GL0 | pass | 0.0sigma | compatible within 2sigma | - |
  2055. 132.00 s > +-------------+-----------------+---------+--------+----------+-----------------------------------------------------------------------------------------------------------------------+-------+
  2056. 132.00 s > | dod2_bubble | mu_r.inspect | inspect | pass | - | best inspect relative delta 6.951e-1 >= 1000*accuracy 1.000e-7 (accuracy=1.000e-10, exponent=+0.0, seed=0, probes=10) | - |
  2057. 132.00 s > +-------------+-----------------+---------+--------+----------+-----------------------------------------------------------------------------------------------------------------------+-------+
  2058. 132.00 s > | dod2_bubble | target | - | pass | - | 2sigma | - |
  2059. 132.00 s > +-------------+-----------------+---------+--------+----------+-----------------------------------------------------------------------------------------------------------------------+-------+
  2060. 132.00 s > test dod2_bubble_uv ... FAILED
  2061. 132.00 s >
  2062. 132.00 s > failures:
  2063. 132.00 s >
  2064. 132.00 s > failures:
  2065. 132.00 s > dod2_bubble_uv
  2066. 132.00 s >
  2067. 132.00 s > test result: FAILED. 0 passed; 1 failed; 0 ignored; 0 measured; 24 filtered out; finished in 40.77s
  2068. 132.00 s > system-err
  2069. 132.00 s > [2026-08-28 15:33:13.375] @gammaloop_api::se... INFO : Running command run generate
  2070. 132.00 s > [2026-08-28 15:33:13.375] @gammaloop_api::se... INFO : Starting command block generate
  2071. 132.00 s > [2026-08-28 15:33:13.375] @gammaloop_api::se... INFO : Running command import model scalars-default.json
  2072. 132.00 s > [2026-08-28 15:33:13.375] @import::model INFO : Loading built-in JSON model scalars-default
  2073. 132.00 s > [2026-08-28 15:33:13.378] @gammalooprs::model INFO : The following 2 external parameters were forced to zero by the restriction card:
  2074. 132.00 s > width_scalar_1, width_scalar_2
  2075. 132.00 s > [2026-08-28 15:33:13.379] @gammaloop_api::se... INFO : Running command remove processes
  2076. 132.00 s > [2026-08-28 15:33:13.379] @gammaloop_api::se... INFO : Running command set global kv global.generation.uv.generate_integrated=true
  2077. 132.00 s > [2026-08-28 15:33:13.379] @gammaloop_api::se... INFO : Running command import graphs ./tests/resources/graphs/scalar/dod2_bubble.dot -p bubble_dod2 -i scalar_bubble_below_thres
  2078. 132.00 s > [2026-08-28 15:33:13.379] @commands::import INFO : Loading graphs from '/build/source/tests/resources/graphs/scalar/dod2_bubble.dot'
  2079. 132.00 s > [2026-08-28 15:33:13.382] @gammaloop_api::se... INFO : Running command generate existing -p bubble_dod2 -i scalar_bubble_below_thres
  2080. 132.00 s > [2026-08-28 15:33:13.383] @approx::local_4d [{#uv, #inspect, #integrated}] DEBUG : Rescaled momenta expanded
  2081. 132.00 s > field value
  2082. 132.00 s > res n-terms: 1, byte size: 3,expr:
  2083. 132.00 s > 1
  2084. 132.00 s > [2026-08-28 15:33:13.386] @approx::local_4d [{#uv, #inspect, #integrated}] DEBUG : Rescaled momenta expanded
  2085. 132.00 s > field value
  2086. 132.00 s > res n-terms: 1, byte size: 585,expr:
  2087. 132.00 s > -SCALAR_COUPLING²·q₀(αᵉ².¹)·q₀(αᵉ³.¹)·q₂(αᵉ².¹)·q₂(αᵉ³.¹)
  2088. 132.00 s > /(t²·denom(3,-q₀-q₂/t,mass_scalar_2²,-mass_scalar_2²+2·(q₀.q₂)/t+(q₂.q₂)/t²+(q₀.q₀))
  2089. 132.00 s > ·denom(2,q₂/t,mass_scalar_2²,-mass_scalar_2²+(q₂.q₂)/t²))
  2090. 132.00 s > [2026-08-28 15:33:13.387] @approx::final_integrand[{#generation, #profile, #uv, #graph, #summary}] DEBUG : Computed global numerator
  2091. 132.00 s > field value
  2092. 132.00 s > global_num n-terms: 1, byte size: 4,expr:
  2093. 132.00 s > 1/2
  2094. 132.00 s > span build_3d{span_context=true graph=GL0 current=subgraph=0, topo_order=0, dod=0}
  2095. 132.00 s > [2026-08-28 15:33:13.389] @uv::approx [{#generation, #uv, #fourd}] DEBUG : Computing 4D
  2096. 132.00 s > field value
  2097. 132.00 s > simple subgraph(S_11,S_y)*Approx(subgraph(S_y,0)) of GL0
  2098. 132.00 s > span compute_4d{span_context=true graph=GL0 current=subgraph=y, topo_order=1, dod=2 given=subgraph=0, topo_order=0, dod=0 reduced=SubSet { set: BitVec<usize, bitvec::order::Lsb0> { addr: 0x7fffec023490, head: 000000, bits: 6, capacity: 64 } [0, 0, 1, 1, 1, 1], id: PhantomData<linnet::half_edge::involution::Hedge> }}
  2099. 132.00 s > [2026-08-28 15:33:13.394] @approx::local_4d [{#uv, #algebra, #integrated, #start}] DEBUG :
  2100. 132.00 s > field value
  2101. 132.00 s > integrand n-terms: 1, byte size: 409,expr:
  2102. 132.00 s > SCALAR_COUPLING²·(q₀(αᵉ³.¹)+q₃(αᵉ³.¹))·q₀(αᵉ².¹)·q₀(αᵉ³.¹)·q₂(αᵉ².¹)
  2103. 132.00 s > /(denom(2,q₂,mass_scalar_2²,-mass_scalar_2²+(q₂.q₂))·denom(3,q₃,mass_scalar_2²,-mass_scalar_2²+(q₃.q₃)))
  2104. 132.00 s > reduced y
  2105. 132.00 s > span grow{span_context=true current=subgraph=y, topo_order=1, dod=2 given=subgraph=0, topo_order=0, dod=0}
  2106. 132.00 s > [2026-08-28 15:33:13.394] @approx::local_4d [{#uv, #inspect, #integrated}] DEBUG : Rescaled momenta expanded
  2107. 132.00 s > field value
  2108. 132.00 s > res n-terms: 1, byte size: 585,expr:
  2109. 132.00 s > -SCALAR_COUPLING²·q₀(αᵉ².¹)·q₀(αᵉ³.¹)·q₂(αᵉ².¹)·q₂(αᵉ³.¹)
  2110. 132.00 s > /(t²·denom(3,-q₀-q₂/t,mass_scalar_2²,-mass_scalar_2²+2·(q₀.q₂)/t+(q₂.q₂)/t²+(q₀.q₀))
  2111. 132.00 s > ·denom(2,q₂/t,mass_scalar_2²,-mass_scalar_2²+(q₂.q₂)/t²))
  2112. 132.00 s > span t{span_context=true current=subgraph=y, topo_order=1, dod=2 given=subgraph=0, topo_order=0, dod=0}
  2113. 132.00 s > [2026-08-28 15:33:13.398] @approx::local_4d [{#uv, #integrated, #rescaled}] DEBUG : Rescaled expanded
  2114. 132.00 s > field value
  2115. 132.00 s > n_loops 1
  2116. 132.00 s > res n-terms: 1, byte size: 707,expr:
  2117. 132.00 s > -SCALAR_COUPLING²·q₀(αᵉ².¹)·q₀(αᵉ³.¹)·q₂(αᵉ².¹)·q₂(αᵉ³.¹)
  2118. 132.00 s > /(t²·denom(3,-q₂,mUVexp²+t²·mass_scalar_2²,-mUV²+t²·(-mass_scalar_2²+2·(q₀.q₂)/t+(q₂.q₂)/t²+(q₀.q₀))+t²·mUVexp²)
  2119. 132.00 s > ·denom(2,q₂,mUVexp²+t²·mass_scalar_2²,-mUV²+t²·(-mass_scalar_2²+(q₂.q₂)/t²)+t²·mUVexp²))
  2120. 132.00 s > span t{span_context=true current=subgraph=y, topo_order=1, dod=2 given=subgraph=0, topo_order=0, dod=0}
  2121. 132.00 s > [2026-08-28 15:33:13.399] @approx::local_4d [{#uv, #integrated, #series}] DEBUG : Series expanded
  2122. 132.00 s > field value
  2123. 132.00 s > res n-terms: 3, byte size: 1896,expr:
  2124. 132.00 s > (1/2·SCALAR_COUPLING²·(2·mUVexp²-2·mass_scalar_2²)/(denom(2,q₂,mUVexp²,-mUV²+(q₂.q₂))²·denom(3,-q₂,mUVexp²,-mUV²+(q₂.q₂)))
  2125. 132.00 s > -SCALAR_COUPLING²
  2126. 132.00 s > ·(-1/2·(2·mUVexp²-2·mass_scalar_2²+2·(q₀.q₀))/denom(3,-q₂,mUVexp²,-mUV²+(q₂.q₂))
  2127. 132.00 s > +4·(q₀.q₂)²/denom(3,-q₂,mUVexp²,-mUV²+(q₂.q₂))²
  2128. 132.00 s > )/(denom(2,q₂,mUVexp²,-mUV²+(q₂.q₂))·denom(3,-q₂,mUVexp²,-mUV²+(q₂.q₂)))
  2129. 132.00 s > )·q₀(αᵉ².¹)·q₀(αᵉ³.¹)·q₂(αᵉ².¹)·q₂(αᵉ³.¹)
  2130. 132.00 s > +2·SCALAR_COUPLING²·(q₀.q₂)·q₀(αᵉ².¹)·q₀(αᵉ³.¹)·q₂(αᵉ².¹)·q₂(αᵉ³.¹)
  2131. 132.00 s > /(t·denom(2,q₂,mUVexp²,-mUV²+(q₂.q₂))·denom(3,-q₂,mUVexp²,-mUV²+(q₂.q₂))²)
  2132. 132.00 s > -SCALAR_COUPLING²·q₀(αᵉ².¹)·q₀(αᵉ³.¹)·q₂(αᵉ².¹)·q₂(αᵉ³.¹)
  2133. 132.00 s > /(t²·denom(2,q₂,mUVexp²,-mUV²+(q₂.q₂))·denom(3,-q₂,mUVexp²,-mUV²+(q₂.q₂)))
  2134. 132.00 s > span t{span_context=true current=subgraph=y, topo_order=1, dod=2 given=subgraph=0, topo_order=0, dod=0}
  2135. 132.00 s > [2026-08-28 15:33:13.399] @approx::local_4d [{#uv, #integrated, #series}] DEBUG : Evaluated at t = 1
  2136. 132.00 s > field value
  2137. 132.00 s > res n-terms: 3, byte size: 1880,expr:
  2138. 132.00 s > (1/2·SCALAR_COUPLING²·(2·mUVexp²-2·mass_scalar_2²)/(denom(2,q₂,mUVexp²,-mUV²+(q₂.q₂))²·denom(3,-q₂,mUVexp²,-mUV²+(q₂.q₂)))
  2139. 132.00 s > -SCALAR_COUPLING²
  2140. 132.00 s > ·(-1/2·(2·mUVexp²-2·mass_scalar_2²+2·(q₀.q₀))/denom(3,-q₂,mUVexp²,-mUV²+(q₂.q₂))
  2141. 132.00 s > +4·(q₀.q₂)²/denom(3,-q₂,mUVexp²,-mUV²+(q₂.q₂))²
  2142. 132.00 s > )/(denom(2,q₂,mUVexp²,-mUV²+(q₂.q₂))·denom(3,-q₂,mUVexp²,-mUV²+(q₂.q₂)))
  2143. 132.00 s > )·q₀(αᵉ².¹)·q₀(αᵉ³.¹)·q₂(αᵉ².¹)·q₂(αᵉ³.¹)
  2144. 132.00 s > -SCALAR_COUPLING²·q₀(αᵉ².¹)·q₀(αᵉ³.¹)·q₂(αᵉ².¹)·q₂(αᵉ³.¹)
  2145. 132.00 s > /(denom(2,q₂,mUVexp²,-mUV²+(q₂.q₂))·denom(3,-q₂,mUVexp²,-mUV²+(q₂.q₂)))
  2146. 132.00 s > +2·SCALAR_COUPLING²·(q₀.q₂)·q₀(αᵉ².¹)·q₀(αᵉ³.¹)·q₂(αᵉ².¹)·q₂(αᵉ³.¹)
  2147. 132.00 s > /(denom(2,q₂,mUVexp²,-mUV²+(q₂.q₂))·denom(3,-q₂,mUVexp²,-mUV²+(q₂.q₂))²)
  2148. 132.00 s > span t{span_context=true current=subgraph=y, topo_order=1, dod=2 given=subgraph=0, topo_order=0, dod=0}
  2149. 132.00 s > [2026-08-28 15:33:13.400] @approx::local_4d [{#uv, #collect, #integrated}] DEBUG : After gamma chain collection
  2150. 132.00 s > field value
  2151. 132.00 s > expr n-terms: 3, byte size: 1880,expr:
  2152. 132.00 s > (1/2·SCALAR_COUPLING²·(2·mUVexp²-2·mass_scalar_2²)/(denom(2,q₂,mUVexp²,-mUV²+(q₂.q₂))²·denom(3,-q₂,mUVexp²,-mUV²+(q₂.q₂)))
  2153. 132.00 s > -SCALAR_COUPLING²
  2154. 132.00 s > ·(-1/2·(2·mUVexp²-2·mass_scalar_2²+2·(q₀.q₀))/denom(3,-q₂,mUVexp²,-mUV²+(q₂.q₂))
  2155. 132.00 s > +4·(q₀.q₂)²/denom(3,-q₂,mUVexp²,-mUV²+(q₂.q₂))²
  2156. 132.00 s > )/(denom(2,q₂,mUVexp²,-mUV²+(q₂.q₂))·denom(3,-q₂,mUVexp²,-mUV²+(q₂.q₂)))
  2157. 132.00 s > )·q₀(αᵉ².¹)·q₀(αᵉ³.¹)·q₂(αᵉ².¹)·q₂(αᵉ³.¹)
  2158. 132.00 s > -SCALAR_COUPLING²·q₀(αᵉ².¹)·q₀(αᵉ³.¹)·q₂(αᵉ².¹)·q₂(αᵉ³.¹)
  2159. 132.00 s > /(denom(2,q₂,mUVexp²,-mUV²+(q₂.q₂))·denom(3,-q₂,mUVexp²,-mUV²+(q₂.q₂)))
  2160. 132.00 s > +2·SCALAR_COUPLING²·(q₀.q₂)·q₀(αᵉ².¹)·q₀(αᵉ³.¹)·q₂(αᵉ².¹)·q₂(αᵉ³.¹)
  2161. 132.00 s > /(denom(2,q₂,mUVexp²,-mUV²+(q₂.q₂))·denom(3,-q₂,mUVexp²,-mUV²+(q₂.q₂))²)
  2162. 132.00 s > span t{span_context=true current=subgraph=y, topo_order=1, dod=2 given=subgraph=0, topo_order=0, dod=0}
  2163. 132.00 s > [2026-08-28 15:33:13.404] @approx::local_4d [{#profile, #uv, #collect, #integrated, #start, #trace}] DEBUG : After gamma schoonschip
  2164. 132.00 s > field value
  2165. 132.00 s > expr n-terms: 3, byte size: 1631,expr:
  2166. 132.00 s > (1/2·SCALAR_COUPLING²·(2·mUVexp²-2·mass_scalar_2²)/(denom(2,q₂,mUVexp²,-mUV²+(q₂.q₂))²·denom(3,-q₂,mUVexp²,-mUV²+(q₂.q₂)))
  2167. 132.00 s > -SCALAR_COUPLING²
  2168. 132.00 s > ·(-1/2·(2·mUVexp²-2·mass_scalar_2²+2·(q₀.q₀))/denom(3,-q₂,mUVexp²,-mUV²+(q₂.q₂))
  2169. 132.00 s > +4·(q₀.q₂)²/denom(3,-q₂,mUVexp²,-mUV²+(q₂.q₂))²
  2170. 132.00 s > )/(denom(2,q₂,mUVexp²,-mUV²+(q₂.q₂))·denom(3,-q₂,mUVexp²,-mUV²+(q₂.q₂)))
  2171. 132.00 s > )·(q₀.q₂)²
  2172. 132.00 s > -SCALAR_COUPLING²·(q₀.q₂)²/(denom(2,q₂,mUVexp²,-mUV²+(q₂.q₂))·denom(3,-q₂,mUVexp²,-mUV²+(q₂.q₂)))
  2173. 132.00 s > +2·SCALAR_COUPLING²·(q₀.q₂)·(q₀.q₂)²
  2174. 132.00 s > /(denom(2,q₂,mUVexp²,-mUV²+(q₂.q₂))·denom(3,-q₂,mUVexp²,-mUV²+(q₂.q₂))²)
  2175. 132.00 s > span t{span_context=true current=subgraph=y, topo_order=1, dod=2 given=subgraph=0, topo_order=0, dod=0}
  2176. 132.00 s > [2026-08-28 15:33:13.405] @approx::local_4d [{#profile, #uv, #collect, #integrated, #start, #trace}] DEBUG : After gamma collection
  2177. 132.00 s > field value
  2178. 132.00 s > expr n-terms: 1, byte size: 1347,expr:
  2179. 132.00 s > SCALAR_COUPLING²
  2180. 132.00 s > ·(-denom(2,q₂,mUVexp²,-mUV²+(q₂.q₂))·denom(3,-q₂,mUVexp²,-mUV²+(q₂.q₂))²
  2181. 132.00 s > +1/2·(2·mUVexp²-2·mass_scalar_2²)·denom(3,-q₂,mUVexp²,-mUV²+(q₂.q₂))²
  2182. 132.00 s > -(-1/2·(2·mUVexp²-2·mass_scalar_2²+2·(q₀.q₀))·denom(3,-q₂,mUVexp²,-mUV²+(q₂.q₂))+4·(q₀.q₂)²)
  2183. 132.00 s > ·denom(2,q₂,mUVexp²,-mUV²+(q₂.q₂))
  2184. 132.00 s > +2·(q₀.q₂)·denom(2,q₂,mUVexp²,-mUV²+(q₂.q₂))·denom(3,-q₂,mUVexp²,-mUV²+(q₂.q₂))
  2185. 132.00 s > )·(q₀.q₂)²/(denom(2,q₂,mUVexp²,-mUV²+(q₂.q₂))²·denom(3,-q₂,mUVexp²,-mUV²+(q₂.q₂))³)
  2186. 132.00 s > span t{span_context=true current=subgraph=y, topo_order=1, dod=2 given=subgraph=0, topo_order=0, dod=0}
  2187. 132.00 s > [2026-08-28 15:33:13.406] @approx::local_4d [{#profile, #uv, #gamma, #integrated, #start, #trace, #vakint}] DEBUG : After gamma simplification
  2188. 132.00 s > ... omitted 3263 more lines; see full nextest output above
  2189. 132.00 s >
  2190. 132.00 s > 8. gammaloop-integration-tests::uv::sunrise_scalar_1_uv
  2191. 132.00 s > failure: test failure with exit code 101
  2192. 132.00 s > system-out
  2193. 132.00 s > running 1 test
  2194. 132.00 s > test sunrise_scalar_1_uv has been running for over 60 seconds
  2195. 132.00 s > +------------------+------------------------+--------------+--------+----------+----------------------------------------------------------------------------------------------------------------------+-------+
  2196. 132.00 s > | case | check | graph | status | sigma | threshold | error |
  2197. 132.00 s > +------------------+------------------------+--------------+--------+----------+----------------------------------------------------------------------------------------------------------------------+-------+
  2198. 132.00 s > | sunrise_scalar_1 | uv_profile | - | FAIL | - | - | - |
  2199. 132.00 s > +------------------+------------------------+--------------+--------+----------+----------------------------------------------------------------------------------------------------------------------+-------+
  2200. 132.00 s > | sunrise_scalar_1 | m_uv.inspect | inspect | pass | - | best inspect relative delta 1.624e0 >= 1000*accuracy 1.000e-3 (accuracy=1.000e-6, exponent=+1.0, seed=1, probes=10) | - |
  2201. 132.00 s > +------------------+------------------------+--------------+--------+----------+----------------------------------------------------------------------------------------------------------------------+-------+
  2202. 132.00 s > | sunrise_scalar_1 | m_uv.integrated | sunrise | pass | 0.1sigma | compatible within 2sigma | - |
  2203. 132.00 s > +------------------+------------------------+--------------+--------+----------+----------------------------------------------------------------------------------------------------------------------+-------+
  2204. 132.00 s > | sunrise_scalar_1 | rls.inspect | inspect | pass | - | best inspect relative delta 8.682e-1 >= 1000*accuracy 1.000e-3 (accuracy=1.000e-6, exponent=+1.0, seed=1, probes=10) | - |
  2205. 132.00 s > +------------------+------------------------+--------------+--------+----------+----------------------------------------------------------------------------------------------------------------------+-------+
  2206. 132.00 s > | sunrise_scalar_1 | rls.integrated | sunrise | pass | 0.0sigma | compatible within 2sigma | - |
  2207. 132.00 s > +------------------+------------------------+--------------+--------+----------+----------------------------------------------------------------------------------------------------------------------+-------+
  2208. 132.00 s > | sunrise_scalar_1 | mu_r.inspect | inspect | pass | - | best inspect relative delta 1.752e0 >= 1000*accuracy 1.000e-3 (accuracy=1.000e-6, exponent=+1.0, seed=1, probes=10) | - |
  2209. 132.00 s > +------------------+------------------------+--------------+--------+----------+----------------------------------------------------------------------------------------------------------------------+-------+
  2210. 132.00 s > | sunrise_scalar_1 | integrated.relerr | integrated | pass | - | relative error 9.20% <= 10.00% | - |
  2211. 132.00 s > +------------------+------------------------+--------------+--------+----------+----------------------------------------------------------------------------------------------------------------------+-------+
  2212. 132.00 s > | sunrise_scalar_1 | m_uv.integrated.relerr | m_uv-shifted | pass | - | relative error 5.89% <= 10.00% | - |
  2213. 132.00 s > +------------------+------------------------+--------------+--------+----------+----------------------------------------------------------------------------------------------------------------------+-------+
  2214. 132.00 s > | sunrise_scalar_1 | target | - | pass | - | 2sigma | - |
  2215. 132.00 s > +------------------+------------------------+--------------+--------+----------+----------------------------------------------------------------------------------------------------------------------+-------+
  2216. 132.00 s > test sunrise_scalar_1_uv ... FAILED
  2217. 132.00 s >
  2218. 132.00 s > failures:
  2219. 132.00 s >
  2220. 132.00 s > failures:
  2221. 132.00 s > sunrise_scalar_1_uv
  2222. 132.00 s >
  2223. 132.00 s > test result: FAILED. 0 passed; 1 failed; 0 ignored; 0 measured; 24 filtered out; finished in 92.59s
  2224. 132.00 s > system-err
  2225. 132.00 s > [2026-08-28 15:33:17.587] @gammaloop_api::se... INFO : Running command run generate
  2226. 132.00 s > [2026-08-28 15:33:17.587] @gammaloop_api::se... INFO : Starting command block generate
  2227. 132.00 s > [2026-08-28 15:33:17.588] @gammaloop_api::se... INFO : Running command import model scalars-default.json
  2228. 132.00 s > [2026-08-28 15:33:17.588] @import::model INFO : Loading built-in JSON model scalars-default
  2229. 132.00 s > [2026-08-28 15:33:17.591] @gammalooprs::model INFO : The following 2 external parameters were forced to zero by the restriction card:
  2230. 132.00 s > width_scalar_1, width_scalar_2
  2231. 132.00 s > [2026-08-28 15:33:17.592] @gammaloop_api::se... INFO : Running command remove processes
  2232. 132.00 s > [2026-08-28 15:33:17.592] @gammaloop_api::se... INFO : Running command set global kv global.generation.uv.generate_integrated=true
  2233. 132.00 s > [2026-08-28 15:33:17.592] @gammaloop_api::se... INFO : Running command import graphs ./tests/resources/graphs/scalar_sunrise.dot -p sunrise_scalar_1 -i scalar_sunrise
  2234. 132.00 s > [2026-08-28 15:33:17.592] @commands::import INFO : Loading graphs from '/build/source/tests/resources/graphs/scalar_sunrise.dot'
  2235. 132.00 s > [2026-08-28 15:33:17.595] @gammaloop_api::se... INFO : Running command generate existing -p sunrise_scalar_1 -i scalar_sunrise
  2236. 132.00 s > [2026-08-28 15:33:17.601] @approx::local_4d [{#uv, #inspect, #integrated}] DEBUG : Rescaled momenta expanded
  2237. 132.00 s > field value
  2238. 132.00 s > res n-terms: 1, byte size: 611,expr:
  2239. 132.00 s > 1/(denom(1,q₁/t,mass_scalar_1²,-mass_scalar_1²+(q₁.q₁)/t²)
  2240. 132.00 s > ·denom(2,-q₀+q₃-q₁/t,mass_scalar_1²,
  2241. 132.00 s > -mass_scalar_1²+2·(q₀.q₁)/t-2·(q₁.q₃)/t+(q₁.q₁)/t²+(q₀.q₀)
  2242. 132.00 s > -2·(q₀.q₃)+(q₃.q₃)
  2243. 132.00 s > ))
  2244. 132.00 s > [2026-08-28 15:33:17.602] @approx::local_4d [{#uv, #inspect, #integrated}] DEBUG : Rescaled momenta expanded
  2245. 132.00 s > field value
  2246. 132.00 s > res n-terms: 1, byte size: 777,expr:
  2247. 132.00 s > 1/(denom(0,q₀/t,mass_scalar_1²,-mass_scalar_1²+(q₀.q₀)/t²)·denom(1,q₁/t,mass_scalar_1²,-mass_scalar_1²+(q₁.q₁)/t²)
  2248. 132.00 s > ·denom(2,q₄-q₀/t-q₁/t,mass_scalar_1²,
  2249. 132.00 s > -mass_scalar_1²-2·(q₀.q₄)/t-2·(q₁.q₄)/t+(q₀.q₀)/t²+2·(q₀.q₁)/t²
  2250. 132.00 s > +(q₁.q₁)/t²+(q₄.q₄)
  2251. 132.00 s > ))
  2252. 132.00 s > [2026-08-28 15:33:17.611] @approx::local_4d [{#uv, #inspect, #integrated}] DEBUG : Rescaled momenta expanded
  2253. 132.00 s > field value
  2254. 132.00 s > res n-terms: 1, byte size: 3,expr:
  2255. 132.00 s > 1
  2256. 132.00 s > [2026-08-28 15:33:17.611] @approx::local_4d [{#uv, #inspect, #integrated}] DEBUG : Rescaled momenta expanded
  2257. 132.00 s > field value
  2258. 132.00 s > res n-terms: 1, byte size: 611,expr:
  2259. 132.00 s > 1/(denom(0,q₀/t,mass_scalar_1²,-mass_scalar_1²+(q₀.q₀)/t²)
  2260. 132.00 s > ·denom(1,-q₂+q₃-q₀/t,mass_scalar_1²,
  2261. 132.00 s > -mass_scalar_1²+2·(q₀.q₂)/t-2·(q₀.q₃)/t+(q₀.q₀)/t²+(q₂.q₂)
  2262. 132.00 s > -2·(q₂.q₃)+(q₃.q₃)
  2263. 132.00 s > ))
  2264. 132.00 s > [2026-08-28 15:33:17.613] @approx::local_4d [{#uv, #inspect, #integrated}] DEBUG : Rescaled momenta expanded
  2265. 132.00 s > field value
  2266. 132.00 s > res n-terms: 1, byte size: 611,expr:
  2267. 132.00 s > 1/(denom(0,q₀/t,mass_scalar_1²,-mass_scalar_1²+(q₀.q₀)/t²)
  2268. 132.00 s > ·denom(2,-q₁+q₃-q₀/t,mass_scalar_1²,
  2269. 132.00 s > -mass_scalar_1²+2·(q₀.q₁)/t-2·(q₀.q₃)/t+(q₀.q₀)/t²+(q₁.q₁)
  2270. 132.00 s > -2·(q₁.q₃)+(q₃.q₃)
  2271. 132.00 s > ))
  2272. 132.00 s > [2026-08-28 15:33:17.615] @approx::final_integrand[{#generation, #profile, #uv, #graph, #summary}] DEBUG : Computed global numerator
  2273. 132.00 s > field value
  2274. 132.00 s > global_num n-terms: 1, byte size: 3,expr:
  2275. 132.00 s > 1
  2276. 132.00 s > span build_3d{span_context=true graph=sunrise current=subgraph=0, topo_order=0, dod=0}
  2277. 132.00 s > [2026-08-28 15:33:17.617] @uv::approx [{#generation, #uv, #fourd}] DEBUG : Computing 4D
  2278. 132.00 s > field value
  2279. 132.00 s > simple subgraph(S_47,S_3s)*Approx(subgraph(S_3s,0)) of sunrise
  2280. 132.00 s > span compute_4d{span_context=true graph=sunrise current=subgraph=3s, topo_order=1, dod=0 given=subgraph=0, topo_order=0, dod=0 reduced=SubSet { set: BitVec<usize, bitvec::order::Lsb0> { addr: 0x7fffec011aa0, head: 000000, bits: 8, capacity: 64 } [0, 0, 0, 0, 1, 1, 1, 1], id: PhantomData<linnet::half_edge::involution::Hedge> }}
  2281. 132.00 s > [2026-08-28 15:33:17.617] @approx::local_4d [{#uv, #algebra, #integrated, #start}] DEBUG :
  2282. 132.00 s > field value
  2283. 132.00 s > integrand n-terms: 1, byte size: 217,expr:
  2284. 132.00 s > 1/(denom(1,q₁,mass_scalar_1²,-mass_scalar_1²+(q₁.q₁))·denom(2,q₂,mass_scalar_1²,-mass_scalar_1²+(q₂.q₂)))
  2285. 132.00 s > reduced 3s
  2286. 132.00 s > span grow{span_context=true current=subgraph=3s, topo_order=1, dod=0 given=subgraph=0, topo_order=0, dod=0}
  2287. 132.00 s > [2026-08-28 15:33:17.618] @approx::local_4d [{#uv, #inspect, #integrated}] DEBUG : Rescaled momenta expanded
  2288. 132.00 s > field value
  2289. 132.00 s > res n-terms: 1, byte size: 611,expr:
  2290. 132.00 s > 1/(denom(1,q₁/t,mass_scalar_1²,-mass_scalar_1²+(q₁.q₁)/t²)
  2291. 132.00 s > ·denom(2,-q₀+q₃-q₁/t,mass_scalar_1²,
  2292. 132.00 s > -mass_scalar_1²+2·(q₀.q₁)/t-2·(q₁.q₃)/t+(q₁.q₁)/t²+(q₀.q₀)
  2293. 132.00 s > -2·(q₀.q₃)+(q₃.q₃)
  2294. 132.00 s > ))
  2295. 132.00 s > span t{span_context=true current=subgraph=3s, topo_order=1, dod=0 given=subgraph=0, topo_order=0, dod=0}
  2296. 132.00 s > [2026-08-28 15:33:17.621] @approx::local_4d [{#uv, #integrated, #rescaled}] DEBUG : Rescaled expanded
  2297. 132.00 s > field value
  2298. 132.00 s > n_loops 1
  2299. 132.00 s > res n-terms: 1, byte size: 723,expr:
  2300. 132.00 s > 1/(denom(1,q₁,mUVexp²+t²·mass_scalar_1²,-mUV²+t²·(-mass_scalar_1²+(q₁.q₁)/t²)+t²·mUVexp²)
  2301. 132.00 s > ·denom(2,-q₁,mUVexp²+t²·mass_scalar_1²,
  2302. 132.00 s > -mUV²
  2303. 132.00 s > +t²
  2304. 132.00 s > ·(-mass_scalar_1²+2·(q₀.q₁)/t-2·(q₁.q₃)/t+(q₁.q₁)/t²+(q₀.q₀)
  2305. 132.00 s > -2·(q₀.q₃)+(q₃.q₃)
  2306. 132.00 s > )
  2307. 132.00 s > +t²·mUVexp²
  2308. 132.00 s > ))
  2309. 132.00 s > span t{span_context=true current=subgraph=3s, topo_order=1, dod=0 given=subgraph=0, topo_order=0, dod=0}
  2310. 132.00 s > [2026-08-28 15:33:17.621] @approx::local_4d [{#uv, #integrated, #series}] DEBUG : Series expanded
  2311. 132.00 s > field value
  2312. 132.00 s > res n-terms: 1, byte size: 223,expr:
  2313. 132.00 s > 1/(denom(1,q₁,mUVexp²,-mUV²+(q₁.q₁))·denom(2,-q₁,mUVexp²,-mUV²+(q₁.q₁)))
  2314. 132.00 s > span t{span_context=true current=subgraph=3s, topo_order=1, dod=0 given=subgraph=0, topo_order=0, dod=0}
  2315. 132.00 s > [2026-08-28 15:33:17.621] @approx::local_4d [{#uv, #integrated, #series}] DEBUG : Evaluated at t = 1
  2316. 132.00 s > field value
  2317. 132.00 s > res n-terms: 1, byte size: 223,expr:
  2318. 132.00 s > 1/(denom(1,q₁,mUVexp²,-mUV²+(q₁.q₁))·denom(2,-q₁,mUVexp²,-mUV²+(q₁.q₁)))
  2319. 132.00 s > span t{span_context=true current=subgraph=3s, topo_order=1, dod=0 given=subgraph=0, topo_order=0, dod=0}
  2320. 132.00 s > [2026-08-28 15:33:17.621] @approx::local_4d [{#uv, #collect, #integrated}] DEBUG : After gamma chain collection
  2321. 132.00 s > field value
  2322. 132.00 s > expr n-terms: 1, byte size: 223,expr:
  2323. 132.00 s > 1/(denom(1,q₁,mUVexp²,-mUV²+(q₁.q₁))·denom(2,-q₁,mUVexp²,-mUV²+(q₁.q₁)))
  2324. 132.00 s > span t{span_context=true current=subgraph=3s, topo_order=1, dod=0 given=subgraph=0, topo_order=0, dod=0}
  2325. 132.00 s > [2026-08-28 15:33:17.622] @approx::local_4d [{#profile, #uv, #collect, #integrated, #start, #trace}] DEBUG : After gamma schoonschip
  2326. 132.00 s > field value
  2327. 132.00 s > expr n-terms: 1, byte size: 223,expr:
  2328. 132.00 s > 1/(denom(1,q₁,mUVexp²,-mUV²+(q₁.q₁))·denom(2,-q₁,mUVexp²,-mUV²+(q₁.q₁)))
  2329. 132.00 s > span t{span_context=true current=subgraph=3s, topo_order=1, dod=0 given=subgraph=0, topo_order=0, dod=0}
  2330. 132.00 s > [2026-08-28 15:33:17.622] @approx::local_4d [{#profile, #uv, #collect, #integrated, #start, #trace}] DEBUG : After gamma collection
  2331. 132.00 s > field value
  2332. 132.00 s > expr n-terms: 1, byte size: 223,expr:
  2333. 132.00 s > 1/(denom(1,q₁,mUVexp²,-mUV²+(q₁.q₁))·denom(2,-q₁,mUVexp²,-mUV²+(q₁.q₁)))
  2334. 132.00 s > span t{span_context=true current=subgraph=3s, topo_order=1, dod=0 given=subgraph=0, topo_order=0, dod=0}
  2335. 132.00 s > [2026-08-28 15:33:17.622] @approx::local_4d [{#profile, #uv, #gamma, #integrated, #start, #trace, #vakint}] DEBUG : After gamma simplification
  2336. 132.00 s > field value
  2337. 132.00 s > expr n-terms: 1, byte size: 223,expr:
  2338. 132.00 s > 1/(denom(1,q₁,mUVexp²,-mUV²+(q₁.q₁))·denom(2,-q₁,mUVexp²,-mUV²+(q₁.q₁)))
  2339. 132.00 s > span t{span_context=true current=subgraph=3s, topo_order=1, dod=0 given=subgraph=0, topo_order=0, dod=0}
  2340. 132.00 s > [2026-08-28 15:33:17.622] @approx::local_4d [{#profile, #uv, #integrated, #schoonschip, #start, #trace, #vakint}] DEBUG : After Schoonschip net
  2341. 132.00 s > field value
  2342. 132.00 s > expr n-terms: 1, byte size: 223,expr:
  2343. 132.00 s > 1/(denom(1,q₁,mUVexp²,-mUV²+(q₁.q₁))·denom(2,-q₁,mUVexp²,-mUV²+(q₁.q₁)))
  2344. 132.00 s > ... omitted 20090 more lines; see full nextest output above
  2345. 132.00 s >
  2346. 132.00 s > 9. gammaloop-integration-tests::uv::se1l_uv
  2347. 132.00 s > failure: test failure with exit code 101
  2348. 132.00 s > system-out
  2349. 132.00 s > running 1 test
  2350. 132.00 s > test se1l_uv has been running for over 60 seconds
  2351. 132.00 s > +------+-----------------+---------+--------+----------+-----------------------------------------------------------------------------------------------------------------------+-------+
  2352. 132.00 s > | case | check | graph | status | sigma | threshold | error |
  2353. 132.00 s > +------+-----------------+---------+--------+----------+-----------------------------------------------------------------------------------------------------------------------+-------+
  2354. 132.00 s > | se1l | uv_profile | - | FAIL | - | - | - |
  2355. 132.00 s > +------+-----------------+---------+--------+----------+-----------------------------------------------------------------------------------------------------------------------+-------+
  2356. 132.00 s > | se1l | m_uv.inspect | inspect | pass | - | best inspect relative delta 1.097e-1 >= 1000*accuracy 1.000e-7 (accuracy=1.000e-10, exponent=+2.0, seed=1, probes=10) | - |
  2357. 132.00 s > +------+-----------------+---------+--------+----------+-----------------------------------------------------------------------------------------------------------------------+-------+
  2358. 132.00 s > | se1l | m_uv.integrated | se1l | pass | 0.1sigma | compatible within 2sigma | - |
  2359. 132.00 s > +------+-----------------+---------+--------+----------+-----------------------------------------------------------------------------------------------------------------------+-------+
  2360. 132.00 s > | se1l | rls.inspect | inspect | pass | - | best inspect relative delta 4.499e-2 >= 1000*accuracy 1.000e-7 (accuracy=1.000e-10, exponent=+2.0, seed=1, probes=10) | - |
  2361. 132.00 s > +------+-----------------+---------+--------+----------+-----------------------------------------------------------------------------------------------------------------------+-------+
  2362. 132.00 s > | se1l | rls.integrated | se1l | pass | 0.0sigma | compatible within 2sigma | - |
  2363. 132.00 s > +------+-----------------+---------+--------+----------+-----------------------------------------------------------------------------------------------------------------------+-------+
  2364. 132.00 s > | se1l | mu_r.inspect | inspect | pass | - | best inspect relative delta 1.424e-1 >= 1000*accuracy 1.000e-7 (accuracy=1.000e-10, exponent=+2.0, seed=1, probes=10) | - |
  2365. 132.00 s > +------+-----------------+---------+--------+----------+-----------------------------------------------------------------------------------------------------------------------+-------+
  2366. 132.00 s > | se1l | target | - | pass | - | 2sigma | - |
  2367. 132.00 s > +------+-----------------+---------+--------+----------+-----------------------------------------------------------------------------------------------------------------------+-------+
  2368. 132.00 s > test se1l_uv ... FAILED
  2369. 132.00 s >
  2370. 132.00 s > failures:
  2371. 132.00 s >
  2372. 132.00 s > failures:
  2373. 132.00 s > se1l_uv
  2374. 132.00 s >
  2375. 132.00 s > test result: FAILED. 0 passed; 1 failed; 0 ignored; 0 measured; 24 filtered out; finished in 103.70s
  2376. 132.00 s > system-err
  2377. 132.00 s > [2026-08-28 15:33:17.623] @gammaloop_api::se... INFO : Running command run generate
  2378. 132.00 s > [2026-08-28 15:33:17.623] @gammaloop_api::se... INFO : Starting command block generate
  2379. 132.00 s > [2026-08-28 15:33:17.623] @gammaloop_api::se... INFO : Running command import model sm-default
  2380. 132.00 s > [2026-08-28 15:33:17.623] @import::model INFO : Loading built-in JSON model sm-default
  2381. 132.00 s > [2026-08-28 15:33:17.651] @gammalooprs::model INFO : The following 11 external parameters were forced to zero by the restriction card:
  2382. 132.00 s > lamWS, AWS, rhoWS, etaWS, ymc, yme, ymm, MC, Me, MM, WTau
  2383. 132.00 s > [2026-08-28 15:33:17.651] @gammalooprs::model INFO : The following 34 vertex rules were removed by the restriction card:
  2384. 132.00 s > V_82 -> (c~, d, G+) | V_83 -> (t~, d, G+) | V_84 -> (c~, s, G+) | V_85 -> (t~, s, G+) | V_86 -> (u~, b, G+) | V_87 -> (c~, b, G+) | V_90 -> (c~, d, W+) | V_91 -> (t~, d, W+) | V_92 -> (u~, s, W+) | V_94 -> (t~, s, W+) | V_95 -> (u~, b, W+) | V_96 -> (c~, b, W+) | V_101 -> (e+, e-, G0) | V_102 -> (mu+, mu-, G0) | V_104 -> (e+, e-, H) | V_105 -> (mu+, mu-, H) | V_110 -> (ve~, e-, G+) | V_111 -> (vm~, mu-, G+) | V_116 -> (b~, u, G-) | V_117 -> (d~, c, G-) | V_118 -> (s~, c, G-) | V_119 -> (b~, c, G-) | V_120 -> (d~, t, G-) | V_121 -> (s~, t, G-) | V_124 -> (s~, u, W-) | V_125 -> (b~, u, W-) | V_126 -> (d~, c, W-) | V_128 -> (b~, c, W-) | V_129 -> (d~, t, W-) | V_130 -> (s~, t, W-) | V_138 -> (c~, c, G0) | V_140 -> (c~, c, H) | V_145 -> (e+, ve, G-) | V_146 -> (mu+, vm, G-)
  2385. 132.00 s > [2026-08-28 15:33:17.651] @gammalooprs::model INFO : The following 36 couplings were removed by the restriction card:
  2386. 132.00 s > GC_13, GC_14, GC_16, GC_17, GC_18, GC_19, GC_20, GC_22, GC_23, GC_24, GC_25, GC_26, GC_28, GC_29, GC_42, GC_43, GC_44, GC_46, GC_47, GC_48, GC_84, GC_85, GC_86, GC_87, GC_88, GC_89, GC_90, GC_91, GC_92, GC_93, GC_101, GC_102, GC_103, GC_105, GC_106, GC_107
  2387. 132.00 s > [2026-08-28 15:33:17.652] @gammaloop_api::se... INFO : Running command remove processes
  2388. 132.00 s > [2026-08-28 15:33:17.652] @gammaloop_api::se... INFO : Running command set global kv global.generation.uv.generate_integrated=true
  2389. 132.00 s > [2026-08-28 15:33:17.653] @gammaloop_api::se... INFO : Running command import graphs ./tests/resources/graphs/uv_tests/se1l.dot -p se1l -i se1l
  2390. 132.00 s > [2026-08-28 15:33:17.653] @commands::import INFO : Loading graphs from '/build/source/tests/resources/graphs/uv_tests/se1l.dot'
  2391. 132.00 s > [2026-08-28 15:33:17.656] @gammaloop_api::se... INFO : Running command generate existing -p se1l -i se1l
  2392. 132.00 s > [2026-08-28 15:33:18.506] @commands::generate INFO :
  2393. 132.00 s > Integrand generation summary
  2394. 132.00 s > peak RAM 88.62 MiB | cores 1
  2395. 132.00 s > ╭───────────┬───────┬─────────┬─────────────┬─────────────┬────────────────┬─────────────╮
  2396. 132.00 s > │ integrand │ graph │ # evals │ expr build │ spenso │ symbolica eval │ compile │
  2397. 132.00 s > ├───────────┼───────┼─────────┼─────────────┼─────────────┼────────────────┼─────────────┤
  2398. 132.00 s > │ se1l │ se1l │ 5 │ 713ms (89%) │ 32ms (4.1%) │ 53ms (6.7%) │ 0ms (0.00%) │
  2399. 132.00 s > ├───────────┼───────┼─────────┼─────────────┼─────────────┼────────────────┼─────────────┤
  2400. 132.00 s > │ Total │ │ 5 │ 713ms (89%) │ 32ms (4.1%) │ 53ms (6.7%) │ 0ms (0.00%) │
  2401. 132.00 s > ╰───────────┴───────┴─────────┴─────────────┴─────────────┴────────────────┴─────────────╯
  2402. 132.00 s > [2026-08-28 15:33:18.507] @gammaloop_api::se... INFO : Running command set process -p se1l -i se1l kv general.m_uv=0.2
  2403. 132.00 s > [2026-08-28 15:33:18.508] @gammaloop_api::se... INFO : Running command set process -p se1l -i se1l kv general.mu_r=0.2
  2404. 132.00 s > [2026-08-28 15:33:18.509] @gammaloop_api::se... INFO : Running command set process -p se1l -i se1l kv general.renormalization_localization_scale=0.2
  2405. 132.00 s > [2026-08-28 15:33:18.510] @gammaloop_api::se... INFO : Running command duplicate integrand -p se1l -i se1l --output_process_name se1l --output_integrand_name se1l_muv_shifted
  2406. 132.00 s > [2026-08-28 15:33:18.511] @gammaloop_api::se... INFO : Running command set process -p se1l -i se1l_muv_shifted kv general.m_uv=0.5
  2407. 132.00 s > [2026-08-28 15:33:18.512] @gammaloop_api::se... INFO : Running command duplicate integrand -p se1l -i se1l --output_process_name se1l --output_integrand_name se1l_rls_shifted
  2408. 132.00 s > [2026-08-28 15:33:18.513] @gammaloop_api::se... INFO : Running command set process -p se1l -i se1l_rls_shifted kv general.renormalization_localization_scale=1
  2409. 132.00 s > [2026-08-28 15:33:18.514] @gammaloop_api::se... INFO : Running command duplicate integrand -p se1l -i se1l --output_process_name se1l --output_integrand_name se1l_mur_shifted
  2410. 132.00 s > [2026-08-28 15:33:18.517] @gammaloop_api::se... INFO : Running command set process -p se1l -i se1l_mur_shifted kv general.mu_r=0.8
  2411. 132.00 s > [2026-08-28 15:33:18.524] @process::amplitude WARNING : External state 0 ('g', PDG 21, helicity +) is off shell: p^2 = +2.5e5, expected m^2 = +0e0 (|Δ| = +2.5e5). Fixed-helicity spinor/vector/tensor external states may be ill-defined at this kinematic point.
  2412. 132.00 s > field value
  2413. 132.00 s > span warm_up{integrand.name=se1l}
  2414. 132.00 s > [2026-08-28 15:33:18.524] @process::amplitude WARNING : External state 1 ('g', PDG 21, helicity -) is off shell: p^2 = +2.5e5, expected m^2 = +0e0 (|Δ| = +2.5e5). Fixed-helicity spinor/vector/tensor external states may be ill-defined at this kinematic point.
  2415. 132.00 s > field value
  2416. 132.00 s > span warm_up{integrand.name=se1l}
  2417. 132.00 s > [2026-08-28 15:33:18.525] @process::amplitude INFO : Input is above threshold: 1 existing threshold E-surfaces across 1/1 graph groups
  2418. 132.00 s > field value
  2419. 132.00 s > existing_esurfaces 1
  2420. 132.00 s > group_count 1
  2421. 132.00 s > groups_above_threshold 1
  2422. 132.00 s > integrand se1l
  2423. 132.00 s > span warm_up{integrand.name=se1l}
  2424. 132.00 s > threshold_status above threshold
  2425. 132.00 s > [2026-08-28 15:33:18.525] @process::amplitude INFO : overlap structure of group 0: [1: [0(2,3)]]
  2426. 132.00 s > field value
  2427. 132.00 s > span warm_up{integrand.name=se1l}
  2428. 132.00 s > [2026-08-28 15:33:18.682] @commands::profile INFO :
  2429. 132.00 s > ╭───────┬──────┬──────────┬───────┬─────┬──────────┬───────────╮
  2430. 132.00 s > │ fixed │ → ∞ │ slope │ r2 │ DOD │ bare DOD │ inspect │
  2431. 132.00 s > ├───────┼──────┼──────────┼───────┼─────┼──────────┼───────────┤
  2432. 132.00 s > │ {} │ {e3} │ 1.639236 │ 0.904 │ 2 │ 2 │ arb retry │
  2433. 132.00 s > │ {} │ {e2} │ 1.698834 │ 0.902 │ 2 │ 2 │ arb retry │
  2434. 132.00 s > ╰───────┴──────┴──────────┴───────┴─────┴──────────┴───────────╯
  2435. 132.00 s > [2026-08-28 15:33:18.682] @commands::profile INFO :
  2436. 132.00 s > ╭───────┬──────┬─────────────┬──────────┬───────┬─────┬──────────┬───────────╮
  2437. 132.00 s > │ fixed │ → ∞ │ orientation │ slope │ r2 │ DOD │ bare DOD │ inspect │
  2438. 132.00 s > ├───────┼──────┼─────────────┼──────────┼───────┼─────┼──────────┼───────────┤
  2439. 132.00 s > │ {} │ {e3} │ 00-+ │ 0.343429 │ 0.145 │ 0 │ 2 │ arb retry │
  2440. 132.00 s > │ {} │ {e3} │ 00+- │ 0.342577 │ 0.135 │ 0 │ 2 │ arb retry │
  2441. 132.00 s > │ {} │ {e2} │ 00-+ │ 0.385975 │ 0.161 │ 0 │ 2 │ arb retry │
  2442. 132.00 s > │ {} │ {e2} │ 00+- │ 0.384920 │ 0.192 │ 0 │ 2 │ arb retry │
  2443. 132.00 s > ╰───────┴──────┴─────────────┴──────────┴───────┴─────┴──────────┴───────────╯
  2444. 132.00 s > [2026-08-28 15:33:18.683] @gammaloop_api::se... INFO : Running command set process kv integrator.target_relative_accuracy=0.001 integrator.n_increase=0 integrator.n_start=50000 integrator.n_max=400000 integrator.seed=1337
  2445. 132.00 s > [2026-08-28 15:33:18.684] @commands::integrate INFO : Created workspace directory at /build/source/tests/artifacts/se1l/integration_workspace_se1l
  2446. 132.00 s > [2026-08-28 15:33:18.701] @commands::integrate INFO : No integration state found, starting new integration
  2447. 132.00 s > [2026-08-28 15:33:18.701] @commands::integrate INFO : Gammaloop now integrates se1l@se1l, se1l@se1l_muv_shifted, se1l@se1l_rls_shifted
  2448. 132.00 s > [2026-08-28 15:33:18.701] @process::amplitude WARNING : External state 0 ('g', PDG 21, helicity +) is off shell: p^2 = +2.5e5, expected m^2 = +0e0 (|Δ| = +2.5e5). Fixed-helicity spinor/vector/tensor external states may be ill-defined at this kinematic point.
  2449. 132.00 s > field value
  2450. 132.00 s > span warm_up{integrand.name=se1l}
  2451. 132.00 s > [2026-08-28 15:33:18.701] @process::amplitude WARNING : External state 1 ('g', PDG 21, helicity -) is off shell: p^2 = +2.5e5, expected m^2 = +0e0 (|Δ| = +2.5e5). Fixed-helicity spinor/vector/tensor external states may be ill-defined at this kinematic point.
  2452. 132.00 s > field value
  2453. 132.00 s > span warm_up{integrand.name=se1l}
  2454. 132.00 s > [2026-08-28 15:33:18.701] @process::amplitude INFO : Input is above threshold: 1 existing threshold E-surfaces across 1/1 graph groups
  2455. 132.00 s > field value
  2456. 132.00 s > existing_esurfaces 1
  2457. 132.00 s > group_count 1
  2458. 132.00 s > groups_above_threshold 1
  2459. 132.00 s > integrand se1l
  2460. 132.00 s > span warm_up{integrand.name=se1l}
  2461. 132.00 s > threshold_status above threshold
  2462. 132.00 s > [2026-08-28 15:33:18.701] @process::amplitude INFO : overlap structure of group 0: [1: [0(2,3)]]
  2463. 132.00 s > field value
  2464. 132.00 s > span warm_up{integrand.name=se1l}
  2465. 132.00 s > [2026-08-28 15:33:18.702] @process::amplitude WARNING : External state 0 ('g', PDG 21, helicity +) is off shell: p^2 = +2.5e5, expected m^2 = +0e0 (|Δ| = +2.5e5). Fixed-helicity spinor/vector/tensor external states may be ill-defined at this kinematic point.
  2466. 132.00 s > field value
  2467. 132.00 s > span warm_up{integrand.name=se1l_muv_shifted}
  2468. 132.00 s > [2026-08-28 15:33:18.702] @process::amplitude WARNING : External state 1 ('g', PDG 21, helicity -) is off shell: p^2 = +2.5e5, expected m^2 = +0e0 (|Δ| = +2.5e5). Fixed-helicity spinor/vector/tensor external states may be ill-defined at this kinematic point.
  2469. 132.00 s > field value
  2470. 132.00 s > span warm_up{integrand.name=se1l_muv_shifted}
  2471. 132.00 s > [2026-08-28 15:33:18.702] @process::amplitude INFO : Input is above threshold: 1 existing threshold E-surfaces across 1/1 graph groups
  2472. 132.00 s > field value
  2473. 132.00 s > existing_esurfaces 1
  2474. 132.00 s > group_count 1
  2475. 132.00 s > groups_above_threshold 1
  2476. 132.00 s > integrand se1l_muv_shifted
  2477. 132.00 s > span warm_up{integrand.name=se1l_muv_shifted}
  2478. 132.00 s > threshold_status above threshold
  2479. 132.00 s > [2026-08-28 15:33:18.702] @process::amplitude INFO : overlap structure of group 0: [1: [0(2,3)]]
  2480. 132.00 s > field value
  2481. 132.00 s > span warm_up{integrand.name=se1l_muv_shifted}
  2482. 132.00 s > [2026-08-28 15:33:18.703] @process::amplitude WARNING : External state 0 ('g', PDG 21, helicity +) is off shell: p^2 = +2.5e5, expected m^2 = +0e0 (|Δ| = +2.5e5). Fixed-helicity spinor/vector/tensor external states may be ill-defined at this kinematic point.
  2483. 132.00 s > field value
  2484. 132.00 s > span warm_up{integrand.name=se1l_rls_shifted}
  2485. 132.00 s > [2026-08-28 15:33:18.703] @process::amplitude WARNING : External state 1 ('g', PDG 21, helicity -) is off shell: p^2 = +2.5e5, expected m^2 = +0e0 (|Δ| = +2.5e5). Fixed-helicity spinor/vector/tensor external states may be ill-defined at this kinematic point.
  2486. 132.00 s > field value
  2487. 132.00 s > span warm_up{integrand.name=se1l_rls_shifted}
  2488. 132.00 s > [2026-08-28 15:33:18.704] @process::amplitude INFO : Input is above threshold: 1 existing threshold E-surfaces across 1/1 graph groups
  2489. 132.00 s > field value
  2490. 132.00 s > existing_esurfaces 1
  2491. 132.00 s > group_count 1
  2492. 132.00 s > groups_above_threshold 1
  2493. 132.00 s > integrand se1l_rls_shifted
  2494. 132.00 s > span warm_up{integrand.name=se1l_rls_shifted}
  2495. 132.00 s > threshold_status above threshold
  2496. 132.00 s > ... omitted 1410 more lines; see full nextest output above
  2497. 132.00 s > =========================================
  2498. 132.00 s For full logs, run:
  2499. 132.00 s nix log /nix/store/5lvckp7qh3dqs2nqf61qj4kz6kj46p4q-gammaloop-nextest-integration.drv
  2500. 132.12 s [0 built (1 failed), 0.0Run failed.