test packages.x86_64-linux.nix-ci-check-gammaloop-nextest-integration

Reproduce this run
Retry Run
  1. 137.20 s gammaloop-nextest-integration> | dod2_bubble | rls.integrated | GL0 | pass | 0.0sigma | compatible within 2sigma | - |
  2. 137.20 s gammaloop-nextest-integration> +-------------+-----------------+---------+--------+----------+-----------------------------------------------------------------------------------------------------------------------+-------+
  3. 137.20 s gammaloop-nextest-integration> | dod2_bubble | mu_r.inspect | inspect | pass | - | best inspect relative delta 6.951e-1 >= 1000*accuracy 1.000e-7 (accuracy=1.000e-10, exponent=+0.0, seed=0, probes=10) | - |
  4. 137.20 s gammaloop-nextest-integration> +-------------+-----------------+---------+--------+----------+-----------------------------------------------------------------------------------------------------------------------+-------+
  5. 137.20 s gammaloop-nextest-integration> | dod2_bubble | target | - | pass | - | 2sigma | - |
  6. 137.20 s gammaloop-nextest-integration> +-------------+-----------------+---------+--------+----------+-----------------------------------------------------------------------------------------------------------------------+-------+
  7. 137.20 s gammaloop-nextest-integration> test dod2_bubble_uv ... FAILED
  8. 137.20 s gammaloop-nextest-integration>
  9. 137.20 s gammaloop-nextest-integration> failures:
  10. 137.20 s gammaloop-nextest-integration>
  11. 137.20 s gammaloop-nextest-integration> failures:
  12. 137.20 s gammaloop-nextest-integration> dod2_bubble_uv
  13. 137.20 s gammaloop-nextest-integration>
  14. 137.20 s gammaloop-nextest-integration> test result: FAILED. 0 passed; 1 failed; 0 ignored; 0 measured; 24 filtered out; finished in 40.41s
  15. 137.20 s gammaloop-nextest-integration> system-err
  16. 137.20 s gammaloop-nextest-integration> [2026-08-28 15:30:54.101] @gammaloop_api::se... INFO : Running command run generate
  17. 137.20 s gammaloop-nextest-integration> [2026-08-28 15:30:54.101] @gammaloop_api::se... INFO : Starting command block generate
  18. 137.20 s gammaloop-nextest-integration> [2026-08-28 15:30:54.102] @gammaloop_api::se... INFO : Running command import model scalars-default.json
  19. 137.20 s gammaloop-nextest-integration> [2026-08-28 15:30:54.102] @import::model INFO : Loading built-in JSON model scalars-default
  20. 137.20 s gammaloop-nextest-integration> [2026-08-28 15:30:54.108] @gammalooprs::model INFO : The following 2 external parameters were forced to zero by the restriction card:
  21. 137.20 s gammaloop-nextest-integration> width_scalar_1, width_scalar_2
  22. 137.20 s gammaloop-nextest-integration> [2026-08-28 15:30:54.109] @gammaloop_api::se... INFO : Running command remove processes
  23. 137.20 s gammaloop-nextest-integration> [2026-08-28 15:30:54.109] @gammaloop_api::se... INFO : Running command set global kv global.generation.uv.generate_integrated=true
  24. 137.20 s gammaloop-nextest-integration> [2026-08-28 15:30:54.110] @gammaloop_api::se... INFO : Running command import graphs ./tests/resources/graphs/scalar/dod2_bubble.dot -p bubble_dod2 -i scalar_bubble_below_thres
  25. 137.20 s gammaloop-nextest-integration> [2026-08-28 15:30:54.110] @commands::import INFO : Loading graphs from '/build/source/tests/resources/graphs/scalar/dod2_bubble.dot'
  26. 137.20 s gammaloop-nextest-integration> [2026-08-28 15:30:54.114] @gammaloop_api::se... INFO : Running command generate existing -p bubble_dod2 -i scalar_bubble_below_thres
  27. 137.20 s gammaloop-nextest-integration> [2026-08-28 15:30:54.115] @approx::local_4d [{#uv, #inspect, #integrated}] DEBUG : Rescaled momenta expanded
  28. 137.20 s gammaloop-nextest-integration> field value
  29. 137.20 s gammaloop-nextest-integration> res n-terms: 1, byte size: 585,expr:
  30. 137.20 s gammaloop-nextest-integration> -SCALAR_COUPLING²·q₀(αᵉ².¹)·q₀(αᵉ³.¹)·q₂(αᵉ².¹)·q₂(αᵉ³.¹)
  31. 137.20 s gammaloop-nextest-integration> /(t²·denom(3,-q₀-q₂/t,mass_scalar_2²,-mass_scalar_2²+2·(q₀.q₂)/t+(q₂.q₂)/t²+(q₀.q₀))
  32. 137.20 s gammaloop-nextest-integration> ·denom(2,q₂/t,mass_scalar_2²,-mass_scalar_2²+(q₂.q₂)/t²))
  33. 137.20 s gammaloop-nextest-integration> [2026-08-28 15:30:54.121] @approx::local_4d [{#uv, #inspect, #integrated}] DEBUG : Rescaled momenta expanded
  34. 137.20 s gammaloop-nextest-integration> field value
  35. 137.20 s gammaloop-nextest-integration> res n-terms: 1, byte size: 3,expr:
  36. 137.20 s gammaloop-nextest-integration> 1
  37. 137.20 s gammaloop-nextest-integration> [2026-08-28 15:30:54.122] @approx::final_integrand[{#generation, #profile, #uv, #graph, #summary}] DEBUG : Computed global numerator
  38. 137.20 s gammaloop-nextest-integration> field value
  39. 137.20 s gammaloop-nextest-integration> global_num n-terms: 1, byte size: 4,expr:
  40. 137.20 s gammaloop-nextest-integration> 1/2
  41. 137.20 s gammaloop-nextest-integration> span build_3d{span_context=true graph=GL0 current=subgraph=0, topo_order=0, dod=0}
  42. 137.20 s gammaloop-nextest-integration> [2026-08-28 15:30:54.125] @uv::approx [{#generation, #uv, #fourd}] DEBUG : Computing 4D
  43. 137.20 s gammaloop-nextest-integration> field value
  44. 137.20 s gammaloop-nextest-integration> simple subgraph(S_11,S_y)*Approx(subgraph(S_y,0)) of GL0
  45. 137.20 s gammaloop-nextest-integration> span compute_4d{span_context=true graph=GL0 current=subgraph=y, topo_order=1, dod=2 given=subgraph=0, topo_order=0, dod=0 reduced=SubSet { set: BitVec<usize, bitvec::order::Lsb0> { addr: 0x7fffec00a8f0, head: 000000, bits: 6, capacity: 64 } [0, 0, 1, 1, 1, 1], id: PhantomData<linnet::half_edge::involution::Hedge> }}
  46. 137.20 s gammaloop-nextest-integration> [2026-08-28 15:30:54.126] @approx::local_4d [{#uv, #algebra, #integrated, #start}] DEBUG :
  47. 137.20 s gammaloop-nextest-integration> field value
  48. 137.20 s gammaloop-nextest-integration> integrand n-terms: 1, byte size: 409,expr:
  49. 137.20 s gammaloop-nextest-integration> SCALAR_COUPLING²·(q₀(αᵉ³.¹)+q₃(αᵉ³.¹))·q₀(αᵉ².¹)·q₀(αᵉ³.¹)·q₂(αᵉ².¹)
  50. 137.20 s gammaloop-nextest-integration> /(denom(2,q₂,mass_scalar_2²,-mass_scalar_2²+(q₂.q₂))·denom(3,q₃,mass_scalar_2²,-mass_scalar_2²+(q₃.q₃)))
  51. 137.20 s gammaloop-nextest-integration> reduced y
  52. 137.20 s gammaloop-nextest-integration> span grow{span_context=true current=subgraph=y, topo_order=1, dod=2 given=subgraph=0, topo_order=0, dod=0}
  53. 137.20 s gammaloop-nextest-integration> [2026-08-28 15:30:54.126] @approx::local_4d [{#uv, #inspect, #integrated}] DEBUG : Rescaled momenta expanded
  54. 137.20 s gammaloop-nextest-integration> field value
  55. 137.20 s gammaloop-nextest-integration> res n-terms: 1, byte size: 585,expr:
  56. 137.20 s gammaloop-nextest-integration> -SCALAR_COUPLING²·q₀(αᵉ².¹)·q₀(αᵉ³.¹)·q₂(αᵉ².¹)·q₂(αᵉ³.¹)
  57. 137.20 s gammaloop-nextest-integration> /(t²·denom(3,-q₀-q₂/t,mass_scalar_2²,-mass_scalar_2²+2·(q₀.q₂)/t+(q₂.q₂)/t²+(q₀.q₀))
  58. 137.20 s gammaloop-nextest-integration> ·denom(2,q₂/t,mass_scalar_2²,-mass_scalar_2²+(q₂.q₂)/t²))
  59. 137.20 s gammaloop-nextest-integration> span t{span_context=true current=subgraph=y, topo_order=1, dod=2 given=subgraph=0, topo_order=0, dod=0}
  60. 137.20 s gammaloop-nextest-integration> [2026-08-28 15:30:54.126] @approx::local_4d [{#uv, #integrated, #rescaled}] DEBUG : Rescaled expanded
  61. 137.20 s gammaloop-nextest-integration> field value
  62. 137.20 s gammaloop-nextest-integration> n_loops 1
  63. 137.20 s gammaloop-nextest-integration> res n-terms: 1, byte size: 707,expr:
  64. 137.20 s gammaloop-nextest-integration> -SCALAR_COUPLING²·q₀(αᵉ².¹)·q₀(αᵉ³.¹)·q₂(αᵉ².¹)·q₂(αᵉ³.¹)
  65. 137.20 s gammaloop-nextest-integration> /(t²·denom(3,-q₂,mUVexp²+t²·mass_scalar_2²,-mUV²+t²·(-mass_scalar_2²+2·(q₀.q₂)/t+(q₂.q₂)/t²+(q₀.q₀))+t²·mUVexp²)
  66. 137.20 s gammaloop-nextest-integration> ·denom(2,q₂,mUVexp²+t²·mass_scalar_2²,-mUV²+t²·(-mass_scalar_2²+(q₂.q₂)/t²)+t²·mUVexp²))
  67. 137.20 s gammaloop-nextest-integration> span t{span_context=true current=subgraph=y, topo_order=1, dod=2 given=subgraph=0, topo_order=0, dod=0}
  68. 137.20 s gammaloop-nextest-integration> [2026-08-28 15:30:54.128] @approx::local_4d [{#uv, #integrated, #series}] DEBUG : Series expanded
  69. 137.20 s gammaloop-nextest-integration> field value
  70. 137.20 s gammaloop-nextest-integration> res n-terms: 3, byte size: 1896,expr:
  71. 137.20 s gammaloop-nextest-integration> (1/2·SCALAR_COUPLING²·(2·mUVexp²-2·mass_scalar_2²)/(denom(2,q₂,mUVexp²,-mUV²+(q₂.q₂))²·denom(3,-q₂,mUVexp²,-mUV²+(q₂.q₂)))
  72. 137.20 s gammaloop-nextest-integration> -SCALAR_COUPLING²
  73. 137.20 s gammaloop-nextest-integration> ·(-1/2·(2·mUVexp²-2·mass_scalar_2²+2·(q₀.q₀))/denom(3,-q₂,mUVexp²,-mUV²+(q₂.q₂))
  74. 137.20 s gammaloop-nextest-integration> +4·(q₀.q₂)²/denom(3,-q₂,mUVexp²,-mUV²+(q₂.q₂))²
  75. 137.20 s gammaloop-nextest-integration> )/(denom(2,q₂,mUVexp²,-mUV²+(q₂.q₂))·denom(3,-q₂,mUVexp²,-mUV²+(q₂.q₂)))
  76. 137.20 s gammaloop-nextest-integration> )·q₀(αᵉ².¹)·q₀(αᵉ³.¹)·q₂(αᵉ².¹)·q₂(αᵉ³.¹)
  77. 137.20 s gammaloop-nextest-integration> +2·SCALAR_COUPLING²·(q₀.q₂)·q₀(αᵉ².¹)·q₀(αᵉ³.¹)·q₂(αᵉ².¹)·q₂(αᵉ³.¹)
  78. 137.20 s gammaloop-nextest-integration> /(t·denom(2,q₂,mUVexp²,-mUV²+(q₂.q₂))·denom(3,-q₂,mUVexp²,-mUV²+(q₂.q₂))²)
  79. 137.20 s gammaloop-nextest-integration> -SCALAR_COUPLING²·q₀(αᵉ².¹)·q₀(αᵉ³.¹)·q₂(αᵉ².¹)·q₂(αᵉ³.¹)
  80. 137.20 s gammaloop-nextest-integration> /(t²·denom(2,q₂,mUVexp²,-mUV²+(q₂.q₂))·denom(3,-q₂,mUVexp²,-mUV²+(q₂.q₂)))
  81. 137.20 s gammaloop-nextest-integration> span t{span_context=true current=subgraph=y, topo_order=1, dod=2 given=subgraph=0, topo_order=0, dod=0}
  82. 137.20 s gammaloop-nextest-integration> [2026-08-28 15:30:54.128] @approx::local_4d [{#uv, #integrated, #series}] DEBUG : Evaluated at t = 1
  83. 137.20 s gammaloop-nextest-integration> field value
  84. 137.20 s gammaloop-nextest-integration> res n-terms: 3, byte size: 1880,expr:
  85. 137.20 s gammaloop-nextest-integration> (1/2·SCALAR_COUPLING²·(2·mUVexp²-2·mass_scalar_2²)/(denom(2,q₂,mUVexp²,-mUV²+(q₂.q₂))²·denom(3,-q₂,mUVexp²,-mUV²+(q₂.q₂)))
  86. 137.20 s gammaloop-nextest-integration> -SCALAR_COUPLING²
  87. 137.20 s gammaloop-nextest-integration> ·(-1/2·(2·mUVexp²-2·mass_scalar_2²+2·(q₀.q₀))/denom(3,-q₂,mUVexp²,-mUV²+(q₂.q₂))
  88. 137.20 s gammaloop-nextest-integration> +4·(q₀.q₂)²/denom(3,-q₂,mUVexp²,-mUV²+(q₂.q₂))²
  89. 137.20 s gammaloop-nextest-integration> )/(denom(2,q₂,mUVexp²,-mUV²+(q₂.q₂))·denom(3,-q₂,mUVexp²,-mUV²+(q₂.q₂)))
  90. 137.20 s gammaloop-nextest-integration> )·q₀(αᵉ².¹)·q₀(αᵉ³.¹)·q₂(αᵉ².¹)·q₂(αᵉ³.¹)
  91. 137.20 s gammaloop-nextest-integration> -SCALAR_COUPLING²·q₀(αᵉ².¹)·q₀(αᵉ³.¹)·q₂(αᵉ².¹)·q₂(αᵉ³.¹)
  92. 137.20 s gammaloop-nextest-integration> /(denom(2,q₂,mUVexp²,-mUV²+(q₂.q₂))·denom(3,-q₂,mUVexp²,-mUV²+(q₂.q₂)))
  93. 137.20 s gammaloop-nextest-integration> +2·SCALAR_COUPLING²·(q₀.q₂)·q₀(αᵉ².¹)·q₀(αᵉ³.¹)·q₂(αᵉ².¹)·q₂(αᵉ³.¹)
  94. 137.20 s gammaloop-nextest-integration> /(denom(2,q₂,mUVexp²,-mUV²+(q₂.q₂))·denom(3,-q₂,mUVexp²,-mUV²+(q₂.q₂))²)
  95. 137.20 s gammaloop-nextest-integration> span t{span_context=true current=subgraph=y, topo_order=1, dod=2 given=subgraph=0, topo_order=0, dod=0}
  96. 137.20 s gammaloop-nextest-integration> [2026-08-28 15:30:54.130] @approx::local_4d [{#uv, #collect, #integrated}] DEBUG : After gamma chain collection
  97. 137.20 s gammaloop-nextest-integration> field value
  98. 137.20 s gammaloop-nextest-integration> expr n-terms: 3, byte size: 1880,expr:
  99. 137.20 s gammaloop-nextest-integration> (1/2·SCALAR_COUPLING²·(2·mUVexp²-2·mass_scalar_2²)/(denom(2,q₂,mUVexp²,-mUV²+(q₂.q₂))²·denom(3,-q₂,mUVexp²,-mUV²+(q₂.q₂)))
  100. 137.20 s gammaloop-nextest-integration> -SCALAR_COUPLING²
  101. 137.20 s gammaloop-nextest-integration> ·(-1/2·(2·mUVexp²-2·mass_scalar_2²+2·(q₀.q₀))/denom(3,-q₂,mUVexp²,-mUV²+(q₂.q₂))
  102. 137.20 s gammaloop-nextest-integration> +4·(q₀.q₂)²/denom(3,-q₂,mUVexp²,-mUV²+(q₂.q₂))²
  103. 137.20 s gammaloop-nextest-integration> )/(denom(2,q₂,mUVexp²,-mUV²+(q₂.q₂))·denom(3,-q₂,mUVexp²,-mUV²+(q₂.q₂)))
  104. 137.20 s gammaloop-nextest-integration> )·q₀(αᵉ².¹)·q₀(αᵉ³.¹)·q₂(αᵉ².¹)·q₂(αᵉ³.¹)
  105. 137.20 s gammaloop-nextest-integration> -SCALAR_COUPLING²·q₀(αᵉ².¹)·q₀(αᵉ³.¹)·q₂(αᵉ².¹)·q₂(αᵉ³.¹)
  106. 137.20 s gammaloop-nextest-integration> /(denom(2,q₂,mUVexp²,-mUV²+(q₂.q₂))·denom(3,-q₂,mUVexp²,-mUV²+(q₂.q₂)))
  107. 137.20 s gammaloop-nextest-integration> +2·SCALAR_COUPLING²·(q₀.q₂)·q₀(αᵉ².¹)·q₀(αᵉ³.¹)·q₂(αᵉ².¹)·q₂(αᵉ³.¹)
  108. 137.20 s gammaloop-nextest-integration> /(denom(2,q₂,mUVexp²,-mUV²+(q₂.q₂))·denom(3,-q₂,mUVexp²,-mUV²+(q₂.q₂))²)
  109. 137.20 s gammaloop-nextest-integration> span t{span_context=true current=subgraph=y, topo_order=1, dod=2 given=subgraph=0, topo_order=0, dod=0}
  110. 137.20 s gammaloop-nextest-integration> [2026-08-28 15:30:54.132] @approx::local_4d [{#profile, #uv, #collect, #integrated, #start, #trace}] DEBUG : After gamma schoonschip
  111. 137.20 s gammaloop-nextest-integration> field value
  112. 137.20 s gammaloop-nextest-integration> expr n-terms: 3, byte size: 1631,expr:
  113. 137.20 s gammaloop-nextest-integration> (1/2·SCALAR_COUPLING²·(2·mUVexp²-2·mass_scalar_2²)/(denom(2,q₂,mUVexp²,-mUV²+(q₂.q₂))²·denom(3,-q₂,mUVexp²,-mUV²+(q₂.q₂)))
  114. 137.20 s gammaloop-nextest-integration> -SCALAR_COUPLING²
  115. 137.20 s gammaloop-nextest-integration> ·(-1/2·(2·mUVexp²-2·mass_scalar_2²+2·(q₀.q₀))/denom(3,-q₂,mUVexp²,-mUV²+(q₂.q₂))
  116. 137.20 s gammaloop-nextest-integration> +4·(q₀.q₂)²/denom(3,-q₂,mUVexp²,-mUV²+(q₂.q₂))²
  117. 137.20 s gammaloop-nextest-integration> )/(denom(2,q₂,mUVexp²,-mUV²+(q₂.q₂))·denom(3,-q₂,mUVexp²,-mUV²+(q₂.q₂)))
  118. 137.20 s gammaloop-nextest-integration> )·(q₀.q₂)²
  119. 137.20 s gammaloop-nextest-integration> -SCALAR_COUPLING²·(q₀.q₂)²/(denom(2,q₂,mUVexp²,-mUV²+(q₂.q₂))·denom(3,-q₂,mUVexp²,-mUV²+(q₂.q₂)))
  120. 137.20 s gammaloop-nextest-integration> +2·SCALAR_COUPLING²·(q₀.q₂)·(q₀.q₂)²
  121. 137.20 s gammaloop-nextest-integration> /(denom(2,q₂,mUVexp²,-mUV²+(q₂.q₂))·denom(3,-q₂,mUVexp²,-mUV²+(q₂.q₂))²)
  122. 137.20 s gammaloop-nextest-integration> span t{span_context=true current=subgraph=y, topo_order=1, dod=2 given=subgraph=0, topo_order=0, dod=0}
  123. 137.20 s gammaloop-nextest-integration> [2026-08-28 15:30:54.135] @approx::local_4d [{#profile, #uv, #collect, #integrated, #start, #trace}] DEBUG : After gamma collection
  124. 137.20 s gammaloop-nextest-integration> field value
  125. 137.20 s gammaloop-nextest-integration> expr n-terms: 1, byte size: 1347,expr:
  126. 137.20 s gammaloop-nextest-integration> SCALAR_COUPLING²
  127. 137.20 s gammaloop-nextest-integration> ·(-denom(2,q₂,mUVexp²,-mUV²+(q₂.q₂))·denom(3,-q₂,mUVexp²,-mUV²+(q₂.q₂))²
  128. 137.20 s gammaloop-nextest-integration> +1/2·(2·mUVexp²-2·mass_scalar_2²)·denom(3,-q₂,mUVexp²,-mUV²+(q₂.q₂))²
  129. 137.20 s gammaloop-nextest-integration> -(-1/2·(2·mUVexp²-2·mass_scalar_2²+2·(q₀.q₀))·denom(3,-q₂,mUVexp²,-mUV²+(q₂.q₂))+4·(q₀.q₂)²)
  130. 137.20 s gammaloop-nextest-integration> ·denom(2,q₂,mUVexp²,-mUV²+(q₂.q₂))
  131. 137.20 s gammaloop-nextest-integration> +2·(q₀.q₂)·denom(2,q₂,mUVexp²,-mUV²+(q₂.q₂))·denom(3,-q₂,mUVexp²,-mUV²+(q₂.q₂))
  132. 137.20 s gammaloop-nextest-integration> )·(q₀.q₂)²/(denom(2,q₂,mUVexp²,-mUV²+(q₂.q₂))²·denom(3,-q₂,mUVexp²,-mUV²+(q₂.q₂))³)
  133. 137.20 s gammaloop-nextest-integration> span t{span_context=true current=subgraph=y, topo_order=1, dod=2 given=subgraph=0, topo_order=0, dod=0}
  134. 137.20 s gammaloop-nextest-integration> [2026-08-28 15:30:54.136] @approx::local_4d [{#profile, #uv, #gamma, #integrated, #start, #trace, #vakint}] DEBUG : After gamma simplification
  135. 137.20 s gammaloop-nextest-integration> ... omitted 3263 more lines; see full nextest output above
  136. 137.20 s gammaloop-nextest-integration>
  137. 137.20 s gammaloop-nextest-integration> 8. gammaloop-integration-tests::uv::sunrise_scalar_1_uv
  138. 137.22 s gammaloop-nextest-integration> failure: test failure with exit code 101
  139. 137.22 s gammaloop-nextest-integration> system-out
  140. 137.22 s gammaloop-nextest-integration> running 1 test
  141. 137.22 s gammaloop-nextest-integration> test sunrise_scalar_1_uv has been running for over 60 seconds
  142. 137.22 s gammaloop-nextest-integration> +------------------+------------------------+--------------+--------+----------+----------------------------------------------------------------------------------------------------------------------+-------+
  143. 137.22 s gammaloop-nextest-integration> | case | check | graph | status | sigma | threshold | error |
  144. 137.22 s gammaloop-nextest-integration> +------------------+------------------------+--------------+--------+----------+----------------------------------------------------------------------------------------------------------------------+-------+
  145. 137.22 s gammaloop-nextest-integration> | sunrise_scalar_1 | uv_profile | - | FAIL | - | - | - |
  146. 137.22 s gammaloop-nextest-integration> +------------------+------------------------+--------------+--------+----------+----------------------------------------------------------------------------------------------------------------------+-------+
  147. 137.22 s gammaloop-nextest-integration> | sunrise_scalar_1 | m_uv.inspect | inspect | pass | - | best inspect relative delta 1.624e0 >= 1000*accuracy 1.000e-3 (accuracy=1.000e-6, exponent=+1.0, seed=1, probes=10) | - |
  148. 137.22 s gammaloop-nextest-integration> +------------------+------------------------+--------------+--------+----------+----------------------------------------------------------------------------------------------------------------------+-------+
  149. 137.22 s gammaloop-nextest-integration> | sunrise_scalar_1 | m_uv.integrated | sunrise | pass | 0.1sigma | compatible within 2sigma | - |
  150. 137.22 s gammaloop-nextest-integration> +------------------+------------------------+--------------+--------+----------+----------------------------------------------------------------------------------------------------------------------+-------+
  151. 137.22 s gammaloop-nextest-integration> | sunrise_scalar_1 | rls.inspect | inspect | pass | - | best inspect relative delta 8.682e-1 >= 1000*accuracy 1.000e-3 (accuracy=1.000e-6, exponent=+1.0, seed=1, probes=10) | - |
  152. 137.22 s gammaloop-nextest-integration> +------------------+------------------------+--------------+--------+----------+----------------------------------------------------------------------------------------------------------------------+-------+
  153. 137.22 s gammaloop-nextest-integration> | sunrise_scalar_1 | rls.integrated | sunrise | pass | 0.0sigma | compatible within 2sigma | - |
  154. 137.22 s gammaloop-nextest-integration> +------------------+------------------------+--------------+--------+----------+----------------------------------------------------------------------------------------------------------------------+-------+
  155. 137.22 s gammaloop-nextest-integration> | sunrise_scalar_1 | mu_r.inspect | inspect | pass | - | best inspect relative delta 1.752e0 >= 1000*accuracy 1.000e-3 (accuracy=1.000e-6, exponent=+1.0, seed=1, probes=10) | - |
  156. 137.22 s gammaloop-nextest-integration> +------------------+------------------------+--------------+--------+----------+----------------------------------------------------------------------------------------------------------------------+-------+
  157. 137.22 s gammaloop-nextest-integration> | sunrise_scalar_1 | integrated.relerr | integrated | pass | - | relative error 9.20% <= 10.00% | - |
  158. 137.22 s gammaloop-nextest-integration> +------------------+------------------------+--------------+--------+----------+----------------------------------------------------------------------------------------------------------------------+-------+
  159. 137.22 s gammaloop-nextest-integration> | sunrise_scalar_1 | m_uv.integrated.relerr | m_uv-shifted | pass | - | relative error 5.89% <= 10.00% | - |
  160. 137.22 s gammaloop-nextest-integration> +------------------+------------------------+--------------+--------+----------+----------------------------------------------------------------------------------------------------------------------+-------+
  161. 137.22 s gammaloop-nextest-integration> | sunrise_scalar_1 | target | - | pass | - | 2sigma | - |
  162. 137.22 s gammaloop-nextest-integration> +------------------+------------------------+--------------+--------+----------+----------------------------------------------------------------------------------------------------------------------+-------+
  163. 137.22 s gammaloop-nextest-integration> test sunrise_scalar_1_uv ... FAILED
  164. 137.22 s gammaloop-nextest-integration>
  165. 137.22 s gammaloop-nextest-integration> failures:
  166. 137.22 s gammaloop-nextest-integration>
  167. 137.22 s gammaloop-nextest-integration> failures:
  168. 137.22 s gammaloop-nextest-integration> sunrise_scalar_1_uv
  169. 137.22 s gammaloop-nextest-integration>
  170. 137.22 s gammaloop-nextest-integration> test result: FAILED. 0 passed; 1 failed; 0 ignored; 0 measured; 24 filtered out; finished in 94.19s
  171. 137.23 s gammaloop-nextest-integration> system-err
  172. 137.23 s gammaloop-nextest-integration> [2026-08-28 15:30:58.776] @gammaloop_api::se... INFO : Running command run generate
  173. 137.23 s gammaloop-nextest-integration> [2026-08-28 15:30:58.776] @gammaloop_api::se... INFO : Starting command block generate
  174. 137.23 s gammaloop-nextest-integration> [2026-08-28 15:30:58.776] @gammaloop_api::se... INFO : Running command import model scalars-default.json
  175. 137.23 s gammaloop-nextest-integration> [2026-08-28 15:30:58.777] @import::model INFO : Loading built-in JSON model scalars-default
  176. 137.23 s gammaloop-nextest-integration> [2026-08-28 15:30:58.780] @gammalooprs::model INFO : The following 2 external parameters were forced to zero by the restriction card:
  177. 137.23 s gammaloop-nextest-integration> width_scalar_1, width_scalar_2
  178. 137.23 s gammaloop-nextest-integration> [2026-08-28 15:30:58.781] @gammaloop_api::se... INFO : Running command remove processes
  179. 137.23 s gammaloop-nextest-integration> [2026-08-28 15:30:58.781] @gammaloop_api::se... INFO : Running command set global kv global.generation.uv.generate_integrated=true
  180. 137.23 s gammaloop-nextest-integration> [2026-08-28 15:30:58.781] @gammaloop_api::se... INFO : Running command import graphs ./tests/resources/graphs/scalar_sunrise.dot -p sunrise_scalar_1 -i scalar_sunrise
  181. 137.23 s gammaloop-nextest-integration> [2026-08-28 15:30:58.781] @commands::import INFO : Loading graphs from '/build/source/tests/resources/graphs/scalar_sunrise.dot'
  182. 137.23 s gammaloop-nextest-integration> [2026-08-28 15:30:58.784] @gammaloop_api::se... INFO : Running command generate existing -p sunrise_scalar_1 -i scalar_sunrise
  183. 137.23 s gammaloop-nextest-integration> [2026-08-28 15:30:58.786] @approx::local_4d [{#uv, #inspect, #integrated}] DEBUG : Rescaled momenta expanded
  184. 137.23 s gammaloop-nextest-integration> field value
  185. 137.23 s gammaloop-nextest-integration> res n-terms: 1, byte size: 777,expr:
  186. 137.23 s gammaloop-nextest-integration> 1/(denom(0,q₀/t,mass_scalar_1²,-mass_scalar_1²+(q₀.q₀)/t²)·denom(1,q₁/t,mass_scalar_1²,-mass_scalar_1²+(q₁.q₁)/t²)
  187. 137.23 s gammaloop-nextest-integration> ·denom(2,q₄-q₀/t-q₁/t,mass_scalar_1²,
  188. 137.23 s gammaloop-nextest-integration> -mass_scalar_1²-2·(q₀.q₄)/t-2·(q₁.q₄)/t+(q₀.q₀)/t²+2·(q₀.q₁)/t²
  189. 137.23 s gammaloop-nextest-integration> +(q₁.q₁)/t²+(q₄.q₄)
  190. 137.23 s gammaloop-nextest-integration> ))
  191. 137.23 s gammaloop-nextest-integration> [2026-08-28 15:30:58.794] @approx::local_4d [{#uv, #inspect, #integrated}] DEBUG : Rescaled momenta expanded
  192. 137.23 s gammaloop-nextest-integration> field value
  193. 137.23 s gammaloop-nextest-integration> res n-terms: 1, byte size: 611,expr:
  194. 137.23 s gammaloop-nextest-integration> 1/(denom(0,q₀/t,mass_scalar_1²,-mass_scalar_1²+(q₀.q₀)/t²)
  195. 137.23 s gammaloop-nextest-integration> ·denom(1,-q₂+q₃-q₀/t,mass_scalar_1²,
  196. 137.23 s gammaloop-nextest-integration> -mass_scalar_1²+2·(q₀.q₂)/t-2·(q₀.q₃)/t+(q₀.q₀)/t²+(q₂.q₂)
  197. 137.23 s gammaloop-nextest-integration> -2·(q₂.q₃)+(q₃.q₃)
  198. 137.23 s gammaloop-nextest-integration> ))
  199. 137.23 s gammaloop-nextest-integration> [2026-08-28 15:30:58.795] @approx::local_4d [{#uv, #inspect, #integrated}] DEBUG : Rescaled momenta expanded
  200. 137.23 s gammaloop-nextest-integration> field value
  201. 137.23 s gammaloop-nextest-integration> res n-terms: 1, byte size: 611,expr:
  202. 137.23 s gammaloop-nextest-integration> 1/(denom(1,q₁/t,mass_scalar_1²,-mass_scalar_1²+(q₁.q₁)/t²)
  203. 137.23 s gammaloop-nextest-integration> ·denom(2,-q₀+q₃-q₁/t,mass_scalar_1²,
  204. 137.23 s gammaloop-nextest-integration> -mass_scalar_1²+2·(q₀.q₁)/t-2·(q₁.q₃)/t+(q₁.q₁)/t²+(q₀.q₀)
  205. 137.23 s gammaloop-nextest-integration> -2·(q₀.q₃)+(q₃.q₃)
  206. 137.23 s gammaloop-nextest-integration> ))
  207. 137.23 s gammaloop-nextest-integration> [2026-08-28 15:30:58.796] @approx::local_4d [{#uv, #inspect, #integrated}] DEBUG : Rescaled momenta expanded
  208. 137.23 s gammaloop-nextest-integration> field value
  209. 137.23 s gammaloop-nextest-integration> res n-terms: 1, byte size: 3,expr:
  210. 137.23 s gammaloop-nextest-integration> 1
  211. 137.23 s gammaloop-nextest-integration> [2026-08-28 15:30:58.797] @approx::local_4d [{#uv, #inspect, #integrated}] DEBUG : Rescaled momenta expanded
  212. 137.23 s gammaloop-nextest-integration> field value
  213. 137.23 s gammaloop-nextest-integration> res n-terms: 1, byte size: 611,expr:
  214. 137.23 s gammaloop-nextest-integration> 1/(denom(0,q₀/t,mass_scalar_1²,-mass_scalar_1²+(q₀.q₀)/t²)
  215. 137.23 s gammaloop-nextest-integration> ·denom(2,-q₁+q₃-q₀/t,mass_scalar_1²,
  216. 137.23 s gammaloop-nextest-integration> -mass_scalar_1²+2·(q₀.q₁)/t-2·(q₀.q₃)/t+(q₀.q₀)/t²+(q₁.q₁)
  217. 137.23 s gammaloop-nextest-integration> -2·(q₁.q₃)+(q₃.q₃)
  218. 137.23 s gammaloop-nextest-integration> ))
  219. 137.23 s gammaloop-nextest-integration> [2026-08-28 15:30:58.798] @approx::final_integrand[{#generation, #profile, #uv, #graph, #summary}] DEBUG : Computed global numerator
  220. 137.23 s gammaloop-nextest-integration> field value
  221. 137.23 s gammaloop-nextest-integration> global_num n-terms: 1, byte size: 3,expr:
  222. 137.23 s gammaloop-nextest-integration> 1
  223. 137.23 s gammaloop-nextest-integration> span build_3d{span_context=true graph=sunrise current=subgraph=0, topo_order=0, dod=0}
  224. 137.23 s gammaloop-nextest-integration> [2026-08-28 15:30:58.799] @uv::approx [{#generation, #uv, #fourd}] DEBUG : Computing 4D
  225. 137.23 s gammaloop-nextest-integration> field value
  226. 137.23 s gammaloop-nextest-integration> simple subgraph(S_47,S_44)*Approx(subgraph(S_44,0)) of sunrise
  227. 137.23 s gammaloop-nextest-integration> span compute_4d{span_context=true graph=sunrise current=subgraph=44, topo_order=1, dod=2 given=subgraph=0, topo_order=0, dod=0 reduced=SubSet { set: BitVec<usize, bitvec::order::Lsb0> { addr: 0x7fffec00c0b0, head: 000000, bits: 8, capacity: 64 } [0, 0, 1, 1, 1, 1, 1, 1], id: PhantomData<linnet::half_edge::involution::Hedge> }}
  228. 137.23 s gammaloop-nextest-integration> [2026-08-28 15:30:58.800] @approx::local_4d [{#uv, #algebra, #integrated, #start}] DEBUG :
  229. 137.23 s gammaloop-nextest-integration> field value
  230. 137.23 s gammaloop-nextest-integration> integrand n-terms: 1, byte size: 322,expr:
  231. 137.23 s gammaloop-nextest-integration> 1/(denom(0,q₀,mass_scalar_1²,-mass_scalar_1²+(q₀.q₀))·denom(1,q₁,mass_scalar_1²,-mass_scalar_1²+(q₁.q₁))
  232. 137.23 s gammaloop-nextest-integration> ·denom(2,q₂,mass_scalar_1²,-mass_scalar_1²+(q₂.q₂)))
  233. 137.23 s gammaloop-nextest-integration> reduced 44
  234. 137.23 s gammaloop-nextest-integration> span grow{span_context=true current=subgraph=44, topo_order=1, dod=2 given=subgraph=0, topo_order=0, dod=0}
  235. 137.23 s gammaloop-nextest-integration> [2026-08-28 15:30:58.800] @approx::local_4d [{#uv, #inspect, #integrated}] DEBUG : Rescaled momenta expanded
  236. 137.23 s gammaloop-nextest-integration> field value
  237. 137.23 s gammaloop-nextest-integration> res n-terms: 1, byte size: 777,expr:
  238. 137.23 s gammaloop-nextest-integration> 1/(denom(0,q₀/t,mass_scalar_1²,-mass_scalar_1²+(q₀.q₀)/t²)·denom(1,q₁/t,mass_scalar_1²,-mass_scalar_1²+(q₁.q₁)/t²)
  239. 137.23 s gammaloop-nextest-integration> ·denom(2,q₄-q₀/t-q₁/t,mass_scalar_1²,
  240. 137.23 s gammaloop-nextest-integration> -mass_scalar_1²-2·(q₀.q₄)/t-2·(q₁.q₄)/t+(q₀.q₀)/t²+2·(q₀.q₁)/t²
  241. 137.23 s gammaloop-nextest-integration> +(q₁.q₁)/t²+(q₄.q₄)
  242. 137.23 s gammaloop-nextest-integration> ))
  243. 137.23 s gammaloop-nextest-integration> span t{span_context=true current=subgraph=44, topo_order=1, dod=2 given=subgraph=0, topo_order=0, dod=0}
  244. 137.23 s gammaloop-nextest-integration> [2026-08-28 15:30:58.800] @approx::local_4d [{#uv, #integrated, #rescaled}] DEBUG : Rescaled expanded
  245. 137.23 s gammaloop-nextest-integration> field value
  246. 137.23 s gammaloop-nextest-integration> n_loops 2
  247. 137.23 s gammaloop-nextest-integration> res n-terms: 1, byte size: 982,expr:
  248. 137.23 s gammaloop-nextest-integration> 1/(t²
  249. 137.23 s gammaloop-nextest-integration> ·denom(2,-q₀-q₁,mUVexp²+t²·mass_scalar_1²,
  250. 137.23 s gammaloop-nextest-integration> -mUV²
  251. 137.23 s gammaloop-nextest-integration> +t²
  252. 137.23 s gammaloop-nextest-integration> ·(-mass_scalar_1²-2·(q₀.q₄)/t-2·(q₁.q₄)/t+(q₀.q₀)/t²+2·(q₀.q₁)/t²
  253. 137.23 s gammaloop-nextest-integration> +(q₁.q₁)/t²+(q₄.q₄)
  254. 137.23 s gammaloop-nextest-integration> )
  255. 137.23 s gammaloop-nextest-integration> +t²·mUVexp²
  256. 137.23 s gammaloop-nextest-integration> )
  257. 137.23 s gammaloop-nextest-integration> ·denom(0,q₀,mUVexp²+t²·mass_scalar_1²,-mUV²+t²·(-mass_scalar_1²+(q₀.q₀)/t²)+t²·mUVexp²)
  258. 137.23 s gammaloop-nextest-integration> ·denom(1,q₁,mUVexp²+t²·mass_scalar_1²,-mUV²+t²·(-mass_scalar_1²+(q₁.q₁)/t²)+t²·mUVexp²))
  259. 137.23 s gammaloop-nextest-integration> span t{span_context=true current=subgraph=44, topo_order=1, dod=2 given=subgraph=0, topo_order=0, dod=0}
  260. 137.23 s gammaloop-nextest-integration> [2026-08-28 15:30:58.801] @approx::local_4d [{#uv, #integrated, #series}] DEBUG : Series expanded
  261. 137.23 s gammaloop-nextest-integration> field value
  262. 137.23 s gammaloop-nextest-integration> res n-terms: 4, byte size: 3187,expr:
  263. 137.23 s gammaloop-nextest-integration> -1/2·(2·mUVexp²-2·mass_scalar_1²)
  264. 137.23 s gammaloop-nextest-integration> /(denom(0,q₀,mUVexp²,-mUV²+(q₀.q₀))·denom(1,q₁,mUVexp²,-mUV²+(q₁.q₁))²
  265. 137.23 s gammaloop-nextest-integration> ·denom(2,-q₀-q₁,mUVexp²,-mUV²+(q₀.q₀)+2·(q₀.q₁)+(q₁.q₁)))
  266. 137.23 s gammaloop-nextest-integration> +(-1/2·(2·mUVexp²-2·mass_scalar_1²)
  267. 137.23 s gammaloop-nextest-integration> /(denom(0,q₀,mUVexp²,-mUV²+(q₀.q₀))²
  268. 137.23 s gammaloop-nextest-integration> ·denom(2,-q₀-q₁,mUVexp²,-mUV²+(q₀.q₀)+2·(q₀.q₁)+(q₁.q₁)))
  269. 137.23 s gammaloop-nextest-integration> +(-1/2·(2·mUVexp²-2·mass_scalar_1²+2·(q₄.q₄))
  270. 137.23 s gammaloop-nextest-integration> /denom(2,-q₀-q₁,mUVexp²,-mUV²+(q₀.q₀)+2·(q₀.q₁)+(q₁.q₁))
  271. 137.23 s gammaloop-nextest-integration> +(-2·(q₀.q₄)-2·(q₁.q₄))²
  272. 137.23 s gammaloop-nextest-integration> /denom(2,-q₀-q₁,mUVexp²,-mUV²+(q₀.q₀)+2·(q₀.q₁)+(q₁.q₁))²
  273. 137.23 s gammaloop-nextest-integration> )
  274. 137.23 s gammaloop-nextest-integration> /(denom(0,q₀,mUVexp²,-mUV²+(q₀.q₀))
  275. 137.23 s gammaloop-nextest-integration> ·denom(2,-q₀-q₁,mUVexp²,-mUV²+(q₀.q₀)+2·(q₀.q₁)+(q₁.q₁)))
  276. 137.23 s gammaloop-nextest-integration> )/denom(1,q₁,mUVexp²,-mUV²+(q₁.q₁))
  277. 137.23 s gammaloop-nextest-integration> -(-2·(q₀.q₄)-2·(q₁.q₄))
  278. 137.23 s gammaloop-nextest-integration> /(t·denom(0,q₀,mUVexp²,-mUV²+(q₀.q₀))·denom(1,q₁,mUVexp²,-mUV²+(q₁.q₁))
  279. 137.23 s gammaloop-nextest-integration> ·denom(2,-q₀-q₁,mUVexp²,-mUV²+(q₀.q₀)+2·(q₀.q₁)+(q₁.q₁))²)
  280. 137.23 s gammaloop-nextest-integration> +1/(t²·denom(0,q₀,mUVexp²,-mUV²+(q₀.q₀))·denom(1,q₁,mUVexp²,-mUV²+(q₁.q₁))
  281. 137.23 s gammaloop-nextest-integration> ·denom(2,-q₀-q₁,mUVexp²,-mUV²+(q₀.q₀)+2·(q₀.q₁)+(q₁.q₁)))
  282. 137.23 s gammaloop-nextest-integration> span t{span_context=true current=subgraph=44, topo_order=1, dod=2 given=subgraph=0, topo_order=0, dod=0}
  283. 137.23 s gammaloop-nextest-integration> [2026-08-28 15:30:58.802] @approx::local_4d [{#uv, #integrated, #series}] DEBUG : Evaluated at t = 1
  284. 137.23 s gammaloop-nextest-integration> field value
  285. 137.23 s gammaloop-nextest-integration> res n-terms: 4, byte size: 3171,expr:
  286. 137.23 s gammaloop-nextest-integration> -1/2·(2·mUVexp²-2·mass_scalar_1²)
  287. 137.23 s gammaloop-nextest-integration> /(denom(0,q₀,mUVexp²,-mUV²+(q₀.q₀))·denom(1,q₁,mUVexp²,-mUV²+(q₁.q₁))²
  288. 137.23 s gammaloop-nextest-integration> ·denom(2,-q₀-q₁,mUVexp²,-mUV²+(q₀.q₀)+2·(q₀.q₁)+(q₁.q₁)))
  289. 137.23 s gammaloop-nextest-integration> -(-2·(q₀.q₄)-2·(q₁.q₄))
  290. 137.23 s gammaloop-nextest-integration> /(denom(0,q₀,mUVexp²,-mUV²+(q₀.q₀))·denom(1,q₁,mUVexp²,-mUV²+(q₁.q₁))
  291. 137.23 s gammaloop-nextest-integration> ... omitted 20095 more lines; see full nextest output above
  292. 137.23 s gammaloop-nextest-integration>
  293. 137.23 s gammaloop-nextest-integration> 9. gammaloop-integration-tests::uv::se1l_uv
  294. 137.23 s gammaloop-nextest-integration> failure: test failure with exit code 101
  295. 137.23 s gammaloop-nextest-integration> system-out
  296. 137.23 s gammaloop-nextest-integration> running 1 test
  297. 137.23 s gammaloop-nextest-integration> test se1l_uv has been running for over 60 seconds
  298. 137.23 s gammaloop-nextest-integration> +------+-----------------+---------+--------+----------+-----------------------------------------------------------------------------------------------------------------------+-------+
  299. 137.23 s gammaloop-nextest-integration> | case | check | graph | status | sigma | threshold | error |
  300. 137.23 s gammaloop-nextest-integration> +------+-----------------+---------+--------+----------+-----------------------------------------------------------------------------------------------------------------------+-------+
  301. 137.23 s gammaloop-nextest-integration> | se1l | uv_profile | - | FAIL | - | - | - |
  302. 137.23 s gammaloop-nextest-integration> +------+-----------------+---------+--------+----------+-----------------------------------------------------------------------------------------------------------------------+-------+
  303. 137.23 s gammaloop-nextest-integration> | se1l | m_uv.inspect | inspect | pass | - | best inspect relative delta 1.097e-1 >= 1000*accuracy 1.000e-7 (accuracy=1.000e-10, exponent=+2.0, seed=1, probes=10) | - |
  304. 137.23 s gammaloop-nextest-integration> +------+-----------------+---------+--------+----------+-----------------------------------------------------------------------------------------------------------------------+-------+
  305. 137.23 s gammaloop-nextest-integration> | se1l | m_uv.integrated | se1l | pass | 0.1sigma | compatible within 2sigma | - |
  306. 137.23 s gammaloop-nextest-integration> +------+-----------------+---------+--------+----------+-----------------------------------------------------------------------------------------------------------------------+-------+
  307. 137.23 s gammaloop-nextest-integration> | se1l | rls.inspect | inspect | pass | - | best inspect relative delta 4.499e-2 >= 1000*accuracy 1.000e-7 (accuracy=1.000e-10, exponent=+2.0, seed=1, probes=10) | - |
  308. 137.23 s gammaloop-nextest-integration> +------+-----------------+---------+--------+----------+-----------------------------------------------------------------------------------------------------------------------+-------+
  309. 137.23 s gammaloop-nextest-integration> | se1l | rls.integrated | se1l | pass | 0.0sigma | compatible within 2sigma | - |
  310. 137.23 s gammaloop-nextest-integration> +------+-----------------+---------+--------+----------+-----------------------------------------------------------------------------------------------------------------------+-------+
  311. 137.23 s gammaloop-nextest-integration> | se1l | mu_r.inspect | inspect | pass | - | best inspect relative delta 1.424e-1 >= 1000*accuracy 1.000e-7 (accuracy=1.000e-10, exponent=+2.0, seed=1, probes=10) | - |
  312. 137.23 s gammaloop-nextest-integration> +------+-----------------+---------+--------+----------+-----------------------------------------------------------------------------------------------------------------------+-------+
  313. 137.23 s gammaloop-nextest-integration> | se1l | target | - | pass | - | 2sigma | - |
  314. 137.23 s gammaloop-nextest-integration> +------+-----------------+---------+--------+----------+-----------------------------------------------------------------------------------------------------------------------+-------+
  315. 137.23 s gammaloop-nextest-integration> test se1l_uv ... FAILED
  316. 137.23 s gammaloop-nextest-integration>
  317. 137.23 s gammaloop-nextest-integration> failures:
  318. 137.23 s gammaloop-nextest-integration>
  319. 137.23 s gammaloop-nextest-integration> failures:
  320. 137.23 s gammaloop-nextest-integration> se1l_uv
  321. 137.23 s gammaloop-nextest-integration>
  322. 137.23 s gammaloop-nextest-integration> test result: FAILED. 0 passed; 1 failed; 0 ignored; 0 measured; 24 filtered out; finished in 105.99s
  323. 137.23 s gammaloop-nextest-integration> system-err
  324. 137.23 s gammaloop-nextest-integration> [2026-08-28 15:30:58.202] @gammaloop_api::se... INFO : Running command run generate
  325. 137.23 s gammaloop-nextest-integration> [2026-08-28 15:30:58.202] @gammaloop_api::se... INFO : Starting command block generate
  326. 137.23 s gammaloop-nextest-integration> [2026-08-28 15:30:58.203] @gammaloop_api::se... INFO : Running command import model sm-default
  327. 137.23 s gammaloop-nextest-integration> [2026-08-28 15:30:58.203] @import::model INFO : Loading built-in JSON model sm-default
  328. 137.23 s gammaloop-nextest-integration> [2026-08-28 15:30:58.243] @gammalooprs::model INFO : The following 11 external parameters were forced to zero by the restriction card:
  329. 137.23 s gammaloop-nextest-integration> lamWS, AWS, rhoWS, etaWS, ymc, yme, ymm, MC, Me, MM, WTau
  330. 137.23 s gammaloop-nextest-integration> [2026-08-28 15:30:58.243] @gammalooprs::model INFO : The following 34 vertex rules were removed by the restriction card:
  331. 137.23 s gammaloop-nextest-integration> V_82 -> (c~, d, G+) | V_83 -> (t~, d, G+) | V_84 -> (c~, s, G+) | V_85 -> (t~, s, G+) | V_86 -> (u~, b, G+) | V_87 -> (c~, b, G+) | V_90 -> (c~, d, W+) | V_91 -> (t~, d, W+) | V_92 -> (u~, s, W+) | V_94 -> (t~, s, W+) | V_95 -> (u~, b, W+) | V_96 -> (c~, b, W+) | V_101 -> (e+, e-, G0) | V_102 -> (mu+, mu-, G0) | V_104 -> (e+, e-, H) | V_105 -> (mu+, mu-, H) | V_110 -> (ve~, e-, G+) | V_111 -> (vm~, mu-, G+) | V_116 -> (b~, u, G-) | V_117 -> (d~, c, G-) | V_118 -> (s~, c, G-) | V_119 -> (b~, c, G-) | V_120 -> (d~, t, G-) | V_121 -> (s~, t, G-) | V_124 -> (s~, u, W-) | V_125 -> (b~, u, W-) | V_126 -> (d~, c, W-) | V_128 -> (b~, c, W-) | V_129 -> (d~, t, W-) | V_130 -> (s~, t, W-) | V_138 -> (c~, c, G0) | V_140 -> (c~, c, H) | V_145 -> (e+, ve, G-) | V_146 -> (mu+, vm, G-)
  332. 137.23 s gammaloop-nextest-integration> [2026-08-28 15:30:58.243] @gammalooprs::model INFO : The following 36 couplings were removed by the restriction card:
  333. 137.23 s gammaloop-nextest-integration> GC_13, GC_14, GC_16, GC_17, GC_18, GC_19, GC_20, GC_22, GC_23, GC_24, GC_25, GC_26, GC_28, GC_29, GC_42, GC_43, GC_44, GC_46, GC_47, GC_48, GC_84, GC_85, GC_86, GC_87, GC_88, GC_89, GC_90, GC_91, GC_92, GC_93, GC_101, GC_102, GC_103, GC_105, GC_106, GC_107
  334. 137.23 s gammaloop-nextest-integration> [2026-08-28 15:30:58.243] @gammaloop_api::se... INFO : Running command remove processes
  335. 137.23 s gammaloop-nextest-integration> [2026-08-28 15:30:58.243] @gammaloop_api::se... INFO : Running command set global kv global.generation.uv.generate_integrated=true
  336. 137.23 s gammaloop-nextest-integration> [2026-08-28 15:30:58.247] @gammaloop_api::se... INFO : Running command import graphs ./tests/resources/graphs/uv_tests/se1l.dot -p se1l -i se1l
  337. 137.23 s gammaloop-nextest-integration> [2026-08-28 15:30:58.247] @commands::import INFO : Loading graphs from '/build/source/tests/resources/graphs/uv_tests/se1l.dot'
  338. 137.23 s gammaloop-nextest-integration> [2026-08-28 15:30:58.253] @gammaloop_api::se... INFO : Running command generate existing -p se1l -i se1l
  339. 137.23 s gammaloop-nextest-integration> [2026-08-28 15:30:59.214] @commands::generate INFO :
  340. 137.23 s gammaloop-nextest-integration> Integrand generation summary
  341. 137.23 s gammaloop-nextest-integration> peak RAM 90.03 MiB | cores 1
  342. 137.23 s gammaloop-nextest-integration> ╭───────────┬───────┬─────────┬─────────────┬─────────────┬────────────────┬─────────────╮
  343. 137.23 s gammaloop-nextest-integration> │ integrand │ graph │ # evals │ expr build │ spenso │ symbolica eval │ compile │
  344. 137.23 s gammaloop-nextest-integration> ├───────────┼───────┼─────────┼─────────────┼─────────────┼────────────────┼─────────────┤
  345. 137.23 s gammaloop-nextest-integration> │ se1l │ se1l │ 5 │ 767ms (83%) │ 54ms (5.9%) │ 99ms (11%) │ 0ms (0.00%) │
  346. 137.23 s gammaloop-nextest-integration> ├───────────┼───────┼─────────┼─────────────┼─────────────┼────────────────┼─────────────┤
  347. 137.23 s gammaloop-nextest-integration> │ Total │ │ 5 │ 767ms (83%) │ 54ms (5.9%) │ 99ms (11%) │ 0ms (0.00%) │
  348. 137.23 s gammaloop-nextest-integration> ╰───────────┴───────┴─────────┴─────────────┴─────────────┴────────────────┴─────────────╯
  349. 137.23 s gammaloop-nextest-integration> [2026-08-28 15:30:59.214] @gammaloop_api::se... INFO : Running command set process -p se1l -i se1l kv general.m_uv=0.2
  350. 137.23 s gammaloop-nextest-integration> [2026-08-28 15:30:59.215] @gammaloop_api::se... INFO : Running command set process -p se1l -i se1l kv general.mu_r=0.2
  351. 137.23 s gammaloop-nextest-integration> [2026-08-28 15:30:59.216] @gammaloop_api::se... INFO : Running command set process -p se1l -i se1l kv general.renormalization_localization_scale=0.2
  352. 137.23 s gammaloop-nextest-integration> [2026-08-28 15:30:59.217] @gammaloop_api::se... INFO : Running command duplicate integrand -p se1l -i se1l --output_process_name se1l --output_integrand_name se1l_muv_shifted
  353. 137.23 s gammaloop-nextest-integration> [2026-08-28 15:30:59.218] @gammaloop_api::se... INFO : Running command set process -p se1l -i se1l_muv_shifted kv general.m_uv=0.5
  354. 137.23 s gammaloop-nextest-integration> [2026-08-28 15:30:59.219] @gammaloop_api::se... INFO : Running command duplicate integrand -p se1l -i se1l --output_process_name se1l --output_integrand_name se1l_rls_shifted
  355. 137.23 s gammaloop-nextest-integration> [2026-08-28 15:30:59.221] @gammaloop_api::se... INFO : Running command set process -p se1l -i se1l_rls_shifted kv general.renormalization_localization_scale=1
  356. 137.23 s gammaloop-nextest-integration> [2026-08-28 15:30:59.222] @gammaloop_api::se... INFO : Running command duplicate integrand -p se1l -i se1l --output_process_name se1l --output_integrand_name se1l_mur_shifted
  357. 137.23 s gammaloop-nextest-integration> [2026-08-28 15:30:59.224] @gammaloop_api::se... INFO : Running command set process -p se1l -i se1l_mur_shifted kv general.mu_r=0.8
  358. 137.23 s gammaloop-nextest-integration> [2026-08-28 15:30:59.229] @process::amplitude WARNING : External state 0 ('g', PDG 21, helicity +) is off shell: p^2 = +2.5e5, expected m^2 = +0e0 (|Δ| = +2.5e5). Fixed-helicity spinor/vector/tensor external states may be ill-defined at this kinematic point.
  359. 137.23 s gammaloop-nextest-integration> field value
  360. 137.23 s gammaloop-nextest-integration> span warm_up{integrand.name=se1l}
  361. 137.23 s gammaloop-nextest-integration> [2026-08-28 15:30:59.229] @process::amplitude WARNING : External state 1 ('g', PDG 21, helicity -) is off shell: p^2 = +2.5e5, expected m^2 = +0e0 (|Δ| = +2.5e5). Fixed-helicity spinor/vector/tensor external states may be ill-defined at this kinematic point.
  362. 137.23 s gammaloop-nextest-integration> field value
  363. 137.23 s gammaloop-nextest-integration> span warm_up{integrand.name=se1l}
  364. 137.23 s gammaloop-nextest-integration> [2026-08-28 15:30:59.229] @process::amplitude INFO : Input is above threshold: 1 existing threshold E-surfaces across 1/1 graph groups
  365. 137.23 s gammaloop-nextest-integration> field value
  366. 137.23 s gammaloop-nextest-integration> existing_esurfaces 1
  367. 137.23 s gammaloop-nextest-integration> group_count 1
  368. 137.23 s gammaloop-nextest-integration> groups_above_threshold 1
  369. 137.23 s gammaloop-nextest-integration> integrand se1l
  370. 137.23 s gammaloop-nextest-integration> span warm_up{integrand.name=se1l}
  371. 137.23 s gammaloop-nextest-integration> threshold_status above threshold
  372. 137.23 s gammaloop-nextest-integration> [2026-08-28 15:30:59.229] @process::amplitude INFO : overlap structure of group 0: [1: [0(2,3)]]
  373. 137.23 s gammaloop-nextest-integration> field value
  374. 137.23 s gammaloop-nextest-integration> span warm_up{integrand.name=se1l}
  375. 137.23 s gammaloop-nextest-integration> [2026-08-28 15:30:59.460] @commands::profile INFO :
  376. 137.23 s gammaloop-nextest-integration> ╭───────┬──────┬──────────┬───────┬─────┬──────────┬───────────╮
  377. 137.23 s gammaloop-nextest-integration> │ fixed │ → ∞ │ slope │ r2 │ DOD │ bare DOD │ inspect │
  378. 137.23 s gammaloop-nextest-integration> ├───────┼──────┼──────────┼───────┼─────┼──────────┼───────────┤
  379. 137.23 s gammaloop-nextest-integration> │ {} │ {e3} │ 1.639236 │ 0.904 │ 2 │ 2 │ arb retry │
  380. 137.23 s gammaloop-nextest-integration> │ {} │ {e2} │ 1.698834 │ 0.902 │ 2 │ 2 │ arb retry │
  381. 137.23 s gammaloop-nextest-integration> ╰───────┴──────┴──────────┴───────┴─────┴──────────┴───────────╯
  382. 137.23 s gammaloop-nextest-integration> [2026-08-28 15:30:59.460] @commands::profile INFO :
  383. 137.23 s gammaloop-nextest-integration> ╭───────┬──────┬─────────────┬──────────┬───────┬─────┬──────────┬───────────╮
  384. 137.23 s gammaloop-nextest-integration> │ fixed │ → ∞ │ orientation │ slope │ r2 │ DOD │ bare DOD │ inspect │
  385. 137.23 s gammaloop-nextest-integration> ├───────┼──────┼─────────────┼──────────┼───────┼─────┼──────────┼───────────┤
  386. 137.23 s gammaloop-nextest-integration> │ {} │ {e3} │ 00-+ │ 0.343429 │ 0.145 │ 0 │ 2 │ arb retry │
  387. 137.23 s gammaloop-nextest-integration> │ {} │ {e3} │ 00+- │ 0.342577 │ 0.135 │ 0 │ 2 │ arb retry │
  388. 137.23 s gammaloop-nextest-integration> │ {} │ {e2} │ 00-+ │ 0.385975 │ 0.161 │ 0 │ 2 │ arb retry │
  389. 137.23 s gammaloop-nextest-integration> │ {} │ {e2} │ 00+- │ 0.384920 │ 0.192 │ 0 │ 2 │ arb retry │
  390. 137.23 s gammaloop-nextest-integration> ╰───────┴──────┴─────────────┴──────────┴───────┴─────┴──────────┴───────────╯
  391. 137.23 s gammaloop-nextest-integration> [2026-08-28 15:30:59.460] @gammaloop_api::se... INFO : Running command set process kv integrator.target_relative_accuracy=0.001 integrator.n_increase=0 integrator.n_start=50000 integrator.n_max=400000 integrator.seed=1337
  392. 137.23 s gammaloop-nextest-integration> [2026-08-28 15:30:59.461] @commands::integrate INFO : Created workspace directory at /build/source/tests/artifacts/se1l/integration_workspace_se1l
  393. 137.23 s gammaloop-nextest-integration> [2026-08-28 15:30:59.477] @commands::integrate INFO : No integration state found, starting new integration
  394. 137.23 s gammaloop-nextest-integration> [2026-08-28 15:30:59.477] @commands::integrate INFO : Gammaloop now integrates se1l@se1l, se1l@se1l_muv_shifted, se1l@se1l_rls_shifted
  395. 137.23 s gammaloop-nextest-integration> [2026-08-28 15:30:59.477] @process::amplitude WARNING : External state 0 ('g', PDG 21, helicity +) is off shell: p^2 = +2.5e5, expected m^2 = +0e0 (|Δ| = +2.5e5). Fixed-helicity spinor/vector/tensor external states may be ill-defined at this kinematic point.
  396. 137.23 s gammaloop-nextest-integration> field value
  397. 137.23 s gammaloop-nextest-integration> span warm_up{integrand.name=se1l}
  398. 137.23 s gammaloop-nextest-integration> [2026-08-28 15:30:59.477] @process::amplitude WARNING : External state 1 ('g', PDG 21, helicity -) is off shell: p^2 = +2.5e5, expected m^2 = +0e0 (|Δ| = +2.5e5). Fixed-helicity spinor/vector/tensor external states may be ill-defined at this kinematic point.
  399. 137.23 s gammaloop-nextest-integration> field value
  400. 137.23 s gammaloop-nextest-integration> span warm_up{integrand.name=se1l}
  401. 137.23 s gammaloop-nextest-integration> [2026-08-28 15:30:59.477] @process::amplitude INFO : Input is above threshold: 1 existing threshold E-surfaces across 1/1 graph groups
  402. 137.23 s gammaloop-nextest-integration> field value
  403. 137.23 s gammaloop-nextest-integration> existing_esurfaces 1
  404. 137.23 s gammaloop-nextest-integration> group_count 1
  405. 137.23 s gammaloop-nextest-integration> groups_above_threshold 1
  406. 137.23 s gammaloop-nextest-integration> integrand se1l
  407. 137.23 s gammaloop-nextest-integration> span warm_up{integrand.name=se1l}
  408. 137.23 s gammaloop-nextest-integration> threshold_status above threshold
  409. 137.23 s gammaloop-nextest-integration> [2026-08-28 15:30:59.477] @process::amplitude INFO : overlap structure of group 0: [1: [0(2,3)]]
  410. 137.23 s gammaloop-nextest-integration> field value
  411. 137.23 s gammaloop-nextest-integration> span warm_up{integrand.name=se1l}
  412. 137.23 s gammaloop-nextest-integration> [2026-08-28 15:30:59.478] @process::amplitude WARNING : External state 0 ('g', PDG 21, helicity +) is off shell: p^2 = +2.5e5, expected m^2 = +0e0 (|Δ| = +2.5e5). Fixed-helicity spinor/vector/tensor external states may be ill-defined at this kinematic point.
  413. 137.23 s gammaloop-nextest-integration> field value
  414. 137.23 s gammaloop-nextest-integration> span warm_up{integrand.name=se1l_muv_shifted}
  415. 137.23 s gammaloop-nextest-integration> [2026-08-28 15:30:59.478] @process::amplitude WARNING : External state 1 ('g', PDG 21, helicity -) is off shell: p^2 = +2.5e5, expected m^2 = +0e0 (|Δ| = +2.5e5). Fixed-helicity spinor/vector/tensor external states may be ill-defined at this kinematic point.
  416. 137.23 s gammaloop-nextest-integration> field value
  417. 137.23 s gammaloop-nextest-integration> span warm_up{integrand.name=se1l_muv_shifted}
  418. 137.23 s gammaloop-nextest-integration> [2026-08-28 15:30:59.479] @process::amplitude INFO : Input is above threshold: 1 existing threshold E-surfaces across 1/1 graph groups
  419. 137.23 s gammaloop-nextest-integration> field value
  420. 137.23 s gammaloop-nextest-integration> existing_esurfaces 1
  421. 137.23 s gammaloop-nextest-integration> group_count 1
  422. 137.23 s gammaloop-nextest-integration> groups_above_threshold 1
  423. 137.23 s gammaloop-nextest-integration> integrand se1l_muv_shifted
  424. 137.23 s gammaloop-nextest-integration> span warm_up{integrand.name=se1l_muv_shifted}
  425. 137.23 s gammaloop-nextest-integration> threshold_status above threshold
  426. 137.23 s gammaloop-nextest-integration> [2026-08-28 15:30:59.479] @process::amplitude INFO : overlap structure of group 0: [1: [0(2,3)]]
  427. 137.23 s gammaloop-nextest-integration> field value
  428. 137.23 s gammaloop-nextest-integration> span warm_up{integrand.name=se1l_muv_shifted}
  429. 137.23 s gammaloop-nextest-integration> [2026-08-28 15:30:59.480] @process::amplitude WARNING : External state 0 ('g', PDG 21, helicity +) is off shell: p^2 = +2.5e5, expected m^2 = +0e0 (|Δ| = +2.5e5). Fixed-helicity spinor/vector/tensor external states may be ill-defined at this kinematic point.
  430. 137.23 s gammaloop-nextest-integration> field value
  431. 137.23 s gammaloop-nextest-integration> span warm_up{integrand.name=se1l_rls_shifted}
  432. 137.23 s gammaloop-nextest-integration> [2026-08-28 15:30:59.480] @process::amplitude WARNING : External state 1 ('g', PDG 21, helicity -) is off shell: p^2 = +2.5e5, expected m^2 = +0e0 (|Δ| = +2.5e5). Fixed-helicity spinor/vector/tensor external states may be ill-defined at this kinematic point.
  433. 137.23 s gammaloop-nextest-integration> field value
  434. 137.23 s gammaloop-nextest-integration> span warm_up{integrand.name=se1l_rls_shifted}
  435. 137.23 s gammaloop-nextest-integration> [2026-08-28 15:30:59.480] @process::amplitude INFO : Input is above threshold: 1 existing threshold E-surfaces across 1/1 graph groups
  436. 137.23 s gammaloop-nextest-integration> field value
  437. 137.23 s gammaloop-nextest-integration> existing_esurfaces 1
  438. 137.23 s gammaloop-nextest-integration> group_count 1
  439. 137.23 s gammaloop-nextest-integration> groups_above_threshold 1
  440. 137.23 s gammaloop-nextest-integration> integrand se1l_rls_shifted
  441. 137.23 s gammaloop-nextest-integration> span warm_up{integrand.name=se1l_rls_shifted}
  442. 137.23 s gammaloop-nextest-integration> threshold_status above threshold
  443. 137.23 s gammaloop-nextest-integration> ... omitted 1410 more lines; see full nextest output above
  444. 137.23 s gammaloop-nextest-integration> =========================================
  445. 137.62 s [0 built (1 failed), 0.0error: Cannot build '/nix/store/5lvckp7qh3dqs2nqf61qj4kz6kj46p4q-gammaloop-nextest-integration.drv'.
  446. 137.62 s Reason: builder failed with exit code 100.
  447. 137.62 s Output paths:
  448. 137.62 s /nix/store/q9ndadp0vb7l2ihf07rjiriv26fb03g2-gammaloop-nextest-integration
  449. 137.62 s Last 2048 log lines:
  450. 137.62 s > span warm_up{integrand.name=se1l_muv_shifted}
  451. 137.62 s > threshold_status above threshold
  452. 137.62 s > [2026-08-28 15:32:43.850] @process::amplitude INFO : overlap structure of group 0: [1: [0(2,3)]]
  453. 137.62 s > field value
  454. 137.62 s > span warm_up{integrand.name=se1l_muv_shifted}
  455. 137.62 s > [2026-08-28 15:32:43.853] @process::amplitude WARNING : External state 0 ('g', PDG 21, helicity +) is off shell: p^2 = +2.5e5, expected m^2 = +0e0 (|Δ| = +2.5e5). Fixed-helicity spinor/vector/tensor external states may be ill-defined at this kinematic point.
  456. 137.62 s > field value
  457. 137.62 s > span warm_up{integrand.name=se1l}
  458. 137.62 s > [2026-08-28 15:32:43.853] @process::amplitude WARNING : External state 1 ('g', PDG 21, helicity -) is off shell: p^2 = +2.5e5, expected m^2 = +0e0 (|Δ| = +2.5e5). Fixed-helicity spinor/vector/tensor external states may be ill-defined at this kinematic point.
  459. 137.62 s > field value
  460. 137.62 s > span warm_up{integrand.name=se1l}
  461. 137.62 s > [2026-08-28 15:32:43.853] @process::amplitude INFO : Input is above threshold: 1 existing threshold E-surfaces across 1/1 graph groups
  462. 137.62 s > field value
  463. 137.62 s > existing_esurfaces 1
  464. 137.62 s > group_count 1
  465. 137.62 s > groups_above_threshold 1
  466. 137.62 s > integrand se1l
  467. 137.62 s > span warm_up{integrand.name=se1l}
  468. 137.62 s > threshold_status above threshold
  469. 137.62 s > [2026-08-28 15:32:43.853] @process::amplitude INFO : overlap structure of group 0: [1: [0(2,3)]]
  470. 137.62 s > field value
  471. 137.62 s > span warm_up{integrand.name=se1l}
  472. 137.62 s > [2026-08-28 15:32:43.857] @process::amplitude WARNING : External state 0 ('g', PDG 21, helicity +) is off shell: p^2 = +2.5e5, expected m^2 = +0e0 (|Δ| = +2.5e5). Fixed-helicity spinor/vector/tensor external states may be ill-defined at this kinematic point.
  473. 137.62 s > field value
  474. 137.62 s > span warm_up{integrand.name=se1l_muv_shifted}
  475. 137.62 s > [2026-08-28 15:32:43.857] @process::amplitude WARNING : External state 1 ('g', PDG 21, helicity -) is off shell: p^2 = +2.5e5, expected m^2 = +0e0 (|Δ| = +2.5e5). Fixed-helicity spinor/vector/tensor external states may be ill-defined at this kinematic point.
  476. 137.62 s > field value
  477. 137.62 s > span warm_up{integrand.name=se1l_muv_shifted}
  478. 137.62 s > [2026-08-28 15:32:43.857] @process::amplitude INFO : Input is above threshold: 1 existing threshold E-surfaces across 1/1 graph groups
  479. 137.62 s > field value
  480. 137.62 s > existing_esurfaces 1
  481. 137.62 s > group_count 1
  482. 137.62 s > groups_above_threshold 1
  483. 137.62 s > integrand se1l_muv_shifted
  484. 137.62 s > span warm_up{integrand.name=se1l_muv_shifted}
  485. 137.62 s > threshold_status above threshold
  486. 137.62 s > [2026-08-28 15:32:43.857] @process::amplitude INFO : overlap structure of group 0: [1: [0(2,3)]]
  487. 137.62 s > field value
  488. 137.62 s > span warm_up{integrand.name=se1l_muv_shifted}
  489. 137.62 s > [2026-08-28 15:32:43.861] @process::amplitude WARNING : External state 0 ('g', PDG 21, helicity +) is off shell: p^2 = +2.5e5, expected m^2 = +0e0 (|Δ| = +2.5e5). Fixed-helicity spinor/vector/tensor external states may be ill-defined at this kinematic point.
  490. 137.62 s > field value
  491. 137.62 s > span warm_up{integrand.name=se1l}
  492. 137.62 s > [2026-08-28 15:32:43.861] @process::amplitude WARNING : External state 1 ('g', PDG 21, helicity -) is off shell: p^2 = +2.5e5, expected m^2 = +0e0 (|Δ| = +2.5e5). Fixed-helicity spinor/vector/tensor external states may be ill-defined at this kinematic point.
  493. 137.62 s > field value
  494. 137.62 s > span warm_up{integrand.name=se1l}
  495. 137.62 s > [2026-08-28 15:32:43.861] @process::amplitude INFO : Input is above threshold: 1 existing threshold E-surfaces across 1/1 graph groups
  496. 137.62 s > field value
  497. 137.62 s > existing_esurfaces 1
  498. 137.62 s > group_count 1
  499. 137.62 s > groups_above_threshold 1
  500. 137.62 s > integrand se1l
  501. 137.62 s > span warm_up{integrand.name=se1l}
  502. 137.62 s > threshold_status above threshold
  503. 137.62 s > [2026-08-28 15:32:43.861] @process::amplitude INFO : overlap structure of group 0: [1: [0(2,3)]]
  504. 137.62 s > field value
  505. 137.62 s > span warm_up{integrand.name=se1l}
  506. 137.62 s > [2026-08-28 15:32:43.864] @process::amplitude WARNING : External state 0 ('g', PDG 21, helicity +) is off shell: p^2 = +2.5e5, expected m^2 = +0e0 (|Δ| = +2.5e5). Fixed-helicity spinor/vector/tensor external states may be ill-defined at this kinematic point.
  507. 137.62 s > field value
  508. 137.62 s > span warm_up{integrand.name=se1l_muv_shifted}
  509. 137.62 s > [2026-08-28 15:32:43.864] @process::amplitude WARNING : External state 1 ('g', PDG 21, helicity -) is off shell: p^2 = +2.5e5, expected m^2 = +0e0 (|Δ| = +2.5e5). Fixed-helicity spinor/vector/tensor external states may be ill-defined at this kinematic point.
  510. 137.62 s > field value
  511. 137.62 s > span warm_up{integrand.name=se1l_muv_shifted}
  512. 137.62 s > [2026-08-28 15:32:43.865] @process::amplitude INFO : Input is above threshold: 1 existing threshold E-surfaces across 1/1 graph groups
  513. 137.62 s > field value
  514. 137.62 s > existing_esurfaces 1
  515. 137.62 s > group_count 1
  516. 137.62 s > groups_above_threshold 1
  517. 137.62 s > integrand se1l_muv_shifted
  518. 137.62 s > span warm_up{integrand.name=se1l_muv_shifted}
  519. 137.62 s > threshold_status above threshold
  520. 137.62 s > [2026-08-28 15:32:43.865] @process::amplitude INFO : overlap structure of group 0: [1: [0(2,3)]]
  521. 137.62 s > field value
  522. 137.62 s > span warm_up{integrand.name=se1l_muv_shifted}
  523. 137.62 s > [2026-08-28 15:32:43.868] @process::amplitude WARNING : External state 0 ('g', PDG 21, helicity +) is off shell: p^2 = +2.5e5, expected m^2 = +0e0 (|Δ| = +2.5e5). Fixed-helicity spinor/vector/tensor external states may be ill-defined at this kinematic point.
  524. 137.62 s > field value
  525. 137.62 s > span warm_up{integrand.name=se1l}
  526. 137.62 s > [2026-08-28 15:32:43.868] @process::amplitude WARNING : External state 1 ('g', PDG 21, helicity -) is off shell: p^2 = +2.5e5, expected m^2 = +0e0 (|Δ| = +2.5e5). Fixed-helicity spinor/vector/tensor external states may be ill-defined at this kinematic point.
  527. 137.62 s > field value
  528. 137.62 s > span warm_up{integrand.name=se1l}
  529. 137.62 s > [2026-08-28 15:32:43.868] @process::amplitude INFO : Input is above threshold: 1 existing threshold E-surfaces across 1/1 graph groups
  530. 137.62 s > field value
  531. 137.62 s > existing_esurfaces 1
  532. 137.62 s > group_count 1
  533. 137.62 s > groups_above_threshold 1
  534. 137.62 s > integrand se1l
  535. 137.62 s > span warm_up{integrand.name=se1l}
  536. 137.62 s > threshold_status above threshold
  537. 137.62 s > [2026-08-28 15:32:43.868] @process::amplitude INFO : overlap structure of group 0: [1: [0(2,3)]]
  538. 137.62 s > field value
  539. 137.62 s > span warm_up{integrand.name=se1l}
  540. 137.62 s > [2026-08-28 15:32:43.872] @process::amplitude WARNING : External state 0 ('g', PDG 21, helicity +) is off shell: p^2 = +2.5e5, expected m^2 = +0e0 (|Δ| = +2.5e5). Fixed-helicity spinor/vector/tensor external states may be ill-defined at this kinematic point.
  541. 137.62 s > field value
  542. 137.62 s > span warm_up{integrand.name=se1l_muv_shifted}
  543. 137.62 s > [2026-08-28 15:32:43.872] @process::amplitude WARNING : External state 1 ('g', PDG 21, helicity -) is off shell: p^2 = +2.5e5, expected m^2 = +0e0 (|Δ| = +2.5e5). Fixed-helicity spinor/vector/tensor external states may be ill-defined at this kinematic point.
  544. 137.62 s > field value
  545. 137.62 s > span warm_up{integrand.name=se1l_muv_shifted}
  546. 137.62 s > [2026-08-28 15:32:43.872] @process::amplitude INFO : Input is above threshold: 1 existing threshold E-surfaces across 1/1 graph groups
  547. 137.62 s > field value
  548. 137.62 s > existing_esurfaces 1
  549. 137.62 s > group_count 1
  550. 137.62 s > groups_above_threshold 1
  551. 137.62 s > integrand se1l_muv_shifted
  552. 137.62 s > span warm_up{integrand.name=se1l_muv_shifted}
  553. 137.62 s > threshold_status above threshold
  554. 137.62 s > [2026-08-28 15:32:43.872] @process::amplitude INFO : overlap structure of group 0: [1: [0(2,3)]]
  555. 137.62 s > field value
  556. 137.62 s > span warm_up{integrand.name=se1l_muv_shifted}
  557. 137.62 s > [2026-08-28 15:32:43.876] @process::amplitude WARNING : External state 0 ('g', PDG 21, helicity +) is off shell: p^2 = +2.5e5, expected m^2 = +0e0 (|Δ| = +2.5e5). Fixed-helicity spinor/vector/tensor external states may be ill-defined at this kinematic point.
  558. 137.62 s > field value
  559. 137.62 s > span warm_up{integrand.name=se1l}
  560. 137.62 s > [2026-08-28 15:32:43.876] @process::amplitude WARNING : External state 1 ('g', PDG 21, helicity -) is off shell: p^2 = +2.5e5, expected m^2 = +0e0 (|Δ| = +2.5e5). Fixed-helicity spinor/vector/tensor external states may be ill-defined at this kinematic point.
  561. 137.62 s > field value
  562. 137.62 s > span warm_up{integrand.name=se1l}
  563. 137.62 s > [2026-08-28 15:32:43.876] @process::amplitude INFO : Input is above threshold: 1 existing threshold E-surfaces across 1/1 graph groups
  564. 137.62 s > field value
  565. 137.62 s > existing_esurfaces 1
  566. 137.62 s > group_count 1
  567. 137.62 s > groups_above_threshold 1
  568. 137.62 s > integrand se1l
  569. 137.62 s > span warm_up{integrand.name=se1l}
  570. 137.62 s > threshold_status above threshold
  571. 137.62 s > [2026-08-28 15:32:43.876] @process::amplitude INFO : overlap structure of group 0: [1: [0(2,3)]]
  572. 137.62 s > field value
  573. 137.62 s > span warm_up{integrand.name=se1l}
  574. 137.62 s > [2026-08-28 15:32:43.879] @process::amplitude WARNING : External state 0 ('g', PDG 21, helicity +) is off shell: p^2 = +2.5e5, expected m^2 = +0e0 (|Δ| = +2.5e5). Fixed-helicity spinor/vector/tensor external states may be ill-defined at this kinematic point.
  575. 137.62 s > field value
  576. 137.62 s > span warm_up{integrand.name=se1l_rls_shifted}
  577. 137.62 s > [2026-08-28 15:32:43.879] @process::amplitude WARNING : External state 1 ('g', PDG 21, helicity -) is off shell: p^2 = +2.5e5, expected m^2 = +0e0 (|Δ| = +2.5e5). Fixed-helicity spinor/vector/tensor external states may be ill-defined at this kinematic point.
  578. 137.62 s > field value
  579. 137.62 s > span warm_up{integrand.name=se1l_rls_shifted}
  580. 137.62 s > [2026-08-28 15:32:43.880] @process::amplitude INFO : Input is above threshold: 1 existing threshold E-surfaces across 1/1 graph groups
  581. 137.62 s > field value
  582. 137.62 s > existing_esurfaces 1
  583. 137.62 s > group_count 1
  584. 137.62 s > groups_above_threshold 1
  585. 137.62 s > integrand se1l_rls_shifted
  586. 137.62 s > span warm_up{integrand.name=se1l_rls_shifted}
  587. 137.62 s > threshold_status above threshold
  588. 137.62 s > [2026-08-28 15:32:43.880] @process::amplitude INFO : overlap structure of group 0: [1: [0(2,3)]]
  589. 137.62 s > field value
  590. 137.62 s > span warm_up{integrand.name=se1l_rls_shifted}
  591. 137.62 s > [2026-08-28 15:32:43.883] @process::amplitude WARNING : External state 0 ('g', PDG 21, helicity +) is off shell: p^2 = +2.5e5, expected m^2 = +0e0 (|Δ| = +2.5e5). Fixed-helicity spinor/vector/tensor external states may be ill-defined at this kinematic point.
  592. 137.62 s > field value
  593. 137.62 s > span warm_up{integrand.name=se1l}
  594. 137.62 s > [2026-08-28 15:32:43.883] @process::amplitude WARNING : External state 1 ('g', PDG 21, helicity -) is off shell: p^2 = +2.5e5, expected m^2 = +0e0 (|Δ| = +2.5e5). Fixed-helicity spinor/vector/tensor external states may be ill-defined at this kinematic point.
  595. 137.62 s > field value
  596. 137.62 s > span warm_up{integrand.name=se1l}
  597. 137.62 s > [2026-08-28 15:32:43.883] @process::amplitude INFO : Input is above threshold: 1 existing threshold E-surfaces across 1/1 graph groups
  598. 137.62 s > field value
  599. 137.62 s > existing_esurfaces 1
  600. 137.62 s > group_count 1
  601. 137.62 s > groups_above_threshold 1
  602. 137.62 s > integrand se1l
  603. 137.62 s > span warm_up{integrand.name=se1l}
  604. 137.62 s > threshold_status above threshold
  605. 137.62 s > [2026-08-28 15:32:43.883] @process::amplitude INFO : overlap structure of group 0: [1: [0(2,3)]]
  606. 137.62 s > field value
  607. 137.62 s > span warm_up{integrand.name=se1l}
  608. 137.62 s > [2026-08-28 15:32:43.887] @process::amplitude WARNING : External state 0 ('g', PDG 21, helicity +) is off shell: p^2 = +2.5e5, expected m^2 = +0e0 (|Δ| = +2.5e5). Fixed-helicity spinor/vector/tensor external states may be ill-defined at this kinematic point.
  609. 137.62 s > field value
  610. 137.62 s > span warm_up{integrand.name=se1l_rls_shifted}
  611. 137.62 s > [2026-08-28 15:32:43.887] @process::amplitude WARNING : External state 1 ('g', PDG 21, helicity -) is off shell: p^2 = +2.5e5, expected m^2 = +0e0 (|Δ| = +2.5e5). Fixed-helicity spinor/vector/tensor external states may be ill-defined at this kinematic point.
  612. 137.62 s > field value
  613. 137.62 s > span warm_up{integrand.name=se1l_rls_shifted}
  614. 137.62 s > [2026-08-28 15:32:43.887] @process::amplitude INFO : Input is above threshold: 1 existing threshold E-surfaces across 1/1 graph groups
  615. 137.62 s > field value
  616. 137.62 s > existing_esurfaces 1
  617. 137.62 s > group_count 1
  618. 137.62 s > groups_above_threshold 1
  619. 137.62 s > integrand se1l_rls_shifted
  620. 137.62 s > span warm_up{integrand.name=se1l_rls_shifted}
  621. 137.62 s > threshold_status above threshold
  622. 137.62 s > [2026-08-28 15:32:43.887] @process::amplitude INFO : overlap structure of group 0: [1: [0(2,3)]]
  623. 137.62 s > field value
  624. 137.62 s > span warm_up{integrand.name=se1l_rls_shifted}
  625. 137.62 s > [2026-08-28 15:32:43.891] @process::amplitude WARNING : External state 0 ('g', PDG 21, helicity +) is off shell: p^2 = +2.5e5, expected m^2 = +0e0 (|Δ| = +2.5e5). Fixed-helicity spinor/vector/tensor external states may be ill-defined at this kinematic point.
  626. 137.62 s > field value
  627. 137.62 s > span warm_up{integrand.name=se1l}
  628. 137.62 s > [2026-08-28 15:32:43.891] @process::amplitude WARNING : External state 1 ('g', PDG 21, helicity -) is off shell: p^2 = +2.5e5, expected m^2 = +0e0 (|Δ| = +2.5e5). Fixed-helicity spinor/vector/tensor external states may be ill-defined at this kinematic point.
  629. 137.62 s > field value
  630. 137.62 s > span warm_up{integrand.name=se1l}
  631. 137.62 s > [2026-08-28 15:32:43.891] @process::amplitude INFO : Input is above threshold: 1 existing threshold E-surfaces across 1/1 graph groups
  632. 137.62 s > field value
  633. 137.62 s > existing_esurfaces 1
  634. 137.62 s > group_count 1
  635. 137.62 s > groups_above_threshold 1
  636. 137.62 s > integrand se1l
  637. 137.62 s > span warm_up{integrand.name=se1l}
  638. 137.62 s > threshold_status above threshold
  639. 137.62 s > [2026-08-28 15:32:43.891] @process::amplitude INFO : overlap structure of group 0: [1: [0(2,3)]]
  640. 137.62 s > field value
  641. 137.62 s > span warm_up{integrand.name=se1l}
  642. 137.62 s > [2026-08-28 15:32:43.894] @process::amplitude WARNING : External state 0 ('g', PDG 21, helicity +) is off shell: p^2 = +2.5e5, expected m^2 = +0e0 (|Δ| = +2.5e5). Fixed-helicity spinor/vector/tensor external states may be ill-defined at this kinematic point.
  643. 137.62 s > field value
  644. 137.62 s > span warm_up{integrand.name=se1l_rls_shifted}
  645. 137.62 s > [2026-08-28 15:32:43.894] @process::amplitude WARNING : External state 1 ('g', PDG 21, helicity -) is off shell: p^2 = +2.5e5, expected m^2 = +0e0 (|Δ| = +2.5e5). Fixed-helicity spinor/vector/tensor external states may be ill-defined at this kinematic point.
  646. 137.62 s > field value
  647. 137.62 s > span warm_up{integrand.name=se1l_rls_shifted}
  648. 137.62 s > [2026-08-28 15:32:43.894] @process::amplitude INFO : Input is above threshold: 1 existing threshold E-surfaces across 1/1 graph groups
  649. 137.62 s > field value
  650. 137.62 s > existing_esurfaces 1
  651. 137.62 s > group_count 1
  652. 137.62 s > groups_above_threshold 1
  653. 137.62 s > integrand se1l_rls_shifted
  654. 137.62 s > span warm_up{integrand.name=se1l_rls_shifted}
  655. 137.62 s > threshold_status above threshold
  656. 137.62 s > [2026-08-28 15:32:43.895] @process::amplitude INFO : overlap structure of group 0: [1: [0(2,3)]]
  657. 137.62 s > field value
  658. 137.62 s > span warm_up{integrand.name=se1l_rls_shifted}
  659. 137.62 s > [2026-08-28 15:32:43.898] @process::amplitude WARNING : External state 0 ('g', PDG 21, helicity +) is off shell: p^2 = +2.5e5, expected m^2 = +0e0 (|Δ| = +2.5e5). Fixed-helicity spinor/vector/tensor external states may be ill-defined at this kinematic point.
  660. 137.62 s > field value
  661. 137.62 s > span warm_up{integrand.name=se1l}
  662. 137.62 s > [2026-08-28 15:32:43.898] @process::amplitude WARNING : External state 1 ('g', PDG 21, helicity -) is off shell: p^2 = +2.5e5, expected m^2 = +0e0 (|Δ| = +2.5e5). Fixed-helicity spinor/vector/tensor external states may be ill-defined at this kinematic point.
  663. 137.62 s > field value
  664. 137.62 s > span warm_up{integrand.name=se1l}
  665. 137.62 s > [2026-08-28 15:32:43.898] @process::amplitude INFO : Input is above threshold: 1 existing threshold E-surfaces across 1/1 graph groups
  666. 137.62 s > field value
  667. 137.62 s > existing_esurfaces 1
  668. 137.62 s > group_count 1
  669. 137.62 s > groups_above_threshold 1
  670. 137.62 s > integrand se1l
  671. 137.62 s > span warm_up{integrand.name=se1l}
  672. 137.62 s > threshold_status above threshold
  673. 137.62 s > [2026-08-28 15:32:43.898] @process::amplitude INFO : overlap structure of group 0: [1: [0(2,3)]]
  674. 137.62 s > field value
  675. 137.62 s > span warm_up{integrand.name=se1l}
  676. 137.62 s > [2026-08-28 15:32:43.902] @process::amplitude WARNING : External state 0 ('g', PDG 21, helicity +) is off shell: p^2 = +2.5e5, expected m^2 = +0e0 (|Δ| = +2.5e5). Fixed-helicity spinor/vector/tensor external states may be ill-defined at this kinematic point.
  677. 137.62 s > field value
  678. 137.62 s > span warm_up{integrand.name=se1l_rls_shifted}
  679. 137.62 s > [2026-08-28 15:32:43.902] @process::amplitude WARNING : External state 1 ('g', PDG 21, helicity -) is off shell: p^2 = +2.5e5, expected m^2 = +0e0 (|Δ| = +2.5e5). Fixed-helicity spinor/vector/tensor external states may be ill-defined at this kinematic point.
  680. 137.62 s > field value
  681. 137.62 s > span warm_up{integrand.name=se1l_rls_shifted}
  682. 137.62 s > [2026-08-28 15:32:43.902] @process::amplitude INFO : Input is above threshold: 1 existing threshold E-surfaces across 1/1 graph groups
  683. 137.62 s > field value
  684. 137.62 s > existing_esurfaces 1
  685. 137.62 s > group_count 1
  686. 137.62 s > groups_above_threshold 1
  687. 137.62 s > integrand se1l_rls_shifted
  688. 137.62 s > span warm_up{integrand.name=se1l_rls_shifted}
  689. 137.62 s > threshold_status above threshold
  690. 137.62 s > [2026-08-28 15:32:43.902] @process::amplitude INFO : overlap structure of group 0: [1: [0(2,3)]]
  691. 137.62 s > field value
  692. 137.62 s > span warm_up{integrand.name=se1l_rls_shifted}
  693. 137.62 s > [2026-08-28 15:32:43.906] @process::amplitude WARNING : External state 0 ('g', PDG 21, helicity +) is off shell: p^2 = +2.5e5, expected m^2 = +0e0 (|Δ| = +2.5e5). Fixed-helicity spinor/vector/tensor external states may be ill-defined at this kinematic point.
  694. 137.62 s > field value
  695. 137.62 s > span warm_up{integrand.name=se1l}
  696. 137.62 s > [2026-08-28 15:32:43.906] @process::amplitude WARNING : External state 1 ('g', PDG 21, helicity -) is off shell: p^2 = +2.5e5, expected m^2 = +0e0 (|Δ| = +2.5e5). Fixed-helicity spinor/vector/tensor external states may be ill-defined at this kinematic point.
  697. 137.62 s > field value
  698. 137.62 s > span warm_up{integrand.name=se1l}
  699. 137.62 s > [2026-08-28 15:32:43.906] @process::amplitude INFO : Input is above threshold: 1 existing threshold E-surfaces across 1/1 graph groups
  700. 137.62 s > field value
  701. 137.62 s > existing_esurfaces 1
  702. 137.62 s > group_count 1
  703. 137.62 s > groups_above_threshold 1
  704. 137.62 s > integrand se1l
  705. 137.62 s > span warm_up{integrand.name=se1l}
  706. 137.62 s > threshold_status above threshold
  707. 137.62 s > [2026-08-28 15:32:43.906] @process::amplitude INFO : overlap structure of group 0: [1: [0(2,3)]]
  708. 137.62 s > field value
  709. 137.62 s > span warm_up{integrand.name=se1l}
  710. 137.62 s > [2026-08-28 15:32:43.909] @process::amplitude WARNING : External state 0 ('g', PDG 21, helicity +) is off shell: p^2 = +2.5e5, expected m^2 = +0e0 (|Δ| = +2.5e5). Fixed-helicity spinor/vector/tensor external states may be ill-defined at this kinematic point.
  711. 137.62 s > field value
  712. 137.62 s > span warm_up{integrand.name=se1l_rls_shifted}
  713. 137.62 s > [2026-08-28 15:32:43.909] @process::amplitude WARNING : External state 1 ('g', PDG 21, helicity -) is off shell: p^2 = +2.5e5, expected m^2 = +0e0 (|Δ| = +2.5e5). Fixed-helicity spinor/vector/tensor external states may be ill-defined at this kinematic point.
  714. 137.62 s > field value
  715. 137.62 s > span warm_up{integrand.name=se1l_rls_shifted}
  716. 137.62 s > [2026-08-28 15:32:43.909] @process::amplitude INFO : Input is above threshold: 1 existing threshold E-surfaces across 1/1 graph groups
  717. 137.62 s > field value
  718. 137.62 s > existing_esurfaces 1
  719. 137.62 s > group_count 1
  720. 137.62 s > groups_above_threshold 1
  721. 137.62 s > integrand se1l_rls_shifted
  722. 137.62 s > span warm_up{integrand.name=se1l_rls_shifted}
  723. 137.62 s > threshold_status above threshold
  724. 137.62 s > [2026-08-28 15:32:43.910] @process::amplitude INFO : overlap structure of group 0: [1: [0(2,3)]]
  725. 137.62 s > field value
  726. 137.62 s > span warm_up{integrand.name=se1l_rls_shifted}
  727. 137.62 s > [2026-08-28 15:32:43.913] @process::amplitude WARNING : External state 0 ('g', PDG 21, helicity +) is off shell: p^2 = +2.5e5, expected m^2 = +0e0 (|Δ| = +2.5e5). Fixed-helicity spinor/vector/tensor external states may be ill-defined at this kinematic point.
  728. 137.62 s > field value
  729. 137.62 s > span warm_up{integrand.name=se1l}
  730. 137.62 s > [2026-08-28 15:32:43.913] @process::amplitude WARNING : External state 1 ('g', PDG 21, helicity -) is off shell: p^2 = +2.5e5, expected m^2 = +0e0 (|Δ| = +2.5e5). Fixed-helicity spinor/vector/tensor external states may be ill-defined at this kinematic point.
  731. 137.62 s > field value
  732. 137.62 s > span warm_up{integrand.name=se1l}
  733. 137.62 s > [2026-08-28 15:32:43.913] @process::amplitude INFO : Input is above threshold: 1 existing threshold E-surfaces across 1/1 graph groups
  734. 137.62 s > field value
  735. 137.62 s > existing_esurfaces 1
  736. 137.62 s > group_count 1
  737. 137.62 s > groups_above_threshold 1
  738. 137.62 s > integrand se1l
  739. 137.62 s > span warm_up{integrand.name=se1l}
  740. 137.62 s > threshold_status above threshold
  741. 137.62 s > [2026-08-28 15:32:43.913] @process::amplitude INFO : overlap structure of group 0: [1: [0(2,3)]]
  742. 137.62 s > field value
  743. 137.62 s > span warm_up{integrand.name=se1l}
  744. 137.62 s > [2026-08-28 15:32:43.917] @process::amplitude WARNING : External state 0 ('g', PDG 21, helicity +) is off shell: p^2 = +2.5e5, expected m^2 = +0e0 (|Δ| = +2.5e5). Fixed-helicity spinor/vector/tensor external states may be ill-defined at this kinematic point.
  745. 137.62 s > field value
  746. 137.62 s > span warm_up{integrand.name=se1l_rls_shifted}
  747. 137.62 s > [2026-08-28 15:32:43.917] @process::amplitude WARNING : External state 1 ('g', PDG 21, helicity -) is off shell: p^2 = +2.5e5, expected m^2 = +0e0 (|Δ| = +2.5e5). Fixed-helicity spinor/vector/tensor external states may be ill-defined at this kinematic point.
  748. 137.62 s > field value
  749. 137.62 s > span warm_up{integrand.name=se1l_rls_shifted}
  750. 137.62 s > [2026-08-28 15:32:43.917] @process::amplitude INFO : Input is above threshold: 1 existing threshold E-surfaces across 1/1 graph groups
  751. 137.62 s > field value
  752. 137.62 s > existing_esurfaces 1
  753. 137.62 s > group_count 1
  754. 137.62 s > groups_above_threshold 1
  755. 137.62 s > integrand se1l_rls_shifted
  756. 137.62 s > span warm_up{integrand.name=se1l_rls_shifted}
  757. 137.62 s > threshold_status above threshold
  758. 137.62 s > [2026-08-28 15:32:43.917] @process::amplitude INFO : overlap structure of group 0: [1: [0(2,3)]]
  759. 137.62 s > field value
  760. 137.62 s > span warm_up{integrand.name=se1l_rls_shifted}
  761. 137.62 s > [2026-08-28 15:32:43.920] @process::amplitude WARNING : External state 0 ('g', PDG 21, helicity +) is off shell: p^2 = +2.5e5, expected m^2 = +0e0 (|Δ| = +2.5e5). Fixed-helicity spinor/vector/tensor external states may be ill-defined at this kinematic point.
  762. 137.62 s > field value
  763. 137.62 s > span warm_up{integrand.name=se1l}
  764. 137.62 s > [2026-08-28 15:32:43.920] @process::amplitude WARNING : External state 1 ('g', PDG 21, helicity -) is off shell: p^2 = +2.5e5, expected m^2 = +0e0 (|Δ| = +2.5e5). Fixed-helicity spinor/vector/tensor external states may be ill-defined at this kinematic point.
  765. 137.62 s > field value
  766. 137.62 s > span warm_up{integrand.name=se1l}
  767. 137.62 s > [2026-08-28 15:32:43.921] @process::amplitude INFO : Input is above threshold: 1 existing threshold E-surfaces across 1/1 graph groups
  768. 137.62 s > field value
  769. 137.62 s > existing_esurfaces 1
  770. 137.62 s > group_count 1
  771. 137.62 s > groups_above_threshold 1
  772. 137.62 s > integrand se1l
  773. 137.62 s > span warm_up{integrand.name=se1l}
  774. 137.62 s > threshold_status above threshold
  775. 137.62 s > [2026-08-28 15:32:43.921] @process::amplitude INFO : overlap structure of group 0: [1: [0(2,3)]]
  776. 137.62 s > field value
  777. 137.62 s > span warm_up{integrand.name=se1l}
  778. 137.62 s > [2026-08-28 15:32:43.924] @process::amplitude WARNING : External state 0 ('g', PDG 21, helicity +) is off shell: p^2 = +2.5e5, expected m^2 = +0e0 (|Δ| = +2.5e5). Fixed-helicity spinor/vector/tensor external states may be ill-defined at this kinematic point.
  779. 137.62 s > field value
  780. 137.62 s > span warm_up{integrand.name=se1l_rls_shifted}
  781. 137.62 s > [2026-08-28 15:32:43.924] @process::amplitude WARNING : External state 1 ('g', PDG 21, helicity -) is off shell: p^2 = +2.5e5, expected m^2 = +0e0 (|Δ| = +2.5e5). Fixed-helicity spinor/vector/tensor external states may be ill-defined at this kinematic point.
  782. 137.62 s > field value
  783. 137.62 s > span warm_up{integrand.name=se1l_rls_shifted}
  784. 137.62 s > [2026-08-28 15:32:43.924] @process::amplitude INFO : Input is above threshold: 1 existing threshold E-surfaces across 1/1 graph groups
  785. 137.62 s > field value
  786. 137.62 s > existing_esurfaces 1
  787. 137.62 s > group_count 1
  788. 137.62 s > groups_above_threshold 1
  789. 137.62 s > integrand se1l_rls_shifted
  790. 137.62 s > span warm_up{integrand.name=se1l_rls_shifted}
  791. 137.62 s > threshold_status above threshold
  792. 137.62 s > [2026-08-28 15:32:43.924] @process::amplitude INFO : overlap structure of group 0: [1: [0(2,3)]]
  793. 137.62 s > field value
  794. 137.62 s > span warm_up{integrand.name=se1l_rls_shifted}
  795. 137.62 s > [2026-08-28 15:32:43.928] @process::amplitude WARNING : External state 0 ('g', PDG 21, helicity +) is off shell: p^2 = +2.5e5, expected m^2 = +0e0 (|Δ| = +2.5e5). Fixed-helicity spinor/vector/tensor external states may be ill-defined at this kinematic point.
  796. 137.62 s > field value
  797. 137.62 s > span warm_up{integrand.name=se1l}
  798. 137.62 s > [2026-08-28 15:32:43.928] @process::amplitude WARNING : External state 1 ('g', PDG 21, helicity -) is off shell: p^2 = +2.5e5, expected m^2 = +0e0 (|Δ| = +2.5e5). Fixed-helicity spinor/vector/tensor external states may be ill-defined at this kinematic point.
  799. 137.62 s > field value
  800. 137.62 s > span warm_up{integrand.name=se1l}
  801. 137.62 s > [2026-08-28 15:32:43.928] @process::amplitude INFO : Input is above threshold: 1 existing threshold E-surfaces across 1/1 graph groups
  802. 137.62 s > field value
  803. 137.62 s > existing_esurfaces 1
  804. 137.62 s > group_count 1
  805. 137.62 s > groups_above_threshold 1
  806. 137.62 s > integrand se1l
  807. 137.62 s > span warm_up{integrand.name=se1l}
  808. 137.62 s > threshold_status above threshold
  809. 137.62 s > [2026-08-28 15:32:43.928] @process::amplitude INFO : overlap structure of group 0: [1: [0(2,3)]]
  810. 137.62 s > field value
  811. 137.62 s > span warm_up{integrand.name=se1l}
  812. 137.62 s > [2026-08-28 15:32:43.932] @process::amplitude WARNING : External state 0 ('g', PDG 21, helicity +) is off shell: p^2 = +2.5e5, expected m^2 = +0e0 (|Δ| = +2.5e5). Fixed-helicity spinor/vector/tensor external states may be ill-defined at this kinematic point.
  813. 137.62 s > field value
  814. 137.62 s > span warm_up{integrand.name=se1l_rls_shifted}
  815. 137.62 s > [2026-08-28 15:32:43.932] @process::amplitude WARNING : External state 1 ('g', PDG 21, helicity -) is off shell: p^2 = +2.5e5, expected m^2 = +0e0 (|Δ| = +2.5e5). Fixed-helicity spinor/vector/tensor external states may be ill-defined at this kinematic point.
  816. 137.62 s > field value
  817. 137.62 s > span warm_up{integrand.name=se1l_rls_shifted}
  818. 137.62 s > [2026-08-28 15:32:43.932] @process::amplitude INFO : Input is above threshold: 1 existing threshold E-surfaces across 1/1 graph groups
  819. 137.62 s > field value
  820. 137.62 s > existing_esurfaces 1
  821. 137.62 s > group_count 1
  822. 137.62 s > groups_above_threshold 1
  823. 137.62 s > integrand se1l_rls_shifted
  824. 137.62 s > span warm_up{integrand.name=se1l_rls_shifted}
  825. 137.62 s > threshold_status above threshold
  826. 137.62 s > [2026-08-28 15:32:43.932] @process::amplitude INFO : overlap structure of group 0: [1: [0(2,3)]]
  827. 137.62 s > field value
  828. 137.62 s > span warm_up{integrand.name=se1l_rls_shifted}
  829. 137.62 s > [2026-08-28 15:32:43.935] @process::amplitude WARNING : External state 0 ('g', PDG 21, helicity +) is off shell: p^2 = +2.5e5, expected m^2 = +0e0 (|Δ| = +2.5e5). Fixed-helicity spinor/vector/tensor external states may be ill-defined at this kinematic point.
  830. 137.62 s > field value
  831. 137.62 s > span warm_up{integrand.name=se1l}
  832. 137.62 s > [2026-08-28 15:32:43.935] @process::amplitude WARNING : External state 1 ('g', PDG 21, helicity -) is off shell: p^2 = +2.5e5, expected m^2 = +0e0 (|Δ| = +2.5e5). Fixed-helicity spinor/vector/tensor external states may be ill-defined at this kinematic point.
  833. 137.62 s > field value
  834. 137.62 s > span warm_up{integrand.name=se1l}
  835. 137.62 s > [2026-08-28 15:32:43.935] @process::amplitude INFO : Input is above threshold: 1 existing threshold E-surfaces across 1/1 graph groups
  836. 137.62 s > field value
  837. 137.62 s > existing_esurfaces 1
  838. 137.62 s > group_count 1
  839. 137.62 s > groups_above_threshold 1
  840. 137.62 s > integrand se1l
  841. 137.62 s > span warm_up{integrand.name=se1l}
  842. 137.62 s > threshold_status above threshold
  843. 137.62 s > [2026-08-28 15:32:43.936] @process::amplitude INFO : overlap structure of group 0: [1: [0(2,3)]]
  844. 137.62 s > field value
  845. 137.62 s > span warm_up{integrand.name=se1l}
  846. 137.62 s > [2026-08-28 15:32:43.939] @process::amplitude WARNING : External state 0 ('g', PDG 21, helicity +) is off shell: p^2 = +2.5e5, expected m^2 = +0e0 (|Δ| = +2.5e5). Fixed-helicity spinor/vector/tensor external states may be ill-defined at this kinematic point.
  847. 137.62 s > field value
  848. 137.62 s > span warm_up{integrand.name=se1l_rls_shifted}
  849. 137.62 s > [2026-08-28 15:32:43.939] @process::amplitude WARNING : External state 1 ('g', PDG 21, helicity -) is off shell: p^2 = +2.5e5, expected m^2 = +0e0 (|Δ| = +2.5e5). Fixed-helicity spinor/vector/tensor external states may be ill-defined at this kinematic point.
  850. 137.62 s > field value
  851. 137.62 s > span warm_up{integrand.name=se1l_rls_shifted}
  852. 137.62 s > [2026-08-28 15:32:43.939] @process::amplitude INFO : Input is above threshold: 1 existing threshold E-surfaces across 1/1 graph groups
  853. 137.62 s > field value
  854. 137.62 s > existing_esurfaces 1
  855. 137.62 s > group_count 1
  856. 137.62 s > groups_above_threshold 1
  857. 137.62 s > integrand se1l_rls_shifted
  858. 137.62 s > span warm_up{integrand.name=se1l_rls_shifted}
  859. 137.62 s > threshold_status above threshold
  860. 137.62 s > [2026-08-28 15:32:43.939] @process::amplitude INFO : overlap structure of group 0: [1: [0(2,3)]]
  861. 137.62 s > field value
  862. 137.62 s > span warm_up{integrand.name=se1l_rls_shifted}
  863. 137.62 s > [2026-08-28 15:32:43.943] @process::amplitude WARNING : External state 0 ('g', PDG 21, helicity +) is off shell: p^2 = +2.5e5, expected m^2 = +0e0 (|Δ| = +2.5e5). Fixed-helicity spinor/vector/tensor external states may be ill-defined at this kinematic point.
  864. 137.62 s > field value
  865. 137.62 s > span warm_up{integrand.name=se1l}
  866. 137.62 s > [2026-08-28 15:32:43.943] @process::amplitude WARNING : External state 1 ('g', PDG 21, helicity -) is off shell: p^2 = +2.5e5, expected m^2 = +0e0 (|Δ| = +2.5e5). Fixed-helicity spinor/vector/tensor external states may be ill-defined at this kinematic point.
  867. 137.62 s > field value
  868. 137.62 s > span warm_up{integrand.name=se1l}
  869. 137.62 s > [2026-08-28 15:32:43.943] @process::amplitude INFO : Input is above threshold: 1 existing threshold E-surfaces across 1/1 graph groups
  870. 137.62 s > field value
  871. 137.62 s > existing_esurfaces 1
  872. 137.62 s > group_count 1
  873. 137.62 s > groups_above_threshold 1
  874. 137.62 s > integrand se1l
  875. 137.62 s > span warm_up{integrand.name=se1l}
  876. 137.62 s > threshold_status above threshold
  877. 137.62 s > [2026-08-28 15:32:43.943] @process::amplitude INFO : overlap structure of group 0: [1: [0(2,3)]]
  878. 137.62 s > field value
  879. 137.62 s > span warm_up{integrand.name=se1l}
  880. 137.62 s > [2026-08-28 15:32:43.947] @process::amplitude WARNING : External state 0 ('g', PDG 21, helicity +) is off shell: p^2 = +2.5e5, expected m^2 = +0e0 (|Δ| = +2.5e5). Fixed-helicity spinor/vector/tensor external states may be ill-defined at this kinematic point.
  881. 137.62 s > field value
  882. 137.62 s > span warm_up{integrand.name=se1l_rls_shifted}
  883. 137.62 s > [2026-08-28 15:32:43.947] @process::amplitude WARNING : External state 1 ('g', PDG 21, helicity -) is off shell: p^2 = +2.5e5, expected m^2 = +0e0 (|Δ| = +2.5e5). Fixed-helicity spinor/vector/tensor external states may be ill-defined at this kinematic point.
  884. 137.62 s > field value
  885. 137.62 s > span warm_up{integrand.name=se1l_rls_shifted}
  886. 137.62 s > [2026-08-28 15:32:43.947] @process::amplitude INFO : Input is above threshold: 1 existing threshold E-surfaces across 1/1 graph groups
  887. 137.62 s > field value
  888. 137.62 s > existing_esurfaces 1
  889. 137.62 s > group_count 1
  890. 137.62 s > groups_above_threshold 1
  891. 137.62 s > integrand se1l_rls_shifted
  892. 137.62 s > span warm_up{integrand.name=se1l_rls_shifted}
  893. 137.62 s > threshold_status above threshold
  894. 137.62 s > [2026-08-28 15:32:43.947] @process::amplitude INFO : overlap structure of group 0: [1: [0(2,3)]]
  895. 137.62 s > field value
  896. 137.62 s > span warm_up{integrand.name=se1l_rls_shifted}
  897. 137.62 s > [2026-08-28 15:32:43.950] @process::amplitude WARNING : External state 0 ('g', PDG 21, helicity +) is off shell: p^2 = +2.5e5, expected m^2 = +0e0 (|Δ| = +2.5e5). Fixed-helicity spinor/vector/tensor external states may be ill-defined at this kinematic point.
  898. 137.62 s > field value
  899. 137.62 s > span warm_up{integrand.name=se1l}
  900. 137.62 s > [2026-08-28 15:32:43.950] @process::amplitude WARNING : External state 1 ('g', PDG 21, helicity -) is off shell: p^2 = +2.5e5, expected m^2 = +0e0 (|Δ| = +2.5e5). Fixed-helicity spinor/vector/tensor external states may be ill-defined at this kinematic point.
  901. 137.62 s > field value
  902. 137.62 s > span warm_up{integrand.name=se1l}
  903. 137.62 s > [2026-08-28 15:32:43.950] @process::amplitude INFO : Input is above threshold: 1 existing threshold E-surfaces across 1/1 graph groups
  904. 137.62 s > field value
  905. 137.62 s > existing_esurfaces 1
  906. 137.62 s > group_count 1
  907. 137.62 s > groups_above_threshold 1
  908. 137.62 s > integrand se1l
  909. 137.62 s > span warm_up{integrand.name=se1l}
  910. 137.62 s > threshold_status above threshold
  911. 137.62 s > [2026-08-28 15:32:43.951] @process::amplitude INFO : overlap structure of group 0: [1: [0(2,3)]]
  912. 137.62 s > field value
  913. 137.62 s > span warm_up{integrand.name=se1l}
  914. 137.62 s > [2026-08-28 15:32:43.954] @process::amplitude WARNING : External state 0 ('g', PDG 21, helicity +) is off shell: p^2 = +2.5e5, expected m^2 = +0e0 (|Δ| = +2.5e5). Fixed-helicity spinor/vector/tensor external states may be ill-defined at this kinematic point.
  915. 137.62 s > field value
  916. 137.62 s > span warm_up{integrand.name=se1l_mur_shifted}
  917. 137.62 s > [2026-08-28 15:32:43.954] @process::amplitude WARNING : External state 1 ('g', PDG 21, helicity -) is off shell: p^2 = +2.5e5, expected m^2 = +0e0 (|Δ| = +2.5e5). Fixed-helicity spinor/vector/tensor external states may be ill-defined at this kinematic point.
  918. 137.62 s > field value
  919. 137.62 s > span warm_up{integrand.name=se1l_mur_shifted}
  920. 137.62 s > [2026-08-28 15:32:43.954] @process::amplitude INFO : Input is above threshold: 1 existing threshold E-surfaces across 1/1 graph groups
  921. 137.62 s > field value
  922. 137.62 s > existing_esurfaces 1
  923. 137.62 s > group_count 1
  924. 137.62 s > groups_above_threshold 1
  925. 137.62 s > integrand se1l_mur_shifted
  926. 137.62 s > span warm_up{integrand.name=se1l_mur_shifted}
  927. 137.62 s > threshold_status above threshold
  928. 137.62 s > [2026-08-28 15:32:43.954] @process::amplitude INFO : overlap structure of group 0: [1: [0(2,3)]]
  929. 137.62 s > field value
  930. 137.62 s > span warm_up{integrand.name=se1l_mur_shifted}
  931. 137.62 s > [2026-08-28 15:32:43.958] @process::amplitude WARNING : External state 0 ('g', PDG 21, helicity +) is off shell: p^2 = +2.5e5, expected m^2 = +0e0 (|Δ| = +2.5e5). Fixed-helicity spinor/vector/tensor external states may be ill-defined at this kinematic point.
  932. 137.62 s > field value
  933. 137.62 s > span warm_up{integrand.name=se1l}
  934. 137.62 s > [2026-08-28 15:32:43.958] @process::amplitude WARNING : External state 1 ('g', PDG 21, helicity -) is off shell: p^2 = +2.5e5, expected m^2 = +0e0 (|Δ| = +2.5e5). Fixed-helicity spinor/vector/tensor external states may be ill-defined at this kinematic point.
  935. 137.62 s > field value
  936. 137.62 s > span warm_up{integrand.name=se1l}
  937. 137.62 s > [2026-08-28 15:32:43.958] @process::amplitude INFO : Input is above threshold: 1 existing threshold E-surfaces across 1/1 graph groups
  938. 137.62 s > field value
  939. 137.62 s > existing_esurfaces 1
  940. 137.62 s > group_count 1
  941. 137.62 s > groups_above_threshold 1
  942. 137.62 s > integrand se1l
  943. 137.62 s > span warm_up{integrand.name=se1l}
  944. 137.62 s > threshold_status above threshold
  945. 137.62 s > [2026-08-28 15:32:43.958] @process::amplitude INFO : overlap structure of group 0: [1: [0(2,3)]]
  946. 137.62 s > field value
  947. 137.62 s > span warm_up{integrand.name=se1l}
  948. 137.62 s > [2026-08-28 15:32:43.961] @process::amplitude WARNING : External state 0 ('g', PDG 21, helicity +) is off shell: p^2 = +2.5e5, expected m^2 = +0e0 (|Δ| = +2.5e5). Fixed-helicity spinor/vector/tensor external states may be ill-defined at this kinematic point.
  949. 137.62 s > field value
  950. 137.62 s > span warm_up{integrand.name=se1l_mur_shifted}
  951. 137.62 s > [2026-08-28 15:32:43.961] @process::amplitude WARNING : External state 1 ('g', PDG 21, helicity -) is off shell: p^2 = +2.5e5, expected m^2 = +0e0 (|Δ| = +2.5e5). Fixed-helicity spinor/vector/tensor external states may be ill-defined at this kinematic point.
  952. 137.62 s > field value
  953. 137.62 s > span warm_up{integrand.name=se1l_mur_shifted}
  954. 137.62 s > [2026-08-28 15:32:43.962] @process::amplitude INFO : Input is above threshold: 1 existing threshold E-surfaces across 1/1 graph groups
  955. 137.62 s > field value
  956. 137.62 s > existing_esurfaces 1
  957. 137.62 s > group_count 1
  958. 137.62 s > groups_above_threshold 1
  959. 137.62 s > integrand se1l_mur_shifted
  960. 137.62 s > span warm_up{integrand.name=se1l_mur_shifted}
  961. 137.62 s > threshold_status above threshold
  962. 137.62 s > [2026-08-28 15:32:43.962] @process::amplitude INFO : overlap structure of group 0: [1: [0(2,3)]]
  963. 137.62 s > field value
  964. 137.62 s > span warm_up{integrand.name=se1l_mur_shifted}
  965. 137.62 s > [2026-08-28 15:32:43.965] @process::amplitude WARNING : External state 0 ('g', PDG 21, helicity +) is off shell: p^2 = +2.5e5, expected m^2 = +0e0 (|Δ| = +2.5e5). Fixed-helicity spinor/vector/tensor external states may be ill-defined at this kinematic point.
  966. 137.62 s > field value
  967. 137.62 s > span warm_up{integrand.name=se1l}
  968. 137.62 s > [2026-08-28 15:32:43.965] @process::amplitude WARNING : External state 1 ('g', PDG 21, helicity -) is off shell: p^2 = +2.5e5, expected m^2 = +0e0 (|Δ| = +2.5e5). Fixed-helicity spinor/vector/tensor external states may be ill-defined at this kinematic point.
  969. 137.62 s > field value
  970. 137.62 s > span warm_up{integrand.name=se1l}
  971. 137.62 s > [2026-08-28 15:32:43.965] @process::amplitude INFO : Input is above threshold: 1 existing threshold E-surfaces across 1/1 graph groups
  972. 137.62 s > field value
  973. 137.62 s > existing_esurfaces 1
  974. 137.62 s > group_count 1
  975. 137.62 s > groups_above_threshold 1
  976. 137.62 s > integrand se1l
  977. 137.62 s > span warm_up{integrand.name=se1l}
  978. 137.62 s > threshold_status above threshold
  979. 137.62 s > [2026-08-28 15:32:43.965] @process::amplitude INFO : overlap structure of group 0: [1: [0(2,3)]]
  980. 137.62 s > field value
  981. 137.62 s > span warm_up{integrand.name=se1l}
  982. 137.62 s > [2026-08-28 15:32:43.969] @process::amplitude WARNING : External state 0 ('g', PDG 21, helicity +) is off shell: p^2 = +2.5e5, expected m^2 = +0e0 (|Δ| = +2.5e5). Fixed-helicity spinor/vector/tensor external states may be ill-defined at this kinematic point.
  983. 137.62 s > field value
  984. 137.62 s > span warm_up{integrand.name=se1l_mur_shifted}
  985. 137.62 s > [2026-08-28 15:32:43.969] @process::amplitude WARNING : External state 1 ('g', PDG 21, helicity -) is off shell: p^2 = +2.5e5, expected m^2 = +0e0 (|Δ| = +2.5e5). Fixed-helicity spinor/vector/tensor external states may be ill-defined at this kinematic point.
  986. 137.62 s > field value
  987. 137.62 s > span warm_up{integrand.name=se1l_mur_shifted}
  988. 137.62 s > [2026-08-28 15:32:43.969] @process::amplitude INFO : Input is above threshold: 1 existing threshold E-surfaces across 1/1 graph groups
  989. 137.62 s > field value
  990. 137.62 s > existing_esurfaces 1
  991. 137.62 s > group_count 1
  992. 137.62 s > groups_above_threshold 1
  993. 137.62 s > integrand se1l_mur_shifted
  994. 137.62 s > span warm_up{integrand.name=se1l_mur_shifted}
  995. 137.62 s > threshold_status above threshold
  996. 137.62 s > [2026-08-28 15:32:43.969] @process::amplitude INFO : overlap structure of group 0: [1: [0(2,3)]]
  997. 137.62 s > field value
  998. 137.62 s > span warm_up{integrand.name=se1l_mur_shifted}
  999. 137.62 s > [2026-08-28 15:32:43.973] @process::amplitude WARNING : External state 0 ('g', PDG 21, helicity +) is off shell: p^2 = +2.5e5, expected m^2 = +0e0 (|Δ| = +2.5e5). Fixed-helicity spinor/vector/tensor external states may be ill-defined at this kinematic point.
  1000. 137.62 s > field value
  1001. 137.62 s > span warm_up{integrand.name=se1l}
  1002. 137.62 s > [2026-08-28 15:32:43.973] @process::amplitude WARNING : External state 1 ('g', PDG 21, helicity -) is off shell: p^2 = +2.5e5, expected m^2 = +0e0 (|Δ| = +2.5e5). Fixed-helicity spinor/vector/tensor external states may be ill-defined at this kinematic point.
  1003. 137.62 s > field value
  1004. 137.62 s > span warm_up{integrand.name=se1l}
  1005. 137.62 s > [2026-08-28 15:32:43.973] @process::amplitude INFO : Input is above threshold: 1 existing threshold E-surfaces across 1/1 graph groups
  1006. 137.62 s > field value
  1007. 137.62 s > existing_esurfaces 1
  1008. 137.62 s > group_count 1
  1009. 137.62 s > groups_above_threshold 1
  1010. 137.62 s > integrand se1l
  1011. 137.62 s > span warm_up{integrand.name=se1l}
  1012. 137.62 s > threshold_status above threshold
  1013. 137.62 s > [2026-08-28 15:32:43.973] @process::amplitude INFO : overlap structure of group 0: [1: [0(2,3)]]
  1014. 137.62 s > field value
  1015. 137.62 s > span warm_up{integrand.name=se1l}
  1016. 137.62 s > [2026-08-28 15:32:43.976] @process::amplitude WARNING : External state 0 ('g', PDG 21, helicity +) is off shell: p^2 = +2.5e5, expected m^2 = +0e0 (|Δ| = +2.5e5). Fixed-helicity spinor/vector/tensor external states may be ill-defined at this kinematic point.
  1017. 137.62 s > field value
  1018. 137.62 s > span warm_up{integrand.name=se1l_mur_shifted}
  1019. 137.62 s > [2026-08-28 15:32:43.976] @process::amplitude WARNING : External state 1 ('g', PDG 21, helicity -) is off shell: p^2 = +2.5e5, expected m^2 = +0e0 (|Δ| = +2.5e5). Fixed-helicity spinor/vector/tensor external states may be ill-defined at this kinematic point.
  1020. 137.62 s > field value
  1021. 137.62 s > span warm_up{integrand.name=se1l_mur_shifted}
  1022. 137.62 s > [2026-08-28 15:32:43.976] @process::amplitude INFO : Input is above threshold: 1 existing threshold E-surfaces across 1/1 graph groups
  1023. 137.62 s > field value
  1024. 137.62 s > existing_esurfaces 1
  1025. 137.62 s > group_count 1
  1026. 137.62 s > groups_above_threshold 1
  1027. 137.62 s > integrand se1l_mur_shifted
  1028. 137.62 s > span warm_up{integrand.name=se1l_mur_shifted}
  1029. 137.62 s > threshold_status above threshold
  1030. 137.62 s > [2026-08-28 15:32:43.977] @process::amplitude INFO : overlap structure of group 0: [1: [0(2,3)]]
  1031. 137.62 s > field value
  1032. 137.62 s > span warm_up{integrand.name=se1l_mur_shifted}
  1033. 137.62 s > [2026-08-28 15:32:43.980] @process::amplitude WARNING : External state 0 ('g', PDG 21, helicity +) is off shell: p^2 = +2.5e5, expected m^2 = +0e0 (|Δ| = +2.5e5). Fixed-helicity spinor/vector/tensor external states may be ill-defined at this kinematic point.
  1034. 137.62 s > field value
  1035. 137.62 s > span warm_up{integrand.name=se1l}
  1036. 137.62 s > [2026-08-28 15:32:43.980] @process::amplitude WARNING : External state 1 ('g', PDG 21, helicity -) is off shell: p^2 = +2.5e5, expected m^2 = +0e0 (|Δ| = +2.5e5). Fixed-helicity spinor/vector/tensor external states may be ill-defined at this kinematic point.
  1037. 137.62 s > field value
  1038. 137.62 s > span warm_up{integrand.name=se1l}
  1039. 137.62 s > [2026-08-28 15:32:43.980] @process::amplitude INFO : Input is above threshold: 1 existing threshold E-surfaces across 1/1 graph groups
  1040. 137.62 s > field value
  1041. 137.62 s > existing_esurfaces 1
  1042. 137.62 s > group_count 1
  1043. 137.62 s > groups_above_threshold 1
  1044. 137.62 s > integrand se1l
  1045. 137.62 s > span warm_up{integrand.name=se1l}
  1046. 137.62 s > threshold_status above threshold
  1047. 137.62 s > [2026-08-28 15:32:43.980] @process::amplitude INFO : overlap structure of group 0: [1: [0(2,3)]]
  1048. 137.62 s > field value
  1049. 137.62 s > span warm_up{integrand.name=se1l}
  1050. 137.62 s > [2026-08-28 15:32:43.984] @process::amplitude WARNING : External state 0 ('g', PDG 21, helicity +) is off shell: p^2 = +2.5e5, expected m^2 = +0e0 (|Δ| = +2.5e5). Fixed-helicity spinor/vector/tensor external states may be ill-defined at this kinematic point.
  1051. 137.62 s > field value
  1052. 137.62 s > span warm_up{integrand.name=se1l_mur_shifted}
  1053. 137.62 s > [2026-08-28 15:32:43.984] @process::amplitude WARNING : External state 1 ('g', PDG 21, helicity -) is off shell: p^2 = +2.5e5, expected m^2 = +0e0 (|Δ| = +2.5e5). Fixed-helicity spinor/vector/tensor external states may be ill-defined at this kinematic point.
  1054. 137.62 s > field value
  1055. 137.62 s > span warm_up{integrand.name=se1l_mur_shifted}
  1056. 137.62 s > [2026-08-28 15:32:43.984] @process::amplitude INFO : Input is above threshold: 1 existing threshold E-surfaces across 1/1 graph groups
  1057. 137.62 s > field value
  1058. 137.62 s > existing_esurfaces 1
  1059. 137.62 s > group_count 1
  1060. 137.62 s > groups_above_threshold 1
  1061. 137.62 s > integrand se1l_mur_shifted
  1062. 137.62 s > span warm_up{integrand.name=se1l_mur_shifted}
  1063. 137.62 s > threshold_status above threshold
  1064. 137.62 s > [2026-08-28 15:32:43.984] @process::amplitude INFO : overlap structure of group 0: [1: [0(2,3)]]
  1065. 137.62 s > field value
  1066. 137.62 s > span warm_up{integrand.name=se1l_mur_shifted}
  1067. 137.62 s > [2026-08-28 15:32:43.988] @process::amplitude WARNING : External state 0 ('g', PDG 21, helicity +) is off shell: p^2 = +2.5e5, expected m^2 = +0e0 (|Δ| = +2.5e5). Fixed-helicity spinor/vector/tensor external states may be ill-defined at this kinematic point.
  1068. 137.62 s > field value
  1069. 137.62 s > span warm_up{integrand.name=se1l}
  1070. 137.62 s > [2026-08-28 15:32:43.988] @process::amplitude WARNING : External state 1 ('g', PDG 21, helicity -) is off shell: p^2 = +2.5e5, expected m^2 = +0e0 (|Δ| = +2.5e5). Fixed-helicity spinor/vector/tensor external states may be ill-defined at this kinematic point.
  1071. 137.62 s > field value
  1072. 137.62 s > span warm_up{integrand.name=se1l}
  1073. 137.62 s > [2026-08-28 15:32:43.988] @process::amplitude INFO : Input is above threshold: 1 existing threshold E-surfaces across 1/1 graph groups
  1074. 137.62 s > field value
  1075. 137.62 s > existing_esurfaces 1
  1076. 137.62 s > group_count 1
  1077. 137.62 s > groups_above_threshold 1
  1078. 137.62 s > integrand se1l
  1079. 137.62 s > span warm_up{integrand.name=se1l}
  1080. 137.62 s > threshold_status above threshold
  1081. 137.62 s > [2026-08-28 15:32:43.988] @process::amplitude INFO : overlap structure of group 0: [1: [0(2,3)]]
  1082. 137.62 s > field value
  1083. 137.62 s > span warm_up{integrand.name=se1l}
  1084. 137.62 s > [2026-08-28 15:32:43.991] @process::amplitude WARNING : External state 0 ('g', PDG 21, helicity +) is off shell: p^2 = +2.5e5, expected m^2 = +0e0 (|Δ| = +2.5e5). Fixed-helicity spinor/vector/tensor external states may be ill-defined at this kinematic point.
  1085. 137.62 s > field value
  1086. 137.62 s > span warm_up{integrand.name=se1l_mur_shifted}
  1087. 137.62 s > [2026-08-28 15:32:43.991] @process::amplitude WARNING : External state 1 ('g', PDG 21, helicity -) is off shell: p^2 = +2.5e5, expected m^2 = +0e0 (|Δ| = +2.5e5). Fixed-helicity spinor/vector/tensor external states may be ill-defined at this kinematic point.
  1088. 137.62 s > field value
  1089. 137.62 s > span warm_up{integrand.name=se1l_mur_shifted}
  1090. 137.62 s > [2026-08-28 15:32:43.991] @process::amplitude INFO : Input is above threshold: 1 existing threshold E-surfaces across 1/1 graph groups
  1091. 137.62 s > field value
  1092. 137.62 s > existing_esurfaces 1
  1093. 137.62 s > group_count 1
  1094. 137.62 s > groups_above_threshold 1
  1095. 137.62 s > integrand se1l_mur_shifted
  1096. 137.62 s > span warm_up{integrand.name=se1l_mur_shifted}
  1097. 137.62 s > threshold_status above threshold
  1098. 137.62 s > [2026-08-28 15:32:43.992] @process::amplitude INFO : overlap structure of group 0: [1: [0(2,3)]]
  1099. 137.62 s > field value
  1100. 137.62 s > span warm_up{integrand.name=se1l_mur_shifted}
  1101. 137.62 s > [2026-08-28 15:32:43.995] @process::amplitude WARNING : External state 0 ('g', PDG 21, helicity +) is off shell: p^2 = +2.5e5, expected m^2 = +0e0 (|Δ| = +2.5e5). Fixed-helicity spinor/vector/tensor external states may be ill-defined at this kinematic point.
  1102. 137.62 s > field value
  1103. 137.62 s > span warm_up{integrand.name=se1l}
  1104. 137.62 s > [2026-08-28 15:32:43.995] @process::amplitude WARNING : External state 1 ('g', PDG 21, helicity -) is off shell: p^2 = +2.5e5, expected m^2 = +0e0 (|Δ| = +2.5e5). Fixed-helicity spinor/vector/tensor external states may be ill-defined at this kinematic point.
  1105. 137.62 s > field value
  1106. 137.62 s > span warm_up{integrand.name=se1l}
  1107. 137.62 s > [2026-08-28 15:32:43.995] @process::amplitude INFO : Input is above threshold: 1 existing threshold E-surfaces across 1/1 graph groups
  1108. 137.62 s > field value
  1109. 137.62 s > existing_esurfaces 1
  1110. 137.62 s > group_count 1
  1111. 137.62 s > groups_above_threshold 1
  1112. 137.62 s > integrand se1l
  1113. 137.62 s > span warm_up{integrand.name=se1l}
  1114. 137.62 s > threshold_status above threshold
  1115. 137.62 s > [2026-08-28 15:32:43.995] @process::amplitude INFO : overlap structure of group 0: [1: [0(2,3)]]
  1116. 137.62 s > field value
  1117. 137.62 s > span warm_up{integrand.name=se1l}
  1118. 137.62 s > [2026-08-28 15:32:43.999] @process::amplitude WARNING : External state 0 ('g', PDG 21, helicity +) is off shell: p^2 = +2.5e5, expected m^2 = +0e0 (|Δ| = +2.5e5). Fixed-helicity spinor/vector/tensor external states may be ill-defined at this kinematic point.
  1119. 137.62 s > field value
  1120. 137.62 s > span warm_up{integrand.name=se1l_mur_shifted}
  1121. 137.62 s > [2026-08-28 15:32:43.999] @process::amplitude WARNING : External state 1 ('g', PDG 21, helicity -) is off shell: p^2 = +2.5e5, expected m^2 = +0e0 (|Δ| = +2.5e5). Fixed-helicity spinor/vector/tensor external states may be ill-defined at this kinematic point.
  1122. 137.62 s > field value
  1123. 137.62 s > span warm_up{integrand.name=se1l_mur_shifted}
  1124. 137.62 s > [2026-08-28 15:32:43.999] @process::amplitude INFO : Input is above threshold: 1 existing threshold E-surfaces across 1/1 graph groups
  1125. 137.62 s > field value
  1126. 137.62 s > existing_esurfaces 1
  1127. 137.62 s > group_count 1
  1128. 137.62 s > groups_above_threshold 1
  1129. 137.62 s > integrand se1l_mur_shifted
  1130. 137.62 s > span warm_up{integrand.name=se1l_mur_shifted}
  1131. 137.62 s > threshold_status above threshold
  1132. 137.62 s > [2026-08-28 15:32:43.999] @process::amplitude INFO : overlap structure of group 0: [1: [0(2,3)]]
  1133. 137.62 s > field value
  1134. 137.62 s > span warm_up{integrand.name=se1l_mur_shifted}
  1135. 137.62 s > [2026-08-28 15:32:44.002] @process::amplitude WARNING : External state 0 ('g', PDG 21, helicity +) is off shell: p^2 = +2.5e5, expected m^2 = +0e0 (|Δ| = +2.5e5). Fixed-helicity spinor/vector/tensor external states may be ill-defined at this kinematic point.
  1136. 137.62 s > field value
  1137. 137.62 s > span warm_up{integrand.name=se1l}
  1138. 137.62 s > [2026-08-28 15:32:44.002] @process::amplitude WARNING : External state 1 ('g', PDG 21, helicity -) is off shell: p^2 = +2.5e5, expected m^2 = +0e0 (|Δ| = +2.5e5). Fixed-helicity spinor/vector/tensor external states may be ill-defined at this kinematic point.
  1139. 137.62 s > field value
  1140. 137.62 s > span warm_up{integrand.name=se1l}
  1141. 137.62 s > [2026-08-28 15:32:44.003] @process::amplitude INFO : Input is above threshold: 1 existing threshold E-surfaces across 1/1 graph groups
  1142. 137.62 s > field value
  1143. 137.62 s > existing_esurfaces 1
  1144. 137.62 s > group_count 1
  1145. 137.62 s > groups_above_threshold 1
  1146. 137.62 s > integrand se1l
  1147. 137.62 s > span warm_up{integrand.name=se1l}
  1148. 137.62 s > threshold_status above threshold
  1149. 137.62 s > [2026-08-28 15:32:44.003] @process::amplitude INFO : overlap structure of group 0: [1: [0(2,3)]]
  1150. 137.62 s > field value
  1151. 137.62 s > span warm_up{integrand.name=se1l}
  1152. 137.62 s > [2026-08-28 15:32:44.006] @process::amplitude WARNING : External state 0 ('g', PDG 21, helicity +) is off shell: p^2 = +2.5e5, expected m^2 = +0e0 (|Δ| = +2.5e5). Fixed-helicity spinor/vector/tensor external states may be ill-defined at this kinematic point.
  1153. 137.62 s > field value
  1154. 137.62 s > span warm_up{integrand.name=se1l_mur_shifted}
  1155. 137.62 s > [2026-08-28 15:32:44.006] @process::amplitude WARNING : External state 1 ('g', PDG 21, helicity -) is off shell: p^2 = +2.5e5, expected m^2 = +0e0 (|Δ| = +2.5e5). Fixed-helicity spinor/vector/tensor external states may be ill-defined at this kinematic point.
  1156. 137.62 s > field value
  1157. 137.62 s > span warm_up{integrand.name=se1l_mur_shifted}
  1158. 137.62 s > [2026-08-28 15:32:44.006] @process::amplitude INFO : Input is above threshold: 1 existing threshold E-surfaces across 1/1 graph groups
  1159. 137.62 s > field value
  1160. 137.62 s > existing_esurfaces 1
  1161. 137.62 s > group_count 1
  1162. 137.62 s > groups_above_threshold 1
  1163. 137.62 s > integrand se1l_mur_shifted
  1164. 137.62 s > span warm_up{integrand.name=se1l_mur_shifted}
  1165. 137.62 s > threshold_status above threshold
  1166. 137.62 s > [2026-08-28 15:32:44.006] @process::amplitude INFO : overlap structure of group 0: [1: [0(2,3)]]
  1167. 137.62 s > field value
  1168. 137.62 s > span warm_up{integrand.name=se1l_mur_shifted}
  1169. 137.62 s > [2026-08-28 15:32:44.010] @process::amplitude WARNING : External state 0 ('g', PDG 21, helicity +) is off shell: p^2 = +2.5e5, expected m^2 = +0e0 (|Δ| = +2.5e5). Fixed-helicity spinor/vector/tensor external states may be ill-defined at this kinematic point.
  1170. 137.62 s > field value
  1171. 137.62 s > span warm_up{integrand.name=se1l}
  1172. 137.62 s > [2026-08-28 15:32:44.010] @process::amplitude WARNING : External state 1 ('g', PDG 21, helicity -) is off shell: p^2 = +2.5e5, expected m^2 = +0e0 (|Δ| = +2.5e5). Fixed-helicity spinor/vector/tensor external states may be ill-defined at this kinematic point.
  1173. 137.62 s > field value
  1174. 137.62 s > span warm_up{integrand.name=se1l}
  1175. 137.62 s > [2026-08-28 15:32:44.010] @process::amplitude INFO : Input is above threshold: 1 existing threshold E-surfaces across 1/1 graph groups
  1176. 137.62 s > field value
  1177. 137.62 s > existing_esurfaces 1
  1178. 137.62 s > group_count 1
  1179. 137.62 s > groups_above_threshold 1
  1180. 137.62 s > integrand se1l
  1181. 137.62 s > span warm_up{integrand.name=se1l}
  1182. 137.62 s > threshold_status above threshold
  1183. 137.62 s > [2026-08-28 15:32:44.010] @process::amplitude INFO : overlap structure of group 0: [1: [0(2,3)]]
  1184. 137.62 s > field value
  1185. 137.62 s > span warm_up{integrand.name=se1l}
  1186. 137.62 s > [2026-08-28 15:32:44.014] @process::amplitude WARNING : External state 0 ('g', PDG 21, helicity +) is off shell: p^2 = +2.5e5, expected m^2 = +0e0 (|Δ| = +2.5e5). Fixed-helicity spinor/vector/tensor external states may be ill-defined at this kinematic point.
  1187. 137.62 s > field value
  1188. 137.62 s > span warm_up{integrand.name=se1l_mur_shifted}
  1189. 137.62 s > [2026-08-28 15:32:44.014] @process::amplitude WARNING : External state 1 ('g', PDG 21, helicity -) is off shell: p^2 = +2.5e5, expected m^2 = +0e0 (|Δ| = +2.5e5). Fixed-helicity spinor/vector/tensor external states may be ill-defined at this kinematic point.
  1190. 137.62 s > field value
  1191. 137.62 s > span warm_up{integrand.name=se1l_mur_shifted}
  1192. 137.62 s > [2026-08-28 15:32:44.014] @process::amplitude INFO : Input is above threshold: 1 existing threshold E-surfaces across 1/1 graph groups
  1193. 137.62 s > field value
  1194. 137.62 s > existing_esurfaces 1
  1195. 137.62 s > group_count 1
  1196. 137.62 s > groups_above_threshold 1
  1197. 137.62 s > integrand se1l_mur_shifted
  1198. 137.62 s > span warm_up{integrand.name=se1l_mur_shifted}
  1199. 137.62 s > threshold_status above threshold
  1200. 137.62 s > [2026-08-28 15:32:44.014] @process::amplitude INFO : overlap structure of group 0: [1: [0(2,3)]]
  1201. 137.62 s > field value
  1202. 137.62 s > span warm_up{integrand.name=se1l_mur_shifted}
  1203. 137.62 s > [2026-08-28 15:32:44.017] @process::amplitude WARNING : External state 0 ('g', PDG 21, helicity +) is off shell: p^2 = +2.5e5, expected m^2 = +0e0 (|Δ| = +2.5e5). Fixed-helicity spinor/vector/tensor external states may be ill-defined at this kinematic point.
  1204. 137.62 s > field value
  1205. 137.62 s > span warm_up{integrand.name=se1l}
  1206. 137.62 s > [2026-08-28 15:32:44.017] @process::amplitude WARNING : External state 1 ('g', PDG 21, helicity -) is off shell: p^2 = +2.5e5, expected m^2 = +0e0 (|Δ| = +2.5e5). Fixed-helicity spinor/vector/tensor external states may be ill-defined at this kinematic point.
  1207. 137.62 s > field value
  1208. 137.62 s > span warm_up{integrand.name=se1l}
  1209. 137.62 s > [2026-08-28 15:32:44.018] @process::amplitude INFO : Input is above threshold: 1 existing threshold E-surfaces across 1/1 graph groups
  1210. 137.62 s > field value
  1211. 137.62 s > existing_esurfaces 1
  1212. 137.62 s > group_count 1
  1213. 137.62 s > groups_above_threshold 1
  1214. 137.62 s > integrand se1l
  1215. 137.62 s > span warm_up{integrand.name=se1l}
  1216. 137.62 s > threshold_status above threshold
  1217. 137.62 s > [2026-08-28 15:32:44.018] @process::amplitude INFO : overlap structure of group 0: [1: [0(2,3)]]
  1218. 137.62 s > field value
  1219. 137.62 s > span warm_up{integrand.name=se1l}
  1220. 137.62 s > [2026-08-28 15:32:44.021] @process::amplitude WARNING : External state 0 ('g', PDG 21, helicity +) is off shell: p^2 = +2.5e5, expected m^2 = +0e0 (|Δ| = +2.5e5). Fixed-helicity spinor/vector/tensor external states may be ill-defined at this kinematic point.
  1221. 137.62 s > field value
  1222. 137.62 s > span warm_up{integrand.name=se1l_mur_shifted}
  1223. 137.62 s > [2026-08-28 15:32:44.021] @process::amplitude WARNING : External state 1 ('g', PDG 21, helicity -) is off shell: p^2 = +2.5e5, expected m^2 = +0e0 (|Δ| = +2.5e5). Fixed-helicity spinor/vector/tensor external states may be ill-defined at this kinematic point.
  1224. 137.62 s > field value
  1225. 137.62 s > span warm_up{integrand.name=se1l_mur_shifted}
  1226. 137.62 s > [2026-08-28 15:32:44.021] @process::amplitude INFO : Input is above threshold: 1 existing threshold E-surfaces across 1/1 graph groups
  1227. 137.62 s > field value
  1228. 137.62 s > existing_esurfaces 1
  1229. 137.62 s > group_count 1
  1230. 137.62 s > groups_above_threshold 1
  1231. 137.62 s > integrand se1l_mur_shifted
  1232. 137.62 s > span warm_up{integrand.name=se1l_mur_shifted}
  1233. 137.62 s > threshold_status above threshold
  1234. 137.62 s > [2026-08-28 15:32:44.021] @process::amplitude INFO : overlap structure of group 0: [1: [0(2,3)]]
  1235. 137.62 s > field value
  1236. 137.62 s > span warm_up{integrand.name=se1l_mur_shifted}
  1237. 137.62 s > The application panicked (crashed).
  1238. 137.62 s > Message: Integrated UV case failed: se1l
  1239. 137.62 s > Location: tests/tests/uv.rs:1068
  1240. 137.62 s >
  1241. 137.62 s > ━━━━━━━━━━━━━━━━━━━━━━━━━━━━━━━━━━ BACKTRACE ━━━━━━━━━━━━━━━━━━━━━━━━━━━━━━━━━━━
  1242. 137.62 s > 1: <color_eyre[51793ea62743adbd]::config::PanicHook>::panic_report<unknown>
  1243. 137.62 s > at <unknown source file>:<unknown line>
  1244. 137.62 s > 2: <color_eyre[51793ea62743adbd]::config::PanicHook>::into_panic_hook::{closure#0}<unknown>
  1245. 137.62 s > at <unknown source file>:<unknown line>
  1246. 137.62 s > 3: std[bcb96dfbba0ab899]::panicking::panic_with_hook<unknown>
  1247. 137.62 s > at <unknown source file>:<unknown line>
  1248. 137.62 s > 4: std[bcb96dfbba0ab899]::panicking::panic_handler::{closure#0}<unknown>
  1249. 137.62 s > at <unknown source file>:<unknown line>
  1250. 137.62 s > 5: std[bcb96dfbba0ab899]::sys::backtrace::__rust_end_short_backtrace::<std[bcb96dfbba0ab899]::panicking::panic_handler::{closure#0}, !><unknown>
  1251. 137.62 s > at <unknown source file>:<unknown line>
  1252. 137.62 s > 6: __rustc[6c289b9f9c454d21]::rust_begin_unwind<unknown>
  1253. 137.62 s > at <unknown source file>:<unknown line>
  1254. 137.62 s > 7: core[940e698046960fd5]::panicking::panic_fmt<unknown>
  1255. 137.62 s > at <unknown source file>:<unknown line>
  1256. 137.62 s > 8: uv[52cf2b63f0104e31]::run_single_integrated_uv_case<unknown>
  1257. 137.62 s > at <unknown source file>:<unknown line>
  1258. 137.62 s > 9: <uv[52cf2b63f0104e31]::se1l_uv::{closure#0} as core[940e698046960fd5]::ops::function::FnOnce<()>>::call_once<unknown>
  1259. 137.62 s > at <unknown source file>:<unknown line>
  1260. 137.62 s > 10: test[75d6903177b1d7e9]::__rust_begin_short_backtrace::<core[940e698046960fd5]::result::Result<(), alloc[2ea6bcb46fca0c42]::string::String>, fn() -> core[940e698046960fd5]::result::Result<(), alloc[2ea6bcb46fca0c42]::string::String>><unknown>
  1261. 137.62 s > at <unknown source file>:<unknown line>
  1262. 137.62 s > 11: test[75d6903177b1d7e9]::run_test::{closure#0}<unknown>
  1263. 137.62 s > at <unknown source file>:<unknown line>
  1264. 137.62 s > 12: std[bcb96dfbba0ab899]::sys::backtrace::__rust_begin_short_backtrace::<test[75d6903177b1d7e9]::run_test::{closure#1}, ()><unknown>
  1265. 137.62 s > at <unknown source file>:<unknown line>
  1266. 137.62 s > 13: <std[bcb96dfbba0ab899]::thread::lifecycle::spawn_unchecked<test[75d6903177b1d7e9]::run_test::{closure#1}, ()>::{closure#1} as core[940e698046960fd5]::ops::function::FnOnce<()>>::call_once::{shim:vtable#0}<unknown>
  1267. 137.62 s > at <unknown source file>:<unknown line>
  1268. 137.62 s > 14: <std[bcb96dfbba0ab899]::sys::thread::unix::Thread>::new::thread_start<unknown>
  1269. 137.62 s > at <unknown source file>:<unknown line>
  1270. 137.62 s > 15: start_thread<unknown>
  1271. 137.62 s > at <unknown source file>:<unknown line>
  1272. 137.62 s > 16: __clone3<unknown>
  1273. 137.62 s > at <unknown source file>:<unknown line>
  1274. 137.62 s >
  1275. 137.62 s > Run with COLORBT_SHOW_HIDDEN=1 environment variable to disable frame filtering.
  1276. 137.62 s > Run with RUST_BACKTRACE=full to include source snippets.
  1277. 137.62 s >
  1278. 137.62 s > error: test run failed
  1279. 137.62 s >
  1280. 137.62 s > ========== nextest test summary ==========
  1281. 137.62 s > report: target/nextest/ci_gammaloop/junit.xml
  1282. 137.62 s > tests: 106, failures: 9, errors: 0
  1283. 137.62 s >
  1284. 137.62 s > 1. gammaloop-integration-tests::test_runs::approach::approach_momentum_space_reports_incomplete_triplet_cleanly
  1285. 137.62 s > failure: test failure with exit code 101
  1286. 137.62 s > system-out
  1287. 137.62 s > running 1 test
  1288. 137.62 s > test approach::approach_momentum_space_reports_incomplete_triplet_cleanly ... FAILED
  1289. 137.62 s >
  1290. 137.62 s > failures:
  1291. 137.62 s >
  1292. 137.62 s > failures:
  1293. 137.62 s > approach::approach_momentum_space_reports_incomplete_triplet_cleanly
  1294. 137.62 s >
  1295. 137.62 s > test result: FAILED. 0 passed; 1 failed; 0 ignored; 0 measured; 82 filtered out; finished in 0.68s
  1296. 137.62 s > system-err
  1297. 137.62 s > [2026-08-28 15:30:50.233] @gammaloop_api::se... INFO : Running command import model scalars-default.json
  1298. 137.62 s > [2026-08-28 15:30:50.234] @import::model INFO : Loading built-in JSON model scalars-default
  1299. 137.62 s > [2026-08-28 15:30:50.237] @gammalooprs::model INFO : The following 2 external parameters were forced to zero by the restriction card:
  1300. 137.62 s > width_scalar_1, width_scalar_2
  1301. 137.62 s > [2026-08-28 15:30:50.238] @gammaloop_api::se... INFO : Running command remove processes
  1302. 137.62 s > [2026-08-28 15:30:50.239] @gammaloop_api::se... INFO : Running command generate amp scalar_1 > scalar_0 scalar_0 [{1}] --allowed-vertex-interactions V_3_SCALAR_022 V_3_SCALAR_122 -p triangle -i scalar_tri
  1303. 137.62 s > [2026-08-28 15:30:50.240] @feyngen::diagram_... INFO : 0s | Δ=0s | Starting Feynman graph generation with Symbolica...
  1304. 137.62 s > [2026-08-28 15:30:50.240] @feyngen::diagram_... INFO : 0s | Δ=0s | Number of graphs resulting from Symbolica generation: 1
  1305. 137.62 s > [2026-08-28 15:30:50.240] @feyngen::diagram_... INFO : 0s | Δ=0s | Number of graphs retained after removal of vetoed topologies: 1
  1306. 137.62 s > [2026-08-28 15:30:50.240] @feyngen::diagram_... INFO : 0s | Δ=0s | Number of graphs after vertex info assignment: 1
  1307. 137.62 s > [2026-08-28 15:30:50.240] @feyngen::diagram_... INFO : 0s | Δ=0s | Number of graphs after all complete graphs filters are applied: 1
  1308. 137.62 s > [2026-08-28 15:30:50.240] @feyngen::diagram_... INFO : 0s | Δ=0s | Number of graphs after closed fermion chains analysis: 1
  1309. 137.62 s > [2026-08-28 15:30:50.240] @feyngen::diagram_... INFO : 0s | Δ=0s | Number of graphs after symmetrization of external states: 1
  1310. 137.62 s > [2026-08-28 15:30:50.240] @feyngen::diagram_... INFO : 0s | Δ=0s | Number of graphs after canonization of vertices, edges and flows (graph labels assigned here): 1
  1311. 137.62 s > [2026-08-28 15:30:50.250] @feyngen::diagram_... INFO : 0s | Δ=0s | Number of graphs after numerator-aware grouping with strategy 'up to a scalar rescaling': 1 (1 isomorphically unique graph, 0 color zero, 0 lorentz zero, 0 grouped and 0 cancellation)
  1312. 137.62 s > [2026-08-28 15:30:50.250] @feyngen::diagram_... INFO : ( Sum of the symmetry factors from each graph generated = 1 )
  1313. 137.62 s > [2026-08-28 15:30:50.250] @commands::generate INFO : Generated amplitude 1 graphs.
  1314. 137.62 s > [2026-08-28 15:30:50.287] @settings::runtime WARNING : No external kinematics were provided; using default-generated external momenta and helicities.
  1315. 137.62 s > [2026-08-28 15:30:50.361] @commands::generate INFO :
  1316. 137.62 s > Integrand generation summary
  1317. 137.62 s > peak RAM 65.78 MiB | cores 1
  1318. 137.62 s > ╭────────────┬───────┬─────────┬────────────┬───────────┬────────────────┬─────────────╮
  1319. 137.62 s > │ integrand │ graph │ # evals │ expr build │ spenso │ symbolica eval │ compile │
  1320. 137.62 s > ├────────────┼───────┼─────────┼────────────┼───────────┼────────────────┼─────────────┤
  1321. 137.62 s > │ scalar_tri │ GL0 │ 9 │ 19ms (59%) │ 4ms (15%) │ 8ms (27%) │ 0ms (0.00%) │
  1322. 137.62 s > ├────────────┼───────┼─────────┼────────────┼───────────┼────────────────┼─────────────┤
  1323. 137.62 s > │ Total │ │ 9 │ 19ms (59%) │ 4ms (15%) │ 8ms (27%) │ 0ms (0.00%) │
  1324. 137.62 s > ╰────────────┴───────┴─────────┴────────────┴───────────┴────────────────┴─────────────╯
  1325. 137.62 s > [2026-08-28 15:30:50.361] @gammaloop_api::se... INFO : Running command generate amp scalar_0 scalar_0 > scalar_0 scalar_0 [{1}] --allowed-vertex-interactions V_3_SCALAR_022 -p box -i scalar_box --select-graphs GL0
  1326. 137.62 s > [2026-08-28 15:30:50.363] @feyngen::diagram_... INFO : 0s | Δ=0s | Starting Feynman graph generation with Symbolica...
  1327. 137.62 s > [2026-08-28 15:30:50.363] @feyngen::diagram_... INFO : 0s | Δ=0s | Number of graphs resulting from Symbolica generation: 3
  1328. 137.62 s > [2026-08-28 15:30:50.363] @feyngen::diagram_... INFO : 0s | Δ=0s | Number of graphs retained after removal of vetoed topologies: 3
  1329. 137.62 s > [2026-08-28 15:30:50.363] @feyngen::diagram_... INFO : 0s | Δ=0s | Number of graphs after vertex info assignment: 3
  1330. 137.62 s > [2026-08-28 15:30:50.364] @feyngen::diagram_... INFO : 0s | Δ=0s | Number of graphs after all complete graphs filters are applied: 3
  1331. 137.62 s > [2026-08-28 15:30:50.364] @feyngen::diagram_... INFO : 0s | Δ=0s | Number of graphs after closed fermion chains analysis: 3
  1332. 137.62 s > [2026-08-28 15:30:50.364] @feyngen::diagram_... INFO : 0s | Δ=0s | Number of graphs after symmetrization of external states: 3
  1333. 137.62 s > [2026-08-28 15:30:50.364] @feyngen::diagram_... INFO : 0s | Δ=0s | Number of graphs after canonization of vertices, edges and flows (graph labels assigned here): 3
  1334. 137.62 s > [2026-08-28 15:30:50.370] @feyngen::diagram_... INFO : 0s | Δ=0s | Number of graphs after numerator-aware grouping with strategy 'up to a scalar rescaling': 1 (1 isomorphically unique graph, 0 color zero, 0 lorentz zero, 0 grouped and 0 cancellation)
  1335. 137.62 s > [2026-08-28 15:30:50.370] @feyngen::diagram_... INFO : ( Sum of the symmetry factors from each graph generated = 1 )
  1336. 137.62 s > [2026-08-28 15:30:50.371] @commands::generate INFO : Generated amplitude 1 graphs.
  1337. 137.62 s > [2026-08-28 15:30:50.491] @settings::runtime WARNING : No external kinematics were provided; using default-generated external momenta and helicities.
  1338. 137.62 s > [2026-08-28 15:30:50.585] @commands::generate INFO :
  1339. 137.62 s > Integrand generation summary
  1340. 137.62 s > peak RAM 69.34 MiB | cores 1
  1341. 137.62 s > ╭────────────┬───────┬─────────┬────────────┬────────────┬────────────────┬─────────────╮
  1342. 137.62 s > │ integrand │ graph │ # evals │ expr build │ spenso │ symbolica eval │ compile │
  1343. 137.62 s > ├────────────┼───────┼─────────┼────────────┼────────────┼────────────────┼─────────────┤
  1344. 137.62 s > │ scalar_box │ GL0 │ 13 │ 83ms (72%) │ 7ms (6.3%) │ 25ms (22%) │ 0ms (0.00%) │
  1345. 137.62 s > ├────────────┼───────┼─────────┼────────────┼────────────┼────────────────┼─────────────┤
  1346. 137.62 s > │ Total │ │ 13 │ 83ms (72%) │ 7ms (6.3%) │ 25ms (22%) │ 0ms (0.00%) │
  1347. 137.62 s > ╰────────────┴───────┴─────────┴────────────┴────────────┴────────────────┴─────────────╯
  1348. 137.62 s > [2026-08-28 15:30:50.586] @gammaloop_api::se... INFO : Running command generate
  1349. 137.62 s > [2026-08-28 15:30:50.656] @settings::runtime WARNING : No external kinematics were provided; using default-generated external momenta and helicities.
  1350. 137.62 s > [2026-08-28 15:30:50.696] @settings::runtime WARNING : No external kinematics were provided; using default-generated external momenta and helicities.
  1351. 137.62 s > [2026-08-28 15:30:50.798] @commands::generate INFO :
  1352. 137.62 s > Integrand generation summary
  1353. 137.62 s > peak RAM 71.74 MiB | cores 1
  1354. 137.62 s > ╭────────────┬───────┬─────────┬────────────┬────────────┬────────────────┬─────────────╮
  1355. 137.62 s > │ integrand │ graph │ # evals │ expr build │ spenso │ symbolica eval │ compile │
  1356. 137.62 s > ├────────────┼───────┼─────────┼────────────┼────────────┼────────────────┼─────────────┤
  1357. 137.62 s > │ scalar_tri │ GL0 │ 9 │ 18ms (71%) │ 1ms (6.4%) │ 6ms (23%) │ 0ms (0.00%) │
  1358. 137.62 s > │ scalar_box │ GL0 │ 13 │ 42ms (52%) │ 8ms (9.9%) │ 31ms (38%) │ 0ms (0.00%) │
  1359. 137.62 s > ├────────────┼───────┼─────────┼────────────┼────────────┼────────────────┼─────────────┤
  1360. 137.62 s > │ Total │ │ 22 │ 61ms (57%) │ 9ms (9.0%) │ 37ms (34%) │ 0ms (0.00%) │
  1361. 137.62 s > ╰────────────┴───────┴─────────┴────────────┴────────────┴────────────────┴─────────────╯
  1362. 137.62 s > [2026-08-28 15:30:50.799] @gammaloop_api::se... INFO : Running command set model mass_scalar_2=2.0
  1363. 137.62 s > [2026-08-28 15:30:50.800] @gammaloop_api::se... INFO : Running command set model mass_scalar_1=1.0
  1364. 137.62 s > [2026-08-28 15:30:50.801] @gammaloop_api::se... INFO : Running command set process -p triangle -i scalar_tri string '
  1365. 137.62 s > [kinematics.externals]
  1366. 137.62 s > type = "constant"
  1367. 137.62 s >
  1368. 137.62 s > [kinematics.externals.data]
  1369. 137.62 s > [...]
  1370. 137.62 s > [2026-08-28 15:30:50.802] @gammaloop_api::se... INFO : Running command set process -p box -i scalar_box string '
  1371. 137.62 s > [kinematics.externals]
  1372. 137.62 s > type = "constant"
  1373. 137.62 s >
  1374. 137.62 s > [kinematics.externals.data]
  1375. 137.62 s > [...]
  1376. 137.62 s > [2026-08-28 15:30:50.804] @gammaloop_api::se... INFO : Running command approach -x 1.0000000000000001e-1,2.0000000000000001e-1,2.9999999999999999e-1,4.0000000000000002e-1 --approach-axis 1.0000000000000000e-3,0.0000000000000000e0,0.0000000000000000e0,0.0000000000000000e0 --n-points 1 --n-cores 1 --output-results /build/source/tests/artifacts/scalar_box_invalid_momentum_approach/approach_momentum.json --momentum-space --graph-id 0
  1377. 137.62 s > The application panicked (crashed).
  1378. 137.62 s > Message: There are 2 processes available. Please specify a process.
  1379. 137.62 s > Location: tests/tests/test_runs/approach.rs:332
  1380. 137.62 s >
  1381. 137.62 s > ━━━━━━━━━━━━━━━━━━━━━━━━━━━━━━━━━━ BACKTRACE ━━━━━━━━━━━━━━━━━━━━━━━━━━━━━━━━━━━
  1382. 137.62 s > 1: <color_eyre[51793ea62743adbd]::config::PanicHook>::panic_report<unknown>
  1383. 137.62 s > at <unknown source file>:<unknown line>
  1384. 137.62 s > 2: <color_eyre[51793ea62743adbd]::config::PanicHook>::into_panic_hook::{closure#0}<unknown>
  1385. 137.62 s > at <unknown source file>:<unknown line>
  1386. 137.62 s > 3: std[bcb96dfbba0ab899]::panicking::panic_with_hook<unknown>
  1387. 137.62 s > at <unknown source file>:<unknown line>
  1388. 137.62 s > 4: std[bcb96dfbba0ab899]::panicking::panic_handler::{closure#0}<unknown>
  1389. 137.62 s > at <unknown source file>:<unknown line>
  1390. 137.62 s > 5: std[bcb96dfbba0ab899]::sys::backtrace::__rust_end_short_backtrace::<std[bcb96dfbba0ab899]::panicking::panic_handler::{closure#0}, !><unknown>
  1391. 137.62 s > at <unknown source file>:<unknown line>
  1392. 137.62 s > 6: __rustc[6c289b9f9c454d21]::rust_begin_unwind<unknown>
  1393. 137.62 s > at <unknown source file>:<unknown line>
  1394. 137.62 s > 7: core[940e698046960fd5]::panicking::panic_fmt<unknown>
  1395. 137.62 s > at <unknown source file>:<unknown line>
  1396. 137.62 s > 8: test_runs[3e7a390caee4e338]::approach::approach_momentum_space_reports_incomplete_triplet_cleanly<unknown>
  1397. 137.62 s > at <unknown source file>:<unknown line>
  1398. 137.62 s > 9: <test_runs[3e7a390caee4e338]::approach::approach_momentum_space_reports_incomplete_triplet_cleanly::{closure#0} as core[940e698046960fd5]::ops::function::FnOnce<()>>::call_once<unknown>
  1399. 137.62 s > at <unknown source file>:<unknown line>
  1400. 137.62 s > 10: test[75d6903177b1d7e9]::__rust_begin_short_backtrace::<core[940e698046960fd5]::result::Result<(), alloc[2ea6bcb46fca0c42]::string::String>, fn() -> core[940e698046960fd5]::result::Result<(), alloc[2ea6bcb46fca0c42]::string::String>><unknown>
  1401. 137.62 s > at <unknown source file>:<unknown line>
  1402. 137.62 s > 11: test[75d6903177b1d7e9]::run_test::{closure#0}<unknown>
  1403. 137.62 s > at <unknown source file>:<unknown line>
  1404. 137.62 s > 12: std[bcb96dfbba0ab899]::sys::backtrace::__rust_begin_short_backtrace::<test[75d6903177b1d7e9]::run_test::{closure#1}, ()><unknown>
  1405. 137.62 s > at <unknown source file>:<unknown line>
  1406. 137.62 s > 13: <std[bcb96dfbba0ab899]::thread::lifecycle::spawn_unchecked<test[75d6903177b1d7e9]::run_test::{closure#1}, ()>::{closure#1} as core[940e698046960fd5]::ops::function::FnOnce<()>>::call_once::{shim:vtable#0}<unknown>
  1407. 137.62 s > at <unknown source file>:<unknown line>
  1408. 137.62 s > 14: <std[bcb96dfbba0ab899]::sys::thread::unix::Thread>::new::thread_start<unknown>
  1409. 137.62 s > at <unknown source file>:<unknown line>
  1410. 137.62 s > 15: start_thread<unknown>
  1411. 137.62 s > at <unknown source file>:<unknown line>
  1412. 137.62 s > 16: __clone3<unknown>
  1413. 137.62 s > at <unknown source file>:<unknown line>
  1414. 137.62 s >
  1415. 137.62 s > Run with COLORBT_SHOW_HIDDEN=1 environment variable to disable frame filtering.
  1416. 137.62 s > ... omitted 1 more lines; see full nextest output above
  1417. 137.62 s >
  1418. 137.62 s > 2. gammaloop-integration-tests::test_runs::profile_bulk::dotted_bubble_amp_bulk_profile_passes
  1419. 137.62 s > failure: test failure with exit code 101
  1420. 137.62 s > Error:
  1421. 137.62 s > 0: IR profiling requested arbitrary precision but received a quad-precision result
  1422. 137.62 s >
  1423. 137.62 s > Location:
  1424. 137.62 s > crates/gammalooprs/src/integrands/process/ir.rs:2123
  1425. 137.62 s >
  1426. 137.62 s > ━━━━━━━━━━━━━━━━━━━━━━━━━━━━━━━━━━ BACKTRACE ━━━━━━━━━━━━━━━━━━━━━━━━━━━━━━━━━━━
  1427. 137.62 s > 1: <color_eyre[51793ea62743adbd]::config::EyreHook>::into_eyre_hook::{closure#0}<unknown>
  1428. 137.62 s > at <unknown source file>:<unknown line>
  1429. 137.62 s > 2: eyre[cb2fd339c0c40fca]::capture_handler<unknown>
  1430. 137.62 s > at <unknown source file>:<unknown line>
  1431. 137.62 s > 3: eyre[cb2fd339c0c40fca]::private::format_err<unknown>
  1432. 137.62 s > at <unknown source file>:<unknown line>
  1433. 137.62 s > 4: gammalooprs[d7a7c067ebd19583]::integrands::process::ir::evaluate_profile_momentum_point_arb::<gammalooprs[d7a7c067ebd19583]::integrands::process::amplitude::AmplitudeIntegrand><unknown>
  1434. 137.62 s > at <unknown source file>:<unknown line>
  1435. 137.62 s > 5: <gammalooprs[d7a7c067ebd19583]::integrands::process::amplitude::AmplitudeIntegrand>::test_single_ir_limit_impl<unknown>
  1436. 137.62 s > at <unknown source file>:<unknown line>
  1437. 137.62 s > 6: gammalooprs[d7a7c067ebd19583]::integrands::process::ir::run_ir_profile::<gammalooprs[d7a7c067ebd19583]::integrands::process::amplitude::AmplitudeIntegrand, <gammalooprs[d7a7c067ebd19583]::integrands::process::amplitude::AmplitudeIntegrand>::enumerate_ir_limits, <gammalooprs[d7a7c067ebd19583]::integrands::process::amplitude::AmplitudeIntegrand>::graph_cut_definitions, <gammalooprs[d7a7c067ebd19583]::integrands::process::amplitude::AmplitudeIntegrand>::test_single_ir_limit_impl><unknown>
  1438. 137.62 s > at <unknown source file>:<unknown line>
  1439. 137.62 s > 7: <gammalooprs[d7a7c067ebd19583]::integrands::process::amplitude::AmplitudeIntegrand>::test_ir<unknown>
  1440. 137.62 s > at <unknown source file>:<unknown line>
  1441. 137.62 s > 8: <gammaloop_api[92ae732909e47e14]::commands::profile::Profile>::run<unknown>
  1442. 137.62 s > at <unknown source file>:<unknown line>
  1443. 137.62 s > 9: test_runs[3e7a390caee4e338]::profile_bulk::dotted_bubble_amp_bulk_profile_passes<unknown>
  1444. 137.62 s > at <unknown source file>:<unknown line>
  1445. 137.62 s > 10: <test_runs[3e7a390caee4e338]::profile_bulk::dotted_bubble_amp_bulk_profile_passes::{closure#0} as core[940e698046960fd5]::ops::function::FnOnce<()>>::call_once<unknown>
  1446. 137.62 s > at <unknown source file>:<unknown line>
  1447. 137.62 s > 11: test[75d6903177b1d7e9]::__rust_begin_short_backtrace::<core[940e698046960fd5]::result::Result<(), alloc[2ea6bcb46fca0c42]::string::String>, fn() -> core[940e698046960fd5]::result::Result<(), alloc[2ea6bcb46fca0c42]::string::String>><unknown>
  1448. 137.62 s > at <unknown source file>:<unknown line>
  1449. 137.62 s > 12: test[75d6903177b1d7e9]::run_test::{closure#0}<unknown>
  1450. 137.62 s > at <unknown source file>:<unknown line>
  1451. 137.62 s > 13: std[bcb96dfbba0ab899]::sys::backtrace::__rust_begin_short_backtrace::<test[75d6903177b1d7e9]::run_test::{closure#1}, ()><unknown>
  1452. 137.62 s > at <unknown source file>:<unknown line>
  1453. 137.62 s > 14: <std[bcb96dfbba0ab899]::thread::lifecycle::spawn_unchecked<test[75d6903177b1d7e9]::run_test::{closure#1}, ()>::{closure#1} as core[940e698046960fd5]::ops::function::FnOnce<()>>::call_once::{shim:vtable#0}<unknown>
  1454. 137.62 s > at <unknown source file>:<unknown line>
  1455. 137.62 s > 15: <std[bcb96dfbba0ab899]::sys::thread::unix::Thread>::new::thread_start<unknown>
  1456. 137.62 s > at <unknown source file>:<unknown line>
  1457. 137.62 s > 16: start_thread<unknown>
  1458. 137.62 s > at <unknown source file>:<unknown line>
  1459. 137.62 s > 17: __clone3<unknown>
  1460. 137.62 s > at <unknown source file>:<unknown line>
  1461. 137.62 s >
  1462. 137.62 s > Run with COLORBT_SHOW_HIDDEN=1 environment variable to disable frame filtering.
  1463. 137.62 s > Run with RUST_BACKTRACE=full to include source snippets.
  1464. 137.62 s > Warning: SpanTrace capture is Unsupported.
  1465. 137.62 s > Ensure that you've setup a tracing-error ErrorLayer and the semver versions are compatible
  1466. 137.62 s > system-out
  1467. 137.62 s > running 1 test
  1468. 137.62 s > test profile_bulk::dotted_bubble_amp_bulk_profile_passes ... FAILED
  1469. 137.62 s >
  1470. 137.62 s > failures:
  1471. 137.62 s >
  1472. 137.62 s > failures:
  1473. 137.62 s > profile_bulk::dotted_bubble_amp_bulk_profile_passes
  1474. 137.62 s >
  1475. 137.62 s > test result: FAILED. 0 passed; 1 failed; 0 ignored; 0 measured; 82 filtered out; finished in 0.27s
  1476. 137.62 s > system-err
  1477. 137.62 s > [2026-08-28 15:30:52.301] @gammaloop_api::se... INFO : Running command import model ./assets/models/json/scalars/scalars_2p_3p.json
  1478. 137.62 s > [2026-08-28 15:30:52.301] @import::model INFO : Loading JSON model scalars_2p_3p-default from /build/source/assets/models/json/scalars/scalars_2p_3p
  1479. 137.62 s > [2026-08-28 15:30:52.302] @gammaloop_api::se... INFO : Running command import graphs ./tests/resources/graphs/dotted_bubble_amp.dot
  1480. 137.62 s > [2026-08-28 15:30:52.302] @commands::import INFO : Loading graphs from '/build/source/tests/resources/graphs/dotted_bubble_amp.dot'
  1481. 137.62 s > [2026-08-28 15:30:52.305] @gammaloop_api::se... INFO : Running command generate
  1482. 137.62 s > [2026-08-28 15:30:52.419] @commands::generate INFO :
  1483. 137.62 s > Integrand generation summary
  1484. 137.62 s > peak RAM 65.49 MiB | cores 1
  1485. 137.62 s > ╭───────────┬───────────────────┬─────────┬────────────┬────────────┬────────────────┬─────────────╮
  1486. 137.62 s > │ integrand │ graph │ # evals │ expr build │ spenso │ symbolica eval │ compile │
  1487. 137.62 s > ├───────────┼───────────────────┼─────────┼────────────┼────────────┼────────────────┼─────────────┤
  1488. 137.62 s > │ default │ dotted_bubble_amp │ 8 │ 21ms (70%) │ 1ms (5.9%) │ 7ms (24%) │ 0ms (0.00%) │
  1489. 137.62 s > ├───────────┼───────────────────┼─────────┼────────────┼────────────┼────────────────┼─────────────┤
  1490. 137.62 s > │ Total │ │ 8 │ 21ms (70%) │ 1ms (5.9%) │ 7ms (24%) │ 0ms (0.00%) │
  1491. 137.62 s > ╰───────────┴───────────────────┴─────────┴────────────┴────────────┴────────────────┴─────────────╯
  1492. 137.62 s > [2026-08-28 15:30:52.420] @process::amplitude INFO : Input is above threshold: 1 existing threshold E-surfaces across 1/1 graph groups
  1493. 137.62 s > [2026-08-28 15:30:52.420] @process::amplitude INFO : overlap structure of group 0: [1: [1(1,3)]]
  1494. 137.62 s > Error:
  1495. 137.62 s > 0: IR profiling requested arbitrary precision but received a quad-precision result
  1496. 137.62 s >
  1497. 137.62 s > Location:
  1498. 137.62 s > crates/gammalooprs/src/integrands/process/ir.rs:2123
  1499. 137.62 s >
  1500. 137.62 s > ━━━━━━━━━━━━━━━━━━━━━━━━━━━━━━━━━━ BACKTRACE ━━━━━━━━━━━━━━━━━━━━━━━━━━━━━━━━━━━
  1501. 137.62 s > 1: <color_eyre[51793ea62743adbd]::config::EyreHook>::into_eyre_hook::{closure#0}<unknown>
  1502. 137.62 s > at <unknown source file>:<unknown line>
  1503. 137.62 s > 2: eyre[cb2fd339c0c40fca]::capture_handler<unknown>
  1504. 137.62 s > at <unknown source file>:<unknown line>
  1505. 137.62 s > 3: eyre[cb2fd339c0c40fca]::private::format_err<unknown>
  1506. 137.62 s > at <unknown source file>:<unknown line>
  1507. 137.62 s > 4: gammalooprs[d7a7c067ebd19583]::integrands::process::ir::evaluate_profile_momentum_point_arb::<gammalooprs[d7a7c067ebd19583]::integrands::process::amplitude::AmplitudeIntegrand><unknown>
  1508. 137.62 s > at <unknown source file>:<unknown line>
  1509. 137.62 s > 5: <gammalooprs[d7a7c067ebd19583]::integrands::process::amplitude::AmplitudeIntegrand>::test_single_ir_limit_impl<unknown>
  1510. 137.62 s > at <unknown source file>:<unknown line>
  1511. 137.62 s > 6: gammalooprs[d7a7c067ebd19583]::integrands::process::ir::run_ir_profile::<gammalooprs[d7a7c067ebd19583]::integrands::process::amplitude::AmplitudeIntegrand, <gammalooprs[d7a7c067ebd19583]::integrands::process::amplitude::AmplitudeIntegrand>::enumerate_ir_limits, <gammalooprs[d7a7c067ebd19583]::integrands::process::amplitude::AmplitudeIntegrand>::graph_cut_definitions, <gammalooprs[d7a7c067ebd19583]::integrands::process::amplitude::AmplitudeIntegrand>::test_single_ir_limit_impl><unknown>
  1512. 137.62 s > at <unknown source file>:<unknown line>
  1513. 137.62 s > 7: <gammalooprs[d7a7c067ebd19583]::integrands::process::amplitude::AmplitudeIntegrand>::test_ir<unknown>
  1514. 137.62 s > at <unknown source file>:<unknown line>
  1515. 137.62 s > 8: <gammaloop_api[92ae732909e47e14]::commands::profile::Profile>::run<unknown>
  1516. 137.62 s > at <unknown source file>:<unknown line>
  1517. 137.62 s > 9: test_runs[3e7a390caee4e338]::profile_bulk::dotted_bubble_amp_bulk_profile_passes<unknown>
  1518. 137.62 s > at <unknown source file>:<unknown line>
  1519. 137.62 s > 10: <test_runs[3e7a390caee4e338]::profile_bulk::dotted_bubble_amp_bulk_profile_passes::{closure#0} as core[940e698046960fd5]::ops::function::FnOnce<()>>::call_once<unknown>
  1520. 137.62 s > at <unknown source file>:<unknown line>
  1521. 137.62 s > 11: test[75d6903177b1d7e9]::__rust_begin_short_backtrace::<core[940e698046960fd5]::result::Result<(), alloc[2ea6bcb46fca0c42]::string::String>, fn() -> core[940e698046960fd5]::result::Result<(), alloc[2ea6bcb46fca0c42]::string::String>><unknown>
  1522. 137.62 s > at <unknown source file>:<unknown line>
  1523. 137.62 s > 12: test[75d6903177b1d7e9]::run_test::{closure#0}<unknown>
  1524. 137.62 s > at <unknown source file>:<unknown line>
  1525. 137.62 s > 13: std[bcb96dfbba0ab899]::sys::backtrace::__rust_begin_short_backtrace::<test[75d6903177b1d7e9]::run_test::{closure#1}, ()><unknown>
  1526. 137.62 s > at <unknown source file>:<unknown line>
  1527. 137.62 s > 14: <std[bcb96dfbba0ab899]::thread::lifecycle::spawn_unchecked<test[75d6903177b1d7e9]::run_test::{closure#1}, ()>::{closure#1} as core[940e698046960fd5]::ops::function::FnOnce<()>>::call_once::{shim:vtable#0}<unknown>
  1528. 137.62 s > at <unknown source file>:<unknown line>
  1529. 137.62 s > 15: <std[bcb96dfbba0ab899]::sys::thread::unix::Thread>::new::thread_start<unknown>
  1530. 137.62 s > at <unknown source file>:<unknown line>
  1531. 137.62 s > 16: start_thread<unknown>
  1532. 137.62 s > at <unknown source file>:<unknown line>
  1533. 137.62 s > 17: __clone3<unknown>
  1534. 137.62 s > at <unknown source file>:<unknown line>
  1535. 137.62 s >
  1536. 137.62 s > Run with COLORBT_SHOW_HIDDEN=1 environment variable to disable frame filtering.
  1537. 137.62 s > Run with RUST_BACKTRACE=full to include source snippets.
  1538. 137.62 s > Warning: SpanTrace capture is Unsupported.
  1539. 137.62 s > Ensure that you've setup a tracing-error ErrorLayer and the semver versions are compatible
  1540. 137.62 s >
  1541. 137.62 s > 3. gammaloop-integration-tests::test_runs::profile_bulk::double_dotted_bubble_amp_bulk_profile_passes
  1542. 137.62 s > failure: test failure with exit code 101
  1543. 137.62 s > Error:
  1544. 137.62 s > 0: IR profiling requested arbitrary precision but received a quad-precision result
  1545. 137.62 s >
  1546. 137.62 s > Location:
  1547. 137.62 s > crates/gammalooprs/src/integrands/process/ir.rs:2123
  1548. 137.62 s >
  1549. 137.62 s > ━━━━━━━━━━━━━━━━━━━━━━━━━━━━━━━━━━ BACKTRACE ━━━━━━━━━━━━━━━━━━━━━━━━━━━━━━━━━━━
  1550. 137.62 s > 1: <color_eyre[51793ea62743adbd]::config::EyreHook>::into_eyre_hook::{closure#0}<unknown>
  1551. 137.62 s > at <unknown source file>:<unknown line>
  1552. 137.62 s > 2: eyre[cb2fd339c0c40fca]::capture_handler<unknown>
  1553. 137.62 s > at <unknown source file>:<unknown line>
  1554. 137.62 s > 3: eyre[cb2fd339c0c40fca]::private::format_err<unknown>
  1555. 137.62 s > at <unknown source file>:<unknown line>
  1556. 137.62 s > 4: gammalooprs[d7a7c067ebd19583]::integrands::process::ir::evaluate_profile_momentum_point_arb::<gammalooprs[d7a7c067ebd19583]::integrands::process::amplitude::AmplitudeIntegrand><unknown>
  1557. 137.62 s > at <unknown source file>:<unknown line>
  1558. 137.62 s > 5: <gammalooprs[d7a7c067ebd19583]::integrands::process::amplitude::AmplitudeIntegrand>::test_single_ir_limit_impl<unknown>
  1559. 137.62 s > at <unknown source file>:<unknown line>
  1560. 137.62 s > 6: gammalooprs[d7a7c067ebd19583]::integrands::process::ir::run_ir_profile::<gammalooprs[d7a7c067ebd19583]::integrands::process::amplitude::AmplitudeIntegrand, <gammalooprs[d7a7c067ebd19583]::integrands::process::amplitude::AmplitudeIntegrand>::enumerate_ir_limits, <gammalooprs[d7a7c067ebd19583]::integrands::process::amplitude::AmplitudeIntegrand>::graph_cut_definitions, <gammalooprs[d7a7c067ebd19583]::integrands::process::amplitude::AmplitudeIntegrand>::test_single_ir_limit_impl><unknown>
  1561. 137.62 s > at <unknown source file>:<unknown line>
  1562. 137.62 s > 7: <gammalooprs[d7a7c067ebd19583]::integrands::process::amplitude::AmplitudeIntegrand>::test_ir<unknown>
  1563. 137.62 s > at <unknown source file>:<unknown line>
  1564. 137.62 s > 8: <gammaloop_api[92ae732909e47e14]::commands::profile::Profile>::run<unknown>
  1565. 137.62 s > at <unknown source file>:<unknown line>
  1566. 137.62 s > 9: test_runs[3e7a390caee4e338]::profile_bulk::double_dotted_bubble_amp_bulk_profile_passes<unknown>
  1567. 137.62 s > at <unknown source file>:<unknown line>
  1568. 137.62 s > 10: <test_runs[3e7a390caee4e338]::profile_bulk::double_dotted_bubble_amp_bulk_profile_passes::{closure#0} as core[940e698046960fd5]::ops::function::FnOnce<()>>::call_once<unknown>
  1569. 137.62 s > at <unknown source file>:<unknown line>
  1570. 137.62 s > 11: test[75d6903177b1d7e9]::__rust_begin_short_backtrace::<core[940e698046960fd5]::result::Result<(), alloc[2ea6bcb46fca0c42]::string::String>, fn() -> core[940e698046960fd5]::result::Result<(), alloc[2ea6bcb46fca0c42]::string::String>><unknown>
  1571. 137.62 s > at <unknown source file>:<unknown line>
  1572. 137.62 s > 12: test[75d6903177b1d7e9]::run_test::{closure#0}<unknown>
  1573. 137.62 s > at <unknown source file>:<unknown line>
  1574. 137.62 s > 13: std[bcb96dfbba0ab899]::sys::backtrace::__rust_begin_short_backtrace::<test[75d6903177b1d7e9]::run_test::{closure#1}, ()><unknown>
  1575. 137.62 s > at <unknown source file>:<unknown line>
  1576. 137.62 s > 14: <std[bcb96dfbba0ab899]::thread::lifecycle::spawn_unchecked<test[75d6903177b1d7e9]::run_test::{closure#1}, ()>::{closure#1} as core[940e698046960fd5]::ops::function::FnOnce<()>>::call_once::{shim:vtable#0}<unknown>
  1577. 137.62 s > at <unknown source file>:<unknown line>
  1578. 137.62 s > 15: <std[bcb96dfbba0ab899]::sys::thread::unix::Thread>::new::thread_start<unknown>
  1579. 137.62 s > at <unknown source file>:<unknown line>
  1580. 137.62 s > 16: start_thread<unknown>
  1581. 137.62 s > at <unknown source file>:<unknown line>
  1582. 137.62 s > 17: __clone3<unknown>
  1583. 137.62 s > at <unknown source file>:<unknown line>
  1584. 137.62 s >
  1585. 137.62 s > Run with COLORBT_SHOW_HIDDEN=1 environment variable to disable frame filtering.
  1586. 137.62 s > Run with RUST_BACKTRACE=full to include source snippets.
  1587. 137.62 s > Warning: SpanTrace capture is Unsupported.
  1588. 137.62 s > Ensure that you've setup a tracing-error ErrorLayer and the semver versions are compatible
  1589. 137.62 s > system-out
  1590. 137.62 s > running 1 test
  1591. 137.62 s > test profile_bulk::double_dotted_bubble_amp_bulk_profile_passes ... FAILED
  1592. 137.62 s >
  1593. 137.62 s > failures:
  1594. 137.62 s >
  1595. 137.62 s > failures:
  1596. 137.62 s > profile_bulk::double_dotted_bubble_amp_bulk_profile_passes
  1597. 137.62 s >
  1598. 137.62 s > test result: FAILED. 0 passed; 1 failed; 0 ignored; 0 measured; 82 filtered out; finished in 0.33s
  1599. 137.62 s > system-err
  1600. 137.62 s > [2026-08-28 15:30:52.346] @gammaloop_api::se... INFO : Running command import model ./assets/models/json/scalars/scalars_2p_3p.json
  1601. 137.62 s > [2026-08-28 15:30:52.346] @import::model INFO : Loading JSON model scalars_2p_3p-default from /build/source/assets/models/json/scalars/scalars_2p_3p
  1602. 137.62 s > [2026-08-28 15:30:52.351] @gammaloop_api::se... INFO : Running command import graphs ./tests/resources/graphs/double_dotted_bubble_amp.dot
  1603. 137.62 s > [2026-08-28 15:30:52.351] @commands::import INFO : Loading graphs from '/build/source/tests/resources/graphs/double_dotted_bubble_amp.dot'
  1604. 137.62 s > [2026-08-28 15:30:52.359] @gammaloop_api::se... INFO : Running command generate
  1605. 137.62 s > [2026-08-28 15:30:52.472] @commands::generate INFO :
  1606. 137.62 s > Integrand generation summary
  1607. 137.62 s > peak RAM 63.96 MiB | cores 1
  1608. 137.62 s > ╭───────────┬──────────────────────────┬─────────┬────────────┬───────────┬────────────────┬─────────────╮
  1609. 137.62 s > │ integrand │ graph │ # evals │ expr build │ spenso │ symbolica eval │ compile │
  1610. 137.62 s > ├───────────┼──────────────────────────┼─────────┼────────────┼───────────┼────────────────┼─────────────┤
  1611. 137.62 s > │ default │ double_dotted_bubble_amp │ 11 │ 53ms (64%) │ 8ms (11%) │ 21ms (26%) │ 0ms (0.00%) │
  1612. 137.62 s > ├───────────┼──────────────────────────┼─────────┼────────────┼───────────┼────────────────┼─────────────┤
  1613. 137.62 s > │ Total │ │ 11 │ 53ms (64%) │ 8ms (11%) │ 21ms (26%) │ 0ms (0.00%) │
  1614. 137.62 s > ╰───────────┴──────────────────────────┴─────────┴────────────┴───────────┴────────────────┴─────────────╯
  1615. 137.62 s > [2026-08-28 15:30:52.473] @process::amplitude INFO : Input is above threshold: 1 existing threshold E-surfaces across 1/1 graph groups
  1616. 137.62 s > [2026-08-28 15:30:52.473] @process::amplitude INFO : overlap structure of group 0: [1: [1(1,4)]]
  1617. 137.62 s > Error:
  1618. 137.62 s > 0: IR profiling requested arbitrary precision but received a quad-precision result
  1619. 137.62 s >
  1620. 137.62 s > Location:
  1621. 137.62 s > crates/gammalooprs/src/integrands/process/ir.rs:2123
  1622. 137.62 s >
  1623. 137.62 s > ━━━━━━━━━━━━━━━━━━━━━━━━━━━━━━━━━━ BACKTRACE ━━━━━━━━━━━━━━━━━━━━━━━━━━━━━━━━━━━
  1624. 137.62 s > 1: <color_eyre[51793ea62743adbd]::config::EyreHook>::into_eyre_hook::{closure#0}<unknown>
  1625. 137.62 s > at <unknown source file>:<unknown line>
  1626. 137.62 s > 2: eyre[cb2fd339c0c40fca]::capture_handler<unknown>
  1627. 137.62 s > at <unknown source file>:<unknown line>
  1628. 137.62 s > 3: eyre[cb2fd339c0c40fca]::private::format_err<unknown>
  1629. 137.62 s > at <unknown source file>:<unknown line>
  1630. 137.62 s > 4: gammalooprs[d7a7c067ebd19583]::integrands::process::ir::evaluate_profile_momentum_point_arb::<gammalooprs[d7a7c067ebd19583]::integrands::process::amplitude::AmplitudeIntegrand><unknown>
  1631. 137.62 s > at <unknown source file>:<unknown line>
  1632. 137.62 s > 5: <gammalooprs[d7a7c067ebd19583]::integrands::process::amplitude::AmplitudeIntegrand>::test_single_ir_limit_impl<unknown>
  1633. 137.62 s > at <unknown source file>:<unknown line>
  1634. 137.62 s > 6: gammalooprs[d7a7c067ebd19583]::integrands::process::ir::run_ir_profile::<gammalooprs[d7a7c067ebd19583]::integrands::process::amplitude::AmplitudeIntegrand, <gammalooprs[d7a7c067ebd19583]::integrands::process::amplitude::AmplitudeIntegrand>::enumerate_ir_limits, <gammalooprs[d7a7c067ebd19583]::integrands::process::amplitude::AmplitudeIntegrand>::graph_cut_definitions, <gammalooprs[d7a7c067ebd19583]::integrands::process::amplitude::AmplitudeIntegrand>::test_single_ir_limit_impl><unknown>
  1635. 137.62 s > at <unknown source file>:<unknown line>
  1636. 137.62 s > 7: <gammalooprs[d7a7c067ebd19583]::integrands::process::amplitude::AmplitudeIntegrand>::test_ir<unknown>
  1637. 137.62 s > at <unknown source file>:<unknown line>
  1638. 137.62 s > 8: <gammaloop_api[92ae732909e47e14]::commands::profile::Profile>::run<unknown>
  1639. 137.62 s > at <unknown source file>:<unknown line>
  1640. 137.62 s > 9: test_runs[3e7a390caee4e338]::profile_bulk::double_dotted_bubble_amp_bulk_profile_passes<unknown>
  1641. 137.62 s > at <unknown source file>:<unknown line>
  1642. 137.62 s > 10: <test_runs[3e7a390caee4e338]::profile_bulk::double_dotted_bubble_amp_bulk_profile_passes::{closure#0} as core[940e698046960fd5]::ops::function::FnOnce<()>>::call_once<unknown>
  1643. 137.62 s > at <unknown source file>:<unknown line>
  1644. 137.62 s > 11: test[75d6903177b1d7e9]::__rust_begin_short_backtrace::<core[940e698046960fd5]::result::Result<(), alloc[2ea6bcb46fca0c42]::string::String>, fn() -> core[940e698046960fd5]::result::Result<(), alloc[2ea6bcb46fca0c42]::string::String>><unknown>
  1645. 137.62 s > at <unknown source file>:<unknown line>
  1646. 137.62 s > 12: test[75d6903177b1d7e9]::run_test::{closure#0}<unknown>
  1647. 137.62 s > at <unknown source file>:<unknown line>
  1648. 137.62 s > 13: std[bcb96dfbba0ab899]::sys::backtrace::__rust_begin_short_backtrace::<test[75d6903177b1d7e9]::run_test::{closure#1}, ()><unknown>
  1649. 137.62 s > at <unknown source file>:<unknown line>
  1650. 137.62 s > 14: <std[bcb96dfbba0ab899]::thread::lifecycle::spawn_unchecked<test[75d6903177b1d7e9]::run_test::{closure#1}, ()>::{closure#1} as core[940e698046960fd5]::ops::function::FnOnce<()>>::call_once::{shim:vtable#0}<unknown>
  1651. 137.62 s > at <unknown source file>:<unknown line>
  1652. 137.62 s > 15: <std[bcb96dfbba0ab899]::sys::thread::unix::Thread>::new::thread_start<unknown>
  1653. 137.62 s > at <unknown source file>:<unknown line>
  1654. 137.62 s > 16: start_thread<unknown>
  1655. 137.62 s > at <unknown source file>:<unknown line>
  1656. 137.62 s > 17: __clone3<unknown>
  1657. 137.62 s > at <unknown source file>:<unknown line>
  1658. 137.62 s >
  1659. 137.62 s > Run with COLORBT_SHOW_HIDDEN=1 environment variable to disable frame filtering.
  1660. 137.62 s > Run with RUST_BACKTRACE=full to include source snippets.
  1661. 137.62 s > Warning: SpanTrace capture is Unsupported.
  1662. 137.62 s > Ensure that you've setup a tracing-error ErrorLayer and the semver versions are compatible
  1663. 137.62 s >
  1664. 137.62 s > 4. gammaloop-integration-tests::test_runs::profile_bulk::box_4e_bulk_profile_passes
  1665. 137.62 s > failure: test failure with exit code 101
  1666. 137.62 s > Error:
  1667. 137.62 s > 0: IR profiling requested arbitrary precision but received a quad-precision result
  1668. 137.62 s >
  1669. 137.62 s > Location:
  1670. 137.62 s > crates/gammalooprs/src/integrands/process/ir.rs:2123
  1671. 137.62 s >
  1672. 137.62 s > ━━━━━━━━━━━━━━━━━━━━━━━━━━━━━━━━━━ BACKTRACE ━━━━━━━━━━━━━━━━━━━━━━━━━━━━━━━━━━━
  1673. 137.62 s > 1: <color_eyre[51793ea62743adbd]::config::EyreHook>::into_eyre_hook::{closure#0}<unknown>
  1674. 137.62 s > at <unknown source file>:<unknown line>
  1675. 137.62 s > 2: eyre[cb2fd339c0c40fca]::capture_handler<unknown>
  1676. 137.62 s > at <unknown source file>:<unknown line>
  1677. 137.62 s > 3: eyre[cb2fd339c0c40fca]::private::format_err<unknown>
  1678. 137.62 s > at <unknown source file>:<unknown line>
  1679. 137.62 s > 4: gammalooprs[d7a7c067ebd19583]::integrands::process::ir::evaluate_profile_momentum_point_arb::<gammalooprs[d7a7c067ebd19583]::integrands::process::amplitude::AmplitudeIntegrand><unknown>
  1680. 137.62 s > at <unknown source file>:<unknown line>
  1681. 137.62 s > 5: <gammalooprs[d7a7c067ebd19583]::integrands::process::amplitude::AmplitudeIntegrand>::test_single_ir_limit_impl<unknown>
  1682. 137.62 s > at <unknown source file>:<unknown line>
  1683. 137.62 s > 6: gammalooprs[d7a7c067ebd19583]::integrands::process::ir::run_ir_profile::<gammalooprs[d7a7c067ebd19583]::integrands::process::amplitude::AmplitudeIntegrand, <gammalooprs[d7a7c067ebd19583]::integrands::process::amplitude::AmplitudeIntegrand>::enumerate_ir_limits, <gammalooprs[d7a7c067ebd19583]::integrands::process::amplitude::AmplitudeIntegrand>::graph_cut_definitions, <gammalooprs[d7a7c067ebd19583]::integrands::process::amplitude::AmplitudeIntegrand>::test_single_ir_limit_impl><unknown>
  1684. 137.62 s > at <unknown source file>:<unknown line>
  1685. 137.62 s > 7: <gammalooprs[d7a7c067ebd19583]::integrands::process::amplitude::AmplitudeIntegrand>::test_ir<unknown>
  1686. 137.62 s > at <unknown source file>:<unknown line>
  1687. 137.62 s > 8: <gammaloop_api[92ae732909e47e14]::commands::profile::Profile>::run<unknown>
  1688. 137.62 s > at <unknown source file>:<unknown line>
  1689. 137.62 s > 9: test_runs[3e7a390caee4e338]::profile_bulk::box_4e_bulk_profile_passes<unknown>
  1690. 137.62 s > at <unknown source file>:<unknown line>
  1691. 137.62 s > 10: <test_runs[3e7a390caee4e338]::profile_bulk::box_4e_bulk_profile_passes::{closure#0} as core[940e698046960fd5]::ops::function::FnOnce<()>>::call_once<unknown>
  1692. 137.62 s > at <unknown source file>:<unknown line>
  1693. 137.62 s > 11: test[75d6903177b1d7e9]::__rust_begin_short_backtrace::<core[940e698046960fd5]::result::Result<(), alloc[2ea6bcb46fca0c42]::string::String>, fn() -> core[940e698046960fd5]::result::Result<(), alloc[2ea6bcb46fca0c42]::string::String>><unknown>
  1694. 137.62 s > at <unknown source file>:<unknown line>
  1695. 137.62 s > 12: test[75d6903177b1d7e9]::run_test::{closure#0}<unknown>
  1696. 137.62 s > at <unknown source file>:<unknown line>
  1697. 137.62 s > 13: std[bcb96dfbba0ab899]::sys::backtrace::__rust_begin_short_backtrace::<test[75d6903177b1d7e9]::run_test::{closure#1}, ()><unknown>
  1698. 137.62 s > at <unknown source file>:<unknown line>
  1699. 137.62 s > 14: <std[bcb96dfbba0ab899]::thread::lifecycle::spawn_unchecked<test[75d6903177b1d7e9]::run_test::{closure#1}, ()>::{closure#1} as core[940e698046960fd5]::ops::function::FnOnce<()>>::call_once::{shim:vtable#0}<unknown>
  1700. 137.62 s > at <unknown source file>:<unknown line>
  1701. 137.62 s > 15: <std[bcb96dfbba0ab899]::sys::thread::unix::Thread>::new::thread_start<unknown>
  1702. 137.62 s > at <unknown source file>:<unknown line>
  1703. 137.62 s > 16: start_thread<unknown>
  1704. 137.62 s > at <unknown source file>:<unknown line>
  1705. 137.62 s > 17: __clone3<unknown>
  1706. 137.62 s > at <unknown source file>:<unknown line>
  1707. 137.62 s >
  1708. 137.62 s > Run with COLORBT_SHOW_HIDDEN=1 environment variable to disable frame filtering.
  1709. 137.62 s > Run with RUST_BACKTRACE=full to include source snippets.
  1710. 137.62 s > Warning: SpanTrace capture is Unsupported.
  1711. 137.62 s > Ensure that you've setup a tracing-error ErrorLayer and the semver versions are compatible
  1712. 137.62 s > system-out
  1713. 137.62 s > running 1 test
  1714. 137.62 s > test profile_bulk::box_4e_bulk_profile_passes ... FAILED
  1715. 137.62 s >
  1716. 137.62 s > failures:
  1717. 137.62 s >
  1718. 137.62 s > failures:
  1719. 137.62 s > profile_bulk::box_4e_bulk_profile_passes
  1720. 137.62 s >
  1721. 137.62 s > test result: FAILED. 0 passed; 1 failed; 0 ignored; 0 measured; 82 filtered out; finished in 0.47s
  1722. 137.62 s > system-err
  1723. 137.62 s > [2026-08-28 15:30:52.219] @gammaloop_api::se... INFO : Running command import model ./assets/models/json/scalars/scalars.json
  1724. 137.62 s > [2026-08-28 15:30:52.219] @import::model INFO : Loading JSON model scalars-default from /build/source/assets/models/json/scalars/scalars
  1725. 137.62 s > [2026-08-28 15:30:52.225] @gammalooprs::model INFO : The following 2 external parameters were forced to zero by the restriction card:
  1726. 137.62 s > width_scalar_1, width_scalar_2
  1727. 137.62 s > [2026-08-28 15:30:52.226] @gammaloop_api::se... INFO : Running command import graphs ./tests/resources/graphs/massless_box.dot
  1728. 137.62 s > [2026-08-28 15:30:52.226] @commands::import INFO : Loading graphs from '/build/source/tests/resources/graphs/massless_box.dot'
  1729. 137.62 s > [2026-08-28 15:30:52.232] @gammaloop_api::se... INFO : Running command generate
  1730. 137.62 s > [2026-08-28 15:30:52.451] @commands::generate INFO :
  1731. 137.62 s > Integrand generation summary
  1732. 137.62 s > peak RAM 67.03 MiB | cores 1
  1733. 137.62 s > ╭───────────┬────────────────┬─────────┬────────────┬────────────┬────────────────┬─────────────╮
  1734. 137.62 s > │ integrand │ graph │ # evals │ expr build │ spenso │ symbolica eval │ compile │
  1735. 137.62 s > ├───────────┼────────────────┼─────────┼────────────┼────────────┼────────────────┼─────────────┤
  1736. 137.62 s > │ default │ massless_box_0 │ 14 │ 93ms (62%) │ 41ms (28%) │ 14ms (9.6%) │ 0ms (0.00%) │
  1737. 137.62 s > ├───────────┼────────────────┼─────────┼────────────┼────────────┼────────────────┼─────────────┤
  1738. 137.62 s > │ Total │ │ 14 │ 93ms (62%) │ 41ms (28%) │ 14ms (9.6%) │ 0ms (0.00%) │
  1739. 137.62 s > ╰───────────┴────────────────┴─────────┴────────────┴────────────┴────────────────┴─────────────╯
  1740. 137.62 s > [2026-08-28 15:30:52.453] @process::amplitude INFO : Input is above threshold: 4 existing threshold E-surfaces across 1/1 graph groups
  1741. 137.62 s > [2026-08-28 15:30:52.454] @process::amplitude INFO : overlap structure of group 0: [2: [8(4,6), 11(5,6)], 2: [9(3,5), 11(5,6)], 2: [4(3,4), 9(3,5)], 2: [4(3,4), 8(4,6)]]
  1742. 137.62 s > Error:
  1743. 137.62 s > 0: IR profiling requested arbitrary precision but received a quad-precision result
  1744. 137.62 s >
  1745. 137.62 s > Location:
  1746. 137.62 s > crates/gammalooprs/src/integrands/process/ir.rs:2123
  1747. 137.62 s >
  1748. 137.62 s > ━━━━━━━━━━━━━━━━━━━━━━━━━━━━━━━━━━ BACKTRACE ━━━━━━━━━━━━━━━━━━━━━━━━━━━━━━━━━━━
  1749. 137.62 s > 1: <color_eyre[51793ea62743adbd]::config::EyreHook>::into_eyre_hook::{closure#0}<unknown>
  1750. 137.62 s > at <unknown source file>:<unknown line>
  1751. 137.62 s > 2: eyre[cb2fd339c0c40fca]::capture_handler<unknown>
  1752. 137.62 s > at <unknown source file>:<unknown line>
  1753. 137.62 s > 3: eyre[cb2fd339c0c40fca]::private::format_err<unknown>
  1754. 137.62 s > at <unknown source file>:<unknown line>
  1755. 137.62 s > 4: gammalooprs[d7a7c067ebd19583]::integrands::process::ir::evaluate_profile_momentum_point_arb::<gammalooprs[d7a7c067ebd19583]::integrands::process::amplitude::AmplitudeIntegrand><unknown>
  1756. 137.62 s > at <unknown source file>:<unknown line>
  1757. 137.62 s > 5: <gammalooprs[d7a7c067ebd19583]::integrands::process::amplitude::AmplitudeIntegrand>::test_single_ir_limit_impl<unknown>
  1758. 137.62 s > at <unknown source file>:<unknown line>
  1759. 137.62 s > 6: gammalooprs[d7a7c067ebd19583]::integrands::process::ir::run_ir_profile::<gammalooprs[d7a7c067ebd19583]::integrands::process::amplitude::AmplitudeIntegrand, <gammalooprs[d7a7c067ebd19583]::integrands::process::amplitude::AmplitudeIntegrand>::enumerate_ir_limits, <gammalooprs[d7a7c067ebd19583]::integrands::process::amplitude::AmplitudeIntegrand>::graph_cut_definitions, <gammalooprs[d7a7c067ebd19583]::integrands::process::amplitude::AmplitudeIntegrand>::test_single_ir_limit_impl><unknown>
  1760. 137.62 s > at <unknown source file>:<unknown line>
  1761. 137.62 s > 7: <gammalooprs[d7a7c067ebd19583]::integrands::process::amplitude::AmplitudeIntegrand>::test_ir<unknown>
  1762. 137.62 s > at <unknown source file>:<unknown line>
  1763. 137.62 s > 8: <gammaloop_api[92ae732909e47e14]::commands::profile::Profile>::run<unknown>
  1764. 137.62 s > at <unknown source file>:<unknown line>
  1765. 137.62 s > 9: test_runs[3e7a390caee4e338]::profile_bulk::box_4e_bulk_profile_passes<unknown>
  1766. 137.62 s > at <unknown source file>:<unknown line>
  1767. 137.62 s > 10: <test_runs[3e7a390caee4e338]::profile_bulk::box_4e_bulk_profile_passes::{closure#0} as core[940e698046960fd5]::ops::function::FnOnce<()>>::call_once<unknown>
  1768. 137.62 s > at <unknown source file>:<unknown line>
  1769. 137.62 s > 11: test[75d6903177b1d7e9]::__rust_begin_short_backtrace::<core[940e698046960fd5]::result::Result<(), alloc[2ea6bcb46fca0c42]::string::String>, fn() -> core[940e698046960fd5]::result::Result<(), alloc[2ea6bcb46fca0c42]::string::String>><unknown>
  1770. 137.62 s > at <unknown source file>:<unknown line>
  1771. 137.62 s > 12: test[75d6903177b1d7e9]::run_test::{closure#0}<unknown>
  1772. 137.62 s > at <unknown source file>:<unknown line>
  1773. 137.62 s > 13: std[bcb96dfbba0ab899]::sys::backtrace::__rust_begin_short_backtrace::<test[75d6903177b1d7e9]::run_test::{closure#1}, ()><unknown>
  1774. 137.62 s > at <unknown source file>:<unknown line>
  1775. 137.62 s > 14: <std[bcb96dfbba0ab899]::thread::lifecycle::spawn_unchecked<test[75d6903177b1d7e9]::run_test::{closure#1}, ()>::{closure#1} as core[940e698046960fd5]::ops::function::FnOnce<()>>::call_once::{shim:vtable#0}<unknown>
  1776. 137.62 s > at <unknown source file>:<unknown line>
  1777. 137.62 s > 15: <std[bcb96dfbba0ab899]::sys::thread::unix::Thread>::new::thread_start<unknown>
  1778. 137.62 s > at <unknown source file>:<unknown line>
  1779. 137.62 s > 16: start_thread<unknown>
  1780. 137.62 s > at <unknown source file>:<unknown line>
  1781. 137.62 s > 17: __clone3<unknown>
  1782. 137.62 s > at <unknown source file>:<unknown line>
  1783. 137.62 s >
  1784. 137.62 s > Run with COLORBT_SHOW_HIDDEN=1 environment variable to disable frame filtering.
  1785. 137.62 s > Run with RUST_BACKTRACE=full to include source snippets.
  1786. 137.62 s > Warning: SpanTrace capture is Unsupported.
  1787. 137.62 s > Ensure that you've setup a tracing-error ErrorLayer and the semver versions are compatible
  1788. 137.62 s >
  1789. 137.62 s > 5. gammaloop-integration-tests::test_runs::profile_bulk::massless_triangle_bulk_profile_passes
  1790. 137.62 s > failure: test failure with exit code 101
  1791. 137.62 s > Error:
  1792. 137.62 s > 0: IR profiling requested arbitrary precision but received a quad-precision result
  1793. 137.62 s >
  1794. 137.62 s > Location:
  1795. 137.62 s > crates/gammalooprs/src/integrands/process/ir.rs:2123
  1796. 137.62 s >
  1797. 137.62 s > ━━━━━━━━━━━━━━━━━━━━━━━━━━━━━━━━━━ BACKTRACE ━━━━━━━━━━━━━━━━━━━━━━━━━━━━━━━━━━━
  1798. 137.62 s > 1: <color_eyre[51793ea62743adbd]::config::EyreHook>::into_eyre_hook::{closure#0}<unknown>
  1799. 137.62 s > at <unknown source file>:<unknown line>
  1800. 137.62 s > 2: eyre[cb2fd339c0c40fca]::capture_handler<unknown>
  1801. 137.62 s > at <unknown source file>:<unknown line>
  1802. 137.62 s > 3: eyre[cb2fd339c0c40fca]::private::format_err<unknown>
  1803. 137.62 s > at <unknown source file>:<unknown line>
  1804. 137.62 s > 4: gammalooprs[d7a7c067ebd19583]::integrands::process::ir::evaluate_profile_momentum_point_arb::<gammalooprs[d7a7c067ebd19583]::integrands::process::amplitude::AmplitudeIntegrand><unknown>
  1805. 137.62 s > at <unknown source file>:<unknown line>
  1806. 137.62 s > 5: <gammalooprs[d7a7c067ebd19583]::integrands::process::amplitude::AmplitudeIntegrand>::test_single_ir_limit_impl<unknown>
  1807. 137.62 s > at <unknown source file>:<unknown line>
  1808. 137.62 s > 6: gammalooprs[d7a7c067ebd19583]::integrands::process::ir::run_ir_profile::<gammalooprs[d7a7c067ebd19583]::integrands::process::amplitude::AmplitudeIntegrand, <gammalooprs[d7a7c067ebd19583]::integrands::process::amplitude::AmplitudeIntegrand>::enumerate_ir_limits, <gammalooprs[d7a7c067ebd19583]::integrands::process::amplitude::AmplitudeIntegrand>::graph_cut_definitions, <gammalooprs[d7a7c067ebd19583]::integrands::process::amplitude::AmplitudeIntegrand>::test_single_ir_limit_impl><unknown>
  1809. 137.62 s > at <unknown source file>:<unknown line>
  1810. 137.62 s > 7: <gammalooprs[d7a7c067ebd19583]::integrands::process::amplitude::AmplitudeIntegrand>::test_ir<unknown>
  1811. 137.62 s > at <unknown source file>:<unknown line>
  1812. 137.62 s > 8: <gammaloop_api[92ae732909e47e14]::commands::profile::Profile>::run<unknown>
  1813. 137.62 s > at <unknown source file>:<unknown line>
  1814. 137.62 s > 9: test_runs[3e7a390caee4e338]::profile_bulk::massless_triangle_bulk_profile_passes<unknown>
  1815. 137.62 s > at <unknown source file>:<unknown line>
  1816. 137.62 s > 10: <test_runs[3e7a390caee4e338]::profile_bulk::massless_triangle_bulk_profile_passes::{closure#0} as core[940e698046960fd5]::ops::function::FnOnce<()>>::call_once<unknown>
  1817. 137.62 s > at <unknown source file>:<unknown line>
  1818. 137.62 s > 11: test[75d6903177b1d7e9]::__rust_begin_short_backtrace::<core[940e698046960fd5]::result::Result<(), alloc[2ea6bcb46fca0c42]::string::String>, fn() -> core[940e698046960fd5]::result::Result<(), alloc[2ea6bcb46fca0c42]::string::String>><unknown>
  1819. 137.62 s > at <unknown source file>:<unknown line>
  1820. 137.62 s > 12: test[75d6903177b1d7e9]::run_test::{closure#0}<unknown>
  1821. 137.62 s > at <unknown source file>:<unknown line>
  1822. 137.62 s > 13: std[bcb96dfbba0ab899]::sys::backtrace::__rust_begin_short_backtrace::<test[75d6903177b1d7e9]::run_test::{closure#1}, ()><unknown>
  1823. 137.62 s > at <unknown source file>:<unknown line>
  1824. 137.62 s > 14: <std[bcb96dfbba0ab899]::thread::lifecycle::spawn_unchecked<test[75d6903177b1d7e9]::run_test::{closure#1}, ()>::{closure#1} as core[940e698046960fd5]::ops::function::FnOnce<()>>::call_once::{shim:vtable#0}<unknown>
  1825. 137.62 s > at <unknown source file>:<unknown line>
  1826. 137.62 s > 15: <std[bcb96dfbba0ab899]::sys::thread::unix::Thread>::new::thread_start<unknown>
  1827. 137.62 s > at <unknown source file>:<unknown line>
  1828. 137.62 s > 16: start_thread<unknown>
  1829. 137.62 s > at <unknown source file>:<unknown line>
  1830. 137.62 s > 17: __clone3<unknown>
  1831. 137.62 s > at <unknown source file>:<unknown line>
  1832. 137.62 s >
  1833. 137.62 s > Run with COLORBT_SHOW_HIDDEN=1 environment variable to disable frame filtering.
  1834. 137.62 s > Run with RUST_BACKTRACE=full to include source snippets.
  1835. 137.62 s > Warning: SpanTrace capture is Unsupported.
  1836. 137.62 s > Ensure that you've setup a tracing-error ErrorLayer and the semver versions are compatible
  1837. 137.62 s > system-out
  1838. 137.62 s > running 1 test
  1839. 137.62 s > test profile_bulk::massless_triangle_bulk_profile_passes ... FAILED
  1840. 137.62 s >
  1841. 137.62 s > failures:
  1842. 137.62 s >
  1843. 137.62 s > failures:
  1844. 137.62 s > profile_bulk::massless_triangle_bulk_profile_passes
  1845. 137.62 s >
  1846. 137.62 s > test result: FAILED. 0 passed; 1 failed; 0 ignored; 0 measured; 82 filtered out; finished in 0.31s
  1847. 137.62 s > system-err
  1848. 137.62 s > [2026-08-28 15:30:52.471] @gammaloop_api::se... INFO : Running command import model scalars
  1849. 137.62 s > [2026-08-28 15:30:52.471] @import::model INFO : Loading built-in JSON model scalars-default
  1850. 137.62 s > [2026-08-28 15:30:52.474] @gammalooprs::model INFO : The following 2 external parameters were forced to zero by the restriction card:
  1851. 137.62 s > width_scalar_1, width_scalar_2
  1852. 137.62 s > [2026-08-28 15:30:52.475] @gammaloop_api::se... INFO : Running command import graphs ./tests/resources/graphs/massless_triangle.dot
  1853. 137.62 s > [2026-08-28 15:30:52.475] @commands::import INFO : Loading graphs from '/build/source/tests/resources/graphs/massless_triangle.dot'
  1854. 137.62 s > [2026-08-28 15:30:52.478] @gammaloop_api::se... INFO : Running command generate
  1855. 137.62 s > [2026-08-28 15:30:52.589] @commands::generate INFO :
  1856. 137.62 s > Integrand generation summary
  1857. 137.62 s > peak RAM 65.52 MiB | cores 1
  1858. 137.62 s > ╭───────────┬─────────────────────┬─────────┬────────────┬────────────┬────────────────┬─────────────╮
  1859. 137.62 s > │ integrand │ graph │ # evals │ expr build │ spenso │ symbolica eval │ compile │
  1860. 137.62 s > ├───────────┼─────────────────────┼─────────┼────────────┼────────────┼────────────────┼─────────────┤
  1861. 137.62 s > │ default │ massless_triangle_0 │ 9 │ 19ms (72%) │ 1ms (7.0%) │ 5ms (21%) │ 0ms (0.00%) │
  1862. 137.62 s > ├───────────┼─────────────────────┼─────────┼────────────┼────────────┼────────────────┼─────────────┤
  1863. 137.62 s > │ Total │ │ 9 │ 19ms (72%) │ 1ms (7.0%) │ 5ms (21%) │ 0ms (0.00%) │
  1864. 137.62 s > ╰───────────┴─────────────────────┴─────────┴────────────┴────────────┴────────────────┴─────────────╯
  1865. 137.62 s > [2026-08-28 15:30:52.590] @process::amplitude INFO : Input is above threshold: 2 existing threshold E-surfaces across 1/1 graph groups
  1866. 137.62 s > [2026-08-28 15:30:52.591] @process::amplitude INFO : overlap structure of group 0: [2: [0(1,5), 1(1,3)]]
  1867. 137.62 s > Error:
  1868. 137.62 s > 0: IR profiling requested arbitrary precision but received a quad-precision result
  1869. 137.62 s >
  1870. 137.62 s > Location:
  1871. 137.62 s > crates/gammalooprs/src/integrands/process/ir.rs:2123
  1872. 137.62 s >
  1873. 137.62 s > ━━━━━━━━━━━━━━━━━━━━━━━━━━━━━━━━━━ BACKTRACE ━━━━━━━━━━━━━━━━━━━━━━━━━━━━━━━━━━━
  1874. 137.62 s > 1: <color_eyre[51793ea62743adbd]::config::EyreHook>::into_eyre_hook::{closure#0}<unknown>
  1875. 137.62 s > at <unknown source file>:<unknown line>
  1876. 137.62 s > 2: eyre[cb2fd339c0c40fca]::capture_handler<unknown>
  1877. 137.62 s > at <unknown source file>:<unknown line>
  1878. 137.62 s > 3: eyre[cb2fd339c0c40fca]::private::format_err<unknown>
  1879. 137.62 s > at <unknown source file>:<unknown line>
  1880. 137.62 s > 4: gammalooprs[d7a7c067ebd19583]::integrands::process::ir::evaluate_profile_momentum_point_arb::<gammalooprs[d7a7c067ebd19583]::integrands::process::amplitude::AmplitudeIntegrand><unknown>
  1881. 137.62 s > at <unknown source file>:<unknown line>
  1882. 137.62 s > 5: <gammalooprs[d7a7c067ebd19583]::integrands::process::amplitude::AmplitudeIntegrand>::test_single_ir_limit_impl<unknown>
  1883. 137.62 s > at <unknown source file>:<unknown line>
  1884. 137.62 s > 6: gammalooprs[d7a7c067ebd19583]::integrands::process::ir::run_ir_profile::<gammalooprs[d7a7c067ebd19583]::integrands::process::amplitude::AmplitudeIntegrand, <gammalooprs[d7a7c067ebd19583]::integrands::process::amplitude::AmplitudeIntegrand>::enumerate_ir_limits, <gammalooprs[d7a7c067ebd19583]::integrands::process::amplitude::AmplitudeIntegrand>::graph_cut_definitions, <gammalooprs[d7a7c067ebd19583]::integrands::process::amplitude::AmplitudeIntegrand>::test_single_ir_limit_impl><unknown>
  1885. 137.62 s > at <unknown source file>:<unknown line>
  1886. 137.62 s > 7: <gammalooprs[d7a7c067ebd19583]::integrands::process::amplitude::AmplitudeIntegrand>::test_ir<unknown>
  1887. 137.62 s > at <unknown source file>:<unknown line>
  1888. 137.62 s > 8: <gammaloop_api[92ae732909e47e14]::commands::profile::Profile>::run<unknown>
  1889. 137.62 s > at <unknown source file>:<unknown line>
  1890. 137.62 s > 9: test_runs[3e7a390caee4e338]::profile_bulk::massless_triangle_bulk_profile_passes<unknown>
  1891. 137.62 s > at <unknown source file>:<unknown line>
  1892. 137.62 s > 10: <test_runs[3e7a390caee4e338]::profile_bulk::massless_triangle_bulk_profile_passes::{closure#0} as core[940e698046960fd5]::ops::function::FnOnce<()>>::call_once<unknown>
  1893. 137.62 s > at <unknown source file>:<unknown line>
  1894. 137.62 s > 11: test[75d6903177b1d7e9]::__rust_begin_short_backtrace::<core[940e698046960fd5]::result::Result<(), alloc[2ea6bcb46fca0c42]::string::String>, fn() -> core[940e698046960fd5]::result::Result<(), alloc[2ea6bcb46fca0c42]::string::String>><unknown>
  1895. 137.62 s > at <unknown source file>:<unknown line>
  1896. 137.62 s > 12: test[75d6903177b1d7e9]::run_test::{closure#0}<unknown>
  1897. 137.62 s > at <unknown source file>:<unknown line>
  1898. 137.62 s > 13: std[bcb96dfbba0ab899]::sys::backtrace::__rust_begin_short_backtrace::<test[75d6903177b1d7e9]::run_test::{closure#1}, ()><unknown>
  1899. 137.62 s > at <unknown source file>:<unknown line>
  1900. 137.62 s > 14: <std[bcb96dfbba0ab899]::thread::lifecycle::spawn_unchecked<test[75d6903177b1d7e9]::run_test::{closure#1}, ()>::{closure#1} as core[940e698046960fd5]::ops::function::FnOnce<()>>::call_once::{shim:vtable#0}<unknown>
  1901. 137.62 s > at <unknown source file>:<unknown line>
  1902. 137.62 s > 15: <std[bcb96dfbba0ab899]::sys::thread::unix::Thread>::new::thread_start<unknown>
  1903. 137.62 s > at <unknown source file>:<unknown line>
  1904. 137.62 s > 16: start_thread<unknown>
  1905. 137.62 s > at <unknown source file>:<unknown line>
  1906. 137.62 s > 17: __clone3<unknown>
  1907. 137.62 s > at <unknown source file>:<unknown line>
  1908. 137.62 s >
  1909. 137.62 s > Run with COLORBT_SHOW_HIDDEN=1 environment variable to disable frame filtering.
  1910. 137.62 s > Run with RUST_BACKTRACE=full to include source snippets.
  1911. 137.62 s > Warning: SpanTrace capture is Unsupported.
  1912. 137.62 s > Ensure that you've setup a tracing-error ErrorLayer and the semver versions are compatible
  1913. 137.62 s >
  1914. 137.62 s > 6. gammaloop-integration-tests::test_runs::profile_bulk::scalar_self_energy_amp_bulk_profile_passes
  1915. 137.62 s > failure: test failure with exit code 101
  1916. 137.62 s > Error:
  1917. 137.62 s > 0: IR profiling requested arbitrary precision but received a quad-precision result
  1918. 137.62 s >
  1919. 137.62 s > Location:
  1920. 137.62 s > crates/gammalooprs/src/integrands/process/ir.rs:2123
  1921. 137.62 s >
  1922. 137.62 s > ━━━━━━━━━━━━━━━━━━━━━━━━━━━━━━━━━━ BACKTRACE ━━━━━━━━━━━━━━━━━━━━━━━━━━━━━━━━━━━
  1923. 137.62 s > 1: <color_eyre[51793ea62743adbd]::config::EyreHook>::into_eyre_hook::{closure#0}<unknown>
  1924. 137.62 s > at <unknown source file>:<unknown line>
  1925. 137.62 s > 2: eyre[cb2fd339c0c40fca]::capture_handler<unknown>
  1926. 137.62 s > at <unknown source file>:<unknown line>
  1927. 137.62 s > 3: eyre[cb2fd339c0c40fca]::private::format_err<unknown>
  1928. 137.62 s > at <unknown source file>:<unknown line>
  1929. 137.62 s > 4: gammalooprs[d7a7c067ebd19583]::integrands::process::ir::evaluate_profile_momentum_point_arb::<gammalooprs[d7a7c067ebd19583]::integrands::process::amplitude::AmplitudeIntegrand><unknown>
  1930. 137.62 s > at <unknown source file>:<unknown line>
  1931. 137.62 s > 5: <gammalooprs[d7a7c067ebd19583]::integrands::process::amplitude::AmplitudeIntegrand>::test_single_ir_limit_impl<unknown>
  1932. 137.62 s > at <unknown source file>:<unknown line>
  1933. 137.62 s > 6: gammalooprs[d7a7c067ebd19583]::integrands::process::ir::run_ir_profile::<gammalooprs[d7a7c067ebd19583]::integrands::process::amplitude::AmplitudeIntegrand, <gammalooprs[d7a7c067ebd19583]::integrands::process::amplitude::AmplitudeIntegrand>::enumerate_ir_limits, <gammalooprs[d7a7c067ebd19583]::integrands::process::amplitude::AmplitudeIntegrand>::graph_cut_definitions, <gammalooprs[d7a7c067ebd19583]::integrands::process::amplitude::AmplitudeIntegrand>::test_single_ir_limit_impl><unknown>
  1934. 137.62 s > at <unknown source file>:<unknown line>
  1935. 137.62 s > 7: <gammalooprs[d7a7c067ebd19583]::integrands::process::amplitude::AmplitudeIntegrand>::test_ir<unknown>
  1936. 137.62 s > at <unknown source file>:<unknown line>
  1937. 137.62 s > 8: <gammaloop_api[92ae732909e47e14]::commands::profile::Profile>::run<unknown>
  1938. 137.62 s > at <unknown source file>:<unknown line>
  1939. 137.62 s > 9: test_runs[3e7a390caee4e338]::profile_bulk::scalar_self_energy_amp_bulk_profile_passes<unknown>
  1940. 137.62 s > at <unknown source file>:<unknown line>
  1941. 137.62 s > 10: <test_runs[3e7a390caee4e338]::profile_bulk::scalar_self_energy_amp_bulk_profile_passes::{closure#0} as core[940e698046960fd5]::ops::function::FnOnce<()>>::call_once<unknown>
  1942. 137.62 s > at <unknown source file>:<unknown line>
  1943. 137.62 s > 11: test[75d6903177b1d7e9]::__rust_begin_short_backtrace::<core[940e698046960fd5]::result::Result<(), alloc[2ea6bcb46fca0c42]::string::String>, fn() -> core[940e698046960fd5]::result::Result<(), alloc[2ea6bcb46fca0c42]::string::String>><unknown>
  1944. 137.62 s > at <unknown source file>:<unknown line>
  1945. 137.62 s > 12: test[75d6903177b1d7e9]::run_test::{closure#0}<unknown>
  1946. 137.62 s > at <unknown source file>:<unknown line>
  1947. 137.62 s > 13: std[bcb96dfbba0ab899]::sys::backtrace::__rust_begin_short_backtrace::<test[75d6903177b1d7e9]::run_test::{closure#1}, ()><unknown>
  1948. 137.62 s > at <unknown source file>:<unknown line>
  1949. 137.62 s > 14: <std[bcb96dfbba0ab899]::thread::lifecycle::spawn_unchecked<test[75d6903177b1d7e9]::run_test::{closure#1}, ()>::{closure#1} as core[940e698046960fd5]::ops::function::FnOnce<()>>::call_once::{shim:vtable#0}<unknown>
  1950. 137.62 s > at <unknown source file>:<unknown line>
  1951. 137.62 s > 15: <std[bcb96dfbba0ab899]::sys::thread::unix::Thread>::new::thread_start<unknown>
  1952. 137.62 s > at <unknown source file>:<unknown line>
  1953. 137.62 s > 16: start_thread<unknown>
  1954. 137.62 s > at <unknown source file>:<unknown line>
  1955. 137.62 s > 17: __clone3<unknown>
  1956. 137.62 s > at <unknown source file>:<unknown line>
  1957. 137.62 s >
  1958. 137.62 s > Run with COLORBT_SHOW_HIDDEN=1 environment variable to disable frame filtering.
  1959. 137.62 s > Run with RUST_BACKTRACE=full to include source snippets.
  1960. 137.62 s > Warning: SpanTrace capture is Unsupported.
  1961. 137.62 s > Ensure that you've setup a tracing-error ErrorLayer and the semver versions are compatible
  1962. 137.62 s > system-out
  1963. 137.62 s > running 1 test
  1964. 137.62 s > test profile_bulk::scalar_self_energy_amp_bulk_profile_passes ... FAILED
  1965. 137.62 s >
  1966. 137.62 s > failures:
  1967. 137.62 s >
  1968. 137.62 s > failures:
  1969. 137.62 s > profile_bulk::scalar_self_energy_amp_bulk_profile_passes
  1970. 137.62 s >
  1971. 137.62 s > test result: FAILED. 0 passed; 1 failed; 0 ignored; 0 measured; 82 filtered out; finished in 0.63s
  1972. 137.62 s > system-err
  1973. 137.62 s > [2026-08-28 15:30:52.712] @gammaloop_api::se... INFO : Running command import model ./assets/models/json/scalars/scalars.json
  1974. 137.62 s > [2026-08-28 15:30:52.712] @import::model INFO : Loading JSON model scalars-default from /build/source/assets/models/json/scalars/scalars
  1975. 137.62 s > [2026-08-28 15:30:52.722] @gammalooprs::model INFO : The following 2 external parameters were forced to zero by the restriction card:
  1976. 137.62 s > width_scalar_1, width_scalar_2
  1977. 137.62 s > [2026-08-28 15:30:52.724] @gammaloop_api::se... INFO : Running command import graphs ./tests/resources/graphs/scalar_self_energy_amp.dot
  1978. 137.62 s > [2026-08-28 15:30:52.724] @commands::import INFO : Loading graphs from '/build/source/tests/resources/graphs/scalar_self_energy_amp.dot'
  1979. 137.62 s > [2026-08-28 15:30:52.729] @gammaloop_api::se... INFO : Running command generate
  1980. 137.62 s > [2026-08-28 15:30:53.071] @commands::generate INFO :
  1981. 137.62 s > Integrand generation summary
  1982. 137.62 s > peak RAM 71.81 MiB | cores 1
  1983. 137.62 s > ╭───────────┬────────────────────────┬─────────┬─────────────┬────────────┬────────────────┬─────────────╮
  1984. 137.62 s > │ integrand │ graph │ # evals │ expr build │ spenso │ symbolica eval │ compile │
  1985. 137.62 s > ├───────────┼────────────────────────┼─────────┼─────────────┼────────────┼────────────────┼─────────────┤
  1986. 137.62 s > │ default │ scalar_self_energy_amp │ 6 │ 209ms (91%) │ 8ms (3.8%) │ 11ms (4.8%) │ 0ms (0.00%) │
  1987. 137.62 s > ├───────────┼────────────────────────┼─────────┼─────────────┼────────────┼────────────────┼─────────────┤
  1988. 137.62 s > │ Total │ │ 6 │ 209ms (91%) │ 8ms (3.8%) │ 11ms (4.8%) │ 0ms (0.00%) │
  1989. 137.62 s > ╰───────────┴────────────────────────┴─────────┴─────────────┴────────────┴────────────────┴─────────────╯
  1990. 137.62 s > [2026-08-28 15:30:53.072] @process::amplitude INFO : Input is above threshold: 2 existing threshold E-surfaces across 1/1 graph groups
  1991. 137.62 s > [2026-08-28 15:30:53.072] @process::amplitude INFO : overlap structure of group 0: [2: [2(1,5), 4(2,3,5)]]
  1992. 137.62 s > Error:
  1993. 137.62 s > 0: IR profiling requested arbitrary precision but received a quad-precision result
  1994. 137.62 s >
  1995. 137.62 s > Location:
  1996. 137.62 s > crates/gammalooprs/src/integrands/process/ir.rs:2123
  1997. 137.62 s >
  1998. 137.62 s > ━━━━━━━━━━━━━━━━━━━━━━━━━━━━━━━━━━ BACKTRACE ━━━━━━━━━━━━━━━━━━━━━━━━━━━━━━━━━━━
  1999. 137.62 s > 1: <color_eyre[51793ea62743adbd]::config::EyreHook>::into_eyre_hook::{closure#0}<unknown>
  2000. 137.62 s > at <unknown source file>:<unknown line>
  2001. 137.62 s > 2: eyre[cb2fd339c0c40fca]::capture_handler<unknown>
  2002. 137.62 s > at <unknown source file>:<unknown line>
  2003. 137.62 s > 3: eyre[cb2fd339c0c40fca]::private::format_err<unknown>
  2004. 137.62 s > at <unknown source file>:<unknown line>
  2005. 137.62 s > 4: gammalooprs[d7a7c067ebd19583]::integrands::process::ir::evaluate_profile_momentum_point_arb::<gammalooprs[d7a7c067ebd19583]::integrands::process::amplitude::AmplitudeIntegrand><unknown>
  2006. 137.62 s > at <unknown source file>:<unknown line>
  2007. 137.62 s > 5: <gammalooprs[d7a7c067ebd19583]::integrands::process::amplitude::AmplitudeIntegrand>::test_single_ir_limit_impl<unknown>
  2008. 137.62 s > at <unknown source file>:<unknown line>
  2009. 137.62 s > 6: gammalooprs[d7a7c067ebd19583]::integrands::process::ir::run_ir_profile::<gammalooprs[d7a7c067ebd19583]::integrands::process::amplitude::AmplitudeIntegrand, <gammalooprs[d7a7c067ebd19583]::integrands::process::amplitude::AmplitudeIntegrand>::enumerate_ir_limits, <gammalooprs[d7a7c067ebd19583]::integrands::process::amplitude::AmplitudeIntegrand>::graph_cut_definitions, <gammalooprs[d7a7c067ebd19583]::integrands::process::amplitude::AmplitudeIntegrand>::test_single_ir_limit_impl><unknown>
  2010. 137.62 s > at <unknown source file>:<unknown line>
  2011. 137.62 s > 7: <gammalooprs[d7a7c067ebd19583]::integrands::process::amplitude::AmplitudeIntegrand>::test_ir<unknown>
  2012. 137.62 s > at <unknown source file>:<unknown line>
  2013. 137.62 s > 8: <gammaloop_api[92ae732909e47e14]::commands::profile::Profile>::run<unknown>
  2014. 137.62 s > at <unknown source file>:<unknown line>
  2015. 137.62 s > 9: test_runs[3e7a390caee4e338]::profile_bulk::scalar_self_energy_amp_bulk_profile_passes<unknown>
  2016. 137.62 s > at <unknown source file>:<unknown line>
  2017. 137.62 s > 10: <test_runs[3e7a390caee4e338]::profile_bulk::scalar_self_energy_amp_bulk_profile_passes::{closure#0} as core[940e698046960fd5]::ops::function::FnOnce<()>>::call_once<unknown>
  2018. 137.62 s > at <unknown source file>:<unknown line>
  2019. 137.62 s > 11: test[75d6903177b1d7e9]::__rust_begin_short_backtrace::<core[940e698046960fd5]::result::Result<(), alloc[2ea6bcb46fca0c42]::string::String>, fn() -> core[940e698046960fd5]::result::Result<(), alloc[2ea6bcb46fca0c42]::string::String>><unknown>
  2020. 137.62 s > at <unknown source file>:<unknown line>
  2021. 137.62 s > 12: test[75d6903177b1d7e9]::run_test::{closure#0}<unknown>
  2022. 137.62 s > at <unknown source file>:<unknown line>
  2023. 137.62 s > 13: std[bcb96dfbba0ab899]::sys::backtrace::__rust_begin_short_backtrace::<test[75d6903177b1d7e9]::run_test::{closure#1}, ()><unknown>
  2024. 137.62 s > at <unknown source file>:<unknown line>
  2025. 137.62 s > 14: <std[bcb96dfbba0ab899]::thread::lifecycle::spawn_unchecked<test[75d6903177b1d7e9]::run_test::{closure#1}, ()>::{closure#1} as core[940e698046960fd5]::ops::function::FnOnce<()>>::call_once::{shim:vtable#0}<unknown>
  2026. 137.62 s > at <unknown source file>:<unknown line>
  2027. 137.62 s > 15: <std[bcb96dfbba0ab899]::sys::thread::unix::Thread>::new::thread_start<unknown>
  2028. 137.62 s > at <unknown source file>:<unknown line>
  2029. 137.62 s > 16: start_thread<unknown>
  2030. 137.62 s > at <unknown source file>:<unknown line>
  2031. 137.62 s > 17: __clone3<unknown>
  2032. 137.62 s > at <unknown source file>:<unknown line>
  2033. 137.62 s >
  2034. 137.62 s > Run with COLORBT_SHOW_HIDDEN=1 environment variable to disable frame filtering.
  2035. 137.62 s > Run with RUST_BACKTRACE=full to include source snippets.
  2036. 137.62 s > Warning: SpanTrace capture is Unsupported.
  2037. 137.62 s > Ensure that you've setup a tracing-error ErrorLayer and the semver versions are compatible
  2038. 137.62 s >
  2039. 137.62 s > 7. gammaloop-integration-tests::uv::dod2_bubble_uv
  2040. 137.62 s > failure: test failure with exit code 101
  2041. 137.62 s > system-out
  2042. 137.62 s > running 1 test
  2043. 137.62 s > +-------------+-----------------+---------+--------+----------+-----------------------------------------------------------------------------------------------------------------------+-------+
  2044. 137.62 s > | case | check | graph | status | sigma | threshold | error |
  2045. 137.62 s > +-------------+-----------------+---------+--------+----------+-----------------------------------------------------------------------------------------------------------------------+-------+
  2046. 137.62 s > | dod2_bubble | uv_profile | - | FAIL | - | - | - |
  2047. 137.62 s > +-------------+-----------------+---------+--------+----------+-----------------------------------------------------------------------------------------------------------------------+-------+
  2048. 137.62 s > | dod2_bubble | m_uv.inspect | inspect | pass | - | best inspect relative delta 1.000e0 >= 1000*accuracy 1.000e-7 (accuracy=1.000e-10, exponent=+8.0, seed=0, probes=10) | - |
  2049. 137.62 s > +-------------+-----------------+---------+--------+----------+-----------------------------------------------------------------------------------------------------------------------+-------+
  2050. 137.62 s > | dod2_bubble | m_uv.integrated | GL0 | pass | 0.0sigma | compatible within 2sigma | - |
  2051. 137.62 s > +-------------+-----------------+---------+--------+----------+-----------------------------------------------------------------------------------------------------------------------+-------+
  2052. 137.62 s > | dod2_bubble | rls.inspect | inspect | pass | - | best inspect relative delta 2.822e-3 >= 1000*accuracy 1.000e-7 (accuracy=1.000e-10, exponent=+2.0, seed=1, probes=10) | - |
  2053. 137.62 s > +-------------+-----------------+---------+--------+----------+-----------------------------------------------------------------------------------------------------------------------+-------+
  2054. 137.62 s > | dod2_bubble | rls.integrated | GL0 | pass | 0.0sigma | compatible within 2sigma | - |
  2055. 137.62 s > +-------------+-----------------+---------+--------+----------+-----------------------------------------------------------------------------------------------------------------------+-------+
  2056. 137.62 s > | dod2_bubble | mu_r.inspect | inspect | pass | - | best inspect relative delta 6.951e-1 >= 1000*accuracy 1.000e-7 (accuracy=1.000e-10, exponent=+0.0, seed=0, probes=10) | - |
  2057. 137.62 s > +-------------+-----------------+---------+--------+----------+-----------------------------------------------------------------------------------------------------------------------+-------+
  2058. 137.62 s > | dod2_bubble | target | - | pass | - | 2sigma | - |
  2059. 137.62 s > +-------------+-----------------+---------+--------+----------+-----------------------------------------------------------------------------------------------------------------------+-------+
  2060. 137.62 s > test dod2_bubble_uv ... FAILED
  2061. 137.62 s >
  2062. 137.62 s > failures:
  2063. 137.62 s >
  2064. 137.62 s > failures:
  2065. 137.62 s > dod2_bubble_uv
  2066. 137.62 s >
  2067. 137.62 s > test result: FAILED. 0 passed; 1 failed; 0 ignored; 0 measured; 24 filtered out; finished in 40.41s
  2068. 137.62 s > system-err
  2069. 137.62 s > [2026-08-28 15:30:54.101] @gammaloop_api::se... INFO : Running command run generate
  2070. 137.62 s > [2026-08-28 15:30:54.101] @gammaloop_api::se... INFO : Starting command block generate
  2071. 137.62 s > [2026-08-28 15:30:54.102] @gammaloop_api::se... INFO : Running command import model scalars-default.json
  2072. 137.62 s > [2026-08-28 15:30:54.102] @import::model INFO : Loading built-in JSON model scalars-default
  2073. 137.62 s > [2026-08-28 15:30:54.108] @gammalooprs::model INFO : The following 2 external parameters were forced to zero by the restriction card:
  2074. 137.62 s > width_scalar_1, width_scalar_2
  2075. 137.62 s > [2026-08-28 15:30:54.109] @gammaloop_api::se... INFO : Running command remove processes
  2076. 137.62 s > [2026-08-28 15:30:54.109] @gammaloop_api::se... INFO : Running command set global kv global.generation.uv.generate_integrated=true
  2077. 137.62 s > [2026-08-28 15:30:54.110] @gammaloop_api::se... INFO : Running command import graphs ./tests/resources/graphs/scalar/dod2_bubble.dot -p bubble_dod2 -i scalar_bubble_below_thres
  2078. 137.62 s > [2026-08-28 15:30:54.110] @commands::import INFO : Loading graphs from '/build/source/tests/resources/graphs/scalar/dod2_bubble.dot'
  2079. 137.62 s > [2026-08-28 15:30:54.114] @gammaloop_api::se... INFO : Running command generate existing -p bubble_dod2 -i scalar_bubble_below_thres
  2080. 137.62 s > [2026-08-28 15:30:54.115] @approx::local_4d [{#uv, #inspect, #integrated}] DEBUG : Rescaled momenta expanded
  2081. 137.62 s > field value
  2082. 137.62 s > res n-terms: 1, byte size: 585,expr:
  2083. 137.62 s > -SCALAR_COUPLING²·q₀(αᵉ².¹)·q₀(αᵉ³.¹)·q₂(αᵉ².¹)·q₂(αᵉ³.¹)
  2084. 137.62 s > /(t²·denom(3,-q₀-q₂/t,mass_scalar_2²,-mass_scalar_2²+2·(q₀.q₂)/t+(q₂.q₂)/t²+(q₀.q₀))
  2085. 137.62 s > ·denom(2,q₂/t,mass_scalar_2²,-mass_scalar_2²+(q₂.q₂)/t²))
  2086. 137.62 s > [2026-08-28 15:30:54.121] @approx::local_4d [{#uv, #inspect, #integrated}] DEBUG : Rescaled momenta expanded
  2087. 137.62 s > field value
  2088. 137.62 s > res n-terms: 1, byte size: 3,expr:
  2089. 137.62 s > 1
  2090. 137.62 s > [2026-08-28 15:30:54.122] @approx::final_integrand[{#generation, #profile, #uv, #graph, #summary}] DEBUG : Computed global numerator
  2091. 137.62 s > field value
  2092. 137.62 s > global_num n-terms: 1, byte size: 4,expr:
  2093. 137.62 s > 1/2
  2094. 137.62 s > span build_3d{span_context=true graph=GL0 current=subgraph=0, topo_order=0, dod=0}
  2095. 137.62 s > [2026-08-28 15:30:54.125] @uv::approx [{#generation, #uv, #fourd}] DEBUG : Computing 4D
  2096. 137.62 s > field value
  2097. 137.62 s > simple subgraph(S_11,S_y)*Approx(subgraph(S_y,0)) of GL0
  2098. 137.62 s > span compute_4d{span_context=true graph=GL0 current=subgraph=y, topo_order=1, dod=2 given=subgraph=0, topo_order=0, dod=0 reduced=SubSet { set: BitVec<usize, bitvec::order::Lsb0> { addr: 0x7fffec00a8f0, head: 000000, bits: 6, capacity: 64 } [0, 0, 1, 1, 1, 1], id: PhantomData<linnet::half_edge::involution::Hedge> }}
  2099. 137.62 s > [2026-08-28 15:30:54.126] @approx::local_4d [{#uv, #algebra, #integrated, #start}] DEBUG :
  2100. 137.62 s > field value
  2101. 137.62 s > integrand n-terms: 1, byte size: 409,expr:
  2102. 137.62 s > SCALAR_COUPLING²·(q₀(αᵉ³.¹)+q₃(αᵉ³.¹))·q₀(αᵉ².¹)·q₀(αᵉ³.¹)·q₂(αᵉ².¹)
  2103. 137.62 s > /(denom(2,q₂,mass_scalar_2²,-mass_scalar_2²+(q₂.q₂))·denom(3,q₃,mass_scalar_2²,-mass_scalar_2²+(q₃.q₃)))
  2104. 137.62 s > reduced y
  2105. 137.62 s > span grow{span_context=true current=subgraph=y, topo_order=1, dod=2 given=subgraph=0, topo_order=0, dod=0}
  2106. 137.62 s > [2026-08-28 15:30:54.126] @approx::local_4d [{#uv, #inspect, #integrated}] DEBUG : Rescaled momenta expanded
  2107. 137.62 s > field value
  2108. 137.62 s > res n-terms: 1, byte size: 585,expr:
  2109. 137.62 s > -SCALAR_COUPLING²·q₀(αᵉ².¹)·q₀(αᵉ³.¹)·q₂(αᵉ².¹)·q₂(αᵉ³.¹)
  2110. 137.62 s > /(t²·denom(3,-q₀-q₂/t,mass_scalar_2²,-mass_scalar_2²+2·(q₀.q₂)/t+(q₂.q₂)/t²+(q₀.q₀))
  2111. 137.62 s > ·denom(2,q₂/t,mass_scalar_2²,-mass_scalar_2²+(q₂.q₂)/t²))
  2112. 137.62 s > span t{span_context=true current=subgraph=y, topo_order=1, dod=2 given=subgraph=0, topo_order=0, dod=0}
  2113. 137.62 s > [2026-08-28 15:30:54.126] @approx::local_4d [{#uv, #integrated, #rescaled}] DEBUG : Rescaled expanded
  2114. 137.62 s > field value
  2115. 137.62 s > n_loops 1
  2116. 137.62 s > res n-terms: 1, byte size: 707,expr:
  2117. 137.62 s > -SCALAR_COUPLING²·q₀(αᵉ².¹)·q₀(αᵉ³.¹)·q₂(αᵉ².¹)·q₂(αᵉ³.¹)
  2118. 137.62 s > /(t²·denom(3,-q₂,mUVexp²+t²·mass_scalar_2²,-mUV²+t²·(-mass_scalar_2²+2·(q₀.q₂)/t+(q₂.q₂)/t²+(q₀.q₀))+t²·mUVexp²)
  2119. 137.62 s > ·denom(2,q₂,mUVexp²+t²·mass_scalar_2²,-mUV²+t²·(-mass_scalar_2²+(q₂.q₂)/t²)+t²·mUVexp²))
  2120. 137.62 s > span t{span_context=true current=subgraph=y, topo_order=1, dod=2 given=subgraph=0, topo_order=0, dod=0}
  2121. 137.62 s > [2026-08-28 15:30:54.128] @approx::local_4d [{#uv, #integrated, #series}] DEBUG : Series expanded
  2122. 137.62 s > field value
  2123. 137.62 s > res n-terms: 3, byte size: 1896,expr:
  2124. 137.62 s > (1/2·SCALAR_COUPLING²·(2·mUVexp²-2·mass_scalar_2²)/(denom(2,q₂,mUVexp²,-mUV²+(q₂.q₂))²·denom(3,-q₂,mUVexp²,-mUV²+(q₂.q₂)))
  2125. 137.62 s > -SCALAR_COUPLING²
  2126. 137.62 s > ·(-1/2·(2·mUVexp²-2·mass_scalar_2²+2·(q₀.q₀))/denom(3,-q₂,mUVexp²,-mUV²+(q₂.q₂))
  2127. 137.62 s > +4·(q₀.q₂)²/denom(3,-q₂,mUVexp²,-mUV²+(q₂.q₂))²
  2128. 137.62 s > )/(denom(2,q₂,mUVexp²,-mUV²+(q₂.q₂))·denom(3,-q₂,mUVexp²,-mUV²+(q₂.q₂)))
  2129. 137.62 s > )·q₀(αᵉ².¹)·q₀(αᵉ³.¹)·q₂(αᵉ².¹)·q₂(αᵉ³.¹)
  2130. 137.62 s > +2·SCALAR_COUPLING²·(q₀.q₂)·q₀(αᵉ².¹)·q₀(αᵉ³.¹)·q₂(αᵉ².¹)·q₂(αᵉ³.¹)
  2131. 137.62 s > /(t·denom(2,q₂,mUVexp²,-mUV²+(q₂.q₂))·denom(3,-q₂,mUVexp²,-mUV²+(q₂.q₂))²)
  2132. 137.62 s > -SCALAR_COUPLING²·q₀(αᵉ².¹)·q₀(αᵉ³.¹)·q₂(αᵉ².¹)·q₂(αᵉ³.¹)
  2133. 137.62 s > /(t²·denom(2,q₂,mUVexp²,-mUV²+(q₂.q₂))·denom(3,-q₂,mUVexp²,-mUV²+(q₂.q₂)))
  2134. 137.62 s > span t{span_context=true current=subgraph=y, topo_order=1, dod=2 given=subgraph=0, topo_order=0, dod=0}
  2135. 137.62 s > [2026-08-28 15:30:54.128] @approx::local_4d [{#uv, #integrated, #series}] DEBUG : Evaluated at t = 1
  2136. 137.62 s > field value
  2137. 137.62 s > res n-terms: 3, byte size: 1880,expr:
  2138. 137.62 s > (1/2·SCALAR_COUPLING²·(2·mUVexp²-2·mass_scalar_2²)/(denom(2,q₂,mUVexp²,-mUV²+(q₂.q₂))²·denom(3,-q₂,mUVexp²,-mUV²+(q₂.q₂)))
  2139. 137.62 s > -SCALAR_COUPLING²
  2140. 137.62 s > ·(-1/2·(2·mUVexp²-2·mass_scalar_2²+2·(q₀.q₀))/denom(3,-q₂,mUVexp²,-mUV²+(q₂.q₂))
  2141. 137.62 s > +4·(q₀.q₂)²/denom(3,-q₂,mUVexp²,-mUV²+(q₂.q₂))²
  2142. 137.62 s > )/(denom(2,q₂,mUVexp²,-mUV²+(q₂.q₂))·denom(3,-q₂,mUVexp²,-mUV²+(q₂.q₂)))
  2143. 137.62 s > )·q₀(αᵉ².¹)·q₀(αᵉ³.¹)·q₂(αᵉ².¹)·q₂(αᵉ³.¹)
  2144. 137.62 s > -SCALAR_COUPLING²·q₀(αᵉ².¹)·q₀(αᵉ³.¹)·q₂(αᵉ².¹)·q₂(αᵉ³.¹)
  2145. 137.62 s > /(denom(2,q₂,mUVexp²,-mUV²+(q₂.q₂))·denom(3,-q₂,mUVexp²,-mUV²+(q₂.q₂)))
  2146. 137.62 s > +2·SCALAR_COUPLING²·(q₀.q₂)·q₀(αᵉ².¹)·q₀(αᵉ³.¹)·q₂(αᵉ².¹)·q₂(αᵉ³.¹)
  2147. 137.62 s > /(denom(2,q₂,mUVexp²,-mUV²+(q₂.q₂))·denom(3,-q₂,mUVexp²,-mUV²+(q₂.q₂))²)
  2148. 137.62 s > span t{span_context=true current=subgraph=y, topo_order=1, dod=2 given=subgraph=0, topo_order=0, dod=0}
  2149. 137.62 s > [2026-08-28 15:30:54.130] @approx::local_4d [{#uv, #collect, #integrated}] DEBUG : After gamma chain collection
  2150. 137.62 s > field value
  2151. 137.62 s > expr n-terms: 3, byte size: 1880,expr:
  2152. 137.62 s > (1/2·SCALAR_COUPLING²·(2·mUVexp²-2·mass_scalar_2²)/(denom(2,q₂,mUVexp²,-mUV²+(q₂.q₂))²·denom(3,-q₂,mUVexp²,-mUV²+(q₂.q₂)))
  2153. 137.62 s > -SCALAR_COUPLING²
  2154. 137.62 s > ·(-1/2·(2·mUVexp²-2·mass_scalar_2²+2·(q₀.q₀))/denom(3,-q₂,mUVexp²,-mUV²+(q₂.q₂))
  2155. 137.62 s > +4·(q₀.q₂)²/denom(3,-q₂,mUVexp²,-mUV²+(q₂.q₂))²
  2156. 137.62 s > )/(denom(2,q₂,mUVexp²,-mUV²+(q₂.q₂))·denom(3,-q₂,mUVexp²,-mUV²+(q₂.q₂)))
  2157. 137.62 s > )·q₀(αᵉ².¹)·q₀(αᵉ³.¹)·q₂(αᵉ².¹)·q₂(αᵉ³.¹)
  2158. 137.62 s > -SCALAR_COUPLING²·q₀(αᵉ².¹)·q₀(αᵉ³.¹)·q₂(αᵉ².¹)·q₂(αᵉ³.¹)
  2159. 137.62 s > /(denom(2,q₂,mUVexp²,-mUV²+(q₂.q₂))·denom(3,-q₂,mUVexp²,-mUV²+(q₂.q₂)))
  2160. 137.62 s > +2·SCALAR_COUPLING²·(q₀.q₂)·q₀(αᵉ².¹)·q₀(αᵉ³.¹)·q₂(αᵉ².¹)·q₂(αᵉ³.¹)
  2161. 137.62 s > /(denom(2,q₂,mUVexp²,-mUV²+(q₂.q₂))·denom(3,-q₂,mUVexp²,-mUV²+(q₂.q₂))²)
  2162. 137.62 s > span t{span_context=true current=subgraph=y, topo_order=1, dod=2 given=subgraph=0, topo_order=0, dod=0}
  2163. 137.62 s > [2026-08-28 15:30:54.132] @approx::local_4d [{#profile, #uv, #collect, #integrated, #start, #trace}] DEBUG : After gamma schoonschip
  2164. 137.62 s > field value
  2165. 137.62 s > expr n-terms: 3, byte size: 1631,expr:
  2166. 137.62 s > (1/2·SCALAR_COUPLING²·(2·mUVexp²-2·mass_scalar_2²)/(denom(2,q₂,mUVexp²,-mUV²+(q₂.q₂))²·denom(3,-q₂,mUVexp²,-mUV²+(q₂.q₂)))
  2167. 137.62 s > -SCALAR_COUPLING²
  2168. 137.62 s > ·(-1/2·(2·mUVexp²-2·mass_scalar_2²+2·(q₀.q₀))/denom(3,-q₂,mUVexp²,-mUV²+(q₂.q₂))
  2169. 137.62 s > +4·(q₀.q₂)²/denom(3,-q₂,mUVexp²,-mUV²+(q₂.q₂))²
  2170. 137.62 s > )/(denom(2,q₂,mUVexp²,-mUV²+(q₂.q₂))·denom(3,-q₂,mUVexp²,-mUV²+(q₂.q₂)))
  2171. 137.62 s > )·(q₀.q₂)²
  2172. 137.62 s > -SCALAR_COUPLING²·(q₀.q₂)²/(denom(2,q₂,mUVexp²,-mUV²+(q₂.q₂))·denom(3,-q₂,mUVexp²,-mUV²+(q₂.q₂)))
  2173. 137.62 s > +2·SCALAR_COUPLING²·(q₀.q₂)·(q₀.q₂)²
  2174. 137.62 s > /(denom(2,q₂,mUVexp²,-mUV²+(q₂.q₂))·denom(3,-q₂,mUVexp²,-mUV²+(q₂.q₂))²)
  2175. 137.62 s > span t{span_context=true current=subgraph=y, topo_order=1, dod=2 given=subgraph=0, topo_order=0, dod=0}
  2176. 137.62 s > [2026-08-28 15:30:54.135] @approx::local_4d [{#profile, #uv, #collect, #integrated, #start, #trace}] DEBUG : After gamma collection
  2177. 137.62 s > field value
  2178. 137.62 s > expr n-terms: 1, byte size: 1347,expr:
  2179. 137.62 s > SCALAR_COUPLING²
  2180. 137.62 s > ·(-denom(2,q₂,mUVexp²,-mUV²+(q₂.q₂))·denom(3,-q₂,mUVexp²,-mUV²+(q₂.q₂))²
  2181. 137.62 s > +1/2·(2·mUVexp²-2·mass_scalar_2²)·denom(3,-q₂,mUVexp²,-mUV²+(q₂.q₂))²
  2182. 137.62 s > -(-1/2·(2·mUVexp²-2·mass_scalar_2²+2·(q₀.q₀))·denom(3,-q₂,mUVexp²,-mUV²+(q₂.q₂))+4·(q₀.q₂)²)
  2183. 137.62 s > ·denom(2,q₂,mUVexp²,-mUV²+(q₂.q₂))
  2184. 137.62 s > +2·(q₀.q₂)·denom(2,q₂,mUVexp²,-mUV²+(q₂.q₂))·denom(3,-q₂,mUVexp²,-mUV²+(q₂.q₂))
  2185. 137.62 s > )·(q₀.q₂)²/(denom(2,q₂,mUVexp²,-mUV²+(q₂.q₂))²·denom(3,-q₂,mUVexp²,-mUV²+(q₂.q₂))³)
  2186. 137.62 s > span t{span_context=true current=subgraph=y, topo_order=1, dod=2 given=subgraph=0, topo_order=0, dod=0}
  2187. 137.62 s > [2026-08-28 15:30:54.136] @approx::local_4d [{#profile, #uv, #gamma, #integrated, #start, #trace, #vakint}] DEBUG : After gamma simplification
  2188. 137.62 s > ... omitted 3263 more lines; see full nextest output above
  2189. 137.62 s >
  2190. 137.62 s > 8. gammaloop-integration-tests::uv::sunrise_scalar_1_uv
  2191. 137.62 s > failure: test failure with exit code 101
  2192. 137.62 s > system-out
  2193. 137.62 s > running 1 test
  2194. 137.62 s > test sunrise_scalar_1_uv has been running for over 60 seconds
  2195. 137.62 s > +------------------+------------------------+--------------+--------+----------+----------------------------------------------------------------------------------------------------------------------+-------+
  2196. 137.62 s > | case | check | graph | status | sigma | threshold | error |
  2197. 137.62 s > +------------------+------------------------+--------------+--------+----------+----------------------------------------------------------------------------------------------------------------------+-------+
  2198. 137.62 s > | sunrise_scalar_1 | uv_profile | - | FAIL | - | - | - |
  2199. 137.62 s > +------------------+------------------------+--------------+--------+----------+----------------------------------------------------------------------------------------------------------------------+-------+
  2200. 137.62 s > | sunrise_scalar_1 | m_uv.inspect | inspect | pass | - | best inspect relative delta 1.624e0 >= 1000*accuracy 1.000e-3 (accuracy=1.000e-6, exponent=+1.0, seed=1, probes=10) | - |
  2201. 137.62 s > +------------------+------------------------+--------------+--------+----------+----------------------------------------------------------------------------------------------------------------------+-------+
  2202. 137.62 s > | sunrise_scalar_1 | m_uv.integrated | sunrise | pass | 0.1sigma | compatible within 2sigma | - |
  2203. 137.62 s > +------------------+------------------------+--------------+--------+----------+----------------------------------------------------------------------------------------------------------------------+-------+
  2204. 137.62 s > | sunrise_scalar_1 | rls.inspect | inspect | pass | - | best inspect relative delta 8.682e-1 >= 1000*accuracy 1.000e-3 (accuracy=1.000e-6, exponent=+1.0, seed=1, probes=10) | - |
  2205. 137.62 s > +------------------+------------------------+--------------+--------+----------+----------------------------------------------------------------------------------------------------------------------+-------+
  2206. 137.62 s > | sunrise_scalar_1 | rls.integrated | sunrise | pass | 0.0sigma | compatible within 2sigma | - |
  2207. 137.62 s > +------------------+------------------------+--------------+--------+----------+----------------------------------------------------------------------------------------------------------------------+-------+
  2208. 137.62 s > | sunrise_scalar_1 | mu_r.inspect | inspect | pass | - | best inspect relative delta 1.752e0 >= 1000*accuracy 1.000e-3 (accuracy=1.000e-6, exponent=+1.0, seed=1, probes=10) | - |
  2209. 137.62 s > +------------------+------------------------+--------------+--------+----------+----------------------------------------------------------------------------------------------------------------------+-------+
  2210. 137.62 s > | sunrise_scalar_1 | integrated.relerr | integrated | pass | - | relative error 9.20% <= 10.00% | - |
  2211. 137.62 s > +------------------+------------------------+--------------+--------+----------+----------------------------------------------------------------------------------------------------------------------+-------+
  2212. 137.62 s > | sunrise_scalar_1 | m_uv.integrated.relerr | m_uv-shifted | pass | - | relative error 5.89% <= 10.00% | - |
  2213. 137.62 s > +------------------+------------------------+--------------+--------+----------+----------------------------------------------------------------------------------------------------------------------+-------+
  2214. 137.62 s > | sunrise_scalar_1 | target | - | pass | - | 2sigma | - |
  2215. 137.62 s > +------------------+------------------------+--------------+--------+----------+----------------------------------------------------------------------------------------------------------------------+-------+
  2216. 137.62 s > test sunrise_scalar_1_uv ... FAILED
  2217. 137.62 s >
  2218. 137.62 s > failures:
  2219. 137.62 s >
  2220. 137.62 s > failures:
  2221. 137.62 s > sunrise_scalar_1_uv
  2222. 137.62 s >
  2223. 137.62 s > test result: FAILED. 0 passed; 1 failed; 0 ignored; 0 measured; 24 filtered out; finished in 94.19s
  2224. 137.62 s > system-err
  2225. 137.62 s > [2026-08-28 15:30:58.776] @gammaloop_api::se... INFO : Running command run generate
  2226. 137.62 s > [2026-08-28 15:30:58.776] @gammaloop_api::se... INFO : Starting command block generate
  2227. 137.62 s > [2026-08-28 15:30:58.776] @gammaloop_api::se... INFO : Running command import model scalars-default.json
  2228. 137.62 s > [2026-08-28 15:30:58.777] @import::model INFO : Loading built-in JSON model scalars-default
  2229. 137.62 s > [2026-08-28 15:30:58.780] @gammalooprs::model INFO : The following 2 external parameters were forced to zero by the restriction card:
  2230. 137.62 s > width_scalar_1, width_scalar_2
  2231. 137.62 s > [2026-08-28 15:30:58.781] @gammaloop_api::se... INFO : Running command remove processes
  2232. 137.62 s > [2026-08-28 15:30:58.781] @gammaloop_api::se... INFO : Running command set global kv global.generation.uv.generate_integrated=true
  2233. 137.62 s > [2026-08-28 15:30:58.781] @gammaloop_api::se... INFO : Running command import graphs ./tests/resources/graphs/scalar_sunrise.dot -p sunrise_scalar_1 -i scalar_sunrise
  2234. 137.62 s > [2026-08-28 15:30:58.781] @commands::import INFO : Loading graphs from '/build/source/tests/resources/graphs/scalar_sunrise.dot'
  2235. 137.62 s > [2026-08-28 15:30:58.784] @gammaloop_api::se... INFO : Running command generate existing -p sunrise_scalar_1 -i scalar_sunrise
  2236. 137.62 s > [2026-08-28 15:30:58.786] @approx::local_4d [{#uv, #inspect, #integrated}] DEBUG : Rescaled momenta expanded
  2237. 137.62 s > field value
  2238. 137.62 s > res n-terms: 1, byte size: 777,expr:
  2239. 137.62 s > 1/(denom(0,q₀/t,mass_scalar_1²,-mass_scalar_1²+(q₀.q₀)/t²)·denom(1,q₁/t,mass_scalar_1²,-mass_scalar_1²+(q₁.q₁)/t²)
  2240. 137.62 s > ·denom(2,q₄-q₀/t-q₁/t,mass_scalar_1²,
  2241. 137.62 s > -mass_scalar_1²-2·(q₀.q₄)/t-2·(q₁.q₄)/t+(q₀.q₀)/t²+2·(q₀.q₁)/t²
  2242. 137.62 s > +(q₁.q₁)/t²+(q₄.q₄)
  2243. 137.62 s > ))
  2244. 137.62 s > [2026-08-28 15:30:58.794] @approx::local_4d [{#uv, #inspect, #integrated}] DEBUG : Rescaled momenta expanded
  2245. 137.62 s > field value
  2246. 137.62 s > res n-terms: 1, byte size: 611,expr:
  2247. 137.62 s > 1/(denom(0,q₀/t,mass_scalar_1²,-mass_scalar_1²+(q₀.q₀)/t²)
  2248. 137.62 s > ·denom(1,-q₂+q₃-q₀/t,mass_scalar_1²,
  2249. 137.62 s > -mass_scalar_1²+2·(q₀.q₂)/t-2·(q₀.q₃)/t+(q₀.q₀)/t²+(q₂.q₂)
  2250. 137.62 s > -2·(q₂.q₃)+(q₃.q₃)
  2251. 137.62 s > ))
  2252. 137.62 s > [2026-08-28 15:30:58.795] @approx::local_4d [{#uv, #inspect, #integrated}] DEBUG : Rescaled momenta expanded
  2253. 137.62 s > field value
  2254. 137.62 s > res n-terms: 1, byte size: 611,expr:
  2255. 137.62 s > 1/(denom(1,q₁/t,mass_scalar_1²,-mass_scalar_1²+(q₁.q₁)/t²)
  2256. 137.62 s > ·denom(2,-q₀+q₃-q₁/t,mass_scalar_1²,
  2257. 137.62 s > -mass_scalar_1²+2·(q₀.q₁)/t-2·(q₁.q₃)/t+(q₁.q₁)/t²+(q₀.q₀)
  2258. 137.62 s > -2·(q₀.q₃)+(q₃.q₃)
  2259. 137.62 s > ))
  2260. 137.62 s > [2026-08-28 15:30:58.796] @approx::local_4d [{#uv, #inspect, #integrated}] DEBUG : Rescaled momenta expanded
  2261. 137.62 s > field value
  2262. 137.62 s > res n-terms: 1, byte size: 3,expr:
  2263. 137.62 s > 1
  2264. 137.62 s > [2026-08-28 15:30:58.797] @approx::local_4d [{#uv, #inspect, #integrated}] DEBUG : Rescaled momenta expanded
  2265. 137.62 s > field value
  2266. 137.62 s > res n-terms: 1, byte size: 611,expr:
  2267. 137.62 s > 1/(denom(0,q₀/t,mass_scalar_1²,-mass_scalar_1²+(q₀.q₀)/t²)
  2268. 137.62 s > ·denom(2,-q₁+q₃-q₀/t,mass_scalar_1²,
  2269. 137.62 s > -mass_scalar_1²+2·(q₀.q₁)/t-2·(q₀.q₃)/t+(q₀.q₀)/t²+(q₁.q₁)
  2270. 137.62 s > -2·(q₁.q₃)+(q₃.q₃)
  2271. 137.62 s > ))
  2272. 137.62 s > [2026-08-28 15:30:58.798] @approx::final_integrand[{#generation, #profile, #uv, #graph, #summary}] DEBUG : Computed global numerator
  2273. 137.62 s > field value
  2274. 137.62 s > global_num n-terms: 1, byte size: 3,expr:
  2275. 137.62 s > 1
  2276. 137.62 s > span build_3d{span_context=true graph=sunrise current=subgraph=0, topo_order=0, dod=0}
  2277. 137.62 s > [2026-08-28 15:30:58.799] @uv::approx [{#generation, #uv, #fourd}] DEBUG : Computing 4D
  2278. 137.62 s > field value
  2279. 137.62 s > simple subgraph(S_47,S_44)*Approx(subgraph(S_44,0)) of sunrise
  2280. 137.62 s > span compute_4d{span_context=true graph=sunrise current=subgraph=44, topo_order=1, dod=2 given=subgraph=0, topo_order=0, dod=0 reduced=SubSet { set: BitVec<usize, bitvec::order::Lsb0> { addr: 0x7fffec00c0b0, head: 000000, bits: 8, capacity: 64 } [0, 0, 1, 1, 1, 1, 1, 1], id: PhantomData<linnet::half_edge::involution::Hedge> }}
  2281. 137.62 s > [2026-08-28 15:30:58.800] @approx::local_4d [{#uv, #algebra, #integrated, #start}] DEBUG :
  2282. 137.62 s > field value
  2283. 137.62 s > integrand n-terms: 1, byte size: 322,expr:
  2284. 137.62 s > 1/(denom(0,q₀,mass_scalar_1²,-mass_scalar_1²+(q₀.q₀))·denom(1,q₁,mass_scalar_1²,-mass_scalar_1²+(q₁.q₁))
  2285. 137.62 s > ·denom(2,q₂,mass_scalar_1²,-mass_scalar_1²+(q₂.q₂)))
  2286. 137.62 s > reduced 44
  2287. 137.62 s > span grow{span_context=true current=subgraph=44, topo_order=1, dod=2 given=subgraph=0, topo_order=0, dod=0}
  2288. 137.62 s > [2026-08-28 15:30:58.800] @approx::local_4d [{#uv, #inspect, #integrated}] DEBUG : Rescaled momenta expanded
  2289. 137.62 s > field value
  2290. 137.62 s > res n-terms: 1, byte size: 777,expr:
  2291. 137.62 s > 1/(denom(0,q₀/t,mass_scalar_1²,-mass_scalar_1²+(q₀.q₀)/t²)·denom(1,q₁/t,mass_scalar_1²,-mass_scalar_1²+(q₁.q₁)/t²)
  2292. 137.62 s > ·denom(2,q₄-q₀/t-q₁/t,mass_scalar_1²,
  2293. 137.62 s > -mass_scalar_1²-2·(q₀.q₄)/t-2·(q₁.q₄)/t+(q₀.q₀)/t²+2·(q₀.q₁)/t²
  2294. 137.62 s > +(q₁.q₁)/t²+(q₄.q₄)
  2295. 137.62 s > ))
  2296. 137.62 s > span t{span_context=true current=subgraph=44, topo_order=1, dod=2 given=subgraph=0, topo_order=0, dod=0}
  2297. 137.62 s > [2026-08-28 15:30:58.800] @approx::local_4d [{#uv, #integrated, #rescaled}] DEBUG : Rescaled expanded
  2298. 137.62 s > field value
  2299. 137.62 s > n_loops 2
  2300. 137.62 s > res n-terms: 1, byte size: 982,expr:
  2301. 137.62 s > 1/(t²
  2302. 137.62 s > ·denom(2,-q₀-q₁,mUVexp²+t²·mass_scalar_1²,
  2303. 137.62 s > -mUV²
  2304. 137.62 s > +t²
  2305. 137.62 s > ·(-mass_scalar_1²-2·(q₀.q₄)/t-2·(q₁.q₄)/t+(q₀.q₀)/t²+2·(q₀.q₁)/t²
  2306. 137.62 s > +(q₁.q₁)/t²+(q₄.q₄)
  2307. 137.62 s > )
  2308. 137.62 s > +t²·mUVexp²
  2309. 137.62 s > )
  2310. 137.62 s > ·denom(0,q₀,mUVexp²+t²·mass_scalar_1²,-mUV²+t²·(-mass_scalar_1²+(q₀.q₀)/t²)+t²·mUVexp²)
  2311. 137.62 s > ·denom(1,q₁,mUVexp²+t²·mass_scalar_1²,-mUV²+t²·(-mass_scalar_1²+(q₁.q₁)/t²)+t²·mUVexp²))
  2312. 137.62 s > span t{span_context=true current=subgraph=44, topo_order=1, dod=2 given=subgraph=0, topo_order=0, dod=0}
  2313. 137.62 s > [2026-08-28 15:30:58.801] @approx::local_4d [{#uv, #integrated, #series}] DEBUG : Series expanded
  2314. 137.62 s > field value
  2315. 137.62 s > res n-terms: 4, byte size: 3187,expr:
  2316. 137.62 s > -1/2·(2·mUVexp²-2·mass_scalar_1²)
  2317. 137.62 s > /(denom(0,q₀,mUVexp²,-mUV²+(q₀.q₀))·denom(1,q₁,mUVexp²,-mUV²+(q₁.q₁))²
  2318. 137.62 s > ·denom(2,-q₀-q₁,mUVexp²,-mUV²+(q₀.q₀)+2·(q₀.q₁)+(q₁.q₁)))
  2319. 137.62 s > +(-1/2·(2·mUVexp²-2·mass_scalar_1²)
  2320. 137.62 s > /(denom(0,q₀,mUVexp²,-mUV²+(q₀.q₀))²
  2321. 137.62 s > ·denom(2,-q₀-q₁,mUVexp²,-mUV²+(q₀.q₀)+2·(q₀.q₁)+(q₁.q₁)))
  2322. 137.62 s > +(-1/2·(2·mUVexp²-2·mass_scalar_1²+2·(q₄.q₄))
  2323. 137.62 s > /denom(2,-q₀-q₁,mUVexp²,-mUV²+(q₀.q₀)+2·(q₀.q₁)+(q₁.q₁))
  2324. 137.62 s > +(-2·(q₀.q₄)-2·(q₁.q₄))²
  2325. 137.62 s > /denom(2,-q₀-q₁,mUVexp²,-mUV²+(q₀.q₀)+2·(q₀.q₁)+(q₁.q₁))²
  2326. 137.62 s > )
  2327. 137.62 s > /(denom(0,q₀,mUVexp²,-mUV²+(q₀.q₀))
  2328. 137.62 s > ·denom(2,-q₀-q₁,mUVexp²,-mUV²+(q₀.q₀)+2·(q₀.q₁)+(q₁.q₁)))
  2329. 137.62 s > )/denom(1,q₁,mUVexp²,-mUV²+(q₁.q₁))
  2330. 137.62 s > -(-2·(q₀.q₄)-2·(q₁.q₄))
  2331. 137.62 s > /(t·denom(0,q₀,mUVexp²,-mUV²+(q₀.q₀))·denom(1,q₁,mUVexp²,-mUV²+(q₁.q₁))
  2332. 137.62 s > ·denom(2,-q₀-q₁,mUVexp²,-mUV²+(q₀.q₀)+2·(q₀.q₁)+(q₁.q₁))²)
  2333. 137.62 s > +1/(t²·denom(0,q₀,mUVexp²,-mUV²+(q₀.q₀))·denom(1,q₁,mUVexp²,-mUV²+(q₁.q₁))
  2334. 137.62 s > ·denom(2,-q₀-q₁,mUVexp²,-mUV²+(q₀.q₀)+2·(q₀.q₁)+(q₁.q₁)))
  2335. 137.62 s > span t{span_context=true current=subgraph=44, topo_order=1, dod=2 given=subgraph=0, topo_order=0, dod=0}
  2336. 137.62 s > [2026-08-28 15:30:58.802] @approx::local_4d [{#uv, #integrated, #series}] DEBUG : Evaluated at t = 1
  2337. 137.62 s > field value
  2338. 137.62 s > res n-terms: 4, byte size: 3171,expr:
  2339. 137.62 s > -1/2·(2·mUVexp²-2·mass_scalar_1²)
  2340. 137.62 s > /(denom(0,q₀,mUVexp²,-mUV²+(q₀.q₀))·denom(1,q₁,mUVexp²,-mUV²+(q₁.q₁))²
  2341. 137.62 s > ·denom(2,-q₀-q₁,mUVexp²,-mUV²+(q₀.q₀)+2·(q₀.q₁)+(q₁.q₁)))
  2342. 137.62 s > -(-2·(q₀.q₄)-2·(q₁.q₄))
  2343. 137.62 s > /(denom(0,q₀,mUVexp²,-mUV²+(q₀.q₀))·denom(1,q₁,mUVexp²,-mUV²+(q₁.q₁))
  2344. 137.62 s > ... omitted 20095 more lines; see full nextest output above
  2345. 137.62 s >
  2346. 137.62 s > 9. gammaloop-integration-tests::uv::se1l_uv
  2347. 137.62 s > failure: test failure with exit code 101
  2348. 137.62 s > system-out
  2349. 137.62 s > running 1 test
  2350. 137.62 s > test se1l_uv has been running for over 60 seconds
  2351. 137.62 s > +------+-----------------+---------+--------+----------+-----------------------------------------------------------------------------------------------------------------------+-------+
  2352. 137.62 s > | case | check | graph | status | sigma | threshold | error |
  2353. 137.62 s > +------+-----------------+---------+--------+----------+-----------------------------------------------------------------------------------------------------------------------+-------+
  2354. 137.62 s > | se1l | uv_profile | - | FAIL | - | - | - |
  2355. 137.62 s > +------+-----------------+---------+--------+----------+-----------------------------------------------------------------------------------------------------------------------+-------+
  2356. 137.62 s > | se1l | m_uv.inspect | inspect | pass | - | best inspect relative delta 1.097e-1 >= 1000*accuracy 1.000e-7 (accuracy=1.000e-10, exponent=+2.0, seed=1, probes=10) | - |
  2357. 137.62 s > +------+-----------------+---------+--------+----------+-----------------------------------------------------------------------------------------------------------------------+-------+
  2358. 137.62 s > | se1l | m_uv.integrated | se1l | pass | 0.1sigma | compatible within 2sigma | - |
  2359. 137.62 s > +------+-----------------+---------+--------+----------+-----------------------------------------------------------------------------------------------------------------------+-------+
  2360. 137.62 s > | se1l | rls.inspect | inspect | pass | - | best inspect relative delta 4.499e-2 >= 1000*accuracy 1.000e-7 (accuracy=1.000e-10, exponent=+2.0, seed=1, probes=10) | - |
  2361. 137.62 s > +------+-----------------+---------+--------+----------+-----------------------------------------------------------------------------------------------------------------------+-------+
  2362. 137.62 s > | se1l | rls.integrated | se1l | pass | 0.0sigma | compatible within 2sigma | - |
  2363. 137.62 s > +------+-----------------+---------+--------+----------+-----------------------------------------------------------------------------------------------------------------------+-------+
  2364. 137.62 s > | se1l | mu_r.inspect | inspect | pass | - | best inspect relative delta 1.424e-1 >= 1000*accuracy 1.000e-7 (accuracy=1.000e-10, exponent=+2.0, seed=1, probes=10) | - |
  2365. 137.62 s > +------+-----------------+---------+--------+----------+-----------------------------------------------------------------------------------------------------------------------+-------+
  2366. 137.62 s > | se1l | target | - | pass | - | 2sigma | - |
  2367. 137.62 s > +------+-----------------+---------+--------+----------+-----------------------------------------------------------------------------------------------------------------------+-------+
  2368. 137.62 s > test se1l_uv ... FAILED
  2369. 137.62 s >
  2370. 137.62 s > failures:
  2371. 137.62 s >
  2372. 137.62 s > failures:
  2373. 137.62 s > se1l_uv
  2374. 137.62 s >
  2375. 137.62 s > test result: FAILED. 0 passed; 1 failed; 0 ignored; 0 measured; 24 filtered out; finished in 105.99s
  2376. 137.62 s > system-err
  2377. 137.62 s > [2026-08-28 15:30:58.202] @gammaloop_api::se... INFO : Running command run generate
  2378. 137.62 s > [2026-08-28 15:30:58.202] @gammaloop_api::se... INFO : Starting command block generate
  2379. 137.62 s > [2026-08-28 15:30:58.203] @gammaloop_api::se... INFO : Running command import model sm-default
  2380. 137.62 s > [2026-08-28 15:30:58.203] @import::model INFO : Loading built-in JSON model sm-default
  2381. 137.62 s > [2026-08-28 15:30:58.243] @gammalooprs::model INFO : The following 11 external parameters were forced to zero by the restriction card:
  2382. 137.62 s > lamWS, AWS, rhoWS, etaWS, ymc, yme, ymm, MC, Me, MM, WTau
  2383. 137.62 s > [2026-08-28 15:30:58.243] @gammalooprs::model INFO : The following 34 vertex rules were removed by the restriction card:
  2384. 137.62 s > V_82 -> (c~, d, G+) | V_83 -> (t~, d, G+) | V_84 -> (c~, s, G+) | V_85 -> (t~, s, G+) | V_86 -> (u~, b, G+) | V_87 -> (c~, b, G+) | V_90 -> (c~, d, W+) | V_91 -> (t~, d, W+) | V_92 -> (u~, s, W+) | V_94 -> (t~, s, W+) | V_95 -> (u~, b, W+) | V_96 -> (c~, b, W+) | V_101 -> (e+, e-, G0) | V_102 -> (mu+, mu-, G0) | V_104 -> (e+, e-, H) | V_105 -> (mu+, mu-, H) | V_110 -> (ve~, e-, G+) | V_111 -> (vm~, mu-, G+) | V_116 -> (b~, u, G-) | V_117 -> (d~, c, G-) | V_118 -> (s~, c, G-) | V_119 -> (b~, c, G-) | V_120 -> (d~, t, G-) | V_121 -> (s~, t, G-) | V_124 -> (s~, u, W-) | V_125 -> (b~, u, W-) | V_126 -> (d~, c, W-) | V_128 -> (b~, c, W-) | V_129 -> (d~, t, W-) | V_130 -> (s~, t, W-) | V_138 -> (c~, c, G0) | V_140 -> (c~, c, H) | V_145 -> (e+, ve, G-) | V_146 -> (mu+, vm, G-)
  2385. 137.62 s > [2026-08-28 15:30:58.243] @gammalooprs::model INFO : The following 36 couplings were removed by the restriction card:
  2386. 137.62 s > GC_13, GC_14, GC_16, GC_17, GC_18, GC_19, GC_20, GC_22, GC_23, GC_24, GC_25, GC_26, GC_28, GC_29, GC_42, GC_43, GC_44, GC_46, GC_47, GC_48, GC_84, GC_85, GC_86, GC_87, GC_88, GC_89, GC_90, GC_91, GC_92, GC_93, GC_101, GC_102, GC_103, GC_105, GC_106, GC_107
  2387. 137.62 s > [2026-08-28 15:30:58.243] @gammaloop_api::se... INFO : Running command remove processes
  2388. 137.62 s > [2026-08-28 15:30:58.243] @gammaloop_api::se... INFO : Running command set global kv global.generation.uv.generate_integrated=true
  2389. 137.62 s > [2026-08-28 15:30:58.247] @gammaloop_api::se... INFO : Running command import graphs ./tests/resources/graphs/uv_tests/se1l.dot -p se1l -i se1l
  2390. 137.62 s > [2026-08-28 15:30:58.247] @commands::import INFO : Loading graphs from '/build/source/tests/resources/graphs/uv_tests/se1l.dot'
  2391. 137.62 s > [2026-08-28 15:30:58.253] @gammaloop_api::se... INFO : Running command generate existing -p se1l -i se1l
  2392. 137.62 s > [2026-08-28 15:30:59.214] @commands::generate INFO :
  2393. 137.62 s > Integrand generation summary
  2394. 137.62 s > peak RAM 90.03 MiB | cores 1
  2395. 137.62 s > ╭───────────┬───────┬─────────┬─────────────┬─────────────┬────────────────┬─────────────╮
  2396. 137.62 s > │ integrand │ graph │ # evals │ expr build │ spenso │ symbolica eval │ compile │
  2397. 137.62 s > ├───────────┼───────┼─────────┼─────────────┼─────────────┼────────────────┼─────────────┤
  2398. 137.62 s > │ se1l │ se1l │ 5 │ 767ms (83%) │ 54ms (5.9%) │ 99ms (11%) │ 0ms (0.00%) │
  2399. 137.62 s > ├───────────┼───────┼─────────┼─────────────┼─────────────┼────────────────┼─────────────┤
  2400. 137.62 s > │ Total │ │ 5 │ 767ms (83%) │ 54ms (5.9%) │ 99ms (11%) │ 0ms (0.00%) │
  2401. 137.62 s > ╰───────────┴───────┴─────────┴─────────────┴─────────────┴────────────────┴─────────────╯
  2402. 137.62 s > [2026-08-28 15:30:59.214] @gammaloop_api::se... INFO : Running command set process -p se1l -i se1l kv general.m_uv=0.2
  2403. 137.62 s > [2026-08-28 15:30:59.215] @gammaloop_api::se... INFO : Running command set process -p se1l -i se1l kv general.mu_r=0.2
  2404. 137.62 s > [2026-08-28 15:30:59.216] @gammaloop_api::se... INFO : Running command set process -p se1l -i se1l kv general.renormalization_localization_scale=0.2
  2405. 137.62 s > [2026-08-28 15:30:59.217] @gammaloop_api::se... INFO : Running command duplicate integrand -p se1l -i se1l --output_process_name se1l --output_integrand_name se1l_muv_shifted
  2406. 137.62 s > [2026-08-28 15:30:59.218] @gammaloop_api::se... INFO : Running command set process -p se1l -i se1l_muv_shifted kv general.m_uv=0.5
  2407. 137.62 s > [2026-08-28 15:30:59.219] @gammaloop_api::se... INFO : Running command duplicate integrand -p se1l -i se1l --output_process_name se1l --output_integrand_name se1l_rls_shifted
  2408. 137.63 s > [2026-08-28 15:30:59.221] @gammaloop_api::se... INFO : Running command set process -p se1l -i se1l_rls_shifted kv general.renormalization_localization_scale=1
  2409. 137.63 s > [2026-08-28 15:30:59.222] @gammaloop_api::se... INFO : Running command duplicate integrand -p se1l -i se1l --output_process_name se1l --output_integrand_name se1l_mur_shifted
  2410. 137.63 s > [2026-08-28 15:30:59.224] @gammaloop_api::se... INFO : Running command set process -p se1l -i se1l_mur_shifted kv general.mu_r=0.8
  2411. 137.63 s > [2026-08-28 15:30:59.229] @process::amplitude WARNING : External state 0 ('g', PDG 21, helicity +) is off shell: p^2 = +2.5e5, expected m^2 = +0e0 (|Δ| = +2.5e5). Fixed-helicity spinor/vector/tensor external states may be ill-defined at this kinematic point.
  2412. 137.63 s > field value
  2413. 137.63 s > span warm_up{integrand.name=se1l}
  2414. 137.63 s > [2026-08-28 15:30:59.229] @process::amplitude WARNING : External state 1 ('g', PDG 21, helicity -) is off shell: p^2 = +2.5e5, expected m^2 = +0e0 (|Δ| = +2.5e5). Fixed-helicity spinor/vector/tensor external states may be ill-defined at this kinematic point.
  2415. 137.63 s > field value
  2416. 137.63 s > span warm_up{integrand.name=se1l}
  2417. 137.63 s > [2026-08-28 15:30:59.229] @process::amplitude INFO : Input is above threshold: 1 existing threshold E-surfaces across 1/1 graph groups
  2418. 137.63 s > field value
  2419. 137.63 s > existing_esurfaces 1
  2420. 137.63 s > group_count 1
  2421. 137.63 s > groups_above_threshold 1
  2422. 137.63 s > integrand se1l
  2423. 137.63 s > span warm_up{integrand.name=se1l}
  2424. 137.63 s > threshold_status above threshold
  2425. 137.63 s > [2026-08-28 15:30:59.229] @process::amplitude INFO : overlap structure of group 0: [1: [0(2,3)]]
  2426. 137.63 s > field value
  2427. 137.63 s > span warm_up{integrand.name=se1l}
  2428. 137.63 s > [2026-08-28 15:30:59.460] @commands::profile INFO :
  2429. 137.63 s > ╭───────┬──────┬──────────┬───────┬─────┬──────────┬───────────╮
  2430. 137.63 s > │ fixed │ → ∞ │ slope │ r2 │ DOD │ bare DOD │ inspect │
  2431. 137.63 s > ├───────┼──────┼──────────┼───────┼─────┼──────────┼───────────┤
  2432. 137.63 s > │ {} │ {e3} │ 1.639236 │ 0.904 │ 2 │ 2 │ arb retry │
  2433. 137.63 s > │ {} │ {e2} │ 1.698834 │ 0.902 │ 2 │ 2 │ arb retry │
  2434. 137.63 s > ╰───────┴──────┴──────────┴───────┴─────┴──────────┴───────────╯
  2435. 137.63 s > [2026-08-28 15:30:59.460] @commands::profile INFO :
  2436. 137.63 s > ╭───────┬──────┬─────────────┬──────────┬───────┬─────┬──────────┬───────────╮
  2437. 137.63 s > │ fixed │ → ∞ │ orientation │ slope │ r2 │ DOD │ bare DOD │ inspect │
  2438. 137.63 s > ├───────┼──────┼─────────────┼──────────┼───────┼─────┼──────────┼───────────┤
  2439. 137.63 s > │ {} │ {e3} │ 00-+ │ 0.343429 │ 0.145 │ 0 │ 2 │ arb retry │
  2440. 137.63 s > │ {} │ {e3} │ 00+- │ 0.342577 │ 0.135 │ 0 │ 2 │ arb retry │
  2441. 137.63 s > │ {} │ {e2} │ 00-+ │ 0.385975 │ 0.161 │ 0 │ 2 │ arb retry │
  2442. 137.63 s > │ {} │ {e2} │ 00+- │ 0.384920 │ 0.192 │ 0 │ 2 │ arb retry │
  2443. 137.63 s > ╰───────┴──────┴─────────────┴──────────┴───────┴─────┴──────────┴───────────╯
  2444. 137.63 s > [2026-08-28 15:30:59.460] @gammaloop_api::se... INFO : Running command set process kv integrator.target_relative_accuracy=0.001 integrator.n_increase=0 integrator.n_start=50000 integrator.n_max=400000 integrator.seed=1337
  2445. 137.63 s > [2026-08-28 15:30:59.461] @commands::integrate INFO : Created workspace directory at /build/source/tests/artifacts/se1l/integration_workspace_se1l
  2446. 137.63 s > [2026-08-28 15:30:59.477] @commands::integrate INFO : No integration state found, starting new integration
  2447. 137.63 s > [2026-08-28 15:30:59.477] @commands::integrate INFO : Gammaloop now integrates se1l@se1l, se1l@se1l_muv_shifted, se1l@se1l_rls_shifted
  2448. 137.63 s > [2026-08-28 15:30:59.477] @process::amplitude WARNING : External state 0 ('g', PDG 21, helicity +) is off shell: p^2 = +2.5e5, expected m^2 = +0e0 (|Δ| = +2.5e5). Fixed-helicity spinor/vector/tensor external states may be ill-defined at this kinematic point.
  2449. 137.63 s > field value
  2450. 137.63 s > span warm_up{integrand.name=se1l}
  2451. 137.63 s > [2026-08-28 15:30:59.477] @process::amplitude WARNING : External state 1 ('g', PDG 21, helicity -) is off shell: p^2 = +2.5e5, expected m^2 = +0e0 (|Δ| = +2.5e5). Fixed-helicity spinor/vector/tensor external states may be ill-defined at this kinematic point.
  2452. 137.63 s > field value
  2453. 137.63 s > span warm_up{integrand.name=se1l}
  2454. 137.63 s > [2026-08-28 15:30:59.477] @process::amplitude INFO : Input is above threshold: 1 existing threshold E-surfaces across 1/1 graph groups
  2455. 137.63 s > field value
  2456. 137.63 s > existing_esurfaces 1
  2457. 137.63 s > group_count 1
  2458. 137.63 s > groups_above_threshold 1
  2459. 137.63 s > integrand se1l
  2460. 137.63 s > span warm_up{integrand.name=se1l}
  2461. 137.63 s > threshold_status above threshold
  2462. 137.63 s > [2026-08-28 15:30:59.477] @process::amplitude INFO : overlap structure of group 0: [1: [0(2,3)]]
  2463. 137.63 s > field value
  2464. 137.63 s > span warm_up{integrand.name=se1l}
  2465. 137.63 s > [2026-08-28 15:30:59.478] @process::amplitude WARNING : External state 0 ('g', PDG 21, helicity +) is off shell: p^2 = +2.5e5, expected m^2 = +0e0 (|Δ| = +2.5e5). Fixed-helicity spinor/vector/tensor external states may be ill-defined at this kinematic point.
  2466. 137.63 s > field value
  2467. 137.63 s > span warm_up{integrand.name=se1l_muv_shifted}
  2468. 137.63 s > [2026-08-28 15:30:59.478] @process::amplitude WARNING : External state 1 ('g', PDG 21, helicity -) is off shell: p^2 = +2.5e5, expected m^2 = +0e0 (|Δ| = +2.5e5). Fixed-helicity spinor/vector/tensor external states may be ill-defined at this kinematic point.
  2469. 137.63 s > field value
  2470. 137.63 s > span warm_up{integrand.name=se1l_muv_shifted}
  2471. 137.63 s > [2026-08-28 15:30:59.479] @process::amplitude INFO : Input is above threshold: 1 existing threshold E-surfaces across 1/1 graph groups
  2472. 137.63 s > field value
  2473. 137.63 s > existing_esurfaces 1
  2474. 137.63 s > group_count 1
  2475. 137.63 s > groups_above_threshold 1
  2476. 137.63 s > integrand se1l_muv_shifted
  2477. 137.63 s > span warm_up{integrand.name=se1l_muv_shifted}
  2478. 137.63 s > threshold_status above threshold
  2479. 137.63 s > [2026-08-28 15:30:59.479] @process::amplitude INFO : overlap structure of group 0: [1: [0(2,3)]]
  2480. 137.63 s > field value
  2481. 137.63 s > span warm_up{integrand.name=se1l_muv_shifted}
  2482. 137.63 s > [2026-08-28 15:30:59.480] @process::amplitude WARNING : External state 0 ('g', PDG 21, helicity +) is off shell: p^2 = +2.5e5, expected m^2 = +0e0 (|Δ| = +2.5e5). Fixed-helicity spinor/vector/tensor external states may be ill-defined at this kinematic point.
  2483. 137.63 s > field value
  2484. 137.63 s > span warm_up{integrand.name=se1l_rls_shifted}
  2485. 137.63 s > [2026-08-28 15:30:59.480] @process::amplitude WARNING : External state 1 ('g', PDG 21, helicity -) is off shell: p^2 = +2.5e5, expected m^2 = +0e0 (|Δ| = +2.5e5). Fixed-helicity spinor/vector/tensor external states may be ill-defined at this kinematic point.
  2486. 137.63 s > field value
  2487. 137.63 s > span warm_up{integrand.name=se1l_rls_shifted}
  2488. 137.63 s > [2026-08-28 15:30:59.480] @process::amplitude INFO : Input is above threshold: 1 existing threshold E-surfaces across 1/1 graph groups
  2489. 137.63 s > field value
  2490. 137.63 s > existing_esurfaces 1
  2491. 137.63 s > group_count 1
  2492. 137.63 s > groups_above_threshold 1
  2493. 137.63 s > integrand se1l_rls_shifted
  2494. 137.63 s > span warm_up{integrand.name=se1l_rls_shifted}
  2495. 137.63 s > threshold_status above threshold
  2496. 137.63 s > ... omitted 1410 more lines; see full nextest output above
  2497. 137.63 s > =========================================
  2498. 137.63 s For full logs, run:
  2499. 137.63 s nix log /nix/store/5lvckp7qh3dqs2nqf61qj4kz6kj46p4q-gammaloop-nextest-integration.drv
  2500. 137.74 s Run failed.