test packages.x86_64-linux.nix-ci-check-gammaloop-nextest-docs
0.00 s
$ /nix/store/9ypz3flqsrl5xl495mm8h645gadjsxi1-coreutils-9.11/bin/timeout --kill-after=15s 7200s /nix/store/23zk8sgzamrbmj1fday15szf7f2279s8-nix-2.34.7/bin/nix --extra-experimental-features nix-command --extra-experimental-features flakes flake clone git+https://github.com/alphal00p/gammaloop --dest /tmp/nix-ci-worker/stable-pwd/repo/
0.07 s
Cloning into '/tmp/nix-ci-worker/stable-pwd/repo'...
1.88 s
remote: Enumerating objects: 63875
remote: Enumerating objects: 78252, done.
2.45 s
remote: Counting objects: 0% (1/14377)
remote: Counting objects: 1% (144/14377)
remote: Counting objects: 2% (288/14377)
remote: Counting objects: 3% (432/14377)
remote: Counting objects: 4% (576/14377)
remote: Counting objects: 5% (719/14377)
remote: Counting objects: 6% (863/14377)
remote: Counting objects: 7% (1007/14377)
remote: Counting objects: 8% (1151/14377)
remote: Counting objects: 9% (1294/14377)
remote: Counting objects: 10% (1438/14377)
remote: Counting objects: 11% (1582/14377)
remote: Counting objects: 12% (1726/14377)
remote: Counting objects: 13% (1870/14377)
remote: Counting objects: 14% (2013/14377)
remote: Counting objects: 15% (2157/14377)
remote: Counting objects: 16% (2301/14377)
remote: Counting objects: 17% (2445/14377)
remote: Counting objects: 18% (2588/14377)
remote: Counting objects: 19% (2732/14377)
remote: Counting objects: 20% (2876/14377)
remote: Counting objects: 21% (3020/14377)
remote: Counting objects: 22% (3163/14377)
remote: Counting objects: 23% (3307/14377)
remote: Counting objects: 24% (3451/14377)
remote: Counting objects: 25% (3595/14377)
remote: Counting objects: 26% (3739/14377)
remote: Counting objects: 27% (3882/14377)
remote: Counting objects: 28% (4026/14377)
remote: Counting objects: 29% (4170/14377)
remote: Counting objects: 30% (4314/14377)
remote: Counting objects: 31% (4457/14377)
remote: Counting objects: 32% (4601/14377)
remote: Counting objects: 33% (4745/14377)
remote: Counting objects: 34% (4889/14377)
remote: Counting objects: 35% (5032/14377)
remote: Counting objects: 36% (5176/14377)
remote: Counting objects: 37% (5320/14377)
remote: Counting objects: 38% (5464/14377)
remote: Counting objects: 39% (5608/14377)
remote: Counting objects: 40% (5751/14377)
remote: Counting objects: 41% (5895/14377)
remote: Counting objects: 42% (6039/14377)
remote: Counting objects: 43% (6183/14377)
remote: Counting objects: 44% (6326/14377)
remote: Counting objects: 45% (6470/14377)
remote: Counting objects: 46% (6614/14377)
remote: Counting objects: 47% (6758/14377)
remote: Counting objects: 48% (6901/14377)
remote: Counting objects: 49% (7045/14377)
remote: Counting objects: 50% (7189/14377)
remote: Counting objects: 51% (7333/14377)
remote: Counting objects: 52% (7477/14377)
remote: Counting objects: 53% (7620/14377)
remote: Counting objects: 54% (7764/14377)
remote: Counting objects: 55% (7908/14377)
remote: Counting objects: 56% (8052/14377)
remote: Counting objects: 57% (8195/14377)
remote: Counting objects: 58% (8339/14377)
remote: Counting objects: 59% (8483/14377)
remote: Counting objects: 60% (8627/14377)
remote: Counting objects: 61% (8770/14377)
remote: Counting objects: 62% (8914/14377)
remote: Counting objects: 63% (9058/14377)
remote: Counting objects: 64% (9202/14377)
remote: Counting objects: 65% (9346/14377)
remote: Counting objects: 66% (9489/14377)
remote: Counting objects: 67% (9633/14377)
remote: Counting objects: 68% (9777/14377)
remote: Counting objects: 69% (9921/14377)
remote: Counting objects: 70% (10064/14377)
remote: Counting objects: 71% (10208/14377)
remote: Counting objects: 72% (10352/14377)
remote: Counting objects: 73% (10496/14377)
remote: Counting objects: 74% (10639/14377)
remote: Counting objects: 75% (10783/14377)
remote: Counting objects: 76% (10927/14377)
remote: Counting objects: 77% (11071/14377)
remote: Counting objects: 78% (11215/14377)
remote: Counting objects: 79% (11358/14377)
remote: Counting objects: 80% (11502/14377)
remote: Counting objects: 81% (11646/14377)
remote: Counting objects: 82% (11790/14377)
remote: Counting objects: 83% (11933/14377)
remote: Counting objects: 84% (12077/14377)
remote: Counting objects: 85% (12221/14377)
remote: Counting objects: 86% (12365/14377)
remote: Counting objects: 87% (12508/14377)
remote: Counting objects: 88% (12652/14377)
remote: Counting objects: 89% (12796/14377)
remote: Counting objects: 90% (12940/14377)
remote: Counting objects: 91% (13084/14377)
remote: Counting objects: 92% (13227/14377)
remote: Counting objects: 93% (13371/14377)
remote: Counting objects: 94% (13515/14377)
remote: Counting objects: 95% (13659/14377)
remote: Counting objects: 96% (13802/14377)
remote: Counting objects: 97% (13946/14377)
remote: Counting objects: 98% (14090/14377)
remote: Counting objects: 99% (14234/14377)
remote: Counting objects: 100% (14377/14377)
remote: Counting objects: 100% (14377/14377), done.
5.10 s
remote: Compressing objects: 0% (1/3260)
remote: Compressing objects: 1% (33/3260)
remote: Compressing objects: 2% (66/3260)
remote: Compressing objects: 3% (98/3260)
remote: Compressing objects: 4% (131/3260)
remote: Compressing objects: 5% (163/3260)
remote: Compressing objects: 6% (196/3260)
remote: Compressing objects: 7% (229/3260)
remote: Compressing objects: 8% (261/3260)
remote: Compressing objects: 9% (294/3260)
remote: Compressing objects: 10% (326/3260)
remote: Compressing objects: 11% (359/3260)
remote: Compressing objects: 12% (392/3260)
remote: Compressing objects: 13% (424/3260)
remote: Compressing objects: 14% (457/3260)
remote: Compressing objects: 15% (489/3260)
remote: Compressing objects: 16% (522/3260)
remote: Compressing objects: 17% (555/3260)
remote: Compressing objects: 18% (587/3260)
remote: Compressing objects: 19% (620/3260)
remote: Compressing objects: 20% (652/3260)
remote: Compressing objects: 21% (685/3260)
remote: Compressing objects: 22% (718/3260)
remote: Compressing objects: 23% (750/3260)
remote: Compressing objects: 24% (783/3260)
remote: Compressing objects: 24% (814/3260)
remote: Compressing objects: 25% (815/3260)
remote: Compressing objects: 26% (848/3260)
remote: Compressing objects: 27% (881/3260)
remote: Compressing objects: 27% (894/3260)
remote: Compressing objects: 28% (913/3260)
remote: Compressing objects: 29% (946/3260)
remote: Compressing objects: 30% (978/3260)
remote: Compressing objects: 31% (1011/3260)
remote: Compressing objects: 32% (1044/3260)
remote: Compressing objects: 33% (1076/3260)
remote: Compressing objects: 34% (1109/3260)
remote: Compressing objects: 35% (1141/3260)
remote: Compressing objects: 36% (1174/3260)
remote: Compressing objects: 36% (1194/3260)
remote: Compressing objects: 37% (1207/3260)
remote: Compressing objects: 38% (1239/3260)
remote: Compressing objects: 39% (1272/3260)
remote: Compressing objects: 40% (1304/3260)
remote: Compressing objects: 41% (1337/3260)
remote: Compressing objects: 42% (1370/3260)
remote: Compressing objects: 43% (1402/3260)
remote: Compressing objects: 44% (1435/3260)
remote: Compressing objects: 45% (1467/3260)
remote: Compressing objects: 46% (1500/3260)
remote: Compressing objects: 47% (1533/3260)
remote: Compressing objects: 48% (1565/3260)
remote: Compressing objects: 49% (1598/3260)
remote: Compressing objects: 50% (1630/3260)
remote: Compressing objects: 51% (1663/3260)
remote: Compressing objects: 52% (1696/3260)
remote: Compressing objects: 53% (1728/3260)
remote: Compressing objects: 54% (1761/3260)
remote: Compressing objects: 55% (1793/3260)
remote: Compressing objects: 56% (1826/3260)
remote: Compressing objects: 57% (1859/3260)
remote: Compressing objects: 58% (1891/3260)
remote: Compressing objects: 59% (1924/3260)
remote: Compressing objects: 60% (1956/3260)
remote: Compressing objects: 61% (1989/3260)
remote: Compressing objects: 62% (2022/3260)
remote: Compressing objects: 63% (2054/3260)
remote: Compressing objects: 64% (2087/3260)
remote: Compressing objects: 65% (2119/3260)
remote: Compressing objects: 66% (2152/3260)
remote: Compressing objects: 67% (2185/3260)
remote: Compressing objects: 68% (2217/3260)
remote: Compressing objects: 69% (2250/3260)
remote: Compressing objects: 70% (2282/3260)
remote: Compressing objects: 71% (2315/3260)
remote: Compressing objects: 72% (2348/3260)
remote: Compressing objects: 73% (2380/3260)
remote: Compressing objects: 74% (2413/3260)
remote: Compressing objects: 75% (2445/3260)
remote: Compressing objects: 76% (2478/3260)
remote: Compressing objects: 77% (2511/3260)
remote: Compressing objects: 78% (2543/3260)
remote: Compressing objects: 79% (2576/3260)
remote: Compressing objects: 80% (2608/3260)
remote: Compressing objects: 81% (2641/3260)
remote: Compressing objects: 82% (2674/3260)
remote: Compressing objects: 83% (2706/3260)
remote: Compressing objects: 84% (2739/3260)
remote: Compressing objects: 85% (2771/3260)
remote: Compressing objects: 86% (2804/3260)
remote: Compressing objects: 87% (2837/3260)
remote: Compressing objects: 88% (2869/3260)
remote: Compressing objects: 89% (2902/3260)
remote: Compressing objects: 90% (2934/3260)
remote: Compressing objects: 91% (2967/3260)
remote: Compressing objects: 92% (3000/3260)
remote: Compressing objects: 93% (3032/3260)
remote: Compressing objects: 94% (3065/3260)
remote: Compressing objects: 95% (3097/3260)
remote: Compressing objects: 96% (3130/3260)
remote: Compressing objects: 97% (3163/3260)
remote: Compressing objects: 98% (3195/3260)
remote: Compressing objects: 99% (3228/3260)
remote: Compressing objects: 100% (3260/3260)
remote: Compressing objects: 100% (3260/3260), done.
8.77 s
Receiving objects: 0% (1/78252)
Receiving objects: 1% (783/78252)
Receiving objects: 2% (1566/78252)
Receiving objects: 3% (2348/78252)
Receiving objects: 4% (3131/78252)
Receiving objects: 5% (3913/78252)
Receiving objects: 6% (4696/78252)
Receiving objects: 7% (5478/78252)
Receiving objects: 8% (6261/78252)
Receiving objects: 9% (7043/78252)
Receiving objects: 10% (7826/78252), 12.50 MiB | 24.98 MiB/s
Receiving objects: 11% (8608/78252), 12.50 MiB | 24.98 MiB/s
Receiving objects: 12% (9391/78252), 12.50 MiB | 24.98 MiB/s
Receiving objects: 13% (10173/78252), 12.50 MiB | 24.98 MiB/s
Receiving objects: 14% (10956/78252), 12.50 MiB | 24.98 MiB/s
Receiving objects: 15% (11738/78252), 12.50 MiB | 24.98 MiB/s
Receiving objects: 16% (12521/78252), 12.50 MiB | 24.98 MiB/s
Receiving objects: 17% (13303/78252), 12.50 MiB | 24.98 MiB/s
Receiving objects: 18% (14086/78252), 12.50 MiB | 24.98 MiB/s
Receiving objects: 19% (14868/78252), 12.50 MiB | 24.98 MiB/s
Receiving objects: 20% (15651/78252), 12.50 MiB | 24.98 MiB/s
Receiving objects: 21% (16433/78252), 12.50 MiB | 24.98 MiB/s
Receiving objects: 22% (17216/78252), 12.50 MiB | 24.98 MiB/s
Receiving objects: 23% (17998/78252), 12.50 MiB | 24.98 MiB/s
Receiving objects: 24% (18781/78252), 12.50 MiB | 24.98 MiB/s
Receiving objects: 25% (19563/78252), 12.50 MiB | 24.98 MiB/s
Receiving objects: 26% (20346/78252), 12.50 MiB | 24.98 MiB/s
Receiving objects: 27% (21129/78252), 12.50 MiB | 24.98 MiB/s
Receiving objects: 28% (21911/78252), 12.50 MiB | 24.98 MiB/s
Receiving objects: 29% (22694/78252), 12.50 MiB | 24.98 MiB/s
Receiving objects: 30% (23476/78252), 12.50 MiB | 24.98 MiB/s
Receiving objects: 31% (24259/78252), 12.50 MiB | 24.98 MiB/s
Receiving objects: 32% (25041/78252), 12.50 MiB | 24.98 MiB/s
Receiving objects: 33% (25824/78252), 12.50 MiB | 24.98 MiB/s
Receiving objects: 34% (26606/78252), 12.50 MiB | 24.98 MiB/s
Receiving objects: 35% (27389/78252), 12.50 MiB | 24.98 MiB/s
Receiving objects: 36% (28171/78252), 12.50 MiB | 24.98 MiB/s
Receiving objects: 37% (28954/78252), 12.50 MiB | 24.98 MiB/s
Receiving objects: 38% (29736/78252), 12.50 MiB | 24.98 MiB/s
Receiving objects: 39% (30519/78252), 12.50 MiB | 24.98 MiB/s
Receiving objects: 40% (31301/78252), 12.50 MiB | 24.98 MiB/s
Receiving objects: 41% (32084/78252), 12.50 MiB | 24.98 MiB/s
Receiving objects: 41% (32625/78252), 30.47 MiB | 30.46 MiB/s
Receiving objects: 42% (32866/78252), 30.47 MiB | 30.46 MiB/s
Receiving objects: 43% (33649/78252), 30.47 MiB | 30.46 MiB/s
Receiving objects: 44% (34431/78252), 30.47 MiB | 30.46 MiB/s
Receiving objects: 45% (35214/78252), 30.47 MiB | 30.46 MiB/s
Receiving objects: 46% (35996/78252), 30.47 MiB | 30.46 MiB/s
Receiving objects: 47% (36779/78252), 30.47 MiB | 30.46 MiB/s
Receiving objects: 48% (37561/78252), 30.47 MiB | 30.46 MiB/s
Receiving objects: 49% (38344/78252), 30.47 MiB | 30.46 MiB/s
Receiving objects: 50% (39126/78252), 30.47 MiB | 30.46 MiB/s
Receiving objects: 51% (39909/78252), 46.86 MiB | 31.17 MiB/s
Receiving objects: 52% (40692/78252), 46.86 MiB | 31.17 MiB/s
Receiving objects: 53% (41474/78252), 46.86 MiB | 31.17 MiB/s
Receiving objects: 54% (42257/78252), 46.86 MiB | 31.17 MiB/s
Receiving objects: 55% (43039/78252), 46.86 MiB | 31.17 MiB/s
Receiving objects: 56% (43822/78252), 46.86 MiB | 31.17 MiB/s
Receiving objects: 57% (44604/78252), 46.86 MiB | 31.17 MiB/s
Receiving objects: 58% (45387/78252), 46.86 MiB | 31.17 MiB/s
Receiving objects: 59% (46169/78252), 46.86 MiB | 31.17 MiB/s
Receiving objects: 60% (46952/78252), 46.86 MiB | 31.17 MiB/s
Receiving objects: 61% (47734/78252), 46.86 MiB | 31.17 MiB/s
Receiving objects: 62% (48517/78252), 46.86 MiB | 31.17 MiB/s
Receiving objects: 62% (48717/78252), 64.50 MiB | 31.84 MiB/s
Receiving objects: 63% (49299/78252), 64.50 MiB | 31.84 MiB/s
Receiving objects: 64% (50082/78252), 64.50 MiB | 31.84 MiB/s
Receiving objects: 65% (50864/78252), 64.50 MiB | 31.84 MiB/s
Receiving objects: 66% (51647/78252), 64.50 MiB | 31.84 MiB/s
Receiving objects: 67% (52429/78252), 64.50 MiB | 31.84 MiB/s
Receiving objects: 68% (53212/78252), 64.50 MiB | 31.84 MiB/s
Receiving objects: 69% (53994/78252), 64.50 MiB | 31.84 MiB/s
Receiving objects: 70% (54777/78252), 64.50 MiB | 31.84 MiB/s
Receiving objects: 71% (55559/78252), 64.50 MiB | 31.84 MiB/s
Receiving objects: 72% (56342/78252), 64.50 MiB | 31.84 MiB/s
Receiving objects: 73% (57124/78252), 82.42 MiB | 32.63 MiB/s
Receiving objects: 74% (57907/78252), 82.42 MiB | 32.63 MiB/s
Receiving objects: 75% (58689/78252), 82.42 MiB | 32.63 MiB/s
Receiving objects: 76% (59472/78252), 82.42 MiB | 32.63 MiB/s
Receiving objects: 77% (60255/78252), 82.42 MiB | 32.63 MiB/s
Receiving objects: 78% (61037/78252), 82.42 MiB | 32.63 MiB/s
Receiving objects: 79% (61820/78252), 82.42 MiB | 32.63 MiB/s
Receiving objects: 79% (62509/78252), 82.42 MiB | 32.63 MiB/s
Receiving objects: 80% (62602/78252), 82.42 MiB | 32.63 MiB/s
Receiving objects: 81% (63385/78252), 99.48 MiB | 32.88 MiB/s
Receiving objects: 82% (64167/78252), 99.48 MiB | 32.88 MiB/s
Receiving objects: 83% (64950/78252), 99.48 MiB | 32.88 MiB/s
Receiving objects: 84% (65732/78252), 99.48 MiB | 32.88 MiB/s
Receiving objects: 85% (66515/78252), 99.48 MiB | 32.88 MiB/s
Receiving objects: 86% (67297/78252), 99.48 MiB | 32.88 MiB/s
Receiving objects: 87% (68080/78252), 99.48 MiB | 32.88 MiB/s
Receiving objects: 88% (68862/78252), 99.48 MiB | 32.88 MiB/s
Receiving objects: 89% (69645/78252), 99.48 MiB | 32.88 MiB/s
Receiving objects: 90% (70427/78252), 99.48 MiB | 32.88 MiB/s
Receiving objects: 91% (71210/78252), 99.48 MiB | 32.88 MiB/s
Receiving objects: 92% (71992/78252), 99.48 MiB | 32.88 MiB/s
Receiving objects: 93% (72775/78252), 99.48 MiB | 32.88 MiB/s
Receiving objects: 94% (73557/78252), 117.17 MiB | 33.21 MiB/s
Receiving objects: 95% (74340/78252), 117.17 MiB | 33.21 MiB/s
Receiving objects: 96% (75122/78252), 117.17 MiB | 33.21 MiB/s
Receiving objects: 97% (75905/78252), 117.17 MiB | 33.21 MiB/s
Receiving objects: 98% (76687/78252), 117.17 MiB | 33.21 MiB/s
Receiving objects: 99% (77470/78252), 117.17 MiB | 33.21 MiB/s
remote: Total 78252 (delta 10129), reused 12101 (delta 9019), pack-reused 63875 (from 2)
8.77 s
Receiving objects: 100% (78252/78252), 117.17 MiB | 33.21 MiB/s
Receiving objects: 100% (78252/78252), 122.17 MiB | 33.31 MiB/s, done.
9.56 s
Resolving deltas: 0% (0/53215)
Resolving deltas: 1% (533/53215)
Resolving deltas: 2% (1065/53215)
Resolving deltas: 3% (1597/53215)
Resolving deltas: 4% (2130/53215)
Resolving deltas: 5% (2661/53215)
Resolving deltas: 6% (3193/53215)
Resolving deltas: 7% (3726/53215)
Resolving deltas: 8% (4258/53215)
Resolving deltas: 9% (4790/53215)
Resolving deltas: 10% (5322/53215)
Resolving deltas: 11% (5855/53215)
Resolving deltas: 12% (6386/53215)
Resolving deltas: 13% (6918/53215)
Resolving deltas: 14% (7453/53215)
Resolving deltas: 15% (7983/53215)
Resolving deltas: 16% (8515/53215)
Resolving deltas: 17% (9047/53215)
Resolving deltas: 18% (9579/53215)
Resolving deltas: 19% (10111/53215)
Resolving deltas: 20% (10643/53215)
Resolving deltas: 21% (11177/53215)
Resolving deltas: 22% (11708/53215)
Resolving deltas: 23% (12240/53215)
Resolving deltas: 24% (12772/53215)
Resolving deltas: 25% (13304/53215)
Resolving deltas: 26% (13836/53215)
Resolving deltas: 27% (14370/53215)
Resolving deltas: 28% (14901/53215)
Resolving deltas: 29% (15434/53215)
Resolving deltas: 30% (15965/53215)
Resolving deltas: 31% (16497/53215)
Resolving deltas: 32% (17029/53215)
Resolving deltas: 33% (17561/53215)
Resolving deltas: 34% (18096/53215)
Resolving deltas: 35% (18626/53215)
Resolving deltas: 36% (19158/53215)
Resolving deltas: 37% (19693/53215)
Resolving deltas: 38% (20222/53215)
Resolving deltas: 39% (20754/53215)
Resolving deltas: 40% (21287/53215)
Resolving deltas: 41% (21821/53215)
Resolving deltas: 42% (22351/53215)
Resolving deltas: 43% (22883/53215)
Resolving deltas: 44% (23415/53215)
Resolving deltas: 45% (23947/53215)
Resolving deltas: 46% (24480/53215)
Resolving deltas: 47% (25012/53215)
Resolving deltas: 48% (25544/53215)
Resolving deltas: 49% (26076/53215)
Resolving deltas: 50% (26608/53215)
Resolving deltas: 51% (27142/53215)
Resolving deltas: 52% (27672/53215)
Resolving deltas: 53% (28204/53215)
Resolving deltas: 54% (28737/53215)
Resolving deltas: 55% (29269/53215)
Resolving deltas: 56% (29801/53215)
Resolving deltas: 57% (30333/53215)
Resolving deltas: 58% (30865/53215)
Resolving deltas: 59% (31397/53215)
Resolving deltas: 60% (31929/53215)
Resolving deltas: 61% (32463/53215)
Resolving deltas: 62% (32995/53215)
Resolving deltas: 63% (33526/53215)
Resolving deltas: 64% (34060/53215)
Resolving deltas: 65% (34590/53215)
Resolving deltas: 66% (35122/53215)
Resolving deltas: 67% (35655/53215)
Resolving deltas: 68% (36187/53215)
Resolving deltas: 69% (36719/53215)
Resolving deltas: 70% (37251/53215)
Resolving deltas: 71% (37783/53215)
Resolving deltas: 72% (38315/53215)
Resolving deltas: 73% (38848/53215)
Resolving deltas: 74% (39380/53215)
Resolving deltas: 75% (39913/53215)
Resolving deltas: 76% (40445/53215)
Resolving deltas: 77% (40976/53215)
Resolving deltas: 78% (41508/53215)
Resolving deltas: 79% (42040/53215)
Resolving deltas: 80% (42572/53215)
Resolving deltas: 81% (43105/53215)
Resolving deltas: 82% (43637/53215)
Resolving deltas: 83% (44169/53215)
Resolving deltas: 84% (44701/53215)
Resolving deltas: 85% (45233/53215)
Resolving deltas: 86% (45765/53215)
Resolving deltas: 87% (46298/53215)
Resolving deltas: 88% (46830/53215)
Resolving deltas: 89% (47362/53215)
Resolving deltas: 90% (47896/53215)
Resolving deltas: 91% (48426/53215)
Resolving deltas: 92% (48960/53215)
Resolving deltas: 93% (49491/53215)
Resolving deltas: 94% (50023/53215)
Resolving deltas: 95% (50555/53215)
Resolving deltas: 96% (51090/53215)
Resolving deltas: 97% (51619/53215)
Resolving deltas: 98% (52151/53215)
Resolving deltas: 99% (52683/53215)
Resolving deltas: 100% (53215/53215)
Resolving deltas: 100% (53215/53215), done.
9.84 s
Fetching commit bac4ee69535bb90006e6528450f950aef795f67f for push-vrpyqyylypmw ...
9.84 s
$ /nix/store/bcnisk3ydfgv26v2gw3zlky24g00yww2-git-2.54.0/bin/git fetch origin bac4ee69535bb90006e6528450f950aef795f67f
10.33 s
From https://github.com/alphal00p/gammaloop
10.33 s
* branch bac4ee69535bb90006e6528450f950aef795f67f -> FETCH_HEAD
10.34 s
$ /nix/store/9ypz3flqsrl5xl495mm8h645gadjsxi1-coreutils-9.11/bin/timeout --kill-after=15s 7200s /nix/store/bcnisk3ydfgv26v2gw3zlky24g00yww2-git-2.54.0/bin/git -c advice.detachedHead=false checkout bac4ee69535bb90006e6528450f950aef795f67f
10.53 s
HEAD is now at bac4ee695 mirror Linnest and Kurvst standalone packages
10.54 s
$ /nix/store/9ypz3flqsrl5xl495mm8h645gadjsxi1-coreutils-9.11/bin/timeout --kill-after=15s 7200s /nix/store/23zk8sgzamrbmj1fday15szf7f2279s8-nix-2.34.7/bin/nix --extra-experimental-features nix-command --extra-experimental-features flakes --log-format internal-json run .#packages.x86_64-linux.nix-ci-check-gammaloop-nextest-docs --print-build-logs
14.76 s
14.91 s
Downloading cached gammaloop-nextest-binaries-docs-alphal00p-docs-builder from https://cache.nix-ci.com
14.91 s
Downloading cached gammaloop-nextest-binaries-docs-alphal00p-docs-catalogs from https://cache.nix-ci.com
14.91 s
Downloading cached gammaloop-nextest-binaries-docs-alphal00p-docs-examples from https://cache.nix-ci.com
14.91 s
Downloading cached gammaloop-nextest-binaries-docs-alphal00p-docs-macros from https://cache.nix-ci.com
14.91 s
Downloading cached gammaloop-nextest-binaries-docs-alphal00p-docs-python-exporter from https://cache.nix-ci.com
14.91 s
Downloading cached gammaloop-nextest-binaries-docs-alphal00p-docs-schema from https://cache.nix-ci.com
15.22 s
Downloaded cached gammaloop-nextest-binaries-docs-alphal00p-docs-python-exporter (1.8 MiB) in 304ms
15.22 s
Progress: 0 of 1 built, 1 of 8 downloaded from cache (5 downloading)
15.25 s
Downloaded cached gammaloop-nextest-binaries-docs-alphal00p-docs-schema (2 MiB) in 337ms
15.25 s
Progress: 0 of 1 built, 2 of 8 downloaded from cache (4 downloading)
15.27 s
Downloaded cached gammaloop-nextest-binaries-docs-alphal00p-docs-catalogs (2.4 MiB) in 356ms
15.27 s
Progress: 0 of 1 built, 3 of 8 downloaded from cache (3 downloading)
15.32 s
Downloaded cached gammaloop-nextest-binaries-docs-alphal00p-docs-macros (3.3 MiB) in 409ms
15.32 s
Progress: 0 of 1 built, 4 of 8 downloaded from cache (2 downloading)
15.37 s
Downloaded cached gammaloop-nextest-binaries-docs-alphal00p-docs-builder (4.4 MiB) in 460ms
15.37 s
Progress: 0 of 1 built, 5 of 8 downloaded from cache (1 downloading)
15.49 s
Downloaded cached gammaloop-nextest-binaries-docs-alphal00p-docs-examples (9.3 MiB) in 575ms
15.49 s
Progress: 0 of 1 built, 6 of 8 downloaded from cache
15.49 s
Downloading cached gammaloop-nextest-binaries-docs from https://cache.nix-ci.com
15.53 s
Downloaded cached gammaloop-nextest-binaries-docs (2472 B) in 38ms
15.53 s
Progress: 0 of 1 built, 7 of 8 downloaded from cache
15.53 s
Downloading cached nix-ci-check-gammaloop-nextest-docs from https://cache.nix-ci.com
15.57 s
Downloaded cached nix-ci-check-gammaloop-nextest-docs (1016 B) in 39ms
15.57 s
Progress: 0 of 1 built, 8 of 8 downloaded from cache
20.88 s
evaluating derivation 'g
copying '/nix/store/a336
evaluating derivation 'g
copying '/nix/store/a336
evaluating derivation 'g
copying '/nix/store/a336
evaluating derivation 'g
copying '/nix/store/a336
evaluating derivation 'g
copying '/nix/store/a336
evaluating derivation 'g
querying gammaloop-nexte
[0.0 KiB DL] querying in
[1.1 KiB DL] querying in
[1.7 KiB DL] querying la
[3.9 KiB DL] querying la
[0 /3 built, 2 /0 /7 copied
[0 /3 built, 1 /1 /7 copied
[0 /3 built, 2 /2 /7 copied
[0 /3 built, 2 /3 /7 copied
[0 /3 built, 1 /6 /7 copiedpython3> structuredAttrs is enabled
20.95 s
[1 /0 /2 built, 7 copied (python3> created 227 symlinks in user environment
21.71 s
python3 (post)> Uploading to the NixCI cache: /nix/store/3gi2x25n327sf3xma8b08jd57aqv69x5-python3-3.13.14-env
21.74 s
python3 (post)> warning: 'warn-short-path-literals' is deprecated, use 'lint-short-path-literals = ignore' instead
21.88 s
python3 (post)> copying 0 paths...
21.92 s
python3 (post)> warning: 'warn-short-path-literals' is deprecated, use 'lint-short-path-literals = ignore' instead
22.16 s
python3 (post)> copying 0 paths...
22.48 s
[1 /3 built, 7 copied (21
[1 /1 /2 built, 7 copied (gammaloop-nextest-docs> Extracting 2 binaries to /build/source
22.52 s
gammaloop-nextest-docs> Extracted 5 files to /build/source in 0.04s
22.53 s
gammaloop-nextest-docs> ------------
22.53 s
gammaloop-nextest-docs> Nextest run ID 41c799f1-b79a-47d1-9384-6804f8337feb with nextest profile: ci_gammaloop
22.53 s
gammaloop-nextest-docs> Starting 111 tests across 2 binaries
22.61 s
gammaloop-nextest-docs> FAIL [ 0.081s] ( 73/111) alphal00p-docs-builder tests :: checked_in_registry_is_valid
22.61 s
gammaloop-nextest-docs> stdout ---
22.61 s
gammaloop-nextest-docs>
22.61 s
gammaloop-nextest-docs> running 1 test
22.61 s
gammaloop-nextest-docs> test tests::checked_in_registry_is_valid ... FAILED
22.61 s
gammaloop-nextest-docs>
22.61 s
gammaloop-nextest-docs> failures:
22.61 s
gammaloop-nextest-docs>
22.61 s
gammaloop-nextest-docs> failures:
22.61 s
gammaloop-nextest-docs> tests::checked_in_registry_is_valid
22.61 s
gammaloop-nextest-docs>
22.61 s
gammaloop-nextest-docs> test result: FAILED. 0 passed; 1 failed; 0 ignored; 0 measured; 110 filtered out; finished in 0.08s
22.61 s
gammaloop-nextest-docs>
22.61 s
gammaloop-nextest-docs> stderr ---
22.61 s
gammaloop-nextest-docs> warning: developer note gammaloop-architecture still requires a named owner
22.61 s
gammaloop-nextest-docs> warning: developer note integration-dashboard still requires a named owner
22.61 s
gammaloop-nextest-docs> warning: developer note uv-renormalization still requires a named owner
22.61 s
gammaloop-nextest-docs> warning: developer note spenso-parsing-flow still requires a named owner
22.61 s
gammaloop-nextest-docs> warning: developer note schoonschip-network still requires a named owner
22.61 s
gammaloop-nextest-docs> warning: developer note gammaloop-draw-style-migration still requires a named owner
22.61 s
gammaloop-nextest-docs> warning: developer note gammaloop-drawing-architecture still requires a named owner
22.61 s
gammaloop-nextest-docs> warning: developer note spenso-symbolica-syntax-and-rewrites still requires a named owner
22.61 s
gammaloop-nextest-docs> warning: developer note spenso-architecture still requires a named owner
22.61 s
gammaloop-nextest-docs> warning: developer note idenso-architecture still requires a named owner
22.61 s
gammaloop-nextest-docs> warning: developer note idenso-form-color-dirac-source-map still requires a named owner
22.61 s
gammaloop-nextest-docs> warning: developer note linnet-architecture still requires a named owner
22.61 s
gammaloop-nextest-docs> warning: developer note vakint-architecture still requires a named owner
22.61 s
gammaloop-nextest-docs> warning: developer note gammaloop-roadmap still requires a named owner
22.61 s
gammaloop-nextest-docs> warning: developer note cff-surface-cache-ownership still requires a named owner
22.61 s
gammaloop-nextest-docs> warning: developer note gammaloop-drawing-evaluated-fields-history still requires a named owner
22.61 s
gammaloop-nextest-docs> warning: archived developer note gammaloop-drawing-evaluated-fields-history has no immutable evidence revision
22.61 s
gammaloop-nextest-docs> warning: developer note bnl-benchmark-investigation still requires a named owner
22.61 s
gammaloop-nextest-docs> warning: developer note bnl-contraction-order-performance still requires a named owner
22.61 s
gammaloop-nextest-docs> warning: developer note bnl-scalar-alias-capture still requires a named owner
22.61 s
gammaloop-nextest-docs> warning: developer note aa-aa-three-loop-performance-smoke still requires a named owner
22.61 s
gammaloop-nextest-docs> warning: developer note network-simplification still requires a named owner
22.61 s
gammaloop-nextest-docs> warning: investigation developer note network-simplification has no immutable evidence revision
22.61 s
gammaloop-nextest-docs> warning: developer note spenso-large-expressions still requires a named owner
22.61 s
gammaloop-nextest-docs> warning: developer note spenso-improvement-effects still requires a named owner
22.61 s
gammaloop-nextest-docs> warning: archived developer note spenso-improvement-effects has no immutable evidence revision
22.61 s
gammaloop-nextest-docs> warning: developer note spenso-test-baseline still requires a named owner
22.61 s
gammaloop-nextest-docs> warning: archived developer note spenso-test-baseline has no immutable evidence revision
22.61 s
gammaloop-nextest-docs> warning: developer note bnl-evaluator-atom-capture still requires a named owner
22.61 s
gammaloop-nextest-docs> warning: archived developer note bnl-evaluator-atom-capture has no immutable evidence revision
22.61 s
gammaloop-nextest-docs> warning: developer note uv-scalar-profile-benchmark still requires a named owner
22.61 s
gammaloop-nextest-docs> warning: archived developer note uv-scalar-profile-benchmark has no immutable evidence revision
22.61 s
gammaloop-nextest-docs> warning: developer note ci-test-failure-summary-2026-03-25 still requires a named owner
22.61 s
gammaloop-nextest-docs> warning: archived developer note ci-test-failure-summary-2026-03-25 has no immutable evidence revision
22.61 s
gammaloop-nextest-docs> warning: developer note network-execution-rebase-record still requires a named owner
22.61 s
gammaloop-nextest-docs> warning: archived developer note network-execution-rebase-record has no immutable evidence revision
22.61 s
gammaloop-nextest-docs> warning: developer note ratatui-integration-dashboard-history still requires a named owner
22.61 s
gammaloop-nextest-docs> warning: archived developer note ratatui-integration-dashboard-history has no immutable evidence revision
22.61 s
gammaloop-nextest-docs> warning: developer note nix-crane-cache-reuse still requires a named owner
22.61 s
gammaloop-nextest-docs>
22.61 s
gammaloop-nextest-docs> thread 'tests::checked_in_registry_is_valid' (174) panicked at crates/alphal00p-docs-builder/src/lib.rs:11887:50:
22.61 s
gammaloop-nextest-docs> called `Result::unwrap()` on an `Err` value: developer note nix-crane-cache-reuse verified scope flake.nix changed (expected 188504937418859942a6770ca21a4f4e0a7ff125, found 17dc35393f0f0abd5cb31c7eaf1fdc9aa6903ce4); owner review or an explicit no-impact attestation is required
22.61 s
gammaloop-nextest-docs>
22.61 s
gammaloop-nextest-docs> Location:
22.61 s
gammaloop-nextest-docs> crates/alphal00p-docs-builder/src/lib.rs:889:21
22.61 s
gammaloop-nextest-docs> stack backtrace:
22.61 s
gammaloop-nextest-docs> 0: __rustc::rust_begin_unwind
22.61 s
gammaloop-nextest-docs> 1: core::panicking::panic_fmt
22.61 s
gammaloop-nextest-docs> 2: core::result::unwrap_failed
22.61 s
gammaloop-nextest-docs> 3: alphal00p_docs_builder::tests::checked_in_registry_is_valid
22.61 s
gammaloop-nextest-docs> 4: <alphal00p_docs_builder::tests::checked_in_registry_is_valid::{closure#0} as core::ops::function::FnOnce<()>>::call_once
22.61 s
gammaloop-nextest-docs> note: Some details are omitted, run with `RUST_BACKTRACE=full` for a verbose backtrace.
22.61 s
gammaloop-nextest-docs>
22.62 s
gammaloop-nextest-docs> FAIL [ 0.076s] ( 82/111) alphal00p-docs-builder tests :: every_product_requires_a_task_chooser_and_each_supported_interface
22.62 s
gammaloop-nextest-docs> stdout ---
22.62 s
gammaloop-nextest-docs>
22.62 s
gammaloop-nextest-docs> running 1 test
22.62 s
gammaloop-nextest-docs> test tests::every_product_requires_a_task_chooser_and_each_supported_interface ... FAILED
22.62 s
gammaloop-nextest-docs>
22.62 s
gammaloop-nextest-docs> failures:
22.62 s
gammaloop-nextest-docs>
22.62 s
gammaloop-nextest-docs> failures:
22.62 s
gammaloop-nextest-docs> tests::every_product_requires_a_task_chooser_and_each_supported_interface
22.62 s
gammaloop-nextest-docs>
22.62 s
gammaloop-nextest-docs> test result: FAILED. 0 passed; 1 failed; 0 ignored; 0 measured; 110 filtered out; finished in 0.07s
22.62 s
gammaloop-nextest-docs>
22.62 s
gammaloop-nextest-docs> stderr ---
22.62 s
gammaloop-nextest-docs> warning: developer note gammaloop-architecture still requires a named owner
22.62 s
gammaloop-nextest-docs> warning: developer note integration-dashboard still requires a named owner
22.62 s
gammaloop-nextest-docs> warning: developer note uv-renormalization still requires a named owner
22.62 s
gammaloop-nextest-docs> warning: developer note spenso-parsing-flow still requires a named owner
22.62 s
gammaloop-nextest-docs> warning: developer note schoonschip-network still requires a named owner
22.62 s
gammaloop-nextest-docs> warning: developer note gammaloop-draw-style-migration still requires a named owner
22.62 s
gammaloop-nextest-docs> warning: developer note gammaloop-drawing-architecture still requires a named owner
22.62 s
gammaloop-nextest-docs> warning: developer note spenso-symbolica-syntax-and-rewrites still requires a named owner
22.62 s
gammaloop-nextest-docs> warning: developer note spenso-architecture still requires a named owner
22.62 s
gammaloop-nextest-docs> warning: developer note idenso-architecture still requires a named owner
22.62 s
gammaloop-nextest-docs> warning: developer note idenso-form-color-dirac-source-map still requires a named owner
22.62 s
gammaloop-nextest-docs> warning: developer note linnet-architecture still requires a named owner
22.62 s
gammaloop-nextest-docs> warning: developer note vakint-architecture still requires a named owner
22.62 s
gammaloop-nextest-docs> warning: developer note gammaloop-roadmap still requires a named owner
22.62 s
gammaloop-nextest-docs> warning: developer note cff-surface-cache-ownership still requires a named owner
22.62 s
gammaloop-nextest-docs> warning: developer note gammaloop-drawing-evaluated-fields-history still requires a named owner
22.62 s
gammaloop-nextest-docs> warning: archived developer note gammaloop-drawing-evaluated-fields-history has no immutable evidence revision
22.62 s
gammaloop-nextest-docs> warning: developer note bnl-benchmark-investigation still requires a named owner
22.62 s
gammaloop-nextest-docs> warning: developer note bnl-contraction-order-performance still requires a named owner
22.62 s
gammaloop-nextest-docs> warning: developer note bnl-scalar-alias-capture still requires a named owner
22.62 s
gammaloop-nextest-docs> warning: developer note aa-aa-three-loop-performance-smoke still requires a named owner
22.62 s
gammaloop-nextest-docs> warning: developer note network-simplification still requires a named owner
22.62 s
gammaloop-nextest-docs> warning: investigation developer note network-simplification has no immutable evidence revision
22.62 s
gammaloop-nextest-docs> warning: developer note spenso-large-expressions still requires a named owner
22.62 s
gammaloop-nextest-docs> warning: developer note spenso-improvement-effects still requires a named owner
22.62 s
gammaloop-nextest-docs> warning: archived developer note spenso-improvement-effects has no immutable evidence revision
22.62 s
gammaloop-nextest-docs> warning: developer note spenso-test-baseline still requires a named owner
22.62 s
gammaloop-nextest-docs> warning: archived developer note spenso-test-baseline has no immutable evidence revision
22.62 s
gammaloop-nextest-docs> warning: developer note bnl-evaluator-atom-capture still requires a named owner
22.62 s
gammaloop-nextest-docs> warning: archived developer note bnl-evaluator-atom-capture has no immutable evidence revision
22.62 s
gammaloop-nextest-docs> warning: developer note uv-scalar-profile-benchmark still requires a named owner
22.62 s
gammaloop-nextest-docs> warning: archived developer note uv-scalar-profile-benchmark has no immutable evidence revision
22.62 s
gammaloop-nextest-docs> warning: developer note ci-test-failure-summary-2026-03-25 still requires a named owner
22.62 s
gammaloop-nextest-docs> warning: archived developer note ci-test-failure-summary-2026-03-25 has no immutable evidence revision
22.62 s
gammaloop-nextest-docs> warning: developer note network-execution-rebase-record still requires a named owner
22.62 s
gammaloop-nextest-docs> warning: archived developer note network-execution-rebase-record has no immutable evidence revision
22.62 s
gammaloop-nextest-docs> warning: developer note ratatui-integration-dashboard-history still requires a named owner
22.62 s
gammaloop-nextest-docs> warning: archived developer note ratatui-integration-dashboard-history has no immutable evidence revision
22.62 s
gammaloop-nextest-docs> warning: developer note nix-crane-cache-reuse still requires a named owner
22.62 s
gammaloop-nextest-docs>
22.62 s
gammaloop-nextest-docs> thread 'tests::every_product_requires_a_task_chooser_and_each_supported_interface' (264) panicked at crates/alphal00p-docs-builder/src/lib.rs:11901:9:
22.62 s
gammaloop-nextest-docs> assertion failed: format!("{error:#}").contains("has no quickstart page")
22.62 s
gammaloop-nextest-docs> stack backtrace:
22.62 s
gammaloop-nextest-docs> 0: __rustc::rust_begin_unwind
22.62 s
gammaloop-nextest-docs> 1: core::panicking::panic_fmt
22.62 s
gammaloop-nextest-docs> 2: core::panicking::panic
22.62 s
gammaloop-nextest-docs> 3: alphal00p_docs_builder::tests::every_product_requires_a_task_chooser_and_each_supported_interface
22.62 s
gammaloop-nextest-docs> 4: <alphal00p_docs_builder::tests::every_product_requires_a_task_chooser_and_each_supported_interface::{closure#0} as core::ops::function::FnOnce<()>>::call_once
22.62 s
gammaloop-nextest-docs> note: Some details are omitted, run with `RUST_BACKTRACE=full` for a verbose backtrace.
22.62 s
gammaloop-nextest-docs>
22.63 s
gammaloop-nextest-docs> FAIL [ 0.067s] ( 93/111) alphal00p-docs-builder tests :: pdf_manual_chapter_order_must_match_the_page_registry
22.63 s
gammaloop-nextest-docs> stdout ---
22.63 s
gammaloop-nextest-docs>
22.63 s
gammaloop-nextest-docs> running 1 test
22.63 s
gammaloop-nextest-docs> test tests::pdf_manual_chapter_order_must_match_the_page_registry ... FAILED
22.63 s
gammaloop-nextest-docs>
22.63 s
gammaloop-nextest-docs> failures:
22.63 s
gammaloop-nextest-docs>
22.63 s
gammaloop-nextest-docs> failures:
22.63 s
gammaloop-nextest-docs> tests::pdf_manual_chapter_order_must_match_the_page_registry
22.63 s
gammaloop-nextest-docs>
22.63 s
gammaloop-nextest-docs> test result: FAILED. 0 passed; 1 failed; 0 ignored; 0 measured; 110 filtered out; finished in 0.06s
22.63 s
gammaloop-nextest-docs>
22.63 s
gammaloop-nextest-docs> stderr ---
22.63 s
gammaloop-nextest-docs> warning: developer note gammaloop-architecture still requires a named owner
22.63 s
gammaloop-nextest-docs> warning: developer note integration-dashboard still requires a named owner
22.63 s
gammaloop-nextest-docs> warning: developer note uv-renormalization still requires a named owner
22.63 s
gammaloop-nextest-docs> warning: developer note spenso-parsing-flow still requires a named owner
22.63 s
gammaloop-nextest-docs> warning: developer note schoonschip-network still requires a named owner
22.63 s
gammaloop-nextest-docs> warning: developer note gammaloop-draw-style-migration still requires a named owner
22.63 s
gammaloop-nextest-docs> warning: developer note gammaloop-drawing-architecture still requires a named owner
22.63 s
gammaloop-nextest-docs> warning: developer note spenso-symbolica-syntax-and-rewrites still requires a named owner
22.63 s
gammaloop-nextest-docs> warning: developer note spenso-architecture still requires a named owner
22.63 s
gammaloop-nextest-docs> warning: developer note idenso-architecture still requires a named owner
22.63 s
gammaloop-nextest-docs> warning: developer note idenso-form-color-dirac-source-map still requires a named owner
22.63 s
gammaloop-nextest-docs> warning: developer note linnet-architecture still requires a named owner
22.63 s
gammaloop-nextest-docs> warning: developer note vakint-architecture still requires a named owner
22.63 s
gammaloop-nextest-docs> warning: developer note gammaloop-roadmap still requires a named owner
22.63 s
gammaloop-nextest-docs> warning: developer note cff-surface-cache-ownership still requires a named owner
22.63 s
gammaloop-nextest-docs> warning: developer note gammaloop-drawing-evaluated-fields-history still requires a named owner
22.63 s
gammaloop-nextest-docs> warning: archived developer note gammaloop-drawing-evaluated-fields-history has no immutable evidence revision
22.63 s
gammaloop-nextest-docs> warning: developer note bnl-benchmark-investigation still requires a named owner
22.63 s
gammaloop-nextest-docs> warning: developer note bnl-contraction-order-performance still requires a named owner
22.63 s
gammaloop-nextest-docs> warning: developer note bnl-scalar-alias-capture still requires a named owner
22.63 s
gammaloop-nextest-docs> warning: developer note aa-aa-three-loop-performance-smoke still requires a named owner
22.63 s
gammaloop-nextest-docs> warning: developer note network-simplification still requires a named owner
22.63 s
gammaloop-nextest-docs> warning: investigation developer note network-simplification has no immutable evidence revision
22.63 s
gammaloop-nextest-docs> warning: developer note spenso-large-expressions still requires a named owner
22.63 s
gammaloop-nextest-docs> warning: developer note spenso-improvement-effects still requires a named owner
22.63 s
gammaloop-nextest-docs> warning: archived developer note spenso-improvement-effects has no immutable evidence revision
22.63 s
gammaloop-nextest-docs> warning: developer note spenso-test-baseline still requires a named owner
22.63 s
gammaloop-nextest-docs> warning: archived developer note spenso-test-baseline has no immutable evidence revision
22.63 s
gammaloop-nextest-docs> warning: developer note bnl-evaluator-atom-capture still requires a named owner
22.63 s
gammaloop-nextest-docs> warning: archived developer note bnl-evaluator-atom-capture has no immutable evidence revision
22.63 s
gammaloop-nextest-docs> warning: developer note uv-scalar-profile-benchmark still requires a named owner
22.63 s
gammaloop-nextest-docs> warning: archived developer note uv-scalar-profile-benchmark has no immutable evidence revision
22.63 s
gammaloop-nextest-docs> warning: developer note ci-test-failure-summary-2026-03-25 still requires a named owner
22.63 s
gammaloop-nextest-docs> warning: archived developer note ci-test-failure-summary-2026-03-25 has no immutable evidence revision
22.63 s
gammaloop-nextest-docs> warning: developer note network-execution-rebase-record still requires a named owner
22.63 s
gammaloop-nextest-docs> warning: archived developer note network-execution-rebase-record has no immutable evidence revision
22.63 s
gammaloop-nextest-docs> warning: developer note ratatui-integration-dashboard-history still requires a named owner
22.63 s
gammaloop-nextest-docs> warning: archived developer note ratatui-integration-dashboard-history has no immutable evidence revision
22.63 s
gammaloop-nextest-docs> warning: developer note nix-crane-cache-reuse still requires a named owner
22.63 s
gammaloop-nextest-docs>
22.63 s
gammaloop-nextest-docs> thread 'tests::pdf_manual_chapter_order_must_match_the_page_registry' (319) panicked at crates/alphal00p-docs-builder/src/lib.rs:11952:9:
22.63 s
gammaloop-nextest-docs> assertion failed: format!("{error:#}").contains("PDF manual chapter order differs")
22.63 s
gammaloop-nextest-docs> stack backtrace:
22.63 s
gammaloop-nextest-docs> 0: __rustc::rust_begin_unwind
22.63 s
gammaloop-nextest-docs> 1: core::panicking::panic_fmt
22.63 s
gammaloop-nextest-docs> 2: core::panicking::panic
22.63 s
gammaloop-nextest-docs> 3: alphal00p_docs_builder::tests::pdf_manual_chapter_order_must_match_the_page_registry
22.63 s
gammaloop-nextest-docs> 4: <alphal00p_docs_builder::tests::pdf_manual_chapter_order_must_match_the_page_registry::{closure#0} as core::ops::function::FnOnce<()>>::call_once
22.63 s
gammaloop-nextest-docs> note: Some details are omitted, run with `RUST_BACKTRACE=full` for a verbose backtrace.
22.63 s
gammaloop-nextest-docs>
34.51 s
gammaloop-nextest-docs> ------------
34.51 s
gammaloop-nextest-docs> Summary [ 11.979s] 111 tests run: 108 passed , 3 failed , 0 skipped
34.51 s
gammaloop-nextest-docs> FAIL [ 0.081s] ( 73/111) alphal00p-docs-builder tests :: checked_in_registry_is_valid
34.51 s
gammaloop-nextest-docs> stdout ---
34.51 s
gammaloop-nextest-docs>
34.51 s
gammaloop-nextest-docs> running 1 test
34.51 s
gammaloop-nextest-docs> test tests::checked_in_registry_is_valid ... FAILED
34.51 s
gammaloop-nextest-docs>
34.51 s
gammaloop-nextest-docs> failures:
34.51 s
gammaloop-nextest-docs>
34.51 s
gammaloop-nextest-docs> failures:
34.51 s
gammaloop-nextest-docs> tests::checked_in_registry_is_valid
34.51 s
gammaloop-nextest-docs>
34.51 s
gammaloop-nextest-docs> test result: FAILED. 0 passed; 1 failed; 0 ignored; 0 measured; 110 filtered out; finished in 0.08s
34.51 s
gammaloop-nextest-docs>
34.51 s
gammaloop-nextest-docs> stderr ---
34.51 s
gammaloop-nextest-docs> warning: developer note gammaloop-architecture still requires a named owner
34.51 s
gammaloop-nextest-docs> warning: developer note integration-dashboard still requires a named owner
34.51 s
gammaloop-nextest-docs> warning: developer note uv-renormalization still requires a named owner
34.51 s
gammaloop-nextest-docs> warning: developer note spenso-parsing-flow still requires a named owner
34.51 s
gammaloop-nextest-docs> warning: developer note schoonschip-network still requires a named owner
34.51 s
gammaloop-nextest-docs> warning: developer note gammaloop-draw-style-migration still requires a named owner
34.51 s
gammaloop-nextest-docs> warning: developer note gammaloop-drawing-architecture still requires a named owner
34.51 s
gammaloop-nextest-docs> warning: developer note spenso-symbolica-syntax-and-rewrites still requires a named owner
34.51 s
gammaloop-nextest-docs> warning: developer note spenso-architecture still requires a named owner
34.51 s
gammaloop-nextest-docs> warning: developer note idenso-architecture still requires a named owner
34.51 s
gammaloop-nextest-docs> warning: developer note idenso-form-color-dirac-source-map still requires a named owner
34.51 s
gammaloop-nextest-docs> warning: developer note linnet-architecture still requires a named owner
34.51 s
gammaloop-nextest-docs> warning: developer note vakint-architecture still requires a named owner
34.51 s
gammaloop-nextest-docs> warning: developer note gammaloop-roadmap still requires a named owner
34.51 s
gammaloop-nextest-docs> warning: developer note cff-surface-cache-ownership still requires a named owner
34.51 s
gammaloop-nextest-docs> warning: developer note gammaloop-drawing-evaluated-fields-history still requires a named owner
34.51 s
gammaloop-nextest-docs> warning: archived developer note gammaloop-drawing-evaluated-fields-history has no immutable evidence revision
34.51 s
gammaloop-nextest-docs> warning: developer note bnl-benchmark-investigation still requires a named owner
34.51 s
gammaloop-nextest-docs> warning: developer note bnl-contraction-order-performance still requires a named owner
34.51 s
gammaloop-nextest-docs> warning: developer note bnl-scalar-alias-capture still requires a named owner
34.51 s
gammaloop-nextest-docs> warning: developer note aa-aa-three-loop-performance-smoke still requires a named owner
34.51 s
gammaloop-nextest-docs> warning: developer note network-simplification still requires a named owner
34.51 s
gammaloop-nextest-docs> warning: investigation developer note network-simplification has no immutable evidence revision
34.51 s
gammaloop-nextest-docs> warning: developer note spenso-large-expressions still requires a named owner
34.51 s
gammaloop-nextest-docs> warning: developer note spenso-improvement-effects still requires a named owner
34.51 s
gammaloop-nextest-docs> warning: archived developer note spenso-improvement-effects has no immutable evidence revision
34.51 s
gammaloop-nextest-docs> warning: developer note spenso-test-baseline still requires a named owner
34.51 s
gammaloop-nextest-docs> warning: archived developer note spenso-test-baseline has no immutable evidence revision
34.51 s
gammaloop-nextest-docs> warning: developer note bnl-evaluator-atom-capture still requires a named owner
34.51 s
gammaloop-nextest-docs> warning: archived developer note bnl-evaluator-atom-capture has no immutable evidence revision
34.51 s
gammaloop-nextest-docs> warning: developer note uv-scalar-profile-benchmark still requires a named owner
34.51 s
gammaloop-nextest-docs> warning: archived developer note uv-scalar-profile-benchmark has no immutable evidence revision
34.51 s
gammaloop-nextest-docs> warning: developer note ci-test-failure-summary-2026-03-25 still requires a named owner
34.51 s
gammaloop-nextest-docs> warning: archived developer note ci-test-failure-summary-2026-03-25 has no immutable evidence revision
34.51 s
gammaloop-nextest-docs> warning: developer note network-execution-rebase-record still requires a named owner
34.51 s
gammaloop-nextest-docs> warning: archived developer note network-execution-rebase-record has no immutable evidence revision
34.51 s
gammaloop-nextest-docs> warning: developer note ratatui-integration-dashboard-history still requires a named owner
34.51 s
gammaloop-nextest-docs> warning: archived developer note ratatui-integration-dashboard-history has no immutable evidence revision
34.51 s
gammaloop-nextest-docs> warning: developer note nix-crane-cache-reuse still requires a named owner
34.51 s
gammaloop-nextest-docs>
34.51 s
gammaloop-nextest-docs> thread 'tests::checked_in_registry_is_valid' (174) panicked at crates/alphal00p-docs-builder/src/lib.rs:11887:50:
34.51 s
gammaloop-nextest-docs> called `Result::unwrap()` on an `Err` value: developer note nix-crane-cache-reuse verified scope flake.nix changed (expected 188504937418859942a6770ca21a4f4e0a7ff125, found 17dc35393f0f0abd5cb31c7eaf1fdc9aa6903ce4); owner review or an explicit no-impact attestation is required
34.51 s
gammaloop-nextest-docs>
34.51 s
gammaloop-nextest-docs> Location:
34.51 s
gammaloop-nextest-docs> crates/alphal00p-docs-builder/src/lib.rs:889:21
34.51 s
gammaloop-nextest-docs> stack backtrace:
34.51 s
gammaloop-nextest-docs> 0: __rustc::rust_begin_unwind
34.51 s
gammaloop-nextest-docs> 1: core::panicking::panic_fmt
34.51 s
gammaloop-nextest-docs> 2: core::result::unwrap_failed
34.51 s
gammaloop-nextest-docs> 3: alphal00p_docs_builder::tests::checked_in_registry_is_valid
34.51 s
gammaloop-nextest-docs> 4: <alphal00p_docs_builder::tests::checked_in_registry_is_valid::{closure#0} as core::ops::function::FnOnce<()>>::call_once
34.51 s
gammaloop-nextest-docs> note: Some details are omitted, run with `RUST_BACKTRACE=full` for a verbose backtrace.
34.51 s
gammaloop-nextest-docs>
34.51 s
gammaloop-nextest-docs> FAIL [ 0.076s] ( 82/111) alphal00p-docs-builder tests :: every_product_requires_a_task_chooser_and_each_supported_interface
34.51 s
gammaloop-nextest-docs> stdout ---
34.51 s
gammaloop-nextest-docs>
34.51 s
gammaloop-nextest-docs> running 1 test
34.51 s
gammaloop-nextest-docs> test tests::every_product_requires_a_task_chooser_and_each_supported_interface ... FAILED
34.51 s
gammaloop-nextest-docs>
34.51 s
gammaloop-nextest-docs> failures:
34.51 s
gammaloop-nextest-docs>
34.51 s
gammaloop-nextest-docs> failures:
34.51 s
gammaloop-nextest-docs> tests::every_product_requires_a_task_chooser_and_each_supported_interface
34.51 s
gammaloop-nextest-docs>
34.51 s
gammaloop-nextest-docs> test result: FAILED. 0 passed; 1 failed; 0 ignored; 0 measured; 110 filtered out; finished in 0.07s
34.51 s
gammaloop-nextest-docs>
34.51 s
gammaloop-nextest-docs> stderr ---
34.51 s
gammaloop-nextest-docs> warning: developer note gammaloop-architecture still requires a named owner
34.51 s
gammaloop-nextest-docs> warning: developer note integration-dashboard still requires a named owner
34.51 s
gammaloop-nextest-docs> warning: developer note uv-renormalization still requires a named owner
34.51 s
gammaloop-nextest-docs> warning: developer note spenso-parsing-flow still requires a named owner
34.51 s
gammaloop-nextest-docs> warning: developer note schoonschip-network still requires a named owner
34.51 s
gammaloop-nextest-docs> warning: developer note gammaloop-draw-style-migration still requires a named owner
34.51 s
gammaloop-nextest-docs> warning: developer note gammaloop-drawing-architecture still requires a named owner
34.51 s
gammaloop-nextest-docs> warning: developer note spenso-symbolica-syntax-and-rewrites still requires a named owner
34.51 s
gammaloop-nextest-docs> warning: developer note spenso-architecture still requires a named owner
34.51 s
gammaloop-nextest-docs> warning: developer note idenso-architecture still requires a named owner
34.51 s
gammaloop-nextest-docs> warning: developer note idenso-form-color-dirac-source-map still requires a named owner
34.51 s
gammaloop-nextest-docs> warning: developer note linnet-architecture still requires a named owner
34.51 s
gammaloop-nextest-docs> warning: developer note vakint-architecture still requires a named owner
34.51 s
gammaloop-nextest-docs> warning: developer note gammaloop-roadmap still requires a named owner
34.51 s
gammaloop-nextest-docs> warning: developer note cff-surface-cache-ownership still requires a named owner
34.51 s
gammaloop-nextest-docs> warning: developer note gammaloop-drawing-evaluated-fields-history still requires a named owner
34.51 s
gammaloop-nextest-docs> warning: archived developer note gammaloop-drawing-evaluated-fields-history has no immutable evidence revision
34.51 s
gammaloop-nextest-docs> warning: developer note bnl-benchmark-investigation still requires a named owner
34.51 s
gammaloop-nextest-docs> warning: developer note bnl-contraction-order-performance still requires a named owner
34.51 s
gammaloop-nextest-docs> warning: developer note bnl-scalar-alias-capture still requires a named owner
34.51 s
gammaloop-nextest-docs> warning: developer note aa-aa-three-loop-performance-smoke still requires a named owner
34.51 s
gammaloop-nextest-docs> warning: developer note network-simplification still requires a named owner
34.51 s
gammaloop-nextest-docs> warning: investigation developer note network-simplification has no immutable evidence revision
34.51 s
gammaloop-nextest-docs> warning: developer note spenso-large-expressions still requires a named owner
34.51 s
gammaloop-nextest-docs> warning: developer note spenso-improvement-effects still requires a named owner
34.51 s
gammaloop-nextest-docs> warning: archived developer note spenso-improvement-effects has no immutable evidence revision
34.51 s
gammaloop-nextest-docs> warning: developer note spenso-test-baseline still requires a named owner
34.51 s
gammaloop-nextest-docs> warning: archived developer note spenso-test-baseline has no immutable evidence revision
34.51 s
gammaloop-nextest-docs> warning: developer note bnl-evaluator-atom-capture still requires a named owner
34.51 s
gammaloop-nextest-docs> warning: archived developer note bnl-evaluator-atom-capture has no immutable evidence revision
34.51 s
gammaloop-nextest-docs> warning: developer note uv-scalar-profile-benchmark still requires a named owner
34.51 s
gammaloop-nextest-docs> warning: archived developer note uv-scalar-profile-benchmark has no immutable evidence revision
34.51 s
gammaloop-nextest-docs> warning: developer note ci-test-failure-summary-2026-03-25 still requires a named owner
34.51 s
gammaloop-nextest-docs> warning: archived developer note ci-test-failure-summary-2026-03-25 has no immutable evidence revision
34.51 s
gammaloop-nextest-docs> warning: developer note network-execution-rebase-record still requires a named owner
34.51 s
gammaloop-nextest-docs> warning: archived developer note network-execution-rebase-record has no immutable evidence revision
34.51 s
gammaloop-nextest-docs> warning: developer note ratatui-integration-dashboard-history still requires a named owner
34.51 s
gammaloop-nextest-docs> warning: archived developer note ratatui-integration-dashboard-history has no immutable evidence revision
34.51 s
gammaloop-nextest-docs> warning: developer note nix-crane-cache-reuse still requires a named owner
34.51 s
gammaloop-nextest-docs>
34.51 s
gammaloop-nextest-docs> thread 'tests::every_product_requires_a_task_chooser_and_each_supported_interface' (264) panicked at crates/alphal00p-docs-builder/src/lib.rs:11901:9:
34.51 s
gammaloop-nextest-docs> assertion failed: format!("{error:#}").contains("has no quickstart page")
34.51 s
gammaloop-nextest-docs> stack backtrace:
34.51 s
gammaloop-nextest-docs> 0: __rustc::rust_begin_unwind
34.51 s
gammaloop-nextest-docs> 1: core::panicking::panic_fmt
34.51 s
gammaloop-nextest-docs> 2: core::panicking::panic
34.51 s
gammaloop-nextest-docs> 3: alphal00p_docs_builder::tests::every_product_requires_a_task_chooser_and_each_supported_interface
34.51 s
gammaloop-nextest-docs> 4: <alphal00p_docs_builder::tests::every_product_requires_a_task_chooser_and_each_supported_interface::{closure#0} as core::ops::function::FnOnce<()>>::call_once
34.51 s
gammaloop-nextest-docs> note: Some details are omitted, run with `RUST_BACKTRACE=full` for a verbose backtrace.
34.51 s
gammaloop-nextest-docs>
34.51 s
gammaloop-nextest-docs> FAIL [ 0.067s] ( 93/111) alphal00p-docs-builder tests :: pdf_manual_chapter_order_must_match_the_page_registry
34.51 s
gammaloop-nextest-docs> stdout ---
34.51 s
gammaloop-nextest-docs>
34.51 s
gammaloop-nextest-docs> running 1 test
34.51 s
gammaloop-nextest-docs> test tests::pdf_manual_chapter_order_must_match_the_page_registry ... FAILED
34.51 s
gammaloop-nextest-docs>
34.51 s
gammaloop-nextest-docs> failures:
34.51 s
gammaloop-nextest-docs>
34.51 s
gammaloop-nextest-docs> failures:
34.51 s
gammaloop-nextest-docs> tests::pdf_manual_chapter_order_must_match_the_page_registry
34.51 s
gammaloop-nextest-docs>
34.51 s
gammaloop-nextest-docs> test result: FAILED. 0 passed; 1 failed; 0 ignored; 0 measured; 110 filtered out; finished in 0.06s
34.51 s
gammaloop-nextest-docs>
34.51 s
gammaloop-nextest-docs> stderr ---
34.51 s
gammaloop-nextest-docs> warning: developer note gammaloop-architecture still requires a named owner
34.51 s
gammaloop-nextest-docs> warning: developer note integration-dashboard still requires a named owner
34.51 s
gammaloop-nextest-docs> warning: developer note uv-renormalization still requires a named owner
34.51 s
gammaloop-nextest-docs> warning: developer note spenso-parsing-flow still requires a named owner
34.51 s
gammaloop-nextest-docs> warning: developer note schoonschip-network still requires a named owner
34.51 s
gammaloop-nextest-docs> warning: developer note gammaloop-draw-style-migration still requires a named owner
34.51 s
gammaloop-nextest-docs> warning: developer note gammaloop-drawing-architecture still requires a named owner
34.51 s
gammaloop-nextest-docs> warning: developer note spenso-symbolica-syntax-and-rewrites still requires a named owner
34.51 s
gammaloop-nextest-docs> warning: developer note spenso-architecture still requires a named owner
34.51 s
gammaloop-nextest-docs> warning: developer note idenso-architecture still requires a named owner
34.51 s
gammaloop-nextest-docs> warning: developer note idenso-form-color-dirac-source-map still requires a named owner
34.51 s
gammaloop-nextest-docs> warning: developer note linnet-architecture still requires a named owner
34.51 s
gammaloop-nextest-docs> warning: developer note vakint-architecture still requires a named owner
34.51 s
gammaloop-nextest-docs> warning: developer note gammaloop-roadmap still requires a named owner
34.51 s
gammaloop-nextest-docs> warning: developer note cff-surface-cache-ownership still requires a named owner
34.51 s
gammaloop-nextest-docs> warning: developer note gammaloop-drawing-evaluated-fields-history still requires a named owner
34.51 s
gammaloop-nextest-docs> warning: archived developer note gammaloop-drawing-evaluated-fields-history has no immutable evidence revision
34.51 s
gammaloop-nextest-docs> warning: developer note bnl-benchmark-investigation still requires a named owner
34.51 s
gammaloop-nextest-docs> warning: developer note bnl-contraction-order-performance still requires a named owner
34.51 s
gammaloop-nextest-docs> warning: developer note bnl-scalar-alias-capture still requires a named owner
34.51 s
gammaloop-nextest-docs> warning: developer note aa-aa-three-loop-performance-smoke still requires a named owner
34.51 s
gammaloop-nextest-docs> warning: developer note network-simplification still requires a named owner
34.51 s
gammaloop-nextest-docs> warning: investigation developer note network-simplification has no immutable evidence revision
34.51 s
gammaloop-nextest-docs> warning: developer note spenso-large-expressions still requires a named owner
34.51 s
gammaloop-nextest-docs> warning: developer note spenso-improvement-effects still requires a named owner
34.51 s
gammaloop-nextest-docs> warning: archived developer note spenso-improvement-effects has no immutable evidence revision
34.51 s
gammaloop-nextest-docs> warning: developer note spenso-test-baseline still requires a named owner
34.51 s
gammaloop-nextest-docs> warning: archived developer note spenso-test-baseline has no immutable evidence revision
34.51 s
gammaloop-nextest-docs> warning: developer note bnl-evaluator-atom-capture still requires a named owner
34.51 s
gammaloop-nextest-docs> warning: archived developer note bnl-evaluator-atom-capture has no immutable evidence revision
34.51 s
gammaloop-nextest-docs> warning: developer note uv-scalar-profile-benchmark still requires a named owner
34.51 s
gammaloop-nextest-docs> warning: archived developer note uv-scalar-profile-benchmark has no immutable evidence revision
34.51 s
gammaloop-nextest-docs> warning: developer note ci-test-failure-summary-2026-03-25 still requires a named owner
34.51 s
gammaloop-nextest-docs> warning: archived developer note ci-test-failure-summary-2026-03-25 has no immutable evidence revision
34.51 s
gammaloop-nextest-docs> warning: developer note network-execution-rebase-record still requires a named owner
34.51 s
gammaloop-nextest-docs> warning: archived developer note network-execution-rebase-record has no immutable evidence revision
34.51 s
gammaloop-nextest-docs> warning: developer note ratatui-integration-dashboard-history still requires a named owner
34.51 s
gammaloop-nextest-docs> warning: archived developer note ratatui-integration-dashboard-history has no immutable evidence revision
34.51 s
gammaloop-nextest-docs> warning: developer note nix-crane-cache-reuse still requires a named owner
34.51 s
gammaloop-nextest-docs>
34.51 s
gammaloop-nextest-docs> thread 'tests::pdf_manual_chapter_order_must_match_the_page_registry' (319) panicked at crates/alphal00p-docs-builder/src/lib.rs:11952:9:
34.51 s
gammaloop-nextest-docs> assertion failed: format!("{error:#}").contains("PDF manual chapter order differs")
34.51 s
gammaloop-nextest-docs> stack backtrace:
34.51 s
gammaloop-nextest-docs> 0: __rustc::rust_begin_unwind
34.51 s
gammaloop-nextest-docs> 1: core::panicking::panic_fmt
34.51 s
gammaloop-nextest-docs> 2: core::panicking::panic
34.51 s
gammaloop-nextest-docs> 3: alphal00p_docs_builder::tests::pdf_manual_chapter_order_must_match_the_page_registry
34.51 s
gammaloop-nextest-docs> 4: <alphal00p_docs_builder::tests::pdf_manual_chapter_order_must_match_the_page_registry::{closure#0} as core::ops::function::FnOnce<()>>::call_once
34.51 s
gammaloop-nextest-docs> note: Some details are omitted, run with `RUST_BACKTRACE=full` for a verbose backtrace.
34.51 s
gammaloop-nextest-docs>
34.51 s
gammaloop-nextest-docs> error : test run failed
34.54 s
gammaloop-nextest-docs>
34.54 s
gammaloop-nextest-docs> ========== nextest test summary ==========
34.54 s
gammaloop-nextest-docs> report: target/nextest/ci_gammaloop/junit.xml
34.54 s
gammaloop-nextest-docs> tests: 111, failures: 3, errors: 0
34.54 s
gammaloop-nextest-docs>
34.54 s
gammaloop-nextest-docs> 1. alphal00p-docs-builder::tests::checked_in_registry_is_valid
34.54 s
gammaloop-nextest-docs> failure: test failure with exit code 101
34.54 s
gammaloop-nextest-docs> thread 'tests::checked_in_registry_is_valid' (174) panicked at crates/alphal00p-docs-builder/src/lib.rs:11887:50:
34.54 s
gammaloop-nextest-docs> called `Result::unwrap()` on an `Err` value: developer note nix-crane-cache-reuse verified scope flake.nix changed (expected 188504937418859942a6770ca21a4f4e0a7ff125, found 17dc35393f0f0abd5cb31c7eaf1fdc9aa6903ce4); owner review or an explicit no-impact attestation is required
34.54 s
gammaloop-nextest-docs>
34.54 s
gammaloop-nextest-docs> Location:
34.54 s
gammaloop-nextest-docs> crates/alphal00p-docs-builder/src/lib.rs:889:21
34.54 s
gammaloop-nextest-docs> stack backtrace:
34.54 s
gammaloop-nextest-docs> 0: __rustc::rust_begin_unwind
34.54 s
gammaloop-nextest-docs> 1: core::panicking::panic_fmt
34.54 s
gammaloop-nextest-docs> 2: core::result::unwrap_failed
34.54 s
gammaloop-nextest-docs> 3: alphal00p_docs_builder::tests::checked_in_registry_is_valid
34.54 s
gammaloop-nextest-docs> 4: <alphal00p_docs_builder::tests::checked_in_registry_is_valid::{closure#0} as core::ops::function::FnOnce<()>>::call_once
34.54 s
gammaloop-nextest-docs> note: Some details are omitted, run with `RUST_BACKTRACE=full` for a verbose backtrace.
34.54 s
gammaloop-nextest-docs> system-out
34.54 s
gammaloop-nextest-docs> running 1 test
34.54 s
gammaloop-nextest-docs> test tests::checked_in_registry_is_valid ... FAILED
34.54 s
gammaloop-nextest-docs>
34.54 s
gammaloop-nextest-docs> failures:
34.54 s
gammaloop-nextest-docs>
34.54 s
gammaloop-nextest-docs> failures:
34.54 s
gammaloop-nextest-docs> tests::checked_in_registry_is_valid
34.54 s
gammaloop-nextest-docs>
34.54 s
gammaloop-nextest-docs> test result: FAILED. 0 passed; 1 failed; 0 ignored; 0 measured; 110 filtered out; finished in 0.08s
34.54 s
gammaloop-nextest-docs> system-err
34.54 s
gammaloop-nextest-docs> warning: developer note gammaloop-architecture still requires a named owner
34.54 s
gammaloop-nextest-docs> warning: developer note integration-dashboard still requires a named owner
34.54 s
gammaloop-nextest-docs> warning: developer note uv-renormalization still requires a named owner
34.54 s
gammaloop-nextest-docs> warning: developer note spenso-parsing-flow still requires a named owner
34.54 s
gammaloop-nextest-docs> warning: developer note schoonschip-network still requires a named owner
34.54 s
gammaloop-nextest-docs> warning: developer note gammaloop-draw-style-migration still requires a named owner
34.54 s
gammaloop-nextest-docs> warning: developer note gammaloop-drawing-architecture still requires a named owner
34.54 s
gammaloop-nextest-docs> warning: developer note spenso-symbolica-syntax-and-rewrites still requires a named owner
34.54 s
gammaloop-nextest-docs> warning: developer note spenso-architecture still requires a named owner
34.54 s
gammaloop-nextest-docs> warning: developer note idenso-architecture still requires a named owner
34.54 s
gammaloop-nextest-docs> warning: developer note idenso-form-color-dirac-source-map still requires a named owner
34.54 s
gammaloop-nextest-docs> warning: developer note linnet-architecture still requires a named owner
34.54 s
gammaloop-nextest-docs> warning: developer note vakint-architecture still requires a named owner
34.54 s
gammaloop-nextest-docs> warning: developer note gammaloop-roadmap still requires a named owner
34.54 s
gammaloop-nextest-docs> warning: developer note cff-surface-cache-ownership still requires a named owner
34.54 s
gammaloop-nextest-docs> warning: developer note gammaloop-drawing-evaluated-fields-history still requires a named owner
34.54 s
gammaloop-nextest-docs> warning: archived developer note gammaloop-drawing-evaluated-fields-history has no immutable evidence revision
34.54 s
gammaloop-nextest-docs> warning: developer note bnl-benchmark-investigation still requires a named owner
34.54 s
gammaloop-nextest-docs> warning: developer note bnl-contraction-order-performance still requires a named owner
34.54 s
gammaloop-nextest-docs> warning: developer note bnl-scalar-alias-capture still requires a named owner
34.54 s
gammaloop-nextest-docs> warning: developer note aa-aa-three-loop-performance-smoke still requires a named owner
34.54 s
gammaloop-nextest-docs> warning: developer note network-simplification still requires a named owner
34.54 s
gammaloop-nextest-docs> warning: investigation developer note network-simplification has no immutable evidence revision
34.54 s
gammaloop-nextest-docs> warning: developer note spenso-large-expressions still requires a named owner
34.54 s
gammaloop-nextest-docs> warning: developer note spenso-improvement-effects still requires a named owner
34.54 s
gammaloop-nextest-docs> warning: archived developer note spenso-improvement-effects has no immutable evidence revision
34.54 s
gammaloop-nextest-docs> warning: developer note spenso-test-baseline still requires a named owner
34.54 s
gammaloop-nextest-docs> warning: archived developer note spenso-test-baseline has no immutable evidence revision
34.54 s
gammaloop-nextest-docs> warning: developer note bnl-evaluator-atom-capture still requires a named owner
34.54 s
gammaloop-nextest-docs> warning: archived developer note bnl-evaluator-atom-capture has no immutable evidence revision
34.54 s
gammaloop-nextest-docs> warning: developer note uv-scalar-profile-benchmark still requires a named owner
34.54 s
gammaloop-nextest-docs> warning: archived developer note uv-scalar-profile-benchmark has no immutable evidence revision
34.54 s
gammaloop-nextest-docs> warning: developer note ci-test-failure-summary-2026-03-25 still requires a named owner
34.54 s
gammaloop-nextest-docs> warning: archived developer note ci-test-failure-summary-2026-03-25 has no immutable evidence revision
34.54 s
gammaloop-nextest-docs> warning: developer note network-execution-rebase-record still requires a named owner
34.54 s
gammaloop-nextest-docs> warning: archived developer note network-execution-rebase-record has no immutable evidence revision
34.54 s
gammaloop-nextest-docs> warning: developer note ratatui-integration-dashboard-history still requires a named owner
34.54 s
gammaloop-nextest-docs> warning: archived developer note ratatui-integration-dashboard-history has no immutable evidence revision
34.54 s
gammaloop-nextest-docs> warning: developer note nix-crane-cache-reuse still requires a named owner
34.54 s
gammaloop-nextest-docs>
34.54 s
gammaloop-nextest-docs> thread 'tests::checked_in_registry_is_valid' (174) panicked at crates/alphal00p-docs-builder/src/lib.rs:11887:50:
34.54 s
gammaloop-nextest-docs> called `Result::unwrap()` on an `Err` value: developer note nix-crane-cache-reuse verified scope flake.nix changed (expected 188504937418859942a6770ca21a4f4e0a7ff125, found 17dc35393f0f0abd5cb31c7eaf1fdc9aa6903ce4); owner review or an explicit no-impact attestation is required
34.54 s
gammaloop-nextest-docs>
34.54 s
gammaloop-nextest-docs> Location:
34.54 s
gammaloop-nextest-docs> crates/alphal00p-docs-builder/src/lib.rs:889:21
34.54 s
gammaloop-nextest-docs> stack backtrace:
34.54 s
gammaloop-nextest-docs> 0: __rustc::rust_begin_unwind
34.54 s
gammaloop-nextest-docs> 1: core::panicking::panic_fmt
34.54 s
gammaloop-nextest-docs> 2: core::result::unwrap_failed
34.54 s
gammaloop-nextest-docs> 3: alphal00p_docs_builder::tests::checked_in_registry_is_valid
34.54 s
gammaloop-nextest-docs> 4: <alphal00p_docs_builder::tests::checked_in_registry_is_valid::{closure#0} as core::ops::function::FnOnce<()>>::call_once
34.54 s
gammaloop-nextest-docs> note: Some details are omitted, run with `RUST_BACKTRACE=full` for a verbose backtrace.
34.54 s
gammaloop-nextest-docs>
34.54 s
gammaloop-nextest-docs> 2. alphal00p-docs-builder::tests::every_product_requires_a_task_chooser_and_each_supported_interface
34.54 s
gammaloop-nextest-docs> failure: test failure with exit code 101
34.54 s
gammaloop-nextest-docs> thread 'tests::every_product_requires_a_task_chooser_and_each_supported_interface' (264) panicked at crates/alphal00p-docs-builder/src/lib.rs:11901:9:
34.54 s
gammaloop-nextest-docs> assertion failed: format!("{error:#}").contains("has no quickstart page")
34.54 s
gammaloop-nextest-docs> stack backtrace:
34.54 s
gammaloop-nextest-docs> 0: __rustc::rust_begin_unwind
34.54 s
gammaloop-nextest-docs> 1: core::panicking::panic_fmt
34.54 s
gammaloop-nextest-docs> 2: core::panicking::panic
34.54 s
gammaloop-nextest-docs> 3: alphal00p_docs_builder::tests::every_product_requires_a_task_chooser_and_each_supported_interface
34.54 s
gammaloop-nextest-docs> 4: <alphal00p_docs_builder::tests::every_product_requires_a_task_chooser_and_each_supported_interface::{closure#0} as core::ops::function::FnOnce<()>>::call_once
34.54 s
gammaloop-nextest-docs> note: Some details are omitted, run with `RUST_BACKTRACE=full` for a verbose backtrace.
34.54 s
gammaloop-nextest-docs> system-out
34.54 s
gammaloop-nextest-docs> running 1 test
34.54 s
gammaloop-nextest-docs> test tests::every_product_requires_a_task_chooser_and_each_supported_interface ... FAILED
34.54 s
gammaloop-nextest-docs>
34.54 s
gammaloop-nextest-docs> failures:
34.54 s
gammaloop-nextest-docs>
34.54 s
gammaloop-nextest-docs> failures:
34.54 s
gammaloop-nextest-docs> tests::every_product_requires_a_task_chooser_and_each_supported_interface
34.54 s
gammaloop-nextest-docs>
34.54 s
gammaloop-nextest-docs> test result: FAILED. 0 passed; 1 failed; 0 ignored; 0 measured; 110 filtered out; finished in 0.07s
34.54 s
gammaloop-nextest-docs> system-err
34.54 s
gammaloop-nextest-docs> warning: developer note gammaloop-architecture still requires a named owner
34.54 s
gammaloop-nextest-docs> warning: developer note integration-dashboard still requires a named owner
34.54 s
gammaloop-nextest-docs> warning: developer note uv-renormalization still requires a named owner
34.54 s
gammaloop-nextest-docs> warning: developer note spenso-parsing-flow still requires a named owner
34.54 s
gammaloop-nextest-docs> warning: developer note schoonschip-network still requires a named owner
34.54 s
gammaloop-nextest-docs> warning: developer note gammaloop-draw-style-migration still requires a named owner
34.54 s
gammaloop-nextest-docs> warning: developer note gammaloop-drawing-architecture still requires a named owner
34.54 s
gammaloop-nextest-docs> warning: developer note spenso-symbolica-syntax-and-rewrites still requires a named owner
34.54 s
gammaloop-nextest-docs> warning: developer note spenso-architecture still requires a named owner
34.54 s
gammaloop-nextest-docs> warning: developer note idenso-architecture still requires a named owner
34.54 s
gammaloop-nextest-docs> warning: developer note idenso-form-color-dirac-source-map still requires a named owner
34.54 s
gammaloop-nextest-docs> warning: developer note linnet-architecture still requires a named owner
34.54 s
gammaloop-nextest-docs> warning: developer note vakint-architecture still requires a named owner
34.54 s
gammaloop-nextest-docs> warning: developer note gammaloop-roadmap still requires a named owner
34.54 s
gammaloop-nextest-docs> warning: developer note cff-surface-cache-ownership still requires a named owner
34.54 s
gammaloop-nextest-docs> warning: developer note gammaloop-drawing-evaluated-fields-history still requires a named owner
34.54 s
gammaloop-nextest-docs> warning: archived developer note gammaloop-drawing-evaluated-fields-history has no immutable evidence revision
34.54 s
gammaloop-nextest-docs> warning: developer note bnl-benchmark-investigation still requires a named owner
34.54 s
gammaloop-nextest-docs> warning: developer note bnl-contraction-order-performance still requires a named owner
34.54 s
gammaloop-nextest-docs> warning: developer note bnl-scalar-alias-capture still requires a named owner
34.54 s
gammaloop-nextest-docs> warning: developer note aa-aa-three-loop-performance-smoke still requires a named owner
34.54 s
gammaloop-nextest-docs> warning: developer note network-simplification still requires a named owner
34.54 s
gammaloop-nextest-docs> warning: investigation developer note network-simplification has no immutable evidence revision
34.54 s
gammaloop-nextest-docs> warning: developer note spenso-large-expressions still requires a named owner
34.54 s
gammaloop-nextest-docs> warning: developer note spenso-improvement-effects still requires a named owner
34.54 s
gammaloop-nextest-docs> warning: archived developer note spenso-improvement-effects has no immutable evidence revision
34.54 s
gammaloop-nextest-docs> warning: developer note spenso-test-baseline still requires a named owner
34.54 s
gammaloop-nextest-docs> warning: archived developer note spenso-test-baseline has no immutable evidence revision
34.54 s
gammaloop-nextest-docs> warning: developer note bnl-evaluator-atom-capture still requires a named owner
34.54 s
gammaloop-nextest-docs> warning: archived developer note bnl-evaluator-atom-capture has no immutable evidence revision
34.54 s
gammaloop-nextest-docs> warning: developer note uv-scalar-profile-benchmark still requires a named owner
34.54 s
gammaloop-nextest-docs> warning: archived developer note uv-scalar-profile-benchmark has no immutable evidence revision
34.54 s
gammaloop-nextest-docs> warning: developer note ci-test-failure-summary-2026-03-25 still requires a named owner
34.54 s
gammaloop-nextest-docs> warning: archived developer note ci-test-failure-summary-2026-03-25 has no immutable evidence revision
34.54 s
gammaloop-nextest-docs> warning: developer note network-execution-rebase-record still requires a named owner
34.54 s
gammaloop-nextest-docs> warning: archived developer note network-execution-rebase-record has no immutable evidence revision
34.54 s
gammaloop-nextest-docs> warning: developer note ratatui-integration-dashboard-history still requires a named owner
34.54 s
gammaloop-nextest-docs> warning: archived developer note ratatui-integration-dashboard-history has no immutable evidence revision
34.54 s
gammaloop-nextest-docs> warning: developer note nix-crane-cache-reuse still requires a named owner
34.54 s
gammaloop-nextest-docs>
34.54 s
gammaloop-nextest-docs> thread 'tests::every_product_requires_a_task_chooser_and_each_supported_interface' (264) panicked at crates/alphal00p-docs-builder/src/lib.rs:11901:9:
34.54 s
gammaloop-nextest-docs> assertion failed: format!("{error:#}").contains("has no quickstart page")
34.54 s
gammaloop-nextest-docs> stack backtrace:
34.54 s
gammaloop-nextest-docs> 0: __rustc::rust_begin_unwind
34.54 s
gammaloop-nextest-docs> 1: core::panicking::panic_fmt
34.54 s
gammaloop-nextest-docs> 2: core::panicking::panic
34.54 s
gammaloop-nextest-docs> 3: alphal00p_docs_builder::tests::every_product_requires_a_task_chooser_and_each_supported_interface
34.54 s
gammaloop-nextest-docs> 4: <alphal00p_docs_builder::tests::every_product_requires_a_task_chooser_and_each_supported_interface::{closure#0} as core::ops::function::FnOnce<()>>::call_once
34.54 s
gammaloop-nextest-docs> note: Some details are omitted, run with `RUST_BACKTRACE=full` for a verbose backtrace.
34.54 s
gammaloop-nextest-docs>
34.54 s
gammaloop-nextest-docs> 3. alphal00p-docs-builder::tests::pdf_manual_chapter_order_must_match_the_page_registry
34.54 s
gammaloop-nextest-docs> failure: test failure with exit code 101
34.54 s
gammaloop-nextest-docs> thread 'tests::pdf_manual_chapter_order_must_match_the_page_registry' (319) panicked at crates/alphal00p-docs-builder/src/lib.rs:11952:9:
34.54 s
gammaloop-nextest-docs> assertion failed: format!("{error:#}").contains("PDF manual chapter order differs")
34.54 s
gammaloop-nextest-docs> stack backtrace:
34.54 s
gammaloop-nextest-docs> 0: __rustc::rust_begin_unwind
34.54 s
gammaloop-nextest-docs> 1: core::panicking::panic_fmt
34.54 s
gammaloop-nextest-docs> 2: core::panicking::panic
34.54 s
gammaloop-nextest-docs> 3: alphal00p_docs_builder::tests::pdf_manual_chapter_order_must_match_the_page_registry
34.54 s
gammaloop-nextest-docs> 4: <alphal00p_docs_builder::tests::pdf_manual_chapter_order_must_match_the_page_registry::{closure#0} as core::ops::function::FnOnce<()>>::call_once
34.54 s
gammaloop-nextest-docs> note: Some details are omitted, run with `RUST_BACKTRACE=full` for a verbose backtrace.
34.54 s
gammaloop-nextest-docs> system-out
34.54 s
gammaloop-nextest-docs> running 1 test
34.54 s
gammaloop-nextest-docs> test tests::pdf_manual_chapter_order_must_match_the_page_registry ... FAILED
34.54 s
gammaloop-nextest-docs>
34.54 s
gammaloop-nextest-docs> failures:
34.54 s
gammaloop-nextest-docs>
34.54 s
gammaloop-nextest-docs> failures:
34.54 s
gammaloop-nextest-docs> tests::pdf_manual_chapter_order_must_match_the_page_registry
34.54 s
gammaloop-nextest-docs>
34.54 s
gammaloop-nextest-docs> test result: FAILED. 0 passed; 1 failed; 0 ignored; 0 measured; 110 filtered out; finished in 0.06s
34.54 s
gammaloop-nextest-docs> system-err
34.54 s
gammaloop-nextest-docs> warning: developer note gammaloop-architecture still requires a named owner
34.54 s
gammaloop-nextest-docs> warning: developer note integration-dashboard still requires a named owner
34.54 s
gammaloop-nextest-docs> warning: developer note uv-renormalization still requires a named owner
34.54 s
gammaloop-nextest-docs> warning: developer note spenso-parsing-flow still requires a named owner
34.54 s
gammaloop-nextest-docs> warning: developer note schoonschip-network still requires a named owner
34.54 s
gammaloop-nextest-docs> warning: developer note gammaloop-draw-style-migration still requires a named owner
34.54 s
gammaloop-nextest-docs> warning: developer note gammaloop-drawing-architecture still requires a named owner
34.54 s
gammaloop-nextest-docs> warning: developer note spenso-symbolica-syntax-and-rewrites still requires a named owner
34.54 s
gammaloop-nextest-docs> warning: developer note spenso-architecture still requires a named owner
34.54 s
gammaloop-nextest-docs> warning: developer note idenso-architecture still requires a named owner
34.54 s
gammaloop-nextest-docs> warning: developer note idenso-form-color-dirac-source-map still requires a named owner
34.54 s
gammaloop-nextest-docs> warning: developer note linnet-architecture still requires a named owner
34.54 s
gammaloop-nextest-docs> warning: developer note vakint-architecture still requires a named owner
34.54 s
gammaloop-nextest-docs> warning: developer note gammaloop-roadmap still requires a named owner
34.54 s
gammaloop-nextest-docs> warning: developer note cff-surface-cache-ownership still requires a named owner
34.54 s
gammaloop-nextest-docs> warning: developer note gammaloop-drawing-evaluated-fields-history still requires a named owner
34.54 s
gammaloop-nextest-docs> warning: archived developer note gammaloop-drawing-evaluated-fields-history has no immutable evidence revision
34.54 s
gammaloop-nextest-docs> warning: developer note bnl-benchmark-investigation still requires a named owner
34.54 s
gammaloop-nextest-docs> warning: developer note bnl-contraction-order-performance still requires a named owner
34.54 s
gammaloop-nextest-docs> warning: developer note bnl-scalar-alias-capture still requires a named owner
34.54 s
gammaloop-nextest-docs> warning: developer note aa-aa-three-loop-performance-smoke still requires a named owner
34.54 s
gammaloop-nextest-docs> warning: developer note network-simplification still requires a named owner
34.54 s
gammaloop-nextest-docs> warning: investigation developer note network-simplification has no immutable evidence revision
34.54 s
gammaloop-nextest-docs> warning: developer note spenso-large-expressions still requires a named owner
34.54 s
gammaloop-nextest-docs> warning: developer note spenso-improvement-effects still requires a named owner
34.54 s
gammaloop-nextest-docs> warning: archived developer note spenso-improvement-effects has no immutable evidence revision
34.54 s
gammaloop-nextest-docs> warning: developer note spenso-test-baseline still requires a named owner
34.54 s
gammaloop-nextest-docs> warning: archived developer note spenso-test-baseline has no immutable evidence revision
34.54 s
gammaloop-nextest-docs> warning: developer note bnl-evaluator-atom-capture still requires a named owner
34.54 s
gammaloop-nextest-docs> warning: archived developer note bnl-evaluator-atom-capture has no immutable evidence revision
34.54 s
gammaloop-nextest-docs> warning: developer note uv-scalar-profile-benchmark still requires a named owner
34.54 s
gammaloop-nextest-docs> warning: archived developer note uv-scalar-profile-benchmark has no immutable evidence revision
34.54 s
gammaloop-nextest-docs> warning: developer note ci-test-failure-summary-2026-03-25 still requires a named owner
34.54 s
gammaloop-nextest-docs> warning: archived developer note ci-test-failure-summary-2026-03-25 has no immutable evidence revision
34.54 s
gammaloop-nextest-docs> warning: developer note network-execution-rebase-record still requires a named owner
34.54 s
gammaloop-nextest-docs> warning: archived developer note network-execution-rebase-record has no immutable evidence revision
34.54 s
gammaloop-nextest-docs> warning: developer note ratatui-integration-dashboard-history still requires a named owner
34.54 s
gammaloop-nextest-docs> warning: archived developer note ratatui-integration-dashboard-history has no immutable evidence revision
34.54 s
gammaloop-nextest-docs> warning: developer note nix-crane-cache-reuse still requires a named owner
34.54 s
gammaloop-nextest-docs>
34.54 s
gammaloop-nextest-docs> thread 'tests::pdf_manual_chapter_order_must_match_the_page_registry' (319) panicked at crates/alphal00p-docs-builder/src/lib.rs:11952:9:
34.54 s
gammaloop-nextest-docs> assertion failed: format!("{error:#}").contains("PDF manual chapter order differs")
34.54 s
gammaloop-nextest-docs> stack backtrace:
34.54 s
gammaloop-nextest-docs> 0: __rustc::rust_begin_unwind
34.54 s
gammaloop-nextest-docs> 1: core::panicking::panic_fmt
34.54 s
gammaloop-nextest-docs> 2: core::panicking::panic
34.54 s
gammaloop-nextest-docs> 3: alphal00p_docs_builder::tests::pdf_manual_chapter_order_must_match_the_page_registry
34.54 s
gammaloop-nextest-docs> 4: <alphal00p_docs_builder::tests::pdf_manual_chapter_order_must_match_the_page_registry::{closure#0} as core::ops::function::FnOnce<()>>::call_once
34.54 s
gammaloop-nextest-docs> note: Some details are omitted, run with `RUST_BACKTRACE=full` for a verbose backtrace.
34.54 s
gammaloop-nextest-docs> =========================================
34.55 s
gammaloop-nextest-docs> Extracting 2 binaries to /build/source
34.58 s
gammaloop-nextest-docs> Extracted 5 files to /build/source in 0.03s
34.59 s
gammaloop-nextest-docs> ------------
34.59 s
gammaloop-nextest-docs> Nextest run ID b5ec9295-bd27-4aca-beb9-fcef7602151e with nextest profile: ci_gammaloop
34.59 s
gammaloop-nextest-docs> Starting 22 tests across 2 binaries
34.60 s
gammaloop-nextest-docs> ------------
34.60 s
gammaloop-nextest-docs> Summary [ 0.015s] 22 tests run: 22 passed , 0 skipped
34.63 s
gammaloop-nextest-docs>
34.63 s
gammaloop-nextest-docs> ========== nextest test summary ==========
34.63 s
gammaloop-nextest-docs> report: target/nextest/ci_gammaloop/junit.xml
34.63 s
gammaloop-nextest-docs> tests: 22, failures: 0, errors: 0
34.63 s
gammaloop-nextest-docs> No failing testcases found.
34.63 s
gammaloop-nextest-docs> =========================================
34.64 s
gammaloop-nextest-docs> Extracting 1 binary, 1 build script output directory, and 2 linked paths to /build/source
34.71 s
gammaloop-nextest-docs> Extracted 18 files to /build/source in 0.06s
34.71 s
gammaloop-nextest-docs> ------------
34.71 s
gammaloop-nextest-docs> Nextest run ID ec48143d-5129-40e1-9b37-99d6a8e401bb with nextest profile: ci_gammaloop
34.71 s
gammaloop-nextest-docs> Starting 89 tests across 1 binary
34.75 s
gammaloop-nextest-docs> ------------
34.75 s
gammaloop-nextest-docs> Summary [ 0.038s] 89 tests run: 89 passed , 0 skipped
34.78 s
gammaloop-nextest-docs>
34.78 s
gammaloop-nextest-docs> ========== nextest test summary ==========
34.78 s
gammaloop-nextest-docs> report: target/nextest/ci_gammaloop/junit.xml
34.78 s
gammaloop-nextest-docs> tests: 89, failures: 0, errors: 0
34.78 s
gammaloop-nextest-docs> No failing testcases found.
34.78 s
gammaloop-nextest-docs> =========================================
34.80 s
gammaloop-nextest-docs> Extracting 2 binaries to /build/source
34.83 s
gammaloop-nextest-docs> Extracted 5 files to /build/source in 0.04s
34.84 s
gammaloop-nextest-docs> ------------
34.84 s
gammaloop-nextest-docs> Nextest run ID 27e0d0fb-7422-4650-9a76-7bc5d97b8e5b with nextest profile: ci_gammaloop
34.84 s
gammaloop-nextest-docs> Starting 10 tests across 2 binaries
45.55 s
gammaloop-nextest-docs> ------------
45.55 s
gammaloop-nextest-docs> Summary [ 10.712s] 10 tests run: 10 passed , 0 skipped
45.58 s
gammaloop-nextest-docs>
45.58 s
gammaloop-nextest-docs> ========== nextest test summary ==========
45.58 s
gammaloop-nextest-docs> report: target/nextest/ci_gammaloop/junit.xml
45.58 s
gammaloop-nextest-docs> tests: 10, failures: 0, errors: 0
45.58 s
gammaloop-nextest-docs> No failing testcases found.
45.58 s
gammaloop-nextest-docs> =========================================
45.59 s
gammaloop-nextest-docs> Extracting 1 binary to /build/source
45.62 s
gammaloop-nextest-docs> Extracted 4 files to /build/source in 0.03s
45.63 s
gammaloop-nextest-docs> ------------
45.63 s
gammaloop-nextest-docs> Nextest run ID 31d27f9f-40eb-48b6-845b-7bf9c9e7e530 with nextest profile: ci_gammaloop
45.63 s
gammaloop-nextest-docs> Starting 0 tests across 1 binary
45.63 s
gammaloop-nextest-docs> ------------
45.63 s
gammaloop-nextest-docs> Summary [ 0.000s] 0 tests run: 0 passed , 0 skipped
45.66 s
gammaloop-nextest-docs>
45.66 s
gammaloop-nextest-docs> ========== nextest test summary ==========
45.66 s
gammaloop-nextest-docs> report: target/nextest/ci_gammaloop/junit.xml
45.66 s
gammaloop-nextest-docs> tests: 0, failures: 0, errors: 0
45.66 s
gammaloop-nextest-docs> No failing testcases found.
45.66 s
gammaloop-nextest-docs> =========================================
45.67 s
gammaloop-nextest-docs> Extracting 1 binary to /build/source
45.70 s
gammaloop-nextest-docs> Extracted 4 files to /build/source in 0.03s
45.71 s
gammaloop-nextest-docs> ------------
45.71 s
gammaloop-nextest-docs> Nextest run ID 8ca909f3-8571-4df9-a35d-79f2b1f95750 with nextest profile: ci_gammaloop
45.71 s
gammaloop-nextest-docs> Starting 5 tests across 1 binary
45.72 s
gammaloop-nextest-docs> ------------
45.72 s
gammaloop-nextest-docs> Summary [ 0.005s] 5 tests run: 5 passed , 0 skipped
45.74 s
gammaloop-nextest-docs>
45.74 s
gammaloop-nextest-docs> ========== nextest test summary ==========
45.74 s
gammaloop-nextest-docs> report: target/nextest/ci_gammaloop/junit.xml
45.74 s
gammaloop-nextest-docs> tests: 5, failures: 0, errors: 0
45.74 s
gammaloop-nextest-docs> No failing testcases found.
45.74 s
gammaloop-nextest-docs> =========================================
45.90 s
error: Cannot build '/nix/store/ig2n8vvnnpdbrss20g10xh19f2x4lxrl-gammaloop-nextest-docs.drv '.
45.90 s
Reason: builder failed with exit code 100 .
45.90 s
Output paths:
45.90 s
/nix/store/mvjf7pw7m7955c5sm90aqfnzz834drqw-gammaloop-nextest-docs
45.90 s
Last 690 log lines:
45.90 s
> Extracting 2 binaries to /build/source
45.90 s
> Extracted 5 files to /build/source in 0.04s
45.90 s
> ------------
45.90 s
> Nextest run ID 41c799f1-b79a-47d1-9384-6804f8337feb with nextest profile: ci_gammaloop
45.90 s
> Starting 111 tests across 2 binaries
45.90 s
> FAIL [ 0.081s] ( 73/111) alphal00p-docs-builder tests :: checked_in_registry_is_valid
45.90 s
> stdout ---
45.90 s
>
45.90 s
> running 1 test
45.90 s
> test tests::checked_in_registry_is_valid ... FAILED
45.90 s
>
45.90 s
> failures:
45.90 s
>
45.90 s
> failures:
45.90 s
> tests::checked_in_registry_is_valid
45.90 s
>
45.90 s
> test result: FAILED. 0 passed; 1 failed; 0 ignored; 0 measured; 110 filtered out; finished in 0.08s
45.90 s
>
45.90 s
> stderr ---
45.90 s
> warning: developer note gammaloop-architecture still requires a named owner
45.90 s
> warning: developer note integration-dashboard still requires a named owner
45.90 s
> warning: developer note uv-renormalization still requires a named owner
45.90 s
> warning: developer note spenso-parsing-flow still requires a named owner
45.90 s
> warning: developer note schoonschip-network still requires a named owner
45.90 s
> warning: developer note gammaloop-draw-style-migration still requires a named owner
45.90 s
> warning: developer note gammaloop-drawing-architecture still requires a named owner
45.90 s
> warning: developer note spenso-symbolica-syntax-and-rewrites still requires a named owner
45.90 s
> warning: developer note spenso-architecture still requires a named owner
45.90 s
> warning: developer note idenso-architecture still requires a named owner
45.90 s
> warning: developer note idenso-form-color-dirac-source-map still requires a named owner
45.90 s
> warning: developer note linnet-architecture still requires a named owner
45.90 s
> warning: developer note vakint-architecture still requires a named owner
45.90 s
> warning: developer note gammaloop-roadmap still requires a named owner
45.90 s
> warning: developer note cff-surface-cache-ownership still requires a named owner
45.90 s
> warning: developer note gammaloop-drawing-evaluated-fields-history still requires a named owner
45.90 s
> warning: archived developer note gammaloop-drawing-evaluated-fields-history has no immutable evidence revision
45.90 s
> warning: developer note bnl-benchmark-investigation still requires a named owner
45.90 s
> warning: developer note bnl-contraction-order-performance still requires a named owner
45.90 s
> warning: developer note bnl-scalar-alias-capture still requires a named owner
45.90 s
> warning: developer note aa-aa-three-loop-performance-smoke still requires a named owner
45.90 s
> warning: developer note network-simplification still requires a named owner
45.90 s
> warning: investigation developer note network-simplification has no immutable evidence revision
45.90 s
> warning: developer note spenso-large-expressions still requires a named owner
45.90 s
> warning: developer note spenso-improvement-effects still requires a named owner
45.90 s
> warning: archived developer note spenso-improvement-effects has no immutable evidence revision
45.90 s
> warning: developer note spenso-test-baseline still requires a named owner
45.90 s
> warning: archived developer note spenso-test-baseline has no immutable evidence revision
45.90 s
> warning: developer note bnl-evaluator-atom-capture still requires a named owner
45.90 s
> warning: archived developer note bnl-evaluator-atom-capture has no immutable evidence revision
45.90 s
> warning: developer note uv-scalar-profile-benchmark still requires a named owner
45.90 s
> warning: archived developer note uv-scalar-profile-benchmark has no immutable evidence revision
45.90 s
> warning: developer note ci-test-failure-summary-2026-03-25 still requires a named owner
45.90 s
> warning: archived developer note ci-test-failure-summary-2026-03-25 has no immutable evidence revision
45.90 s
> warning: developer note network-execution-rebase-record still requires a named owner
45.90 s
> warning: archived developer note network-execution-rebase-record has no immutable evidence revision
45.90 s
> warning: developer note ratatui-integration-dashboard-history still requires a named owner
45.90 s
> warning: archived developer note ratatui-integration-dashboard-history has no immutable evidence revision
45.90 s
> warning: developer note nix-crane-cache-reuse still requires a named owner
45.90 s
>
45.90 s
> thread 'tests::checked_in_registry_is_valid' (174) panicked at crates/alphal00p-docs-builder/src/lib.rs:11887:50:
45.90 s
> called `Result::unwrap()` on an `Err` value: developer note nix-crane-cache-reuse verified scope flake.nix changed (expected 188504937418859942a6770ca21a4f4e0a7ff125, found 17dc35393f0f0abd5cb31c7eaf1fdc9aa6903ce4); owner review or an explicit no-impact attestation is required
45.90 s
>
45.90 s
> Location:
45.90 s
> crates/alphal00p-docs-builder/src/lib.rs:889:21
45.90 s
> stack backtrace:
45.90 s
> 0: __rustc::rust_begin_unwind
45.90 s
> 1: core::panicking::panic_fmt
45.90 s
> 2: core::result::unwrap_failed
45.90 s
> 3: alphal00p_docs_builder::tests::checked_in_registry_is_valid
45.90 s
> 4: <alphal00p_docs_builder::tests::checked_in_registry_is_valid::{closure#0} as core::ops::function::FnOnce<()>>::call_once
45.90 s
> note: Some details are omitted, run with `RUST_BACKTRACE=full` for a verbose backtrace.
45.90 s
>
45.90 s
> FAIL [ 0.076s] ( 82/111) alphal00p-docs-builder tests :: every_product_requires_a_task_chooser_and_each_supported_interface
45.90 s
> stdout ---
45.90 s
>
45.90 s
> running 1 test
45.90 s
> test tests::every_product_requires_a_task_chooser_and_each_supported_interface ... FAILED
45.90 s
>
45.90 s
> failures:
45.90 s
>
45.90 s
> failures:
45.90 s
> tests::every_product_requires_a_task_chooser_and_each_supported_interface
45.90 s
>
45.90 s
> test result: FAILED. 0 passed; 1 failed; 0 ignored; 0 measured; 110 filtered out; finished in 0.07s
45.90 s
>
45.90 s
> stderr ---
45.90 s
> warning: developer note gammaloop-architecture still requires a named owner
45.90 s
> warning: developer note integration-dashboard still requires a named owner
45.90 s
> warning: developer note uv-renormalization still requires a named owner
45.90 s
> warning: developer note spenso-parsing-flow still requires a named owner
45.90 s
> warning: developer note schoonschip-network still requires a named owner
45.90 s
> warning: developer note gammaloop-draw-style-migration still requires a named owner
45.90 s
> warning: developer note gammaloop-drawing-architecture still requires a named owner
45.90 s
> warning: developer note spenso-symbolica-syntax-and-rewrites still requires a named owner
45.90 s
> warning: developer note spenso-architecture still requires a named owner
45.90 s
> warning: developer note idenso-architecture still requires a named owner
45.90 s
> warning: developer note idenso-form-color-dirac-source-map still requires a named owner
45.90 s
> warning: developer note linnet-architecture still requires a named owner
45.90 s
> warning: developer note vakint-architecture still requires a named owner
45.90 s
> warning: developer note gammaloop-roadmap still requires a named owner
45.90 s
> warning: developer note cff-surface-cache-ownership still requires a named owner
45.90 s
> warning: developer note gammaloop-drawing-evaluated-fields-history still requires a named owner
45.90 s
> warning: archived developer note gammaloop-drawing-evaluated-fields-history has no immutable evidence revision
45.90 s
> warning: developer note bnl-benchmark-investigation still requires a named owner
45.90 s
> warning: developer note bnl-contraction-order-performance still requires a named owner
45.90 s
> warning: developer note bnl-scalar-alias-capture still requires a named owner
45.90 s
> warning: developer note aa-aa-three-loop-performance-smoke still requires a named owner
45.90 s
> warning: developer note network-simplification still requires a named owner
45.90 s
> warning: investigation developer note network-simplification has no immutable evidence revision
45.90 s
> warning: developer note spenso-large-expressions still requires a named owner
45.90 s
> warning: developer note spenso-improvement-effects still requires a named owner
45.90 s
> warning: archived developer note spenso-improvement-effects has no immutable evidence revision
45.90 s
> warning: developer note spenso-test-baseline still requires a named owner
45.90 s
> warning: archived developer note spenso-test-baseline has no immutable evidence revision
45.90 s
> warning: developer note bnl-evaluator-atom-capture still requires a named owner
45.90 s
> warning: archived developer note bnl-evaluator-atom-capture has no immutable evidence revision
45.90 s
> warning: developer note uv-scalar-profile-benchmark still requires a named owner
45.90 s
> warning: archived developer note uv-scalar-profile-benchmark has no immutable evidence revision
45.90 s
> warning: developer note ci-test-failure-summary-2026-03-25 still requires a named owner
45.90 s
> warning: archived developer note ci-test-failure-summary-2026-03-25 has no immutable evidence revision
45.90 s
> warning: developer note network-execution-rebase-record still requires a named owner
45.90 s
> warning: archived developer note network-execution-rebase-record has no immutable evidence revision
45.90 s
> warning: developer note ratatui-integration-dashboard-history still requires a named owner
45.90 s
> warning: archived developer note ratatui-integration-dashboard-history has no immutable evidence revision
45.90 s
> warning: developer note nix-crane-cache-reuse still requires a named owner
45.90 s
>
45.90 s
> thread 'tests::every_product_requires_a_task_chooser_and_each_supported_interface' (264) panicked at crates/alphal00p-docs-builder/src/lib.rs:11901:9:
45.90 s
> assertion failed: format!("{error:#}").contains("has no quickstart page")
45.90 s
> stack backtrace:
45.90 s
> 0: __rustc::rust_begin_unwind
45.90 s
> 1: core::panicking::panic_fmt
45.90 s
> 2: core::panicking::panic
45.90 s
> 3: alphal00p_docs_builder::tests::every_product_requires_a_task_chooser_and_each_supported_interface
45.90 s
> 4: <alphal00p_docs_builder::tests::every_product_requires_a_task_chooser_and_each_supported_interface::{closure#0} as core::ops::function::FnOnce<()>>::call_once
45.90 s
> note: Some details are omitted, run with `RUST_BACKTRACE=full` for a verbose backtrace.
45.90 s
>
45.90 s
> FAIL [ 0.067s] ( 93/111) alphal00p-docs-builder tests :: pdf_manual_chapter_order_must_match_the_page_registry
45.90 s
> stdout ---
45.90 s
>
45.90 s
> running 1 test
45.90 s
> test tests::pdf_manual_chapter_order_must_match_the_page_registry ... FAILED
45.90 s
>
45.90 s
> failures:
45.90 s
>
45.90 s
> failures:
45.90 s
> tests::pdf_manual_chapter_order_must_match_the_page_registry
45.90 s
>
45.90 s
> test result: FAILED. 0 passed; 1 failed; 0 ignored; 0 measured; 110 filtered out; finished in 0.06s
45.90 s
>
45.90 s
> stderr ---
45.90 s
> warning: developer note gammaloop-architecture still requires a named owner
45.90 s
> warning: developer note integration-dashboard still requires a named owner
45.90 s
> warning: developer note uv-renormalization still requires a named owner
45.90 s
> warning: developer note spenso-parsing-flow still requires a named owner
45.90 s
> warning: developer note schoonschip-network still requires a named owner
45.90 s
> warning: developer note gammaloop-draw-style-migration still requires a named owner
45.90 s
> warning: developer note gammaloop-drawing-architecture still requires a named owner
45.90 s
> warning: developer note spenso-symbolica-syntax-and-rewrites still requires a named owner
45.90 s
> warning: developer note spenso-architecture still requires a named owner
45.90 s
> warning: developer note idenso-architecture still requires a named owner
45.90 s
> warning: developer note idenso-form-color-dirac-source-map still requires a named owner
45.90 s
> warning: developer note linnet-architecture still requires a named owner
45.90 s
> warning: developer note vakint-architecture still requires a named owner
45.90 s
> warning: developer note gammaloop-roadmap still requires a named owner
45.90 s
> warning: developer note cff-surface-cache-ownership still requires a named owner
45.90 s
> warning: developer note gammaloop-drawing-evaluated-fields-history still requires a named owner
45.90 s
> warning: archived developer note gammaloop-drawing-evaluated-fields-history has no immutable evidence revision
45.90 s
> warning: developer note bnl-benchmark-investigation still requires a named owner
45.90 s
> warning: developer note bnl-contraction-order-performance still requires a named owner
45.90 s
> warning: developer note bnl-scalar-alias-capture still requires a named owner
45.90 s
> warning: developer note aa-aa-three-loop-performance-smoke still requires a named owner
45.90 s
> warning: developer note network-simplification still requires a named owner
45.90 s
> warning: investigation developer note network-simplification has no immutable evidence revision
45.90 s
> warning: developer note spenso-large-expressions still requires a named owner
45.90 s
> warning: developer note spenso-improvement-effects still requires a named owner
45.90 s
> warning: archived developer note spenso-improvement-effects has no immutable evidence revision
45.90 s
> warning: developer note spenso-test-baseline still requires a named owner
45.90 s
> warning: archived developer note spenso-test-baseline has no immutable evidence revision
45.90 s
> warning: developer note bnl-evaluator-atom-capture still requires a named owner
45.90 s
> warning: archived developer note bnl-evaluator-atom-capture has no immutable evidence revision
45.90 s
> warning: developer note uv-scalar-profile-benchmark still requires a named owner
45.90 s
> warning: archived developer note uv-scalar-profile-benchmark has no immutable evidence revision
45.90 s
> warning: developer note ci-test-failure-summary-2026-03-25 still requires a named owner
45.90 s
> warning: archived developer note ci-test-failure-summary-2026-03-25 has no immutable evidence revision
45.90 s
> warning: developer note network-execution-rebase-record still requires a named owner
45.90 s
> warning: archived developer note network-execution-rebase-record has no immutable evidence revision
45.90 s
> warning: developer note ratatui-integration-dashboard-history still requires a named owner
45.90 s
> warning: archived developer note ratatui-integration-dashboard-history has no immutable evidence revision
45.90 s
> warning: developer note nix-crane-cache-reuse still requires a named owner
45.90 s
>
45.90 s
> thread 'tests::pdf_manual_chapter_order_must_match_the_page_registry' (319) panicked at crates/alphal00p-docs-builder/src/lib.rs:11952:9:
45.90 s
> assertion failed: format!("{error:#}").contains("PDF manual chapter order differs")
45.90 s
> stack backtrace:
45.90 s
> 0: __rustc::rust_begin_unwind
45.90 s
> 1: core::panicking::panic_fmt
45.90 s
> 2: core::panicking::panic
45.90 s
> 3: alphal00p_docs_builder::tests::pdf_manual_chapter_order_must_match_the_page_registry
45.90 s
> 4: <alphal00p_docs_builder::tests::pdf_manual_chapter_order_must_match_the_page_registry::{closure#0} as core::ops::function::FnOnce<()>>::call_once
45.90 s
> note: Some details are omitted, run with `RUST_BACKTRACE=full` for a verbose backtrace.
45.90 s
>
45.90 s
> ------------
45.90 s
> Summary [ 11.979s] 111 tests run: 108 passed , 3 failed , 0 skipped
45.90 s
> FAIL [ 0.081s] ( 73/111) alphal00p-docs-builder tests :: checked_in_registry_is_valid
45.90 s
> stdout ---
45.90 s
>
45.90 s
> running 1 test
45.90 s
> test tests::checked_in_registry_is_valid ... FAILED
45.90 s
>
45.90 s
> failures:
45.90 s
>
45.90 s
> failures:
45.90 s
> tests::checked_in_registry_is_valid
45.90 s
>
45.90 s
> test result: FAILED. 0 passed; 1 failed; 0 ignored; 0 measured; 110 filtered out; finished in 0.08s
45.90 s
>
45.90 s
> stderr ---
45.90 s
> warning: developer note gammaloop-architecture still requires a named owner
45.90 s
> warning: developer note integration-dashboard still requires a named owner
45.90 s
> warning: developer note uv-renormalization still requires a named owner
45.90 s
> warning: developer note spenso-parsing-flow still requires a named owner
45.90 s
> warning: developer note schoonschip-network still requires a named owner
45.90 s
> warning: developer note gammaloop-draw-style-migration still requires a named owner
45.90 s
> warning: developer note gammaloop-drawing-architecture still requires a named owner
45.90 s
> warning: developer note spenso-symbolica-syntax-and-rewrites still requires a named owner
45.90 s
> warning: developer note spenso-architecture still requires a named owner
45.90 s
> warning: developer note idenso-architecture still requires a named owner
45.90 s
> warning: developer note idenso-form-color-dirac-source-map still requires a named owner
45.90 s
> warning: developer note linnet-architecture still requires a named owner
45.90 s
> warning: developer note vakint-architecture still requires a named owner
45.90 s
> warning: developer note gammaloop-roadmap still requires a named owner
45.90 s
> warning: developer note cff-surface-cache-ownership still requires a named owner
45.90 s
> warning: developer note gammaloop-drawing-evaluated-fields-history still requires a named owner
45.90 s
> warning: archived developer note gammaloop-drawing-evaluated-fields-history has no immutable evidence revision
45.90 s
> warning: developer note bnl-benchmark-investigation still requires a named owner
45.90 s
> warning: developer note bnl-contraction-order-performance still requires a named owner
45.90 s
> warning: developer note bnl-scalar-alias-capture still requires a named owner
45.90 s
> warning: developer note aa-aa-three-loop-performance-smoke still requires a named owner
45.90 s
> warning: developer note network-simplification still requires a named owner
45.90 s
> warning: investigation developer note network-simplification has no immutable evidence revision
45.90 s
> warning: developer note spenso-large-expressions still requires a named owner
45.90 s
> warning: developer note spenso-improvement-effects still requires a named owner
45.90 s
> warning: archived developer note spenso-improvement-effects has no immutable evidence revision
45.90 s
> warning: developer note spenso-test-baseline still requires a named owner
45.90 s
> warning: archived developer note spenso-test-baseline has no immutable evidence revision
45.90 s
> warning: developer note bnl-evaluator-atom-capture still requires a named owner
45.90 s
> warning: archived developer note bnl-evaluator-atom-capture has no immutable evidence revision
45.90 s
> warning: developer note uv-scalar-profile-benchmark still requires a named owner
45.90 s
> warning: archived developer note uv-scalar-profile-benchmark has no immutable evidence revision
45.90 s
> warning: developer note ci-test-failure-summary-2026-03-25 still requires a named owner
45.90 s
> warning: archived developer note ci-test-failure-summary-2026-03-25 has no immutable evidence revision
45.90 s
> warning: developer note network-execution-rebase-record still requires a named owner
45.90 s
> warning: archived developer note network-execution-rebase-record has no immutable evidence revision
45.90 s
> warning: developer note ratatui-integration-dashboard-history still requires a named owner
45.90 s
> warning: archived developer note ratatui-integration-dashboard-history has no immutable evidence revision
45.90 s
> warning: developer note nix-crane-cache-reuse still requires a named owner
45.90 s
>
45.90 s
> thread 'tests::checked_in_registry_is_valid' (174) panicked at crates/alphal00p-docs-builder/src/lib.rs:11887:50:
45.90 s
> called `Result::unwrap()` on an `Err` value: developer note nix-crane-cache-reuse verified scope flake.nix changed (expected 188504937418859942a6770ca21a4f4e0a7ff125, found 17dc35393f0f0abd5cb31c7eaf1fdc9aa6903ce4); owner review or an explicit no-impact attestation is required
45.90 s
>
45.90 s
> Location:
45.90 s
> crates/alphal00p-docs-builder/src/lib.rs:889:21
45.90 s
> stack backtrace:
45.90 s
> 0: __rustc::rust_begin_unwind
45.90 s
> 1: core::panicking::panic_fmt
45.90 s
> 2: core::result::unwrap_failed
45.90 s
> 3: alphal00p_docs_builder::tests::checked_in_registry_is_valid
45.90 s
> 4: <alphal00p_docs_builder::tests::checked_in_registry_is_valid::{closure#0} as core::ops::function::FnOnce<()>>::call_once
45.90 s
> note: Some details are omitted, run with `RUST_BACKTRACE=full` for a verbose backtrace.
45.90 s
>
45.90 s
> FAIL [ 0.076s] ( 82/111) alphal00p-docs-builder tests :: every_product_requires_a_task_chooser_and_each_supported_interface
45.90 s
> stdout ---
45.90 s
>
45.90 s
> running 1 test
45.90 s
> test tests::every_product_requires_a_task_chooser_and_each_supported_interface ... FAILED
45.90 s
>
45.90 s
> failures:
45.90 s
>
45.90 s
> failures:
45.90 s
> tests::every_product_requires_a_task_chooser_and_each_supported_interface
45.90 s
>
45.90 s
> test result: FAILED. 0 passed; 1 failed; 0 ignored; 0 measured; 110 filtered out; finished in 0.07s
45.90 s
>
45.90 s
> stderr ---
45.90 s
> warning: developer note gammaloop-architecture still requires a named owner
45.90 s
> warning: developer note integration-dashboard still requires a named owner
45.90 s
> warning: developer note uv-renormalization still requires a named owner
45.90 s
> warning: developer note spenso-parsing-flow still requires a named owner
45.90 s
> warning: developer note schoonschip-network still requires a named owner
45.90 s
> warning: developer note gammaloop-draw-style-migration still requires a named owner
45.90 s
> warning: developer note gammaloop-drawing-architecture still requires a named owner
45.90 s
> warning: developer note spenso-symbolica-syntax-and-rewrites still requires a named owner
45.90 s
> warning: developer note spenso-architecture still requires a named owner
45.90 s
> warning: developer note idenso-architecture still requires a named owner
45.90 s
> warning: developer note idenso-form-color-dirac-source-map still requires a named owner
45.90 s
> warning: developer note linnet-architecture still requires a named owner
45.90 s
> warning: developer note vakint-architecture still requires a named owner
45.90 s
> warning: developer note gammaloop-roadmap still requires a named owner
45.90 s
> warning: developer note cff-surface-cache-ownership still requires a named owner
45.90 s
> warning: developer note gammaloop-drawing-evaluated-fields-history still requires a named owner
45.90 s
> warning: archived developer note gammaloop-drawing-evaluated-fields-history has no immutable evidence revision
45.90 s
> warning: developer note bnl-benchmark-investigation still requires a named owner
45.90 s
> warning: developer note bnl-contraction-order-performance still requires a named owner
45.90 s
> warning: developer note bnl-scalar-alias-capture still requires a named owner
45.90 s
> warning: developer note aa-aa-three-loop-performance-smoke still requires a named owner
45.90 s
> warning: developer note network-simplification still requires a named owner
45.90 s
> warning: investigation developer note network-simplification has no immutable evidence revision
45.90 s
> warning: developer note spenso-large-expressions still requires a named owner
45.90 s
> warning: developer note spenso-improvement-effects still requires a named owner
45.90 s
> warning: archived developer note spenso-improvement-effects has no immutable evidence revision
45.90 s
> warning: developer note spenso-test-baseline still requires a named owner
45.90 s
> warning: archived developer note spenso-test-baseline has no immutable evidence revision
45.90 s
> warning: developer note bnl-evaluator-atom-capture still requires a named owner
45.90 s
> warning: archived developer note bnl-evaluator-atom-capture has no immutable evidence revision
45.90 s
> warning: developer note uv-scalar-profile-benchmark still requires a named owner
45.90 s
> warning: archived developer note uv-scalar-profile-benchmark has no immutable evidence revision
45.90 s
> warning: developer note ci-test-failure-summary-2026-03-25 still requires a named owner
45.90 s
> warning: archived developer note ci-test-failure-summary-2026-03-25 has no immutable evidence revision
45.90 s
> warning: developer note network-execution-rebase-record still requires a named owner
45.90 s
> warning: archived developer note network-execution-rebase-record has no immutable evidence revision
45.90 s
> warning: developer note ratatui-integration-dashboard-history still requires a named owner
45.90 s
> warning: archived developer note ratatui-integration-dashboard-history has no immutable evidence revision
45.90 s
> warning: developer note nix-crane-cache-reuse still requires a named owner
45.90 s
>
45.90 s
> thread 'tests::every_product_requires_a_task_chooser_and_each_supported_interface' (264) panicked at crates/alphal00p-docs-builder/src/lib.rs:11901:9:
45.90 s
> assertion failed: format!("{error:#}").contains("has no quickstart page")
45.90 s
> stack backtrace:
45.90 s
> 0: __rustc::rust_begin_unwind
45.90 s
> 1: core::panicking::panic_fmt
45.90 s
> 2: core::panicking::panic
45.90 s
> 3: alphal00p_docs_builder::tests::every_product_requires_a_task_chooser_and_each_supported_interface
45.90 s
> 4: <alphal00p_docs_builder::tests::every_product_requires_a_task_chooser_and_each_supported_interface::{closure#0} as core::ops::function::FnOnce<()>>::call_once
45.90 s
> note: Some details are omitted, run with `RUST_BACKTRACE=full` for a verbose backtrace.
45.90 s
>
45.90 s
> FAIL [ 0.067s] ( 93/111) alphal00p-docs-builder tests :: pdf_manual_chapter_order_must_match_the_page_registry
45.90 s
> stdout ---
45.90 s
>
45.90 s
> running 1 test
45.90 s
> test tests::pdf_manual_chapter_order_must_match_the_page_registry ... FAILED
45.90 s
>
45.90 s
> failures:
45.90 s
>
45.90 s
> failures:
45.90 s
> tests::pdf_manual_chapter_order_must_match_the_page_registry
45.90 s
>
45.90 s
> test result: FAILED. 0 passed; 1 failed; 0 ignored; 0 measured; 110 filtered out; finished in 0.06s
45.90 s
>
45.90 s
> stderr ---
45.90 s
> warning: developer note gammaloop-architecture still requires a named owner
45.90 s
> warning: developer note integration-dashboard still requires a named owner
45.90 s
> warning: developer note uv-renormalization still requires a named owner
45.90 s
> warning: developer note spenso-parsing-flow still requires a named owner
45.90 s
> warning: developer note schoonschip-network still requires a named owner
45.90 s
> warning: developer note gammaloop-draw-style-migration still requires a named owner
45.90 s
> warning: developer note gammaloop-drawing-architecture still requires a named owner
45.90 s
> warning: developer note spenso-symbolica-syntax-and-rewrites still requires a named owner
45.90 s
> warning: developer note spenso-architecture still requires a named owner
45.90 s
> warning: developer note idenso-architecture still requires a named owner
45.90 s
> warning: developer note idenso-form-color-dirac-source-map still requires a named owner
45.90 s
> warning: developer note linnet-architecture still requires a named owner
45.90 s
> warning: developer note vakint-architecture still requires a named owner
45.90 s
> warning: developer note gammaloop-roadmap still requires a named owner
45.90 s
> warning: developer note cff-surface-cache-ownership still requires a named owner
45.90 s
> warning: developer note gammaloop-drawing-evaluated-fields-history still requires a named owner
45.90 s
> warning: archived developer note gammaloop-drawing-evaluated-fields-history has no immutable evidence revision
45.90 s
> warning: developer note bnl-benchmark-investigation still requires a named owner
45.90 s
> warning: developer note bnl-contraction-order-performance still requires a named owner
45.90 s
> warning: developer note bnl-scalar-alias-capture still requires a named owner
45.90 s
> warning: developer note aa-aa-three-loop-performance-smoke still requires a named owner
45.90 s
> warning: developer note network-simplification still requires a named owner
45.90 s
> warning: investigation developer note network-simplification has no immutable evidence revision
45.90 s
> warning: developer note spenso-large-expressions still requires a named owner
45.90 s
> warning: developer note spenso-improvement-effects still requires a named owner
45.90 s
> warning: archived developer note spenso-improvement-effects has no immutable evidence revision
45.90 s
> warning: developer note spenso-test-baseline still requires a named owner
45.90 s
> warning: archived developer note spenso-test-baseline has no immutable evidence revision
45.90 s
> warning: developer note bnl-evaluator-atom-capture still requires a named owner
45.90 s
> warning: archived developer note bnl-evaluator-atom-capture has no immutable evidence revision
45.90 s
> warning: developer note uv-scalar-profile-benchmark still requires a named owner
45.90 s
> warning: archived developer note uv-scalar-profile-benchmark has no immutable evidence revision
45.90 s
> warning: developer note ci-test-failure-summary-2026-03-25 still requires a named owner
45.90 s
> warning: archived developer note ci-test-failure-summary-2026-03-25 has no immutable evidence revision
45.90 s
> warning: developer note network-execution-rebase-record still requires a named owner
45.90 s
> warning: archived developer note network-execution-rebase-record has no immutable evidence revision
45.90 s
> warning: developer note ratatui-integration-dashboard-history still requires a named owner
45.90 s
> warning: archived developer note ratatui-integration-dashboard-history has no immutable evidence revision
45.90 s
> warning: developer note nix-crane-cache-reuse still requires a named owner
45.90 s
>
45.90 s
> thread 'tests::pdf_manual_chapter_order_must_match_the_page_registry' (319) panicked at crates/alphal00p-docs-builder/src/lib.rs:11952:9:
45.90 s
> assertion failed: format!("{error:#}").contains("PDF manual chapter order differs")
45.90 s
> stack backtrace:
45.90 s
> 0: __rustc::rust_begin_unwind
45.90 s
> 1: core::panicking::panic_fmt
45.90 s
> 2: core::panicking::panic
45.90 s
> 3: alphal00p_docs_builder::tests::pdf_manual_chapter_order_must_match_the_page_registry
45.90 s
> 4: <alphal00p_docs_builder::tests::pdf_manual_chapter_order_must_match_the_page_registry::{closure#0} as core::ops::function::FnOnce<()>>::call_once
45.90 s
> note: Some details are omitted, run with `RUST_BACKTRACE=full` for a verbose backtrace.
45.90 s
>
45.90 s
> error : test run failed
45.90 s
>
45.90 s
> ========== nextest test summary ==========
45.90 s
> report: target/nextest/ci_gammaloop/junit.xml
45.90 s
> tests: 111, failures: 3, errors: 0
45.90 s
>
45.90 s
> 1. alphal00p-docs-builder::tests::checked_in_registry_is_valid
45.90 s
> failure: test failure with exit code 101
45.90 s
> thread 'tests::checked_in_registry_is_valid' (174) panicked at crates/alphal00p-docs-builder/src/lib.rs:11887:50:
45.90 s
> called `Result::unwrap()` on an `Err` value: developer note nix-crane-cache-reuse verified scope flake.nix changed (expected 188504937418859942a6770ca21a4f4e0a7ff125, found 17dc35393f0f0abd5cb31c7eaf1fdc9aa6903ce4); owner review or an explicit no-impact attestation is required
45.90 s
>
45.90 s
> Location:
45.90 s
> crates/alphal00p-docs-builder/src/lib.rs:889:21
45.90 s
> stack backtrace:
45.90 s
> 0: __rustc::rust_begin_unwind
45.90 s
> 1: core::panicking::panic_fmt
45.90 s
> 2: core::result::unwrap_failed
45.90 s
> 3: alphal00p_docs_builder::tests::checked_in_registry_is_valid
45.90 s
> 4: <alphal00p_docs_builder::tests::checked_in_registry_is_valid::{closure#0} as core::ops::function::FnOnce<()>>::call_once
45.90 s
> note: Some details are omitted, run with `RUST_BACKTRACE=full` for a verbose backtrace.
45.90 s
> system-out
45.90 s
> running 1 test
45.90 s
> test tests::checked_in_registry_is_valid ... FAILED
45.90 s
>
45.90 s
> failures:
45.90 s
>
45.90 s
> failures:
45.90 s
> tests::checked_in_registry_is_valid
45.90 s
>
45.90 s
> test result: FAILED. 0 passed; 1 failed; 0 ignored; 0 measured; 110 filtered out; finished in 0.08s
45.90 s
> system-err
45.90 s
> warning: developer note gammaloop-architecture still requires a named owner
45.90 s
> warning: developer note integration-dashboard still requires a named owner
45.90 s
> warning: developer note uv-renormalization still requires a named owner
45.90 s
> warning: developer note spenso-parsing-flow still requires a named owner
45.90 s
> warning: developer note schoonschip-network still requires a named owner
45.90 s
> warning: developer note gammaloop-draw-style-migration still requires a named owner
45.90 s
> warning: developer note gammaloop-drawing-architecture still requires a named owner
45.90 s
> warning: developer note spenso-symbolica-syntax-and-rewrites still requires a named owner
45.90 s
> warning: developer note spenso-architecture still requires a named owner
45.90 s
> warning: developer note idenso-architecture still requires a named owner
45.90 s
> warning: developer note idenso-form-color-dirac-source-map still requires a named owner
45.90 s
> warning: developer note linnet-architecture still requires a named owner
45.90 s
> warning: developer note vakint-architecture still requires a named owner
45.90 s
> warning: developer note gammaloop-roadmap still requires a named owner
45.90 s
> warning: developer note cff-surface-cache-ownership still requires a named owner
45.90 s
> warning: developer note gammaloop-drawing-evaluated-fields-history still requires a named owner
45.90 s
> warning: archived developer note gammaloop-drawing-evaluated-fields-history has no immutable evidence revision
45.90 s
> warning: developer note bnl-benchmark-investigation still requires a named owner
45.90 s
> warning: developer note bnl-contraction-order-performance still requires a named owner
45.90 s
> warning: developer note bnl-scalar-alias-capture still requires a named owner
45.90 s
> warning: developer note aa-aa-three-loop-performance-smoke still requires a named owner
45.90 s
> warning: developer note network-simplification still requires a named owner
45.90 s
> warning: investigation developer note network-simplification has no immutable evidence revision
45.90 s
> warning: developer note spenso-large-expressions still requires a named owner
45.90 s
> warning: developer note spenso-improvement-effects still requires a named owner
45.90 s
> warning: archived developer note spenso-improvement-effects has no immutable evidence revision
45.90 s
> warning: developer note spenso-test-baseline still requires a named owner
45.90 s
> warning: archived developer note spenso-test-baseline has no immutable evidence revision
45.90 s
> warning: developer note bnl-evaluator-atom-capture still requires a named owner
45.90 s
> warning: archived developer note bnl-evaluator-atom-capture has no immutable evidence revision
45.90 s
> warning: developer note uv-scalar-profile-benchmark still requires a named owner
45.90 s
> warning: archived developer note uv-scalar-profile-benchmark has no immutable evidence revision
45.90 s
> warning: developer note ci-test-failure-summary-2026-03-25 still requires a named owner
45.90 s
> warning: archived developer note ci-test-failure-summary-2026-03-25 has no immutable evidence revision
45.90 s
> warning: developer note network-execution-rebase-record still requires a named owner
45.90 s
> warning: archived developer note network-execution-rebase-record has no immutable evidence revision
45.90 s
> warning: developer note ratatui-integration-dashboard-history still requires a named owner
45.90 s
> warning: archived developer note ratatui-integration-dashboard-history has no immutable evidence revision
45.90 s
> warning: developer note nix-crane-cache-reuse still requires a named owner
45.90 s
>
45.90 s
> thread 'tests::checked_in_registry_is_valid' (174) panicked at crates/alphal00p-docs-builder/src/lib.rs:11887:50:
45.90 s
> called `Result::unwrap()` on an `Err` value: developer note nix-crane-cache-reuse verified scope flake.nix changed (expected 188504937418859942a6770ca21a4f4e0a7ff125, found 17dc35393f0f0abd5cb31c7eaf1fdc9aa6903ce4); owner review or an explicit no-impact attestation is required
45.90 s
>
45.90 s
> Location:
45.90 s
> crates/alphal00p-docs-builder/src/lib.rs:889:21
45.90 s
> stack backtrace:
45.90 s
> 0: __rustc::rust_begin_unwind
45.90 s
> 1: core::panicking::panic_fmt
45.90 s
> 2: core::result::unwrap_failed
45.90 s
> 3: alphal00p_docs_builder::tests::checked_in_registry_is_valid
45.90 s
> 4: <alphal00p_docs_builder::tests::checked_in_registry_is_valid::{closure#0} as core::ops::function::FnOnce<()>>::call_once
45.90 s
> note: Some details are omitted, run with `RUST_BACKTRACE=full` for a verbose backtrace.
45.90 s
>
45.90 s
> 2. alphal00p-docs-builder::tests::every_product_requires_a_task_chooser_and_each_supported_interface
45.90 s
> failure: test failure with exit code 101
45.90 s
> thread 'tests::every_product_requires_a_task_chooser_and_each_supported_interface' (264) panicked at crates/alphal00p-docs-builder/src/lib.rs:11901:9:
45.90 s
> assertion failed: format!("{error:#}").contains("has no quickstart page")
45.90 s
> stack backtrace:
45.90 s
> 0: __rustc::rust_begin_unwind
45.90 s
> 1: core::panicking::panic_fmt
45.90 s
> 2: core::panicking::panic
45.90 s
> 3: alphal00p_docs_builder::tests::every_product_requires_a_task_chooser_and_each_supported_interface
45.90 s
> 4: <alphal00p_docs_builder::tests::every_product_requires_a_task_chooser_and_each_supported_interface::{closure#0} as core::ops::function::FnOnce<()>>::call_once
45.90 s
> note: Some details are omitted, run with `RUST_BACKTRACE=full` for a verbose backtrace.
45.90 s
> system-out
45.90 s
> running 1 test
45.90 s
> test tests::every_product_requires_a_task_chooser_and_each_supported_interface ... FAILED
45.90 s
>
45.90 s
> failures:
45.90 s
>
45.90 s
> failures:
45.90 s
> tests::every_product_requires_a_task_chooser_and_each_supported_interface
45.90 s
>
45.90 s
> test result: FAILED. 0 passed; 1 failed; 0 ignored; 0 measured; 110 filtered out; finished in 0.07s
45.90 s
> system-err
45.90 s
> warning: developer note gammaloop-architecture still requires a named owner
45.90 s
> warning: developer note integration-dashboard still requires a named owner
45.90 s
> warning: developer note uv-renormalization still requires a named owner
45.90 s
> warning: developer note spenso-parsing-flow still requires a named owner
45.90 s
> warning: developer note schoonschip-network still requires a named owner
45.90 s
> warning: developer note gammaloop-draw-style-migration still requires a named owner
45.90 s
> warning: developer note gammaloop-drawing-architecture still requires a named owner
45.90 s
> warning: developer note spenso-symbolica-syntax-and-rewrites still requires a named owner
45.90 s
> warning: developer note spenso-architecture still requires a named owner
45.90 s
> warning: developer note idenso-architecture still requires a named owner
45.90 s
> warning: developer note idenso-form-color-dirac-source-map still requires a named owner
45.90 s
> warning: developer note linnet-architecture still requires a named owner
45.90 s
> warning: developer note vakint-architecture still requires a named owner
45.90 s
> warning: developer note gammaloop-roadmap still requires a named owner
45.90 s
> warning: developer note cff-surface-cache-ownership still requires a named owner
45.90 s
> warning: developer note gammaloop-drawing-evaluated-fields-history still requires a named owner
45.90 s
> warning: archived developer note gammaloop-drawing-evaluated-fields-history has no immutable evidence revision
45.90 s
> warning: developer note bnl-benchmark-investigation still requires a named owner
45.90 s
> warning: developer note bnl-contraction-order-performance still requires a named owner
45.90 s
> warning: developer note bnl-scalar-alias-capture still requires a named owner
45.90 s
> warning: developer note aa-aa-three-loop-performance-smoke still requires a named owner
45.90 s
> warning: developer note network-simplification still requires a named owner
45.90 s
> warning: investigation developer note network-simplification has no immutable evidence revision
45.90 s
> warning: developer note spenso-large-expressions still requires a named owner
45.90 s
> warning: developer note spenso-improvement-effects still requires a named owner
45.90 s
> warning: archived developer note spenso-improvement-effects has no immutable evidence revision
45.90 s
> warning: developer note spenso-test-baseline still requires a named owner
45.90 s
> warning: archived developer note spenso-test-baseline has no immutable evidence revision
45.90 s
> warning: developer note bnl-evaluator-atom-capture still requires a named owner
45.90 s
> warning: archived developer note bnl-evaluator-atom-capture has no immutable evidence revision
45.90 s
> warning: developer note uv-scalar-profile-benchmark still requires a named owner
45.90 s
> warning: archived developer note uv-scalar-profile-benchmark has no immutable evidence revision
45.90 s
> warning: developer note ci-test-failure-summary-2026-03-25 still requires a named owner
45.90 s
> warning: archived developer note ci-test-failure-summary-2026-03-25 has no immutable evidence revision
45.90 s
> warning: developer note network-execution-rebase-record still requires a named owner
45.90 s
> warning: archived developer note network-execution-rebase-record has no immutable evidence revision
45.90 s
> warning: developer note ratatui-integration-dashboard-history still requires a named owner
45.90 s
> warning: archived developer note ratatui-integration-dashboard-history has no immutable evidence revision
45.90 s
> warning: developer note nix-crane-cache-reuse still requires a named owner
45.90 s
>
45.90 s
> thread 'tests::every_product_requires_a_task_chooser_and_each_supported_interface' (264) panicked at crates/alphal00p-docs-builder/src/lib.rs:11901:9:
45.90 s
> assertion failed: format!("{error:#}").contains("has no quickstart page")
45.90 s
> stack backtrace:
45.90 s
> 0: __rustc::rust_begin_unwind
45.90 s
> 1: core::panicking::panic_fmt
45.90 s
> 2: core::panicking::panic
45.90 s
> 3: alphal00p_docs_builder::tests::every_product_requires_a_task_chooser_and_each_supported_interface
45.90 s
> 4: <alphal00p_docs_builder::tests::every_product_requires_a_task_chooser_and_each_supported_interface::{closure#0} as core::ops::function::FnOnce<()>>::call_once
45.90 s
> note: Some details are omitted, run with `RUST_BACKTRACE=full` for a verbose backtrace.
45.90 s
>
45.90 s
> 3. alphal00p-docs-builder::tests::pdf_manual_chapter_order_must_match_the_page_registry
45.90 s
> failure: test failure with exit code 101
45.90 s
> thread 'tests::pdf_manual_chapter_order_must_match_the_page_registry' (319) panicked at crates/alphal00p-docs-builder/src/lib.rs:11952:9:
45.90 s
> assertion failed: format!("{error:#}").contains("PDF manual chapter order differs")
45.90 s
> stack backtrace:
45.90 s
> 0: __rustc::rust_begin_unwind
45.90 s
> 1: core::panicking::panic_fmt
45.90 s
> 2: core::panicking::panic
45.90 s
> 3: alphal00p_docs_builder::tests::pdf_manual_chapter_order_must_match_the_page_registry
45.90 s
> 4: <alphal00p_docs_builder::tests::pdf_manual_chapter_order_must_match_the_page_registry::{closure#0} as core::ops::function::FnOnce<()>>::call_once
45.90 s
> note: Some details are omitted, run with `RUST_BACKTRACE=full` for a verbose backtrace.
45.90 s
> system-out
45.90 s
> running 1 test
45.90 s
> test tests::pdf_manual_chapter_order_must_match_the_page_registry ... FAILED
45.90 s
>
45.90 s
> failures:
45.90 s
>
45.90 s
> failures:
45.90 s
> tests::pdf_manual_chapter_order_must_match_the_page_registry
45.90 s
>
45.90 s
> test result: FAILED. 0 passed; 1 failed; 0 ignored; 0 measured; 110 filtered out; finished in 0.06s
45.90 s
> system-err
45.90 s
> warning: developer note gammaloop-architecture still requires a named owner
45.90 s
> warning: developer note integration-dashboard still requires a named owner
45.90 s
> warning: developer note uv-renormalization still requires a named owner
45.90 s
> warning: developer note spenso-parsing-flow still requires a named owner
45.90 s
> warning: developer note schoonschip-network still requires a named owner
45.90 s
> warning: developer note gammaloop-draw-style-migration still requires a named owner
45.90 s
> warning: developer note gammaloop-drawing-architecture still requires a named owner
45.90 s
> warning: developer note spenso-symbolica-syntax-and-rewrites still requires a named owner
45.90 s
> warning: developer note spenso-architecture still requires a named owner
45.90 s
> warning: developer note idenso-architecture still requires a named owner
45.90 s
> warning: developer note idenso-form-color-dirac-source-map still requires a named owner
45.90 s
> warning: developer note linnet-architecture still requires a named owner
45.90 s
> warning: developer note vakint-architecture still requires a named owner
45.90 s
> warning: developer note gammaloop-roadmap still requires a named owner
45.90 s
> warning: developer note cff-surface-cache-ownership still requires a named owner
45.90 s
> warning: developer note gammaloop-drawing-evaluated-fields-history still requires a named owner
45.90 s
> warning: archived developer note gammaloop-drawing-evaluated-fields-history has no immutable evidence revision
45.90 s
> warning: developer note bnl-benchmark-investigation still requires a named owner
45.90 s
> warning: developer note bnl-contraction-order-performance still requires a named owner
45.90 s
> warning: developer note bnl-scalar-alias-capture still requires a named owner
45.90 s
> warning: developer note aa-aa-three-loop-performance-smoke still requires a named owner
45.90 s
> warning: developer note network-simplification still requires a named owner
45.90 s
> warning: investigation developer note network-simplification has no immutable evidence revision
45.90 s
> warning: developer note spenso-large-expressions still requires a named owner
45.90 s
> warning: developer note spenso-improvement-effects still requires a named owner
45.90 s
> warning: archived developer note spenso-improvement-effects has no immutable evidence revision
45.90 s
> warning: developer note spenso-test-baseline still requires a named owner
45.90 s
> warning: archived developer note spenso-test-baseline has no immutable evidence revision
45.90 s
> warning: developer note bnl-evaluator-atom-capture still requires a named owner
45.90 s
> warning: archived developer note bnl-evaluator-atom-capture has no immutable evidence revision
45.90 s
> warning: developer note uv-scalar-profile-benchmark still requires a named owner
45.90 s
> warning: archived developer note uv-scalar-profile-benchmark has no immutable evidence revision
45.90 s
> warning: developer note ci-test-failure-summary-2026-03-25 still requires a named owner
45.90 s
> warning: archived developer note ci-test-failure-summary-2026-03-25 has no immutable evidence revision
45.90 s
> warning: developer note network-execution-rebase-record still requires a named owner
45.90 s
> warning: archived developer note network-execution-rebase-record has no immutable evidence revision
45.90 s
> warning: developer note ratatui-integration-dashboard-history still requires a named owner
45.90 s
> warning: archived developer note ratatui-integration-dashboard-history has no immutable evidence revision
45.90 s
> warning: developer note nix-crane-cache-reuse still requires a named owner
45.90 s
>
45.90 s
> thread 'tests::pdf_manual_chapter_order_must_match_the_page_registry' (319) panicked at crates/alphal00p-docs-builder/src/lib.rs:11952:9:
45.90 s
> assertion failed: format!("{error:#}").contains("PDF manual chapter order differs")
45.90 s
> stack backtrace:
45.90 s
> 0: __rustc::rust_begin_unwind
45.90 s
> 1: core::panicking::panic_fmt
45.90 s
> 2: core::panicking::panic
45.90 s
> 3: alphal00p_docs_builder::tests::pdf_manual_chapter_order_must_match_the_page_registry
45.90 s
> 4: <alphal00p_docs_builder::tests::pdf_manual_chapter_order_must_match_the_page_registry::{closure#0} as core::ops::function::FnOnce<()>>::call_once
45.90 s
> note: Some details are omitted, run with `RUST_BACKTRACE=full` for a verbose backtrace.
45.90 s
> =========================================
45.90 s
> Extracting 2 binaries to /build/source
45.90 s
> Extracted 5 files to /build/source in 0.03s
45.90 s
> ------------
45.90 s
> Nextest run ID b5ec9295-bd27-4aca-beb9-fcef7602151e with nextest profile: ci_gammaloop
45.90 s
> Starting 22 tests across 2 binaries
45.90 s
> ------------
45.90 s
> Summary [ 0.015s] 22 tests run: 22 passed , 0 skipped
45.90 s
>
45.90 s
> ========== nextest test summary ==========
45.90 s
> report: target/nextest/ci_gammaloop/junit.xml
45.90 s
> tests: 22, failures: 0, errors: 0
45.90 s
> No failing testcases found.
45.90 s
> =========================================
45.90 s
> Extracting 1 binary, 1 build script output directory, and 2 linked paths to /build/source
45.90 s
> Extracted 18 files to /build/source in 0.06s
45.90 s
> ------------
45.90 s
> Nextest run ID ec48143d-5129-40e1-9b37-99d6a8e401bb with nextest profile: ci_gammaloop
45.90 s
> Starting 89 tests across 1 binary
45.90 s
> ------------
45.90 s
> Summary [ 0.038s] 89 tests run: 89 passed , 0 skipped
45.90 s
>
45.90 s
> ========== nextest test summary ==========
45.90 s
> report: target/nextest/ci_gammaloop/junit.xml
45.90 s
> tests: 89, failures: 0, errors: 0
45.90 s
> No failing testcases found.
45.90 s
> =========================================
45.90 s
> Extracting 2 binaries to /build/source
45.90 s
> Extracted 5 files to /build/source in 0.04s
45.90 s
> ------------
45.90 s
> Nextest run ID 27e0d0fb-7422-4650-9a76-7bc5d97b8e5b with nextest profile: ci_gammaloop
45.90 s
> Starting 10 tests across 2 binaries
45.90 s
> ------------
45.90 s
> Summary [ 10.712s] 10 tests run: 10 passed , 0 skipped
45.90 s
>
45.90 s
> ========== nextest test summary ==========
45.90 s
> report: target/nextest/ci_gammaloop/junit.xml
45.90 s
> tests: 10, failures: 0, errors: 0
45.90 s
> No failing testcases found.
45.90 s
> =========================================
45.90 s
> Extracting 1 binary to /build/source
45.90 s
> Extracted 4 files to /build/source in 0.03s
45.90 s
> ------------
45.90 s
> Nextest run ID 31d27f9f-40eb-48b6-845b-7bf9c9e7e530 with nextest profile: ci_gammaloop
45.90 s
> Starting 0 tests across 1 binary
45.90 s
> ------------
45.90 s
> Summary [ 0.000s] 0 tests run: 0 passed , 0 skipped
45.90 s
>
45.90 s
> ========== nextest test summary ==========
45.90 s
> report: target/nextest/ci_gammaloop/junit.xml
45.90 s
> tests: 0, failures: 0, errors: 0
45.90 s
> No failing testcases found.
45.90 s
> =========================================
45.90 s
> Extracting 1 binary to /build/source
45.90 s
> Extracted 4 files to /build/source in 0.03s
45.90 s
> ------------
45.90 s
> Nextest run ID 8ca909f3-8571-4df9-a35d-79f2b1f95750 with nextest profile: ci_gammaloop
45.90 s
> Starting 5 tests across 1 binary
45.90 s
> ------------
45.90 s
> Summary [ 0.005s] 5 tests run: 5 passed , 0 skipped
45.90 s
>
45.90 s
> ========== nextest test summary ==========
45.90 s
> report: target/nextest/ci_gammaloop/junit.xml
45.90 s
> tests: 5, failures: 0, errors: 0
45.90 s
> No failing testcases found.
45.90 s
> =========================================
45.90 s
For full logs, run:
45.90 s
nix log /nix/store/ig2n8vvnnpdbrss20g10xh19f2x4lxrl-gammaloop-nextest-docs.drv
46.02 s
[1 built (1 failed ), 7 cRun failed.