1. 0.00 s $ /nix/store/9ypz3flqsrl5xl495mm8h645gadjsxi1-coreutils-9.11/bin/timeout --kill-after=15s 7200s /nix/store/23zk8sgzamrbmj1fday15szf7f2279s8-nix-2.34.7/bin/nix --extra-experimental-features nix-command --extra-experimental-features flakes flake clone git+https://github.com/alphal00p/gammaloop --dest /tmp/nix-ci-worker/stable-pwd/repo/
  2. 0.07 s Cloning into '/tmp/nix-ci-worker/stable-pwd/repo'...
  3. 1.88 s remote: Enumerating objects: 63875 remote: Enumerating objects: 78252, done.
  4. 2.45 s remote: Counting objects: 0% (1/14377) remote: Counting objects: 1% (144/14377) remote: Counting objects: 2% (288/14377) remote: Counting objects: 3% (432/14377) remote: Counting objects: 4% (576/14377) remote: Counting objects: 5% (719/14377) remote: Counting objects: 6% (863/14377) remote: Counting objects: 7% (1007/14377) remote: Counting objects: 8% (1151/14377) remote: Counting objects: 9% (1294/14377) remote: Counting objects: 10% (1438/14377) remote: Counting objects: 11% (1582/14377) remote: Counting objects: 12% (1726/14377) remote: Counting objects: 13% (1870/14377) remote: Counting objects: 14% (2013/14377) remote: Counting objects: 15% (2157/14377) remote: Counting objects: 16% (2301/14377) remote: Counting objects: 17% (2445/14377) remote: Counting objects: 18% (2588/14377) remote: Counting objects: 19% (2732/14377) remote: Counting objects: 20% (2876/14377) remote: Counting objects: 21% (3020/14377) remote: Counting objects: 22% (3163/14377) remote: Counting objects: 23% (3307/14377) remote: Counting objects: 24% (3451/14377) remote: Counting objects: 25% (3595/14377) remote: Counting objects: 26% (3739/14377) remote: Counting objects: 27% (3882/14377) remote: Counting objects: 28% (4026/14377) remote: Counting objects: 29% (4170/14377) remote: Counting objects: 30% (4314/14377) remote: Counting objects: 31% (4457/14377) remote: Counting objects: 32% (4601/14377) remote: Counting objects: 33% (4745/14377) remote: Counting objects: 34% (4889/14377) remote: Counting objects: 35% (5032/14377) remote: Counting objects: 36% (5176/14377) remote: Counting objects: 37% (5320/14377) remote: Counting objects: 38% (5464/14377) remote: Counting objects: 39% (5608/14377) remote: Counting objects: 40% (5751/14377) remote: Counting objects: 41% (5895/14377) remote: Counting objects: 42% (6039/14377) remote: Counting objects: 43% (6183/14377) remote: Counting objects: 44% (6326/14377) remote: Counting objects: 45% (6470/14377) remote: Counting objects: 46% (6614/14377) remote: Counting objects: 47% (6758/14377) remote: Counting objects: 48% (6901/14377) remote: Counting objects: 49% (7045/14377) remote: Counting objects: 50% (7189/14377) remote: Counting objects: 51% (7333/14377) remote: Counting objects: 52% (7477/14377) remote: Counting objects: 53% (7620/14377) remote: Counting objects: 54% (7764/14377) remote: Counting objects: 55% (7908/14377) remote: Counting objects: 56% (8052/14377) remote: Counting objects: 57% (8195/14377) remote: Counting objects: 58% (8339/14377) remote: Counting objects: 59% (8483/14377) remote: Counting objects: 60% (8627/14377) remote: Counting objects: 61% (8770/14377) remote: Counting objects: 62% (8914/14377) remote: Counting objects: 63% (9058/14377) remote: Counting objects: 64% (9202/14377) remote: Counting objects: 65% (9346/14377) remote: Counting objects: 66% (9489/14377) remote: Counting objects: 67% (9633/14377) remote: Counting objects: 68% (9777/14377) remote: Counting objects: 69% (9921/14377) remote: Counting objects: 70% (10064/14377) remote: Counting objects: 71% (10208/14377) remote: Counting objects: 72% (10352/14377) remote: Counting objects: 73% (10496/14377) remote: Counting objects: 74% (10639/14377) remote: Counting objects: 75% (10783/14377) remote: Counting objects: 76% (10927/14377) remote: Counting objects: 77% (11071/14377) remote: Counting objects: 78% (11215/14377) remote: Counting objects: 79% (11358/14377) remote: Counting objects: 80% (11502/14377) remote: Counting objects: 81% (11646/14377) remote: Counting objects: 82% (11790/14377) remote: Counting objects: 83% (11933/14377) remote: Counting objects: 84% (12077/14377) remote: Counting objects: 85% (12221/14377) remote: Counting objects: 86% (12365/14377) remote: Counting objects: 87% (12508/14377) remote: Counting objects: 88% (12652/14377) remote: Counting objects: 89% (12796/14377) remote: Counting objects: 90% (12940/14377) remote: Counting objects: 91% (13084/14377) remote: Counting objects: 92% (13227/14377) remote: Counting objects: 93% (13371/14377) remote: Counting objects: 94% (13515/14377) remote: Counting objects: 95% (13659/14377) remote: Counting objects: 96% (13802/14377) remote: Counting objects: 97% (13946/14377) remote: Counting objects: 98% (14090/14377) remote: Counting objects: 99% (14234/14377) remote: Counting objects: 100% (14377/14377) remote: Counting objects: 100% (14377/14377), done.
  5. 5.10 s remote: Compressing objects: 0% (1/3260) remote: Compressing objects: 1% (33/3260) remote: Compressing objects: 2% (66/3260) remote: Compressing objects: 3% (98/3260) remote: Compressing objects: 4% (131/3260) remote: Compressing objects: 5% (163/3260) remote: Compressing objects: 6% (196/3260) remote: Compressing objects: 7% (229/3260) remote: Compressing objects: 8% (261/3260) remote: Compressing objects: 9% (294/3260) remote: Compressing objects: 10% (326/3260) remote: Compressing objects: 11% (359/3260) remote: Compressing objects: 12% (392/3260) remote: Compressing objects: 13% (424/3260) remote: Compressing objects: 14% (457/3260) remote: Compressing objects: 15% (489/3260) remote: Compressing objects: 16% (522/3260) remote: Compressing objects: 17% (555/3260) remote: Compressing objects: 18% (587/3260) remote: Compressing objects: 19% (620/3260) remote: Compressing objects: 20% (652/3260) remote: Compressing objects: 21% (685/3260) remote: Compressing objects: 22% (718/3260) remote: Compressing objects: 23% (750/3260) remote: Compressing objects: 24% (783/3260) remote: Compressing objects: 24% (814/3260) remote: Compressing objects: 25% (815/3260) remote: Compressing objects: 26% (848/3260) remote: Compressing objects: 27% (881/3260) remote: Compressing objects: 27% (894/3260) remote: Compressing objects: 28% (913/3260) remote: Compressing objects: 29% (946/3260) remote: Compressing objects: 30% (978/3260) remote: Compressing objects: 31% (1011/3260) remote: Compressing objects: 32% (1044/3260) remote: Compressing objects: 33% (1076/3260) remote: Compressing objects: 34% (1109/3260) remote: Compressing objects: 35% (1141/3260) remote: Compressing objects: 36% (1174/3260) remote: Compressing objects: 36% (1194/3260) remote: Compressing objects: 37% (1207/3260) remote: Compressing objects: 38% (1239/3260) remote: Compressing objects: 39% (1272/3260) remote: Compressing objects: 40% (1304/3260) remote: Compressing objects: 41% (1337/3260) remote: Compressing objects: 42% (1370/3260) remote: Compressing objects: 43% (1402/3260) remote: Compressing objects: 44% (1435/3260) remote: Compressing objects: 45% (1467/3260) remote: Compressing objects: 46% (1500/3260) remote: Compressing objects: 47% (1533/3260) remote: Compressing objects: 48% (1565/3260) remote: Compressing objects: 49% (1598/3260) remote: Compressing objects: 50% (1630/3260) remote: Compressing objects: 51% (1663/3260) remote: Compressing objects: 52% (1696/3260) remote: Compressing objects: 53% (1728/3260) remote: Compressing objects: 54% (1761/3260) remote: Compressing objects: 55% (1793/3260) remote: Compressing objects: 56% (1826/3260) remote: Compressing objects: 57% (1859/3260) remote: Compressing objects: 58% (1891/3260) remote: Compressing objects: 59% (1924/3260) remote: Compressing objects: 60% (1956/3260) remote: Compressing objects: 61% (1989/3260) remote: Compressing objects: 62% (2022/3260) remote: Compressing objects: 63% (2054/3260) remote: Compressing objects: 64% (2087/3260) remote: Compressing objects: 65% (2119/3260) remote: Compressing objects: 66% (2152/3260) remote: Compressing objects: 67% (2185/3260) remote: Compressing objects: 68% (2217/3260) remote: Compressing objects: 69% (2250/3260) remote: Compressing objects: 70% (2282/3260) remote: Compressing objects: 71% (2315/3260) remote: Compressing objects: 72% (2348/3260) remote: Compressing objects: 73% (2380/3260) remote: Compressing objects: 74% (2413/3260) remote: Compressing objects: 75% (2445/3260) remote: Compressing objects: 76% (2478/3260) remote: Compressing objects: 77% (2511/3260) remote: Compressing objects: 78% (2543/3260) remote: Compressing objects: 79% (2576/3260) remote: Compressing objects: 80% (2608/3260) remote: Compressing objects: 81% (2641/3260) remote: Compressing objects: 82% (2674/3260) remote: Compressing objects: 83% (2706/3260) remote: Compressing objects: 84% (2739/3260) remote: Compressing objects: 85% (2771/3260) remote: Compressing objects: 86% (2804/3260) remote: Compressing objects: 87% (2837/3260) remote: Compressing objects: 88% (2869/3260) remote: Compressing objects: 89% (2902/3260) remote: Compressing objects: 90% (2934/3260) remote: Compressing objects: 91% (2967/3260) remote: Compressing objects: 92% (3000/3260) remote: Compressing objects: 93% (3032/3260) remote: Compressing objects: 94% (3065/3260) remote: Compressing objects: 95% (3097/3260) remote: Compressing objects: 96% (3130/3260) remote: Compressing objects: 97% (3163/3260) remote: Compressing objects: 98% (3195/3260) remote: Compressing objects: 99% (3228/3260) remote: Compressing objects: 100% (3260/3260) remote: Compressing objects: 100% (3260/3260), done.
  6. 8.77 s Receiving objects: 0% (1/78252) Receiving objects: 1% (783/78252) Receiving objects: 2% (1566/78252) Receiving objects: 3% (2348/78252) Receiving objects: 4% (3131/78252) Receiving objects: 5% (3913/78252) Receiving objects: 6% (4696/78252) Receiving objects: 7% (5478/78252) Receiving objects: 8% (6261/78252) Receiving objects: 9% (7043/78252) Receiving objects: 10% (7826/78252), 12.50 MiB | 24.98 MiB/s Receiving objects: 11% (8608/78252), 12.50 MiB | 24.98 MiB/s Receiving objects: 12% (9391/78252), 12.50 MiB | 24.98 MiB/s Receiving objects: 13% (10173/78252), 12.50 MiB | 24.98 MiB/s Receiving objects: 14% (10956/78252), 12.50 MiB | 24.98 MiB/s Receiving objects: 15% (11738/78252), 12.50 MiB | 24.98 MiB/s Receiving objects: 16% (12521/78252), 12.50 MiB | 24.98 MiB/s Receiving objects: 17% (13303/78252), 12.50 MiB | 24.98 MiB/s Receiving objects: 18% (14086/78252), 12.50 MiB | 24.98 MiB/s Receiving objects: 19% (14868/78252), 12.50 MiB | 24.98 MiB/s Receiving objects: 20% (15651/78252), 12.50 MiB | 24.98 MiB/s Receiving objects: 21% (16433/78252), 12.50 MiB | 24.98 MiB/s Receiving objects: 22% (17216/78252), 12.50 MiB | 24.98 MiB/s Receiving objects: 23% (17998/78252), 12.50 MiB | 24.98 MiB/s Receiving objects: 24% (18781/78252), 12.50 MiB | 24.98 MiB/s Receiving objects: 25% (19563/78252), 12.50 MiB | 24.98 MiB/s Receiving objects: 26% (20346/78252), 12.50 MiB | 24.98 MiB/s Receiving objects: 27% (21129/78252), 12.50 MiB | 24.98 MiB/s Receiving objects: 28% (21911/78252), 12.50 MiB | 24.98 MiB/s Receiving objects: 29% (22694/78252), 12.50 MiB | 24.98 MiB/s Receiving objects: 30% (23476/78252), 12.50 MiB | 24.98 MiB/s Receiving objects: 31% (24259/78252), 12.50 MiB | 24.98 MiB/s Receiving objects: 32% (25041/78252), 12.50 MiB | 24.98 MiB/s Receiving objects: 33% (25824/78252), 12.50 MiB | 24.98 MiB/s Receiving objects: 34% (26606/78252), 12.50 MiB | 24.98 MiB/s Receiving objects: 35% (27389/78252), 12.50 MiB | 24.98 MiB/s Receiving objects: 36% (28171/78252), 12.50 MiB | 24.98 MiB/s Receiving objects: 37% (28954/78252), 12.50 MiB | 24.98 MiB/s Receiving objects: 38% (29736/78252), 12.50 MiB | 24.98 MiB/s Receiving objects: 39% (30519/78252), 12.50 MiB | 24.98 MiB/s Receiving objects: 40% (31301/78252), 12.50 MiB | 24.98 MiB/s Receiving objects: 41% (32084/78252), 12.50 MiB | 24.98 MiB/s Receiving objects: 41% (32625/78252), 30.47 MiB | 30.46 MiB/s Receiving objects: 42% (32866/78252), 30.47 MiB | 30.46 MiB/s Receiving objects: 43% (33649/78252), 30.47 MiB | 30.46 MiB/s Receiving objects: 44% (34431/78252), 30.47 MiB | 30.46 MiB/s Receiving objects: 45% (35214/78252), 30.47 MiB | 30.46 MiB/s Receiving objects: 46% (35996/78252), 30.47 MiB | 30.46 MiB/s Receiving objects: 47% (36779/78252), 30.47 MiB | 30.46 MiB/s Receiving objects: 48% (37561/78252), 30.47 MiB | 30.46 MiB/s Receiving objects: 49% (38344/78252), 30.47 MiB | 30.46 MiB/s Receiving objects: 50% (39126/78252), 30.47 MiB | 30.46 MiB/s Receiving objects: 51% (39909/78252), 46.86 MiB | 31.17 MiB/s Receiving objects: 52% (40692/78252), 46.86 MiB | 31.17 MiB/s Receiving objects: 53% (41474/78252), 46.86 MiB | 31.17 MiB/s Receiving objects: 54% (42257/78252), 46.86 MiB | 31.17 MiB/s Receiving objects: 55% (43039/78252), 46.86 MiB | 31.17 MiB/s Receiving objects: 56% (43822/78252), 46.86 MiB | 31.17 MiB/s Receiving objects: 57% (44604/78252), 46.86 MiB | 31.17 MiB/s Receiving objects: 58% (45387/78252), 46.86 MiB | 31.17 MiB/s Receiving objects: 59% (46169/78252), 46.86 MiB | 31.17 MiB/s Receiving objects: 60% (46952/78252), 46.86 MiB | 31.17 MiB/s Receiving objects: 61% (47734/78252), 46.86 MiB | 31.17 MiB/s Receiving objects: 62% (48517/78252), 46.86 MiB | 31.17 MiB/s Receiving objects: 62% (48717/78252), 64.50 MiB | 31.84 MiB/s Receiving objects: 63% (49299/78252), 64.50 MiB | 31.84 MiB/s Receiving objects: 64% (50082/78252), 64.50 MiB | 31.84 MiB/s Receiving objects: 65% (50864/78252), 64.50 MiB | 31.84 MiB/s Receiving objects: 66% (51647/78252), 64.50 MiB | 31.84 MiB/s Receiving objects: 67% (52429/78252), 64.50 MiB | 31.84 MiB/s Receiving objects: 68% (53212/78252), 64.50 MiB | 31.84 MiB/s Receiving objects: 69% (53994/78252), 64.50 MiB | 31.84 MiB/s Receiving objects: 70% (54777/78252), 64.50 MiB | 31.84 MiB/s Receiving objects: 71% (55559/78252), 64.50 MiB | 31.84 MiB/s Receiving objects: 72% (56342/78252), 64.50 MiB | 31.84 MiB/s Receiving objects: 73% (57124/78252), 82.42 MiB | 32.63 MiB/s Receiving objects: 74% (57907/78252), 82.42 MiB | 32.63 MiB/s Receiving objects: 75% (58689/78252), 82.42 MiB | 32.63 MiB/s Receiving objects: 76% (59472/78252), 82.42 MiB | 32.63 MiB/s Receiving objects: 77% (60255/78252), 82.42 MiB | 32.63 MiB/s Receiving objects: 78% (61037/78252), 82.42 MiB | 32.63 MiB/s Receiving objects: 79% (61820/78252), 82.42 MiB | 32.63 MiB/s Receiving objects: 79% (62509/78252), 82.42 MiB | 32.63 MiB/s Receiving objects: 80% (62602/78252), 82.42 MiB | 32.63 MiB/s Receiving objects: 81% (63385/78252), 99.48 MiB | 32.88 MiB/s Receiving objects: 82% (64167/78252), 99.48 MiB | 32.88 MiB/s Receiving objects: 83% (64950/78252), 99.48 MiB | 32.88 MiB/s Receiving objects: 84% (65732/78252), 99.48 MiB | 32.88 MiB/s Receiving objects: 85% (66515/78252), 99.48 MiB | 32.88 MiB/s Receiving objects: 86% (67297/78252), 99.48 MiB | 32.88 MiB/s Receiving objects: 87% (68080/78252), 99.48 MiB | 32.88 MiB/s Receiving objects: 88% (68862/78252), 99.48 MiB | 32.88 MiB/s Receiving objects: 89% (69645/78252), 99.48 MiB | 32.88 MiB/s Receiving objects: 90% (70427/78252), 99.48 MiB | 32.88 MiB/s Receiving objects: 91% (71210/78252), 99.48 MiB | 32.88 MiB/s Receiving objects: 92% (71992/78252), 99.48 MiB | 32.88 MiB/s Receiving objects: 93% (72775/78252), 99.48 MiB | 32.88 MiB/s Receiving objects: 94% (73557/78252), 117.17 MiB | 33.21 MiB/s Receiving objects: 95% (74340/78252), 117.17 MiB | 33.21 MiB/s Receiving objects: 96% (75122/78252), 117.17 MiB | 33.21 MiB/s Receiving objects: 97% (75905/78252), 117.17 MiB | 33.21 MiB/s Receiving objects: 98% (76687/78252), 117.17 MiB | 33.21 MiB/s Receiving objects: 99% (77470/78252), 117.17 MiB | 33.21 MiB/s remote: Total 78252 (delta 10129), reused 12101 (delta 9019), pack-reused 63875 (from 2)
  7. 8.77 s Receiving objects: 100% (78252/78252), 117.17 MiB | 33.21 MiB/s Receiving objects: 100% (78252/78252), 122.17 MiB | 33.31 MiB/s, done.
  8. 9.56 s Resolving deltas: 0% (0/53215) Resolving deltas: 1% (533/53215) Resolving deltas: 2% (1065/53215) Resolving deltas: 3% (1597/53215) Resolving deltas: 4% (2130/53215) Resolving deltas: 5% (2661/53215) Resolving deltas: 6% (3193/53215) Resolving deltas: 7% (3726/53215) Resolving deltas: 8% (4258/53215) Resolving deltas: 9% (4790/53215) Resolving deltas: 10% (5322/53215) Resolving deltas: 11% (5855/53215) Resolving deltas: 12% (6386/53215) Resolving deltas: 13% (6918/53215) Resolving deltas: 14% (7453/53215) Resolving deltas: 15% (7983/53215) Resolving deltas: 16% (8515/53215) Resolving deltas: 17% (9047/53215) Resolving deltas: 18% (9579/53215) Resolving deltas: 19% (10111/53215) Resolving deltas: 20% (10643/53215) Resolving deltas: 21% (11177/53215) Resolving deltas: 22% (11708/53215) Resolving deltas: 23% (12240/53215) Resolving deltas: 24% (12772/53215) Resolving deltas: 25% (13304/53215) Resolving deltas: 26% (13836/53215) Resolving deltas: 27% (14370/53215) Resolving deltas: 28% (14901/53215) Resolving deltas: 29% (15434/53215) Resolving deltas: 30% (15965/53215) Resolving deltas: 31% (16497/53215) Resolving deltas: 32% (17029/53215) Resolving deltas: 33% (17561/53215) Resolving deltas: 34% (18096/53215) Resolving deltas: 35% (18626/53215) Resolving deltas: 36% (19158/53215) Resolving deltas: 37% (19693/53215) Resolving deltas: 38% (20222/53215) Resolving deltas: 39% (20754/53215) Resolving deltas: 40% (21287/53215) Resolving deltas: 41% (21821/53215) Resolving deltas: 42% (22351/53215) Resolving deltas: 43% (22883/53215) Resolving deltas: 44% (23415/53215) Resolving deltas: 45% (23947/53215) Resolving deltas: 46% (24480/53215) Resolving deltas: 47% (25012/53215) Resolving deltas: 48% (25544/53215) Resolving deltas: 49% (26076/53215) Resolving deltas: 50% (26608/53215) Resolving deltas: 51% (27142/53215) Resolving deltas: 52% (27672/53215) Resolving deltas: 53% (28204/53215) Resolving deltas: 54% (28737/53215) Resolving deltas: 55% (29269/53215) Resolving deltas: 56% (29801/53215) Resolving deltas: 57% (30333/53215) Resolving deltas: 58% (30865/53215) Resolving deltas: 59% (31397/53215) Resolving deltas: 60% (31929/53215) Resolving deltas: 61% (32463/53215) Resolving deltas: 62% (32995/53215) Resolving deltas: 63% (33526/53215) Resolving deltas: 64% (34060/53215) Resolving deltas: 65% (34590/53215) Resolving deltas: 66% (35122/53215) Resolving deltas: 67% (35655/53215) Resolving deltas: 68% (36187/53215) Resolving deltas: 69% (36719/53215) Resolving deltas: 70% (37251/53215) Resolving deltas: 71% (37783/53215) Resolving deltas: 72% (38315/53215) Resolving deltas: 73% (38848/53215) Resolving deltas: 74% (39380/53215) Resolving deltas: 75% (39913/53215) Resolving deltas: 76% (40445/53215) Resolving deltas: 77% (40976/53215) Resolving deltas: 78% (41508/53215) Resolving deltas: 79% (42040/53215) Resolving deltas: 80% (42572/53215) Resolving deltas: 81% (43105/53215) Resolving deltas: 82% (43637/53215) Resolving deltas: 83% (44169/53215) Resolving deltas: 84% (44701/53215) Resolving deltas: 85% (45233/53215) Resolving deltas: 86% (45765/53215) Resolving deltas: 87% (46298/53215) Resolving deltas: 88% (46830/53215) Resolving deltas: 89% (47362/53215) Resolving deltas: 90% (47896/53215) Resolving deltas: 91% (48426/53215) Resolving deltas: 92% (48960/53215) Resolving deltas: 93% (49491/53215) Resolving deltas: 94% (50023/53215) Resolving deltas: 95% (50555/53215) Resolving deltas: 96% (51090/53215) Resolving deltas: 97% (51619/53215) Resolving deltas: 98% (52151/53215) Resolving deltas: 99% (52683/53215) Resolving deltas: 100% (53215/53215) Resolving deltas: 100% (53215/53215), done.
  9. 9.84 s Fetching commit bac4ee69535bb90006e6528450f950aef795f67f for push-vrpyqyylypmw ...
  10. 9.84 s $ /nix/store/bcnisk3ydfgv26v2gw3zlky24g00yww2-git-2.54.0/bin/git fetch origin bac4ee69535bb90006e6528450f950aef795f67f
  11. 10.33 s From https://github.com/alphal00p/gammaloop
  12. 10.33 s * branch bac4ee69535bb90006e6528450f950aef795f67f -> FETCH_HEAD
  13. 10.34 s $ /nix/store/9ypz3flqsrl5xl495mm8h645gadjsxi1-coreutils-9.11/bin/timeout --kill-after=15s 7200s /nix/store/bcnisk3ydfgv26v2gw3zlky24g00yww2-git-2.54.0/bin/git -c advice.detachedHead=false checkout bac4ee69535bb90006e6528450f950aef795f67f
  14. 10.53 s HEAD is now at bac4ee695 mirror Linnest and Kurvst standalone packages
  15. 10.54 s $ /nix/store/9ypz3flqsrl5xl495mm8h645gadjsxi1-coreutils-9.11/bin/timeout --kill-after=15s 7200s /nix/store/23zk8sgzamrbmj1fday15szf7f2279s8-nix-2.34.7/bin/nix --extra-experimental-features nix-command --extra-experimental-features flakes --log-format internal-json run .#packages.x86_64-linux.nix-ci-check-gammaloop-nextest-docs --print-build-logs
  16. 14.76 s
  17. 14.91 s Downloading cached gammaloop-nextest-binaries-docs-alphal00p-docs-builder from https://cache.nix-ci.com
  18. 14.91 s Downloading cached gammaloop-nextest-binaries-docs-alphal00p-docs-catalogs from https://cache.nix-ci.com
  19. 14.91 s Downloading cached gammaloop-nextest-binaries-docs-alphal00p-docs-examples from https://cache.nix-ci.com
  20. 14.91 s Downloading cached gammaloop-nextest-binaries-docs-alphal00p-docs-macros from https://cache.nix-ci.com
  21. 14.91 s Downloading cached gammaloop-nextest-binaries-docs-alphal00p-docs-python-exporter from https://cache.nix-ci.com
  22. 14.91 s Downloading cached gammaloop-nextest-binaries-docs-alphal00p-docs-schema from https://cache.nix-ci.com
  23. 15.22 s Downloaded cached gammaloop-nextest-binaries-docs-alphal00p-docs-python-exporter (1.8 MiB) in 304ms
  24. 15.22 s Progress: 0 of 1 built, 1 of 8 downloaded from cache (5 downloading)
  25. 15.25 s Downloaded cached gammaloop-nextest-binaries-docs-alphal00p-docs-schema (2 MiB) in 337ms
  26. 15.25 s Progress: 0 of 1 built, 2 of 8 downloaded from cache (4 downloading)
  27. 15.27 s Downloaded cached gammaloop-nextest-binaries-docs-alphal00p-docs-catalogs (2.4 MiB) in 356ms
  28. 15.27 s Progress: 0 of 1 built, 3 of 8 downloaded from cache (3 downloading)
  29. 15.32 s Downloaded cached gammaloop-nextest-binaries-docs-alphal00p-docs-macros (3.3 MiB) in 409ms
  30. 15.32 s Progress: 0 of 1 built, 4 of 8 downloaded from cache (2 downloading)
  31. 15.37 s Downloaded cached gammaloop-nextest-binaries-docs-alphal00p-docs-builder (4.4 MiB) in 460ms
  32. 15.37 s Progress: 0 of 1 built, 5 of 8 downloaded from cache (1 downloading)
  33. 15.49 s Downloaded cached gammaloop-nextest-binaries-docs-alphal00p-docs-examples (9.3 MiB) in 575ms
  34. 15.49 s Progress: 0 of 1 built, 6 of 8 downloaded from cache
  35. 15.49 s Downloading cached gammaloop-nextest-binaries-docs from https://cache.nix-ci.com
  36. 15.53 s Downloaded cached gammaloop-nextest-binaries-docs (2472 B) in 38ms
  37. 15.53 s Progress: 0 of 1 built, 7 of 8 downloaded from cache
  38. 15.53 s Downloading cached nix-ci-check-gammaloop-nextest-docs from https://cache.nix-ci.com
  39. 15.57 s Downloaded cached nix-ci-check-gammaloop-nextest-docs (1016 B) in 39ms
  40. 15.57 s Progress: 0 of 1 built, 8 of 8 downloaded from cache
  41. 20.88 s evaluating derivation 'g copying '/nix/store/a336 evaluating derivation 'g copying '/nix/store/a336 evaluating derivation 'g copying '/nix/store/a336 evaluating derivation 'g copying '/nix/store/a336 evaluating derivation 'g copying '/nix/store/a336 evaluating derivation 'g querying gammaloop-nexte [0.0 KiB DL] querying in [1.1 KiB DL] querying in [1.7 KiB DL] querying la [3.9 KiB DL] querying la [0/3 built, 2/0/7 copied [0/3 built, 1/1/7 copied [0/3 built, 2/2/7 copied [0/3 built, 2/3/7 copied [0/3 built, 1/6/7 copiedpython3> structuredAttrs is enabled
  42. 20.95 s [1/0/2 built, 7 copied (python3> created 227 symlinks in user environment
  43. 21.71 s python3 (post)> Uploading to the NixCI cache: /nix/store/3gi2x25n327sf3xma8b08jd57aqv69x5-python3-3.13.14-env
  44. 21.74 s python3 (post)> warning: 'warn-short-path-literals' is deprecated, use 'lint-short-path-literals = ignore' instead
  45. 21.88 s python3 (post)> copying 0 paths...
  46. 21.92 s python3 (post)> warning: 'warn-short-path-literals' is deprecated, use 'lint-short-path-literals = ignore' instead
  47. 22.16 s python3 (post)> copying 0 paths...
  48. 22.48 s [1/3 built, 7 copied (21 [1/1/2 built, 7 copied (gammaloop-nextest-docs> Extracting 2 binaries to /build/source
  49. 22.52 s gammaloop-nextest-docs> Extracted 5 files to /build/source in 0.04s
  50. 22.53 s gammaloop-nextest-docs> ------------
  51. 22.53 s gammaloop-nextest-docs> Nextest run ID 41c799f1-b79a-47d1-9384-6804f8337feb with nextest profile: ci_gammaloop
  52. 22.53 s gammaloop-nextest-docs> Starting 111 tests across 2 binaries
  53. 22.61 s gammaloop-nextest-docs> FAIL [ 0.081s] ( 73/111) alphal00p-docs-builder tests::checked_in_registry_is_valid
  54. 22.61 s gammaloop-nextest-docs> stdout ---
  55. 22.61 s gammaloop-nextest-docs>
  56. 22.61 s gammaloop-nextest-docs> running 1 test
  57. 22.61 s gammaloop-nextest-docs> test tests::checked_in_registry_is_valid ... FAILED
  58. 22.61 s gammaloop-nextest-docs>
  59. 22.61 s gammaloop-nextest-docs> failures:
  60. 22.61 s gammaloop-nextest-docs>
  61. 22.61 s gammaloop-nextest-docs> failures:
  62. 22.61 s gammaloop-nextest-docs> tests::checked_in_registry_is_valid
  63. 22.61 s gammaloop-nextest-docs>
  64. 22.61 s gammaloop-nextest-docs> test result: FAILED. 0 passed; 1 failed; 0 ignored; 0 measured; 110 filtered out; finished in 0.08s
  65. 22.61 s gammaloop-nextest-docs>
  66. 22.61 s gammaloop-nextest-docs> stderr ---
  67. 22.61 s gammaloop-nextest-docs> warning: developer note gammaloop-architecture still requires a named owner
  68. 22.61 s gammaloop-nextest-docs> warning: developer note integration-dashboard still requires a named owner
  69. 22.61 s gammaloop-nextest-docs> warning: developer note uv-renormalization still requires a named owner
  70. 22.61 s gammaloop-nextest-docs> warning: developer note spenso-parsing-flow still requires a named owner
  71. 22.61 s gammaloop-nextest-docs> warning: developer note schoonschip-network still requires a named owner
  72. 22.61 s gammaloop-nextest-docs> warning: developer note gammaloop-draw-style-migration still requires a named owner
  73. 22.61 s gammaloop-nextest-docs> warning: developer note gammaloop-drawing-architecture still requires a named owner
  74. 22.61 s gammaloop-nextest-docs> warning: developer note spenso-symbolica-syntax-and-rewrites still requires a named owner
  75. 22.61 s gammaloop-nextest-docs> warning: developer note spenso-architecture still requires a named owner
  76. 22.61 s gammaloop-nextest-docs> warning: developer note idenso-architecture still requires a named owner
  77. 22.61 s gammaloop-nextest-docs> warning: developer note idenso-form-color-dirac-source-map still requires a named owner
  78. 22.61 s gammaloop-nextest-docs> warning: developer note linnet-architecture still requires a named owner
  79. 22.61 s gammaloop-nextest-docs> warning: developer note vakint-architecture still requires a named owner
  80. 22.61 s gammaloop-nextest-docs> warning: developer note gammaloop-roadmap still requires a named owner
  81. 22.61 s gammaloop-nextest-docs> warning: developer note cff-surface-cache-ownership still requires a named owner
  82. 22.61 s gammaloop-nextest-docs> warning: developer note gammaloop-drawing-evaluated-fields-history still requires a named owner
  83. 22.61 s gammaloop-nextest-docs> warning: archived developer note gammaloop-drawing-evaluated-fields-history has no immutable evidence revision
  84. 22.61 s gammaloop-nextest-docs> warning: developer note bnl-benchmark-investigation still requires a named owner
  85. 22.61 s gammaloop-nextest-docs> warning: developer note bnl-contraction-order-performance still requires a named owner
  86. 22.61 s gammaloop-nextest-docs> warning: developer note bnl-scalar-alias-capture still requires a named owner
  87. 22.61 s gammaloop-nextest-docs> warning: developer note aa-aa-three-loop-performance-smoke still requires a named owner
  88. 22.61 s gammaloop-nextest-docs> warning: developer note network-simplification still requires a named owner
  89. 22.61 s gammaloop-nextest-docs> warning: investigation developer note network-simplification has no immutable evidence revision
  90. 22.61 s gammaloop-nextest-docs> warning: developer note spenso-large-expressions still requires a named owner
  91. 22.61 s gammaloop-nextest-docs> warning: developer note spenso-improvement-effects still requires a named owner
  92. 22.61 s gammaloop-nextest-docs> warning: archived developer note spenso-improvement-effects has no immutable evidence revision
  93. 22.61 s gammaloop-nextest-docs> warning: developer note spenso-test-baseline still requires a named owner
  94. 22.61 s gammaloop-nextest-docs> warning: archived developer note spenso-test-baseline has no immutable evidence revision
  95. 22.61 s gammaloop-nextest-docs> warning: developer note bnl-evaluator-atom-capture still requires a named owner
  96. 22.61 s gammaloop-nextest-docs> warning: archived developer note bnl-evaluator-atom-capture has no immutable evidence revision
  97. 22.61 s gammaloop-nextest-docs> warning: developer note uv-scalar-profile-benchmark still requires a named owner
  98. 22.61 s gammaloop-nextest-docs> warning: archived developer note uv-scalar-profile-benchmark has no immutable evidence revision
  99. 22.61 s gammaloop-nextest-docs> warning: developer note ci-test-failure-summary-2026-03-25 still requires a named owner
  100. 22.61 s gammaloop-nextest-docs> warning: archived developer note ci-test-failure-summary-2026-03-25 has no immutable evidence revision
  101. 22.61 s gammaloop-nextest-docs> warning: developer note network-execution-rebase-record still requires a named owner
  102. 22.61 s gammaloop-nextest-docs> warning: archived developer note network-execution-rebase-record has no immutable evidence revision
  103. 22.61 s gammaloop-nextest-docs> warning: developer note ratatui-integration-dashboard-history still requires a named owner
  104. 22.61 s gammaloop-nextest-docs> warning: archived developer note ratatui-integration-dashboard-history has no immutable evidence revision
  105. 22.61 s gammaloop-nextest-docs> warning: developer note nix-crane-cache-reuse still requires a named owner
  106. 22.61 s gammaloop-nextest-docs>
  107. 22.61 s gammaloop-nextest-docs> thread 'tests::checked_in_registry_is_valid' (174) panicked at crates/alphal00p-docs-builder/src/lib.rs:11887:50:
  108. 22.61 s gammaloop-nextest-docs> called `Result::unwrap()` on an `Err` value: developer note nix-crane-cache-reuse verified scope flake.nix changed (expected 188504937418859942a6770ca21a4f4e0a7ff125, found 17dc35393f0f0abd5cb31c7eaf1fdc9aa6903ce4); owner review or an explicit no-impact attestation is required
  109. 22.61 s gammaloop-nextest-docs>
  110. 22.61 s gammaloop-nextest-docs> Location:
  111. 22.61 s gammaloop-nextest-docs> crates/alphal00p-docs-builder/src/lib.rs:889:21
  112. 22.61 s gammaloop-nextest-docs> stack backtrace:
  113. 22.61 s gammaloop-nextest-docs> 0: __rustc::rust_begin_unwind
  114. 22.61 s gammaloop-nextest-docs> 1: core::panicking::panic_fmt
  115. 22.61 s gammaloop-nextest-docs> 2: core::result::unwrap_failed
  116. 22.61 s gammaloop-nextest-docs> 3: alphal00p_docs_builder::tests::checked_in_registry_is_valid
  117. 22.61 s gammaloop-nextest-docs> 4: <alphal00p_docs_builder::tests::checked_in_registry_is_valid::{closure#0} as core::ops::function::FnOnce<()>>::call_once
  118. 22.61 s gammaloop-nextest-docs> note: Some details are omitted, run with `RUST_BACKTRACE=full` for a verbose backtrace.
  119. 22.61 s gammaloop-nextest-docs>
  120. 22.62 s gammaloop-nextest-docs> FAIL [ 0.076s] ( 82/111) alphal00p-docs-builder tests::every_product_requires_a_task_chooser_and_each_supported_interface
  121. 22.62 s gammaloop-nextest-docs> stdout ---
  122. 22.62 s gammaloop-nextest-docs>
  123. 22.62 s gammaloop-nextest-docs> running 1 test
  124. 22.62 s gammaloop-nextest-docs> test tests::every_product_requires_a_task_chooser_and_each_supported_interface ... FAILED
  125. 22.62 s gammaloop-nextest-docs>
  126. 22.62 s gammaloop-nextest-docs> failures:
  127. 22.62 s gammaloop-nextest-docs>
  128. 22.62 s gammaloop-nextest-docs> failures:
  129. 22.62 s gammaloop-nextest-docs> tests::every_product_requires_a_task_chooser_and_each_supported_interface
  130. 22.62 s gammaloop-nextest-docs>
  131. 22.62 s gammaloop-nextest-docs> test result: FAILED. 0 passed; 1 failed; 0 ignored; 0 measured; 110 filtered out; finished in 0.07s
  132. 22.62 s gammaloop-nextest-docs>
  133. 22.62 s gammaloop-nextest-docs> stderr ---
  134. 22.62 s gammaloop-nextest-docs> warning: developer note gammaloop-architecture still requires a named owner
  135. 22.62 s gammaloop-nextest-docs> warning: developer note integration-dashboard still requires a named owner
  136. 22.62 s gammaloop-nextest-docs> warning: developer note uv-renormalization still requires a named owner
  137. 22.62 s gammaloop-nextest-docs> warning: developer note spenso-parsing-flow still requires a named owner
  138. 22.62 s gammaloop-nextest-docs> warning: developer note schoonschip-network still requires a named owner
  139. 22.62 s gammaloop-nextest-docs> warning: developer note gammaloop-draw-style-migration still requires a named owner
  140. 22.62 s gammaloop-nextest-docs> warning: developer note gammaloop-drawing-architecture still requires a named owner
  141. 22.62 s gammaloop-nextest-docs> warning: developer note spenso-symbolica-syntax-and-rewrites still requires a named owner
  142. 22.62 s gammaloop-nextest-docs> warning: developer note spenso-architecture still requires a named owner
  143. 22.62 s gammaloop-nextest-docs> warning: developer note idenso-architecture still requires a named owner
  144. 22.62 s gammaloop-nextest-docs> warning: developer note idenso-form-color-dirac-source-map still requires a named owner
  145. 22.62 s gammaloop-nextest-docs> warning: developer note linnet-architecture still requires a named owner
  146. 22.62 s gammaloop-nextest-docs> warning: developer note vakint-architecture still requires a named owner
  147. 22.62 s gammaloop-nextest-docs> warning: developer note gammaloop-roadmap still requires a named owner
  148. 22.62 s gammaloop-nextest-docs> warning: developer note cff-surface-cache-ownership still requires a named owner
  149. 22.62 s gammaloop-nextest-docs> warning: developer note gammaloop-drawing-evaluated-fields-history still requires a named owner
  150. 22.62 s gammaloop-nextest-docs> warning: archived developer note gammaloop-drawing-evaluated-fields-history has no immutable evidence revision
  151. 22.62 s gammaloop-nextest-docs> warning: developer note bnl-benchmark-investigation still requires a named owner
  152. 22.62 s gammaloop-nextest-docs> warning: developer note bnl-contraction-order-performance still requires a named owner
  153. 22.62 s gammaloop-nextest-docs> warning: developer note bnl-scalar-alias-capture still requires a named owner
  154. 22.62 s gammaloop-nextest-docs> warning: developer note aa-aa-three-loop-performance-smoke still requires a named owner
  155. 22.62 s gammaloop-nextest-docs> warning: developer note network-simplification still requires a named owner
  156. 22.62 s gammaloop-nextest-docs> warning: investigation developer note network-simplification has no immutable evidence revision
  157. 22.62 s gammaloop-nextest-docs> warning: developer note spenso-large-expressions still requires a named owner
  158. 22.62 s gammaloop-nextest-docs> warning: developer note spenso-improvement-effects still requires a named owner
  159. 22.62 s gammaloop-nextest-docs> warning: archived developer note spenso-improvement-effects has no immutable evidence revision
  160. 22.62 s gammaloop-nextest-docs> warning: developer note spenso-test-baseline still requires a named owner
  161. 22.62 s gammaloop-nextest-docs> warning: archived developer note spenso-test-baseline has no immutable evidence revision
  162. 22.62 s gammaloop-nextest-docs> warning: developer note bnl-evaluator-atom-capture still requires a named owner
  163. 22.62 s gammaloop-nextest-docs> warning: archived developer note bnl-evaluator-atom-capture has no immutable evidence revision
  164. 22.62 s gammaloop-nextest-docs> warning: developer note uv-scalar-profile-benchmark still requires a named owner
  165. 22.62 s gammaloop-nextest-docs> warning: archived developer note uv-scalar-profile-benchmark has no immutable evidence revision
  166. 22.62 s gammaloop-nextest-docs> warning: developer note ci-test-failure-summary-2026-03-25 still requires a named owner
  167. 22.62 s gammaloop-nextest-docs> warning: archived developer note ci-test-failure-summary-2026-03-25 has no immutable evidence revision
  168. 22.62 s gammaloop-nextest-docs> warning: developer note network-execution-rebase-record still requires a named owner
  169. 22.62 s gammaloop-nextest-docs> warning: archived developer note network-execution-rebase-record has no immutable evidence revision
  170. 22.62 s gammaloop-nextest-docs> warning: developer note ratatui-integration-dashboard-history still requires a named owner
  171. 22.62 s gammaloop-nextest-docs> warning: archived developer note ratatui-integration-dashboard-history has no immutable evidence revision
  172. 22.62 s gammaloop-nextest-docs> warning: developer note nix-crane-cache-reuse still requires a named owner
  173. 22.62 s gammaloop-nextest-docs>
  174. 22.62 s gammaloop-nextest-docs> thread 'tests::every_product_requires_a_task_chooser_and_each_supported_interface' (264) panicked at crates/alphal00p-docs-builder/src/lib.rs:11901:9:
  175. 22.62 s gammaloop-nextest-docs> assertion failed: format!("{error:#}").contains("has no quickstart page")
  176. 22.62 s gammaloop-nextest-docs> stack backtrace:
  177. 22.62 s gammaloop-nextest-docs> 0: __rustc::rust_begin_unwind
  178. 22.62 s gammaloop-nextest-docs> 1: core::panicking::panic_fmt
  179. 22.62 s gammaloop-nextest-docs> 2: core::panicking::panic
  180. 22.62 s gammaloop-nextest-docs> 3: alphal00p_docs_builder::tests::every_product_requires_a_task_chooser_and_each_supported_interface
  181. 22.62 s gammaloop-nextest-docs> 4: <alphal00p_docs_builder::tests::every_product_requires_a_task_chooser_and_each_supported_interface::{closure#0} as core::ops::function::FnOnce<()>>::call_once
  182. 22.62 s gammaloop-nextest-docs> note: Some details are omitted, run with `RUST_BACKTRACE=full` for a verbose backtrace.
  183. 22.62 s gammaloop-nextest-docs>
  184. 22.63 s gammaloop-nextest-docs> FAIL [ 0.067s] ( 93/111) alphal00p-docs-builder tests::pdf_manual_chapter_order_must_match_the_page_registry
  185. 22.63 s gammaloop-nextest-docs> stdout ---
  186. 22.63 s gammaloop-nextest-docs>
  187. 22.63 s gammaloop-nextest-docs> running 1 test
  188. 22.63 s gammaloop-nextest-docs> test tests::pdf_manual_chapter_order_must_match_the_page_registry ... FAILED
  189. 22.63 s gammaloop-nextest-docs>
  190. 22.63 s gammaloop-nextest-docs> failures:
  191. 22.63 s gammaloop-nextest-docs>
  192. 22.63 s gammaloop-nextest-docs> failures:
  193. 22.63 s gammaloop-nextest-docs> tests::pdf_manual_chapter_order_must_match_the_page_registry
  194. 22.63 s gammaloop-nextest-docs>
  195. 22.63 s gammaloop-nextest-docs> test result: FAILED. 0 passed; 1 failed; 0 ignored; 0 measured; 110 filtered out; finished in 0.06s
  196. 22.63 s gammaloop-nextest-docs>
  197. 22.63 s gammaloop-nextest-docs> stderr ---
  198. 22.63 s gammaloop-nextest-docs> warning: developer note gammaloop-architecture still requires a named owner
  199. 22.63 s gammaloop-nextest-docs> warning: developer note integration-dashboard still requires a named owner
  200. 22.63 s gammaloop-nextest-docs> warning: developer note uv-renormalization still requires a named owner
  201. 22.63 s gammaloop-nextest-docs> warning: developer note spenso-parsing-flow still requires a named owner
  202. 22.63 s gammaloop-nextest-docs> warning: developer note schoonschip-network still requires a named owner
  203. 22.63 s gammaloop-nextest-docs> warning: developer note gammaloop-draw-style-migration still requires a named owner
  204. 22.63 s gammaloop-nextest-docs> warning: developer note gammaloop-drawing-architecture still requires a named owner
  205. 22.63 s gammaloop-nextest-docs> warning: developer note spenso-symbolica-syntax-and-rewrites still requires a named owner
  206. 22.63 s gammaloop-nextest-docs> warning: developer note spenso-architecture still requires a named owner
  207. 22.63 s gammaloop-nextest-docs> warning: developer note idenso-architecture still requires a named owner
  208. 22.63 s gammaloop-nextest-docs> warning: developer note idenso-form-color-dirac-source-map still requires a named owner
  209. 22.63 s gammaloop-nextest-docs> warning: developer note linnet-architecture still requires a named owner
  210. 22.63 s gammaloop-nextest-docs> warning: developer note vakint-architecture still requires a named owner
  211. 22.63 s gammaloop-nextest-docs> warning: developer note gammaloop-roadmap still requires a named owner
  212. 22.63 s gammaloop-nextest-docs> warning: developer note cff-surface-cache-ownership still requires a named owner
  213. 22.63 s gammaloop-nextest-docs> warning: developer note gammaloop-drawing-evaluated-fields-history still requires a named owner
  214. 22.63 s gammaloop-nextest-docs> warning: archived developer note gammaloop-drawing-evaluated-fields-history has no immutable evidence revision
  215. 22.63 s gammaloop-nextest-docs> warning: developer note bnl-benchmark-investigation still requires a named owner
  216. 22.63 s gammaloop-nextest-docs> warning: developer note bnl-contraction-order-performance still requires a named owner
  217. 22.63 s gammaloop-nextest-docs> warning: developer note bnl-scalar-alias-capture still requires a named owner
  218. 22.63 s gammaloop-nextest-docs> warning: developer note aa-aa-three-loop-performance-smoke still requires a named owner
  219. 22.63 s gammaloop-nextest-docs> warning: developer note network-simplification still requires a named owner
  220. 22.63 s gammaloop-nextest-docs> warning: investigation developer note network-simplification has no immutable evidence revision
  221. 22.63 s gammaloop-nextest-docs> warning: developer note spenso-large-expressions still requires a named owner
  222. 22.63 s gammaloop-nextest-docs> warning: developer note spenso-improvement-effects still requires a named owner
  223. 22.63 s gammaloop-nextest-docs> warning: archived developer note spenso-improvement-effects has no immutable evidence revision
  224. 22.63 s gammaloop-nextest-docs> warning: developer note spenso-test-baseline still requires a named owner
  225. 22.63 s gammaloop-nextest-docs> warning: archived developer note spenso-test-baseline has no immutable evidence revision
  226. 22.63 s gammaloop-nextest-docs> warning: developer note bnl-evaluator-atom-capture still requires a named owner
  227. 22.63 s gammaloop-nextest-docs> warning: archived developer note bnl-evaluator-atom-capture has no immutable evidence revision
  228. 22.63 s gammaloop-nextest-docs> warning: developer note uv-scalar-profile-benchmark still requires a named owner
  229. 22.63 s gammaloop-nextest-docs> warning: archived developer note uv-scalar-profile-benchmark has no immutable evidence revision
  230. 22.63 s gammaloop-nextest-docs> warning: developer note ci-test-failure-summary-2026-03-25 still requires a named owner
  231. 22.63 s gammaloop-nextest-docs> warning: archived developer note ci-test-failure-summary-2026-03-25 has no immutable evidence revision
  232. 22.63 s gammaloop-nextest-docs> warning: developer note network-execution-rebase-record still requires a named owner
  233. 22.63 s gammaloop-nextest-docs> warning: archived developer note network-execution-rebase-record has no immutable evidence revision
  234. 22.63 s gammaloop-nextest-docs> warning: developer note ratatui-integration-dashboard-history still requires a named owner
  235. 22.63 s gammaloop-nextest-docs> warning: archived developer note ratatui-integration-dashboard-history has no immutable evidence revision
  236. 22.63 s gammaloop-nextest-docs> warning: developer note nix-crane-cache-reuse still requires a named owner
  237. 22.63 s gammaloop-nextest-docs>
  238. 22.63 s gammaloop-nextest-docs> thread 'tests::pdf_manual_chapter_order_must_match_the_page_registry' (319) panicked at crates/alphal00p-docs-builder/src/lib.rs:11952:9:
  239. 22.63 s gammaloop-nextest-docs> assertion failed: format!("{error:#}").contains("PDF manual chapter order differs")
  240. 22.63 s gammaloop-nextest-docs> stack backtrace:
  241. 22.63 s gammaloop-nextest-docs> 0: __rustc::rust_begin_unwind
  242. 22.63 s gammaloop-nextest-docs> 1: core::panicking::panic_fmt
  243. 22.63 s gammaloop-nextest-docs> 2: core::panicking::panic
  244. 22.63 s gammaloop-nextest-docs> 3: alphal00p_docs_builder::tests::pdf_manual_chapter_order_must_match_the_page_registry
  245. 22.63 s gammaloop-nextest-docs> 4: <alphal00p_docs_builder::tests::pdf_manual_chapter_order_must_match_the_page_registry::{closure#0} as core::ops::function::FnOnce<()>>::call_once
  246. 22.63 s gammaloop-nextest-docs> note: Some details are omitted, run with `RUST_BACKTRACE=full` for a verbose backtrace.
  247. 22.63 s gammaloop-nextest-docs>
  248. 34.51 s gammaloop-nextest-docs> ------------
  249. 34.51 s gammaloop-nextest-docs> Summary [ 11.979s] 111 tests run: 108 passed, 3 failed, 0 skipped
  250. 34.51 s gammaloop-nextest-docs> FAIL [ 0.081s] ( 73/111) alphal00p-docs-builder tests::checked_in_registry_is_valid
  251. 34.51 s gammaloop-nextest-docs> stdout ---
  252. 34.51 s gammaloop-nextest-docs>
  253. 34.51 s gammaloop-nextest-docs> running 1 test
  254. 34.51 s gammaloop-nextest-docs> test tests::checked_in_registry_is_valid ... FAILED
  255. 34.51 s gammaloop-nextest-docs>
  256. 34.51 s gammaloop-nextest-docs> failures:
  257. 34.51 s gammaloop-nextest-docs>
  258. 34.51 s gammaloop-nextest-docs> failures:
  259. 34.51 s gammaloop-nextest-docs> tests::checked_in_registry_is_valid
  260. 34.51 s gammaloop-nextest-docs>
  261. 34.51 s gammaloop-nextest-docs> test result: FAILED. 0 passed; 1 failed; 0 ignored; 0 measured; 110 filtered out; finished in 0.08s
  262. 34.51 s gammaloop-nextest-docs>
  263. 34.51 s gammaloop-nextest-docs> stderr ---
  264. 34.51 s gammaloop-nextest-docs> warning: developer note gammaloop-architecture still requires a named owner
  265. 34.51 s gammaloop-nextest-docs> warning: developer note integration-dashboard still requires a named owner
  266. 34.51 s gammaloop-nextest-docs> warning: developer note uv-renormalization still requires a named owner
  267. 34.51 s gammaloop-nextest-docs> warning: developer note spenso-parsing-flow still requires a named owner
  268. 34.51 s gammaloop-nextest-docs> warning: developer note schoonschip-network still requires a named owner
  269. 34.51 s gammaloop-nextest-docs> warning: developer note gammaloop-draw-style-migration still requires a named owner
  270. 34.51 s gammaloop-nextest-docs> warning: developer note gammaloop-drawing-architecture still requires a named owner
  271. 34.51 s gammaloop-nextest-docs> warning: developer note spenso-symbolica-syntax-and-rewrites still requires a named owner
  272. 34.51 s gammaloop-nextest-docs> warning: developer note spenso-architecture still requires a named owner
  273. 34.51 s gammaloop-nextest-docs> warning: developer note idenso-architecture still requires a named owner
  274. 34.51 s gammaloop-nextest-docs> warning: developer note idenso-form-color-dirac-source-map still requires a named owner
  275. 34.51 s gammaloop-nextest-docs> warning: developer note linnet-architecture still requires a named owner
  276. 34.51 s gammaloop-nextest-docs> warning: developer note vakint-architecture still requires a named owner
  277. 34.51 s gammaloop-nextest-docs> warning: developer note gammaloop-roadmap still requires a named owner
  278. 34.51 s gammaloop-nextest-docs> warning: developer note cff-surface-cache-ownership still requires a named owner
  279. 34.51 s gammaloop-nextest-docs> warning: developer note gammaloop-drawing-evaluated-fields-history still requires a named owner
  280. 34.51 s gammaloop-nextest-docs> warning: archived developer note gammaloop-drawing-evaluated-fields-history has no immutable evidence revision
  281. 34.51 s gammaloop-nextest-docs> warning: developer note bnl-benchmark-investigation still requires a named owner
  282. 34.51 s gammaloop-nextest-docs> warning: developer note bnl-contraction-order-performance still requires a named owner
  283. 34.51 s gammaloop-nextest-docs> warning: developer note bnl-scalar-alias-capture still requires a named owner
  284. 34.51 s gammaloop-nextest-docs> warning: developer note aa-aa-three-loop-performance-smoke still requires a named owner
  285. 34.51 s gammaloop-nextest-docs> warning: developer note network-simplification still requires a named owner
  286. 34.51 s gammaloop-nextest-docs> warning: investigation developer note network-simplification has no immutable evidence revision
  287. 34.51 s gammaloop-nextest-docs> warning: developer note spenso-large-expressions still requires a named owner
  288. 34.51 s gammaloop-nextest-docs> warning: developer note spenso-improvement-effects still requires a named owner
  289. 34.51 s gammaloop-nextest-docs> warning: archived developer note spenso-improvement-effects has no immutable evidence revision
  290. 34.51 s gammaloop-nextest-docs> warning: developer note spenso-test-baseline still requires a named owner
  291. 34.51 s gammaloop-nextest-docs> warning: archived developer note spenso-test-baseline has no immutable evidence revision
  292. 34.51 s gammaloop-nextest-docs> warning: developer note bnl-evaluator-atom-capture still requires a named owner
  293. 34.51 s gammaloop-nextest-docs> warning: archived developer note bnl-evaluator-atom-capture has no immutable evidence revision
  294. 34.51 s gammaloop-nextest-docs> warning: developer note uv-scalar-profile-benchmark still requires a named owner
  295. 34.51 s gammaloop-nextest-docs> warning: archived developer note uv-scalar-profile-benchmark has no immutable evidence revision
  296. 34.51 s gammaloop-nextest-docs> warning: developer note ci-test-failure-summary-2026-03-25 still requires a named owner
  297. 34.51 s gammaloop-nextest-docs> warning: archived developer note ci-test-failure-summary-2026-03-25 has no immutable evidence revision
  298. 34.51 s gammaloop-nextest-docs> warning: developer note network-execution-rebase-record still requires a named owner
  299. 34.51 s gammaloop-nextest-docs> warning: archived developer note network-execution-rebase-record has no immutable evidence revision
  300. 34.51 s gammaloop-nextest-docs> warning: developer note ratatui-integration-dashboard-history still requires a named owner
  301. 34.51 s gammaloop-nextest-docs> warning: archived developer note ratatui-integration-dashboard-history has no immutable evidence revision
  302. 34.51 s gammaloop-nextest-docs> warning: developer note nix-crane-cache-reuse still requires a named owner
  303. 34.51 s gammaloop-nextest-docs>
  304. 34.51 s gammaloop-nextest-docs> thread 'tests::checked_in_registry_is_valid' (174) panicked at crates/alphal00p-docs-builder/src/lib.rs:11887:50:
  305. 34.51 s gammaloop-nextest-docs> called `Result::unwrap()` on an `Err` value: developer note nix-crane-cache-reuse verified scope flake.nix changed (expected 188504937418859942a6770ca21a4f4e0a7ff125, found 17dc35393f0f0abd5cb31c7eaf1fdc9aa6903ce4); owner review or an explicit no-impact attestation is required
  306. 34.51 s gammaloop-nextest-docs>
  307. 34.51 s gammaloop-nextest-docs> Location:
  308. 34.51 s gammaloop-nextest-docs> crates/alphal00p-docs-builder/src/lib.rs:889:21
  309. 34.51 s gammaloop-nextest-docs> stack backtrace:
  310. 34.51 s gammaloop-nextest-docs> 0: __rustc::rust_begin_unwind
  311. 34.51 s gammaloop-nextest-docs> 1: core::panicking::panic_fmt
  312. 34.51 s gammaloop-nextest-docs> 2: core::result::unwrap_failed
  313. 34.51 s gammaloop-nextest-docs> 3: alphal00p_docs_builder::tests::checked_in_registry_is_valid
  314. 34.51 s gammaloop-nextest-docs> 4: <alphal00p_docs_builder::tests::checked_in_registry_is_valid::{closure#0} as core::ops::function::FnOnce<()>>::call_once
  315. 34.51 s gammaloop-nextest-docs> note: Some details are omitted, run with `RUST_BACKTRACE=full` for a verbose backtrace.
  316. 34.51 s gammaloop-nextest-docs>
  317. 34.51 s gammaloop-nextest-docs> FAIL [ 0.076s] ( 82/111) alphal00p-docs-builder tests::every_product_requires_a_task_chooser_and_each_supported_interface
  318. 34.51 s gammaloop-nextest-docs> stdout ---
  319. 34.51 s gammaloop-nextest-docs>
  320. 34.51 s gammaloop-nextest-docs> running 1 test
  321. 34.51 s gammaloop-nextest-docs> test tests::every_product_requires_a_task_chooser_and_each_supported_interface ... FAILED
  322. 34.51 s gammaloop-nextest-docs>
  323. 34.51 s gammaloop-nextest-docs> failures:
  324. 34.51 s gammaloop-nextest-docs>
  325. 34.51 s gammaloop-nextest-docs> failures:
  326. 34.51 s gammaloop-nextest-docs> tests::every_product_requires_a_task_chooser_and_each_supported_interface
  327. 34.51 s gammaloop-nextest-docs>
  328. 34.51 s gammaloop-nextest-docs> test result: FAILED. 0 passed; 1 failed; 0 ignored; 0 measured; 110 filtered out; finished in 0.07s
  329. 34.51 s gammaloop-nextest-docs>
  330. 34.51 s gammaloop-nextest-docs> stderr ---
  331. 34.51 s gammaloop-nextest-docs> warning: developer note gammaloop-architecture still requires a named owner
  332. 34.51 s gammaloop-nextest-docs> warning: developer note integration-dashboard still requires a named owner
  333. 34.51 s gammaloop-nextest-docs> warning: developer note uv-renormalization still requires a named owner
  334. 34.51 s gammaloop-nextest-docs> warning: developer note spenso-parsing-flow still requires a named owner
  335. 34.51 s gammaloop-nextest-docs> warning: developer note schoonschip-network still requires a named owner
  336. 34.51 s gammaloop-nextest-docs> warning: developer note gammaloop-draw-style-migration still requires a named owner
  337. 34.51 s gammaloop-nextest-docs> warning: developer note gammaloop-drawing-architecture still requires a named owner
  338. 34.51 s gammaloop-nextest-docs> warning: developer note spenso-symbolica-syntax-and-rewrites still requires a named owner
  339. 34.51 s gammaloop-nextest-docs> warning: developer note spenso-architecture still requires a named owner
  340. 34.51 s gammaloop-nextest-docs> warning: developer note idenso-architecture still requires a named owner
  341. 34.51 s gammaloop-nextest-docs> warning: developer note idenso-form-color-dirac-source-map still requires a named owner
  342. 34.51 s gammaloop-nextest-docs> warning: developer note linnet-architecture still requires a named owner
  343. 34.51 s gammaloop-nextest-docs> warning: developer note vakint-architecture still requires a named owner
  344. 34.51 s gammaloop-nextest-docs> warning: developer note gammaloop-roadmap still requires a named owner
  345. 34.51 s gammaloop-nextest-docs> warning: developer note cff-surface-cache-ownership still requires a named owner
  346. 34.51 s gammaloop-nextest-docs> warning: developer note gammaloop-drawing-evaluated-fields-history still requires a named owner
  347. 34.51 s gammaloop-nextest-docs> warning: archived developer note gammaloop-drawing-evaluated-fields-history has no immutable evidence revision
  348. 34.51 s gammaloop-nextest-docs> warning: developer note bnl-benchmark-investigation still requires a named owner
  349. 34.51 s gammaloop-nextest-docs> warning: developer note bnl-contraction-order-performance still requires a named owner
  350. 34.51 s gammaloop-nextest-docs> warning: developer note bnl-scalar-alias-capture still requires a named owner
  351. 34.51 s gammaloop-nextest-docs> warning: developer note aa-aa-three-loop-performance-smoke still requires a named owner
  352. 34.51 s gammaloop-nextest-docs> warning: developer note network-simplification still requires a named owner
  353. 34.51 s gammaloop-nextest-docs> warning: investigation developer note network-simplification has no immutable evidence revision
  354. 34.51 s gammaloop-nextest-docs> warning: developer note spenso-large-expressions still requires a named owner
  355. 34.51 s gammaloop-nextest-docs> warning: developer note spenso-improvement-effects still requires a named owner
  356. 34.51 s gammaloop-nextest-docs> warning: archived developer note spenso-improvement-effects has no immutable evidence revision
  357. 34.51 s gammaloop-nextest-docs> warning: developer note spenso-test-baseline still requires a named owner
  358. 34.51 s gammaloop-nextest-docs> warning: archived developer note spenso-test-baseline has no immutable evidence revision
  359. 34.51 s gammaloop-nextest-docs> warning: developer note bnl-evaluator-atom-capture still requires a named owner
  360. 34.51 s gammaloop-nextest-docs> warning: archived developer note bnl-evaluator-atom-capture has no immutable evidence revision
  361. 34.51 s gammaloop-nextest-docs> warning: developer note uv-scalar-profile-benchmark still requires a named owner
  362. 34.51 s gammaloop-nextest-docs> warning: archived developer note uv-scalar-profile-benchmark has no immutable evidence revision
  363. 34.51 s gammaloop-nextest-docs> warning: developer note ci-test-failure-summary-2026-03-25 still requires a named owner
  364. 34.51 s gammaloop-nextest-docs> warning: archived developer note ci-test-failure-summary-2026-03-25 has no immutable evidence revision
  365. 34.51 s gammaloop-nextest-docs> warning: developer note network-execution-rebase-record still requires a named owner
  366. 34.51 s gammaloop-nextest-docs> warning: archived developer note network-execution-rebase-record has no immutable evidence revision
  367. 34.51 s gammaloop-nextest-docs> warning: developer note ratatui-integration-dashboard-history still requires a named owner
  368. 34.51 s gammaloop-nextest-docs> warning: archived developer note ratatui-integration-dashboard-history has no immutable evidence revision
  369. 34.51 s gammaloop-nextest-docs> warning: developer note nix-crane-cache-reuse still requires a named owner
  370. 34.51 s gammaloop-nextest-docs>
  371. 34.51 s gammaloop-nextest-docs> thread 'tests::every_product_requires_a_task_chooser_and_each_supported_interface' (264) panicked at crates/alphal00p-docs-builder/src/lib.rs:11901:9:
  372. 34.51 s gammaloop-nextest-docs> assertion failed: format!("{error:#}").contains("has no quickstart page")
  373. 34.51 s gammaloop-nextest-docs> stack backtrace:
  374. 34.51 s gammaloop-nextest-docs> 0: __rustc::rust_begin_unwind
  375. 34.51 s gammaloop-nextest-docs> 1: core::panicking::panic_fmt
  376. 34.51 s gammaloop-nextest-docs> 2: core::panicking::panic
  377. 34.51 s gammaloop-nextest-docs> 3: alphal00p_docs_builder::tests::every_product_requires_a_task_chooser_and_each_supported_interface
  378. 34.51 s gammaloop-nextest-docs> 4: <alphal00p_docs_builder::tests::every_product_requires_a_task_chooser_and_each_supported_interface::{closure#0} as core::ops::function::FnOnce<()>>::call_once
  379. 34.51 s gammaloop-nextest-docs> note: Some details are omitted, run with `RUST_BACKTRACE=full` for a verbose backtrace.
  380. 34.51 s gammaloop-nextest-docs>
  381. 34.51 s gammaloop-nextest-docs> FAIL [ 0.067s] ( 93/111) alphal00p-docs-builder tests::pdf_manual_chapter_order_must_match_the_page_registry
  382. 34.51 s gammaloop-nextest-docs> stdout ---
  383. 34.51 s gammaloop-nextest-docs>
  384. 34.51 s gammaloop-nextest-docs> running 1 test
  385. 34.51 s gammaloop-nextest-docs> test tests::pdf_manual_chapter_order_must_match_the_page_registry ... FAILED
  386. 34.51 s gammaloop-nextest-docs>
  387. 34.51 s gammaloop-nextest-docs> failures:
  388. 34.51 s gammaloop-nextest-docs>
  389. 34.51 s gammaloop-nextest-docs> failures:
  390. 34.51 s gammaloop-nextest-docs> tests::pdf_manual_chapter_order_must_match_the_page_registry
  391. 34.51 s gammaloop-nextest-docs>
  392. 34.51 s gammaloop-nextest-docs> test result: FAILED. 0 passed; 1 failed; 0 ignored; 0 measured; 110 filtered out; finished in 0.06s
  393. 34.51 s gammaloop-nextest-docs>
  394. 34.51 s gammaloop-nextest-docs> stderr ---
  395. 34.51 s gammaloop-nextest-docs> warning: developer note gammaloop-architecture still requires a named owner
  396. 34.51 s gammaloop-nextest-docs> warning: developer note integration-dashboard still requires a named owner
  397. 34.51 s gammaloop-nextest-docs> warning: developer note uv-renormalization still requires a named owner
  398. 34.51 s gammaloop-nextest-docs> warning: developer note spenso-parsing-flow still requires a named owner
  399. 34.51 s gammaloop-nextest-docs> warning: developer note schoonschip-network still requires a named owner
  400. 34.51 s gammaloop-nextest-docs> warning: developer note gammaloop-draw-style-migration still requires a named owner
  401. 34.51 s gammaloop-nextest-docs> warning: developer note gammaloop-drawing-architecture still requires a named owner
  402. 34.51 s gammaloop-nextest-docs> warning: developer note spenso-symbolica-syntax-and-rewrites still requires a named owner
  403. 34.51 s gammaloop-nextest-docs> warning: developer note spenso-architecture still requires a named owner
  404. 34.51 s gammaloop-nextest-docs> warning: developer note idenso-architecture still requires a named owner
  405. 34.51 s gammaloop-nextest-docs> warning: developer note idenso-form-color-dirac-source-map still requires a named owner
  406. 34.51 s gammaloop-nextest-docs> warning: developer note linnet-architecture still requires a named owner
  407. 34.51 s gammaloop-nextest-docs> warning: developer note vakint-architecture still requires a named owner
  408. 34.51 s gammaloop-nextest-docs> warning: developer note gammaloop-roadmap still requires a named owner
  409. 34.51 s gammaloop-nextest-docs> warning: developer note cff-surface-cache-ownership still requires a named owner
  410. 34.51 s gammaloop-nextest-docs> warning: developer note gammaloop-drawing-evaluated-fields-history still requires a named owner
  411. 34.51 s gammaloop-nextest-docs> warning: archived developer note gammaloop-drawing-evaluated-fields-history has no immutable evidence revision
  412. 34.51 s gammaloop-nextest-docs> warning: developer note bnl-benchmark-investigation still requires a named owner
  413. 34.51 s gammaloop-nextest-docs> warning: developer note bnl-contraction-order-performance still requires a named owner
  414. 34.51 s gammaloop-nextest-docs> warning: developer note bnl-scalar-alias-capture still requires a named owner
  415. 34.51 s gammaloop-nextest-docs> warning: developer note aa-aa-three-loop-performance-smoke still requires a named owner
  416. 34.51 s gammaloop-nextest-docs> warning: developer note network-simplification still requires a named owner
  417. 34.51 s gammaloop-nextest-docs> warning: investigation developer note network-simplification has no immutable evidence revision
  418. 34.51 s gammaloop-nextest-docs> warning: developer note spenso-large-expressions still requires a named owner
  419. 34.51 s gammaloop-nextest-docs> warning: developer note spenso-improvement-effects still requires a named owner
  420. 34.51 s gammaloop-nextest-docs> warning: archived developer note spenso-improvement-effects has no immutable evidence revision
  421. 34.51 s gammaloop-nextest-docs> warning: developer note spenso-test-baseline still requires a named owner
  422. 34.51 s gammaloop-nextest-docs> warning: archived developer note spenso-test-baseline has no immutable evidence revision
  423. 34.51 s gammaloop-nextest-docs> warning: developer note bnl-evaluator-atom-capture still requires a named owner
  424. 34.51 s gammaloop-nextest-docs> warning: archived developer note bnl-evaluator-atom-capture has no immutable evidence revision
  425. 34.51 s gammaloop-nextest-docs> warning: developer note uv-scalar-profile-benchmark still requires a named owner
  426. 34.51 s gammaloop-nextest-docs> warning: archived developer note uv-scalar-profile-benchmark has no immutable evidence revision
  427. 34.51 s gammaloop-nextest-docs> warning: developer note ci-test-failure-summary-2026-03-25 still requires a named owner
  428. 34.51 s gammaloop-nextest-docs> warning: archived developer note ci-test-failure-summary-2026-03-25 has no immutable evidence revision
  429. 34.51 s gammaloop-nextest-docs> warning: developer note network-execution-rebase-record still requires a named owner
  430. 34.51 s gammaloop-nextest-docs> warning: archived developer note network-execution-rebase-record has no immutable evidence revision
  431. 34.51 s gammaloop-nextest-docs> warning: developer note ratatui-integration-dashboard-history still requires a named owner
  432. 34.51 s gammaloop-nextest-docs> warning: archived developer note ratatui-integration-dashboard-history has no immutable evidence revision
  433. 34.51 s gammaloop-nextest-docs> warning: developer note nix-crane-cache-reuse still requires a named owner
  434. 34.51 s gammaloop-nextest-docs>
  435. 34.51 s gammaloop-nextest-docs> thread 'tests::pdf_manual_chapter_order_must_match_the_page_registry' (319) panicked at crates/alphal00p-docs-builder/src/lib.rs:11952:9:
  436. 34.51 s gammaloop-nextest-docs> assertion failed: format!("{error:#}").contains("PDF manual chapter order differs")
  437. 34.51 s gammaloop-nextest-docs> stack backtrace:
  438. 34.51 s gammaloop-nextest-docs> 0: __rustc::rust_begin_unwind
  439. 34.51 s gammaloop-nextest-docs> 1: core::panicking::panic_fmt
  440. 34.51 s gammaloop-nextest-docs> 2: core::panicking::panic
  441. 34.51 s gammaloop-nextest-docs> 3: alphal00p_docs_builder::tests::pdf_manual_chapter_order_must_match_the_page_registry
  442. 34.51 s gammaloop-nextest-docs> 4: <alphal00p_docs_builder::tests::pdf_manual_chapter_order_must_match_the_page_registry::{closure#0} as core::ops::function::FnOnce<()>>::call_once
  443. 34.51 s gammaloop-nextest-docs> note: Some details are omitted, run with `RUST_BACKTRACE=full` for a verbose backtrace.
  444. 34.51 s gammaloop-nextest-docs>
  445. 34.51 s gammaloop-nextest-docs> error: test run failed
  446. 34.54 s gammaloop-nextest-docs>
  447. 34.54 s gammaloop-nextest-docs> ========== nextest test summary ==========
  448. 34.54 s gammaloop-nextest-docs> report: target/nextest/ci_gammaloop/junit.xml
  449. 34.54 s gammaloop-nextest-docs> tests: 111, failures: 3, errors: 0
  450. 34.54 s gammaloop-nextest-docs>
  451. 34.54 s gammaloop-nextest-docs> 1. alphal00p-docs-builder::tests::checked_in_registry_is_valid
  452. 34.54 s gammaloop-nextest-docs> failure: test failure with exit code 101
  453. 34.54 s gammaloop-nextest-docs> thread 'tests::checked_in_registry_is_valid' (174) panicked at crates/alphal00p-docs-builder/src/lib.rs:11887:50:
  454. 34.54 s gammaloop-nextest-docs> called `Result::unwrap()` on an `Err` value: developer note nix-crane-cache-reuse verified scope flake.nix changed (expected 188504937418859942a6770ca21a4f4e0a7ff125, found 17dc35393f0f0abd5cb31c7eaf1fdc9aa6903ce4); owner review or an explicit no-impact attestation is required
  455. 34.54 s gammaloop-nextest-docs>
  456. 34.54 s gammaloop-nextest-docs> Location:
  457. 34.54 s gammaloop-nextest-docs> crates/alphal00p-docs-builder/src/lib.rs:889:21
  458. 34.54 s gammaloop-nextest-docs> stack backtrace:
  459. 34.54 s gammaloop-nextest-docs> 0: __rustc::rust_begin_unwind
  460. 34.54 s gammaloop-nextest-docs> 1: core::panicking::panic_fmt
  461. 34.54 s gammaloop-nextest-docs> 2: core::result::unwrap_failed
  462. 34.54 s gammaloop-nextest-docs> 3: alphal00p_docs_builder::tests::checked_in_registry_is_valid
  463. 34.54 s gammaloop-nextest-docs> 4: <alphal00p_docs_builder::tests::checked_in_registry_is_valid::{closure#0} as core::ops::function::FnOnce<()>>::call_once
  464. 34.54 s gammaloop-nextest-docs> note: Some details are omitted, run with `RUST_BACKTRACE=full` for a verbose backtrace.
  465. 34.54 s gammaloop-nextest-docs> system-out
  466. 34.54 s gammaloop-nextest-docs> running 1 test
  467. 34.54 s gammaloop-nextest-docs> test tests::checked_in_registry_is_valid ... FAILED
  468. 34.54 s gammaloop-nextest-docs>
  469. 34.54 s gammaloop-nextest-docs> failures:
  470. 34.54 s gammaloop-nextest-docs>
  471. 34.54 s gammaloop-nextest-docs> failures:
  472. 34.54 s gammaloop-nextest-docs> tests::checked_in_registry_is_valid
  473. 34.54 s gammaloop-nextest-docs>
  474. 34.54 s gammaloop-nextest-docs> test result: FAILED. 0 passed; 1 failed; 0 ignored; 0 measured; 110 filtered out; finished in 0.08s
  475. 34.54 s gammaloop-nextest-docs> system-err
  476. 34.54 s gammaloop-nextest-docs> warning: developer note gammaloop-architecture still requires a named owner
  477. 34.54 s gammaloop-nextest-docs> warning: developer note integration-dashboard still requires a named owner
  478. 34.54 s gammaloop-nextest-docs> warning: developer note uv-renormalization still requires a named owner
  479. 34.54 s gammaloop-nextest-docs> warning: developer note spenso-parsing-flow still requires a named owner
  480. 34.54 s gammaloop-nextest-docs> warning: developer note schoonschip-network still requires a named owner
  481. 34.54 s gammaloop-nextest-docs> warning: developer note gammaloop-draw-style-migration still requires a named owner
  482. 34.54 s gammaloop-nextest-docs> warning: developer note gammaloop-drawing-architecture still requires a named owner
  483. 34.54 s gammaloop-nextest-docs> warning: developer note spenso-symbolica-syntax-and-rewrites still requires a named owner
  484. 34.54 s gammaloop-nextest-docs> warning: developer note spenso-architecture still requires a named owner
  485. 34.54 s gammaloop-nextest-docs> warning: developer note idenso-architecture still requires a named owner
  486. 34.54 s gammaloop-nextest-docs> warning: developer note idenso-form-color-dirac-source-map still requires a named owner
  487. 34.54 s gammaloop-nextest-docs> warning: developer note linnet-architecture still requires a named owner
  488. 34.54 s gammaloop-nextest-docs> warning: developer note vakint-architecture still requires a named owner
  489. 34.54 s gammaloop-nextest-docs> warning: developer note gammaloop-roadmap still requires a named owner
  490. 34.54 s gammaloop-nextest-docs> warning: developer note cff-surface-cache-ownership still requires a named owner
  491. 34.54 s gammaloop-nextest-docs> warning: developer note gammaloop-drawing-evaluated-fields-history still requires a named owner
  492. 34.54 s gammaloop-nextest-docs> warning: archived developer note gammaloop-drawing-evaluated-fields-history has no immutable evidence revision
  493. 34.54 s gammaloop-nextest-docs> warning: developer note bnl-benchmark-investigation still requires a named owner
  494. 34.54 s gammaloop-nextest-docs> warning: developer note bnl-contraction-order-performance still requires a named owner
  495. 34.54 s gammaloop-nextest-docs> warning: developer note bnl-scalar-alias-capture still requires a named owner
  496. 34.54 s gammaloop-nextest-docs> warning: developer note aa-aa-three-loop-performance-smoke still requires a named owner
  497. 34.54 s gammaloop-nextest-docs> warning: developer note network-simplification still requires a named owner
  498. 34.54 s gammaloop-nextest-docs> warning: investigation developer note network-simplification has no immutable evidence revision
  499. 34.54 s gammaloop-nextest-docs> warning: developer note spenso-large-expressions still requires a named owner
  500. 34.54 s gammaloop-nextest-docs> warning: developer note spenso-improvement-effects still requires a named owner
  501. 34.54 s gammaloop-nextest-docs> warning: archived developer note spenso-improvement-effects has no immutable evidence revision
  502. 34.54 s gammaloop-nextest-docs> warning: developer note spenso-test-baseline still requires a named owner
  503. 34.54 s gammaloop-nextest-docs> warning: archived developer note spenso-test-baseline has no immutable evidence revision
  504. 34.54 s gammaloop-nextest-docs> warning: developer note bnl-evaluator-atom-capture still requires a named owner
  505. 34.54 s gammaloop-nextest-docs> warning: archived developer note bnl-evaluator-atom-capture has no immutable evidence revision
  506. 34.54 s gammaloop-nextest-docs> warning: developer note uv-scalar-profile-benchmark still requires a named owner
  507. 34.54 s gammaloop-nextest-docs> warning: archived developer note uv-scalar-profile-benchmark has no immutable evidence revision
  508. 34.54 s gammaloop-nextest-docs> warning: developer note ci-test-failure-summary-2026-03-25 still requires a named owner
  509. 34.54 s gammaloop-nextest-docs> warning: archived developer note ci-test-failure-summary-2026-03-25 has no immutable evidence revision
  510. 34.54 s gammaloop-nextest-docs> warning: developer note network-execution-rebase-record still requires a named owner
  511. 34.54 s gammaloop-nextest-docs> warning: archived developer note network-execution-rebase-record has no immutable evidence revision
  512. 34.54 s gammaloop-nextest-docs> warning: developer note ratatui-integration-dashboard-history still requires a named owner
  513. 34.54 s gammaloop-nextest-docs> warning: archived developer note ratatui-integration-dashboard-history has no immutable evidence revision
  514. 34.54 s gammaloop-nextest-docs> warning: developer note nix-crane-cache-reuse still requires a named owner
  515. 34.54 s gammaloop-nextest-docs>
  516. 34.54 s gammaloop-nextest-docs> thread 'tests::checked_in_registry_is_valid' (174) panicked at crates/alphal00p-docs-builder/src/lib.rs:11887:50:
  517. 34.54 s gammaloop-nextest-docs> called `Result::unwrap()` on an `Err` value: developer note nix-crane-cache-reuse verified scope flake.nix changed (expected 188504937418859942a6770ca21a4f4e0a7ff125, found 17dc35393f0f0abd5cb31c7eaf1fdc9aa6903ce4); owner review or an explicit no-impact attestation is required
  518. 34.54 s gammaloop-nextest-docs>
  519. 34.54 s gammaloop-nextest-docs> Location:
  520. 34.54 s gammaloop-nextest-docs> crates/alphal00p-docs-builder/src/lib.rs:889:21
  521. 34.54 s gammaloop-nextest-docs> stack backtrace:
  522. 34.54 s gammaloop-nextest-docs> 0: __rustc::rust_begin_unwind
  523. 34.54 s gammaloop-nextest-docs> 1: core::panicking::panic_fmt
  524. 34.54 s gammaloop-nextest-docs> 2: core::result::unwrap_failed
  525. 34.54 s gammaloop-nextest-docs> 3: alphal00p_docs_builder::tests::checked_in_registry_is_valid
  526. 34.54 s gammaloop-nextest-docs> 4: <alphal00p_docs_builder::tests::checked_in_registry_is_valid::{closure#0} as core::ops::function::FnOnce<()>>::call_once
  527. 34.54 s gammaloop-nextest-docs> note: Some details are omitted, run with `RUST_BACKTRACE=full` for a verbose backtrace.
  528. 34.54 s gammaloop-nextest-docs>
  529. 34.54 s gammaloop-nextest-docs> 2. alphal00p-docs-builder::tests::every_product_requires_a_task_chooser_and_each_supported_interface
  530. 34.54 s gammaloop-nextest-docs> failure: test failure with exit code 101
  531. 34.54 s gammaloop-nextest-docs> thread 'tests::every_product_requires_a_task_chooser_and_each_supported_interface' (264) panicked at crates/alphal00p-docs-builder/src/lib.rs:11901:9:
  532. 34.54 s gammaloop-nextest-docs> assertion failed: format!("{error:#}").contains("has no quickstart page")
  533. 34.54 s gammaloop-nextest-docs> stack backtrace:
  534. 34.54 s gammaloop-nextest-docs> 0: __rustc::rust_begin_unwind
  535. 34.54 s gammaloop-nextest-docs> 1: core::panicking::panic_fmt
  536. 34.54 s gammaloop-nextest-docs> 2: core::panicking::panic
  537. 34.54 s gammaloop-nextest-docs> 3: alphal00p_docs_builder::tests::every_product_requires_a_task_chooser_and_each_supported_interface
  538. 34.54 s gammaloop-nextest-docs> 4: <alphal00p_docs_builder::tests::every_product_requires_a_task_chooser_and_each_supported_interface::{closure#0} as core::ops::function::FnOnce<()>>::call_once
  539. 34.54 s gammaloop-nextest-docs> note: Some details are omitted, run with `RUST_BACKTRACE=full` for a verbose backtrace.
  540. 34.54 s gammaloop-nextest-docs> system-out
  541. 34.54 s gammaloop-nextest-docs> running 1 test
  542. 34.54 s gammaloop-nextest-docs> test tests::every_product_requires_a_task_chooser_and_each_supported_interface ... FAILED
  543. 34.54 s gammaloop-nextest-docs>
  544. 34.54 s gammaloop-nextest-docs> failures:
  545. 34.54 s gammaloop-nextest-docs>
  546. 34.54 s gammaloop-nextest-docs> failures:
  547. 34.54 s gammaloop-nextest-docs> tests::every_product_requires_a_task_chooser_and_each_supported_interface
  548. 34.54 s gammaloop-nextest-docs>
  549. 34.54 s gammaloop-nextest-docs> test result: FAILED. 0 passed; 1 failed; 0 ignored; 0 measured; 110 filtered out; finished in 0.07s
  550. 34.54 s gammaloop-nextest-docs> system-err
  551. 34.54 s gammaloop-nextest-docs> warning: developer note gammaloop-architecture still requires a named owner
  552. 34.54 s gammaloop-nextest-docs> warning: developer note integration-dashboard still requires a named owner
  553. 34.54 s gammaloop-nextest-docs> warning: developer note uv-renormalization still requires a named owner
  554. 34.54 s gammaloop-nextest-docs> warning: developer note spenso-parsing-flow still requires a named owner
  555. 34.54 s gammaloop-nextest-docs> warning: developer note schoonschip-network still requires a named owner
  556. 34.54 s gammaloop-nextest-docs> warning: developer note gammaloop-draw-style-migration still requires a named owner
  557. 34.54 s gammaloop-nextest-docs> warning: developer note gammaloop-drawing-architecture still requires a named owner
  558. 34.54 s gammaloop-nextest-docs> warning: developer note spenso-symbolica-syntax-and-rewrites still requires a named owner
  559. 34.54 s gammaloop-nextest-docs> warning: developer note spenso-architecture still requires a named owner
  560. 34.54 s gammaloop-nextest-docs> warning: developer note idenso-architecture still requires a named owner
  561. 34.54 s gammaloop-nextest-docs> warning: developer note idenso-form-color-dirac-source-map still requires a named owner
  562. 34.54 s gammaloop-nextest-docs> warning: developer note linnet-architecture still requires a named owner
  563. 34.54 s gammaloop-nextest-docs> warning: developer note vakint-architecture still requires a named owner
  564. 34.54 s gammaloop-nextest-docs> warning: developer note gammaloop-roadmap still requires a named owner
  565. 34.54 s gammaloop-nextest-docs> warning: developer note cff-surface-cache-ownership still requires a named owner
  566. 34.54 s gammaloop-nextest-docs> warning: developer note gammaloop-drawing-evaluated-fields-history still requires a named owner
  567. 34.54 s gammaloop-nextest-docs> warning: archived developer note gammaloop-drawing-evaluated-fields-history has no immutable evidence revision
  568. 34.54 s gammaloop-nextest-docs> warning: developer note bnl-benchmark-investigation still requires a named owner
  569. 34.54 s gammaloop-nextest-docs> warning: developer note bnl-contraction-order-performance still requires a named owner
  570. 34.54 s gammaloop-nextest-docs> warning: developer note bnl-scalar-alias-capture still requires a named owner
  571. 34.54 s gammaloop-nextest-docs> warning: developer note aa-aa-three-loop-performance-smoke still requires a named owner
  572. 34.54 s gammaloop-nextest-docs> warning: developer note network-simplification still requires a named owner
  573. 34.54 s gammaloop-nextest-docs> warning: investigation developer note network-simplification has no immutable evidence revision
  574. 34.54 s gammaloop-nextest-docs> warning: developer note spenso-large-expressions still requires a named owner
  575. 34.54 s gammaloop-nextest-docs> warning: developer note spenso-improvement-effects still requires a named owner
  576. 34.54 s gammaloop-nextest-docs> warning: archived developer note spenso-improvement-effects has no immutable evidence revision
  577. 34.54 s gammaloop-nextest-docs> warning: developer note spenso-test-baseline still requires a named owner
  578. 34.54 s gammaloop-nextest-docs> warning: archived developer note spenso-test-baseline has no immutable evidence revision
  579. 34.54 s gammaloop-nextest-docs> warning: developer note bnl-evaluator-atom-capture still requires a named owner
  580. 34.54 s gammaloop-nextest-docs> warning: archived developer note bnl-evaluator-atom-capture has no immutable evidence revision
  581. 34.54 s gammaloop-nextest-docs> warning: developer note uv-scalar-profile-benchmark still requires a named owner
  582. 34.54 s gammaloop-nextest-docs> warning: archived developer note uv-scalar-profile-benchmark has no immutable evidence revision
  583. 34.54 s gammaloop-nextest-docs> warning: developer note ci-test-failure-summary-2026-03-25 still requires a named owner
  584. 34.54 s gammaloop-nextest-docs> warning: archived developer note ci-test-failure-summary-2026-03-25 has no immutable evidence revision
  585. 34.54 s gammaloop-nextest-docs> warning: developer note network-execution-rebase-record still requires a named owner
  586. 34.54 s gammaloop-nextest-docs> warning: archived developer note network-execution-rebase-record has no immutable evidence revision
  587. 34.54 s gammaloop-nextest-docs> warning: developer note ratatui-integration-dashboard-history still requires a named owner
  588. 34.54 s gammaloop-nextest-docs> warning: archived developer note ratatui-integration-dashboard-history has no immutable evidence revision
  589. 34.54 s gammaloop-nextest-docs> warning: developer note nix-crane-cache-reuse still requires a named owner
  590. 34.54 s gammaloop-nextest-docs>
  591. 34.54 s gammaloop-nextest-docs> thread 'tests::every_product_requires_a_task_chooser_and_each_supported_interface' (264) panicked at crates/alphal00p-docs-builder/src/lib.rs:11901:9:
  592. 34.54 s gammaloop-nextest-docs> assertion failed: format!("{error:#}").contains("has no quickstart page")
  593. 34.54 s gammaloop-nextest-docs> stack backtrace:
  594. 34.54 s gammaloop-nextest-docs> 0: __rustc::rust_begin_unwind
  595. 34.54 s gammaloop-nextest-docs> 1: core::panicking::panic_fmt
  596. 34.54 s gammaloop-nextest-docs> 2: core::panicking::panic
  597. 34.54 s gammaloop-nextest-docs> 3: alphal00p_docs_builder::tests::every_product_requires_a_task_chooser_and_each_supported_interface
  598. 34.54 s gammaloop-nextest-docs> 4: <alphal00p_docs_builder::tests::every_product_requires_a_task_chooser_and_each_supported_interface::{closure#0} as core::ops::function::FnOnce<()>>::call_once
  599. 34.54 s gammaloop-nextest-docs> note: Some details are omitted, run with `RUST_BACKTRACE=full` for a verbose backtrace.
  600. 34.54 s gammaloop-nextest-docs>
  601. 34.54 s gammaloop-nextest-docs> 3. alphal00p-docs-builder::tests::pdf_manual_chapter_order_must_match_the_page_registry
  602. 34.54 s gammaloop-nextest-docs> failure: test failure with exit code 101
  603. 34.54 s gammaloop-nextest-docs> thread 'tests::pdf_manual_chapter_order_must_match_the_page_registry' (319) panicked at crates/alphal00p-docs-builder/src/lib.rs:11952:9:
  604. 34.54 s gammaloop-nextest-docs> assertion failed: format!("{error:#}").contains("PDF manual chapter order differs")
  605. 34.54 s gammaloop-nextest-docs> stack backtrace:
  606. 34.54 s gammaloop-nextest-docs> 0: __rustc::rust_begin_unwind
  607. 34.54 s gammaloop-nextest-docs> 1: core::panicking::panic_fmt
  608. 34.54 s gammaloop-nextest-docs> 2: core::panicking::panic
  609. 34.54 s gammaloop-nextest-docs> 3: alphal00p_docs_builder::tests::pdf_manual_chapter_order_must_match_the_page_registry
  610. 34.54 s gammaloop-nextest-docs> 4: <alphal00p_docs_builder::tests::pdf_manual_chapter_order_must_match_the_page_registry::{closure#0} as core::ops::function::FnOnce<()>>::call_once
  611. 34.54 s gammaloop-nextest-docs> note: Some details are omitted, run with `RUST_BACKTRACE=full` for a verbose backtrace.
  612. 34.54 s gammaloop-nextest-docs> system-out
  613. 34.54 s gammaloop-nextest-docs> running 1 test
  614. 34.54 s gammaloop-nextest-docs> test tests::pdf_manual_chapter_order_must_match_the_page_registry ... FAILED
  615. 34.54 s gammaloop-nextest-docs>
  616. 34.54 s gammaloop-nextest-docs> failures:
  617. 34.54 s gammaloop-nextest-docs>
  618. 34.54 s gammaloop-nextest-docs> failures:
  619. 34.54 s gammaloop-nextest-docs> tests::pdf_manual_chapter_order_must_match_the_page_registry
  620. 34.54 s gammaloop-nextest-docs>
  621. 34.54 s gammaloop-nextest-docs> test result: FAILED. 0 passed; 1 failed; 0 ignored; 0 measured; 110 filtered out; finished in 0.06s
  622. 34.54 s gammaloop-nextest-docs> system-err
  623. 34.54 s gammaloop-nextest-docs> warning: developer note gammaloop-architecture still requires a named owner
  624. 34.54 s gammaloop-nextest-docs> warning: developer note integration-dashboard still requires a named owner
  625. 34.54 s gammaloop-nextest-docs> warning: developer note uv-renormalization still requires a named owner
  626. 34.54 s gammaloop-nextest-docs> warning: developer note spenso-parsing-flow still requires a named owner
  627. 34.54 s gammaloop-nextest-docs> warning: developer note schoonschip-network still requires a named owner
  628. 34.54 s gammaloop-nextest-docs> warning: developer note gammaloop-draw-style-migration still requires a named owner
  629. 34.54 s gammaloop-nextest-docs> warning: developer note gammaloop-drawing-architecture still requires a named owner
  630. 34.54 s gammaloop-nextest-docs> warning: developer note spenso-symbolica-syntax-and-rewrites still requires a named owner
  631. 34.54 s gammaloop-nextest-docs> warning: developer note spenso-architecture still requires a named owner
  632. 34.54 s gammaloop-nextest-docs> warning: developer note idenso-architecture still requires a named owner
  633. 34.54 s gammaloop-nextest-docs> warning: developer note idenso-form-color-dirac-source-map still requires a named owner
  634. 34.54 s gammaloop-nextest-docs> warning: developer note linnet-architecture still requires a named owner
  635. 34.54 s gammaloop-nextest-docs> warning: developer note vakint-architecture still requires a named owner
  636. 34.54 s gammaloop-nextest-docs> warning: developer note gammaloop-roadmap still requires a named owner
  637. 34.54 s gammaloop-nextest-docs> warning: developer note cff-surface-cache-ownership still requires a named owner
  638. 34.54 s gammaloop-nextest-docs> warning: developer note gammaloop-drawing-evaluated-fields-history still requires a named owner
  639. 34.54 s gammaloop-nextest-docs> warning: archived developer note gammaloop-drawing-evaluated-fields-history has no immutable evidence revision
  640. 34.54 s gammaloop-nextest-docs> warning: developer note bnl-benchmark-investigation still requires a named owner
  641. 34.54 s gammaloop-nextest-docs> warning: developer note bnl-contraction-order-performance still requires a named owner
  642. 34.54 s gammaloop-nextest-docs> warning: developer note bnl-scalar-alias-capture still requires a named owner
  643. 34.54 s gammaloop-nextest-docs> warning: developer note aa-aa-three-loop-performance-smoke still requires a named owner
  644. 34.54 s gammaloop-nextest-docs> warning: developer note network-simplification still requires a named owner
  645. 34.54 s gammaloop-nextest-docs> warning: investigation developer note network-simplification has no immutable evidence revision
  646. 34.54 s gammaloop-nextest-docs> warning: developer note spenso-large-expressions still requires a named owner
  647. 34.54 s gammaloop-nextest-docs> warning: developer note spenso-improvement-effects still requires a named owner
  648. 34.54 s gammaloop-nextest-docs> warning: archived developer note spenso-improvement-effects has no immutable evidence revision
  649. 34.54 s gammaloop-nextest-docs> warning: developer note spenso-test-baseline still requires a named owner
  650. 34.54 s gammaloop-nextest-docs> warning: archived developer note spenso-test-baseline has no immutable evidence revision
  651. 34.54 s gammaloop-nextest-docs> warning: developer note bnl-evaluator-atom-capture still requires a named owner
  652. 34.54 s gammaloop-nextest-docs> warning: archived developer note bnl-evaluator-atom-capture has no immutable evidence revision
  653. 34.54 s gammaloop-nextest-docs> warning: developer note uv-scalar-profile-benchmark still requires a named owner
  654. 34.54 s gammaloop-nextest-docs> warning: archived developer note uv-scalar-profile-benchmark has no immutable evidence revision
  655. 34.54 s gammaloop-nextest-docs> warning: developer note ci-test-failure-summary-2026-03-25 still requires a named owner
  656. 34.54 s gammaloop-nextest-docs> warning: archived developer note ci-test-failure-summary-2026-03-25 has no immutable evidence revision
  657. 34.54 s gammaloop-nextest-docs> warning: developer note network-execution-rebase-record still requires a named owner
  658. 34.54 s gammaloop-nextest-docs> warning: archived developer note network-execution-rebase-record has no immutable evidence revision
  659. 34.54 s gammaloop-nextest-docs> warning: developer note ratatui-integration-dashboard-history still requires a named owner
  660. 34.54 s gammaloop-nextest-docs> warning: archived developer note ratatui-integration-dashboard-history has no immutable evidence revision
  661. 34.54 s gammaloop-nextest-docs> warning: developer note nix-crane-cache-reuse still requires a named owner
  662. 34.54 s gammaloop-nextest-docs>
  663. 34.54 s gammaloop-nextest-docs> thread 'tests::pdf_manual_chapter_order_must_match_the_page_registry' (319) panicked at crates/alphal00p-docs-builder/src/lib.rs:11952:9:
  664. 34.54 s gammaloop-nextest-docs> assertion failed: format!("{error:#}").contains("PDF manual chapter order differs")
  665. 34.54 s gammaloop-nextest-docs> stack backtrace:
  666. 34.54 s gammaloop-nextest-docs> 0: __rustc::rust_begin_unwind
  667. 34.54 s gammaloop-nextest-docs> 1: core::panicking::panic_fmt
  668. 34.54 s gammaloop-nextest-docs> 2: core::panicking::panic
  669. 34.54 s gammaloop-nextest-docs> 3: alphal00p_docs_builder::tests::pdf_manual_chapter_order_must_match_the_page_registry
  670. 34.54 s gammaloop-nextest-docs> 4: <alphal00p_docs_builder::tests::pdf_manual_chapter_order_must_match_the_page_registry::{closure#0} as core::ops::function::FnOnce<()>>::call_once
  671. 34.54 s gammaloop-nextest-docs> note: Some details are omitted, run with `RUST_BACKTRACE=full` for a verbose backtrace.
  672. 34.54 s gammaloop-nextest-docs> =========================================
  673. 34.55 s gammaloop-nextest-docs> Extracting 2 binaries to /build/source
  674. 34.58 s gammaloop-nextest-docs> Extracted 5 files to /build/source in 0.03s
  675. 34.59 s gammaloop-nextest-docs> ------------
  676. 34.59 s gammaloop-nextest-docs> Nextest run ID b5ec9295-bd27-4aca-beb9-fcef7602151e with nextest profile: ci_gammaloop
  677. 34.59 s gammaloop-nextest-docs> Starting 22 tests across 2 binaries
  678. 34.60 s gammaloop-nextest-docs> ------------
  679. 34.60 s gammaloop-nextest-docs> Summary [ 0.015s] 22 tests run: 22 passed, 0 skipped
  680. 34.63 s gammaloop-nextest-docs>
  681. 34.63 s gammaloop-nextest-docs> ========== nextest test summary ==========
  682. 34.63 s gammaloop-nextest-docs> report: target/nextest/ci_gammaloop/junit.xml
  683. 34.63 s gammaloop-nextest-docs> tests: 22, failures: 0, errors: 0
  684. 34.63 s gammaloop-nextest-docs> No failing testcases found.
  685. 34.63 s gammaloop-nextest-docs> =========================================
  686. 34.64 s gammaloop-nextest-docs> Extracting 1 binary, 1 build script output directory, and 2 linked paths to /build/source
  687. 34.71 s gammaloop-nextest-docs> Extracted 18 files to /build/source in 0.06s
  688. 34.71 s gammaloop-nextest-docs> ------------
  689. 34.71 s gammaloop-nextest-docs> Nextest run ID ec48143d-5129-40e1-9b37-99d6a8e401bb with nextest profile: ci_gammaloop
  690. 34.71 s gammaloop-nextest-docs> Starting 89 tests across 1 binary
  691. 34.75 s gammaloop-nextest-docs> ------------
  692. 34.75 s gammaloop-nextest-docs> Summary [ 0.038s] 89 tests run: 89 passed, 0 skipped
  693. 34.78 s gammaloop-nextest-docs>
  694. 34.78 s gammaloop-nextest-docs> ========== nextest test summary ==========
  695. 34.78 s gammaloop-nextest-docs> report: target/nextest/ci_gammaloop/junit.xml
  696. 34.78 s gammaloop-nextest-docs> tests: 89, failures: 0, errors: 0
  697. 34.78 s gammaloop-nextest-docs> No failing testcases found.
  698. 34.78 s gammaloop-nextest-docs> =========================================
  699. 34.80 s gammaloop-nextest-docs> Extracting 2 binaries to /build/source
  700. 34.83 s gammaloop-nextest-docs> Extracted 5 files to /build/source in 0.04s
  701. 34.84 s gammaloop-nextest-docs> ------------
  702. 34.84 s gammaloop-nextest-docs> Nextest run ID 27e0d0fb-7422-4650-9a76-7bc5d97b8e5b with nextest profile: ci_gammaloop
  703. 34.84 s gammaloop-nextest-docs> Starting 10 tests across 2 binaries
  704. 45.55 s gammaloop-nextest-docs> ------------
  705. 45.55 s gammaloop-nextest-docs> Summary [ 10.712s] 10 tests run: 10 passed, 0 skipped
  706. 45.58 s gammaloop-nextest-docs>
  707. 45.58 s gammaloop-nextest-docs> ========== nextest test summary ==========
  708. 45.58 s gammaloop-nextest-docs> report: target/nextest/ci_gammaloop/junit.xml
  709. 45.58 s gammaloop-nextest-docs> tests: 10, failures: 0, errors: 0
  710. 45.58 s gammaloop-nextest-docs> No failing testcases found.
  711. 45.58 s gammaloop-nextest-docs> =========================================
  712. 45.59 s gammaloop-nextest-docs> Extracting 1 binary to /build/source
  713. 45.62 s gammaloop-nextest-docs> Extracted 4 files to /build/source in 0.03s
  714. 45.63 s gammaloop-nextest-docs> ------------
  715. 45.63 s gammaloop-nextest-docs> Nextest run ID 31d27f9f-40eb-48b6-845b-7bf9c9e7e530 with nextest profile: ci_gammaloop
  716. 45.63 s gammaloop-nextest-docs> Starting 0 tests across 1 binary
  717. 45.63 s gammaloop-nextest-docs> ------------
  718. 45.63 s gammaloop-nextest-docs> Summary [ 0.000s] 0 tests run: 0 passed, 0 skipped
  719. 45.66 s gammaloop-nextest-docs>
  720. 45.66 s gammaloop-nextest-docs> ========== nextest test summary ==========
  721. 45.66 s gammaloop-nextest-docs> report: target/nextest/ci_gammaloop/junit.xml
  722. 45.66 s gammaloop-nextest-docs> tests: 0, failures: 0, errors: 0
  723. 45.66 s gammaloop-nextest-docs> No failing testcases found.
  724. 45.66 s gammaloop-nextest-docs> =========================================
  725. 45.67 s gammaloop-nextest-docs> Extracting 1 binary to /build/source
  726. 45.70 s gammaloop-nextest-docs> Extracted 4 files to /build/source in 0.03s
  727. 45.71 s gammaloop-nextest-docs> ------------
  728. 45.71 s gammaloop-nextest-docs> Nextest run ID 8ca909f3-8571-4df9-a35d-79f2b1f95750 with nextest profile: ci_gammaloop
  729. 45.71 s gammaloop-nextest-docs> Starting 5 tests across 1 binary
  730. 45.72 s gammaloop-nextest-docs> ------------
  731. 45.72 s gammaloop-nextest-docs> Summary [ 0.005s] 5 tests run: 5 passed, 0 skipped
  732. 45.74 s gammaloop-nextest-docs>
  733. 45.74 s gammaloop-nextest-docs> ========== nextest test summary ==========
  734. 45.74 s gammaloop-nextest-docs> report: target/nextest/ci_gammaloop/junit.xml
  735. 45.74 s gammaloop-nextest-docs> tests: 5, failures: 0, errors: 0
  736. 45.74 s gammaloop-nextest-docs> No failing testcases found.
  737. 45.74 s gammaloop-nextest-docs> =========================================
  738. 45.90 s error: Cannot build '/nix/store/ig2n8vvnnpdbrss20g10xh19f2x4lxrl-gammaloop-nextest-docs.drv'.
  739. 45.90 s Reason: builder failed with exit code 100.
  740. 45.90 s Output paths:
  741. 45.90 s /nix/store/mvjf7pw7m7955c5sm90aqfnzz834drqw-gammaloop-nextest-docs
  742. 45.90 s Last 690 log lines:
  743. 45.90 s > Extracting 2 binaries to /build/source
  744. 45.90 s > Extracted 5 files to /build/source in 0.04s
  745. 45.90 s > ------------
  746. 45.90 s > Nextest run ID 41c799f1-b79a-47d1-9384-6804f8337feb with nextest profile: ci_gammaloop
  747. 45.90 s > Starting 111 tests across 2 binaries
  748. 45.90 s > FAIL [ 0.081s] ( 73/111) alphal00p-docs-builder tests::checked_in_registry_is_valid
  749. 45.90 s > stdout ---
  750. 45.90 s >
  751. 45.90 s > running 1 test
  752. 45.90 s > test tests::checked_in_registry_is_valid ... FAILED
  753. 45.90 s >
  754. 45.90 s > failures:
  755. 45.90 s >
  756. 45.90 s > failures:
  757. 45.90 s > tests::checked_in_registry_is_valid
  758. 45.90 s >
  759. 45.90 s > test result: FAILED. 0 passed; 1 failed; 0 ignored; 0 measured; 110 filtered out; finished in 0.08s
  760. 45.90 s >
  761. 45.90 s > stderr ---
  762. 45.90 s > warning: developer note gammaloop-architecture still requires a named owner
  763. 45.90 s > warning: developer note integration-dashboard still requires a named owner
  764. 45.90 s > warning: developer note uv-renormalization still requires a named owner
  765. 45.90 s > warning: developer note spenso-parsing-flow still requires a named owner
  766. 45.90 s > warning: developer note schoonschip-network still requires a named owner
  767. 45.90 s > warning: developer note gammaloop-draw-style-migration still requires a named owner
  768. 45.90 s > warning: developer note gammaloop-drawing-architecture still requires a named owner
  769. 45.90 s > warning: developer note spenso-symbolica-syntax-and-rewrites still requires a named owner
  770. 45.90 s > warning: developer note spenso-architecture still requires a named owner
  771. 45.90 s > warning: developer note idenso-architecture still requires a named owner
  772. 45.90 s > warning: developer note idenso-form-color-dirac-source-map still requires a named owner
  773. 45.90 s > warning: developer note linnet-architecture still requires a named owner
  774. 45.90 s > warning: developer note vakint-architecture still requires a named owner
  775. 45.90 s > warning: developer note gammaloop-roadmap still requires a named owner
  776. 45.90 s > warning: developer note cff-surface-cache-ownership still requires a named owner
  777. 45.90 s > warning: developer note gammaloop-drawing-evaluated-fields-history still requires a named owner
  778. 45.90 s > warning: archived developer note gammaloop-drawing-evaluated-fields-history has no immutable evidence revision
  779. 45.90 s > warning: developer note bnl-benchmark-investigation still requires a named owner
  780. 45.90 s > warning: developer note bnl-contraction-order-performance still requires a named owner
  781. 45.90 s > warning: developer note bnl-scalar-alias-capture still requires a named owner
  782. 45.90 s > warning: developer note aa-aa-three-loop-performance-smoke still requires a named owner
  783. 45.90 s > warning: developer note network-simplification still requires a named owner
  784. 45.90 s > warning: investigation developer note network-simplification has no immutable evidence revision
  785. 45.90 s > warning: developer note spenso-large-expressions still requires a named owner
  786. 45.90 s > warning: developer note spenso-improvement-effects still requires a named owner
  787. 45.90 s > warning: archived developer note spenso-improvement-effects has no immutable evidence revision
  788. 45.90 s > warning: developer note spenso-test-baseline still requires a named owner
  789. 45.90 s > warning: archived developer note spenso-test-baseline has no immutable evidence revision
  790. 45.90 s > warning: developer note bnl-evaluator-atom-capture still requires a named owner
  791. 45.90 s > warning: archived developer note bnl-evaluator-atom-capture has no immutable evidence revision
  792. 45.90 s > warning: developer note uv-scalar-profile-benchmark still requires a named owner
  793. 45.90 s > warning: archived developer note uv-scalar-profile-benchmark has no immutable evidence revision
  794. 45.90 s > warning: developer note ci-test-failure-summary-2026-03-25 still requires a named owner
  795. 45.90 s > warning: archived developer note ci-test-failure-summary-2026-03-25 has no immutable evidence revision
  796. 45.90 s > warning: developer note network-execution-rebase-record still requires a named owner
  797. 45.90 s > warning: archived developer note network-execution-rebase-record has no immutable evidence revision
  798. 45.90 s > warning: developer note ratatui-integration-dashboard-history still requires a named owner
  799. 45.90 s > warning: archived developer note ratatui-integration-dashboard-history has no immutable evidence revision
  800. 45.90 s > warning: developer note nix-crane-cache-reuse still requires a named owner
  801. 45.90 s >
  802. 45.90 s > thread 'tests::checked_in_registry_is_valid' (174) panicked at crates/alphal00p-docs-builder/src/lib.rs:11887:50:
  803. 45.90 s > called `Result::unwrap()` on an `Err` value: developer note nix-crane-cache-reuse verified scope flake.nix changed (expected 188504937418859942a6770ca21a4f4e0a7ff125, found 17dc35393f0f0abd5cb31c7eaf1fdc9aa6903ce4); owner review or an explicit no-impact attestation is required
  804. 45.90 s >
  805. 45.90 s > Location:
  806. 45.90 s > crates/alphal00p-docs-builder/src/lib.rs:889:21
  807. 45.90 s > stack backtrace:
  808. 45.90 s > 0: __rustc::rust_begin_unwind
  809. 45.90 s > 1: core::panicking::panic_fmt
  810. 45.90 s > 2: core::result::unwrap_failed
  811. 45.90 s > 3: alphal00p_docs_builder::tests::checked_in_registry_is_valid
  812. 45.90 s > 4: <alphal00p_docs_builder::tests::checked_in_registry_is_valid::{closure#0} as core::ops::function::FnOnce<()>>::call_once
  813. 45.90 s > note: Some details are omitted, run with `RUST_BACKTRACE=full` for a verbose backtrace.
  814. 45.90 s >
  815. 45.90 s > FAIL [ 0.076s] ( 82/111) alphal00p-docs-builder tests::every_product_requires_a_task_chooser_and_each_supported_interface
  816. 45.90 s > stdout ---
  817. 45.90 s >
  818. 45.90 s > running 1 test
  819. 45.90 s > test tests::every_product_requires_a_task_chooser_and_each_supported_interface ... FAILED
  820. 45.90 s >
  821. 45.90 s > failures:
  822. 45.90 s >
  823. 45.90 s > failures:
  824. 45.90 s > tests::every_product_requires_a_task_chooser_and_each_supported_interface
  825. 45.90 s >
  826. 45.90 s > test result: FAILED. 0 passed; 1 failed; 0 ignored; 0 measured; 110 filtered out; finished in 0.07s
  827. 45.90 s >
  828. 45.90 s > stderr ---
  829. 45.90 s > warning: developer note gammaloop-architecture still requires a named owner
  830. 45.90 s > warning: developer note integration-dashboard still requires a named owner
  831. 45.90 s > warning: developer note uv-renormalization still requires a named owner
  832. 45.90 s > warning: developer note spenso-parsing-flow still requires a named owner
  833. 45.90 s > warning: developer note schoonschip-network still requires a named owner
  834. 45.90 s > warning: developer note gammaloop-draw-style-migration still requires a named owner
  835. 45.90 s > warning: developer note gammaloop-drawing-architecture still requires a named owner
  836. 45.90 s > warning: developer note spenso-symbolica-syntax-and-rewrites still requires a named owner
  837. 45.90 s > warning: developer note spenso-architecture still requires a named owner
  838. 45.90 s > warning: developer note idenso-architecture still requires a named owner
  839. 45.90 s > warning: developer note idenso-form-color-dirac-source-map still requires a named owner
  840. 45.90 s > warning: developer note linnet-architecture still requires a named owner
  841. 45.90 s > warning: developer note vakint-architecture still requires a named owner
  842. 45.90 s > warning: developer note gammaloop-roadmap still requires a named owner
  843. 45.90 s > warning: developer note cff-surface-cache-ownership still requires a named owner
  844. 45.90 s > warning: developer note gammaloop-drawing-evaluated-fields-history still requires a named owner
  845. 45.90 s > warning: archived developer note gammaloop-drawing-evaluated-fields-history has no immutable evidence revision
  846. 45.90 s > warning: developer note bnl-benchmark-investigation still requires a named owner
  847. 45.90 s > warning: developer note bnl-contraction-order-performance still requires a named owner
  848. 45.90 s > warning: developer note bnl-scalar-alias-capture still requires a named owner
  849. 45.90 s > warning: developer note aa-aa-three-loop-performance-smoke still requires a named owner
  850. 45.90 s > warning: developer note network-simplification still requires a named owner
  851. 45.90 s > warning: investigation developer note network-simplification has no immutable evidence revision
  852. 45.90 s > warning: developer note spenso-large-expressions still requires a named owner
  853. 45.90 s > warning: developer note spenso-improvement-effects still requires a named owner
  854. 45.90 s > warning: archived developer note spenso-improvement-effects has no immutable evidence revision
  855. 45.90 s > warning: developer note spenso-test-baseline still requires a named owner
  856. 45.90 s > warning: archived developer note spenso-test-baseline has no immutable evidence revision
  857. 45.90 s > warning: developer note bnl-evaluator-atom-capture still requires a named owner
  858. 45.90 s > warning: archived developer note bnl-evaluator-atom-capture has no immutable evidence revision
  859. 45.90 s > warning: developer note uv-scalar-profile-benchmark still requires a named owner
  860. 45.90 s > warning: archived developer note uv-scalar-profile-benchmark has no immutable evidence revision
  861. 45.90 s > warning: developer note ci-test-failure-summary-2026-03-25 still requires a named owner
  862. 45.90 s > warning: archived developer note ci-test-failure-summary-2026-03-25 has no immutable evidence revision
  863. 45.90 s > warning: developer note network-execution-rebase-record still requires a named owner
  864. 45.90 s > warning: archived developer note network-execution-rebase-record has no immutable evidence revision
  865. 45.90 s > warning: developer note ratatui-integration-dashboard-history still requires a named owner
  866. 45.90 s > warning: archived developer note ratatui-integration-dashboard-history has no immutable evidence revision
  867. 45.90 s > warning: developer note nix-crane-cache-reuse still requires a named owner
  868. 45.90 s >
  869. 45.90 s > thread 'tests::every_product_requires_a_task_chooser_and_each_supported_interface' (264) panicked at crates/alphal00p-docs-builder/src/lib.rs:11901:9:
  870. 45.90 s > assertion failed: format!("{error:#}").contains("has no quickstart page")
  871. 45.90 s > stack backtrace:
  872. 45.90 s > 0: __rustc::rust_begin_unwind
  873. 45.90 s > 1: core::panicking::panic_fmt
  874. 45.90 s > 2: core::panicking::panic
  875. 45.90 s > 3: alphal00p_docs_builder::tests::every_product_requires_a_task_chooser_and_each_supported_interface
  876. 45.90 s > 4: <alphal00p_docs_builder::tests::every_product_requires_a_task_chooser_and_each_supported_interface::{closure#0} as core::ops::function::FnOnce<()>>::call_once
  877. 45.90 s > note: Some details are omitted, run with `RUST_BACKTRACE=full` for a verbose backtrace.
  878. 45.90 s >
  879. 45.90 s > FAIL [ 0.067s] ( 93/111) alphal00p-docs-builder tests::pdf_manual_chapter_order_must_match_the_page_registry
  880. 45.90 s > stdout ---
  881. 45.90 s >
  882. 45.90 s > running 1 test
  883. 45.90 s > test tests::pdf_manual_chapter_order_must_match_the_page_registry ... FAILED
  884. 45.90 s >
  885. 45.90 s > failures:
  886. 45.90 s >
  887. 45.90 s > failures:
  888. 45.90 s > tests::pdf_manual_chapter_order_must_match_the_page_registry
  889. 45.90 s >
  890. 45.90 s > test result: FAILED. 0 passed; 1 failed; 0 ignored; 0 measured; 110 filtered out; finished in 0.06s
  891. 45.90 s >
  892. 45.90 s > stderr ---
  893. 45.90 s > warning: developer note gammaloop-architecture still requires a named owner
  894. 45.90 s > warning: developer note integration-dashboard still requires a named owner
  895. 45.90 s > warning: developer note uv-renormalization still requires a named owner
  896. 45.90 s > warning: developer note spenso-parsing-flow still requires a named owner
  897. 45.90 s > warning: developer note schoonschip-network still requires a named owner
  898. 45.90 s > warning: developer note gammaloop-draw-style-migration still requires a named owner
  899. 45.90 s > warning: developer note gammaloop-drawing-architecture still requires a named owner
  900. 45.90 s > warning: developer note spenso-symbolica-syntax-and-rewrites still requires a named owner
  901. 45.90 s > warning: developer note spenso-architecture still requires a named owner
  902. 45.90 s > warning: developer note idenso-architecture still requires a named owner
  903. 45.90 s > warning: developer note idenso-form-color-dirac-source-map still requires a named owner
  904. 45.90 s > warning: developer note linnet-architecture still requires a named owner
  905. 45.90 s > warning: developer note vakint-architecture still requires a named owner
  906. 45.90 s > warning: developer note gammaloop-roadmap still requires a named owner
  907. 45.90 s > warning: developer note cff-surface-cache-ownership still requires a named owner
  908. 45.90 s > warning: developer note gammaloop-drawing-evaluated-fields-history still requires a named owner
  909. 45.90 s > warning: archived developer note gammaloop-drawing-evaluated-fields-history has no immutable evidence revision
  910. 45.90 s > warning: developer note bnl-benchmark-investigation still requires a named owner
  911. 45.90 s > warning: developer note bnl-contraction-order-performance still requires a named owner
  912. 45.90 s > warning: developer note bnl-scalar-alias-capture still requires a named owner
  913. 45.90 s > warning: developer note aa-aa-three-loop-performance-smoke still requires a named owner
  914. 45.90 s > warning: developer note network-simplification still requires a named owner
  915. 45.90 s > warning: investigation developer note network-simplification has no immutable evidence revision
  916. 45.90 s > warning: developer note spenso-large-expressions still requires a named owner
  917. 45.90 s > warning: developer note spenso-improvement-effects still requires a named owner
  918. 45.90 s > warning: archived developer note spenso-improvement-effects has no immutable evidence revision
  919. 45.90 s > warning: developer note spenso-test-baseline still requires a named owner
  920. 45.90 s > warning: archived developer note spenso-test-baseline has no immutable evidence revision
  921. 45.90 s > warning: developer note bnl-evaluator-atom-capture still requires a named owner
  922. 45.90 s > warning: archived developer note bnl-evaluator-atom-capture has no immutable evidence revision
  923. 45.90 s > warning: developer note uv-scalar-profile-benchmark still requires a named owner
  924. 45.90 s > warning: archived developer note uv-scalar-profile-benchmark has no immutable evidence revision
  925. 45.90 s > warning: developer note ci-test-failure-summary-2026-03-25 still requires a named owner
  926. 45.90 s > warning: archived developer note ci-test-failure-summary-2026-03-25 has no immutable evidence revision
  927. 45.90 s > warning: developer note network-execution-rebase-record still requires a named owner
  928. 45.90 s > warning: archived developer note network-execution-rebase-record has no immutable evidence revision
  929. 45.90 s > warning: developer note ratatui-integration-dashboard-history still requires a named owner
  930. 45.90 s > warning: archived developer note ratatui-integration-dashboard-history has no immutable evidence revision
  931. 45.90 s > warning: developer note nix-crane-cache-reuse still requires a named owner
  932. 45.90 s >
  933. 45.90 s > thread 'tests::pdf_manual_chapter_order_must_match_the_page_registry' (319) panicked at crates/alphal00p-docs-builder/src/lib.rs:11952:9:
  934. 45.90 s > assertion failed: format!("{error:#}").contains("PDF manual chapter order differs")
  935. 45.90 s > stack backtrace:
  936. 45.90 s > 0: __rustc::rust_begin_unwind
  937. 45.90 s > 1: core::panicking::panic_fmt
  938. 45.90 s > 2: core::panicking::panic
  939. 45.90 s > 3: alphal00p_docs_builder::tests::pdf_manual_chapter_order_must_match_the_page_registry
  940. 45.90 s > 4: <alphal00p_docs_builder::tests::pdf_manual_chapter_order_must_match_the_page_registry::{closure#0} as core::ops::function::FnOnce<()>>::call_once
  941. 45.90 s > note: Some details are omitted, run with `RUST_BACKTRACE=full` for a verbose backtrace.
  942. 45.90 s >
  943. 45.90 s > ------------
  944. 45.90 s > Summary [ 11.979s] 111 tests run: 108 passed, 3 failed, 0 skipped
  945. 45.90 s > FAIL [ 0.081s] ( 73/111) alphal00p-docs-builder tests::checked_in_registry_is_valid
  946. 45.90 s > stdout ---
  947. 45.90 s >
  948. 45.90 s > running 1 test
  949. 45.90 s > test tests::checked_in_registry_is_valid ... FAILED
  950. 45.90 s >
  951. 45.90 s > failures:
  952. 45.90 s >
  953. 45.90 s > failures:
  954. 45.90 s > tests::checked_in_registry_is_valid
  955. 45.90 s >
  956. 45.90 s > test result: FAILED. 0 passed; 1 failed; 0 ignored; 0 measured; 110 filtered out; finished in 0.08s
  957. 45.90 s >
  958. 45.90 s > stderr ---
  959. 45.90 s > warning: developer note gammaloop-architecture still requires a named owner
  960. 45.90 s > warning: developer note integration-dashboard still requires a named owner
  961. 45.90 s > warning: developer note uv-renormalization still requires a named owner
  962. 45.90 s > warning: developer note spenso-parsing-flow still requires a named owner
  963. 45.90 s > warning: developer note schoonschip-network still requires a named owner
  964. 45.90 s > warning: developer note gammaloop-draw-style-migration still requires a named owner
  965. 45.90 s > warning: developer note gammaloop-drawing-architecture still requires a named owner
  966. 45.90 s > warning: developer note spenso-symbolica-syntax-and-rewrites still requires a named owner
  967. 45.90 s > warning: developer note spenso-architecture still requires a named owner
  968. 45.90 s > warning: developer note idenso-architecture still requires a named owner
  969. 45.90 s > warning: developer note idenso-form-color-dirac-source-map still requires a named owner
  970. 45.90 s > warning: developer note linnet-architecture still requires a named owner
  971. 45.90 s > warning: developer note vakint-architecture still requires a named owner
  972. 45.90 s > warning: developer note gammaloop-roadmap still requires a named owner
  973. 45.90 s > warning: developer note cff-surface-cache-ownership still requires a named owner
  974. 45.90 s > warning: developer note gammaloop-drawing-evaluated-fields-history still requires a named owner
  975. 45.90 s > warning: archived developer note gammaloop-drawing-evaluated-fields-history has no immutable evidence revision
  976. 45.90 s > warning: developer note bnl-benchmark-investigation still requires a named owner
  977. 45.90 s > warning: developer note bnl-contraction-order-performance still requires a named owner
  978. 45.90 s > warning: developer note bnl-scalar-alias-capture still requires a named owner
  979. 45.90 s > warning: developer note aa-aa-three-loop-performance-smoke still requires a named owner
  980. 45.90 s > warning: developer note network-simplification still requires a named owner
  981. 45.90 s > warning: investigation developer note network-simplification has no immutable evidence revision
  982. 45.90 s > warning: developer note spenso-large-expressions still requires a named owner
  983. 45.90 s > warning: developer note spenso-improvement-effects still requires a named owner
  984. 45.90 s > warning: archived developer note spenso-improvement-effects has no immutable evidence revision
  985. 45.90 s > warning: developer note spenso-test-baseline still requires a named owner
  986. 45.90 s > warning: archived developer note spenso-test-baseline has no immutable evidence revision
  987. 45.90 s > warning: developer note bnl-evaluator-atom-capture still requires a named owner
  988. 45.90 s > warning: archived developer note bnl-evaluator-atom-capture has no immutable evidence revision
  989. 45.90 s > warning: developer note uv-scalar-profile-benchmark still requires a named owner
  990. 45.90 s > warning: archived developer note uv-scalar-profile-benchmark has no immutable evidence revision
  991. 45.90 s > warning: developer note ci-test-failure-summary-2026-03-25 still requires a named owner
  992. 45.90 s > warning: archived developer note ci-test-failure-summary-2026-03-25 has no immutable evidence revision
  993. 45.90 s > warning: developer note network-execution-rebase-record still requires a named owner
  994. 45.90 s > warning: archived developer note network-execution-rebase-record has no immutable evidence revision
  995. 45.90 s > warning: developer note ratatui-integration-dashboard-history still requires a named owner
  996. 45.90 s > warning: archived developer note ratatui-integration-dashboard-history has no immutable evidence revision
  997. 45.90 s > warning: developer note nix-crane-cache-reuse still requires a named owner
  998. 45.90 s >
  999. 45.90 s > thread 'tests::checked_in_registry_is_valid' (174) panicked at crates/alphal00p-docs-builder/src/lib.rs:11887:50:
  1000. 45.90 s > called `Result::unwrap()` on an `Err` value: developer note nix-crane-cache-reuse verified scope flake.nix changed (expected 188504937418859942a6770ca21a4f4e0a7ff125, found 17dc35393f0f0abd5cb31c7eaf1fdc9aa6903ce4); owner review or an explicit no-impact attestation is required
  1001. 45.90 s >
  1002. 45.90 s > Location:
  1003. 45.90 s > crates/alphal00p-docs-builder/src/lib.rs:889:21
  1004. 45.90 s > stack backtrace:
  1005. 45.90 s > 0: __rustc::rust_begin_unwind
  1006. 45.90 s > 1: core::panicking::panic_fmt
  1007. 45.90 s > 2: core::result::unwrap_failed
  1008. 45.90 s > 3: alphal00p_docs_builder::tests::checked_in_registry_is_valid
  1009. 45.90 s > 4: <alphal00p_docs_builder::tests::checked_in_registry_is_valid::{closure#0} as core::ops::function::FnOnce<()>>::call_once
  1010. 45.90 s > note: Some details are omitted, run with `RUST_BACKTRACE=full` for a verbose backtrace.
  1011. 45.90 s >
  1012. 45.90 s > FAIL [ 0.076s] ( 82/111) alphal00p-docs-builder tests::every_product_requires_a_task_chooser_and_each_supported_interface
  1013. 45.90 s > stdout ---
  1014. 45.90 s >
  1015. 45.90 s > running 1 test
  1016. 45.90 s > test tests::every_product_requires_a_task_chooser_and_each_supported_interface ... FAILED
  1017. 45.90 s >
  1018. 45.90 s > failures:
  1019. 45.90 s >
  1020. 45.90 s > failures:
  1021. 45.90 s > tests::every_product_requires_a_task_chooser_and_each_supported_interface
  1022. 45.90 s >
  1023. 45.90 s > test result: FAILED. 0 passed; 1 failed; 0 ignored; 0 measured; 110 filtered out; finished in 0.07s
  1024. 45.90 s >
  1025. 45.90 s > stderr ---
  1026. 45.90 s > warning: developer note gammaloop-architecture still requires a named owner
  1027. 45.90 s > warning: developer note integration-dashboard still requires a named owner
  1028. 45.90 s > warning: developer note uv-renormalization still requires a named owner
  1029. 45.90 s > warning: developer note spenso-parsing-flow still requires a named owner
  1030. 45.90 s > warning: developer note schoonschip-network still requires a named owner
  1031. 45.90 s > warning: developer note gammaloop-draw-style-migration still requires a named owner
  1032. 45.90 s > warning: developer note gammaloop-drawing-architecture still requires a named owner
  1033. 45.90 s > warning: developer note spenso-symbolica-syntax-and-rewrites still requires a named owner
  1034. 45.90 s > warning: developer note spenso-architecture still requires a named owner
  1035. 45.90 s > warning: developer note idenso-architecture still requires a named owner
  1036. 45.90 s > warning: developer note idenso-form-color-dirac-source-map still requires a named owner
  1037. 45.90 s > warning: developer note linnet-architecture still requires a named owner
  1038. 45.90 s > warning: developer note vakint-architecture still requires a named owner
  1039. 45.90 s > warning: developer note gammaloop-roadmap still requires a named owner
  1040. 45.90 s > warning: developer note cff-surface-cache-ownership still requires a named owner
  1041. 45.90 s > warning: developer note gammaloop-drawing-evaluated-fields-history still requires a named owner
  1042. 45.90 s > warning: archived developer note gammaloop-drawing-evaluated-fields-history has no immutable evidence revision
  1043. 45.90 s > warning: developer note bnl-benchmark-investigation still requires a named owner
  1044. 45.90 s > warning: developer note bnl-contraction-order-performance still requires a named owner
  1045. 45.90 s > warning: developer note bnl-scalar-alias-capture still requires a named owner
  1046. 45.90 s > warning: developer note aa-aa-three-loop-performance-smoke still requires a named owner
  1047. 45.90 s > warning: developer note network-simplification still requires a named owner
  1048. 45.90 s > warning: investigation developer note network-simplification has no immutable evidence revision
  1049. 45.90 s > warning: developer note spenso-large-expressions still requires a named owner
  1050. 45.90 s > warning: developer note spenso-improvement-effects still requires a named owner
  1051. 45.90 s > warning: archived developer note spenso-improvement-effects has no immutable evidence revision
  1052. 45.90 s > warning: developer note spenso-test-baseline still requires a named owner
  1053. 45.90 s > warning: archived developer note spenso-test-baseline has no immutable evidence revision
  1054. 45.90 s > warning: developer note bnl-evaluator-atom-capture still requires a named owner
  1055. 45.90 s > warning: archived developer note bnl-evaluator-atom-capture has no immutable evidence revision
  1056. 45.90 s > warning: developer note uv-scalar-profile-benchmark still requires a named owner
  1057. 45.90 s > warning: archived developer note uv-scalar-profile-benchmark has no immutable evidence revision
  1058. 45.90 s > warning: developer note ci-test-failure-summary-2026-03-25 still requires a named owner
  1059. 45.90 s > warning: archived developer note ci-test-failure-summary-2026-03-25 has no immutable evidence revision
  1060. 45.90 s > warning: developer note network-execution-rebase-record still requires a named owner
  1061. 45.90 s > warning: archived developer note network-execution-rebase-record has no immutable evidence revision
  1062. 45.90 s > warning: developer note ratatui-integration-dashboard-history still requires a named owner
  1063. 45.90 s > warning: archived developer note ratatui-integration-dashboard-history has no immutable evidence revision
  1064. 45.90 s > warning: developer note nix-crane-cache-reuse still requires a named owner
  1065. 45.90 s >
  1066. 45.90 s > thread 'tests::every_product_requires_a_task_chooser_and_each_supported_interface' (264) panicked at crates/alphal00p-docs-builder/src/lib.rs:11901:9:
  1067. 45.90 s > assertion failed: format!("{error:#}").contains("has no quickstart page")
  1068. 45.90 s > stack backtrace:
  1069. 45.90 s > 0: __rustc::rust_begin_unwind
  1070. 45.90 s > 1: core::panicking::panic_fmt
  1071. 45.90 s > 2: core::panicking::panic
  1072. 45.90 s > 3: alphal00p_docs_builder::tests::every_product_requires_a_task_chooser_and_each_supported_interface
  1073. 45.90 s > 4: <alphal00p_docs_builder::tests::every_product_requires_a_task_chooser_and_each_supported_interface::{closure#0} as core::ops::function::FnOnce<()>>::call_once
  1074. 45.90 s > note: Some details are omitted, run with `RUST_BACKTRACE=full` for a verbose backtrace.
  1075. 45.90 s >
  1076. 45.90 s > FAIL [ 0.067s] ( 93/111) alphal00p-docs-builder tests::pdf_manual_chapter_order_must_match_the_page_registry
  1077. 45.90 s > stdout ---
  1078. 45.90 s >
  1079. 45.90 s > running 1 test
  1080. 45.90 s > test tests::pdf_manual_chapter_order_must_match_the_page_registry ... FAILED
  1081. 45.90 s >
  1082. 45.90 s > failures:
  1083. 45.90 s >
  1084. 45.90 s > failures:
  1085. 45.90 s > tests::pdf_manual_chapter_order_must_match_the_page_registry
  1086. 45.90 s >
  1087. 45.90 s > test result: FAILED. 0 passed; 1 failed; 0 ignored; 0 measured; 110 filtered out; finished in 0.06s
  1088. 45.90 s >
  1089. 45.90 s > stderr ---
  1090. 45.90 s > warning: developer note gammaloop-architecture still requires a named owner
  1091. 45.90 s > warning: developer note integration-dashboard still requires a named owner
  1092. 45.90 s > warning: developer note uv-renormalization still requires a named owner
  1093. 45.90 s > warning: developer note spenso-parsing-flow still requires a named owner
  1094. 45.90 s > warning: developer note schoonschip-network still requires a named owner
  1095. 45.90 s > warning: developer note gammaloop-draw-style-migration still requires a named owner
  1096. 45.90 s > warning: developer note gammaloop-drawing-architecture still requires a named owner
  1097. 45.90 s > warning: developer note spenso-symbolica-syntax-and-rewrites still requires a named owner
  1098. 45.90 s > warning: developer note spenso-architecture still requires a named owner
  1099. 45.90 s > warning: developer note idenso-architecture still requires a named owner
  1100. 45.90 s > warning: developer note idenso-form-color-dirac-source-map still requires a named owner
  1101. 45.90 s > warning: developer note linnet-architecture still requires a named owner
  1102. 45.90 s > warning: developer note vakint-architecture still requires a named owner
  1103. 45.90 s > warning: developer note gammaloop-roadmap still requires a named owner
  1104. 45.90 s > warning: developer note cff-surface-cache-ownership still requires a named owner
  1105. 45.90 s > warning: developer note gammaloop-drawing-evaluated-fields-history still requires a named owner
  1106. 45.90 s > warning: archived developer note gammaloop-drawing-evaluated-fields-history has no immutable evidence revision
  1107. 45.90 s > warning: developer note bnl-benchmark-investigation still requires a named owner
  1108. 45.90 s > warning: developer note bnl-contraction-order-performance still requires a named owner
  1109. 45.90 s > warning: developer note bnl-scalar-alias-capture still requires a named owner
  1110. 45.90 s > warning: developer note aa-aa-three-loop-performance-smoke still requires a named owner
  1111. 45.90 s > warning: developer note network-simplification still requires a named owner
  1112. 45.90 s > warning: investigation developer note network-simplification has no immutable evidence revision
  1113. 45.90 s > warning: developer note spenso-large-expressions still requires a named owner
  1114. 45.90 s > warning: developer note spenso-improvement-effects still requires a named owner
  1115. 45.90 s > warning: archived developer note spenso-improvement-effects has no immutable evidence revision
  1116. 45.90 s > warning: developer note spenso-test-baseline still requires a named owner
  1117. 45.90 s > warning: archived developer note spenso-test-baseline has no immutable evidence revision
  1118. 45.90 s > warning: developer note bnl-evaluator-atom-capture still requires a named owner
  1119. 45.90 s > warning: archived developer note bnl-evaluator-atom-capture has no immutable evidence revision
  1120. 45.90 s > warning: developer note uv-scalar-profile-benchmark still requires a named owner
  1121. 45.90 s > warning: archived developer note uv-scalar-profile-benchmark has no immutable evidence revision
  1122. 45.90 s > warning: developer note ci-test-failure-summary-2026-03-25 still requires a named owner
  1123. 45.90 s > warning: archived developer note ci-test-failure-summary-2026-03-25 has no immutable evidence revision
  1124. 45.90 s > warning: developer note network-execution-rebase-record still requires a named owner
  1125. 45.90 s > warning: archived developer note network-execution-rebase-record has no immutable evidence revision
  1126. 45.90 s > warning: developer note ratatui-integration-dashboard-history still requires a named owner
  1127. 45.90 s > warning: archived developer note ratatui-integration-dashboard-history has no immutable evidence revision
  1128. 45.90 s > warning: developer note nix-crane-cache-reuse still requires a named owner
  1129. 45.90 s >
  1130. 45.90 s > thread 'tests::pdf_manual_chapter_order_must_match_the_page_registry' (319) panicked at crates/alphal00p-docs-builder/src/lib.rs:11952:9:
  1131. 45.90 s > assertion failed: format!("{error:#}").contains("PDF manual chapter order differs")
  1132. 45.90 s > stack backtrace:
  1133. 45.90 s > 0: __rustc::rust_begin_unwind
  1134. 45.90 s > 1: core::panicking::panic_fmt
  1135. 45.90 s > 2: core::panicking::panic
  1136. 45.90 s > 3: alphal00p_docs_builder::tests::pdf_manual_chapter_order_must_match_the_page_registry
  1137. 45.90 s > 4: <alphal00p_docs_builder::tests::pdf_manual_chapter_order_must_match_the_page_registry::{closure#0} as core::ops::function::FnOnce<()>>::call_once
  1138. 45.90 s > note: Some details are omitted, run with `RUST_BACKTRACE=full` for a verbose backtrace.
  1139. 45.90 s >
  1140. 45.90 s > error: test run failed
  1141. 45.90 s >
  1142. 45.90 s > ========== nextest test summary ==========
  1143. 45.90 s > report: target/nextest/ci_gammaloop/junit.xml
  1144. 45.90 s > tests: 111, failures: 3, errors: 0
  1145. 45.90 s >
  1146. 45.90 s > 1. alphal00p-docs-builder::tests::checked_in_registry_is_valid
  1147. 45.90 s > failure: test failure with exit code 101
  1148. 45.90 s > thread 'tests::checked_in_registry_is_valid' (174) panicked at crates/alphal00p-docs-builder/src/lib.rs:11887:50:
  1149. 45.90 s > called `Result::unwrap()` on an `Err` value: developer note nix-crane-cache-reuse verified scope flake.nix changed (expected 188504937418859942a6770ca21a4f4e0a7ff125, found 17dc35393f0f0abd5cb31c7eaf1fdc9aa6903ce4); owner review or an explicit no-impact attestation is required
  1150. 45.90 s >
  1151. 45.90 s > Location:
  1152. 45.90 s > crates/alphal00p-docs-builder/src/lib.rs:889:21
  1153. 45.90 s > stack backtrace:
  1154. 45.90 s > 0: __rustc::rust_begin_unwind
  1155. 45.90 s > 1: core::panicking::panic_fmt
  1156. 45.90 s > 2: core::result::unwrap_failed
  1157. 45.90 s > 3: alphal00p_docs_builder::tests::checked_in_registry_is_valid
  1158. 45.90 s > 4: <alphal00p_docs_builder::tests::checked_in_registry_is_valid::{closure#0} as core::ops::function::FnOnce<()>>::call_once
  1159. 45.90 s > note: Some details are omitted, run with `RUST_BACKTRACE=full` for a verbose backtrace.
  1160. 45.90 s > system-out
  1161. 45.90 s > running 1 test
  1162. 45.90 s > test tests::checked_in_registry_is_valid ... FAILED
  1163. 45.90 s >
  1164. 45.90 s > failures:
  1165. 45.90 s >
  1166. 45.90 s > failures:
  1167. 45.90 s > tests::checked_in_registry_is_valid
  1168. 45.90 s >
  1169. 45.90 s > test result: FAILED. 0 passed; 1 failed; 0 ignored; 0 measured; 110 filtered out; finished in 0.08s
  1170. 45.90 s > system-err
  1171. 45.90 s > warning: developer note gammaloop-architecture still requires a named owner
  1172. 45.90 s > warning: developer note integration-dashboard still requires a named owner
  1173. 45.90 s > warning: developer note uv-renormalization still requires a named owner
  1174. 45.90 s > warning: developer note spenso-parsing-flow still requires a named owner
  1175. 45.90 s > warning: developer note schoonschip-network still requires a named owner
  1176. 45.90 s > warning: developer note gammaloop-draw-style-migration still requires a named owner
  1177. 45.90 s > warning: developer note gammaloop-drawing-architecture still requires a named owner
  1178. 45.90 s > warning: developer note spenso-symbolica-syntax-and-rewrites still requires a named owner
  1179. 45.90 s > warning: developer note spenso-architecture still requires a named owner
  1180. 45.90 s > warning: developer note idenso-architecture still requires a named owner
  1181. 45.90 s > warning: developer note idenso-form-color-dirac-source-map still requires a named owner
  1182. 45.90 s > warning: developer note linnet-architecture still requires a named owner
  1183. 45.90 s > warning: developer note vakint-architecture still requires a named owner
  1184. 45.90 s > warning: developer note gammaloop-roadmap still requires a named owner
  1185. 45.90 s > warning: developer note cff-surface-cache-ownership still requires a named owner
  1186. 45.90 s > warning: developer note gammaloop-drawing-evaluated-fields-history still requires a named owner
  1187. 45.90 s > warning: archived developer note gammaloop-drawing-evaluated-fields-history has no immutable evidence revision
  1188. 45.90 s > warning: developer note bnl-benchmark-investigation still requires a named owner
  1189. 45.90 s > warning: developer note bnl-contraction-order-performance still requires a named owner
  1190. 45.90 s > warning: developer note bnl-scalar-alias-capture still requires a named owner
  1191. 45.90 s > warning: developer note aa-aa-three-loop-performance-smoke still requires a named owner
  1192. 45.90 s > warning: developer note network-simplification still requires a named owner
  1193. 45.90 s > warning: investigation developer note network-simplification has no immutable evidence revision
  1194. 45.90 s > warning: developer note spenso-large-expressions still requires a named owner
  1195. 45.90 s > warning: developer note spenso-improvement-effects still requires a named owner
  1196. 45.90 s > warning: archived developer note spenso-improvement-effects has no immutable evidence revision
  1197. 45.90 s > warning: developer note spenso-test-baseline still requires a named owner
  1198. 45.90 s > warning: archived developer note spenso-test-baseline has no immutable evidence revision
  1199. 45.90 s > warning: developer note bnl-evaluator-atom-capture still requires a named owner
  1200. 45.90 s > warning: archived developer note bnl-evaluator-atom-capture has no immutable evidence revision
  1201. 45.90 s > warning: developer note uv-scalar-profile-benchmark still requires a named owner
  1202. 45.90 s > warning: archived developer note uv-scalar-profile-benchmark has no immutable evidence revision
  1203. 45.90 s > warning: developer note ci-test-failure-summary-2026-03-25 still requires a named owner
  1204. 45.90 s > warning: archived developer note ci-test-failure-summary-2026-03-25 has no immutable evidence revision
  1205. 45.90 s > warning: developer note network-execution-rebase-record still requires a named owner
  1206. 45.90 s > warning: archived developer note network-execution-rebase-record has no immutable evidence revision
  1207. 45.90 s > warning: developer note ratatui-integration-dashboard-history still requires a named owner
  1208. 45.90 s > warning: archived developer note ratatui-integration-dashboard-history has no immutable evidence revision
  1209. 45.90 s > warning: developer note nix-crane-cache-reuse still requires a named owner
  1210. 45.90 s >
  1211. 45.90 s > thread 'tests::checked_in_registry_is_valid' (174) panicked at crates/alphal00p-docs-builder/src/lib.rs:11887:50:
  1212. 45.90 s > called `Result::unwrap()` on an `Err` value: developer note nix-crane-cache-reuse verified scope flake.nix changed (expected 188504937418859942a6770ca21a4f4e0a7ff125, found 17dc35393f0f0abd5cb31c7eaf1fdc9aa6903ce4); owner review or an explicit no-impact attestation is required
  1213. 45.90 s >
  1214. 45.90 s > Location:
  1215. 45.90 s > crates/alphal00p-docs-builder/src/lib.rs:889:21
  1216. 45.90 s > stack backtrace:
  1217. 45.90 s > 0: __rustc::rust_begin_unwind
  1218. 45.90 s > 1: core::panicking::panic_fmt
  1219. 45.90 s > 2: core::result::unwrap_failed
  1220. 45.90 s > 3: alphal00p_docs_builder::tests::checked_in_registry_is_valid
  1221. 45.90 s > 4: <alphal00p_docs_builder::tests::checked_in_registry_is_valid::{closure#0} as core::ops::function::FnOnce<()>>::call_once
  1222. 45.90 s > note: Some details are omitted, run with `RUST_BACKTRACE=full` for a verbose backtrace.
  1223. 45.90 s >
  1224. 45.90 s > 2. alphal00p-docs-builder::tests::every_product_requires_a_task_chooser_and_each_supported_interface
  1225. 45.90 s > failure: test failure with exit code 101
  1226. 45.90 s > thread 'tests::every_product_requires_a_task_chooser_and_each_supported_interface' (264) panicked at crates/alphal00p-docs-builder/src/lib.rs:11901:9:
  1227. 45.90 s > assertion failed: format!("{error:#}").contains("has no quickstart page")
  1228. 45.90 s > stack backtrace:
  1229. 45.90 s > 0: __rustc::rust_begin_unwind
  1230. 45.90 s > 1: core::panicking::panic_fmt
  1231. 45.90 s > 2: core::panicking::panic
  1232. 45.90 s > 3: alphal00p_docs_builder::tests::every_product_requires_a_task_chooser_and_each_supported_interface
  1233. 45.90 s > 4: <alphal00p_docs_builder::tests::every_product_requires_a_task_chooser_and_each_supported_interface::{closure#0} as core::ops::function::FnOnce<()>>::call_once
  1234. 45.90 s > note: Some details are omitted, run with `RUST_BACKTRACE=full` for a verbose backtrace.
  1235. 45.90 s > system-out
  1236. 45.90 s > running 1 test
  1237. 45.90 s > test tests::every_product_requires_a_task_chooser_and_each_supported_interface ... FAILED
  1238. 45.90 s >
  1239. 45.90 s > failures:
  1240. 45.90 s >
  1241. 45.90 s > failures:
  1242. 45.90 s > tests::every_product_requires_a_task_chooser_and_each_supported_interface
  1243. 45.90 s >
  1244. 45.90 s > test result: FAILED. 0 passed; 1 failed; 0 ignored; 0 measured; 110 filtered out; finished in 0.07s
  1245. 45.90 s > system-err
  1246. 45.90 s > warning: developer note gammaloop-architecture still requires a named owner
  1247. 45.90 s > warning: developer note integration-dashboard still requires a named owner
  1248. 45.90 s > warning: developer note uv-renormalization still requires a named owner
  1249. 45.90 s > warning: developer note spenso-parsing-flow still requires a named owner
  1250. 45.90 s > warning: developer note schoonschip-network still requires a named owner
  1251. 45.90 s > warning: developer note gammaloop-draw-style-migration still requires a named owner
  1252. 45.90 s > warning: developer note gammaloop-drawing-architecture still requires a named owner
  1253. 45.90 s > warning: developer note spenso-symbolica-syntax-and-rewrites still requires a named owner
  1254. 45.90 s > warning: developer note spenso-architecture still requires a named owner
  1255. 45.90 s > warning: developer note idenso-architecture still requires a named owner
  1256. 45.90 s > warning: developer note idenso-form-color-dirac-source-map still requires a named owner
  1257. 45.90 s > warning: developer note linnet-architecture still requires a named owner
  1258. 45.90 s > warning: developer note vakint-architecture still requires a named owner
  1259. 45.90 s > warning: developer note gammaloop-roadmap still requires a named owner
  1260. 45.90 s > warning: developer note cff-surface-cache-ownership still requires a named owner
  1261. 45.90 s > warning: developer note gammaloop-drawing-evaluated-fields-history still requires a named owner
  1262. 45.90 s > warning: archived developer note gammaloop-drawing-evaluated-fields-history has no immutable evidence revision
  1263. 45.90 s > warning: developer note bnl-benchmark-investigation still requires a named owner
  1264. 45.90 s > warning: developer note bnl-contraction-order-performance still requires a named owner
  1265. 45.90 s > warning: developer note bnl-scalar-alias-capture still requires a named owner
  1266. 45.90 s > warning: developer note aa-aa-three-loop-performance-smoke still requires a named owner
  1267. 45.90 s > warning: developer note network-simplification still requires a named owner
  1268. 45.90 s > warning: investigation developer note network-simplification has no immutable evidence revision
  1269. 45.90 s > warning: developer note spenso-large-expressions still requires a named owner
  1270. 45.90 s > warning: developer note spenso-improvement-effects still requires a named owner
  1271. 45.90 s > warning: archived developer note spenso-improvement-effects has no immutable evidence revision
  1272. 45.90 s > warning: developer note spenso-test-baseline still requires a named owner
  1273. 45.90 s > warning: archived developer note spenso-test-baseline has no immutable evidence revision
  1274. 45.90 s > warning: developer note bnl-evaluator-atom-capture still requires a named owner
  1275. 45.90 s > warning: archived developer note bnl-evaluator-atom-capture has no immutable evidence revision
  1276. 45.90 s > warning: developer note uv-scalar-profile-benchmark still requires a named owner
  1277. 45.90 s > warning: archived developer note uv-scalar-profile-benchmark has no immutable evidence revision
  1278. 45.90 s > warning: developer note ci-test-failure-summary-2026-03-25 still requires a named owner
  1279. 45.90 s > warning: archived developer note ci-test-failure-summary-2026-03-25 has no immutable evidence revision
  1280. 45.90 s > warning: developer note network-execution-rebase-record still requires a named owner
  1281. 45.90 s > warning: archived developer note network-execution-rebase-record has no immutable evidence revision
  1282. 45.90 s > warning: developer note ratatui-integration-dashboard-history still requires a named owner
  1283. 45.90 s > warning: archived developer note ratatui-integration-dashboard-history has no immutable evidence revision
  1284. 45.90 s > warning: developer note nix-crane-cache-reuse still requires a named owner
  1285. 45.90 s >
  1286. 45.90 s > thread 'tests::every_product_requires_a_task_chooser_and_each_supported_interface' (264) panicked at crates/alphal00p-docs-builder/src/lib.rs:11901:9:
  1287. 45.90 s > assertion failed: format!("{error:#}").contains("has no quickstart page")
  1288. 45.90 s > stack backtrace:
  1289. 45.90 s > 0: __rustc::rust_begin_unwind
  1290. 45.90 s > 1: core::panicking::panic_fmt
  1291. 45.90 s > 2: core::panicking::panic
  1292. 45.90 s > 3: alphal00p_docs_builder::tests::every_product_requires_a_task_chooser_and_each_supported_interface
  1293. 45.90 s > 4: <alphal00p_docs_builder::tests::every_product_requires_a_task_chooser_and_each_supported_interface::{closure#0} as core::ops::function::FnOnce<()>>::call_once
  1294. 45.90 s > note: Some details are omitted, run with `RUST_BACKTRACE=full` for a verbose backtrace.
  1295. 45.90 s >
  1296. 45.90 s > 3. alphal00p-docs-builder::tests::pdf_manual_chapter_order_must_match_the_page_registry
  1297. 45.90 s > failure: test failure with exit code 101
  1298. 45.90 s > thread 'tests::pdf_manual_chapter_order_must_match_the_page_registry' (319) panicked at crates/alphal00p-docs-builder/src/lib.rs:11952:9:
  1299. 45.90 s > assertion failed: format!("{error:#}").contains("PDF manual chapter order differs")
  1300. 45.90 s > stack backtrace:
  1301. 45.90 s > 0: __rustc::rust_begin_unwind
  1302. 45.90 s > 1: core::panicking::panic_fmt
  1303. 45.90 s > 2: core::panicking::panic
  1304. 45.90 s > 3: alphal00p_docs_builder::tests::pdf_manual_chapter_order_must_match_the_page_registry
  1305. 45.90 s > 4: <alphal00p_docs_builder::tests::pdf_manual_chapter_order_must_match_the_page_registry::{closure#0} as core::ops::function::FnOnce<()>>::call_once
  1306. 45.90 s > note: Some details are omitted, run with `RUST_BACKTRACE=full` for a verbose backtrace.
  1307. 45.90 s > system-out
  1308. 45.90 s > running 1 test
  1309. 45.90 s > test tests::pdf_manual_chapter_order_must_match_the_page_registry ... FAILED
  1310. 45.90 s >
  1311. 45.90 s > failures:
  1312. 45.90 s >
  1313. 45.90 s > failures:
  1314. 45.90 s > tests::pdf_manual_chapter_order_must_match_the_page_registry
  1315. 45.90 s >
  1316. 45.90 s > test result: FAILED. 0 passed; 1 failed; 0 ignored; 0 measured; 110 filtered out; finished in 0.06s
  1317. 45.90 s > system-err
  1318. 45.90 s > warning: developer note gammaloop-architecture still requires a named owner
  1319. 45.90 s > warning: developer note integration-dashboard still requires a named owner
  1320. 45.90 s > warning: developer note uv-renormalization still requires a named owner
  1321. 45.90 s > warning: developer note spenso-parsing-flow still requires a named owner
  1322. 45.90 s > warning: developer note schoonschip-network still requires a named owner
  1323. 45.90 s > warning: developer note gammaloop-draw-style-migration still requires a named owner
  1324. 45.90 s > warning: developer note gammaloop-drawing-architecture still requires a named owner
  1325. 45.90 s > warning: developer note spenso-symbolica-syntax-and-rewrites still requires a named owner
  1326. 45.90 s > warning: developer note spenso-architecture still requires a named owner
  1327. 45.90 s > warning: developer note idenso-architecture still requires a named owner
  1328. 45.90 s > warning: developer note idenso-form-color-dirac-source-map still requires a named owner
  1329. 45.90 s > warning: developer note linnet-architecture still requires a named owner
  1330. 45.90 s > warning: developer note vakint-architecture still requires a named owner
  1331. 45.90 s > warning: developer note gammaloop-roadmap still requires a named owner
  1332. 45.90 s > warning: developer note cff-surface-cache-ownership still requires a named owner
  1333. 45.90 s > warning: developer note gammaloop-drawing-evaluated-fields-history still requires a named owner
  1334. 45.90 s > warning: archived developer note gammaloop-drawing-evaluated-fields-history has no immutable evidence revision
  1335. 45.90 s > warning: developer note bnl-benchmark-investigation still requires a named owner
  1336. 45.90 s > warning: developer note bnl-contraction-order-performance still requires a named owner
  1337. 45.90 s > warning: developer note bnl-scalar-alias-capture still requires a named owner
  1338. 45.90 s > warning: developer note aa-aa-three-loop-performance-smoke still requires a named owner
  1339. 45.90 s > warning: developer note network-simplification still requires a named owner
  1340. 45.90 s > warning: investigation developer note network-simplification has no immutable evidence revision
  1341. 45.90 s > warning: developer note spenso-large-expressions still requires a named owner
  1342. 45.90 s > warning: developer note spenso-improvement-effects still requires a named owner
  1343. 45.90 s > warning: archived developer note spenso-improvement-effects has no immutable evidence revision
  1344. 45.90 s > warning: developer note spenso-test-baseline still requires a named owner
  1345. 45.90 s > warning: archived developer note spenso-test-baseline has no immutable evidence revision
  1346. 45.90 s > warning: developer note bnl-evaluator-atom-capture still requires a named owner
  1347. 45.90 s > warning: archived developer note bnl-evaluator-atom-capture has no immutable evidence revision
  1348. 45.90 s > warning: developer note uv-scalar-profile-benchmark still requires a named owner
  1349. 45.90 s > warning: archived developer note uv-scalar-profile-benchmark has no immutable evidence revision
  1350. 45.90 s > warning: developer note ci-test-failure-summary-2026-03-25 still requires a named owner
  1351. 45.90 s > warning: archived developer note ci-test-failure-summary-2026-03-25 has no immutable evidence revision
  1352. 45.90 s > warning: developer note network-execution-rebase-record still requires a named owner
  1353. 45.90 s > warning: archived developer note network-execution-rebase-record has no immutable evidence revision
  1354. 45.90 s > warning: developer note ratatui-integration-dashboard-history still requires a named owner
  1355. 45.90 s > warning: archived developer note ratatui-integration-dashboard-history has no immutable evidence revision
  1356. 45.90 s > warning: developer note nix-crane-cache-reuse still requires a named owner
  1357. 45.90 s >
  1358. 45.90 s > thread 'tests::pdf_manual_chapter_order_must_match_the_page_registry' (319) panicked at crates/alphal00p-docs-builder/src/lib.rs:11952:9:
  1359. 45.90 s > assertion failed: format!("{error:#}").contains("PDF manual chapter order differs")
  1360. 45.90 s > stack backtrace:
  1361. 45.90 s > 0: __rustc::rust_begin_unwind
  1362. 45.90 s > 1: core::panicking::panic_fmt
  1363. 45.90 s > 2: core::panicking::panic
  1364. 45.90 s > 3: alphal00p_docs_builder::tests::pdf_manual_chapter_order_must_match_the_page_registry
  1365. 45.90 s > 4: <alphal00p_docs_builder::tests::pdf_manual_chapter_order_must_match_the_page_registry::{closure#0} as core::ops::function::FnOnce<()>>::call_once
  1366. 45.90 s > note: Some details are omitted, run with `RUST_BACKTRACE=full` for a verbose backtrace.
  1367. 45.90 s > =========================================
  1368. 45.90 s > Extracting 2 binaries to /build/source
  1369. 45.90 s > Extracted 5 files to /build/source in 0.03s
  1370. 45.90 s > ------------
  1371. 45.90 s > Nextest run ID b5ec9295-bd27-4aca-beb9-fcef7602151e with nextest profile: ci_gammaloop
  1372. 45.90 s > Starting 22 tests across 2 binaries
  1373. 45.90 s > ------------
  1374. 45.90 s > Summary [ 0.015s] 22 tests run: 22 passed, 0 skipped
  1375. 45.90 s >
  1376. 45.90 s > ========== nextest test summary ==========
  1377. 45.90 s > report: target/nextest/ci_gammaloop/junit.xml
  1378. 45.90 s > tests: 22, failures: 0, errors: 0
  1379. 45.90 s > No failing testcases found.
  1380. 45.90 s > =========================================
  1381. 45.90 s > Extracting 1 binary, 1 build script output directory, and 2 linked paths to /build/source
  1382. 45.90 s > Extracted 18 files to /build/source in 0.06s
  1383. 45.90 s > ------------
  1384. 45.90 s > Nextest run ID ec48143d-5129-40e1-9b37-99d6a8e401bb with nextest profile: ci_gammaloop
  1385. 45.90 s > Starting 89 tests across 1 binary
  1386. 45.90 s > ------------
  1387. 45.90 s > Summary [ 0.038s] 89 tests run: 89 passed, 0 skipped
  1388. 45.90 s >
  1389. 45.90 s > ========== nextest test summary ==========
  1390. 45.90 s > report: target/nextest/ci_gammaloop/junit.xml
  1391. 45.90 s > tests: 89, failures: 0, errors: 0
  1392. 45.90 s > No failing testcases found.
  1393. 45.90 s > =========================================
  1394. 45.90 s > Extracting 2 binaries to /build/source
  1395. 45.90 s > Extracted 5 files to /build/source in 0.04s
  1396. 45.90 s > ------------
  1397. 45.90 s > Nextest run ID 27e0d0fb-7422-4650-9a76-7bc5d97b8e5b with nextest profile: ci_gammaloop
  1398. 45.90 s > Starting 10 tests across 2 binaries
  1399. 45.90 s > ------------
  1400. 45.90 s > Summary [ 10.712s] 10 tests run: 10 passed, 0 skipped
  1401. 45.90 s >
  1402. 45.90 s > ========== nextest test summary ==========
  1403. 45.90 s > report: target/nextest/ci_gammaloop/junit.xml
  1404. 45.90 s > tests: 10, failures: 0, errors: 0
  1405. 45.90 s > No failing testcases found.
  1406. 45.90 s > =========================================
  1407. 45.90 s > Extracting 1 binary to /build/source
  1408. 45.90 s > Extracted 4 files to /build/source in 0.03s
  1409. 45.90 s > ------------
  1410. 45.90 s > Nextest run ID 31d27f9f-40eb-48b6-845b-7bf9c9e7e530 with nextest profile: ci_gammaloop
  1411. 45.90 s > Starting 0 tests across 1 binary
  1412. 45.90 s > ------------
  1413. 45.90 s > Summary [ 0.000s] 0 tests run: 0 passed, 0 skipped
  1414. 45.90 s >
  1415. 45.90 s > ========== nextest test summary ==========
  1416. 45.90 s > report: target/nextest/ci_gammaloop/junit.xml
  1417. 45.90 s > tests: 0, failures: 0, errors: 0
  1418. 45.90 s > No failing testcases found.
  1419. 45.90 s > =========================================
  1420. 45.90 s > Extracting 1 binary to /build/source
  1421. 45.90 s > Extracted 4 files to /build/source in 0.03s
  1422. 45.90 s > ------------
  1423. 45.90 s > Nextest run ID 8ca909f3-8571-4df9-a35d-79f2b1f95750 with nextest profile: ci_gammaloop
  1424. 45.90 s > Starting 5 tests across 1 binary
  1425. 45.90 s > ------------
  1426. 45.90 s > Summary [ 0.005s] 5 tests run: 5 passed, 0 skipped
  1427. 45.90 s >
  1428. 45.90 s > ========== nextest test summary ==========
  1429. 45.90 s > report: target/nextest/ci_gammaloop/junit.xml
  1430. 45.90 s > tests: 5, failures: 0, errors: 0
  1431. 45.90 s > No failing testcases found.
  1432. 45.90 s > =========================================
  1433. 45.90 s For full logs, run:
  1434. 45.90 s nix log /nix/store/ig2n8vvnnpdbrss20g10xh19f2x4lxrl-gammaloop-nextest-docs.drv
  1435. 46.02 s [1 built (1 failed), 7 cRun failed.