test packages.x86_64-linux.nix-ci-check-gammaloop-nextest-docs

Reproduce this run
Original Run
  1. 0.00 s $ /nix/store/9ypz3flqsrl5xl495mm8h645gadjsxi1-coreutils-9.11/bin/timeout --kill-after=15s 7200s /nix/store/23zk8sgzamrbmj1fday15szf7f2279s8-nix-2.34.7/bin/nix --extra-experimental-features nix-command --extra-experimental-features flakes flake clone git+https://github.com/alphal00p/gammaloop --dest /tmp/nix-ci-worker/stable-pwd/repo/
  2. 0.08 s Cloning into '/tmp/nix-ci-worker/stable-pwd/repo'...
  3. 0.90 s remote: Enumerating objects: 79689, done.
  4. 1.02 s remote: Counting objects: 0% (1/9284) remote: Counting objects: 1% (93/9284) remote: Counting objects: 2% (186/9284) remote: Counting objects: 3% (279/9284) remote: Counting objects: 4% (372/9284) remote: Counting objects: 5% (465/9284) remote: Counting objects: 6% (558/9284) remote: Counting objects: 7% (650/9284) remote: Counting objects: 8% (743/9284) remote: Counting objects: 9% (836/9284) remote: Counting objects: 10% (929/9284) remote: Counting objects: 11% (1022/9284) remote: Counting objects: 12% (1115/9284) remote: Counting objects: 13% (1207/9284) remote: Counting objects: 14% (1300/9284) remote: Counting objects: 15% (1393/9284) remote: Counting objects: 16% (1486/9284) remote: Counting objects: 17% (1579/9284) remote: Counting objects: 18% (1672/9284) remote: Counting objects: 19% (1764/9284) remote: Counting objects: 20% (1857/9284) remote: Counting objects: 21% (1950/9284) remote: Counting objects: 22% (2043/9284) remote: Counting objects: 23% (2136/9284) remote: Counting objects: 24% (2229/9284) remote: Counting objects: 25% (2321/9284) remote: Counting objects: 26% (2414/9284) remote: Counting objects: 27% (2507/9284) remote: Counting objects: 28% (2600/9284) remote: Counting objects: 29% (2693/9284) remote: Counting objects: 30% (2786/9284) remote: Counting objects: 31% (2879/9284) remote: Counting objects: 32% (2971/9284) remote: Counting objects: 33% (3064/9284) remote: Counting objects: 34% (3157/9284) remote: Counting objects: 35% (3250/9284) remote: Counting objects: 36% (3343/9284) remote: Counting objects: 37% (3436/9284) remote: Counting objects: 38% (3528/9284) remote: Counting objects: 39% (3621/9284) remote: Counting objects: 40% (3714/9284) remote: Counting objects: 41% (3807/9284) remote: Counting objects: 42% (3900/9284) remote: Counting objects: 43% (3993/9284) remote: Counting objects: 44% (4085/9284) remote: Counting objects: 45% (4178/9284) remote: Counting objects: 46% (4271/9284) remote: Counting objects: 47% (4364/9284) remote: Counting objects: 48% (4457/9284) remote: Counting objects: 49% (4550/9284) remote: Counting objects: 50% (4642/9284) remote: Counting objects: 51% (4735/9284) remote: Counting objects: 52% (4828/9284) remote: Counting objects: 53% (4921/9284) remote: Counting objects: 54% (5014/9284) remote: Counting objects: 55% (5107/9284) remote: Counting objects: 56% (5200/9284) remote: Counting objects: 57% (5292/9284) remote: Counting objects: 58% (5385/9284) remote: Counting objects: 59% (5478/9284) remote: Counting objects: 60% (5571/9284) remote: Counting objects: 61% (5664/9284) remote: Counting objects: 62% (5757/9284) remote: Counting objects: 63% (5849/9284) remote: Counting objects: 64% (5942/9284) remote: Counting objects: 65% (6035/9284) remote: Counting objects: 66% (6128/9284) remote: Counting objects: 67% (6221/9284) remote: Counting objects: 68% (6314/9284) remote: Counting objects: 69% (6406/9284) remote: Counting objects: 70% (6499/9284) remote: Counting objects: 71% (6592/9284) remote: Counting objects: 72% (6685/9284) remote: Counting objects: 73% (6778/9284) remote: Counting objects: 74% (6871/9284) remote: Counting objects: 75% (6963/9284) remote: Counting objects: 76% (7056/9284) remote: Counting objects: 77% (7149/9284) remote: Counting objects: 78% (7242/9284) remote: Counting objects: 79% (7335/9284) remote: Counting objects: 80% (7428/9284) remote: Counting objects: 81% (7521/9284) remote: Counting objects: 82% (7613/9284) remote: Counting objects: 83% (7706/9284) remote: Counting objects: 84% (7799/9284) remote: Counting objects: 85% (7892/9284) remote: Counting objects: 86% (7985/9284) remote: Counting objects: 87% (8078/9284) remote: Counting objects: 88% (8170/9284) remote: Counting objects: 89% (8263/9284) remote: Counting objects: 90% (8356/9284) remote: Counting objects: 91% (8449/9284) remote: Counting objects: 92% (8542/9284) remote: Counting objects: 93% (8635/9284) remote: Counting objects: 94% (8727/9284) remote: Counting objects: 95% (8820/9284) remote: Counting objects: 96% (8913/9284) remote: Counting objects: 97% (9006/9284) remote: Counting objects: 98% (9099/9284) remote: Counting objects: 99% (9192/9284) remote: Counting objects: 100% (9284/9284) remote: Counting objects: 100% (9284/9284), done.
  5. 3.10 s remote: Compressing objects: 0% (1/2087) remote: Compressing objects: 1% (21/2087) remote: Compressing objects: 2% (42/2087) remote: Compressing objects: 3% (63/2087) remote: Compressing objects: 4% (84/2087) remote: Compressing objects: 5% (105/2087) remote: Compressing objects: 6% (126/2087) remote: Compressing objects: 7% (147/2087) remote: Compressing objects: 8% (167/2087) remote: Compressing objects: 9% (188/2087) remote: Compressing objects: 10% (209/2087) remote: Compressing objects: 11% (230/2087) remote: Compressing objects: 12% (251/2087) remote: Compressing objects: 13% (272/2087) remote: Compressing objects: 14% (293/2087) remote: Compressing objects: 15% (314/2087) remote: Compressing objects: 15% (325/2087) remote: Compressing objects: 16% (334/2087) remote: Compressing objects: 17% (355/2087) remote: Compressing objects: 18% (376/2087) remote: Compressing objects: 19% (397/2087) remote: Compressing objects: 20% (418/2087) remote: Compressing objects: 21% (439/2087) remote: Compressing objects: 22% (460/2087) remote: Compressing objects: 23% (481/2087) remote: Compressing objects: 24% (501/2087) remote: Compressing objects: 25% (522/2087) remote: Compressing objects: 26% (543/2087) remote: Compressing objects: 27% (564/2087) remote: Compressing objects: 28% (585/2087) remote: Compressing objects: 29% (606/2087) remote: Compressing objects: 29% (621/2087) remote: Compressing objects: 30% (627/2087) remote: Compressing objects: 31% (647/2087) remote: Compressing objects: 32% (668/2087) remote: Compressing objects: 33% (689/2087) remote: Compressing objects: 34% (710/2087) remote: Compressing objects: 35% (731/2087) remote: Compressing objects: 36% (752/2087) remote: Compressing objects: 37% (773/2087) remote: Compressing objects: 38% (794/2087) remote: Compressing objects: 39% (814/2087) remote: Compressing objects: 40% (835/2087) remote: Compressing objects: 41% (856/2087) remote: Compressing objects: 42% (877/2087) remote: Compressing objects: 43% (898/2087) remote: Compressing objects: 44% (919/2087) remote: Compressing objects: 45% (940/2087) remote: Compressing objects: 46% (961/2087) remote: Compressing objects: 47% (981/2087) remote: Compressing objects: 48% (1002/2087) remote: Compressing objects: 49% (1023/2087) remote: Compressing objects: 50% (1044/2087) remote: Compressing objects: 51% (1065/2087) remote: Compressing objects: 52% (1086/2087) remote: Compressing objects: 53% (1107/2087) remote: Compressing objects: 54% (1127/2087) remote: Compressing objects: 55% (1148/2087) remote: Compressing objects: 56% (1169/2087) remote: Compressing objects: 57% (1190/2087) remote: Compressing objects: 58% (1211/2087) remote: Compressing objects: 59% (1232/2087) remote: Compressing objects: 60% (1253/2087) remote: Compressing objects: 61% (1274/2087) remote: Compressing objects: 62% (1294/2087) remote: Compressing objects: 63% (1315/2087) remote: Compressing objects: 64% (1336/2087) remote: Compressing objects: 65% (1357/2087) remote: Compressing objects: 66% (1378/2087) remote: Compressing objects: 67% (1399/2087) remote: Compressing objects: 68% (1420/2087) remote: Compressing objects: 69% (1441/2087) remote: Compressing objects: 70% (1461/2087) remote: Compressing objects: 71% (1482/2087) remote: Compressing objects: 72% (1503/2087) remote: Compressing objects: 73% (1524/2087) remote: Compressing objects: 74% (1545/2087) remote: Compressing objects: 75% (1566/2087) remote: Compressing objects: 76% (1587/2087) remote: Compressing objects: 77% (1607/2087) remote: Compressing objects: 78% (1628/2087) remote: Compressing objects: 79% (1649/2087) remote: Compressing objects: 80% (1670/2087) remote: Compressing objects: 81% (1691/2087) remote: Compressing objects: 82% (1712/2087) remote: Compressing objects: 83% (1733/2087) remote: Compressing objects: 84% (1754/2087) remote: Compressing objects: 85% (1774/2087) remote: Compressing objects: 86% (1795/2087) remote: Compressing objects: 87% (1816/2087) remote: Compressing objects: 88% (1837/2087) remote: Compressing objects: 89% (1858/2087) remote: Compressing objects: 90% (1879/2087) remote: Compressing objects: 91% (1900/2087) remote: Compressing objects: 92% (1921/2087) remote: Compressing objects: 93% (1941/2087) remote: Compressing objects: 94% (1962/2087) remote: Compressing objects: 95% (1983/2087) remote: Compressing objects: 96% (2004/2087) remote: Compressing objects: 97% (2025/2087) remote: Compressing objects: 98% (2046/2087) remote: Compressing objects: 99% (2067/2087) remote: Compressing objects: 100% (2087/2087) remote: Compressing objects: 100% (2087/2087), done.
  6. 7.30 s Receiving objects: 0% (1/79689) Receiving objects: 1% (797/79689) Receiving objects: 2% (1594/79689) Receiving objects: 3% (2391/79689) Receiving objects: 4% (3188/79689) Receiving objects: 5% (3985/79689) Receiving objects: 6% (4782/79689) Receiving objects: 7% (5579/79689) Receiving objects: 8% (6376/79689) Receiving objects: 9% (7173/79689), 11.05 MiB | 22.08 MiB/s Receiving objects: 10% (7969/79689), 11.05 MiB | 22.08 MiB/s Receiving objects: 11% (8766/79689), 11.05 MiB | 22.08 MiB/s Receiving objects: 12% (9563/79689), 11.05 MiB | 22.08 MiB/s Receiving objects: 13% (10360/79689), 11.05 MiB | 22.08 MiB/s Receiving objects: 14% (11157/79689), 11.05 MiB | 22.08 MiB/s Receiving objects: 15% (11954/79689), 11.05 MiB | 22.08 MiB/s Receiving objects: 16% (12751/79689), 11.05 MiB | 22.08 MiB/s Receiving objects: 17% (13548/79689), 11.05 MiB | 22.08 MiB/s Receiving objects: 18% (14345/79689), 11.05 MiB | 22.08 MiB/s Receiving objects: 19% (15141/79689), 11.05 MiB | 22.08 MiB/s Receiving objects: 20% (15938/79689), 11.05 MiB | 22.08 MiB/s Receiving objects: 21% (16735/79689), 11.05 MiB | 22.08 MiB/s Receiving objects: 22% (17532/79689), 11.05 MiB | 22.08 MiB/s Receiving objects: 23% (18329/79689), 11.05 MiB | 22.08 MiB/s Receiving objects: 24% (19126/79689), 11.05 MiB | 22.08 MiB/s Receiving objects: 25% (19923/79689), 11.05 MiB | 22.08 MiB/s Receiving objects: 26% (20720/79689), 11.05 MiB | 22.08 MiB/s Receiving objects: 27% (21517/79689), 11.05 MiB | 22.08 MiB/s Receiving objects: 28% (22313/79689), 11.05 MiB | 22.08 MiB/s Receiving objects: 29% (23110/79689), 11.05 MiB | 22.08 MiB/s Receiving objects: 30% (23907/79689), 11.05 MiB | 22.08 MiB/s Receiving objects: 31% (24704/79689), 11.05 MiB | 22.08 MiB/s Receiving objects: 32% (25501/79689), 11.05 MiB | 22.08 MiB/s Receiving objects: 33% (26298/79689), 11.05 MiB | 22.08 MiB/s Receiving objects: 34% (27095/79689), 11.05 MiB | 22.08 MiB/s Receiving objects: 35% (27892/79689), 11.05 MiB | 22.08 MiB/s Receiving objects: 36% (28689/79689), 11.05 MiB | 22.08 MiB/s Receiving objects: 37% (29485/79689), 11.05 MiB | 22.08 MiB/s Receiving objects: 37% (29551/79689), 11.05 MiB | 22.08 MiB/s Receiving objects: 38% (30282/79689), 27.16 MiB | 27.17 MiB/s Receiving objects: 39% (31079/79689), 27.16 MiB | 27.17 MiB/s Receiving objects: 40% (31876/79689), 27.16 MiB | 27.17 MiB/s Receiving objects: 41% (32673/79689), 27.16 MiB | 27.17 MiB/s Receiving objects: 42% (33470/79689), 27.16 MiB | 27.17 MiB/s Receiving objects: 43% (34267/79689), 27.16 MiB | 27.17 MiB/s Receiving objects: 44% (35064/79689), 27.16 MiB | 27.17 MiB/s Receiving objects: 45% (35861/79689), 27.16 MiB | 27.17 MiB/s Receiving objects: 46% (36657/79689), 27.16 MiB | 27.17 MiB/s Receiving objects: 47% (37454/79689), 27.16 MiB | 27.17 MiB/s Receiving objects: 48% (38251/79689), 41.94 MiB | 27.97 MiB/s Receiving objects: 49% (39048/79689), 41.94 MiB | 27.97 MiB/s Receiving objects: 50% (39845/79689), 41.94 MiB | 27.97 MiB/s Receiving objects: 51% (40642/79689), 41.94 MiB | 27.97 MiB/s Receiving objects: 52% (41439/79689), 41.94 MiB | 27.97 MiB/s Receiving objects: 53% (42236/79689), 41.94 MiB | 27.97 MiB/s Receiving objects: 54% (43033/79689), 41.94 MiB | 27.97 MiB/s Receiving objects: 55% (43829/79689), 41.94 MiB | 27.97 MiB/s Receiving objects: 56% (44626/79689), 41.94 MiB | 27.97 MiB/s Receiving objects: 57% (45423/79689), 41.94 MiB | 27.97 MiB/s Receiving objects: 58% (46220/79689), 41.94 MiB | 27.97 MiB/s Receiving objects: 58% (46309/79689), 41.94 MiB | 27.97 MiB/s Receiving objects: 59% (47017/79689), 56.98 MiB | 28.50 MiB/s Receiving objects: 60% (47814/79689), 56.98 MiB | 28.50 MiB/s Receiving objects: 61% (48611/79689), 56.98 MiB | 28.50 MiB/s Receiving objects: 62% (49408/79689), 56.98 MiB | 28.50 MiB/s Receiving objects: 63% (50205/79689), 56.98 MiB | 28.50 MiB/s Receiving objects: 64% (51001/79689), 56.98 MiB | 28.50 MiB/s Receiving objects: 65% (51798/79689), 72.25 MiB | 28.92 MiB/s Receiving objects: 66% (52595/79689), 72.25 MiB | 28.92 MiB/s Receiving objects: 67% (53392/79689), 72.25 MiB | 28.92 MiB/s Receiving objects: 68% (54189/79689), 72.25 MiB | 28.92 MiB/s Receiving objects: 69% (54986/79689), 72.25 MiB | 28.92 MiB/s Receiving objects: 70% (55783/79689), 72.25 MiB | 28.92 MiB/s Receiving objects: 71% (56580/79689), 72.25 MiB | 28.92 MiB/s Receiving objects: 72% (57377/79689), 72.25 MiB | 28.92 MiB/s Receiving objects: 73% (58173/79689), 72.25 MiB | 28.92 MiB/s Receiving objects: 73% (58620/79689), 87.32 MiB | 28.97 MiB/s Receiving objects: 74% (58970/79689), 87.32 MiB | 28.97 MiB/s Receiving objects: 75% (59767/79689), 87.32 MiB | 28.97 MiB/s Receiving objects: 76% (60564/79689), 87.32 MiB | 28.97 MiB/s Receiving objects: 77% (61361/79689), 87.32 MiB | 28.97 MiB/s Receiving objects: 78% (62158/79689), 87.32 MiB | 28.97 MiB/s Receiving objects: 79% (62955/79689), 87.32 MiB | 28.97 MiB/s Receiving objects: 80% (63752/79689), 102.12 MiB | 29.05 MiB/s Receiving objects: 81% (64549/79689), 102.12 MiB | 29.05 MiB/s Receiving objects: 82% (65345/79689), 102.12 MiB | 29.05 MiB/s Receiving objects: 83% (66142/79689), 102.12 MiB | 29.05 MiB/s Receiving objects: 84% (66939/79689), 102.12 MiB | 29.05 MiB/s Receiving objects: 85% (67736/79689), 102.12 MiB | 29.05 MiB/s Receiving objects: 86% (68533/79689), 102.12 MiB | 29.05 MiB/s Receiving objects: 87% (69330/79689), 102.12 MiB | 29.05 MiB/s Receiving objects: 88% (70127/79689), 102.12 MiB | 29.05 MiB/s Receiving objects: 89% (70924/79689), 102.12 MiB | 29.05 MiB/s Receiving objects: 90% (71721/79689), 102.12 MiB | 29.05 MiB/s Receiving objects: 91% (72517/79689), 102.12 MiB | 29.05 MiB/s Receiving objects: 92% (73314/79689), 102.12 MiB | 29.05 MiB/s Receiving objects: 93% (74111/79689), 102.12 MiB | 29.05 MiB/s Receiving objects: 93% (74890/79689), 117.56 MiB | 29.28 MiB/s Receiving objects: 94% (74908/79689), 117.56 MiB | 29.28 MiB/s Receiving objects: 95% (75705/79689), 117.56 MiB | 29.28 MiB/s Receiving objects: 96% (76502/79689), 117.56 MiB | 29.28 MiB/s Receiving objects: 97% (77299/79689), 117.56 MiB | 29.28 MiB/s Receiving objects: 98% (78096/79689), 117.56 MiB | 29.28 MiB/s Receiving objects: 99% (78893/79689), 117.56 MiB | 29.28 MiB/s remote: Total 79689 (delta 7862), reused 7479 (delta 7191), pack-reused 70405 (from 2)
  7. 7.30 s Receiving objects: 100% (79689/79689), 117.56 MiB | 29.28 MiB/s Receiving objects: 100% (79689/79689), 124.05 MiB | 29.53 MiB/s, done.
  8. 8.22 s Resolving deltas: 0% (0/54343) Resolving deltas: 1% (544/54343) Resolving deltas: 2% (1087/54343) Resolving deltas: 3% (1633/54343) Resolving deltas: 4% (2174/54343) Resolving deltas: 5% (2718/54343) Resolving deltas: 6% (3261/54343) Resolving deltas: 7% (3805/54343) Resolving deltas: 8% (4348/54343) Resolving deltas: 9% (4891/54343) Resolving deltas: 10% (5435/54343) Resolving deltas: 11% (5978/54343) Resolving deltas: 12% (6522/54343) Resolving deltas: 13% (7065/54343) Resolving deltas: 14% (7611/54343) Resolving deltas: 15% (8153/54343) Resolving deltas: 16% (8695/54343) Resolving deltas: 17% (9241/54343) Resolving deltas: 18% (9782/54343) Resolving deltas: 19% (10326/54343) Resolving deltas: 20% (10869/54343) Resolving deltas: 21% (11413/54343) Resolving deltas: 22% (11956/54343) Resolving deltas: 23% (12499/54343) Resolving deltas: 24% (13043/54343) Resolving deltas: 25% (13586/54343) Resolving deltas: 26% (14130/54343) Resolving deltas: 27% (14675/54343) Resolving deltas: 28% (15217/54343) Resolving deltas: 29% (15760/54343) Resolving deltas: 30% (16303/54343) Resolving deltas: 31% (16847/54343) Resolving deltas: 32% (17391/54343) Resolving deltas: 33% (17935/54343) Resolving deltas: 34% (18477/54343) Resolving deltas: 35% (19021/54343) Resolving deltas: 36% (19564/54343) Resolving deltas: 37% (20107/54343) Resolving deltas: 38% (20651/54343) Resolving deltas: 39% (21194/54343) Resolving deltas: 40% (21738/54343) Resolving deltas: 41% (22281/54343) Resolving deltas: 42% (22825/54343) Resolving deltas: 43% (23368/54343) Resolving deltas: 44% (23911/54343) Resolving deltas: 45% (24455/54343) Resolving deltas: 46% (24998/54343) Resolving deltas: 47% (25543/54343) Resolving deltas: 48% (26085/54343) Resolving deltas: 49% (26629/54343) Resolving deltas: 50% (27172/54343) Resolving deltas: 51% (27715/54343) Resolving deltas: 52% (28259/54343) Resolving deltas: 53% (28802/54343) Resolving deltas: 54% (29346/54343) Resolving deltas: 55% (29889/54343) Resolving deltas: 56% (30433/54343) Resolving deltas: 57% (30976/54343) Resolving deltas: 58% (31519/54343) Resolving deltas: 59% (32063/54343) Resolving deltas: 60% (32606/54343) Resolving deltas: 61% (33150/54343) Resolving deltas: 62% (33693/54343) Resolving deltas: 63% (34241/54343) Resolving deltas: 64% (34780/54343) Resolving deltas: 65% (35323/54343) Resolving deltas: 66% (35869/54343) Resolving deltas: 67% (36410/54343) Resolving deltas: 68% (36955/54343) Resolving deltas: 69% (37497/54343) Resolving deltas: 70% (38042/54343) Resolving deltas: 71% (38584/54343) Resolving deltas: 72% (39127/54343) Resolving deltas: 73% (39671/54343) Resolving deltas: 74% (40214/54343) Resolving deltas: 75% (40758/54343) Resolving deltas: 76% (41301/54343) Resolving deltas: 77% (41845/54343) Resolving deltas: 78% (42390/54343) Resolving deltas: 79% (42931/54343) Resolving deltas: 80% (43475/54343) Resolving deltas: 81% (44018/54343) Resolving deltas: 82% (44562/54343) Resolving deltas: 83% (45105/54343) Resolving deltas: 84% (45650/54343) Resolving deltas: 85% (46192/54343) Resolving deltas: 86% (46735/54343) Resolving deltas: 87% (47279/54343) Resolving deltas: 88% (47822/54343) Resolving deltas: 89% (48366/54343) Resolving deltas: 90% (48909/54343) Resolving deltas: 91% (49453/54343) Resolving deltas: 92% (49996/54343) Resolving deltas: 93% (50539/54343) Resolving deltas: 94% (51084/54343) Resolving deltas: 95% (51626/54343) Resolving deltas: 96% (52170/54343) Resolving deltas: 97% (52713/54343) Resolving deltas: 98% (53257/54343) Resolving deltas: 99% (53800/54343) Resolving deltas: 100% (54343/54343) Resolving deltas: 100% (54343/54343), done.
  9. 8.57 s Fetching commit c36776102037cebc62eeb2aecd21b2f790609f5e for push-vrpyqyylypmw ...
  10. 8.57 s $ /nix/store/bcnisk3ydfgv26v2gw3zlky24g00yww2-git-2.54.0/bin/git fetch origin c36776102037cebc62eeb2aecd21b2f790609f5e
  11. 9.10 s From https://github.com/alphal00p/gammaloop
  12. 9.10 s * branch c36776102037cebc62eeb2aecd21b2f790609f5e -> FETCH_HEAD
  13. 9.12 s $ /nix/store/9ypz3flqsrl5xl495mm8h645gadjsxi1-coreutils-9.11/bin/timeout --kill-after=15s 7200s /nix/store/bcnisk3ydfgv26v2gw3zlky24g00yww2-git-2.54.0/bin/git -c advice.detachedHead=false checkout c36776102037cebc62eeb2aecd21b2f790609f5e
  14. 9.34 s HEAD is now at c36776102 match initial-cut styles across xbox views
  15. 9.35 s $ /nix/store/9ypz3flqsrl5xl495mm8h645gadjsxi1-coreutils-9.11/bin/timeout --kill-after=15s 7200s /nix/store/23zk8sgzamrbmj1fday15szf7f2279s8-nix-2.34.7/bin/nix --extra-experimental-features nix-command --extra-experimental-features flakes --log-format internal-json run .#packages.x86_64-linux.nix-ci-check-gammaloop-nextest-docs --print-build-logs
  16. 9.61 s stdenv.isDarwin is deprecated, use stdenv.hostPlatform.isDarwin instead
  17. 14.00 s
  18. 14.46 s evaluating derivation 'gevaluation warning: stdenv.isDarwin is deprecated, use stdenv.hostPlatform.isDarwin instead
  19. 19.40 s copying '/nix/store/fb2x evaluating derivation 'g copying '/nix/store/fb2x evaluating derivation 'g copying '/nix/store/fb2x evaluating derivation 'g copying '/nix/store/fb2x evaluating derivation 'g copying '/nix/store/fb2x evaluating derivation 'g copying '/nix/store/fb2x evaluating derivation 'g copying '/nix/store/fb2x evaluating derivation 'g copying '/nix/store/fb2x evaluating derivation 'g [0/1 built] [1/0/1 built] [1/0/1 built] building ggammaloop-nextest-docs> Extracting 2 binaries to /build/source
  20. 19.45 s gammaloop-nextest-docs> Extracted 5 files to /build/source in 0.05s
  21. 19.46 s gammaloop-nextest-docs> ------------
  22. 19.46 s gammaloop-nextest-docs> Nextest run ID 9115e4d2-16ac-4e99-a4f4-c58fdf786afb with nextest profile: ci_gammaloop
  23. 19.46 s gammaloop-nextest-docs> Starting 111 tests across 2 binaries
  24. 19.59 s gammaloop-nextest-docs> FAIL [ 0.122s] ( 71/111) alphal00p-docs-builder tests::checked_in_registry_is_valid
  25. 19.59 s gammaloop-nextest-docs> stdout ---
  26. 19.59 s gammaloop-nextest-docs>
  27. 19.59 s gammaloop-nextest-docs> running 1 test
  28. 19.59 s gammaloop-nextest-docs> test tests::checked_in_registry_is_valid ... FAILED
  29. 19.59 s gammaloop-nextest-docs>
  30. 19.59 s gammaloop-nextest-docs> failures:
  31. 19.59 s gammaloop-nextest-docs>
  32. 19.59 s gammaloop-nextest-docs> failures:
  33. 19.59 s gammaloop-nextest-docs> tests::checked_in_registry_is_valid
  34. 19.59 s gammaloop-nextest-docs>
  35. 19.59 s gammaloop-nextest-docs> test result: FAILED. 0 passed; 1 failed; 0 ignored; 0 measured; 110 filtered out; finished in 0.11s
  36. 19.59 s gammaloop-nextest-docs>
  37. 19.59 s gammaloop-nextest-docs> stderr ---
  38. 19.59 s gammaloop-nextest-docs> warning: developer note gammaloop-architecture still requires a named owner
  39. 19.59 s gammaloop-nextest-docs> warning: developer note integration-dashboard still requires a named owner
  40. 19.59 s gammaloop-nextest-docs> warning: developer note uv-renormalization still requires a named owner
  41. 19.59 s gammaloop-nextest-docs> warning: developer note spenso-parsing-flow still requires a named owner
  42. 19.59 s gammaloop-nextest-docs> warning: developer note schoonschip-network still requires a named owner
  43. 19.59 s gammaloop-nextest-docs> warning: developer note gammaloop-draw-style-migration still requires a named owner
  44. 19.59 s gammaloop-nextest-docs> warning: developer note gammaloop-drawing-architecture still requires a named owner
  45. 19.59 s gammaloop-nextest-docs> warning: developer note spenso-symbolica-syntax-and-rewrites still requires a named owner
  46. 19.59 s gammaloop-nextest-docs> warning: developer note spenso-architecture still requires a named owner
  47. 19.59 s gammaloop-nextest-docs> warning: developer note idenso-architecture still requires a named owner
  48. 19.59 s gammaloop-nextest-docs> warning: developer note idenso-form-color-dirac-source-map still requires a named owner
  49. 19.59 s gammaloop-nextest-docs> warning: developer note linnet-architecture still requires a named owner
  50. 19.59 s gammaloop-nextest-docs> warning: developer note vakint-architecture still requires a named owner
  51. 19.59 s gammaloop-nextest-docs> warning: developer note gammaloop-roadmap still requires a named owner
  52. 19.59 s gammaloop-nextest-docs> warning: developer note cff-surface-cache-ownership still requires a named owner
  53. 19.59 s gammaloop-nextest-docs> warning: developer note gammaloop-drawing-evaluated-fields-history still requires a named owner
  54. 19.59 s gammaloop-nextest-docs> warning: archived developer note gammaloop-drawing-evaluated-fields-history has no immutable evidence revision
  55. 19.59 s gammaloop-nextest-docs> warning: developer note bnl-benchmark-investigation still requires a named owner
  56. 19.59 s gammaloop-nextest-docs> warning: developer note bnl-contraction-order-performance still requires a named owner
  57. 19.59 s gammaloop-nextest-docs> warning: developer note bnl-scalar-alias-capture still requires a named owner
  58. 19.59 s gammaloop-nextest-docs> warning: developer note aa-aa-three-loop-performance-smoke still requires a named owner
  59. 19.59 s gammaloop-nextest-docs> warning: developer note network-simplification still requires a named owner
  60. 19.59 s gammaloop-nextest-docs> warning: investigation developer note network-simplification has no immutable evidence revision
  61. 19.59 s gammaloop-nextest-docs> warning: developer note spenso-large-expressions still requires a named owner
  62. 19.59 s gammaloop-nextest-docs> warning: developer note spenso-improvement-effects still requires a named owner
  63. 19.59 s gammaloop-nextest-docs> warning: archived developer note spenso-improvement-effects has no immutable evidence revision
  64. 19.59 s gammaloop-nextest-docs> warning: developer note spenso-test-baseline still requires a named owner
  65. 19.59 s gammaloop-nextest-docs> warning: archived developer note spenso-test-baseline has no immutable evidence revision
  66. 19.59 s gammaloop-nextest-docs> warning: developer note bnl-evaluator-atom-capture still requires a named owner
  67. 19.59 s gammaloop-nextest-docs> warning: archived developer note bnl-evaluator-atom-capture has no immutable evidence revision
  68. 19.59 s gammaloop-nextest-docs> warning: developer note uv-scalar-profile-benchmark still requires a named owner
  69. 19.59 s gammaloop-nextest-docs> warning: archived developer note uv-scalar-profile-benchmark has no immutable evidence revision
  70. 19.59 s gammaloop-nextest-docs> warning: developer note ci-test-failure-summary-2026-03-25 still requires a named owner
  71. 19.59 s gammaloop-nextest-docs> warning: archived developer note ci-test-failure-summary-2026-03-25 has no immutable evidence revision
  72. 19.59 s gammaloop-nextest-docs> warning: developer note network-execution-rebase-record still requires a named owner
  73. 19.59 s gammaloop-nextest-docs> warning: archived developer note network-execution-rebase-record has no immutable evidence revision
  74. 19.59 s gammaloop-nextest-docs> warning: developer note ratatui-integration-dashboard-history still requires a named owner
  75. 19.59 s gammaloop-nextest-docs> warning: archived developer note ratatui-integration-dashboard-history has no immutable evidence revision
  76. 19.59 s gammaloop-nextest-docs> warning: developer note nix-crane-cache-reuse still requires a named owner
  77. 19.59 s gammaloop-nextest-docs>
  78. 19.59 s gammaloop-nextest-docs> thread 'tests::checked_in_registry_is_valid' (160) panicked at crates/alphal00p-docs-builder/src/lib.rs:11887:50:
  79. 19.59 s gammaloop-nextest-docs> called `Result::unwrap()` on an `Err` value: developer note nix-crane-cache-reuse verified scope flake.nix changed (expected 188504937418859942a6770ca21a4f4e0a7ff125, found 2055acf4433777d5a18c44d88e8416b42a938f3a); owner review or an explicit no-impact attestation is required
  80. 19.59 s gammaloop-nextest-docs>
  81. 19.59 s gammaloop-nextest-docs> Location:
  82. 19.59 s gammaloop-nextest-docs> crates/alphal00p-docs-builder/src/lib.rs:889:21
  83. 19.59 s gammaloop-nextest-docs> stack backtrace:
  84. 19.59 s gammaloop-nextest-docs> 0: __rustc::rust_begin_unwind
  85. 19.59 s gammaloop-nextest-docs> 1: core::panicking::panic_fmt
  86. 19.59 s gammaloop-nextest-docs> 2: core::result::unwrap_failed
  87. 19.59 s gammaloop-nextest-docs> 3: alphal00p_docs_builder::tests::checked_in_registry_is_valid
  88. 19.59 s gammaloop-nextest-docs> 4: <alphal00p_docs_builder::tests::checked_in_registry_is_valid::{closure#0} as core::ops::function::FnOnce<()>>::call_once
  89. 19.59 s gammaloop-nextest-docs> note: Some details are omitted, run with `RUST_BACKTRACE=full` for a verbose backtrace.
  90. 19.59 s gammaloop-nextest-docs>
  91. 19.59 s gammaloop-nextest-docs> FAIL [ 0.106s] ( 75/111) alphal00p-docs-builder tests::every_product_requires_a_task_chooser_and_each_supported_interface
  92. 19.59 s gammaloop-nextest-docs> stdout ---
  93. 19.59 s gammaloop-nextest-docs>
  94. 19.59 s gammaloop-nextest-docs> running 1 test
  95. 19.59 s gammaloop-nextest-docs> test tests::every_product_requires_a_task_chooser_and_each_supported_interface ... FAILED
  96. 19.59 s gammaloop-nextest-docs>
  97. 19.59 s gammaloop-nextest-docs> failures:
  98. 19.59 s gammaloop-nextest-docs>
  99. 19.59 s gammaloop-nextest-docs> failures:
  100. 19.59 s gammaloop-nextest-docs> tests::every_product_requires_a_task_chooser_and_each_supported_interface
  101. 19.59 s gammaloop-nextest-docs>
  102. 19.59 s gammaloop-nextest-docs> test result: FAILED. 0 passed; 1 failed; 0 ignored; 0 measured; 110 filtered out; finished in 0.10s
  103. 19.59 s gammaloop-nextest-docs>
  104. 19.59 s gammaloop-nextest-docs> stderr ---
  105. 19.59 s gammaloop-nextest-docs> warning: developer note gammaloop-architecture still requires a named owner
  106. 19.59 s gammaloop-nextest-docs> warning: developer note integration-dashboard still requires a named owner
  107. 19.59 s gammaloop-nextest-docs> warning: developer note uv-renormalization still requires a named owner
  108. 19.59 s gammaloop-nextest-docs> warning: developer note spenso-parsing-flow still requires a named owner
  109. 19.59 s gammaloop-nextest-docs> warning: developer note schoonschip-network still requires a named owner
  110. 19.59 s gammaloop-nextest-docs> warning: developer note gammaloop-draw-style-migration still requires a named owner
  111. 19.59 s gammaloop-nextest-docs> warning: developer note gammaloop-drawing-architecture still requires a named owner
  112. 19.59 s gammaloop-nextest-docs> warning: developer note spenso-symbolica-syntax-and-rewrites still requires a named owner
  113. 19.59 s gammaloop-nextest-docs> warning: developer note spenso-architecture still requires a named owner
  114. 19.59 s gammaloop-nextest-docs> warning: developer note idenso-architecture still requires a named owner
  115. 19.59 s gammaloop-nextest-docs> warning: developer note idenso-form-color-dirac-source-map still requires a named owner
  116. 19.59 s gammaloop-nextest-docs> warning: developer note linnet-architecture still requires a named owner
  117. 19.59 s gammaloop-nextest-docs> warning: developer note vakint-architecture still requires a named owner
  118. 19.59 s gammaloop-nextest-docs> warning: developer note gammaloop-roadmap still requires a named owner
  119. 19.59 s gammaloop-nextest-docs> warning: developer note cff-surface-cache-ownership still requires a named owner
  120. 19.59 s gammaloop-nextest-docs> warning: developer note gammaloop-drawing-evaluated-fields-history still requires a named owner
  121. 19.59 s gammaloop-nextest-docs> warning: archived developer note gammaloop-drawing-evaluated-fields-history has no immutable evidence revision
  122. 19.59 s gammaloop-nextest-docs> warning: developer note bnl-benchmark-investigation still requires a named owner
  123. 19.59 s gammaloop-nextest-docs> warning: developer note bnl-contraction-order-performance still requires a named owner
  124. 19.59 s gammaloop-nextest-docs> warning: developer note bnl-scalar-alias-capture still requires a named owner
  125. 19.59 s gammaloop-nextest-docs> warning: developer note aa-aa-three-loop-performance-smoke still requires a named owner
  126. 19.59 s gammaloop-nextest-docs> warning: developer note network-simplification still requires a named owner
  127. 19.59 s gammaloop-nextest-docs> warning: investigation developer note network-simplification has no immutable evidence revision
  128. 19.59 s gammaloop-nextest-docs> warning: developer note spenso-large-expressions still requires a named owner
  129. 19.59 s gammaloop-nextest-docs> warning: developer note spenso-improvement-effects still requires a named owner
  130. 19.59 s gammaloop-nextest-docs> warning: archived developer note spenso-improvement-effects has no immutable evidence revision
  131. 19.59 s gammaloop-nextest-docs> warning: developer note spenso-test-baseline still requires a named owner
  132. 19.59 s gammaloop-nextest-docs> warning: archived developer note spenso-test-baseline has no immutable evidence revision
  133. 19.59 s gammaloop-nextest-docs> warning: developer note bnl-evaluator-atom-capture still requires a named owner
  134. 19.59 s gammaloop-nextest-docs> warning: archived developer note bnl-evaluator-atom-capture has no immutable evidence revision
  135. 19.59 s gammaloop-nextest-docs> warning: developer note uv-scalar-profile-benchmark still requires a named owner
  136. 19.59 s gammaloop-nextest-docs> warning: archived developer note uv-scalar-profile-benchmark has no immutable evidence revision
  137. 19.59 s gammaloop-nextest-docs> warning: developer note ci-test-failure-summary-2026-03-25 still requires a named owner
  138. 19.59 s gammaloop-nextest-docs> warning: archived developer note ci-test-failure-summary-2026-03-25 has no immutable evidence revision
  139. 19.59 s gammaloop-nextest-docs> warning: developer note network-execution-rebase-record still requires a named owner
  140. 19.59 s gammaloop-nextest-docs> warning: archived developer note network-execution-rebase-record has no immutable evidence revision
  141. 19.59 s gammaloop-nextest-docs> warning: developer note ratatui-integration-dashboard-history still requires a named owner
  142. 19.59 s gammaloop-nextest-docs> warning: archived developer note ratatui-integration-dashboard-history has no immutable evidence revision
  143. 19.59 s gammaloop-nextest-docs> warning: developer note nix-crane-cache-reuse still requires a named owner
  144. 19.59 s gammaloop-nextest-docs>
  145. 19.59 s gammaloop-nextest-docs> thread 'tests::every_product_requires_a_task_chooser_and_each_supported_interface' (269) panicked at crates/alphal00p-docs-builder/src/lib.rs:11901:9:
  146. 19.59 s gammaloop-nextest-docs> assertion failed: format!("{error:#}").contains("has no quickstart page")
  147. 19.59 s gammaloop-nextest-docs> stack backtrace:
  148. 19.59 s gammaloop-nextest-docs> 0: __rustc::rust_begin_unwind
  149. 19.59 s gammaloop-nextest-docs> 1: core::panicking::panic_fmt
  150. 19.59 s gammaloop-nextest-docs> 2: core::panicking::panic
  151. 19.59 s gammaloop-nextest-docs> 3: alphal00p_docs_builder::tests::every_product_requires_a_task_chooser_and_each_supported_interface
  152. 19.59 s gammaloop-nextest-docs> 4: <alphal00p_docs_builder::tests::every_product_requires_a_task_chooser_and_each_supported_interface::{closure#0} as core::ops::function::FnOnce<()>>::call_once
  153. 19.59 s gammaloop-nextest-docs> note: Some details are omitted, run with `RUST_BACKTRACE=full` for a verbose backtrace.
  154. 19.59 s gammaloop-nextest-docs>
  155. 19.62 s gammaloop-nextest-docs> FAIL [ 0.104s] ( 93/111) alphal00p-docs-builder tests::pdf_manual_chapter_order_must_match_the_page_registry
  156. 19.62 s gammaloop-nextest-docs> stdout ---
  157. 19.62 s gammaloop-nextest-docs>
  158. 19.62 s gammaloop-nextest-docs> running 1 test
  159. 19.62 s gammaloop-nextest-docs> test tests::pdf_manual_chapter_order_must_match_the_page_registry ... FAILED
  160. 19.62 s gammaloop-nextest-docs>
  161. 19.62 s gammaloop-nextest-docs> failures:
  162. 19.62 s gammaloop-nextest-docs>
  163. 19.62 s gammaloop-nextest-docs> failures:
  164. 19.62 s gammaloop-nextest-docs> tests::pdf_manual_chapter_order_must_match_the_page_registry
  165. 19.62 s gammaloop-nextest-docs>
  166. 19.62 s gammaloop-nextest-docs> test result: FAILED. 0 passed; 1 failed; 0 ignored; 0 measured; 110 filtered out; finished in 0.09s
  167. 19.62 s gammaloop-nextest-docs>
  168. 19.62 s gammaloop-nextest-docs> stderr ---
  169. 19.62 s gammaloop-nextest-docs> warning: developer note gammaloop-architecture still requires a named owner
  170. 19.62 s gammaloop-nextest-docs> warning: developer note integration-dashboard still requires a named owner
  171. 19.62 s gammaloop-nextest-docs> warning: developer note uv-renormalization still requires a named owner
  172. 19.62 s gammaloop-nextest-docs> warning: developer note spenso-parsing-flow still requires a named owner
  173. 19.62 s gammaloop-nextest-docs> warning: developer note schoonschip-network still requires a named owner
  174. 19.62 s gammaloop-nextest-docs> warning: developer note gammaloop-draw-style-migration still requires a named owner
  175. 19.62 s gammaloop-nextest-docs> warning: developer note gammaloop-drawing-architecture still requires a named owner
  176. 19.62 s gammaloop-nextest-docs> warning: developer note spenso-symbolica-syntax-and-rewrites still requires a named owner
  177. 19.62 s gammaloop-nextest-docs> warning: developer note spenso-architecture still requires a named owner
  178. 19.62 s gammaloop-nextest-docs> warning: developer note idenso-architecture still requires a named owner
  179. 19.62 s gammaloop-nextest-docs> warning: developer note idenso-form-color-dirac-source-map still requires a named owner
  180. 19.62 s gammaloop-nextest-docs> warning: developer note linnet-architecture still requires a named owner
  181. 19.62 s gammaloop-nextest-docs> warning: developer note vakint-architecture still requires a named owner
  182. 19.62 s gammaloop-nextest-docs> warning: developer note gammaloop-roadmap still requires a named owner
  183. 19.62 s gammaloop-nextest-docs> warning: developer note cff-surface-cache-ownership still requires a named owner
  184. 19.62 s gammaloop-nextest-docs> warning: developer note gammaloop-drawing-evaluated-fields-history still requires a named owner
  185. 19.62 s gammaloop-nextest-docs> warning: archived developer note gammaloop-drawing-evaluated-fields-history has no immutable evidence revision
  186. 19.62 s gammaloop-nextest-docs> warning: developer note bnl-benchmark-investigation still requires a named owner
  187. 19.62 s gammaloop-nextest-docs> warning: developer note bnl-contraction-order-performance still requires a named owner
  188. 19.62 s gammaloop-nextest-docs> warning: developer note bnl-scalar-alias-capture still requires a named owner
  189. 19.62 s gammaloop-nextest-docs> warning: developer note aa-aa-three-loop-performance-smoke still requires a named owner
  190. 19.62 s gammaloop-nextest-docs> warning: developer note network-simplification still requires a named owner
  191. 19.62 s gammaloop-nextest-docs> warning: investigation developer note network-simplification has no immutable evidence revision
  192. 19.62 s gammaloop-nextest-docs> warning: developer note spenso-large-expressions still requires a named owner
  193. 19.62 s gammaloop-nextest-docs> warning: developer note spenso-improvement-effects still requires a named owner
  194. 19.62 s gammaloop-nextest-docs> warning: archived developer note spenso-improvement-effects has no immutable evidence revision
  195. 19.62 s gammaloop-nextest-docs> warning: developer note spenso-test-baseline still requires a named owner
  196. 19.62 s gammaloop-nextest-docs> warning: archived developer note spenso-test-baseline has no immutable evidence revision
  197. 19.62 s gammaloop-nextest-docs> warning: developer note bnl-evaluator-atom-capture still requires a named owner
  198. 19.62 s gammaloop-nextest-docs> warning: archived developer note bnl-evaluator-atom-capture has no immutable evidence revision
  199. 19.62 s gammaloop-nextest-docs> warning: developer note uv-scalar-profile-benchmark still requires a named owner
  200. 19.62 s gammaloop-nextest-docs> warning: archived developer note uv-scalar-profile-benchmark has no immutable evidence revision
  201. 19.62 s gammaloop-nextest-docs> warning: developer note ci-test-failure-summary-2026-03-25 still requires a named owner
  202. 19.62 s gammaloop-nextest-docs> warning: archived developer note ci-test-failure-summary-2026-03-25 has no immutable evidence revision
  203. 19.62 s gammaloop-nextest-docs> warning: developer note network-execution-rebase-record still requires a named owner
  204. 19.62 s gammaloop-nextest-docs> warning: archived developer note network-execution-rebase-record has no immutable evidence revision
  205. 19.62 s gammaloop-nextest-docs> warning: developer note ratatui-integration-dashboard-history still requires a named owner
  206. 19.62 s gammaloop-nextest-docs> warning: archived developer note ratatui-integration-dashboard-history has no immutable evidence revision
  207. 19.62 s gammaloop-nextest-docs> warning: developer note nix-crane-cache-reuse still requires a named owner
  208. 19.62 s gammaloop-nextest-docs>
  209. 19.62 s gammaloop-nextest-docs> thread 'tests::pdf_manual_chapter_order_must_match_the_page_registry' (323) panicked at crates/alphal00p-docs-builder/src/lib.rs:11952:9:
  210. 19.62 s gammaloop-nextest-docs> assertion failed: format!("{error:#}").contains("PDF manual chapter order differs")
  211. 19.62 s gammaloop-nextest-docs> stack backtrace:
  212. 19.62 s gammaloop-nextest-docs> 0: __rustc::rust_begin_unwind
  213. 19.62 s gammaloop-nextest-docs> 1: core::panicking::panic_fmt
  214. 19.62 s gammaloop-nextest-docs> 2: core::panicking::panic
  215. 19.62 s gammaloop-nextest-docs> 3: alphal00p_docs_builder::tests::pdf_manual_chapter_order_must_match_the_page_registry
  216. 19.62 s gammaloop-nextest-docs> 4: <alphal00p_docs_builder::tests::pdf_manual_chapter_order_must_match_the_page_registry::{closure#0} as core::ops::function::FnOnce<()>>::call_once
  217. 19.62 s gammaloop-nextest-docs> note: Some details are omitted, run with `RUST_BACKTRACE=full` for a verbose backtrace.
  218. 19.62 s gammaloop-nextest-docs>
  219. 41.26 s gammaloop-nextest-docs> ------------
  220. 41.26 s gammaloop-nextest-docs> Summary [ 21.796s] 111 tests run: 108 passed, 3 failed, 0 skipped
  221. 41.26 s gammaloop-nextest-docs> FAIL [ 0.122s] ( 71/111) alphal00p-docs-builder tests::checked_in_registry_is_valid
  222. 41.26 s gammaloop-nextest-docs> stdout ---
  223. 41.26 s gammaloop-nextest-docs>
  224. 41.26 s gammaloop-nextest-docs> running 1 test
  225. 41.26 s gammaloop-nextest-docs> test tests::checked_in_registry_is_valid ... FAILED
  226. 41.26 s gammaloop-nextest-docs>
  227. 41.26 s gammaloop-nextest-docs> failures:
  228. 41.26 s gammaloop-nextest-docs>
  229. 41.26 s gammaloop-nextest-docs> failures:
  230. 41.26 s gammaloop-nextest-docs> tests::checked_in_registry_is_valid
  231. 41.26 s gammaloop-nextest-docs>
  232. 41.26 s gammaloop-nextest-docs> test result: FAILED. 0 passed; 1 failed; 0 ignored; 0 measured; 110 filtered out; finished in 0.11s
  233. 41.26 s gammaloop-nextest-docs>
  234. 41.26 s gammaloop-nextest-docs> stderr ---
  235. 41.26 s gammaloop-nextest-docs> warning: developer note gammaloop-architecture still requires a named owner
  236. 41.26 s gammaloop-nextest-docs> warning: developer note integration-dashboard still requires a named owner
  237. 41.26 s gammaloop-nextest-docs> warning: developer note uv-renormalization still requires a named owner
  238. 41.26 s gammaloop-nextest-docs> warning: developer note spenso-parsing-flow still requires a named owner
  239. 41.26 s gammaloop-nextest-docs> warning: developer note schoonschip-network still requires a named owner
  240. 41.26 s gammaloop-nextest-docs> warning: developer note gammaloop-draw-style-migration still requires a named owner
  241. 41.26 s gammaloop-nextest-docs> warning: developer note gammaloop-drawing-architecture still requires a named owner
  242. 41.26 s gammaloop-nextest-docs> warning: developer note spenso-symbolica-syntax-and-rewrites still requires a named owner
  243. 41.26 s gammaloop-nextest-docs> warning: developer note spenso-architecture still requires a named owner
  244. 41.26 s gammaloop-nextest-docs> warning: developer note idenso-architecture still requires a named owner
  245. 41.26 s gammaloop-nextest-docs> warning: developer note idenso-form-color-dirac-source-map still requires a named owner
  246. 41.26 s gammaloop-nextest-docs> warning: developer note linnet-architecture still requires a named owner
  247. 41.26 s gammaloop-nextest-docs> warning: developer note vakint-architecture still requires a named owner
  248. 41.26 s gammaloop-nextest-docs> warning: developer note gammaloop-roadmap still requires a named owner
  249. 41.26 s gammaloop-nextest-docs> warning: developer note cff-surface-cache-ownership still requires a named owner
  250. 41.26 s gammaloop-nextest-docs> warning: developer note gammaloop-drawing-evaluated-fields-history still requires a named owner
  251. 41.26 s gammaloop-nextest-docs> warning: archived developer note gammaloop-drawing-evaluated-fields-history has no immutable evidence revision
  252. 41.26 s gammaloop-nextest-docs> warning: developer note bnl-benchmark-investigation still requires a named owner
  253. 41.26 s gammaloop-nextest-docs> warning: developer note bnl-contraction-order-performance still requires a named owner
  254. 41.26 s gammaloop-nextest-docs> warning: developer note bnl-scalar-alias-capture still requires a named owner
  255. 41.26 s gammaloop-nextest-docs> warning: developer note aa-aa-three-loop-performance-smoke still requires a named owner
  256. 41.26 s gammaloop-nextest-docs> warning: developer note network-simplification still requires a named owner
  257. 41.26 s gammaloop-nextest-docs> warning: investigation developer note network-simplification has no immutable evidence revision
  258. 41.26 s gammaloop-nextest-docs> warning: developer note spenso-large-expressions still requires a named owner
  259. 41.26 s gammaloop-nextest-docs> warning: developer note spenso-improvement-effects still requires a named owner
  260. 41.26 s gammaloop-nextest-docs> warning: archived developer note spenso-improvement-effects has no immutable evidence revision
  261. 41.26 s gammaloop-nextest-docs> warning: developer note spenso-test-baseline still requires a named owner
  262. 41.26 s gammaloop-nextest-docs> warning: archived developer note spenso-test-baseline has no immutable evidence revision
  263. 41.26 s gammaloop-nextest-docs> warning: developer note bnl-evaluator-atom-capture still requires a named owner
  264. 41.26 s gammaloop-nextest-docs> warning: archived developer note bnl-evaluator-atom-capture has no immutable evidence revision
  265. 41.26 s gammaloop-nextest-docs> warning: developer note uv-scalar-profile-benchmark still requires a named owner
  266. 41.26 s gammaloop-nextest-docs> warning: archived developer note uv-scalar-profile-benchmark has no immutable evidence revision
  267. 41.26 s gammaloop-nextest-docs> warning: developer note ci-test-failure-summary-2026-03-25 still requires a named owner
  268. 41.26 s gammaloop-nextest-docs> warning: archived developer note ci-test-failure-summary-2026-03-25 has no immutable evidence revision
  269. 41.26 s gammaloop-nextest-docs> warning: developer note network-execution-rebase-record still requires a named owner
  270. 41.26 s gammaloop-nextest-docs> warning: archived developer note network-execution-rebase-record has no immutable evidence revision
  271. 41.26 s gammaloop-nextest-docs> warning: developer note ratatui-integration-dashboard-history still requires a named owner
  272. 41.26 s gammaloop-nextest-docs> warning: archived developer note ratatui-integration-dashboard-history has no immutable evidence revision
  273. 41.26 s gammaloop-nextest-docs> warning: developer note nix-crane-cache-reuse still requires a named owner
  274. 41.26 s gammaloop-nextest-docs>
  275. 41.26 s gammaloop-nextest-docs> thread 'tests::checked_in_registry_is_valid' (160) panicked at crates/alphal00p-docs-builder/src/lib.rs:11887:50:
  276. 41.26 s gammaloop-nextest-docs> called `Result::unwrap()` on an `Err` value: developer note nix-crane-cache-reuse verified scope flake.nix changed (expected 188504937418859942a6770ca21a4f4e0a7ff125, found 2055acf4433777d5a18c44d88e8416b42a938f3a); owner review or an explicit no-impact attestation is required
  277. 41.26 s gammaloop-nextest-docs>
  278. 41.26 s gammaloop-nextest-docs> Location:
  279. 41.26 s gammaloop-nextest-docs> crates/alphal00p-docs-builder/src/lib.rs:889:21
  280. 41.26 s gammaloop-nextest-docs> stack backtrace:
  281. 41.26 s gammaloop-nextest-docs> 0: __rustc::rust_begin_unwind
  282. 41.26 s gammaloop-nextest-docs> 1: core::panicking::panic_fmt
  283. 41.26 s gammaloop-nextest-docs> 2: core::result::unwrap_failed
  284. 41.26 s gammaloop-nextest-docs> 3: alphal00p_docs_builder::tests::checked_in_registry_is_valid
  285. 41.26 s gammaloop-nextest-docs> 4: <alphal00p_docs_builder::tests::checked_in_registry_is_valid::{closure#0} as core::ops::function::FnOnce<()>>::call_once
  286. 41.26 s gammaloop-nextest-docs> note: Some details are omitted, run with `RUST_BACKTRACE=full` for a verbose backtrace.
  287. 41.26 s gammaloop-nextest-docs>
  288. 41.26 s gammaloop-nextest-docs> FAIL [ 0.106s] ( 75/111) alphal00p-docs-builder tests::every_product_requires_a_task_chooser_and_each_supported_interface
  289. 41.26 s gammaloop-nextest-docs> stdout ---
  290. 41.26 s gammaloop-nextest-docs>
  291. 41.26 s gammaloop-nextest-docs> running 1 test
  292. 41.26 s gammaloop-nextest-docs> test tests::every_product_requires_a_task_chooser_and_each_supported_interface ... FAILED
  293. 41.26 s gammaloop-nextest-docs>
  294. 41.26 s gammaloop-nextest-docs> failures:
  295. 41.26 s gammaloop-nextest-docs>
  296. 41.26 s gammaloop-nextest-docs> failures:
  297. 41.26 s gammaloop-nextest-docs> tests::every_product_requires_a_task_chooser_and_each_supported_interface
  298. 41.26 s gammaloop-nextest-docs>
  299. 41.26 s gammaloop-nextest-docs> test result: FAILED. 0 passed; 1 failed; 0 ignored; 0 measured; 110 filtered out; finished in 0.10s
  300. 41.26 s gammaloop-nextest-docs>
  301. 41.26 s gammaloop-nextest-docs> stderr ---
  302. 41.26 s gammaloop-nextest-docs> warning: developer note gammaloop-architecture still requires a named owner
  303. 41.26 s gammaloop-nextest-docs> warning: developer note integration-dashboard still requires a named owner
  304. 41.26 s gammaloop-nextest-docs> warning: developer note uv-renormalization still requires a named owner
  305. 41.26 s gammaloop-nextest-docs> warning: developer note spenso-parsing-flow still requires a named owner
  306. 41.26 s gammaloop-nextest-docs> warning: developer note schoonschip-network still requires a named owner
  307. 41.26 s gammaloop-nextest-docs> warning: developer note gammaloop-draw-style-migration still requires a named owner
  308. 41.26 s gammaloop-nextest-docs> warning: developer note gammaloop-drawing-architecture still requires a named owner
  309. 41.26 s gammaloop-nextest-docs> warning: developer note spenso-symbolica-syntax-and-rewrites still requires a named owner
  310. 41.26 s gammaloop-nextest-docs> warning: developer note spenso-architecture still requires a named owner
  311. 41.26 s gammaloop-nextest-docs> warning: developer note idenso-architecture still requires a named owner
  312. 41.26 s gammaloop-nextest-docs> warning: developer note idenso-form-color-dirac-source-map still requires a named owner
  313. 41.26 s gammaloop-nextest-docs> warning: developer note linnet-architecture still requires a named owner
  314. 41.26 s gammaloop-nextest-docs> warning: developer note vakint-architecture still requires a named owner
  315. 41.26 s gammaloop-nextest-docs> warning: developer note gammaloop-roadmap still requires a named owner
  316. 41.26 s gammaloop-nextest-docs> warning: developer note cff-surface-cache-ownership still requires a named owner
  317. 41.26 s gammaloop-nextest-docs> warning: developer note gammaloop-drawing-evaluated-fields-history still requires a named owner
  318. 41.26 s gammaloop-nextest-docs> warning: archived developer note gammaloop-drawing-evaluated-fields-history has no immutable evidence revision
  319. 41.26 s gammaloop-nextest-docs> warning: developer note bnl-benchmark-investigation still requires a named owner
  320. 41.26 s gammaloop-nextest-docs> warning: developer note bnl-contraction-order-performance still requires a named owner
  321. 41.26 s gammaloop-nextest-docs> warning: developer note bnl-scalar-alias-capture still requires a named owner
  322. 41.26 s gammaloop-nextest-docs> warning: developer note aa-aa-three-loop-performance-smoke still requires a named owner
  323. 41.26 s gammaloop-nextest-docs> warning: developer note network-simplification still requires a named owner
  324. 41.26 s gammaloop-nextest-docs> warning: investigation developer note network-simplification has no immutable evidence revision
  325. 41.26 s gammaloop-nextest-docs> warning: developer note spenso-large-expressions still requires a named owner
  326. 41.26 s gammaloop-nextest-docs> warning: developer note spenso-improvement-effects still requires a named owner
  327. 41.26 s gammaloop-nextest-docs> warning: archived developer note spenso-improvement-effects has no immutable evidence revision
  328. 41.26 s gammaloop-nextest-docs> warning: developer note spenso-test-baseline still requires a named owner
  329. 41.26 s gammaloop-nextest-docs> warning: archived developer note spenso-test-baseline has no immutable evidence revision
  330. 41.26 s gammaloop-nextest-docs> warning: developer note bnl-evaluator-atom-capture still requires a named owner
  331. 41.26 s gammaloop-nextest-docs> warning: archived developer note bnl-evaluator-atom-capture has no immutable evidence revision
  332. 41.26 s gammaloop-nextest-docs> warning: developer note uv-scalar-profile-benchmark still requires a named owner
  333. 41.26 s gammaloop-nextest-docs> warning: archived developer note uv-scalar-profile-benchmark has no immutable evidence revision
  334. 41.26 s gammaloop-nextest-docs> warning: developer note ci-test-failure-summary-2026-03-25 still requires a named owner
  335. 41.26 s gammaloop-nextest-docs> warning: archived developer note ci-test-failure-summary-2026-03-25 has no immutable evidence revision
  336. 41.26 s gammaloop-nextest-docs> warning: developer note network-execution-rebase-record still requires a named owner
  337. 41.26 s gammaloop-nextest-docs> warning: archived developer note network-execution-rebase-record has no immutable evidence revision
  338. 41.26 s gammaloop-nextest-docs> warning: developer note ratatui-integration-dashboard-history still requires a named owner
  339. 41.26 s gammaloop-nextest-docs> warning: archived developer note ratatui-integration-dashboard-history has no immutable evidence revision
  340. 41.26 s gammaloop-nextest-docs> warning: developer note nix-crane-cache-reuse still requires a named owner
  341. 41.26 s gammaloop-nextest-docs>
  342. 41.26 s gammaloop-nextest-docs> thread 'tests::every_product_requires_a_task_chooser_and_each_supported_interface' (269) panicked at crates/alphal00p-docs-builder/src/lib.rs:11901:9:
  343. 41.26 s gammaloop-nextest-docs> assertion failed: format!("{error:#}").contains("has no quickstart page")
  344. 41.26 s gammaloop-nextest-docs> stack backtrace:
  345. 41.26 s gammaloop-nextest-docs> 0: __rustc::rust_begin_unwind
  346. 41.26 s gammaloop-nextest-docs> 1: core::panicking::panic_fmt
  347. 41.26 s gammaloop-nextest-docs> 2: core::panicking::panic
  348. 41.26 s gammaloop-nextest-docs> 3: alphal00p_docs_builder::tests::every_product_requires_a_task_chooser_and_each_supported_interface
  349. 41.26 s gammaloop-nextest-docs> 4: <alphal00p_docs_builder::tests::every_product_requires_a_task_chooser_and_each_supported_interface::{closure#0} as core::ops::function::FnOnce<()>>::call_once
  350. 41.26 s gammaloop-nextest-docs> note: Some details are omitted, run with `RUST_BACKTRACE=full` for a verbose backtrace.
  351. 41.26 s gammaloop-nextest-docs>
  352. 41.26 s gammaloop-nextest-docs> FAIL [ 0.104s] ( 93/111) alphal00p-docs-builder tests::pdf_manual_chapter_order_must_match_the_page_registry
  353. 41.26 s gammaloop-nextest-docs> stdout ---
  354. 41.26 s gammaloop-nextest-docs>
  355. 41.26 s gammaloop-nextest-docs> running 1 test
  356. 41.26 s gammaloop-nextest-docs> test tests::pdf_manual_chapter_order_must_match_the_page_registry ... FAILED
  357. 41.26 s gammaloop-nextest-docs>
  358. 41.26 s gammaloop-nextest-docs> failures:
  359. 41.26 s gammaloop-nextest-docs>
  360. 41.26 s gammaloop-nextest-docs> failures:
  361. 41.26 s gammaloop-nextest-docs> tests::pdf_manual_chapter_order_must_match_the_page_registry
  362. 41.26 s gammaloop-nextest-docs>
  363. 41.26 s gammaloop-nextest-docs> test result: FAILED. 0 passed; 1 failed; 0 ignored; 0 measured; 110 filtered out; finished in 0.09s
  364. 41.26 s gammaloop-nextest-docs>
  365. 41.26 s gammaloop-nextest-docs> stderr ---
  366. 41.26 s gammaloop-nextest-docs> warning: developer note gammaloop-architecture still requires a named owner
  367. 41.26 s gammaloop-nextest-docs> warning: developer note integration-dashboard still requires a named owner
  368. 41.26 s gammaloop-nextest-docs> warning: developer note uv-renormalization still requires a named owner
  369. 41.26 s gammaloop-nextest-docs> warning: developer note spenso-parsing-flow still requires a named owner
  370. 41.26 s gammaloop-nextest-docs> warning: developer note schoonschip-network still requires a named owner
  371. 41.26 s gammaloop-nextest-docs> warning: developer note gammaloop-draw-style-migration still requires a named owner
  372. 41.26 s gammaloop-nextest-docs> warning: developer note gammaloop-drawing-architecture still requires a named owner
  373. 41.26 s gammaloop-nextest-docs> warning: developer note spenso-symbolica-syntax-and-rewrites still requires a named owner
  374. 41.26 s gammaloop-nextest-docs> warning: developer note spenso-architecture still requires a named owner
  375. 41.26 s gammaloop-nextest-docs> warning: developer note idenso-architecture still requires a named owner
  376. 41.26 s gammaloop-nextest-docs> warning: developer note idenso-form-color-dirac-source-map still requires a named owner
  377. 41.26 s gammaloop-nextest-docs> warning: developer note linnet-architecture still requires a named owner
  378. 41.26 s gammaloop-nextest-docs> warning: developer note vakint-architecture still requires a named owner
  379. 41.26 s gammaloop-nextest-docs> warning: developer note gammaloop-roadmap still requires a named owner
  380. 41.26 s gammaloop-nextest-docs> warning: developer note cff-surface-cache-ownership still requires a named owner
  381. 41.26 s gammaloop-nextest-docs> warning: developer note gammaloop-drawing-evaluated-fields-history still requires a named owner
  382. 41.26 s gammaloop-nextest-docs> warning: archived developer note gammaloop-drawing-evaluated-fields-history has no immutable evidence revision
  383. 41.26 s gammaloop-nextest-docs> warning: developer note bnl-benchmark-investigation still requires a named owner
  384. 41.26 s gammaloop-nextest-docs> warning: developer note bnl-contraction-order-performance still requires a named owner
  385. 41.26 s gammaloop-nextest-docs> warning: developer note bnl-scalar-alias-capture still requires a named owner
  386. 41.26 s gammaloop-nextest-docs> warning: developer note aa-aa-three-loop-performance-smoke still requires a named owner
  387. 41.26 s gammaloop-nextest-docs> warning: developer note network-simplification still requires a named owner
  388. 41.26 s gammaloop-nextest-docs> warning: investigation developer note network-simplification has no immutable evidence revision
  389. 41.26 s gammaloop-nextest-docs> warning: developer note spenso-large-expressions still requires a named owner
  390. 41.26 s gammaloop-nextest-docs> warning: developer note spenso-improvement-effects still requires a named owner
  391. 41.26 s gammaloop-nextest-docs> warning: archived developer note spenso-improvement-effects has no immutable evidence revision
  392. 41.26 s gammaloop-nextest-docs> warning: developer note spenso-test-baseline still requires a named owner
  393. 41.26 s gammaloop-nextest-docs> warning: archived developer note spenso-test-baseline has no immutable evidence revision
  394. 41.26 s gammaloop-nextest-docs> warning: developer note bnl-evaluator-atom-capture still requires a named owner
  395. 41.26 s gammaloop-nextest-docs> warning: archived developer note bnl-evaluator-atom-capture has no immutable evidence revision
  396. 41.26 s gammaloop-nextest-docs> warning: developer note uv-scalar-profile-benchmark still requires a named owner
  397. 41.26 s gammaloop-nextest-docs> warning: archived developer note uv-scalar-profile-benchmark has no immutable evidence revision
  398. 41.26 s gammaloop-nextest-docs> warning: developer note ci-test-failure-summary-2026-03-25 still requires a named owner
  399. 41.26 s gammaloop-nextest-docs> warning: archived developer note ci-test-failure-summary-2026-03-25 has no immutable evidence revision
  400. 41.26 s gammaloop-nextest-docs> warning: developer note network-execution-rebase-record still requires a named owner
  401. 41.26 s gammaloop-nextest-docs> warning: archived developer note network-execution-rebase-record has no immutable evidence revision
  402. 41.26 s gammaloop-nextest-docs> warning: developer note ratatui-integration-dashboard-history still requires a named owner
  403. 41.26 s gammaloop-nextest-docs> warning: archived developer note ratatui-integration-dashboard-history has no immutable evidence revision
  404. 41.26 s gammaloop-nextest-docs> warning: developer note nix-crane-cache-reuse still requires a named owner
  405. 41.26 s gammaloop-nextest-docs>
  406. 41.26 s gammaloop-nextest-docs> thread 'tests::pdf_manual_chapter_order_must_match_the_page_registry' (323) panicked at crates/alphal00p-docs-builder/src/lib.rs:11952:9:
  407. 41.26 s gammaloop-nextest-docs> assertion failed: format!("{error:#}").contains("PDF manual chapter order differs")
  408. 41.26 s gammaloop-nextest-docs> stack backtrace:
  409. 41.26 s gammaloop-nextest-docs> 0: __rustc::rust_begin_unwind
  410. 41.26 s gammaloop-nextest-docs> 1: core::panicking::panic_fmt
  411. 41.26 s gammaloop-nextest-docs> 2: core::panicking::panic
  412. 41.26 s gammaloop-nextest-docs> 3: alphal00p_docs_builder::tests::pdf_manual_chapter_order_must_match_the_page_registry
  413. 41.26 s gammaloop-nextest-docs> 4: <alphal00p_docs_builder::tests::pdf_manual_chapter_order_must_match_the_page_registry::{closure#0} as core::ops::function::FnOnce<()>>::call_once
  414. 41.26 s gammaloop-nextest-docs> note: Some details are omitted, run with `RUST_BACKTRACE=full` for a verbose backtrace.
  415. 41.26 s gammaloop-nextest-docs>
  416. 41.27 s gammaloop-nextest-docs> error: test run failed
  417. 41.32 s gammaloop-nextest-docs>
  418. 41.32 s gammaloop-nextest-docs> ========== nextest test summary ==========
  419. 41.32 s gammaloop-nextest-docs> report: target/nextest/ci_gammaloop/junit.xml
  420. 41.32 s gammaloop-nextest-docs> tests: 111, failures: 3, errors: 0
  421. 41.32 s gammaloop-nextest-docs>
  422. 41.32 s gammaloop-nextest-docs> 1. alphal00p-docs-builder::tests::checked_in_registry_is_valid
  423. 41.32 s gammaloop-nextest-docs> failure: test failure with exit code 101
  424. 41.32 s gammaloop-nextest-docs> thread 'tests::checked_in_registry_is_valid' (160) panicked at crates/alphal00p-docs-builder/src/lib.rs:11887:50:
  425. 41.32 s gammaloop-nextest-docs> called `Result::unwrap()` on an `Err` value: developer note nix-crane-cache-reuse verified scope flake.nix changed (expected 188504937418859942a6770ca21a4f4e0a7ff125, found 2055acf4433777d5a18c44d88e8416b42a938f3a); owner review or an explicit no-impact attestation is required
  426. 41.32 s gammaloop-nextest-docs>
  427. 41.32 s gammaloop-nextest-docs> Location:
  428. 41.32 s gammaloop-nextest-docs> crates/alphal00p-docs-builder/src/lib.rs:889:21
  429. 41.32 s gammaloop-nextest-docs> stack backtrace:
  430. 41.32 s gammaloop-nextest-docs> 0: __rustc::rust_begin_unwind
  431. 41.32 s gammaloop-nextest-docs> 1: core::panicking::panic_fmt
  432. 41.32 s gammaloop-nextest-docs> 2: core::result::unwrap_failed
  433. 41.32 s gammaloop-nextest-docs> 3: alphal00p_docs_builder::tests::checked_in_registry_is_valid
  434. 41.32 s gammaloop-nextest-docs> 4: <alphal00p_docs_builder::tests::checked_in_registry_is_valid::{closure#0} as core::ops::function::FnOnce<()>>::call_once
  435. 41.32 s gammaloop-nextest-docs> note: Some details are omitted, run with `RUST_BACKTRACE=full` for a verbose backtrace.
  436. 41.32 s gammaloop-nextest-docs> system-out
  437. 41.32 s gammaloop-nextest-docs> running 1 test
  438. 41.32 s gammaloop-nextest-docs> test tests::checked_in_registry_is_valid ... FAILED
  439. 41.32 s gammaloop-nextest-docs>
  440. 41.32 s gammaloop-nextest-docs> failures:
  441. 41.32 s gammaloop-nextest-docs>
  442. 41.32 s gammaloop-nextest-docs> failures:
  443. 41.32 s gammaloop-nextest-docs> tests::checked_in_registry_is_valid
  444. 41.32 s gammaloop-nextest-docs>
  445. 41.32 s gammaloop-nextest-docs> test result: FAILED. 0 passed; 1 failed; 0 ignored; 0 measured; 110 filtered out; finished in 0.11s
  446. 41.32 s gammaloop-nextest-docs> system-err
  447. 41.32 s gammaloop-nextest-docs> warning: developer note gammaloop-architecture still requires a named owner
  448. 41.32 s gammaloop-nextest-docs> warning: developer note integration-dashboard still requires a named owner
  449. 41.32 s gammaloop-nextest-docs> warning: developer note uv-renormalization still requires a named owner
  450. 41.32 s gammaloop-nextest-docs> warning: developer note spenso-parsing-flow still requires a named owner
  451. 41.32 s gammaloop-nextest-docs> warning: developer note schoonschip-network still requires a named owner
  452. 41.32 s gammaloop-nextest-docs> warning: developer note gammaloop-draw-style-migration still requires a named owner
  453. 41.32 s gammaloop-nextest-docs> warning: developer note gammaloop-drawing-architecture still requires a named owner
  454. 41.32 s gammaloop-nextest-docs> warning: developer note spenso-symbolica-syntax-and-rewrites still requires a named owner
  455. 41.32 s gammaloop-nextest-docs> warning: developer note spenso-architecture still requires a named owner
  456. 41.32 s gammaloop-nextest-docs> warning: developer note idenso-architecture still requires a named owner
  457. 41.32 s gammaloop-nextest-docs> warning: developer note idenso-form-color-dirac-source-map still requires a named owner
  458. 41.32 s gammaloop-nextest-docs> warning: developer note linnet-architecture still requires a named owner
  459. 41.32 s gammaloop-nextest-docs> warning: developer note vakint-architecture still requires a named owner
  460. 41.32 s gammaloop-nextest-docs> warning: developer note gammaloop-roadmap still requires a named owner
  461. 41.32 s gammaloop-nextest-docs> warning: developer note cff-surface-cache-ownership still requires a named owner
  462. 41.32 s gammaloop-nextest-docs> warning: developer note gammaloop-drawing-evaluated-fields-history still requires a named owner
  463. 41.32 s gammaloop-nextest-docs> warning: archived developer note gammaloop-drawing-evaluated-fields-history has no immutable evidence revision
  464. 41.32 s gammaloop-nextest-docs> warning: developer note bnl-benchmark-investigation still requires a named owner
  465. 41.32 s gammaloop-nextest-docs> warning: developer note bnl-contraction-order-performance still requires a named owner
  466. 41.32 s gammaloop-nextest-docs> warning: developer note bnl-scalar-alias-capture still requires a named owner
  467. 41.32 s gammaloop-nextest-docs> warning: developer note aa-aa-three-loop-performance-smoke still requires a named owner
  468. 41.32 s gammaloop-nextest-docs> warning: developer note network-simplification still requires a named owner
  469. 41.32 s gammaloop-nextest-docs> warning: investigation developer note network-simplification has no immutable evidence revision
  470. 41.32 s gammaloop-nextest-docs> warning: developer note spenso-large-expressions still requires a named owner
  471. 41.32 s gammaloop-nextest-docs> warning: developer note spenso-improvement-effects still requires a named owner
  472. 41.32 s gammaloop-nextest-docs> warning: archived developer note spenso-improvement-effects has no immutable evidence revision
  473. 41.32 s gammaloop-nextest-docs> warning: developer note spenso-test-baseline still requires a named owner
  474. 41.32 s gammaloop-nextest-docs> warning: archived developer note spenso-test-baseline has no immutable evidence revision
  475. 41.32 s gammaloop-nextest-docs> warning: developer note bnl-evaluator-atom-capture still requires a named owner
  476. 41.32 s gammaloop-nextest-docs> warning: archived developer note bnl-evaluator-atom-capture has no immutable evidence revision
  477. 41.32 s gammaloop-nextest-docs> warning: developer note uv-scalar-profile-benchmark still requires a named owner
  478. 41.32 s gammaloop-nextest-docs> warning: archived developer note uv-scalar-profile-benchmark has no immutable evidence revision
  479. 41.32 s gammaloop-nextest-docs> warning: developer note ci-test-failure-summary-2026-03-25 still requires a named owner
  480. 41.32 s gammaloop-nextest-docs> warning: archived developer note ci-test-failure-summary-2026-03-25 has no immutable evidence revision
  481. 41.32 s gammaloop-nextest-docs> warning: developer note network-execution-rebase-record still requires a named owner
  482. 41.32 s gammaloop-nextest-docs> warning: archived developer note network-execution-rebase-record has no immutable evidence revision
  483. 41.32 s gammaloop-nextest-docs> warning: developer note ratatui-integration-dashboard-history still requires a named owner
  484. 41.32 s gammaloop-nextest-docs> warning: archived developer note ratatui-integration-dashboard-history has no immutable evidence revision
  485. 41.32 s gammaloop-nextest-docs> warning: developer note nix-crane-cache-reuse still requires a named owner
  486. 41.32 s gammaloop-nextest-docs>
  487. 41.33 s gammaloop-nextest-docs> thread 'tests::checked_in_registry_is_valid' (160) panicked at crates/alphal00p-docs-builder/src/lib.rs:11887:50:
  488. 41.33 s gammaloop-nextest-docs> called `Result::unwrap()` on an `Err` value: developer note nix-crane-cache-reuse verified scope flake.nix changed (expected 188504937418859942a6770ca21a4f4e0a7ff125, found 2055acf4433777d5a18c44d88e8416b42a938f3a); owner review or an explicit no-impact attestation is required
  489. 41.33 s gammaloop-nextest-docs>
  490. 41.33 s gammaloop-nextest-docs> Location:
  491. 41.33 s gammaloop-nextest-docs> crates/alphal00p-docs-builder/src/lib.rs:889:21
  492. 41.33 s gammaloop-nextest-docs> stack backtrace:
  493. 41.33 s gammaloop-nextest-docs> 0: __rustc::rust_begin_unwind
  494. 41.33 s gammaloop-nextest-docs> 1: core::panicking::panic_fmt
  495. 41.33 s gammaloop-nextest-docs> 2: core::result::unwrap_failed
  496. 41.33 s gammaloop-nextest-docs> 3: alphal00p_docs_builder::tests::checked_in_registry_is_valid
  497. 41.33 s gammaloop-nextest-docs> 4: <alphal00p_docs_builder::tests::checked_in_registry_is_valid::{closure#0} as core::ops::function::FnOnce<()>>::call_once
  498. 41.33 s gammaloop-nextest-docs> note: Some details are omitted, run with `RUST_BACKTRACE=full` for a verbose backtrace.
  499. 41.33 s gammaloop-nextest-docs>
  500. 41.33 s gammaloop-nextest-docs> 2. alphal00p-docs-builder::tests::every_product_requires_a_task_chooser_and_each_supported_interface
  501. 41.33 s gammaloop-nextest-docs> failure: test failure with exit code 101
  502. 41.33 s gammaloop-nextest-docs> thread 'tests::every_product_requires_a_task_chooser_and_each_supported_interface' (269) panicked at crates/alphal00p-docs-builder/src/lib.rs:11901:9:
  503. 41.33 s gammaloop-nextest-docs> assertion failed: format!("{error:#}").contains("has no quickstart page")
  504. 41.33 s gammaloop-nextest-docs> stack backtrace:
  505. 41.33 s gammaloop-nextest-docs> 0: __rustc::rust_begin_unwind
  506. 41.33 s gammaloop-nextest-docs> 1: core::panicking::panic_fmt
  507. 41.33 s gammaloop-nextest-docs> 2: core::panicking::panic
  508. 41.33 s gammaloop-nextest-docs> 3: alphal00p_docs_builder::tests::every_product_requires_a_task_chooser_and_each_supported_interface
  509. 41.33 s gammaloop-nextest-docs> 4: <alphal00p_docs_builder::tests::every_product_requires_a_task_chooser_and_each_supported_interface::{closure#0} as core::ops::function::FnOnce<()>>::call_once
  510. 41.33 s gammaloop-nextest-docs> note: Some details are omitted, run with `RUST_BACKTRACE=full` for a verbose backtrace.
  511. 41.33 s gammaloop-nextest-docs> system-out
  512. 41.33 s gammaloop-nextest-docs> running 1 test
  513. 41.33 s gammaloop-nextest-docs> test tests::every_product_requires_a_task_chooser_and_each_supported_interface ... FAILED
  514. 41.33 s gammaloop-nextest-docs>
  515. 41.33 s gammaloop-nextest-docs> failures:
  516. 41.33 s gammaloop-nextest-docs>
  517. 41.33 s gammaloop-nextest-docs> failures:
  518. 41.33 s gammaloop-nextest-docs> tests::every_product_requires_a_task_chooser_and_each_supported_interface
  519. 41.33 s gammaloop-nextest-docs>
  520. 41.33 s gammaloop-nextest-docs> test result: FAILED. 0 passed; 1 failed; 0 ignored; 0 measured; 110 filtered out; finished in 0.10s
  521. 41.33 s gammaloop-nextest-docs> system-err
  522. 41.33 s gammaloop-nextest-docs> warning: developer note gammaloop-architecture still requires a named owner
  523. 41.33 s gammaloop-nextest-docs> warning: developer note integration-dashboard still requires a named owner
  524. 41.33 s gammaloop-nextest-docs> warning: developer note uv-renormalization still requires a named owner
  525. 41.33 s gammaloop-nextest-docs> warning: developer note spenso-parsing-flow still requires a named owner
  526. 41.33 s gammaloop-nextest-docs> warning: developer note schoonschip-network still requires a named owner
  527. 41.33 s gammaloop-nextest-docs> warning: developer note gammaloop-draw-style-migration still requires a named owner
  528. 41.33 s gammaloop-nextest-docs> warning: developer note gammaloop-drawing-architecture still requires a named owner
  529. 41.33 s gammaloop-nextest-docs> warning: developer note spenso-symbolica-syntax-and-rewrites still requires a named owner
  530. 41.33 s gammaloop-nextest-docs> warning: developer note spenso-architecture still requires a named owner
  531. 41.33 s gammaloop-nextest-docs> warning: developer note idenso-architecture still requires a named owner
  532. 41.33 s gammaloop-nextest-docs> warning: developer note idenso-form-color-dirac-source-map still requires a named owner
  533. 41.33 s gammaloop-nextest-docs> warning: developer note linnet-architecture still requires a named owner
  534. 41.33 s gammaloop-nextest-docs> warning: developer note vakint-architecture still requires a named owner
  535. 41.33 s gammaloop-nextest-docs> warning: developer note gammaloop-roadmap still requires a named owner
  536. 41.33 s gammaloop-nextest-docs> warning: developer note cff-surface-cache-ownership still requires a named owner
  537. 41.33 s gammaloop-nextest-docs> warning: developer note gammaloop-drawing-evaluated-fields-history still requires a named owner
  538. 41.33 s gammaloop-nextest-docs> warning: archived developer note gammaloop-drawing-evaluated-fields-history has no immutable evidence revision
  539. 41.33 s gammaloop-nextest-docs> warning: developer note bnl-benchmark-investigation still requires a named owner
  540. 41.33 s gammaloop-nextest-docs> warning: developer note bnl-contraction-order-performance still requires a named owner
  541. 41.33 s gammaloop-nextest-docs> warning: developer note bnl-scalar-alias-capture still requires a named owner
  542. 41.33 s gammaloop-nextest-docs> warning: developer note aa-aa-three-loop-performance-smoke still requires a named owner
  543. 41.33 s gammaloop-nextest-docs> warning: developer note network-simplification still requires a named owner
  544. 41.33 s gammaloop-nextest-docs> warning: investigation developer note network-simplification has no immutable evidence revision
  545. 41.33 s gammaloop-nextest-docs> warning: developer note spenso-large-expressions still requires a named owner
  546. 41.33 s gammaloop-nextest-docs> warning: developer note spenso-improvement-effects still requires a named owner
  547. 41.33 s gammaloop-nextest-docs> warning: archived developer note spenso-improvement-effects has no immutable evidence revision
  548. 41.33 s gammaloop-nextest-docs> warning: developer note spenso-test-baseline still requires a named owner
  549. 41.33 s gammaloop-nextest-docs> warning: archived developer note spenso-test-baseline has no immutable evidence revision
  550. 41.33 s gammaloop-nextest-docs> warning: developer note bnl-evaluator-atom-capture still requires a named owner
  551. 41.33 s gammaloop-nextest-docs> warning: archived developer note bnl-evaluator-atom-capture has no immutable evidence revision
  552. 41.33 s gammaloop-nextest-docs> warning: developer note uv-scalar-profile-benchmark still requires a named owner
  553. 41.33 s gammaloop-nextest-docs> warning: archived developer note uv-scalar-profile-benchmark has no immutable evidence revision
  554. 41.33 s gammaloop-nextest-docs> warning: developer note ci-test-failure-summary-2026-03-25 still requires a named owner
  555. 41.33 s gammaloop-nextest-docs> warning: archived developer note ci-test-failure-summary-2026-03-25 has no immutable evidence revision
  556. 41.33 s gammaloop-nextest-docs> warning: developer note network-execution-rebase-record still requires a named owner
  557. 41.33 s gammaloop-nextest-docs> warning: archived developer note network-execution-rebase-record has no immutable evidence revision
  558. 41.33 s gammaloop-nextest-docs> warning: developer note ratatui-integration-dashboard-history still requires a named owner
  559. 41.33 s gammaloop-nextest-docs> warning: archived developer note ratatui-integration-dashboard-history has no immutable evidence revision
  560. 41.33 s gammaloop-nextest-docs> warning: developer note nix-crane-cache-reuse still requires a named owner
  561. 41.33 s gammaloop-nextest-docs>
  562. 41.33 s gammaloop-nextest-docs> thread 'tests::every_product_requires_a_task_chooser_and_each_supported_interface' (269) panicked at crates/alphal00p-docs-builder/src/lib.rs:11901:9:
  563. 41.33 s gammaloop-nextest-docs> assertion failed: format!("{error:#}").contains("has no quickstart page")
  564. 41.33 s gammaloop-nextest-docs> stack backtrace:
  565. 41.33 s gammaloop-nextest-docs> 0: __rustc::rust_begin_unwind
  566. 41.33 s gammaloop-nextest-docs> 1: core::panicking::panic_fmt
  567. 41.33 s gammaloop-nextest-docs> 2: core::panicking::panic
  568. 41.33 s gammaloop-nextest-docs> 3: alphal00p_docs_builder::tests::every_product_requires_a_task_chooser_and_each_supported_interface
  569. 41.33 s gammaloop-nextest-docs> 4: <alphal00p_docs_builder::tests::every_product_requires_a_task_chooser_and_each_supported_interface::{closure#0} as core::ops::function::FnOnce<()>>::call_once
  570. 41.33 s gammaloop-nextest-docs> note: Some details are omitted, run with `RUST_BACKTRACE=full` for a verbose backtrace.
  571. 41.33 s gammaloop-nextest-docs>
  572. 41.33 s gammaloop-nextest-docs> 3. alphal00p-docs-builder::tests::pdf_manual_chapter_order_must_match_the_page_registry
  573. 41.33 s gammaloop-nextest-docs> failure: test failure with exit code 101
  574. 41.33 s gammaloop-nextest-docs> thread 'tests::pdf_manual_chapter_order_must_match_the_page_registry' (323) panicked at crates/alphal00p-docs-builder/src/lib.rs:11952:9:
  575. 41.33 s gammaloop-nextest-docs> assertion failed: format!("{error:#}").contains("PDF manual chapter order differs")
  576. 41.33 s gammaloop-nextest-docs> stack backtrace:
  577. 41.33 s gammaloop-nextest-docs> 0: __rustc::rust_begin_unwind
  578. 41.33 s gammaloop-nextest-docs> 1: core::panicking::panic_fmt
  579. 41.33 s gammaloop-nextest-docs> 2: core::panicking::panic
  580. 41.33 s gammaloop-nextest-docs> 3: alphal00p_docs_builder::tests::pdf_manual_chapter_order_must_match_the_page_registry
  581. 41.33 s gammaloop-nextest-docs> 4: <alphal00p_docs_builder::tests::pdf_manual_chapter_order_must_match_the_page_registry::{closure#0} as core::ops::function::FnOnce<()>>::call_once
  582. 41.33 s gammaloop-nextest-docs> note: Some details are omitted, run with `RUST_BACKTRACE=full` for a verbose backtrace.
  583. 41.33 s gammaloop-nextest-docs> system-out
  584. 41.33 s gammaloop-nextest-docs> running 1 test
  585. 41.33 s gammaloop-nextest-docs> test tests::pdf_manual_chapter_order_must_match_the_page_registry ... FAILED
  586. 41.33 s gammaloop-nextest-docs>
  587. 41.33 s gammaloop-nextest-docs> failures:
  588. 41.33 s gammaloop-nextest-docs>
  589. 41.33 s gammaloop-nextest-docs> failures:
  590. 41.33 s gammaloop-nextest-docs> tests::pdf_manual_chapter_order_must_match_the_page_registry
  591. 41.33 s gammaloop-nextest-docs>
  592. 41.33 s gammaloop-nextest-docs> test result: FAILED. 0 passed; 1 failed; 0 ignored; 0 measured; 110 filtered out; finished in 0.09s
  593. 41.33 s gammaloop-nextest-docs> system-err
  594. 41.33 s gammaloop-nextest-docs> warning: developer note gammaloop-architecture still requires a named owner
  595. 41.33 s gammaloop-nextest-docs> warning: developer note integration-dashboard still requires a named owner
  596. 41.33 s gammaloop-nextest-docs> warning: developer note uv-renormalization still requires a named owner
  597. 41.33 s gammaloop-nextest-docs> warning: developer note spenso-parsing-flow still requires a named owner
  598. 41.33 s gammaloop-nextest-docs> warning: developer note schoonschip-network still requires a named owner
  599. 41.33 s gammaloop-nextest-docs> warning: developer note gammaloop-draw-style-migration still requires a named owner
  600. 41.33 s gammaloop-nextest-docs> warning: developer note gammaloop-drawing-architecture still requires a named owner
  601. 41.33 s gammaloop-nextest-docs> warning: developer note spenso-symbolica-syntax-and-rewrites still requires a named owner
  602. 41.33 s gammaloop-nextest-docs> warning: developer note spenso-architecture still requires a named owner
  603. 41.33 s gammaloop-nextest-docs> warning: developer note idenso-architecture still requires a named owner
  604. 41.33 s gammaloop-nextest-docs> warning: developer note idenso-form-color-dirac-source-map still requires a named owner
  605. 41.33 s gammaloop-nextest-docs> warning: developer note linnet-architecture still requires a named owner
  606. 41.33 s gammaloop-nextest-docs> warning: developer note vakint-architecture still requires a named owner
  607. 41.33 s gammaloop-nextest-docs> warning: developer note gammaloop-roadmap still requires a named owner
  608. 41.33 s gammaloop-nextest-docs> warning: developer note cff-surface-cache-ownership still requires a named owner
  609. 41.33 s gammaloop-nextest-docs> warning: developer note gammaloop-drawing-evaluated-fields-history still requires a named owner
  610. 41.33 s gammaloop-nextest-docs> warning: archived developer note gammaloop-drawing-evaluated-fields-history has no immutable evidence revision
  611. 41.33 s gammaloop-nextest-docs> warning: developer note bnl-benchmark-investigation still requires a named owner
  612. 41.33 s gammaloop-nextest-docs> warning: developer note bnl-contraction-order-performance still requires a named owner
  613. 41.33 s gammaloop-nextest-docs> warning: developer note bnl-scalar-alias-capture still requires a named owner
  614. 41.33 s gammaloop-nextest-docs> warning: developer note aa-aa-three-loop-performance-smoke still requires a named owner
  615. 41.33 s gammaloop-nextest-docs> warning: developer note network-simplification still requires a named owner
  616. 41.33 s gammaloop-nextest-docs> warning: investigation developer note network-simplification has no immutable evidence revision
  617. 41.33 s gammaloop-nextest-docs> warning: developer note spenso-large-expressions still requires a named owner
  618. 41.33 s gammaloop-nextest-docs> warning: developer note spenso-improvement-effects still requires a named owner
  619. 41.33 s gammaloop-nextest-docs> warning: archived developer note spenso-improvement-effects has no immutable evidence revision
  620. 41.33 s gammaloop-nextest-docs> warning: developer note spenso-test-baseline still requires a named owner
  621. 41.33 s gammaloop-nextest-docs> warning: archived developer note spenso-test-baseline has no immutable evidence revision
  622. 41.33 s gammaloop-nextest-docs> warning: developer note bnl-evaluator-atom-capture still requires a named owner
  623. 41.33 s gammaloop-nextest-docs> warning: archived developer note bnl-evaluator-atom-capture has no immutable evidence revision
  624. 41.33 s gammaloop-nextest-docs> warning: developer note uv-scalar-profile-benchmark still requires a named owner
  625. 41.33 s gammaloop-nextest-docs> warning: archived developer note uv-scalar-profile-benchmark has no immutable evidence revision
  626. 41.33 s gammaloop-nextest-docs> warning: developer note ci-test-failure-summary-2026-03-25 still requires a named owner
  627. 41.33 s gammaloop-nextest-docs> warning: archived developer note ci-test-failure-summary-2026-03-25 has no immutable evidence revision
  628. 41.33 s gammaloop-nextest-docs> warning: developer note network-execution-rebase-record still requires a named owner
  629. 41.33 s gammaloop-nextest-docs> warning: archived developer note network-execution-rebase-record has no immutable evidence revision
  630. 41.33 s gammaloop-nextest-docs> warning: developer note ratatui-integration-dashboard-history still requires a named owner
  631. 41.33 s gammaloop-nextest-docs> warning: archived developer note ratatui-integration-dashboard-history has no immutable evidence revision
  632. 41.33 s gammaloop-nextest-docs> warning: developer note nix-crane-cache-reuse still requires a named owner
  633. 41.33 s gammaloop-nextest-docs>
  634. 41.33 s gammaloop-nextest-docs> thread 'tests::pdf_manual_chapter_order_must_match_the_page_registry' (323) panicked at crates/alphal00p-docs-builder/src/lib.rs:11952:9:
  635. 41.33 s gammaloop-nextest-docs> assertion failed: format!("{error:#}").contains("PDF manual chapter order differs")
  636. 41.33 s gammaloop-nextest-docs> stack backtrace:
  637. 41.33 s gammaloop-nextest-docs> 0: __rustc::rust_begin_unwind
  638. 41.33 s gammaloop-nextest-docs> 1: core::panicking::panic_fmt
  639. 41.33 s gammaloop-nextest-docs> 2: core::panicking::panic
  640. 41.33 s gammaloop-nextest-docs> 3: alphal00p_docs_builder::tests::pdf_manual_chapter_order_must_match_the_page_registry
  641. 41.33 s gammaloop-nextest-docs> 4: <alphal00p_docs_builder::tests::pdf_manual_chapter_order_must_match_the_page_registry::{closure#0} as core::ops::function::FnOnce<()>>::call_once
  642. 41.33 s gammaloop-nextest-docs> note: Some details are omitted, run with `RUST_BACKTRACE=full` for a verbose backtrace.
  643. 41.33 s gammaloop-nextest-docs> =========================================
  644. 41.35 s gammaloop-nextest-docs> Extracting 2 binaries to /build/source
  645. 41.39 s gammaloop-nextest-docs> Extracted 5 files to /build/source in 0.04s
  646. 41.40 s gammaloop-nextest-docs> ------------
  647. 41.40 s gammaloop-nextest-docs> Nextest run ID ab7e93d7-3f41-4547-9b32-a57851309287 with nextest profile: ci_gammaloop
  648. 41.40 s gammaloop-nextest-docs> Starting 22 tests across 2 binaries
  649. 41.43 s gammaloop-nextest-docs> ------------
  650. 41.43 s gammaloop-nextest-docs> Summary [ 0.025s] 22 tests run: 22 passed, 0 skipped
  651. 41.48 s gammaloop-nextest-docs>
  652. 41.48 s gammaloop-nextest-docs> ========== nextest test summary ==========
  653. 41.48 s gammaloop-nextest-docs> report: target/nextest/ci_gammaloop/junit.xml
  654. 41.48 s gammaloop-nextest-docs> tests: 22, failures: 0, errors: 0
  655. 41.48 s gammaloop-nextest-docs> No failing testcases found.
  656. 41.48 s gammaloop-nextest-docs> =========================================
  657. 41.50 s gammaloop-nextest-docs> Extracting 3 binaries (including 2 non-test binaries), 1 build script output directory, and 2 linked paths to /build/source
  658. 41.91 s gammaloop-nextest-docs> Extracted 22 files to /build/source in 0.41s
  659. 41.92 s gammaloop-nextest-docs> ------------
  660. 41.92 s gammaloop-nextest-docs> Nextest run ID 4e5ebe17-886f-4ce4-92e6-07a2a89c209f with nextest profile: ci_gammaloop
  661. 41.92 s gammaloop-nextest-docs> Starting 89 tests across 1 binary
  662. 41.99 s gammaloop-nextest-docs> ------------
  663. 41.99 s gammaloop-nextest-docs> Summary [ 0.072s] 89 tests run: 89 passed, 0 skipped
  664. 42.05 s gammaloop-nextest-docs>
  665. 42.05 s gammaloop-nextest-docs> ========== nextest test summary ==========
  666. 42.05 s gammaloop-nextest-docs> report: target/nextest/ci_gammaloop/junit.xml
  667. 42.05 s gammaloop-nextest-docs> tests: 89, failures: 0, errors: 0
  668. 42.05 s gammaloop-nextest-docs> No failing testcases found.
  669. 42.05 s gammaloop-nextest-docs> =========================================
  670. 42.08 s gammaloop-nextest-docs> Extracting 2 binaries to /build/source
  671. 42.15 s gammaloop-nextest-docs> Extracted 5 files to /build/source in 0.07s
  672. 42.16 s gammaloop-nextest-docs> ------------
  673. 42.16 s gammaloop-nextest-docs> Nextest run ID da400a49-d047-4ab0-b5a3-0db815f0eb0d with nextest profile: ci_gammaloop
  674. 42.16 s gammaloop-nextest-docs> Starting 10 tests across 2 binaries
  675. 60.97 s gammaloop-nextest-docs> ------------
  676. 60.97 s gammaloop-nextest-docs> Summary [ 18.803s] 10 tests run: 10 passed, 0 skipped
  677. 61.02 s gammaloop-nextest-docs>
  678. 61.02 s gammaloop-nextest-docs> ========== nextest test summary ==========
  679. 61.02 s gammaloop-nextest-docs> report: target/nextest/ci_gammaloop/junit.xml
  680. 61.02 s gammaloop-nextest-docs> tests: 10, failures: 0, errors: 0
  681. 61.02 s gammaloop-nextest-docs> No failing testcases found.
  682. 61.02 s gammaloop-nextest-docs> =========================================
  683. 61.04 s gammaloop-nextest-docs> Extracting 1 binary to /build/source
  684. 61.10 s gammaloop-nextest-docs> Extracted 4 files to /build/source in 0.05s
  685. 61.11 s gammaloop-nextest-docs> ------------
  686. 61.11 s gammaloop-nextest-docs> Nextest run ID 61eb6bac-349b-4a40-8a8c-b2e99f8a48bd with nextest profile: ci_gammaloop
  687. 61.11 s gammaloop-nextest-docs> Starting 0 tests across 1 binary
  688. 61.11 s gammaloop-nextest-docs> ------------
  689. 61.11 s gammaloop-nextest-docs> Summary [ 0.000s] 0 tests run: 0 passed, 0 skipped
  690. 61.16 s gammaloop-nextest-docs>
  691. 61.16 s gammaloop-nextest-docs> ========== nextest test summary ==========
  692. 61.16 s gammaloop-nextest-docs> report: target/nextest/ci_gammaloop/junit.xml
  693. 61.16 s gammaloop-nextest-docs> tests: 0, failures: 0, errors: 0
  694. 61.16 s gammaloop-nextest-docs> No failing testcases found.
  695. 61.16 s gammaloop-nextest-docs> =========================================
  696. 61.19 s gammaloop-nextest-docs> Extracting 1 binary to /build/source
  697. 61.24 s gammaloop-nextest-docs> Extracted 4 files to /build/source in 0.05s
  698. 61.25 s gammaloop-nextest-docs> ------------
  699. 61.25 s gammaloop-nextest-docs> Nextest run ID 9d987993-11ff-4711-b979-4ce79e5507b1 with nextest profile: ci_gammaloop
  700. 61.25 s gammaloop-nextest-docs> Starting 5 tests across 1 binary
  701. 61.26 s gammaloop-nextest-docs> ------------
  702. 61.26 s gammaloop-nextest-docs> Summary [ 0.009s] 5 tests run: 5 passed, 0 skipped
  703. 61.32 s gammaloop-nextest-docs>
  704. 61.32 s gammaloop-nextest-docs> ========== nextest test summary ==========
  705. 61.32 s gammaloop-nextest-docs> report: target/nextest/ci_gammaloop/junit.xml
  706. 61.32 s gammaloop-nextest-docs> tests: 5, failures: 0, errors: 0
  707. 61.32 s gammaloop-nextest-docs> No failing testcases found.
  708. 61.32 s gammaloop-nextest-docs> =========================================
  709. 61.59 s [0 built (1 failed)]error: Cannot build '/nix/store/iba9mhp7j85acznvf18xhmxcpgblqny8-gammaloop-nextest-docs.drv'.
  710. 61.59 s Reason: builder failed with exit code 100.
  711. 61.59 s Output paths:
  712. 61.59 s /nix/store/dhrilg2md2vkpn5szwq1dqhrk46mlnir-gammaloop-nextest-docs
  713. 61.59 s Last 690 log lines:
  714. 61.59 s > Extracting 2 binaries to /build/source
  715. 61.59 s > Extracted 5 files to /build/source in 0.05s
  716. 61.59 s > ------------
  717. 61.59 s > Nextest run ID 9115e4d2-16ac-4e99-a4f4-c58fdf786afb with nextest profile: ci_gammaloop
  718. 61.59 s > Starting 111 tests across 2 binaries
  719. 61.59 s > FAIL [ 0.122s] ( 71/111) alphal00p-docs-builder tests::checked_in_registry_is_valid
  720. 61.59 s > stdout ---
  721. 61.59 s >
  722. 61.59 s > running 1 test
  723. 61.59 s > test tests::checked_in_registry_is_valid ... FAILED
  724. 61.59 s >
  725. 61.59 s > failures:
  726. 61.59 s >
  727. 61.59 s > failures:
  728. 61.59 s > tests::checked_in_registry_is_valid
  729. 61.59 s >
  730. 61.59 s > test result: FAILED. 0 passed; 1 failed; 0 ignored; 0 measured; 110 filtered out; finished in 0.11s
  731. 61.59 s >
  732. 61.59 s > stderr ---
  733. 61.59 s > warning: developer note gammaloop-architecture still requires a named owner
  734. 61.59 s > warning: developer note integration-dashboard still requires a named owner
  735. 61.59 s > warning: developer note uv-renormalization still requires a named owner
  736. 61.59 s > warning: developer note spenso-parsing-flow still requires a named owner
  737. 61.59 s > warning: developer note schoonschip-network still requires a named owner
  738. 61.59 s > warning: developer note gammaloop-draw-style-migration still requires a named owner
  739. 61.59 s > warning: developer note gammaloop-drawing-architecture still requires a named owner
  740. 61.59 s > warning: developer note spenso-symbolica-syntax-and-rewrites still requires a named owner
  741. 61.59 s > warning: developer note spenso-architecture still requires a named owner
  742. 61.59 s > warning: developer note idenso-architecture still requires a named owner
  743. 61.59 s > warning: developer note idenso-form-color-dirac-source-map still requires a named owner
  744. 61.59 s > warning: developer note linnet-architecture still requires a named owner
  745. 61.59 s > warning: developer note vakint-architecture still requires a named owner
  746. 61.59 s > warning: developer note gammaloop-roadmap still requires a named owner
  747. 61.59 s > warning: developer note cff-surface-cache-ownership still requires a named owner
  748. 61.59 s > warning: developer note gammaloop-drawing-evaluated-fields-history still requires a named owner
  749. 61.59 s > warning: archived developer note gammaloop-drawing-evaluated-fields-history has no immutable evidence revision
  750. 61.59 s > warning: developer note bnl-benchmark-investigation still requires a named owner
  751. 61.59 s > warning: developer note bnl-contraction-order-performance still requires a named owner
  752. 61.59 s > warning: developer note bnl-scalar-alias-capture still requires a named owner
  753. 61.59 s > warning: developer note aa-aa-three-loop-performance-smoke still requires a named owner
  754. 61.59 s > warning: developer note network-simplification still requires a named owner
  755. 61.59 s > warning: investigation developer note network-simplification has no immutable evidence revision
  756. 61.59 s > warning: developer note spenso-large-expressions still requires a named owner
  757. 61.59 s > warning: developer note spenso-improvement-effects still requires a named owner
  758. 61.59 s > warning: archived developer note spenso-improvement-effects has no immutable evidence revision
  759. 61.59 s > warning: developer note spenso-test-baseline still requires a named owner
  760. 61.59 s > warning: archived developer note spenso-test-baseline has no immutable evidence revision
  761. 61.59 s > warning: developer note bnl-evaluator-atom-capture still requires a named owner
  762. 61.59 s > warning: archived developer note bnl-evaluator-atom-capture has no immutable evidence revision
  763. 61.59 s > warning: developer note uv-scalar-profile-benchmark still requires a named owner
  764. 61.59 s > warning: archived developer note uv-scalar-profile-benchmark has no immutable evidence revision
  765. 61.59 s > warning: developer note ci-test-failure-summary-2026-03-25 still requires a named owner
  766. 61.59 s > warning: archived developer note ci-test-failure-summary-2026-03-25 has no immutable evidence revision
  767. 61.59 s > warning: developer note network-execution-rebase-record still requires a named owner
  768. 61.59 s > warning: archived developer note network-execution-rebase-record has no immutable evidence revision
  769. 61.59 s > warning: developer note ratatui-integration-dashboard-history still requires a named owner
  770. 61.59 s > warning: archived developer note ratatui-integration-dashboard-history has no immutable evidence revision
  771. 61.59 s > warning: developer note nix-crane-cache-reuse still requires a named owner
  772. 61.59 s >
  773. 61.59 s > thread 'tests::checked_in_registry_is_valid' (160) panicked at crates/alphal00p-docs-builder/src/lib.rs:11887:50:
  774. 61.59 s > called `Result::unwrap()` on an `Err` value: developer note nix-crane-cache-reuse verified scope flake.nix changed (expected 188504937418859942a6770ca21a4f4e0a7ff125, found 2055acf4433777d5a18c44d88e8416b42a938f3a); owner review or an explicit no-impact attestation is required
  775. 61.59 s >
  776. 61.59 s > Location:
  777. 61.59 s > crates/alphal00p-docs-builder/src/lib.rs:889:21
  778. 61.59 s > stack backtrace:
  779. 61.59 s > 0: __rustc::rust_begin_unwind
  780. 61.59 s > 1: core::panicking::panic_fmt
  781. 61.59 s > 2: core::result::unwrap_failed
  782. 61.59 s > 3: alphal00p_docs_builder::tests::checked_in_registry_is_valid
  783. 61.59 s > 4: <alphal00p_docs_builder::tests::checked_in_registry_is_valid::{closure#0} as core::ops::function::FnOnce<()>>::call_once
  784. 61.60 s > note: Some details are omitted, run with `RUST_BACKTRACE=full` for a verbose backtrace.
  785. 61.60 s >
  786. 61.60 s > FAIL [ 0.106s] ( 75/111) alphal00p-docs-builder tests::every_product_requires_a_task_chooser_and_each_supported_interface
  787. 61.60 s > stdout ---
  788. 61.60 s >
  789. 61.60 s > running 1 test
  790. 61.60 s > test tests::every_product_requires_a_task_chooser_and_each_supported_interface ... FAILED
  791. 61.60 s >
  792. 61.60 s > failures:
  793. 61.60 s >
  794. 61.60 s > failures:
  795. 61.60 s > tests::every_product_requires_a_task_chooser_and_each_supported_interface
  796. 61.60 s >
  797. 61.60 s > test result: FAILED. 0 passed; 1 failed; 0 ignored; 0 measured; 110 filtered out; finished in 0.10s
  798. 61.60 s >
  799. 61.60 s > stderr ---
  800. 61.60 s > warning: developer note gammaloop-architecture still requires a named owner
  801. 61.60 s > warning: developer note integration-dashboard still requires a named owner
  802. 61.60 s > warning: developer note uv-renormalization still requires a named owner
  803. 61.60 s > warning: developer note spenso-parsing-flow still requires a named owner
  804. 61.60 s > warning: developer note schoonschip-network still requires a named owner
  805. 61.60 s > warning: developer note gammaloop-draw-style-migration still requires a named owner
  806. 61.60 s > warning: developer note gammaloop-drawing-architecture still requires a named owner
  807. 61.60 s > warning: developer note spenso-symbolica-syntax-and-rewrites still requires a named owner
  808. 61.60 s > warning: developer note spenso-architecture still requires a named owner
  809. 61.60 s > warning: developer note idenso-architecture still requires a named owner
  810. 61.60 s > warning: developer note idenso-form-color-dirac-source-map still requires a named owner
  811. 61.60 s > warning: developer note linnet-architecture still requires a named owner
  812. 61.60 s > warning: developer note vakint-architecture still requires a named owner
  813. 61.60 s > warning: developer note gammaloop-roadmap still requires a named owner
  814. 61.60 s > warning: developer note cff-surface-cache-ownership still requires a named owner
  815. 61.60 s > warning: developer note gammaloop-drawing-evaluated-fields-history still requires a named owner
  816. 61.60 s > warning: archived developer note gammaloop-drawing-evaluated-fields-history has no immutable evidence revision
  817. 61.60 s > warning: developer note bnl-benchmark-investigation still requires a named owner
  818. 61.60 s > warning: developer note bnl-contraction-order-performance still requires a named owner
  819. 61.60 s > warning: developer note bnl-scalar-alias-capture still requires a named owner
  820. 61.60 s > warning: developer note aa-aa-three-loop-performance-smoke still requires a named owner
  821. 61.60 s > warning: developer note network-simplification still requires a named owner
  822. 61.60 s > warning: investigation developer note network-simplification has no immutable evidence revision
  823. 61.60 s > warning: developer note spenso-large-expressions still requires a named owner
  824. 61.60 s > warning: developer note spenso-improvement-effects still requires a named owner
  825. 61.60 s > warning: archived developer note spenso-improvement-effects has no immutable evidence revision
  826. 61.60 s > warning: developer note spenso-test-baseline still requires a named owner
  827. 61.60 s > warning: archived developer note spenso-test-baseline has no immutable evidence revision
  828. 61.60 s > warning: developer note bnl-evaluator-atom-capture still requires a named owner
  829. 61.60 s > warning: archived developer note bnl-evaluator-atom-capture has no immutable evidence revision
  830. 61.60 s > warning: developer note uv-scalar-profile-benchmark still requires a named owner
  831. 61.60 s > warning: archived developer note uv-scalar-profile-benchmark has no immutable evidence revision
  832. 61.60 s > warning: developer note ci-test-failure-summary-2026-03-25 still requires a named owner
  833. 61.60 s > warning: archived developer note ci-test-failure-summary-2026-03-25 has no immutable evidence revision
  834. 61.60 s > warning: developer note network-execution-rebase-record still requires a named owner
  835. 61.60 s > warning: archived developer note network-execution-rebase-record has no immutable evidence revision
  836. 61.60 s > warning: developer note ratatui-integration-dashboard-history still requires a named owner
  837. 61.60 s > warning: archived developer note ratatui-integration-dashboard-history has no immutable evidence revision
  838. 61.60 s > warning: developer note nix-crane-cache-reuse still requires a named owner
  839. 61.60 s >
  840. 61.60 s > thread 'tests::every_product_requires_a_task_chooser_and_each_supported_interface' (269) panicked at crates/alphal00p-docs-builder/src/lib.rs:11901:9:
  841. 61.60 s > assertion failed: format!("{error:#}").contains("has no quickstart page")
  842. 61.60 s > stack backtrace:
  843. 61.60 s > 0: __rustc::rust_begin_unwind
  844. 61.60 s > 1: core::panicking::panic_fmt
  845. 61.60 s > 2: core::panicking::panic
  846. 61.60 s > 3: alphal00p_docs_builder::tests::every_product_requires_a_task_chooser_and_each_supported_interface
  847. 61.60 s > 4: <alphal00p_docs_builder::tests::every_product_requires_a_task_chooser_and_each_supported_interface::{closure#0} as core::ops::function::FnOnce<()>>::call_once
  848. 61.60 s > note: Some details are omitted, run with `RUST_BACKTRACE=full` for a verbose backtrace.
  849. 61.60 s >
  850. 61.60 s > FAIL [ 0.104s] ( 93/111) alphal00p-docs-builder tests::pdf_manual_chapter_order_must_match_the_page_registry
  851. 61.60 s > stdout ---
  852. 61.60 s >
  853. 61.60 s > running 1 test
  854. 61.60 s > test tests::pdf_manual_chapter_order_must_match_the_page_registry ... FAILED
  855. 61.60 s >
  856. 61.60 s > failures:
  857. 61.60 s >
  858. 61.60 s > failures:
  859. 61.60 s > tests::pdf_manual_chapter_order_must_match_the_page_registry
  860. 61.60 s >
  861. 61.60 s > test result: FAILED. 0 passed; 1 failed; 0 ignored; 0 measured; 110 filtered out; finished in 0.09s
  862. 61.60 s >
  863. 61.60 s > stderr ---
  864. 61.60 s > warning: developer note gammaloop-architecture still requires a named owner
  865. 61.60 s > warning: developer note integration-dashboard still requires a named owner
  866. 61.60 s > warning: developer note uv-renormalization still requires a named owner
  867. 61.60 s > warning: developer note spenso-parsing-flow still requires a named owner
  868. 61.60 s > warning: developer note schoonschip-network still requires a named owner
  869. 61.60 s > warning: developer note gammaloop-draw-style-migration still requires a named owner
  870. 61.60 s > warning: developer note gammaloop-drawing-architecture still requires a named owner
  871. 61.60 s > warning: developer note spenso-symbolica-syntax-and-rewrites still requires a named owner
  872. 61.60 s > warning: developer note spenso-architecture still requires a named owner
  873. 61.60 s > warning: developer note idenso-architecture still requires a named owner
  874. 61.60 s > warning: developer note idenso-form-color-dirac-source-map still requires a named owner
  875. 61.60 s > warning: developer note linnet-architecture still requires a named owner
  876. 61.60 s > warning: developer note vakint-architecture still requires a named owner
  877. 61.60 s > warning: developer note gammaloop-roadmap still requires a named owner
  878. 61.60 s > warning: developer note cff-surface-cache-ownership still requires a named owner
  879. 61.60 s > warning: developer note gammaloop-drawing-evaluated-fields-history still requires a named owner
  880. 61.60 s > warning: archived developer note gammaloop-drawing-evaluated-fields-history has no immutable evidence revision
  881. 61.60 s > warning: developer note bnl-benchmark-investigation still requires a named owner
  882. 61.60 s > warning: developer note bnl-contraction-order-performance still requires a named owner
  883. 61.60 s > warning: developer note bnl-scalar-alias-capture still requires a named owner
  884. 61.60 s > warning: developer note aa-aa-three-loop-performance-smoke still requires a named owner
  885. 61.60 s > warning: developer note network-simplification still requires a named owner
  886. 61.60 s > warning: investigation developer note network-simplification has no immutable evidence revision
  887. 61.60 s > warning: developer note spenso-large-expressions still requires a named owner
  888. 61.60 s > warning: developer note spenso-improvement-effects still requires a named owner
  889. 61.60 s > warning: archived developer note spenso-improvement-effects has no immutable evidence revision
  890. 61.60 s > warning: developer note spenso-test-baseline still requires a named owner
  891. 61.60 s > warning: archived developer note spenso-test-baseline has no immutable evidence revision
  892. 61.60 s > warning: developer note bnl-evaluator-atom-capture still requires a named owner
  893. 61.60 s > warning: archived developer note bnl-evaluator-atom-capture has no immutable evidence revision
  894. 61.60 s > warning: developer note uv-scalar-profile-benchmark still requires a named owner
  895. 61.60 s > warning: archived developer note uv-scalar-profile-benchmark has no immutable evidence revision
  896. 61.60 s > warning: developer note ci-test-failure-summary-2026-03-25 still requires a named owner
  897. 61.60 s > warning: archived developer note ci-test-failure-summary-2026-03-25 has no immutable evidence revision
  898. 61.60 s > warning: developer note network-execution-rebase-record still requires a named owner
  899. 61.60 s > warning: archived developer note network-execution-rebase-record has no immutable evidence revision
  900. 61.60 s > warning: developer note ratatui-integration-dashboard-history still requires a named owner
  901. 61.60 s > warning: archived developer note ratatui-integration-dashboard-history has no immutable evidence revision
  902. 61.60 s > warning: developer note nix-crane-cache-reuse still requires a named owner
  903. 61.60 s >
  904. 61.60 s > thread 'tests::pdf_manual_chapter_order_must_match_the_page_registry' (323) panicked at crates/alphal00p-docs-builder/src/lib.rs:11952:9:
  905. 61.60 s > assertion failed: format!("{error:#}").contains("PDF manual chapter order differs")
  906. 61.60 s > stack backtrace:
  907. 61.60 s > 0: __rustc::rust_begin_unwind
  908. 61.60 s > 1: core::panicking::panic_fmt
  909. 61.60 s > 2: core::panicking::panic
  910. 61.60 s > 3: alphal00p_docs_builder::tests::pdf_manual_chapter_order_must_match_the_page_registry
  911. 61.60 s > 4: <alphal00p_docs_builder::tests::pdf_manual_chapter_order_must_match_the_page_registry::{closure#0} as core::ops::function::FnOnce<()>>::call_once
  912. 61.60 s > note: Some details are omitted, run with `RUST_BACKTRACE=full` for a verbose backtrace.
  913. 61.60 s >
  914. 61.60 s > ------------
  915. 61.60 s > Summary [ 21.796s] 111 tests run: 108 passed, 3 failed, 0 skipped
  916. 61.60 s > FAIL [ 0.122s] ( 71/111) alphal00p-docs-builder tests::checked_in_registry_is_valid
  917. 61.60 s > stdout ---
  918. 61.60 s >
  919. 61.60 s > running 1 test
  920. 61.60 s > test tests::checked_in_registry_is_valid ... FAILED
  921. 61.60 s >
  922. 61.60 s > failures:
  923. 61.60 s >
  924. 61.60 s > failures:
  925. 61.60 s > tests::checked_in_registry_is_valid
  926. 61.60 s >
  927. 61.60 s > test result: FAILED. 0 passed; 1 failed; 0 ignored; 0 measured; 110 filtered out; finished in 0.11s
  928. 61.60 s >
  929. 61.60 s > stderr ---
  930. 61.60 s > warning: developer note gammaloop-architecture still requires a named owner
  931. 61.60 s > warning: developer note integration-dashboard still requires a named owner
  932. 61.60 s > warning: developer note uv-renormalization still requires a named owner
  933. 61.60 s > warning: developer note spenso-parsing-flow still requires a named owner
  934. 61.60 s > warning: developer note schoonschip-network still requires a named owner
  935. 61.60 s > warning: developer note gammaloop-draw-style-migration still requires a named owner
  936. 61.60 s > warning: developer note gammaloop-drawing-architecture still requires a named owner
  937. 61.60 s > warning: developer note spenso-symbolica-syntax-and-rewrites still requires a named owner
  938. 61.60 s > warning: developer note spenso-architecture still requires a named owner
  939. 61.60 s > warning: developer note idenso-architecture still requires a named owner
  940. 61.60 s > warning: developer note idenso-form-color-dirac-source-map still requires a named owner
  941. 61.60 s > warning: developer note linnet-architecture still requires a named owner
  942. 61.60 s > warning: developer note vakint-architecture still requires a named owner
  943. 61.60 s > warning: developer note gammaloop-roadmap still requires a named owner
  944. 61.60 s > warning: developer note cff-surface-cache-ownership still requires a named owner
  945. 61.60 s > warning: developer note gammaloop-drawing-evaluated-fields-history still requires a named owner
  946. 61.60 s > warning: archived developer note gammaloop-drawing-evaluated-fields-history has no immutable evidence revision
  947. 61.60 s > warning: developer note bnl-benchmark-investigation still requires a named owner
  948. 61.60 s > warning: developer note bnl-contraction-order-performance still requires a named owner
  949. 61.60 s > warning: developer note bnl-scalar-alias-capture still requires a named owner
  950. 61.60 s > warning: developer note aa-aa-three-loop-performance-smoke still requires a named owner
  951. 61.60 s > warning: developer note network-simplification still requires a named owner
  952. 61.60 s > warning: investigation developer note network-simplification has no immutable evidence revision
  953. 61.60 s > warning: developer note spenso-large-expressions still requires a named owner
  954. 61.60 s > warning: developer note spenso-improvement-effects still requires a named owner
  955. 61.60 s > warning: archived developer note spenso-improvement-effects has no immutable evidence revision
  956. 61.60 s > warning: developer note spenso-test-baseline still requires a named owner
  957. 61.60 s > warning: archived developer note spenso-test-baseline has no immutable evidence revision
  958. 61.60 s > warning: developer note bnl-evaluator-atom-capture still requires a named owner
  959. 61.60 s > warning: archived developer note bnl-evaluator-atom-capture has no immutable evidence revision
  960. 61.60 s > warning: developer note uv-scalar-profile-benchmark still requires a named owner
  961. 61.60 s > warning: archived developer note uv-scalar-profile-benchmark has no immutable evidence revision
  962. 61.60 s > warning: developer note ci-test-failure-summary-2026-03-25 still requires a named owner
  963. 61.60 s > warning: archived developer note ci-test-failure-summary-2026-03-25 has no immutable evidence revision
  964. 61.60 s > warning: developer note network-execution-rebase-record still requires a named owner
  965. 61.60 s > warning: archived developer note network-execution-rebase-record has no immutable evidence revision
  966. 61.60 s > warning: developer note ratatui-integration-dashboard-history still requires a named owner
  967. 61.60 s > warning: archived developer note ratatui-integration-dashboard-history has no immutable evidence revision
  968. 61.60 s > warning: developer note nix-crane-cache-reuse still requires a named owner
  969. 61.60 s >
  970. 61.60 s > thread 'tests::checked_in_registry_is_valid' (160) panicked at crates/alphal00p-docs-builder/src/lib.rs:11887:50:
  971. 61.60 s > called `Result::unwrap()` on an `Err` value: developer note nix-crane-cache-reuse verified scope flake.nix changed (expected 188504937418859942a6770ca21a4f4e0a7ff125, found 2055acf4433777d5a18c44d88e8416b42a938f3a); owner review or an explicit no-impact attestation is required
  972. 61.60 s >
  973. 61.60 s > Location:
  974. 61.60 s > crates/alphal00p-docs-builder/src/lib.rs:889:21
  975. 61.60 s > stack backtrace:
  976. 61.60 s > 0: __rustc::rust_begin_unwind
  977. 61.60 s > 1: core::panicking::panic_fmt
  978. 61.60 s > 2: core::result::unwrap_failed
  979. 61.60 s > 3: alphal00p_docs_builder::tests::checked_in_registry_is_valid
  980. 61.60 s > 4: <alphal00p_docs_builder::tests::checked_in_registry_is_valid::{closure#0} as core::ops::function::FnOnce<()>>::call_once
  981. 61.60 s > note: Some details are omitted, run with `RUST_BACKTRACE=full` for a verbose backtrace.
  982. 61.60 s >
  983. 61.60 s > FAIL [ 0.106s] ( 75/111) alphal00p-docs-builder tests::every_product_requires_a_task_chooser_and_each_supported_interface
  984. 61.60 s > stdout ---
  985. 61.60 s >
  986. 61.60 s > running 1 test
  987. 61.60 s > test tests::every_product_requires_a_task_chooser_and_each_supported_interface ... FAILED
  988. 61.60 s >
  989. 61.60 s > failures:
  990. 61.60 s >
  991. 61.60 s > failures:
  992. 61.60 s > tests::every_product_requires_a_task_chooser_and_each_supported_interface
  993. 61.60 s >
  994. 61.60 s > test result: FAILED. 0 passed; 1 failed; 0 ignored; 0 measured; 110 filtered out; finished in 0.10s
  995. 61.60 s >
  996. 61.60 s > stderr ---
  997. 61.60 s > warning: developer note gammaloop-architecture still requires a named owner
  998. 61.60 s > warning: developer note integration-dashboard still requires a named owner
  999. 61.60 s > warning: developer note uv-renormalization still requires a named owner
  1000. 61.60 s > warning: developer note spenso-parsing-flow still requires a named owner
  1001. 61.60 s > warning: developer note schoonschip-network still requires a named owner
  1002. 61.60 s > warning: developer note gammaloop-draw-style-migration still requires a named owner
  1003. 61.60 s > warning: developer note gammaloop-drawing-architecture still requires a named owner
  1004. 61.60 s > warning: developer note spenso-symbolica-syntax-and-rewrites still requires a named owner
  1005. 61.60 s > warning: developer note spenso-architecture still requires a named owner
  1006. 61.60 s > warning: developer note idenso-architecture still requires a named owner
  1007. 61.60 s > warning: developer note idenso-form-color-dirac-source-map still requires a named owner
  1008. 61.60 s > warning: developer note linnet-architecture still requires a named owner
  1009. 61.60 s > warning: developer note vakint-architecture still requires a named owner
  1010. 61.60 s > warning: developer note gammaloop-roadmap still requires a named owner
  1011. 61.60 s > warning: developer note cff-surface-cache-ownership still requires a named owner
  1012. 61.60 s > warning: developer note gammaloop-drawing-evaluated-fields-history still requires a named owner
  1013. 61.60 s > warning: archived developer note gammaloop-drawing-evaluated-fields-history has no immutable evidence revision
  1014. 61.60 s > warning: developer note bnl-benchmark-investigation still requires a named owner
  1015. 61.60 s > warning: developer note bnl-contraction-order-performance still requires a named owner
  1016. 61.60 s > warning: developer note bnl-scalar-alias-capture still requires a named owner
  1017. 61.60 s > warning: developer note aa-aa-three-loop-performance-smoke still requires a named owner
  1018. 61.60 s > warning: developer note network-simplification still requires a named owner
  1019. 61.60 s > warning: investigation developer note network-simplification has no immutable evidence revision
  1020. 61.60 s > warning: developer note spenso-large-expressions still requires a named owner
  1021. 61.60 s > warning: developer note spenso-improvement-effects still requires a named owner
  1022. 61.60 s > warning: archived developer note spenso-improvement-effects has no immutable evidence revision
  1023. 61.60 s > warning: developer note spenso-test-baseline still requires a named owner
  1024. 61.60 s > warning: archived developer note spenso-test-baseline has no immutable evidence revision
  1025. 61.60 s > warning: developer note bnl-evaluator-atom-capture still requires a named owner
  1026. 61.60 s > warning: archived developer note bnl-evaluator-atom-capture has no immutable evidence revision
  1027. 61.60 s > warning: developer note uv-scalar-profile-benchmark still requires a named owner
  1028. 61.60 s > warning: archived developer note uv-scalar-profile-benchmark has no immutable evidence revision
  1029. 61.60 s > warning: developer note ci-test-failure-summary-2026-03-25 still requires a named owner
  1030. 61.60 s > warning: archived developer note ci-test-failure-summary-2026-03-25 has no immutable evidence revision
  1031. 61.60 s > warning: developer note network-execution-rebase-record still requires a named owner
  1032. 61.60 s > warning: archived developer note network-execution-rebase-record has no immutable evidence revision
  1033. 61.60 s > warning: developer note ratatui-integration-dashboard-history still requires a named owner
  1034. 61.60 s > warning: archived developer note ratatui-integration-dashboard-history has no immutable evidence revision
  1035. 61.60 s > warning: developer note nix-crane-cache-reuse still requires a named owner
  1036. 61.60 s >
  1037. 61.60 s > thread 'tests::every_product_requires_a_task_chooser_and_each_supported_interface' (269) panicked at crates/alphal00p-docs-builder/src/lib.rs:11901:9:
  1038. 61.60 s > assertion failed: format!("{error:#}").contains("has no quickstart page")
  1039. 61.60 s > stack backtrace:
  1040. 61.60 s > 0: __rustc::rust_begin_unwind
  1041. 61.60 s > 1: core::panicking::panic_fmt
  1042. 61.60 s > 2: core::panicking::panic
  1043. 61.60 s > 3: alphal00p_docs_builder::tests::every_product_requires_a_task_chooser_and_each_supported_interface
  1044. 61.60 s > 4: <alphal00p_docs_builder::tests::every_product_requires_a_task_chooser_and_each_supported_interface::{closure#0} as core::ops::function::FnOnce<()>>::call_once
  1045. 61.60 s > note: Some details are omitted, run with `RUST_BACKTRACE=full` for a verbose backtrace.
  1046. 61.60 s >
  1047. 61.60 s > FAIL [ 0.104s] ( 93/111) alphal00p-docs-builder tests::pdf_manual_chapter_order_must_match_the_page_registry
  1048. 61.60 s > stdout ---
  1049. 61.60 s >
  1050. 61.60 s > running 1 test
  1051. 61.60 s > test tests::pdf_manual_chapter_order_must_match_the_page_registry ... FAILED
  1052. 61.60 s >
  1053. 61.60 s > failures:
  1054. 61.60 s >
  1055. 61.60 s > failures:
  1056. 61.60 s > tests::pdf_manual_chapter_order_must_match_the_page_registry
  1057. 61.60 s >
  1058. 61.60 s > test result: FAILED. 0 passed; 1 failed; 0 ignored; 0 measured; 110 filtered out; finished in 0.09s
  1059. 61.60 s >
  1060. 61.60 s > stderr ---
  1061. 61.60 s > warning: developer note gammaloop-architecture still requires a named owner
  1062. 61.60 s > warning: developer note integration-dashboard still requires a named owner
  1063. 61.60 s > warning: developer note uv-renormalization still requires a named owner
  1064. 61.60 s > warning: developer note spenso-parsing-flow still requires a named owner
  1065. 61.60 s > warning: developer note schoonschip-network still requires a named owner
  1066. 61.60 s > warning: developer note gammaloop-draw-style-migration still requires a named owner
  1067. 61.60 s > warning: developer note gammaloop-drawing-architecture still requires a named owner
  1068. 61.60 s > warning: developer note spenso-symbolica-syntax-and-rewrites still requires a named owner
  1069. 61.60 s > warning: developer note spenso-architecture still requires a named owner
  1070. 61.60 s > warning: developer note idenso-architecture still requires a named owner
  1071. 61.60 s > warning: developer note idenso-form-color-dirac-source-map still requires a named owner
  1072. 61.60 s > warning: developer note linnet-architecture still requires a named owner
  1073. 61.60 s > warning: developer note vakint-architecture still requires a named owner
  1074. 61.60 s > warning: developer note gammaloop-roadmap still requires a named owner
  1075. 61.60 s > warning: developer note cff-surface-cache-ownership still requires a named owner
  1076. 61.60 s > warning: developer note gammaloop-drawing-evaluated-fields-history still requires a named owner
  1077. 61.60 s > warning: archived developer note gammaloop-drawing-evaluated-fields-history has no immutable evidence revision
  1078. 61.60 s > warning: developer note bnl-benchmark-investigation still requires a named owner
  1079. 61.60 s > warning: developer note bnl-contraction-order-performance still requires a named owner
  1080. 61.60 s > warning: developer note bnl-scalar-alias-capture still requires a named owner
  1081. 61.60 s > warning: developer note aa-aa-three-loop-performance-smoke still requires a named owner
  1082. 61.60 s > warning: developer note network-simplification still requires a named owner
  1083. 61.60 s > warning: investigation developer note network-simplification has no immutable evidence revision
  1084. 61.60 s > warning: developer note spenso-large-expressions still requires a named owner
  1085. 61.60 s > warning: developer note spenso-improvement-effects still requires a named owner
  1086. 61.60 s > warning: archived developer note spenso-improvement-effects has no immutable evidence revision
  1087. 61.60 s > warning: developer note spenso-test-baseline still requires a named owner
  1088. 61.60 s > warning: archived developer note spenso-test-baseline has no immutable evidence revision
  1089. 61.60 s > warning: developer note bnl-evaluator-atom-capture still requires a named owner
  1090. 61.60 s > warning: archived developer note bnl-evaluator-atom-capture has no immutable evidence revision
  1091. 61.60 s > warning: developer note uv-scalar-profile-benchmark still requires a named owner
  1092. 61.60 s > warning: archived developer note uv-scalar-profile-benchmark has no immutable evidence revision
  1093. 61.60 s > warning: developer note ci-test-failure-summary-2026-03-25 still requires a named owner
  1094. 61.60 s > warning: archived developer note ci-test-failure-summary-2026-03-25 has no immutable evidence revision
  1095. 61.60 s > warning: developer note network-execution-rebase-record still requires a named owner
  1096. 61.60 s > warning: archived developer note network-execution-rebase-record has no immutable evidence revision
  1097. 61.60 s > warning: developer note ratatui-integration-dashboard-history still requires a named owner
  1098. 61.60 s > warning: archived developer note ratatui-integration-dashboard-history has no immutable evidence revision
  1099. 61.60 s > warning: developer note nix-crane-cache-reuse still requires a named owner
  1100. 61.60 s >
  1101. 61.60 s > thread 'tests::pdf_manual_chapter_order_must_match_the_page_registry' (323) panicked at crates/alphal00p-docs-builder/src/lib.rs:11952:9:
  1102. 61.60 s > assertion failed: format!("{error:#}").contains("PDF manual chapter order differs")
  1103. 61.60 s > stack backtrace:
  1104. 61.60 s > 0: __rustc::rust_begin_unwind
  1105. 61.60 s > 1: core::panicking::panic_fmt
  1106. 61.60 s > 2: core::panicking::panic
  1107. 61.60 s > 3: alphal00p_docs_builder::tests::pdf_manual_chapter_order_must_match_the_page_registry
  1108. 61.60 s > 4: <alphal00p_docs_builder::tests::pdf_manual_chapter_order_must_match_the_page_registry::{closure#0} as core::ops::function::FnOnce<()>>::call_once
  1109. 61.60 s > note: Some details are omitted, run with `RUST_BACKTRACE=full` for a verbose backtrace.
  1110. 61.60 s >
  1111. 61.60 s > error: test run failed
  1112. 61.60 s >
  1113. 61.60 s > ========== nextest test summary ==========
  1114. 61.60 s > report: target/nextest/ci_gammaloop/junit.xml
  1115. 61.60 s > tests: 111, failures: 3, errors: 0
  1116. 61.60 s >
  1117. 61.60 s > 1. alphal00p-docs-builder::tests::checked_in_registry_is_valid
  1118. 61.60 s > failure: test failure with exit code 101
  1119. 61.60 s > thread 'tests::checked_in_registry_is_valid' (160) panicked at crates/alphal00p-docs-builder/src/lib.rs:11887:50:
  1120. 61.60 s > called `Result::unwrap()` on an `Err` value: developer note nix-crane-cache-reuse verified scope flake.nix changed (expected 188504937418859942a6770ca21a4f4e0a7ff125, found 2055acf4433777d5a18c44d88e8416b42a938f3a); owner review or an explicit no-impact attestation is required
  1121. 61.60 s >
  1122. 61.60 s > Location:
  1123. 61.60 s > crates/alphal00p-docs-builder/src/lib.rs:889:21
  1124. 61.60 s > stack backtrace:
  1125. 61.60 s > 0: __rustc::rust_begin_unwind
  1126. 61.60 s > 1: core::panicking::panic_fmt
  1127. 61.60 s > 2: core::result::unwrap_failed
  1128. 61.60 s > 3: alphal00p_docs_builder::tests::checked_in_registry_is_valid
  1129. 61.60 s > 4: <alphal00p_docs_builder::tests::checked_in_registry_is_valid::{closure#0} as core::ops::function::FnOnce<()>>::call_once
  1130. 61.60 s > note: Some details are omitted, run with `RUST_BACKTRACE=full` for a verbose backtrace.
  1131. 61.60 s > system-out
  1132. 61.60 s > running 1 test
  1133. 61.60 s > test tests::checked_in_registry_is_valid ... FAILED
  1134. 61.60 s >
  1135. 61.60 s > failures:
  1136. 61.60 s >
  1137. 61.60 s > failures:
  1138. 61.60 s > tests::checked_in_registry_is_valid
  1139. 61.60 s >
  1140. 61.60 s > test result: FAILED. 0 passed; 1 failed; 0 ignored; 0 measured; 110 filtered out; finished in 0.11s
  1141. 61.60 s > system-err
  1142. 61.60 s > warning: developer note gammaloop-architecture still requires a named owner
  1143. 61.60 s > warning: developer note integration-dashboard still requires a named owner
  1144. 61.60 s > warning: developer note uv-renormalization still requires a named owner
  1145. 61.60 s > warning: developer note spenso-parsing-flow still requires a named owner
  1146. 61.60 s > warning: developer note schoonschip-network still requires a named owner
  1147. 61.60 s > warning: developer note gammaloop-draw-style-migration still requires a named owner
  1148. 61.60 s > warning: developer note gammaloop-drawing-architecture still requires a named owner
  1149. 61.60 s > warning: developer note spenso-symbolica-syntax-and-rewrites still requires a named owner
  1150. 61.60 s > warning: developer note spenso-architecture still requires a named owner
  1151. 61.60 s > warning: developer note idenso-architecture still requires a named owner
  1152. 61.60 s > warning: developer note idenso-form-color-dirac-source-map still requires a named owner
  1153. 61.60 s > warning: developer note linnet-architecture still requires a named owner
  1154. 61.60 s > warning: developer note vakint-architecture still requires a named owner
  1155. 61.60 s > warning: developer note gammaloop-roadmap still requires a named owner
  1156. 61.60 s > warning: developer note cff-surface-cache-ownership still requires a named owner
  1157. 61.60 s > warning: developer note gammaloop-drawing-evaluated-fields-history still requires a named owner
  1158. 61.60 s > warning: archived developer note gammaloop-drawing-evaluated-fields-history has no immutable evidence revision
  1159. 61.60 s > warning: developer note bnl-benchmark-investigation still requires a named owner
  1160. 61.60 s > warning: developer note bnl-contraction-order-performance still requires a named owner
  1161. 61.60 s > warning: developer note bnl-scalar-alias-capture still requires a named owner
  1162. 61.60 s > warning: developer note aa-aa-three-loop-performance-smoke still requires a named owner
  1163. 61.60 s > warning: developer note network-simplification still requires a named owner
  1164. 61.60 s > warning: investigation developer note network-simplification has no immutable evidence revision
  1165. 61.60 s > warning: developer note spenso-large-expressions still requires a named owner
  1166. 61.60 s > warning: developer note spenso-improvement-effects still requires a named owner
  1167. 61.60 s > warning: archived developer note spenso-improvement-effects has no immutable evidence revision
  1168. 61.60 s > warning: developer note spenso-test-baseline still requires a named owner
  1169. 61.60 s > warning: archived developer note spenso-test-baseline has no immutable evidence revision
  1170. 61.60 s > warning: developer note bnl-evaluator-atom-capture still requires a named owner
  1171. 61.60 s > warning: archived developer note bnl-evaluator-atom-capture has no immutable evidence revision
  1172. 61.60 s > warning: developer note uv-scalar-profile-benchmark still requires a named owner
  1173. 61.60 s > warning: archived developer note uv-scalar-profile-benchmark has no immutable evidence revision
  1174. 61.60 s > warning: developer note ci-test-failure-summary-2026-03-25 still requires a named owner
  1175. 61.60 s > warning: archived developer note ci-test-failure-summary-2026-03-25 has no immutable evidence revision
  1176. 61.60 s > warning: developer note network-execution-rebase-record still requires a named owner
  1177. 61.60 s > warning: archived developer note network-execution-rebase-record has no immutable evidence revision
  1178. 61.60 s > warning: developer note ratatui-integration-dashboard-history still requires a named owner
  1179. 61.60 s > warning: archived developer note ratatui-integration-dashboard-history has no immutable evidence revision
  1180. 61.60 s > warning: developer note nix-crane-cache-reuse still requires a named owner
  1181. 61.60 s >
  1182. 61.60 s > thread 'tests::checked_in_registry_is_valid' (160) panicked at crates/alphal00p-docs-builder/src/lib.rs:11887:50:
  1183. 61.60 s > called `Result::unwrap()` on an `Err` value: developer note nix-crane-cache-reuse verified scope flake.nix changed (expected 188504937418859942a6770ca21a4f4e0a7ff125, found 2055acf4433777d5a18c44d88e8416b42a938f3a); owner review or an explicit no-impact attestation is required
  1184. 61.60 s >
  1185. 61.60 s > Location:
  1186. 61.60 s > crates/alphal00p-docs-builder/src/lib.rs:889:21
  1187. 61.60 s > stack backtrace:
  1188. 61.60 s > 0: __rustc::rust_begin_unwind
  1189. 61.60 s > 1: core::panicking::panic_fmt
  1190. 61.60 s > 2: core::result::unwrap_failed
  1191. 61.60 s > 3: alphal00p_docs_builder::tests::checked_in_registry_is_valid
  1192. 61.60 s > 4: <alphal00p_docs_builder::tests::checked_in_registry_is_valid::{closure#0} as core::ops::function::FnOnce<()>>::call_once
  1193. 61.60 s > note: Some details are omitted, run with `RUST_BACKTRACE=full` for a verbose backtrace.
  1194. 61.60 s >
  1195. 61.60 s > 2. alphal00p-docs-builder::tests::every_product_requires_a_task_chooser_and_each_supported_interface
  1196. 61.60 s > failure: test failure with exit code 101
  1197. 61.60 s > thread 'tests::every_product_requires_a_task_chooser_and_each_supported_interface' (269) panicked at crates/alphal00p-docs-builder/src/lib.rs:11901:9:
  1198. 61.60 s > assertion failed: format!("{error:#}").contains("has no quickstart page")
  1199. 61.60 s > stack backtrace:
  1200. 61.60 s > 0: __rustc::rust_begin_unwind
  1201. 61.60 s > 1: core::panicking::panic_fmt
  1202. 61.60 s > 2: core::panicking::panic
  1203. 61.60 s > 3: alphal00p_docs_builder::tests::every_product_requires_a_task_chooser_and_each_supported_interface
  1204. 61.60 s > 4: <alphal00p_docs_builder::tests::every_product_requires_a_task_chooser_and_each_supported_interface::{closure#0} as core::ops::function::FnOnce<()>>::call_once
  1205. 61.60 s > note: Some details are omitted, run with `RUST_BACKTRACE=full` for a verbose backtrace.
  1206. 61.60 s > system-out
  1207. 61.60 s > running 1 test
  1208. 61.60 s > test tests::every_product_requires_a_task_chooser_and_each_supported_interface ... FAILED
  1209. 61.60 s >
  1210. 61.60 s > failures:
  1211. 61.60 s >
  1212. 61.60 s > failures:
  1213. 61.60 s > tests::every_product_requires_a_task_chooser_and_each_supported_interface
  1214. 61.60 s >
  1215. 61.60 s > test result: FAILED. 0 passed; 1 failed; 0 ignored; 0 measured; 110 filtered out; finished in 0.10s
  1216. 61.60 s > system-err
  1217. 61.60 s > warning: developer note gammaloop-architecture still requires a named owner
  1218. 61.60 s > warning: developer note integration-dashboard still requires a named owner
  1219. 61.60 s > warning: developer note uv-renormalization still requires a named owner
  1220. 61.60 s > warning: developer note spenso-parsing-flow still requires a named owner
  1221. 61.60 s > warning: developer note schoonschip-network still requires a named owner
  1222. 61.60 s > warning: developer note gammaloop-draw-style-migration still requires a named owner
  1223. 61.60 s > warning: developer note gammaloop-drawing-architecture still requires a named owner
  1224. 61.60 s > warning: developer note spenso-symbolica-syntax-and-rewrites still requires a named owner
  1225. 61.60 s > warning: developer note spenso-architecture still requires a named owner
  1226. 61.60 s > warning: developer note idenso-architecture still requires a named owner
  1227. 61.60 s > warning: developer note idenso-form-color-dirac-source-map still requires a named owner
  1228. 61.60 s > warning: developer note linnet-architecture still requires a named owner
  1229. 61.60 s > warning: developer note vakint-architecture still requires a named owner
  1230. 61.60 s > warning: developer note gammaloop-roadmap still requires a named owner
  1231. 61.60 s > warning: developer note cff-surface-cache-ownership still requires a named owner
  1232. 61.60 s > warning: developer note gammaloop-drawing-evaluated-fields-history still requires a named owner
  1233. 61.60 s > warning: archived developer note gammaloop-drawing-evaluated-fields-history has no immutable evidence revision
  1234. 61.60 s > warning: developer note bnl-benchmark-investigation still requires a named owner
  1235. 61.60 s > warning: developer note bnl-contraction-order-performance still requires a named owner
  1236. 61.60 s > warning: developer note bnl-scalar-alias-capture still requires a named owner
  1237. 61.60 s > warning: developer note aa-aa-three-loop-performance-smoke still requires a named owner
  1238. 61.60 s > warning: developer note network-simplification still requires a named owner
  1239. 61.60 s > warning: investigation developer note network-simplification has no immutable evidence revision
  1240. 61.60 s > warning: developer note spenso-large-expressions still requires a named owner
  1241. 61.60 s > warning: developer note spenso-improvement-effects still requires a named owner
  1242. 61.60 s > warning: archived developer note spenso-improvement-effects has no immutable evidence revision
  1243. 61.60 s > warning: developer note spenso-test-baseline still requires a named owner
  1244. 61.60 s > warning: archived developer note spenso-test-baseline has no immutable evidence revision
  1245. 61.60 s > warning: developer note bnl-evaluator-atom-capture still requires a named owner
  1246. 61.60 s > warning: archived developer note bnl-evaluator-atom-capture has no immutable evidence revision
  1247. 61.60 s > warning: developer note uv-scalar-profile-benchmark still requires a named owner
  1248. 61.60 s > warning: archived developer note uv-scalar-profile-benchmark has no immutable evidence revision
  1249. 61.60 s > warning: developer note ci-test-failure-summary-2026-03-25 still requires a named owner
  1250. 61.60 s > warning: archived developer note ci-test-failure-summary-2026-03-25 has no immutable evidence revision
  1251. 61.60 s > warning: developer note network-execution-rebase-record still requires a named owner
  1252. 61.60 s > warning: archived developer note network-execution-rebase-record has no immutable evidence revision
  1253. 61.60 s > warning: developer note ratatui-integration-dashboard-history still requires a named owner
  1254. 61.60 s > warning: archived developer note ratatui-integration-dashboard-history has no immutable evidence revision
  1255. 61.60 s > warning: developer note nix-crane-cache-reuse still requires a named owner
  1256. 61.60 s >
  1257. 61.60 s > thread 'tests::every_product_requires_a_task_chooser_and_each_supported_interface' (269) panicked at crates/alphal00p-docs-builder/src/lib.rs:11901:9:
  1258. 61.60 s > assertion failed: format!("{error:#}").contains("has no quickstart page")
  1259. 61.60 s > stack backtrace:
  1260. 61.60 s > 0: __rustc::rust_begin_unwind
  1261. 61.60 s > 1: core::panicking::panic_fmt
  1262. 61.60 s > 2: core::panicking::panic
  1263. 61.60 s > 3: alphal00p_docs_builder::tests::every_product_requires_a_task_chooser_and_each_supported_interface
  1264. 61.60 s > 4: <alphal00p_docs_builder::tests::every_product_requires_a_task_chooser_and_each_supported_interface::{closure#0} as core::ops::function::FnOnce<()>>::call_once
  1265. 61.60 s > note: Some details are omitted, run with `RUST_BACKTRACE=full` for a verbose backtrace.
  1266. 61.60 s >
  1267. 61.60 s > 3. alphal00p-docs-builder::tests::pdf_manual_chapter_order_must_match_the_page_registry
  1268. 61.60 s > failure: test failure with exit code 101
  1269. 61.60 s > thread 'tests::pdf_manual_chapter_order_must_match_the_page_registry' (323) panicked at crates/alphal00p-docs-builder/src/lib.rs:11952:9:
  1270. 61.60 s > assertion failed: format!("{error:#}").contains("PDF manual chapter order differs")
  1271. 61.60 s > stack backtrace:
  1272. 61.60 s > 0: __rustc::rust_begin_unwind
  1273. 61.60 s > 1: core::panicking::panic_fmt
  1274. 61.60 s > 2: core::panicking::panic
  1275. 61.60 s > 3: alphal00p_docs_builder::tests::pdf_manual_chapter_order_must_match_the_page_registry
  1276. 61.60 s > 4: <alphal00p_docs_builder::tests::pdf_manual_chapter_order_must_match_the_page_registry::{closure#0} as core::ops::function::FnOnce<()>>::call_once
  1277. 61.60 s > note: Some details are omitted, run with `RUST_BACKTRACE=full` for a verbose backtrace.
  1278. 61.60 s > system-out
  1279. 61.60 s > running 1 test
  1280. 61.60 s > test tests::pdf_manual_chapter_order_must_match_the_page_registry ... FAILED
  1281. 61.60 s >
  1282. 61.60 s > failures:
  1283. 61.60 s >
  1284. 61.60 s > failures:
  1285. 61.60 s > tests::pdf_manual_chapter_order_must_match_the_page_registry
  1286. 61.60 s >
  1287. 61.60 s > test result: FAILED. 0 passed; 1 failed; 0 ignored; 0 measured; 110 filtered out; finished in 0.09s
  1288. 61.60 s > system-err
  1289. 61.60 s > warning: developer note gammaloop-architecture still requires a named owner
  1290. 61.60 s > warning: developer note integration-dashboard still requires a named owner
  1291. 61.60 s > warning: developer note uv-renormalization still requires a named owner
  1292. 61.60 s > warning: developer note spenso-parsing-flow still requires a named owner
  1293. 61.60 s > warning: developer note schoonschip-network still requires a named owner
  1294. 61.60 s > warning: developer note gammaloop-draw-style-migration still requires a named owner
  1295. 61.60 s > warning: developer note gammaloop-drawing-architecture still requires a named owner
  1296. 61.60 s > warning: developer note spenso-symbolica-syntax-and-rewrites still requires a named owner
  1297. 61.60 s > warning: developer note spenso-architecture still requires a named owner
  1298. 61.60 s > warning: developer note idenso-architecture still requires a named owner
  1299. 61.60 s > warning: developer note idenso-form-color-dirac-source-map still requires a named owner
  1300. 61.60 s > warning: developer note linnet-architecture still requires a named owner
  1301. 61.60 s > warning: developer note vakint-architecture still requires a named owner
  1302. 61.60 s > warning: developer note gammaloop-roadmap still requires a named owner
  1303. 61.60 s > warning: developer note cff-surface-cache-ownership still requires a named owner
  1304. 61.60 s > warning: developer note gammaloop-drawing-evaluated-fields-history still requires a named owner
  1305. 61.60 s > warning: archived developer note gammaloop-drawing-evaluated-fields-history has no immutable evidence revision
  1306. 61.60 s > warning: developer note bnl-benchmark-investigation still requires a named owner
  1307. 61.60 s > warning: developer note bnl-contraction-order-performance still requires a named owner
  1308. 61.60 s > warning: developer note bnl-scalar-alias-capture still requires a named owner
  1309. 61.60 s > warning: developer note aa-aa-three-loop-performance-smoke still requires a named owner
  1310. 61.60 s > warning: developer note network-simplification still requires a named owner
  1311. 61.60 s > warning: investigation developer note network-simplification has no immutable evidence revision
  1312. 61.60 s > warning: developer note spenso-large-expressions still requires a named owner
  1313. 61.60 s > warning: developer note spenso-improvement-effects still requires a named owner
  1314. 61.60 s > warning: archived developer note spenso-improvement-effects has no immutable evidence revision
  1315. 61.60 s > warning: developer note spenso-test-baseline still requires a named owner
  1316. 61.60 s > warning: archived developer note spenso-test-baseline has no immutable evidence revision
  1317. 61.60 s > warning: developer note bnl-evaluator-atom-capture still requires a named owner
  1318. 61.60 s > warning: archived developer note bnl-evaluator-atom-capture has no immutable evidence revision
  1319. 61.60 s > warning: developer note uv-scalar-profile-benchmark still requires a named owner
  1320. 61.60 s > warning: archived developer note uv-scalar-profile-benchmark has no immutable evidence revision
  1321. 61.60 s > warning: developer note ci-test-failure-summary-2026-03-25 still requires a named owner
  1322. 61.60 s > warning: archived developer note ci-test-failure-summary-2026-03-25 has no immutable evidence revision
  1323. 61.60 s > warning: developer note network-execution-rebase-record still requires a named owner
  1324. 61.60 s > warning: archived developer note network-execution-rebase-record has no immutable evidence revision
  1325. 61.60 s > warning: developer note ratatui-integration-dashboard-history still requires a named owner
  1326. 61.60 s > warning: archived developer note ratatui-integration-dashboard-history has no immutable evidence revision
  1327. 61.60 s > warning: developer note nix-crane-cache-reuse still requires a named owner
  1328. 61.60 s >
  1329. 61.60 s > thread 'tests::pdf_manual_chapter_order_must_match_the_page_registry' (323) panicked at crates/alphal00p-docs-builder/src/lib.rs:11952:9:
  1330. 61.60 s > assertion failed: format!("{error:#}").contains("PDF manual chapter order differs")
  1331. 61.60 s > stack backtrace:
  1332. 61.60 s > 0: __rustc::rust_begin_unwind
  1333. 61.60 s > 1: core::panicking::panic_fmt
  1334. 61.60 s > 2: core::panicking::panic
  1335. 61.60 s > 3: alphal00p_docs_builder::tests::pdf_manual_chapter_order_must_match_the_page_registry
  1336. 61.60 s > 4: <alphal00p_docs_builder::tests::pdf_manual_chapter_order_must_match_the_page_registry::{closure#0} as core::ops::function::FnOnce<()>>::call_once
  1337. 61.60 s > note: Some details are omitted, run with `RUST_BACKTRACE=full` for a verbose backtrace.
  1338. 61.60 s > =========================================
  1339. 61.60 s > Extracting 2 binaries to /build/source
  1340. 61.60 s > Extracted 5 files to /build/source in 0.04s
  1341. 61.60 s > ------------
  1342. 61.60 s > Nextest run ID ab7e93d7-3f41-4547-9b32-a57851309287 with nextest profile: ci_gammaloop
  1343. 61.60 s > Starting 22 tests across 2 binaries
  1344. 61.60 s > ------------
  1345. 61.60 s > Summary [ 0.025s] 22 tests run: 22 passed, 0 skipped
  1346. 61.60 s >
  1347. 61.60 s > ========== nextest test summary ==========
  1348. 61.60 s > report: target/nextest/ci_gammaloop/junit.xml
  1349. 61.60 s > tests: 22, failures: 0, errors: 0
  1350. 61.60 s > No failing testcases found.
  1351. 61.60 s > =========================================
  1352. 61.60 s > Extracting 3 binaries (including 2 non-test binaries), 1 build script output directory, and 2 linked paths to /build/source
  1353. 61.60 s > Extracted 22 files to /build/source in 0.41s
  1354. 61.60 s > ------------
  1355. 61.60 s > Nextest run ID 4e5ebe17-886f-4ce4-92e6-07a2a89c209f with nextest profile: ci_gammaloop
  1356. 61.60 s > Starting 89 tests across 1 binary
  1357. 61.60 s > ------------
  1358. 61.60 s > Summary [ 0.072s] 89 tests run: 89 passed, 0 skipped
  1359. 61.60 s >
  1360. 61.60 s > ========== nextest test summary ==========
  1361. 61.60 s > report: target/nextest/ci_gammaloop/junit.xml
  1362. 61.60 s > tests: 89, failures: 0, errors: 0
  1363. 61.60 s > No failing testcases found.
  1364. 61.60 s > =========================================
  1365. 61.60 s > Extracting 2 binaries to /build/source
  1366. 61.60 s > Extracted 5 files to /build/source in 0.07s
  1367. 61.60 s > ------------
  1368. 61.60 s > Nextest run ID da400a49-d047-4ab0-b5a3-0db815f0eb0d with nextest profile: ci_gammaloop
  1369. 61.60 s > Starting 10 tests across 2 binaries
  1370. 61.60 s > ------------
  1371. 61.60 s > Summary [ 18.803s] 10 tests run: 10 passed, 0 skipped
  1372. 61.60 s >
  1373. 61.60 s > ========== nextest test summary ==========
  1374. 61.60 s > report: target/nextest/ci_gammaloop/junit.xml
  1375. 61.60 s > tests: 10, failures: 0, errors: 0
  1376. 61.60 s > No failing testcases found.
  1377. 61.60 s > =========================================
  1378. 61.60 s > Extracting 1 binary to /build/source
  1379. 61.60 s > Extracted 4 files to /build/source in 0.05s
  1380. 61.60 s > ------------
  1381. 61.60 s > Nextest run ID 61eb6bac-349b-4a40-8a8c-b2e99f8a48bd with nextest profile: ci_gammaloop
  1382. 61.60 s > Starting 0 tests across 1 binary
  1383. 61.60 s > ------------
  1384. 61.60 s > Summary [ 0.000s] 0 tests run: 0 passed, 0 skipped
  1385. 61.60 s >
  1386. 61.60 s > ========== nextest test summary ==========
  1387. 61.60 s > report: target/nextest/ci_gammaloop/junit.xml
  1388. 61.60 s > tests: 0, failures: 0, errors: 0
  1389. 61.60 s > No failing testcases found.
  1390. 61.60 s > =========================================
  1391. 61.60 s > Extracting 1 binary to /build/source
  1392. 61.60 s > Extracted 4 files to /build/source in 0.05s
  1393. 61.60 s > ------------
  1394. 61.60 s > Nextest run ID 9d987993-11ff-4711-b979-4ce79e5507b1 with nextest profile: ci_gammaloop
  1395. 61.60 s > Starting 5 tests across 1 binary
  1396. 61.60 s > ------------
  1397. 61.60 s > Summary [ 0.009s] 5 tests run: 5 passed, 0 skipped
  1398. 61.60 s >
  1399. 61.60 s > ========== nextest test summary ==========
  1400. 61.60 s > report: target/nextest/ci_gammaloop/junit.xml
  1401. 61.60 s > tests: 5, failures: 0, errors: 0
  1402. 61.60 s > No failing testcases found.
  1403. 61.60 s > =========================================
  1404. 61.60 s For full logs, run:
  1405. 61.60 s nix log /nix/store/iba9mhp7j85acznvf18xhmxcpgblqny8-gammaloop-nextest-docs.drv
  1406. 61.80 s Run failed.