test packages.x86_64-linux.nix-ci-check-gammaloop-nextest-docs
0.01 s
$ /nix/store/9ypz3flqsrl5xl495mm8h645gadjsxi1-coreutils-9.11/bin/timeout --kill-after=15s 7200s /nix/store/23zk8sgzamrbmj1fday15szf7f2279s8-nix-2.34.7/bin/nix --extra-experimental-features nix-command --extra-experimental-features flakes flake clone git+https://github.com/alphal00p/gammaloop --dest /tmp/nix-ci-worker/stable-pwd/repo/
0.21 s
Cloning into '/tmp/nix-ci-worker/stable-pwd/repo'...
1.72 s
remote: Enumerating objects: 79689, done.
1.96 s
remote: Counting objects: 0% (1/9284)
remote: Counting objects: 1% (93/9284)
remote: Counting objects: 2% (186/9284)
remote: Counting objects: 3% (279/9284)
remote: Counting objects: 4% (372/9284)
remote: Counting objects: 5% (465/9284)
remote: Counting objects: 6% (558/9284)
remote: Counting objects: 7% (650/9284)
remote: Counting objects: 8% (743/9284)
remote: Counting objects: 9% (836/9284)
remote: Counting objects: 10% (929/9284)
remote: Counting objects: 11% (1022/9284)
remote: Counting objects: 12% (1115/9284)
remote: Counting objects: 13% (1207/9284)
remote: Counting objects: 14% (1300/9284)
remote: Counting objects: 15% (1393/9284)
remote: Counting objects: 16% (1486/9284)
remote: Counting objects: 17% (1579/9284)
remote: Counting objects: 18% (1672/9284)
remote: Counting objects: 19% (1764/9284)
remote: Counting objects: 20% (1857/9284)
remote: Counting objects: 21% (1950/9284)
remote: Counting objects: 22% (2043/9284)
remote: Counting objects: 23% (2136/9284)
remote: Counting objects: 24% (2229/9284)
remote: Counting objects: 25% (2321/9284)
remote: Counting objects: 26% (2414/9284)
remote: Counting objects: 27% (2507/9284)
remote: Counting objects: 28% (2600/9284)
remote: Counting objects: 29% (2693/9284)
remote: Counting objects: 30% (2786/9284)
remote: Counting objects: 31% (2879/9284)
remote: Counting objects: 32% (2971/9284)
remote: Counting objects: 33% (3064/9284)
remote: Counting objects: 34% (3157/9284)
remote: Counting objects: 35% (3250/9284)
remote: Counting objects: 36% (3343/9284)
remote: Counting objects: 37% (3436/9284)
remote: Counting objects: 38% (3528/9284)
remote: Counting objects: 39% (3621/9284)
remote: Counting objects: 40% (3714/9284)
remote: Counting objects: 41% (3807/9284)
remote: Counting objects: 42% (3900/9284)
remote: Counting objects: 43% (3993/9284)
remote: Counting objects: 44% (4085/9284)
remote: Counting objects: 45% (4178/9284)
remote: Counting objects: 46% (4271/9284)
remote: Counting objects: 47% (4364/9284)
remote: Counting objects: 48% (4457/9284)
remote: Counting objects: 49% (4550/9284)
remote: Counting objects: 50% (4642/9284)
remote: Counting objects: 51% (4735/9284)
remote: Counting objects: 52% (4828/9284)
remote: Counting objects: 53% (4921/9284)
remote: Counting objects: 54% (5014/9284)
remote: Counting objects: 55% (5107/9284)
remote: Counting objects: 56% (5200/9284)
remote: Counting objects: 57% (5292/9284)
remote: Counting objects: 58% (5385/9284)
remote: Counting objects: 59% (5478/9284)
remote: Counting objects: 60% (5571/9284)
remote: Counting objects: 61% (5664/9284)
remote: Counting objects: 62% (5757/9284)
remote: Counting objects: 63% (5849/9284)
remote: Counting objects: 64% (5942/9284)
remote: Counting objects: 65% (6035/9284)
remote: Counting objects: 66% (6128/9284)
remote: Counting objects: 67% (6221/9284)
remote: Counting objects: 68% (6314/9284)
remote: Counting objects: 69% (6406/9284)
remote: Counting objects: 70% (6499/9284)
remote: Counting objects: 71% (6592/9284)
remote: Counting objects: 72% (6685/9284)
remote: Counting objects: 73% (6778/9284)
remote: Counting objects: 74% (6871/9284)
remote: Counting objects: 75% (6963/9284)
remote: Counting objects: 76% (7056/9284)
remote: Counting objects: 77% (7149/9284)
remote: Counting objects: 78% (7242/9284)
remote: Counting objects: 79% (7335/9284)
remote: Counting objects: 80% (7428/9284)
remote: Counting objects: 81% (7521/9284)
remote: Counting objects: 82% (7613/9284)
remote: Counting objects: 83% (7706/9284)
remote: Counting objects: 84% (7799/9284)
remote: Counting objects: 85% (7892/9284)
remote: Counting objects: 86% (7985/9284)
remote: Counting objects: 87% (8078/9284)
remote: Counting objects: 88% (8170/9284)
remote: Counting objects: 89% (8263/9284)
remote: Counting objects: 90% (8356/9284)
remote: Counting objects: 91% (8449/9284)
remote: Counting objects: 92% (8542/9284)
remote: Counting objects: 93% (8635/9284)
remote: Counting objects: 94% (8727/9284)
remote: Counting objects: 95% (8820/9284)
remote: Counting objects: 96% (8913/9284)
remote: Counting objects: 97% (9006/9284)
remote: Counting objects: 98% (9099/9284)
remote: Counting objects: 99% (9192/9284)
remote: Counting objects: 100% (9284/9284)
remote: Counting objects: 100% (9284/9284), done.
3.95 s
remote: Compressing objects: 0% (1/2087)
remote: Compressing objects: 1% (21/2087)
remote: Compressing objects: 2% (42/2087)
remote: Compressing objects: 3% (63/2087)
remote: Compressing objects: 4% (84/2087)
remote: Compressing objects: 5% (105/2087)
remote: Compressing objects: 6% (126/2087)
remote: Compressing objects: 7% (147/2087)
remote: Compressing objects: 8% (167/2087)
remote: Compressing objects: 9% (188/2087)
remote: Compressing objects: 10% (209/2087)
remote: Compressing objects: 11% (230/2087)
remote: Compressing objects: 12% (251/2087)
remote: Compressing objects: 13% (272/2087)
remote: Compressing objects: 14% (293/2087)
remote: Compressing objects: 15% (314/2087)
remote: Compressing objects: 15% (323/2087)
remote: Compressing objects: 16% (334/2087)
remote: Compressing objects: 17% (355/2087)
remote: Compressing objects: 18% (376/2087)
remote: Compressing objects: 19% (397/2087)
remote: Compressing objects: 20% (418/2087)
remote: Compressing objects: 21% (439/2087)
remote: Compressing objects: 22% (460/2087)
remote: Compressing objects: 23% (481/2087)
remote: Compressing objects: 24% (501/2087)
remote: Compressing objects: 25% (522/2087)
remote: Compressing objects: 26% (543/2087)
remote: Compressing objects: 27% (564/2087)
remote: Compressing objects: 28% (585/2087)
remote: Compressing objects: 28% (602/2087)
remote: Compressing objects: 29% (606/2087)
remote: Compressing objects: 30% (627/2087)
remote: Compressing objects: 31% (647/2087)
remote: Compressing objects: 32% (668/2087)
remote: Compressing objects: 33% (689/2087)
remote: Compressing objects: 34% (710/2087)
remote: Compressing objects: 35% (731/2087)
remote: Compressing objects: 36% (752/2087)
remote: Compressing objects: 37% (773/2087)
remote: Compressing objects: 38% (794/2087)
remote: Compressing objects: 39% (814/2087)
remote: Compressing objects: 40% (835/2087)
remote: Compressing objects: 41% (856/2087)
remote: Compressing objects: 42% (877/2087)
remote: Compressing objects: 43% (898/2087)
remote: Compressing objects: 44% (919/2087)
remote: Compressing objects: 45% (940/2087)
remote: Compressing objects: 46% (961/2087)
remote: Compressing objects: 47% (981/2087)
remote: Compressing objects: 48% (1002/2087)
remote: Compressing objects: 49% (1023/2087)
remote: Compressing objects: 50% (1044/2087)
remote: Compressing objects: 51% (1065/2087)
remote: Compressing objects: 52% (1086/2087)
remote: Compressing objects: 53% (1107/2087)
remote: Compressing objects: 54% (1127/2087)
remote: Compressing objects: 55% (1148/2087)
remote: Compressing objects: 56% (1169/2087)
remote: Compressing objects: 57% (1190/2087)
remote: Compressing objects: 58% (1211/2087)
remote: Compressing objects: 59% (1232/2087)
remote: Compressing objects: 60% (1253/2087)
remote: Compressing objects: 61% (1274/2087)
remote: Compressing objects: 62% (1294/2087)
remote: Compressing objects: 63% (1315/2087)
remote: Compressing objects: 64% (1336/2087)
remote: Compressing objects: 65% (1357/2087)
remote: Compressing objects: 66% (1378/2087)
remote: Compressing objects: 67% (1399/2087)
remote: Compressing objects: 68% (1420/2087)
remote: Compressing objects: 69% (1441/2087)
remote: Compressing objects: 70% (1461/2087)
remote: Compressing objects: 71% (1482/2087)
remote: Compressing objects: 72% (1503/2087)
remote: Compressing objects: 73% (1524/2087)
remote: Compressing objects: 74% (1545/2087)
remote: Compressing objects: 75% (1566/2087)
remote: Compressing objects: 76% (1587/2087)
remote: Compressing objects: 77% (1607/2087)
remote: Compressing objects: 78% (1628/2087)
remote: Compressing objects: 79% (1649/2087)
remote: Compressing objects: 80% (1670/2087)
remote: Compressing objects: 81% (1691/2087)
remote: Compressing objects: 82% (1712/2087)
remote: Compressing objects: 83% (1733/2087)
remote: Compressing objects: 84% (1754/2087)
remote: Compressing objects: 85% (1774/2087)
remote: Compressing objects: 86% (1795/2087)
remote: Compressing objects: 87% (1816/2087)
remote: Compressing objects: 88% (1837/2087)
remote: Compressing objects: 89% (1858/2087)
remote: Compressing objects: 90% (1879/2087)
remote: Compressing objects: 91% (1900/2087)
remote: Compressing objects: 92% (1921/2087)
remote: Compressing objects: 93% (1941/2087)
remote: Compressing objects: 94% (1962/2087)
remote: Compressing objects: 95% (1983/2087)
remote: Compressing objects: 96% (2004/2087)
remote: Compressing objects: 97% (2025/2087)
remote: Compressing objects: 98% (2046/2087)
remote: Compressing objects: 99% (2067/2087)
remote: Compressing objects: 100% (2087/2087)
remote: Compressing objects: 100% (2087/2087), done.
8.17 s
Receiving objects: 0% (1/79689)
Receiving objects: 1% (797/79689)
Receiving objects: 2% (1594/79689)
Receiving objects: 3% (2391/79689)
Receiving objects: 4% (3188/79689)
Receiving objects: 5% (3985/79689)
Receiving objects: 6% (4782/79689), 9.28 MiB | 18.54 MiB/s
Receiving objects: 7% (5579/79689), 9.28 MiB | 18.54 MiB/s
Receiving objects: 8% (6376/79689), 9.28 MiB | 18.54 MiB/s
Receiving objects: 9% (7173/79689), 9.28 MiB | 18.54 MiB/s
Receiving objects: 10% (7969/79689), 9.28 MiB | 18.54 MiB/s
Receiving objects: 11% (8766/79689), 9.28 MiB | 18.54 MiB/s
Receiving objects: 12% (9563/79689), 9.28 MiB | 18.54 MiB/s
Receiving objects: 13% (10360/79689), 9.28 MiB | 18.54 MiB/s
Receiving objects: 14% (11157/79689), 9.28 MiB | 18.54 MiB/s
Receiving objects: 15% (11954/79689), 9.28 MiB | 18.54 MiB/s
Receiving objects: 16% (12751/79689), 9.28 MiB | 18.54 MiB/s
Receiving objects: 17% (13548/79689), 9.28 MiB | 18.54 MiB/s
Receiving objects: 18% (14345/79689), 9.28 MiB | 18.54 MiB/s
Receiving objects: 19% (15141/79689), 9.28 MiB | 18.54 MiB/s
Receiving objects: 20% (15938/79689), 9.28 MiB | 18.54 MiB/s
Receiving objects: 21% (16735/79689), 9.28 MiB | 18.54 MiB/s
Receiving objects: 22% (17532/79689), 9.28 MiB | 18.54 MiB/s
Receiving objects: 23% (18329/79689), 9.28 MiB | 18.54 MiB/s
Receiving objects: 24% (19126/79689), 9.28 MiB | 18.54 MiB/s
Receiving objects: 25% (19923/79689), 9.28 MiB | 18.54 MiB/s
Receiving objects: 26% (20720/79689), 9.28 MiB | 18.54 MiB/s
Receiving objects: 27% (21517/79689), 9.28 MiB | 18.54 MiB/s
Receiving objects: 28% (22313/79689), 9.28 MiB | 18.54 MiB/s
Receiving objects: 29% (23110/79689), 9.28 MiB | 18.54 MiB/s
Receiving objects: 30% (23907/79689), 9.28 MiB | 18.54 MiB/s
Receiving objects: 30% (24312/79689), 9.28 MiB | 18.54 MiB/s
Receiving objects: 31% (24704/79689), 26.10 MiB | 26.09 MiB/s
Receiving objects: 32% (25501/79689), 26.10 MiB | 26.09 MiB/s
Receiving objects: 33% (26298/79689), 26.10 MiB | 26.09 MiB/s
Receiving objects: 34% (27095/79689), 26.10 MiB | 26.09 MiB/s
Receiving objects: 35% (27892/79689), 26.10 MiB | 26.09 MiB/s
Receiving objects: 36% (28689/79689), 26.10 MiB | 26.09 MiB/s
Receiving objects: 37% (29485/79689), 26.10 MiB | 26.09 MiB/s
Receiving objects: 38% (30282/79689), 26.10 MiB | 26.09 MiB/s
Receiving objects: 39% (31079/79689), 26.10 MiB | 26.09 MiB/s
Receiving objects: 40% (31876/79689), 26.10 MiB | 26.09 MiB/s
Receiving objects: 41% (32673/79689), 26.10 MiB | 26.09 MiB/s
Receiving objects: 42% (33470/79689), 26.10 MiB | 26.09 MiB/s
Receiving objects: 43% (34267/79689), 26.10 MiB | 26.09 MiB/s
Receiving objects: 44% (35064/79689), 26.10 MiB | 26.09 MiB/s
Receiving objects: 45% (35861/79689), 26.10 MiB | 26.09 MiB/s
Receiving objects: 46% (36657/79689), 26.10 MiB | 26.09 MiB/s
Receiving objects: 47% (37454/79689), 41.22 MiB | 27.47 MiB/s
Receiving objects: 48% (38251/79689), 41.22 MiB | 27.47 MiB/s
Receiving objects: 49% (39048/79689), 41.22 MiB | 27.47 MiB/s
Receiving objects: 50% (39845/79689), 41.22 MiB | 27.47 MiB/s
Receiving objects: 51% (40642/79689), 41.22 MiB | 27.47 MiB/s
Receiving objects: 52% (41439/79689), 41.22 MiB | 27.47 MiB/s
Receiving objects: 53% (42236/79689), 41.22 MiB | 27.47 MiB/s
Receiving objects: 54% (43033/79689), 41.22 MiB | 27.47 MiB/s
Receiving objects: 55% (43829/79689), 41.22 MiB | 27.47 MiB/s
Receiving objects: 56% (44626/79689), 41.22 MiB | 27.47 MiB/s
Receiving objects: 57% (45423/79689), 41.22 MiB | 27.47 MiB/s
Receiving objects: 57% (46095/79689), 41.22 MiB | 27.47 MiB/s
Receiving objects: 58% (46220/79689), 54.91 MiB | 27.45 MiB/s
Receiving objects: 59% (47017/79689), 54.91 MiB | 27.45 MiB/s
Receiving objects: 60% (47814/79689), 54.91 MiB | 27.45 MiB/s
Receiving objects: 61% (48611/79689), 54.91 MiB | 27.45 MiB/s
Receiving objects: 62% (49408/79689), 54.91 MiB | 27.45 MiB/s
Receiving objects: 63% (50205/79689), 54.91 MiB | 27.45 MiB/s
Receiving objects: 64% (51001/79689), 70.84 MiB | 28.33 MiB/s
Receiving objects: 65% (51798/79689), 70.84 MiB | 28.33 MiB/s
Receiving objects: 66% (52595/79689), 70.84 MiB | 28.33 MiB/s
Receiving objects: 67% (53392/79689), 70.84 MiB | 28.33 MiB/s
Receiving objects: 68% (54189/79689), 70.84 MiB | 28.33 MiB/s
Receiving objects: 69% (54986/79689), 70.84 MiB | 28.33 MiB/s
Receiving objects: 70% (55783/79689), 70.84 MiB | 28.33 MiB/s
Receiving objects: 71% (56580/79689), 70.84 MiB | 28.33 MiB/s
Receiving objects: 72% (57377/79689), 70.84 MiB | 28.33 MiB/s
Receiving objects: 72% (58042/79689), 70.84 MiB | 28.33 MiB/s
Receiving objects: 73% (58173/79689), 86.42 MiB | 28.80 MiB/s
Receiving objects: 74% (58970/79689), 86.42 MiB | 28.80 MiB/s
Receiving objects: 75% (59767/79689), 86.42 MiB | 28.80 MiB/s
Receiving objects: 76% (60564/79689), 86.42 MiB | 28.80 MiB/s
Receiving objects: 77% (61361/79689), 86.42 MiB | 28.80 MiB/s
Receiving objects: 78% (62158/79689), 86.42 MiB | 28.80 MiB/s
Receiving objects: 79% (62955/79689), 86.42 MiB | 28.80 MiB/s
Receiving objects: 80% (63752/79689), 102.11 MiB | 29.11 MiB/s
Receiving objects: 81% (64549/79689), 102.11 MiB | 29.11 MiB/s
Receiving objects: 82% (65345/79689), 102.11 MiB | 29.11 MiB/s
Receiving objects: 83% (66142/79689), 102.11 MiB | 29.11 MiB/s
Receiving objects: 84% (66939/79689), 102.11 MiB | 29.11 MiB/s
Receiving objects: 85% (67736/79689), 102.11 MiB | 29.11 MiB/s
Receiving objects: 86% (68533/79689), 102.11 MiB | 29.11 MiB/s
Receiving objects: 87% (69330/79689), 102.11 MiB | 29.11 MiB/s
Receiving objects: 88% (70127/79689), 102.11 MiB | 29.11 MiB/s
Receiving objects: 89% (70924/79689), 102.11 MiB | 29.11 MiB/s
Receiving objects: 90% (71721/79689), 102.11 MiB | 29.11 MiB/s
Receiving objects: 91% (72517/79689), 102.11 MiB | 29.11 MiB/s
Receiving objects: 92% (73314/79689), 102.11 MiB | 29.11 MiB/s
Receiving objects: 93% (74111/79689), 102.11 MiB | 29.11 MiB/s
Receiving objects: 94% (74908/79689), 102.11 MiB | 29.11 MiB/s
Receiving objects: 95% (75705/79689), 102.11 MiB | 29.11 MiB/s
Receiving objects: 95% (76055/79689), 102.11 MiB | 29.11 MiB/s
Receiving objects: 96% (76502/79689), 118.30 MiB | 29.51 MiB/s
Receiving objects: 97% (77299/79689), 118.30 MiB | 29.51 MiB/s
Receiving objects: 98% (78096/79689), 118.30 MiB | 29.51 MiB/s
Receiving objects: 99% (78893/79689), 118.30 MiB | 29.51 MiB/s
remote: Total 79689 (delta 7862), reused 7479 (delta 7191), pack-reused 70405 (from 2)
8.17 s
Receiving objects: 100% (79689/79689), 118.30 MiB | 29.51 MiB/s
Receiving objects: 100% (79689/79689), 124.05 MiB | 29.55 MiB/s, done.
9.56 s
Resolving deltas: 0% (0/54343)
Resolving deltas: 1% (544/54343)
Resolving deltas: 2% (1089/54343)
Resolving deltas: 3% (1632/54343)
Resolving deltas: 4% (2174/54343)
Resolving deltas: 5% (2718/54343)
Resolving deltas: 6% (3261/54343)
Resolving deltas: 7% (3806/54343)
Resolving deltas: 8% (4348/54343)
Resolving deltas: 9% (4891/54343)
Resolving deltas: 10% (5436/54343)
Resolving deltas: 11% (5978/54343)
Resolving deltas: 12% (6522/54343)
Resolving deltas: 13% (7065/54343)
Resolving deltas: 14% (7609/54343)
Resolving deltas: 15% (8153/54343)
Resolving deltas: 16% (8695/54343)
Resolving deltas: 17% (9239/54343)
Resolving deltas: 18% (9782/54343)
Resolving deltas: 19% (10326/54343)
Resolving deltas: 20% (10869/54343)
Resolving deltas: 21% (11414/54343)
Resolving deltas: 22% (11956/54343)
Resolving deltas: 23% (12499/54343)
Resolving deltas: 24% (13043/54343)
Resolving deltas: 25% (13586/54343)
Resolving deltas: 26% (14130/54343)
Resolving deltas: 27% (14673/54343)
Resolving deltas: 28% (15217/54343)
Resolving deltas: 29% (15760/54343)
Resolving deltas: 30% (16303/54343)
Resolving deltas: 31% (16847/54343)
Resolving deltas: 32% (17390/54343)
Resolving deltas: 33% (17934/54343)
Resolving deltas: 34% (18478/54343)
Resolving deltas: 35% (19021/54343)
Resolving deltas: 36% (19564/54343)
Resolving deltas: 37% (20107/54343)
Resolving deltas: 38% (20652/54343)
Resolving deltas: 39% (21194/54343)
Resolving deltas: 40% (21738/54343)
Resolving deltas: 41% (22281/54343)
Resolving deltas: 42% (22826/54343)
Resolving deltas: 43% (23368/54343)
Resolving deltas: 44% (23911/54343)
Resolving deltas: 45% (24455/54343)
Resolving deltas: 46% (24998/54343)
Resolving deltas: 47% (25542/54343)
Resolving deltas: 48% (26085/54343)
Resolving deltas: 49% (26629/54343)
Resolving deltas: 50% (27172/54343)
Resolving deltas: 51% (27715/54343)
Resolving deltas: 52% (28259/54343)
Resolving deltas: 53% (28802/54343)
Resolving deltas: 54% (29346/54343)
Resolving deltas: 55% (29889/54343)
Resolving deltas: 56% (30435/54343)
Resolving deltas: 57% (30976/54343)
Resolving deltas: 58% (31519/54343)
Resolving deltas: 59% (32063/54343)
Resolving deltas: 60% (32606/54343)
Resolving deltas: 61% (33150/54343)
Resolving deltas: 62% (33693/54343)
Resolving deltas: 63% (34240/54343)
Resolving deltas: 64% (34785/54343)
Resolving deltas: 65% (35323/54343)
Resolving deltas: 66% (35867/54343)
Resolving deltas: 67% (36410/54343)
Resolving deltas: 68% (36954/54343)
Resolving deltas: 69% (37497/54343)
Resolving deltas: 70% (38042/54343)
Resolving deltas: 71% (38584/54343)
Resolving deltas: 72% (39127/54343)
Resolving deltas: 73% (39671/54343)
Resolving deltas: 73% (40002/54343)
Resolving deltas: 74% (40214/54343)
Resolving deltas: 75% (40758/54343)
Resolving deltas: 76% (41301/54343)
Resolving deltas: 77% (41846/54343)
Resolving deltas: 78% (42388/54343)
Resolving deltas: 79% (42931/54343)
Resolving deltas: 80% (43476/54343)
Resolving deltas: 81% (44018/54343)
Resolving deltas: 82% (44562/54343)
Resolving deltas: 83% (45105/54343)
Resolving deltas: 84% (45649/54343)
Resolving deltas: 85% (46192/54343)
Resolving deltas: 86% (46735/54343)
Resolving deltas: 87% (47280/54343)
Resolving deltas: 88% (47822/54343)
Resolving deltas: 89% (48366/54343)
Resolving deltas: 90% (48909/54343)
Resolving deltas: 91% (49453/54343)
Resolving deltas: 92% (49996/54343)
Resolving deltas: 93% (50539/54343)
Resolving deltas: 94% (51083/54343)
Resolving deltas: 95% (51626/54343)
Resolving deltas: 96% (52170/54343)
Resolving deltas: 97% (52713/54343)
Resolving deltas: 98% (53257/54343)
Resolving deltas: 99% (53803/54343)
Resolving deltas: 100% (54343/54343)
Resolving deltas: 100% (54343/54343), done.
10.06 s
Fetching commit c36776102037cebc62eeb2aecd21b2f790609f5e for push-vrpyqyylypmw ...
10.07 s
$ /nix/store/bcnisk3ydfgv26v2gw3zlky24g00yww2-git-2.54.0/bin/git fetch origin c36776102037cebc62eeb2aecd21b2f790609f5e
10.65 s
From https://github.com/alphal00p/gammaloop
10.65 s
* branch c36776102037cebc62eeb2aecd21b2f790609f5e -> FETCH_HEAD
10.67 s
$ /nix/store/9ypz3flqsrl5xl495mm8h645gadjsxi1-coreutils-9.11/bin/timeout --kill-after=15s 7200s /nix/store/bcnisk3ydfgv26v2gw3zlky24g00yww2-git-2.54.0/bin/git -c advice.detachedHead=false checkout c36776102037cebc62eeb2aecd21b2f790609f5e
11.03 s
HEAD is now at c36776102 match initial-cut styles across xbox views
11.03 s
$ /nix/store/9ypz3flqsrl5xl495mm8h645gadjsxi1-coreutils-9.11/bin/timeout --kill-after=15s 7200s /nix/store/23zk8sgzamrbmj1fday15szf7f2279s8-nix-2.34.7/bin/nix --extra-experimental-features nix-command --extra-experimental-features flakes --log-format internal-json run .#packages.x86_64-linux.nix-ci-check-gammaloop-nextest-docs --print-build-logs
11.53 s
stdenv.isDarwin is deprecated, use stdenv.hostPlatform.isDarwin instead
19.43 s
20.12 s
evaluating derivation 'gevaluation warning: stdenv.isDarwin is deprecated, use stdenv.hostPlatform.isDarwin instead
26.38 s
copying '/nix/store/fb2x
evaluating derivation 'g
copying '/nix/store/fb2x
evaluating derivation 'g
copying '/nix/store/fb2x
evaluating derivation 'g
copying '/nix/store/fb2x
evaluating derivation 'g
copying '/nix/store/fb2x
evaluating derivation 'g
copying '/nix/store/fb2x
evaluating derivation 'g
copying '/nix/store/fb2x
evaluating derivation 'g
querying gammaloop-nexte
[0.0 KiB DL] querying ma
[4.3 KiB DL] querying ch
[10.8 KiB DL] querying l
[0 /9 built, 3 /0 /24 copie
[0 /9 built, 9 /0 /17 copie
[1 /0 /7 built, 5 /6 /17 copbuilder.pl> Running phase: patchPhase
26.38 s
builder.pl> Running phase: updateAutotoolsGnuConfigScriptsPhase
26.39 s
builder.pl> Running phase: configurePhase
26.41 s
builder.pl> no configure script, doing nothing
26.41 s
[1 /0 /6 built, 3 /8 /17 copbuilder.pl> Running phase: buildPhase
26.42 s
builder.pl> Running phase: checkPhase
26.43 s
builder.pl> Running phase: installPhase
26.43 s
builder.pl> no Makefile or custom installPhase, doing nothing
26.44 s
builder.pl> Running phase: fixupPhase
26.45 s
builder.pl> shrinking RPATHs of ELF executables and libraries in /nix/store/654vgnw02gp7qz9lnaa6mypnmbgp8473-builder.pl
26.45 s
builder.pl> checking for references to /build/ in /nix/store/654vgnw02gp7qz9lnaa6mypnmbgp8473-builder.pl...
26.46 s
builder.pl> patching script interpreter paths in /nix/store/654vgnw02gp7qz9lnaa6mypnmbgp8473-builder.pl
26.51 s
builder.pl (post)> Uploading to the NixCI cache: /nix/store/654vgnw02gp7qz9lnaa6mypnmbgp8473-builder.pl
26.58 s
[1 /0 /6 built, 3 /9 /17 copbuilder.pl (post)> warning: 'warn-short-path-literals' is deprecated, use 'lint-short-path-literals = ignore' instead
26.73 s
builder.pl (post)> copying 0 paths...
26.82 s
builder.pl (post)> warning: 'warn-short-path-literals' is deprecated, use 'lint-short-path-literals = ignore' instead
26.88 s
builder.pl (post)> copying 0 paths...
27.67 s
[1 /4 built, 2 /12 /17 copi
[1 /4 built, 2 /14 /17 copi
[1 /4 built, 1 /16 /17 copi
[1 /1 /3 built, 17 copied python3> structuredAttrs is enabled
27.79 s
python3> created 227 symlinks in user environment
29.34 s
python3 (post)> Uploading to the NixCI cache: /nix/store/v67wpyflacy0i2gvzasrxvw2gkz4mr12-python3-3.13.15-env
29.41 s
python3 (post)> warning: 'warn-short-path-literals' is deprecated, use 'lint-short-path-literals = ignore' instead
29.55 s
python3 (post)> copying 0 paths...
29.63 s
python3 (post)> warning: 'warn-short-path-literals' is deprecated, use 'lint-short-path-literals = ignore' instead
29.93 s
python3 (post)> copying 0 paths...
30.53 s
[2 /4 built, 17 copied (3
[1 /2 /3 built, 17 copied gammaloop-nextest-docs> Extracting 2 binaries to /build/source
30.60 s
gammaloop-nextest-docs> Extracted 5 files to /build/source in 0.07s
30.61 s
gammaloop-nextest-docs> ------------
30.61 s
gammaloop-nextest-docs> Nextest run ID 49c2016a-0bbb-443e-8924-01bf7aeb5246 with nextest profile: ci_gammaloop
30.61 s
gammaloop-nextest-docs> Starting 111 tests across 2 binaries
30.73 s
gammaloop-nextest-docs> FAIL [ 0.119s] ( 70/111) alphal00p-docs-builder tests :: checked_in_registry_is_valid
30.73 s
gammaloop-nextest-docs> stdout ---
30.73 s
gammaloop-nextest-docs>
30.73 s
gammaloop-nextest-docs> running 1 test
30.73 s
gammaloop-nextest-docs> test tests::checked_in_registry_is_valid ... FAILED
30.73 s
gammaloop-nextest-docs>
30.73 s
gammaloop-nextest-docs> failures:
30.73 s
gammaloop-nextest-docs>
30.73 s
gammaloop-nextest-docs> failures:
30.73 s
gammaloop-nextest-docs> tests::checked_in_registry_is_valid
30.73 s
gammaloop-nextest-docs>
30.73 s
gammaloop-nextest-docs> test result: FAILED. 0 passed; 1 failed; 0 ignored; 0 measured; 110 filtered out; finished in 0.11s
30.73 s
gammaloop-nextest-docs>
30.73 s
gammaloop-nextest-docs> stderr ---
30.73 s
gammaloop-nextest-docs> warning: developer note gammaloop-architecture still requires a named owner
30.73 s
gammaloop-nextest-docs> warning: developer note integration-dashboard still requires a named owner
30.73 s
gammaloop-nextest-docs> warning: developer note uv-renormalization still requires a named owner
30.73 s
gammaloop-nextest-docs> warning: developer note spenso-parsing-flow still requires a named owner
30.73 s
gammaloop-nextest-docs> warning: developer note schoonschip-network still requires a named owner
30.73 s
gammaloop-nextest-docs> warning: developer note gammaloop-draw-style-migration still requires a named owner
30.73 s
gammaloop-nextest-docs> warning: developer note gammaloop-drawing-architecture still requires a named owner
30.73 s
gammaloop-nextest-docs> warning: developer note spenso-symbolica-syntax-and-rewrites still requires a named owner
30.73 s
gammaloop-nextest-docs> warning: developer note spenso-architecture still requires a named owner
30.73 s
gammaloop-nextest-docs> warning: developer note idenso-architecture still requires a named owner
30.73 s
gammaloop-nextest-docs> warning: developer note idenso-form-color-dirac-source-map still requires a named owner
30.73 s
gammaloop-nextest-docs> warning: developer note linnet-architecture still requires a named owner
30.73 s
gammaloop-nextest-docs> warning: developer note vakint-architecture still requires a named owner
30.73 s
gammaloop-nextest-docs> warning: developer note gammaloop-roadmap still requires a named owner
30.73 s
gammaloop-nextest-docs> warning: developer note cff-surface-cache-ownership still requires a named owner
30.73 s
gammaloop-nextest-docs> warning: developer note gammaloop-drawing-evaluated-fields-history still requires a named owner
30.73 s
gammaloop-nextest-docs> warning: archived developer note gammaloop-drawing-evaluated-fields-history has no immutable evidence revision
30.73 s
gammaloop-nextest-docs> warning: developer note bnl-benchmark-investigation still requires a named owner
30.73 s
gammaloop-nextest-docs> warning: developer note bnl-contraction-order-performance still requires a named owner
30.73 s
gammaloop-nextest-docs> warning: developer note bnl-scalar-alias-capture still requires a named owner
30.73 s
gammaloop-nextest-docs> warning: developer note aa-aa-three-loop-performance-smoke still requires a named owner
30.73 s
gammaloop-nextest-docs> warning: developer note network-simplification still requires a named owner
30.73 s
gammaloop-nextest-docs> warning: investigation developer note network-simplification has no immutable evidence revision
30.73 s
gammaloop-nextest-docs> warning: developer note spenso-large-expressions still requires a named owner
30.73 s
gammaloop-nextest-docs> warning: developer note spenso-improvement-effects still requires a named owner
30.73 s
gammaloop-nextest-docs> warning: archived developer note spenso-improvement-effects has no immutable evidence revision
30.73 s
gammaloop-nextest-docs> warning: developer note spenso-test-baseline still requires a named owner
30.73 s
gammaloop-nextest-docs> warning: archived developer note spenso-test-baseline has no immutable evidence revision
30.73 s
gammaloop-nextest-docs> warning: developer note bnl-evaluator-atom-capture still requires a named owner
30.73 s
gammaloop-nextest-docs> warning: archived developer note bnl-evaluator-atom-capture has no immutable evidence revision
30.73 s
gammaloop-nextest-docs> warning: developer note uv-scalar-profile-benchmark still requires a named owner
30.73 s
gammaloop-nextest-docs> warning: archived developer note uv-scalar-profile-benchmark has no immutable evidence revision
30.73 s
gammaloop-nextest-docs> warning: developer note ci-test-failure-summary-2026-03-25 still requires a named owner
30.73 s
gammaloop-nextest-docs> warning: archived developer note ci-test-failure-summary-2026-03-25 has no immutable evidence revision
30.73 s
gammaloop-nextest-docs> warning: developer note network-execution-rebase-record still requires a named owner
30.73 s
gammaloop-nextest-docs> warning: archived developer note network-execution-rebase-record has no immutable evidence revision
30.73 s
gammaloop-nextest-docs> warning: developer note ratatui-integration-dashboard-history still requires a named owner
30.73 s
gammaloop-nextest-docs> warning: archived developer note ratatui-integration-dashboard-history has no immutable evidence revision
30.73 s
gammaloop-nextest-docs> warning: developer note nix-crane-cache-reuse still requires a named owner
30.73 s
gammaloop-nextest-docs>
30.73 s
gammaloop-nextest-docs> thread 'tests::checked_in_registry_is_valid' (165) panicked at crates/alphal00p-docs-builder/src/lib.rs:11887:50:
30.73 s
gammaloop-nextest-docs> called `Result::unwrap()` on an `Err` value: developer note nix-crane-cache-reuse verified scope flake.nix changed (expected 188504937418859942a6770ca21a4f4e0a7ff125, found 2055acf4433777d5a18c44d88e8416b42a938f3a); owner review or an explicit no-impact attestation is required
30.73 s
gammaloop-nextest-docs>
30.73 s
gammaloop-nextest-docs> Location:
30.73 s
gammaloop-nextest-docs> crates/alphal00p-docs-builder/src/lib.rs:889:21
30.73 s
gammaloop-nextest-docs> stack backtrace:
30.73 s
gammaloop-nextest-docs> 0: __rustc::rust_begin_unwind
30.73 s
gammaloop-nextest-docs> 1: core::panicking::panic_fmt
30.73 s
gammaloop-nextest-docs> 2: core::result::unwrap_failed
30.73 s
gammaloop-nextest-docs> 3: alphal00p_docs_builder::tests::checked_in_registry_is_valid
30.73 s
gammaloop-nextest-docs> 4: <alphal00p_docs_builder::tests::checked_in_registry_is_valid::{closure#0} as core::ops::function::FnOnce<()>>::call_once
30.73 s
gammaloop-nextest-docs> note: Some details are omitted, run with `RUST_BACKTRACE=full` for a verbose backtrace.
30.73 s
gammaloop-nextest-docs>
30.76 s
gammaloop-nextest-docs> FAIL [ 0.126s] ( 85/111) alphal00p-docs-builder tests :: every_product_requires_a_task_chooser_and_each_supported_interface
30.76 s
gammaloop-nextest-docs> stdout ---
30.76 s
gammaloop-nextest-docs>
30.76 s
gammaloop-nextest-docs> running 1 test
30.76 s
gammaloop-nextest-docs> test tests::every_product_requires_a_task_chooser_and_each_supported_interface ... FAILED
30.76 s
gammaloop-nextest-docs>
30.76 s
gammaloop-nextest-docs> failures:
30.76 s
gammaloop-nextest-docs>
30.76 s
gammaloop-nextest-docs> failures:
30.76 s
gammaloop-nextest-docs> tests::every_product_requires_a_task_chooser_and_each_supported_interface
30.76 s
gammaloop-nextest-docs>
30.76 s
gammaloop-nextest-docs> test result: FAILED. 0 passed; 1 failed; 0 ignored; 0 measured; 110 filtered out; finished in 0.12s
30.76 s
gammaloop-nextest-docs>
30.76 s
gammaloop-nextest-docs> stderr ---
30.76 s
gammaloop-nextest-docs> warning: developer note gammaloop-architecture still requires a named owner
30.76 s
gammaloop-nextest-docs> warning: developer note integration-dashboard still requires a named owner
30.76 s
gammaloop-nextest-docs> warning: developer note uv-renormalization still requires a named owner
30.76 s
gammaloop-nextest-docs> warning: developer note spenso-parsing-flow still requires a named owner
30.76 s
gammaloop-nextest-docs> warning: developer note schoonschip-network still requires a named owner
30.76 s
gammaloop-nextest-docs> warning: developer note gammaloop-draw-style-migration still requires a named owner
30.76 s
gammaloop-nextest-docs> warning: developer note gammaloop-drawing-architecture still requires a named owner
30.76 s
gammaloop-nextest-docs> warning: developer note spenso-symbolica-syntax-and-rewrites still requires a named owner
30.76 s
gammaloop-nextest-docs> warning: developer note spenso-architecture still requires a named owner
30.76 s
gammaloop-nextest-docs> warning: developer note idenso-architecture still requires a named owner
30.76 s
gammaloop-nextest-docs> warning: developer note idenso-form-color-dirac-source-map still requires a named owner
30.76 s
gammaloop-nextest-docs> warning: developer note linnet-architecture still requires a named owner
30.76 s
gammaloop-nextest-docs> warning: developer note vakint-architecture still requires a named owner
30.76 s
gammaloop-nextest-docs> warning: developer note gammaloop-roadmap still requires a named owner
30.76 s
gammaloop-nextest-docs> warning: developer note cff-surface-cache-ownership still requires a named owner
30.76 s
gammaloop-nextest-docs> warning: developer note gammaloop-drawing-evaluated-fields-history still requires a named owner
30.76 s
gammaloop-nextest-docs> warning: archived developer note gammaloop-drawing-evaluated-fields-history has no immutable evidence revision
30.76 s
gammaloop-nextest-docs> warning: developer note bnl-benchmark-investigation still requires a named owner
30.76 s
gammaloop-nextest-docs> warning: developer note bnl-contraction-order-performance still requires a named owner
30.76 s
gammaloop-nextest-docs> warning: developer note bnl-scalar-alias-capture still requires a named owner
30.76 s
gammaloop-nextest-docs> warning: developer note aa-aa-three-loop-performance-smoke still requires a named owner
30.76 s
gammaloop-nextest-docs> warning: developer note network-simplification still requires a named owner
30.76 s
gammaloop-nextest-docs> warning: investigation developer note network-simplification has no immutable evidence revision
30.76 s
gammaloop-nextest-docs> warning: developer note spenso-large-expressions still requires a named owner
30.76 s
gammaloop-nextest-docs> warning: developer note spenso-improvement-effects still requires a named owner
30.76 s
gammaloop-nextest-docs> warning: archived developer note spenso-improvement-effects has no immutable evidence revision
30.76 s
gammaloop-nextest-docs> warning: developer note spenso-test-baseline still requires a named owner
30.76 s
gammaloop-nextest-docs> warning: archived developer note spenso-test-baseline has no immutable evidence revision
30.76 s
gammaloop-nextest-docs> warning: developer note bnl-evaluator-atom-capture still requires a named owner
30.76 s
gammaloop-nextest-docs> warning: archived developer note bnl-evaluator-atom-capture has no immutable evidence revision
30.76 s
gammaloop-nextest-docs> warning: developer note uv-scalar-profile-benchmark still requires a named owner
30.76 s
gammaloop-nextest-docs> warning: archived developer note uv-scalar-profile-benchmark has no immutable evidence revision
30.76 s
gammaloop-nextest-docs> warning: developer note ci-test-failure-summary-2026-03-25 still requires a named owner
30.76 s
gammaloop-nextest-docs> warning: archived developer note ci-test-failure-summary-2026-03-25 has no immutable evidence revision
30.76 s
gammaloop-nextest-docs> warning: developer note network-execution-rebase-record still requires a named owner
30.76 s
gammaloop-nextest-docs> warning: archived developer note network-execution-rebase-record has no immutable evidence revision
30.76 s
gammaloop-nextest-docs> warning: developer note ratatui-integration-dashboard-history still requires a named owner
30.76 s
gammaloop-nextest-docs> warning: archived developer note ratatui-integration-dashboard-history has no immutable evidence revision
30.76 s
gammaloop-nextest-docs> warning: developer note nix-crane-cache-reuse still requires a named owner
30.76 s
gammaloop-nextest-docs>
30.76 s
gammaloop-nextest-docs> thread 'tests::every_product_requires_a_task_chooser_and_each_supported_interface' (270) panicked at crates/alphal00p-docs-builder/src/lib.rs:11901:9:
30.76 s
gammaloop-nextest-docs> assertion failed: format!("{error:#}").contains("has no quickstart page")
30.76 s
gammaloop-nextest-docs> stack backtrace:
30.76 s
gammaloop-nextest-docs> 0: __rustc::rust_begin_unwind
30.76 s
gammaloop-nextest-docs> 1: core::panicking::panic_fmt
30.76 s
gammaloop-nextest-docs> 2: core::panicking::panic
30.76 s
gammaloop-nextest-docs> 3: alphal00p_docs_builder::tests::every_product_requires_a_task_chooser_and_each_supported_interface
30.76 s
gammaloop-nextest-docs> 4: <alphal00p_docs_builder::tests::every_product_requires_a_task_chooser_and_each_supported_interface::{closure#0} as core::ops::function::FnOnce<()>>::call_once
30.76 s
gammaloop-nextest-docs> note: Some details are omitted, run with `RUST_BACKTRACE=full` for a verbose backtrace.
30.76 s
gammaloop-nextest-docs>
30.78 s
gammaloop-nextest-docs> FAIL [ 0.113s] ( 98/111) alphal00p-docs-builder tests :: pdf_manual_chapter_order_must_match_the_page_registry
30.78 s
gammaloop-nextest-docs> stdout ---
30.78 s
gammaloop-nextest-docs>
30.78 s
gammaloop-nextest-docs> running 1 test
30.78 s
gammaloop-nextest-docs> test tests::pdf_manual_chapter_order_must_match_the_page_registry ... FAILED
30.78 s
gammaloop-nextest-docs>
30.78 s
gammaloop-nextest-docs> failures:
30.78 s
gammaloop-nextest-docs>
30.78 s
gammaloop-nextest-docs> failures:
30.78 s
gammaloop-nextest-docs> tests::pdf_manual_chapter_order_must_match_the_page_registry
30.78 s
gammaloop-nextest-docs>
30.78 s
gammaloop-nextest-docs> test result: FAILED. 0 passed; 1 failed; 0 ignored; 0 measured; 110 filtered out; finished in 0.11s
30.78 s
gammaloop-nextest-docs>
30.78 s
gammaloop-nextest-docs> stderr ---
30.78 s
gammaloop-nextest-docs> warning: developer note gammaloop-architecture still requires a named owner
30.78 s
gammaloop-nextest-docs> warning: developer note integration-dashboard still requires a named owner
30.78 s
gammaloop-nextest-docs> warning: developer note uv-renormalization still requires a named owner
30.78 s
gammaloop-nextest-docs> warning: developer note spenso-parsing-flow still requires a named owner
30.78 s
gammaloop-nextest-docs> warning: developer note schoonschip-network still requires a named owner
30.78 s
gammaloop-nextest-docs> warning: developer note gammaloop-draw-style-migration still requires a named owner
30.78 s
gammaloop-nextest-docs> warning: developer note gammaloop-drawing-architecture still requires a named owner
30.78 s
gammaloop-nextest-docs> warning: developer note spenso-symbolica-syntax-and-rewrites still requires a named owner
30.78 s
gammaloop-nextest-docs> warning: developer note spenso-architecture still requires a named owner
30.78 s
gammaloop-nextest-docs> warning: developer note idenso-architecture still requires a named owner
30.78 s
gammaloop-nextest-docs> warning: developer note idenso-form-color-dirac-source-map still requires a named owner
30.78 s
gammaloop-nextest-docs> warning: developer note linnet-architecture still requires a named owner
30.78 s
gammaloop-nextest-docs> warning: developer note vakint-architecture still requires a named owner
30.78 s
gammaloop-nextest-docs> warning: developer note gammaloop-roadmap still requires a named owner
30.78 s
gammaloop-nextest-docs> warning: developer note cff-surface-cache-ownership still requires a named owner
30.78 s
gammaloop-nextest-docs> warning: developer note gammaloop-drawing-evaluated-fields-history still requires a named owner
30.78 s
gammaloop-nextest-docs> warning: archived developer note gammaloop-drawing-evaluated-fields-history has no immutable evidence revision
30.78 s
gammaloop-nextest-docs> warning: developer note bnl-benchmark-investigation still requires a named owner
30.78 s
gammaloop-nextest-docs> warning: developer note bnl-contraction-order-performance still requires a named owner
30.78 s
gammaloop-nextest-docs> warning: developer note bnl-scalar-alias-capture still requires a named owner
30.78 s
gammaloop-nextest-docs> warning: developer note aa-aa-three-loop-performance-smoke still requires a named owner
30.78 s
gammaloop-nextest-docs> warning: developer note network-simplification still requires a named owner
30.78 s
gammaloop-nextest-docs> warning: investigation developer note network-simplification has no immutable evidence revision
30.78 s
gammaloop-nextest-docs> warning: developer note spenso-large-expressions still requires a named owner
30.78 s
gammaloop-nextest-docs> warning: developer note spenso-improvement-effects still requires a named owner
30.78 s
gammaloop-nextest-docs> warning: archived developer note spenso-improvement-effects has no immutable evidence revision
30.78 s
gammaloop-nextest-docs> warning: developer note spenso-test-baseline still requires a named owner
30.78 s
gammaloop-nextest-docs> warning: archived developer note spenso-test-baseline has no immutable evidence revision
30.78 s
gammaloop-nextest-docs> warning: developer note bnl-evaluator-atom-capture still requires a named owner
30.78 s
gammaloop-nextest-docs> warning: archived developer note bnl-evaluator-atom-capture has no immutable evidence revision
30.78 s
gammaloop-nextest-docs> warning: developer note uv-scalar-profile-benchmark still requires a named owner
30.78 s
gammaloop-nextest-docs> warning: archived developer note uv-scalar-profile-benchmark has no immutable evidence revision
30.78 s
gammaloop-nextest-docs> warning: developer note ci-test-failure-summary-2026-03-25 still requires a named owner
30.78 s
gammaloop-nextest-docs> warning: archived developer note ci-test-failure-summary-2026-03-25 has no immutable evidence revision
30.78 s
gammaloop-nextest-docs> warning: developer note network-execution-rebase-record still requires a named owner
30.78 s
gammaloop-nextest-docs> warning: archived developer note network-execution-rebase-record has no immutable evidence revision
30.78 s
gammaloop-nextest-docs> warning: developer note ratatui-integration-dashboard-history still requires a named owner
30.78 s
gammaloop-nextest-docs> warning: archived developer note ratatui-integration-dashboard-history has no immutable evidence revision
30.78 s
gammaloop-nextest-docs> warning: developer note nix-crane-cache-reuse still requires a named owner
30.78 s
gammaloop-nextest-docs>
30.78 s
gammaloop-nextest-docs> thread 'tests::pdf_manual_chapter_order_must_match_the_page_registry' (327) panicked at crates/alphal00p-docs-builder/src/lib.rs:11952:9:
30.78 s
gammaloop-nextest-docs> assertion failed: format!("{error:#}").contains("PDF manual chapter order differs")
30.78 s
gammaloop-nextest-docs> stack backtrace:
30.78 s
gammaloop-nextest-docs> 0: __rustc::rust_begin_unwind
30.78 s
gammaloop-nextest-docs> 1: core::panicking::panic_fmt
30.78 s
gammaloop-nextest-docs> 2: core::panicking::panic
30.78 s
gammaloop-nextest-docs> 3: alphal00p_docs_builder::tests::pdf_manual_chapter_order_must_match_the_page_registry
30.78 s
gammaloop-nextest-docs> 4: <alphal00p_docs_builder::tests::pdf_manual_chapter_order_must_match_the_page_registry::{closure#0} as core::ops::function::FnOnce<()>>::call_once
30.78 s
gammaloop-nextest-docs> note: Some details are omitted, run with `RUST_BACKTRACE=full` for a verbose backtrace.
30.78 s
gammaloop-nextest-docs>
51.14 s
gammaloop-nextest-docs> ------------
51.14 s
gammaloop-nextest-docs> Summary [ 20.530s] 111 tests run: 108 passed , 3 failed , 0 skipped
51.14 s
gammaloop-nextest-docs> FAIL [ 0.119s] ( 70/111) alphal00p-docs-builder tests :: checked_in_registry_is_valid
51.14 s
gammaloop-nextest-docs> stdout ---
51.14 s
gammaloop-nextest-docs>
51.14 s
gammaloop-nextest-docs> running 1 test
51.14 s
gammaloop-nextest-docs> test tests::checked_in_registry_is_valid ... FAILED
51.14 s
gammaloop-nextest-docs>
51.14 s
gammaloop-nextest-docs> failures:
51.14 s
gammaloop-nextest-docs>
51.14 s
gammaloop-nextest-docs> failures:
51.14 s
gammaloop-nextest-docs> tests::checked_in_registry_is_valid
51.14 s
gammaloop-nextest-docs>
51.14 s
gammaloop-nextest-docs> test result: FAILED. 0 passed; 1 failed; 0 ignored; 0 measured; 110 filtered out; finished in 0.11s
51.14 s
gammaloop-nextest-docs>
51.14 s
gammaloop-nextest-docs> stderr ---
51.14 s
gammaloop-nextest-docs> warning: developer note gammaloop-architecture still requires a named owner
51.14 s
gammaloop-nextest-docs> warning: developer note integration-dashboard still requires a named owner
51.14 s
gammaloop-nextest-docs> warning: developer note uv-renormalization still requires a named owner
51.14 s
gammaloop-nextest-docs> warning: developer note spenso-parsing-flow still requires a named owner
51.14 s
gammaloop-nextest-docs> warning: developer note schoonschip-network still requires a named owner
51.14 s
gammaloop-nextest-docs> warning: developer note gammaloop-draw-style-migration still requires a named owner
51.14 s
gammaloop-nextest-docs> warning: developer note gammaloop-drawing-architecture still requires a named owner
51.14 s
gammaloop-nextest-docs> warning: developer note spenso-symbolica-syntax-and-rewrites still requires a named owner
51.14 s
gammaloop-nextest-docs> warning: developer note spenso-architecture still requires a named owner
51.14 s
gammaloop-nextest-docs> warning: developer note idenso-architecture still requires a named owner
51.14 s
gammaloop-nextest-docs> warning: developer note idenso-form-color-dirac-source-map still requires a named owner
51.14 s
gammaloop-nextest-docs> warning: developer note linnet-architecture still requires a named owner
51.14 s
gammaloop-nextest-docs> warning: developer note vakint-architecture still requires a named owner
51.14 s
gammaloop-nextest-docs> warning: developer note gammaloop-roadmap still requires a named owner
51.14 s
gammaloop-nextest-docs> warning: developer note cff-surface-cache-ownership still requires a named owner
51.14 s
gammaloop-nextest-docs> warning: developer note gammaloop-drawing-evaluated-fields-history still requires a named owner
51.14 s
gammaloop-nextest-docs> warning: archived developer note gammaloop-drawing-evaluated-fields-history has no immutable evidence revision
51.14 s
gammaloop-nextest-docs> warning: developer note bnl-benchmark-investigation still requires a named owner
51.14 s
gammaloop-nextest-docs> warning: developer note bnl-contraction-order-performance still requires a named owner
51.14 s
gammaloop-nextest-docs> warning: developer note bnl-scalar-alias-capture still requires a named owner
51.14 s
gammaloop-nextest-docs> warning: developer note aa-aa-three-loop-performance-smoke still requires a named owner
51.14 s
gammaloop-nextest-docs> warning: developer note network-simplification still requires a named owner
51.14 s
gammaloop-nextest-docs> warning: investigation developer note network-simplification has no immutable evidence revision
51.14 s
gammaloop-nextest-docs> warning: developer note spenso-large-expressions still requires a named owner
51.14 s
gammaloop-nextest-docs> warning: developer note spenso-improvement-effects still requires a named owner
51.14 s
gammaloop-nextest-docs> warning: archived developer note spenso-improvement-effects has no immutable evidence revision
51.14 s
gammaloop-nextest-docs> warning: developer note spenso-test-baseline still requires a named owner
51.14 s
gammaloop-nextest-docs> warning: archived developer note spenso-test-baseline has no immutable evidence revision
51.14 s
gammaloop-nextest-docs> warning: developer note bnl-evaluator-atom-capture still requires a named owner
51.14 s
gammaloop-nextest-docs> warning: archived developer note bnl-evaluator-atom-capture has no immutable evidence revision
51.14 s
gammaloop-nextest-docs> warning: developer note uv-scalar-profile-benchmark still requires a named owner
51.14 s
gammaloop-nextest-docs> warning: archived developer note uv-scalar-profile-benchmark has no immutable evidence revision
51.14 s
gammaloop-nextest-docs> warning: developer note ci-test-failure-summary-2026-03-25 still requires a named owner
51.14 s
gammaloop-nextest-docs> warning: archived developer note ci-test-failure-summary-2026-03-25 has no immutable evidence revision
51.14 s
gammaloop-nextest-docs> warning: developer note network-execution-rebase-record still requires a named owner
51.14 s
gammaloop-nextest-docs> warning: archived developer note network-execution-rebase-record has no immutable evidence revision
51.14 s
gammaloop-nextest-docs> warning: developer note ratatui-integration-dashboard-history still requires a named owner
51.14 s
gammaloop-nextest-docs> warning: archived developer note ratatui-integration-dashboard-history has no immutable evidence revision
51.14 s
gammaloop-nextest-docs> warning: developer note nix-crane-cache-reuse still requires a named owner
51.14 s
gammaloop-nextest-docs>
51.14 s
gammaloop-nextest-docs> thread 'tests::checked_in_registry_is_valid' (165) panicked at crates/alphal00p-docs-builder/src/lib.rs:11887:50:
51.14 s
gammaloop-nextest-docs> called `Result::unwrap()` on an `Err` value: developer note nix-crane-cache-reuse verified scope flake.nix changed (expected 188504937418859942a6770ca21a4f4e0a7ff125, found 2055acf4433777d5a18c44d88e8416b42a938f3a); owner review or an explicit no-impact attestation is required
51.14 s
gammaloop-nextest-docs>
51.14 s
gammaloop-nextest-docs> Location:
51.14 s
gammaloop-nextest-docs> crates/alphal00p-docs-builder/src/lib.rs:889:21
51.14 s
gammaloop-nextest-docs> stack backtrace:
51.14 s
gammaloop-nextest-docs> 0: __rustc::rust_begin_unwind
51.14 s
gammaloop-nextest-docs> 1: core::panicking::panic_fmt
51.14 s
gammaloop-nextest-docs> 2: core::result::unwrap_failed
51.14 s
gammaloop-nextest-docs> 3: alphal00p_docs_builder::tests::checked_in_registry_is_valid
51.14 s
gammaloop-nextest-docs> 4: <alphal00p_docs_builder::tests::checked_in_registry_is_valid::{closure#0} as core::ops::function::FnOnce<()>>::call_once
51.14 s
gammaloop-nextest-docs> note: Some details are omitted, run with `RUST_BACKTRACE=full` for a verbose backtrace.
51.14 s
gammaloop-nextest-docs>
51.14 s
gammaloop-nextest-docs> FAIL [ 0.126s] ( 85/111) alphal00p-docs-builder tests :: every_product_requires_a_task_chooser_and_each_supported_interface
51.14 s
gammaloop-nextest-docs> stdout ---
51.14 s
gammaloop-nextest-docs>
51.14 s
gammaloop-nextest-docs> running 1 test
51.14 s
gammaloop-nextest-docs> test tests::every_product_requires_a_task_chooser_and_each_supported_interface ... FAILED
51.14 s
gammaloop-nextest-docs>
51.14 s
gammaloop-nextest-docs> failures:
51.14 s
gammaloop-nextest-docs>
51.14 s
gammaloop-nextest-docs> failures:
51.14 s
gammaloop-nextest-docs> tests::every_product_requires_a_task_chooser_and_each_supported_interface
51.14 s
gammaloop-nextest-docs>
51.14 s
gammaloop-nextest-docs> test result: FAILED. 0 passed; 1 failed; 0 ignored; 0 measured; 110 filtered out; finished in 0.12s
51.14 s
gammaloop-nextest-docs>
51.14 s
gammaloop-nextest-docs> stderr ---
51.14 s
gammaloop-nextest-docs> warning: developer note gammaloop-architecture still requires a named owner
51.14 s
gammaloop-nextest-docs> warning: developer note integration-dashboard still requires a named owner
51.14 s
gammaloop-nextest-docs> warning: developer note uv-renormalization still requires a named owner
51.14 s
gammaloop-nextest-docs> warning: developer note spenso-parsing-flow still requires a named owner
51.14 s
gammaloop-nextest-docs> warning: developer note schoonschip-network still requires a named owner
51.14 s
gammaloop-nextest-docs> warning: developer note gammaloop-draw-style-migration still requires a named owner
51.14 s
gammaloop-nextest-docs> warning: developer note gammaloop-drawing-architecture still requires a named owner
51.14 s
gammaloop-nextest-docs> warning: developer note spenso-symbolica-syntax-and-rewrites still requires a named owner
51.14 s
gammaloop-nextest-docs> warning: developer note spenso-architecture still requires a named owner
51.14 s
gammaloop-nextest-docs> warning: developer note idenso-architecture still requires a named owner
51.14 s
gammaloop-nextest-docs> warning: developer note idenso-form-color-dirac-source-map still requires a named owner
51.14 s
gammaloop-nextest-docs> warning: developer note linnet-architecture still requires a named owner
51.14 s
gammaloop-nextest-docs> warning: developer note vakint-architecture still requires a named owner
51.14 s
gammaloop-nextest-docs> warning: developer note gammaloop-roadmap still requires a named owner
51.14 s
gammaloop-nextest-docs> warning: developer note cff-surface-cache-ownership still requires a named owner
51.14 s
gammaloop-nextest-docs> warning: developer note gammaloop-drawing-evaluated-fields-history still requires a named owner
51.14 s
gammaloop-nextest-docs> warning: archived developer note gammaloop-drawing-evaluated-fields-history has no immutable evidence revision
51.14 s
gammaloop-nextest-docs> warning: developer note bnl-benchmark-investigation still requires a named owner
51.14 s
gammaloop-nextest-docs> warning: developer note bnl-contraction-order-performance still requires a named owner
51.14 s
gammaloop-nextest-docs> warning: developer note bnl-scalar-alias-capture still requires a named owner
51.14 s
gammaloop-nextest-docs> warning: developer note aa-aa-three-loop-performance-smoke still requires a named owner
51.14 s
gammaloop-nextest-docs> warning: developer note network-simplification still requires a named owner
51.14 s
gammaloop-nextest-docs> warning: investigation developer note network-simplification has no immutable evidence revision
51.14 s
gammaloop-nextest-docs> warning: developer note spenso-large-expressions still requires a named owner
51.14 s
gammaloop-nextest-docs> warning: developer note spenso-improvement-effects still requires a named owner
51.14 s
gammaloop-nextest-docs> warning: archived developer note spenso-improvement-effects has no immutable evidence revision
51.14 s
gammaloop-nextest-docs> warning: developer note spenso-test-baseline still requires a named owner
51.14 s
gammaloop-nextest-docs> warning: archived developer note spenso-test-baseline has no immutable evidence revision
51.14 s
gammaloop-nextest-docs> warning: developer note bnl-evaluator-atom-capture still requires a named owner
51.14 s
gammaloop-nextest-docs> warning: archived developer note bnl-evaluator-atom-capture has no immutable evidence revision
51.14 s
gammaloop-nextest-docs> warning: developer note uv-scalar-profile-benchmark still requires a named owner
51.14 s
gammaloop-nextest-docs> warning: archived developer note uv-scalar-profile-benchmark has no immutable evidence revision
51.14 s
gammaloop-nextest-docs> warning: developer note ci-test-failure-summary-2026-03-25 still requires a named owner
51.14 s
gammaloop-nextest-docs> warning: archived developer note ci-test-failure-summary-2026-03-25 has no immutable evidence revision
51.14 s
gammaloop-nextest-docs> warning: developer note network-execution-rebase-record still requires a named owner
51.14 s
gammaloop-nextest-docs> warning: archived developer note network-execution-rebase-record has no immutable evidence revision
51.14 s
gammaloop-nextest-docs> warning: developer note ratatui-integration-dashboard-history still requires a named owner
51.14 s
gammaloop-nextest-docs> warning: archived developer note ratatui-integration-dashboard-history has no immutable evidence revision
51.14 s
gammaloop-nextest-docs> warning: developer note nix-crane-cache-reuse still requires a named owner
51.14 s
gammaloop-nextest-docs>
51.14 s
gammaloop-nextest-docs> thread 'tests::every_product_requires_a_task_chooser_and_each_supported_interface' (270) panicked at crates/alphal00p-docs-builder/src/lib.rs:11901:9:
51.14 s
gammaloop-nextest-docs> assertion failed: format!("{error:#}").contains("has no quickstart page")
51.14 s
gammaloop-nextest-docs> stack backtrace:
51.14 s
gammaloop-nextest-docs> 0: __rustc::rust_begin_unwind
51.14 s
gammaloop-nextest-docs> 1: core::panicking::panic_fmt
51.14 s
gammaloop-nextest-docs> 2: core::panicking::panic
51.14 s
gammaloop-nextest-docs> 3: alphal00p_docs_builder::tests::every_product_requires_a_task_chooser_and_each_supported_interface
51.14 s
gammaloop-nextest-docs> 4: <alphal00p_docs_builder::tests::every_product_requires_a_task_chooser_and_each_supported_interface::{closure#0} as core::ops::function::FnOnce<()>>::call_once
51.14 s
gammaloop-nextest-docs> note: Some details are omitted, run with `RUST_BACKTRACE=full` for a verbose backtrace.
51.14 s
gammaloop-nextest-docs>
51.14 s
gammaloop-nextest-docs> FAIL [ 0.113s] ( 98/111) alphal00p-docs-builder tests :: pdf_manual_chapter_order_must_match_the_page_registry
51.14 s
gammaloop-nextest-docs> stdout ---
51.14 s
gammaloop-nextest-docs>
51.14 s
gammaloop-nextest-docs> running 1 test
51.14 s
gammaloop-nextest-docs> test tests::pdf_manual_chapter_order_must_match_the_page_registry ... FAILED
51.14 s
gammaloop-nextest-docs>
51.14 s
gammaloop-nextest-docs> failures:
51.14 s
gammaloop-nextest-docs>
51.14 s
gammaloop-nextest-docs> failures:
51.14 s
gammaloop-nextest-docs> tests::pdf_manual_chapter_order_must_match_the_page_registry
51.14 s
gammaloop-nextest-docs>
51.14 s
gammaloop-nextest-docs> test result: FAILED. 0 passed; 1 failed; 0 ignored; 0 measured; 110 filtered out; finished in 0.11s
51.14 s
gammaloop-nextest-docs>
51.14 s
gammaloop-nextest-docs> stderr ---
51.14 s
gammaloop-nextest-docs> warning: developer note gammaloop-architecture still requires a named owner
51.14 s
gammaloop-nextest-docs> warning: developer note integration-dashboard still requires a named owner
51.14 s
gammaloop-nextest-docs> warning: developer note uv-renormalization still requires a named owner
51.14 s
gammaloop-nextest-docs> warning: developer note spenso-parsing-flow still requires a named owner
51.14 s
gammaloop-nextest-docs> warning: developer note schoonschip-network still requires a named owner
51.14 s
gammaloop-nextest-docs> warning: developer note gammaloop-draw-style-migration still requires a named owner
51.14 s
gammaloop-nextest-docs> warning: developer note gammaloop-drawing-architecture still requires a named owner
51.14 s
gammaloop-nextest-docs> warning: developer note spenso-symbolica-syntax-and-rewrites still requires a named owner
51.14 s
gammaloop-nextest-docs> warning: developer note spenso-architecture still requires a named owner
51.14 s
gammaloop-nextest-docs> warning: developer note idenso-architecture still requires a named owner
51.14 s
gammaloop-nextest-docs> warning: developer note idenso-form-color-dirac-source-map still requires a named owner
51.14 s
gammaloop-nextest-docs> warning: developer note linnet-architecture still requires a named owner
51.14 s
gammaloop-nextest-docs> warning: developer note vakint-architecture still requires a named owner
51.14 s
gammaloop-nextest-docs> warning: developer note gammaloop-roadmap still requires a named owner
51.14 s
gammaloop-nextest-docs> warning: developer note cff-surface-cache-ownership still requires a named owner
51.14 s
gammaloop-nextest-docs> warning: developer note gammaloop-drawing-evaluated-fields-history still requires a named owner
51.14 s
gammaloop-nextest-docs> warning: archived developer note gammaloop-drawing-evaluated-fields-history has no immutable evidence revision
51.14 s
gammaloop-nextest-docs> warning: developer note bnl-benchmark-investigation still requires a named owner
51.14 s
gammaloop-nextest-docs> warning: developer note bnl-contraction-order-performance still requires a named owner
51.14 s
gammaloop-nextest-docs> warning: developer note bnl-scalar-alias-capture still requires a named owner
51.14 s
gammaloop-nextest-docs> warning: developer note aa-aa-three-loop-performance-smoke still requires a named owner
51.14 s
gammaloop-nextest-docs> warning: developer note network-simplification still requires a named owner
51.14 s
gammaloop-nextest-docs> warning: investigation developer note network-simplification has no immutable evidence revision
51.14 s
gammaloop-nextest-docs> warning: developer note spenso-large-expressions still requires a named owner
51.14 s
gammaloop-nextest-docs> warning: developer note spenso-improvement-effects still requires a named owner
51.14 s
gammaloop-nextest-docs> warning: archived developer note spenso-improvement-effects has no immutable evidence revision
51.14 s
gammaloop-nextest-docs> warning: developer note spenso-test-baseline still requires a named owner
51.14 s
gammaloop-nextest-docs> warning: archived developer note spenso-test-baseline has no immutable evidence revision
51.14 s
gammaloop-nextest-docs> warning: developer note bnl-evaluator-atom-capture still requires a named owner
51.14 s
gammaloop-nextest-docs> warning: archived developer note bnl-evaluator-atom-capture has no immutable evidence revision
51.14 s
gammaloop-nextest-docs> warning: developer note uv-scalar-profile-benchmark still requires a named owner
51.14 s
gammaloop-nextest-docs> warning: archived developer note uv-scalar-profile-benchmark has no immutable evidence revision
51.14 s
gammaloop-nextest-docs> warning: developer note ci-test-failure-summary-2026-03-25 still requires a named owner
51.14 s
gammaloop-nextest-docs> warning: archived developer note ci-test-failure-summary-2026-03-25 has no immutable evidence revision
51.14 s
gammaloop-nextest-docs> warning: developer note network-execution-rebase-record still requires a named owner
51.14 s
gammaloop-nextest-docs> warning: archived developer note network-execution-rebase-record has no immutable evidence revision
51.14 s
gammaloop-nextest-docs> warning: developer note ratatui-integration-dashboard-history still requires a named owner
51.14 s
gammaloop-nextest-docs> warning: archived developer note ratatui-integration-dashboard-history has no immutable evidence revision
51.14 s
gammaloop-nextest-docs> warning: developer note nix-crane-cache-reuse still requires a named owner
51.14 s
gammaloop-nextest-docs>
51.14 s
gammaloop-nextest-docs> thread 'tests::pdf_manual_chapter_order_must_match_the_page_registry' (327) panicked at crates/alphal00p-docs-builder/src/lib.rs:11952:9:
51.14 s
gammaloop-nextest-docs> assertion failed: format!("{error:#}").contains("PDF manual chapter order differs")
51.14 s
gammaloop-nextest-docs> stack backtrace:
51.14 s
gammaloop-nextest-docs> 0: __rustc::rust_begin_unwind
51.14 s
gammaloop-nextest-docs> 1: core::panicking::panic_fmt
51.14 s
gammaloop-nextest-docs> 2: core::panicking::panic
51.14 s
gammaloop-nextest-docs> 3: alphal00p_docs_builder::tests::pdf_manual_chapter_order_must_match_the_page_registry
51.14 s
gammaloop-nextest-docs> 4: <alphal00p_docs_builder::tests::pdf_manual_chapter_order_must_match_the_page_registry::{closure#0} as core::ops::function::FnOnce<()>>::call_once
51.14 s
gammaloop-nextest-docs> note: Some details are omitted, run with `RUST_BACKTRACE=full` for a verbose backtrace.
51.14 s
gammaloop-nextest-docs>
51.15 s
gammaloop-nextest-docs> error : test run failed
51.23 s
gammaloop-nextest-docs>
51.23 s
gammaloop-nextest-docs> ========== nextest test summary ==========
51.23 s
gammaloop-nextest-docs> report: target/nextest/ci_gammaloop/junit.xml
51.23 s
gammaloop-nextest-docs> tests: 111, failures: 3, errors: 0
51.23 s
gammaloop-nextest-docs>
51.23 s
gammaloop-nextest-docs> 1. alphal00p-docs-builder::tests::checked_in_registry_is_valid
51.23 s
gammaloop-nextest-docs> failure: test failure with exit code 101
51.23 s
gammaloop-nextest-docs> thread 'tests::checked_in_registry_is_valid' (165) panicked at crates/alphal00p-docs-builder/src/lib.rs:11887:50:
51.23 s
gammaloop-nextest-docs> called `Result::unwrap()` on an `Err` value: developer note nix-crane-cache-reuse verified scope flake.nix changed (expected 188504937418859942a6770ca21a4f4e0a7ff125, found 2055acf4433777d5a18c44d88e8416b42a938f3a); owner review or an explicit no-impact attestation is required
51.23 s
gammaloop-nextest-docs>
51.23 s
gammaloop-nextest-docs> Location:
51.23 s
gammaloop-nextest-docs> crates/alphal00p-docs-builder/src/lib.rs:889:21
51.23 s
gammaloop-nextest-docs> stack backtrace:
51.23 s
gammaloop-nextest-docs> 0: __rustc::rust_begin_unwind
51.23 s
gammaloop-nextest-docs> 1: core::panicking::panic_fmt
51.23 s
gammaloop-nextest-docs> 2: core::result::unwrap_failed
51.23 s
gammaloop-nextest-docs> 3: alphal00p_docs_builder::tests::checked_in_registry_is_valid
51.23 s
gammaloop-nextest-docs> 4: <alphal00p_docs_builder::tests::checked_in_registry_is_valid::{closure#0} as core::ops::function::FnOnce<()>>::call_once
51.23 s
gammaloop-nextest-docs> note: Some details are omitted, run with `RUST_BACKTRACE=full` for a verbose backtrace.
51.23 s
gammaloop-nextest-docs> system-out
51.23 s
gammaloop-nextest-docs> running 1 test
51.23 s
gammaloop-nextest-docs> test tests::checked_in_registry_is_valid ... FAILED
51.23 s
gammaloop-nextest-docs>
51.23 s
gammaloop-nextest-docs> failures:
51.23 s
gammaloop-nextest-docs>
51.23 s
gammaloop-nextest-docs> failures:
51.23 s
gammaloop-nextest-docs> tests::checked_in_registry_is_valid
51.23 s
gammaloop-nextest-docs>
51.23 s
gammaloop-nextest-docs> test result: FAILED. 0 passed; 1 failed; 0 ignored; 0 measured; 110 filtered out; finished in 0.11s
51.23 s
gammaloop-nextest-docs> system-err
51.23 s
gammaloop-nextest-docs> warning: developer note gammaloop-architecture still requires a named owner
51.23 s
gammaloop-nextest-docs> warning: developer note integration-dashboard still requires a named owner
51.23 s
gammaloop-nextest-docs> warning: developer note uv-renormalization still requires a named owner
51.23 s
gammaloop-nextest-docs> warning: developer note spenso-parsing-flow still requires a named owner
51.23 s
gammaloop-nextest-docs> warning: developer note schoonschip-network still requires a named owner
51.23 s
gammaloop-nextest-docs> warning: developer note gammaloop-draw-style-migration still requires a named owner
51.23 s
gammaloop-nextest-docs> warning: developer note gammaloop-drawing-architecture still requires a named owner
51.23 s
gammaloop-nextest-docs> warning: developer note spenso-symbolica-syntax-and-rewrites still requires a named owner
51.23 s
gammaloop-nextest-docs> warning: developer note spenso-architecture still requires a named owner
51.23 s
gammaloop-nextest-docs> warning: developer note idenso-architecture still requires a named owner
51.23 s
gammaloop-nextest-docs> warning: developer note idenso-form-color-dirac-source-map still requires a named owner
51.23 s
gammaloop-nextest-docs> warning: developer note linnet-architecture still requires a named owner
51.23 s
gammaloop-nextest-docs> warning: developer note vakint-architecture still requires a named owner
51.23 s
gammaloop-nextest-docs> warning: developer note gammaloop-roadmap still requires a named owner
51.23 s
gammaloop-nextest-docs> warning: developer note cff-surface-cache-ownership still requires a named owner
51.23 s
gammaloop-nextest-docs> warning: developer note gammaloop-drawing-evaluated-fields-history still requires a named owner
51.23 s
gammaloop-nextest-docs> warning: archived developer note gammaloop-drawing-evaluated-fields-history has no immutable evidence revision
51.23 s
gammaloop-nextest-docs> warning: developer note bnl-benchmark-investigation still requires a named owner
51.23 s
gammaloop-nextest-docs> warning: developer note bnl-contraction-order-performance still requires a named owner
51.23 s
gammaloop-nextest-docs> warning: developer note bnl-scalar-alias-capture still requires a named owner
51.23 s
gammaloop-nextest-docs> warning: developer note aa-aa-three-loop-performance-smoke still requires a named owner
51.23 s
gammaloop-nextest-docs> warning: developer note network-simplification still requires a named owner
51.23 s
gammaloop-nextest-docs> warning: investigation developer note network-simplification has no immutable evidence revision
51.23 s
gammaloop-nextest-docs> warning: developer note spenso-large-expressions still requires a named owner
51.23 s
gammaloop-nextest-docs> warning: developer note spenso-improvement-effects still requires a named owner
51.23 s
gammaloop-nextest-docs> warning: archived developer note spenso-improvement-effects has no immutable evidence revision
51.23 s
gammaloop-nextest-docs> warning: developer note spenso-test-baseline still requires a named owner
51.23 s
gammaloop-nextest-docs> warning: archived developer note spenso-test-baseline has no immutable evidence revision
51.23 s
gammaloop-nextest-docs> warning: developer note bnl-evaluator-atom-capture still requires a named owner
51.23 s
gammaloop-nextest-docs> warning: archived developer note bnl-evaluator-atom-capture has no immutable evidence revision
51.23 s
gammaloop-nextest-docs> warning: developer note uv-scalar-profile-benchmark still requires a named owner
51.23 s
gammaloop-nextest-docs> warning: archived developer note uv-scalar-profile-benchmark has no immutable evidence revision
51.23 s
gammaloop-nextest-docs> warning: developer note ci-test-failure-summary-2026-03-25 still requires a named owner
51.23 s
gammaloop-nextest-docs> warning: archived developer note ci-test-failure-summary-2026-03-25 has no immutable evidence revision
51.23 s
gammaloop-nextest-docs> warning: developer note network-execution-rebase-record still requires a named owner
51.23 s
gammaloop-nextest-docs> warning: archived developer note network-execution-rebase-record has no immutable evidence revision
51.23 s
gammaloop-nextest-docs> warning: developer note ratatui-integration-dashboard-history still requires a named owner
51.23 s
gammaloop-nextest-docs> warning: archived developer note ratatui-integration-dashboard-history has no immutable evidence revision
51.23 s
gammaloop-nextest-docs> warning: developer note nix-crane-cache-reuse still requires a named owner
51.23 s
gammaloop-nextest-docs>
51.23 s
gammaloop-nextest-docs> thread 'tests::checked_in_registry_is_valid' (165) panicked at crates/alphal00p-docs-builder/src/lib.rs:11887:50:
51.23 s
gammaloop-nextest-docs> called `Result::unwrap()` on an `Err` value: developer note nix-crane-cache-reuse verified scope flake.nix changed (expected 188504937418859942a6770ca21a4f4e0a7ff125, found 2055acf4433777d5a18c44d88e8416b42a938f3a); owner review or an explicit no-impact attestation is required
51.23 s
gammaloop-nextest-docs>
51.23 s
gammaloop-nextest-docs> Location:
51.23 s
gammaloop-nextest-docs> crates/alphal00p-docs-builder/src/lib.rs:889:21
51.23 s
gammaloop-nextest-docs> stack backtrace:
51.23 s
gammaloop-nextest-docs> 0: __rustc::rust_begin_unwind
51.23 s
gammaloop-nextest-docs> 1: core::panicking::panic_fmt
51.23 s
gammaloop-nextest-docs> 2: core::result::unwrap_failed
51.23 s
gammaloop-nextest-docs> 3: alphal00p_docs_builder::tests::checked_in_registry_is_valid
51.23 s
gammaloop-nextest-docs> 4: <alphal00p_docs_builder::tests::checked_in_registry_is_valid::{closure#0} as core::ops::function::FnOnce<()>>::call_once
51.23 s
gammaloop-nextest-docs> note: Some details are omitted, run with `RUST_BACKTRACE=full` for a verbose backtrace.
51.23 s
gammaloop-nextest-docs>
51.23 s
gammaloop-nextest-docs> 2. alphal00p-docs-builder::tests::every_product_requires_a_task_chooser_and_each_supported_interface
51.23 s
gammaloop-nextest-docs> failure: test failure with exit code 101
51.23 s
gammaloop-nextest-docs> thread 'tests::every_product_requires_a_task_chooser_and_each_supported_interface' (270) panicked at crates/alphal00p-docs-builder/src/lib.rs:11901:9:
51.23 s
gammaloop-nextest-docs> assertion failed: format!("{error:#}").contains("has no quickstart page")
51.23 s
gammaloop-nextest-docs> stack backtrace:
51.23 s
gammaloop-nextest-docs> 0: __rustc::rust_begin_unwind
51.23 s
gammaloop-nextest-docs> 1: core::panicking::panic_fmt
51.23 s
gammaloop-nextest-docs> 2: core::panicking::panic
51.23 s
gammaloop-nextest-docs> 3: alphal00p_docs_builder::tests::every_product_requires_a_task_chooser_and_each_supported_interface
51.23 s
gammaloop-nextest-docs> 4: <alphal00p_docs_builder::tests::every_product_requires_a_task_chooser_and_each_supported_interface::{closure#0} as core::ops::function::FnOnce<()>>::call_once
51.23 s
gammaloop-nextest-docs> note: Some details are omitted, run with `RUST_BACKTRACE=full` for a verbose backtrace.
51.23 s
gammaloop-nextest-docs> system-out
51.23 s
gammaloop-nextest-docs> running 1 test
51.23 s
gammaloop-nextest-docs> test tests::every_product_requires_a_task_chooser_and_each_supported_interface ... FAILED
51.23 s
gammaloop-nextest-docs>
51.23 s
gammaloop-nextest-docs> failures:
51.23 s
gammaloop-nextest-docs>
51.23 s
gammaloop-nextest-docs> failures:
51.23 s
gammaloop-nextest-docs> tests::every_product_requires_a_task_chooser_and_each_supported_interface
51.23 s
gammaloop-nextest-docs>
51.23 s
gammaloop-nextest-docs> test result: FAILED. 0 passed; 1 failed; 0 ignored; 0 measured; 110 filtered out; finished in 0.12s
51.23 s
gammaloop-nextest-docs> system-err
51.23 s
gammaloop-nextest-docs> warning: developer note gammaloop-architecture still requires a named owner
51.23 s
gammaloop-nextest-docs> warning: developer note integration-dashboard still requires a named owner
51.23 s
gammaloop-nextest-docs> warning: developer note uv-renormalization still requires a named owner
51.23 s
gammaloop-nextest-docs> warning: developer note spenso-parsing-flow still requires a named owner
51.23 s
gammaloop-nextest-docs> warning: developer note schoonschip-network still requires a named owner
51.23 s
gammaloop-nextest-docs> warning: developer note gammaloop-draw-style-migration still requires a named owner
51.23 s
gammaloop-nextest-docs> warning: developer note gammaloop-drawing-architecture still requires a named owner
51.23 s
gammaloop-nextest-docs> warning: developer note spenso-symbolica-syntax-and-rewrites still requires a named owner
51.23 s
gammaloop-nextest-docs> warning: developer note spenso-architecture still requires a named owner
51.23 s
gammaloop-nextest-docs> warning: developer note idenso-architecture still requires a named owner
51.23 s
gammaloop-nextest-docs> warning: developer note idenso-form-color-dirac-source-map still requires a named owner
51.23 s
gammaloop-nextest-docs> warning: developer note linnet-architecture still requires a named owner
51.23 s
gammaloop-nextest-docs> warning: developer note vakint-architecture still requires a named owner
51.23 s
gammaloop-nextest-docs> warning: developer note gammaloop-roadmap still requires a named owner
51.23 s
gammaloop-nextest-docs> warning: developer note cff-surface-cache-ownership still requires a named owner
51.23 s
gammaloop-nextest-docs> warning: developer note gammaloop-drawing-evaluated-fields-history still requires a named owner
51.23 s
gammaloop-nextest-docs> warning: archived developer note gammaloop-drawing-evaluated-fields-history has no immutable evidence revision
51.23 s
gammaloop-nextest-docs> warning: developer note bnl-benchmark-investigation still requires a named owner
51.23 s
gammaloop-nextest-docs> warning: developer note bnl-contraction-order-performance still requires a named owner
51.23 s
gammaloop-nextest-docs> warning: developer note bnl-scalar-alias-capture still requires a named owner
51.23 s
gammaloop-nextest-docs> warning: developer note aa-aa-three-loop-performance-smoke still requires a named owner
51.23 s
gammaloop-nextest-docs> warning: developer note network-simplification still requires a named owner
51.23 s
gammaloop-nextest-docs> warning: investigation developer note network-simplification has no immutable evidence revision
51.23 s
gammaloop-nextest-docs> warning: developer note spenso-large-expressions still requires a named owner
51.23 s
gammaloop-nextest-docs> warning: developer note spenso-improvement-effects still requires a named owner
51.23 s
gammaloop-nextest-docs> warning: archived developer note spenso-improvement-effects has no immutable evidence revision
51.23 s
gammaloop-nextest-docs> warning: developer note spenso-test-baseline still requires a named owner
51.23 s
gammaloop-nextest-docs> warning: archived developer note spenso-test-baseline has no immutable evidence revision
51.23 s
gammaloop-nextest-docs> warning: developer note bnl-evaluator-atom-capture still requires a named owner
51.23 s
gammaloop-nextest-docs> warning: archived developer note bnl-evaluator-atom-capture has no immutable evidence revision
51.23 s
gammaloop-nextest-docs> warning: developer note uv-scalar-profile-benchmark still requires a named owner
51.23 s
gammaloop-nextest-docs> warning: archived developer note uv-scalar-profile-benchmark has no immutable evidence revision
51.23 s
gammaloop-nextest-docs> warning: developer note ci-test-failure-summary-2026-03-25 still requires a named owner
51.23 s
gammaloop-nextest-docs> warning: archived developer note ci-test-failure-summary-2026-03-25 has no immutable evidence revision
51.23 s
gammaloop-nextest-docs> warning: developer note network-execution-rebase-record still requires a named owner
51.23 s
gammaloop-nextest-docs> warning: archived developer note network-execution-rebase-record has no immutable evidence revision
51.23 s
gammaloop-nextest-docs> warning: developer note ratatui-integration-dashboard-history still requires a named owner
51.23 s
gammaloop-nextest-docs> warning: archived developer note ratatui-integration-dashboard-history has no immutable evidence revision
51.23 s
gammaloop-nextest-docs> warning: developer note nix-crane-cache-reuse still requires a named owner
51.23 s
gammaloop-nextest-docs>
51.23 s
gammaloop-nextest-docs> thread 'tests::every_product_requires_a_task_chooser_and_each_supported_interface' (270) panicked at crates/alphal00p-docs-builder/src/lib.rs:11901:9:
51.23 s
gammaloop-nextest-docs> assertion failed: format!("{error:#}").contains("has no quickstart page")
51.23 s
gammaloop-nextest-docs> stack backtrace:
51.23 s
gammaloop-nextest-docs> 0: __rustc::rust_begin_unwind
51.23 s
gammaloop-nextest-docs> 1: core::panicking::panic_fmt
51.23 s
gammaloop-nextest-docs> 2: core::panicking::panic
51.23 s
gammaloop-nextest-docs> 3: alphal00p_docs_builder::tests::every_product_requires_a_task_chooser_and_each_supported_interface
51.23 s
gammaloop-nextest-docs> 4: <alphal00p_docs_builder::tests::every_product_requires_a_task_chooser_and_each_supported_interface::{closure#0} as core::ops::function::FnOnce<()>>::call_once
51.23 s
gammaloop-nextest-docs> note: Some details are omitted, run with `RUST_BACKTRACE=full` for a verbose backtrace.
51.23 s
gammaloop-nextest-docs>
51.23 s
gammaloop-nextest-docs> 3. alphal00p-docs-builder::tests::pdf_manual_chapter_order_must_match_the_page_registry
51.23 s
gammaloop-nextest-docs> failure: test failure with exit code 101
51.23 s
gammaloop-nextest-docs> thread 'tests::pdf_manual_chapter_order_must_match_the_page_registry' (327) panicked at crates/alphal00p-docs-builder/src/lib.rs:11952:9:
51.23 s
gammaloop-nextest-docs> assertion failed: format!("{error:#}").contains("PDF manual chapter order differs")
51.23 s
gammaloop-nextest-docs> stack backtrace:
51.23 s
gammaloop-nextest-docs> 0: __rustc::rust_begin_unwind
51.23 s
gammaloop-nextest-docs> 1: core::panicking::panic_fmt
51.23 s
gammaloop-nextest-docs> 2: core::panicking::panic
51.23 s
gammaloop-nextest-docs> 3: alphal00p_docs_builder::tests::pdf_manual_chapter_order_must_match_the_page_registry
51.23 s
gammaloop-nextest-docs> 4: <alphal00p_docs_builder::tests::pdf_manual_chapter_order_must_match_the_page_registry::{closure#0} as core::ops::function::FnOnce<()>>::call_once
51.23 s
gammaloop-nextest-docs> note: Some details are omitted, run with `RUST_BACKTRACE=full` for a verbose backtrace.
51.23 s
gammaloop-nextest-docs> system-out
51.23 s
gammaloop-nextest-docs> running 1 test
51.23 s
gammaloop-nextest-docs> test tests::pdf_manual_chapter_order_must_match_the_page_registry ... FAILED
51.23 s
gammaloop-nextest-docs>
51.23 s
gammaloop-nextest-docs> failures:
51.23 s
gammaloop-nextest-docs>
51.23 s
gammaloop-nextest-docs> failures:
51.23 s
gammaloop-nextest-docs> tests::pdf_manual_chapter_order_must_match_the_page_registry
51.23 s
gammaloop-nextest-docs>
51.23 s
gammaloop-nextest-docs> test result: FAILED. 0 passed; 1 failed; 0 ignored; 0 measured; 110 filtered out; finished in 0.11s
51.23 s
gammaloop-nextest-docs> system-err
51.23 s
gammaloop-nextest-docs> warning: developer note gammaloop-architecture still requires a named owner
51.23 s
gammaloop-nextest-docs> warning: developer note integration-dashboard still requires a named owner
51.23 s
gammaloop-nextest-docs> warning: developer note uv-renormalization still requires a named owner
51.23 s
gammaloop-nextest-docs> warning: developer note spenso-parsing-flow still requires a named owner
51.23 s
gammaloop-nextest-docs> warning: developer note schoonschip-network still requires a named owner
51.23 s
gammaloop-nextest-docs> warning: developer note gammaloop-draw-style-migration still requires a named owner
51.23 s
gammaloop-nextest-docs> warning: developer note gammaloop-drawing-architecture still requires a named owner
51.23 s
gammaloop-nextest-docs> warning: developer note spenso-symbolica-syntax-and-rewrites still requires a named owner
51.23 s
gammaloop-nextest-docs> warning: developer note spenso-architecture still requires a named owner
51.23 s
gammaloop-nextest-docs> warning: developer note idenso-architecture still requires a named owner
51.23 s
gammaloop-nextest-docs> warning: developer note idenso-form-color-dirac-source-map still requires a named owner
51.23 s
gammaloop-nextest-docs> warning: developer note linnet-architecture still requires a named owner
51.23 s
gammaloop-nextest-docs> warning: developer note vakint-architecture still requires a named owner
51.23 s
gammaloop-nextest-docs> warning: developer note gammaloop-roadmap still requires a named owner
51.23 s
gammaloop-nextest-docs> warning: developer note cff-surface-cache-ownership still requires a named owner
51.23 s
gammaloop-nextest-docs> warning: developer note gammaloop-drawing-evaluated-fields-history still requires a named owner
51.23 s
gammaloop-nextest-docs> warning: archived developer note gammaloop-drawing-evaluated-fields-history has no immutable evidence revision
51.23 s
gammaloop-nextest-docs> warning: developer note bnl-benchmark-investigation still requires a named owner
51.23 s
gammaloop-nextest-docs> warning: developer note bnl-contraction-order-performance still requires a named owner
51.23 s
gammaloop-nextest-docs> warning: developer note bnl-scalar-alias-capture still requires a named owner
51.23 s
gammaloop-nextest-docs> warning: developer note aa-aa-three-loop-performance-smoke still requires a named owner
51.23 s
gammaloop-nextest-docs> warning: developer note network-simplification still requires a named owner
51.23 s
gammaloop-nextest-docs> warning: investigation developer note network-simplification has no immutable evidence revision
51.23 s
gammaloop-nextest-docs> warning: developer note spenso-large-expressions still requires a named owner
51.23 s
gammaloop-nextest-docs> warning: developer note spenso-improvement-effects still requires a named owner
51.23 s
gammaloop-nextest-docs> warning: archived developer note spenso-improvement-effects has no immutable evidence revision
51.23 s
gammaloop-nextest-docs> warning: developer note spenso-test-baseline still requires a named owner
51.23 s
gammaloop-nextest-docs> warning: archived developer note spenso-test-baseline has no immutable evidence revision
51.23 s
gammaloop-nextest-docs> warning: developer note bnl-evaluator-atom-capture still requires a named owner
51.23 s
gammaloop-nextest-docs> warning: archived developer note bnl-evaluator-atom-capture has no immutable evidence revision
51.23 s
gammaloop-nextest-docs> warning: developer note uv-scalar-profile-benchmark still requires a named owner
51.23 s
gammaloop-nextest-docs> warning: archived developer note uv-scalar-profile-benchmark has no immutable evidence revision
51.23 s
gammaloop-nextest-docs> warning: developer note ci-test-failure-summary-2026-03-25 still requires a named owner
51.23 s
gammaloop-nextest-docs> warning: archived developer note ci-test-failure-summary-2026-03-25 has no immutable evidence revision
51.23 s
gammaloop-nextest-docs> warning: developer note network-execution-rebase-record still requires a named owner
51.23 s
gammaloop-nextest-docs> warning: archived developer note network-execution-rebase-record has no immutable evidence revision
51.23 s
gammaloop-nextest-docs> warning: developer note ratatui-integration-dashboard-history still requires a named owner
51.23 s
gammaloop-nextest-docs> warning: archived developer note ratatui-integration-dashboard-history has no immutable evidence revision
51.23 s
gammaloop-nextest-docs> warning: developer note nix-crane-cache-reuse still requires a named owner
51.23 s
gammaloop-nextest-docs>
51.23 s
gammaloop-nextest-docs> thread 'tests::pdf_manual_chapter_order_must_match_the_page_registry' (327) panicked at crates/alphal00p-docs-builder/src/lib.rs:11952:9:
51.23 s
gammaloop-nextest-docs> assertion failed: format!("{error:#}").contains("PDF manual chapter order differs")
51.23 s
gammaloop-nextest-docs> stack backtrace:
51.23 s
gammaloop-nextest-docs> 0: __rustc::rust_begin_unwind
51.23 s
gammaloop-nextest-docs> 1: core::panicking::panic_fmt
51.23 s
gammaloop-nextest-docs> 2: core::panicking::panic
51.23 s
gammaloop-nextest-docs> 3: alphal00p_docs_builder::tests::pdf_manual_chapter_order_must_match_the_page_registry
51.23 s
gammaloop-nextest-docs> 4: <alphal00p_docs_builder::tests::pdf_manual_chapter_order_must_match_the_page_registry::{closure#0} as core::ops::function::FnOnce<()>>::call_once
51.23 s
gammaloop-nextest-docs> note: Some details are omitted, run with `RUST_BACKTRACE=full` for a verbose backtrace.
51.23 s
gammaloop-nextest-docs> =========================================
51.25 s
gammaloop-nextest-docs> Extracting 2 binaries to /build/source
51.31 s
gammaloop-nextest-docs> Extracted 5 files to /build/source in 0.06s
51.33 s
gammaloop-nextest-docs> ------------
51.33 s
gammaloop-nextest-docs> Nextest run ID 1d3999e8-c2e5-45d2-ae24-d6e7fa86840b with nextest profile: ci_gammaloop
51.33 s
gammaloop-nextest-docs> Starting 22 tests across 2 binaries
51.35 s
gammaloop-nextest-docs> ------------
51.35 s
gammaloop-nextest-docs> Summary [ 0.026s] 22 tests run: 22 passed , 0 skipped
51.41 s
gammaloop-nextest-docs>
51.41 s
gammaloop-nextest-docs> ========== nextest test summary ==========
51.41 s
gammaloop-nextest-docs> report: target/nextest/ci_gammaloop/junit.xml
51.41 s
gammaloop-nextest-docs> tests: 22, failures: 0, errors: 0
51.41 s
gammaloop-nextest-docs> No failing testcases found.
51.41 s
gammaloop-nextest-docs> =========================================
51.44 s
gammaloop-nextest-docs> Extracting 3 binaries (including 2 non-test binaries), 1 build script output directory, and 2 linked paths to /build/source
51.84 s
gammaloop-nextest-docs> Extracted 22 files to /build/source in 0.40s
51.85 s
gammaloop-nextest-docs> ------------
51.85 s
gammaloop-nextest-docs> Nextest run ID 3f0845e9-b888-46a0-a4d7-80b73b7070f3 with nextest profile: ci_gammaloop
51.85 s
gammaloop-nextest-docs> Starting 89 tests across 1 binary
51.91 s
gammaloop-nextest-docs> ------------
51.91 s
gammaloop-nextest-docs> Summary [ 0.061s] 89 tests run: 89 passed , 0 skipped
51.97 s
gammaloop-nextest-docs>
51.97 s
gammaloop-nextest-docs> ========== nextest test summary ==========
51.97 s
gammaloop-nextest-docs> report: target/nextest/ci_gammaloop/junit.xml
51.97 s
gammaloop-nextest-docs> tests: 89, failures: 0, errors: 0
51.97 s
gammaloop-nextest-docs> No failing testcases found.
51.97 s
gammaloop-nextest-docs> =========================================
51.99 s
gammaloop-nextest-docs> Extracting 2 binaries to /build/source
52.05 s
gammaloop-nextest-docs> Extracted 5 files to /build/source in 0.06s
52.07 s
gammaloop-nextest-docs> ------------
52.07 s
gammaloop-nextest-docs> Nextest run ID 5dc8bf56-c159-4097-bca6-094dafefa799 with nextest profile: ci_gammaloop
52.07 s
gammaloop-nextest-docs> Starting 10 tests across 2 binaries
73.06 s
gammaloop-nextest-docs> ------------
73.06 s
gammaloop-nextest-docs> Summary [ 20.985s] 10 tests run: 10 passed , 0 skipped
73.13 s
gammaloop-nextest-docs>
73.13 s
gammaloop-nextest-docs> ========== nextest test summary ==========
73.13 s
gammaloop-nextest-docs> report: target/nextest/ci_gammaloop/junit.xml
73.13 s
gammaloop-nextest-docs> tests: 10, failures: 0, errors: 0
73.13 s
gammaloop-nextest-docs> No failing testcases found.
73.13 s
gammaloop-nextest-docs> =========================================
73.17 s
gammaloop-nextest-docs> Extracting 1 binary to /build/source
73.22 s
gammaloop-nextest-docs> Extracted 4 files to /build/source in 0.06s
73.24 s
gammaloop-nextest-docs> ------------
73.24 s
gammaloop-nextest-docs> Nextest run ID 652cb51e-5af1-430a-a42a-bb39b73da846 with nextest profile: ci_gammaloop
73.24 s
gammaloop-nextest-docs> Starting 0 tests across 1 binary
73.25 s
gammaloop-nextest-docs> ------------
73.25 s
gammaloop-nextest-docs> Summary [ 0.008s] 0 tests run: 0 passed , 0 skipped
73.33 s
gammaloop-nextest-docs>
73.33 s
gammaloop-nextest-docs> ========== nextest test summary ==========
73.33 s
gammaloop-nextest-docs> report: target/nextest/ci_gammaloop/junit.xml
73.33 s
gammaloop-nextest-docs> tests: 0, failures: 0, errors: 0
73.33 s
gammaloop-nextest-docs> No failing testcases found.
73.33 s
gammaloop-nextest-docs> =========================================
73.37 s
gammaloop-nextest-docs> Extracting 1 binary to /build/source
73.46 s
gammaloop-nextest-docs> Extracted 4 files to /build/source in 0.09s
73.51 s
gammaloop-nextest-docs> ------------
73.51 s
gammaloop-nextest-docs> Nextest run ID 60222e3b-1321-4ed0-8bc6-210332d80515 with nextest profile: ci_gammaloop
73.51 s
gammaloop-nextest-docs> Starting 5 tests across 1 binary
73.55 s
gammaloop-nextest-docs> ------------
73.55 s
gammaloop-nextest-docs> Summary [ 0.049s] 5 tests run: 5 passed , 0 skipped
73.62 s
gammaloop-nextest-docs>
73.62 s
gammaloop-nextest-docs> ========== nextest test summary ==========
73.62 s
gammaloop-nextest-docs> report: target/nextest/ci_gammaloop/junit.xml
73.62 s
gammaloop-nextest-docs> tests: 5, failures: 0, errors: 0
73.62 s
gammaloop-nextest-docs> No failing testcases found.
73.62 s
gammaloop-nextest-docs> =========================================
73.98 s
[2 built (1 failed ), 17 error: Cannot build '/nix/store/iba9mhp7j85acznvf18xhmxcpgblqny8-gammaloop-nextest-docs.drv '.
73.98 s
Reason: builder failed with exit code 100 .
73.98 s
Output paths:
73.98 s
/nix/store/dhrilg2md2vkpn5szwq1dqhrk46mlnir-gammaloop-nextest-docs
73.98 s
Last 690 log lines:
73.98 s
> Extracting 2 binaries to /build/source
73.98 s
> Extracted 5 files to /build/source in 0.07s
73.98 s
> ------------
73.98 s
> Nextest run ID 49c2016a-0bbb-443e-8924-01bf7aeb5246 with nextest profile: ci_gammaloop
73.98 s
> Starting 111 tests across 2 binaries
73.98 s
> FAIL [ 0.119s] ( 70/111) alphal00p-docs-builder tests :: checked_in_registry_is_valid
73.98 s
> stdout ---
73.98 s
>
73.98 s
> running 1 test
73.98 s
> test tests::checked_in_registry_is_valid ... FAILED
73.98 s
>
73.98 s
> failures:
73.98 s
>
73.98 s
> failures:
73.98 s
> tests::checked_in_registry_is_valid
73.98 s
>
73.98 s
> test result: FAILED. 0 passed; 1 failed; 0 ignored; 0 measured; 110 filtered out; finished in 0.11s
73.98 s
>
73.98 s
> stderr ---
73.98 s
> warning: developer note gammaloop-architecture still requires a named owner
73.98 s
> warning: developer note integration-dashboard still requires a named owner
73.98 s
> warning: developer note uv-renormalization still requires a named owner
73.98 s
> warning: developer note spenso-parsing-flow still requires a named owner
73.98 s
> warning: developer note schoonschip-network still requires a named owner
73.98 s
> warning: developer note gammaloop-draw-style-migration still requires a named owner
73.98 s
> warning: developer note gammaloop-drawing-architecture still requires a named owner
73.98 s
> warning: developer note spenso-symbolica-syntax-and-rewrites still requires a named owner
73.98 s
> warning: developer note spenso-architecture still requires a named owner
73.98 s
> warning: developer note idenso-architecture still requires a named owner
73.98 s
> warning: developer note idenso-form-color-dirac-source-map still requires a named owner
73.98 s
> warning: developer note linnet-architecture still requires a named owner
73.98 s
> warning: developer note vakint-architecture still requires a named owner
73.98 s
> warning: developer note gammaloop-roadmap still requires a named owner
73.98 s
> warning: developer note cff-surface-cache-ownership still requires a named owner
73.98 s
> warning: developer note gammaloop-drawing-evaluated-fields-history still requires a named owner
73.98 s
> warning: archived developer note gammaloop-drawing-evaluated-fields-history has no immutable evidence revision
73.98 s
> warning: developer note bnl-benchmark-investigation still requires a named owner
73.98 s
> warning: developer note bnl-contraction-order-performance still requires a named owner
73.98 s
> warning: developer note bnl-scalar-alias-capture still requires a named owner
73.98 s
> warning: developer note aa-aa-three-loop-performance-smoke still requires a named owner
73.98 s
> warning: developer note network-simplification still requires a named owner
73.98 s
> warning: investigation developer note network-simplification has no immutable evidence revision
73.98 s
> warning: developer note spenso-large-expressions still requires a named owner
73.98 s
> warning: developer note spenso-improvement-effects still requires a named owner
73.98 s
> warning: archived developer note spenso-improvement-effects has no immutable evidence revision
73.98 s
> warning: developer note spenso-test-baseline still requires a named owner
73.98 s
> warning: archived developer note spenso-test-baseline has no immutable evidence revision
73.98 s
> warning: developer note bnl-evaluator-atom-capture still requires a named owner
73.98 s
> warning: archived developer note bnl-evaluator-atom-capture has no immutable evidence revision
73.98 s
> warning: developer note uv-scalar-profile-benchmark still requires a named owner
73.98 s
> warning: archived developer note uv-scalar-profile-benchmark has no immutable evidence revision
73.98 s
> warning: developer note ci-test-failure-summary-2026-03-25 still requires a named owner
73.98 s
> warning: archived developer note ci-test-failure-summary-2026-03-25 has no immutable evidence revision
73.98 s
> warning: developer note network-execution-rebase-record still requires a named owner
73.98 s
> warning: archived developer note network-execution-rebase-record has no immutable evidence revision
73.98 s
> warning: developer note ratatui-integration-dashboard-history still requires a named owner
73.98 s
> warning: archived developer note ratatui-integration-dashboard-history has no immutable evidence revision
73.98 s
> warning: developer note nix-crane-cache-reuse still requires a named owner
73.98 s
>
73.98 s
> thread 'tests::checked_in_registry_is_valid' (165) panicked at crates/alphal00p-docs-builder/src/lib.rs:11887:50:
73.98 s
> called `Result::unwrap()` on an `Err` value: developer note nix-crane-cache-reuse verified scope flake.nix changed (expected 188504937418859942a6770ca21a4f4e0a7ff125, found 2055acf4433777d5a18c44d88e8416b42a938f3a); owner review or an explicit no-impact attestation is required
73.98 s
>
73.98 s
> Location:
73.98 s
> crates/alphal00p-docs-builder/src/lib.rs:889:21
73.98 s
> stack backtrace:
73.98 s
> 0: __rustc::rust_begin_unwind
73.98 s
> 1: core::panicking::panic_fmt
73.98 s
> 2: core::result::unwrap_failed
73.98 s
> 3: alphal00p_docs_builder::tests::checked_in_registry_is_valid
73.98 s
> 4: <alphal00p_docs_builder::tests::checked_in_registry_is_valid::{closure#0} as core::ops::function::FnOnce<()>>::call_once
73.98 s
> note: Some details are omitted, run with `RUST_BACKTRACE=full` for a verbose backtrace.
73.98 s
>
73.98 s
> FAIL [ 0.126s] ( 85/111) alphal00p-docs-builder tests :: every_product_requires_a_task_chooser_and_each_supported_interface
73.98 s
> stdout ---
73.98 s
>
73.98 s
> running 1 test
73.98 s
> test tests::every_product_requires_a_task_chooser_and_each_supported_interface ... FAILED
73.98 s
>
73.98 s
> failures:
73.98 s
>
73.98 s
> failures:
73.98 s
> tests::every_product_requires_a_task_chooser_and_each_supported_interface
73.98 s
>
73.98 s
> test result: FAILED. 0 passed; 1 failed; 0 ignored; 0 measured; 110 filtered out; finished in 0.12s
73.98 s
>
73.98 s
> stderr ---
73.98 s
> warning: developer note gammaloop-architecture still requires a named owner
73.98 s
> warning: developer note integration-dashboard still requires a named owner
73.98 s
> warning: developer note uv-renormalization still requires a named owner
73.98 s
> warning: developer note spenso-parsing-flow still requires a named owner
73.98 s
> warning: developer note schoonschip-network still requires a named owner
73.98 s
> warning: developer note gammaloop-draw-style-migration still requires a named owner
73.98 s
> warning: developer note gammaloop-drawing-architecture still requires a named owner
73.98 s
> warning: developer note spenso-symbolica-syntax-and-rewrites still requires a named owner
73.98 s
> warning: developer note spenso-architecture still requires a named owner
73.98 s
> warning: developer note idenso-architecture still requires a named owner
73.98 s
> warning: developer note idenso-form-color-dirac-source-map still requires a named owner
73.98 s
> warning: developer note linnet-architecture still requires a named owner
73.98 s
> warning: developer note vakint-architecture still requires a named owner
73.98 s
> warning: developer note gammaloop-roadmap still requires a named owner
73.98 s
> warning: developer note cff-surface-cache-ownership still requires a named owner
73.98 s
> warning: developer note gammaloop-drawing-evaluated-fields-history still requires a named owner
73.98 s
> warning: archived developer note gammaloop-drawing-evaluated-fields-history has no immutable evidence revision
73.98 s
> warning: developer note bnl-benchmark-investigation still requires a named owner
73.98 s
> warning: developer note bnl-contraction-order-performance still requires a named owner
73.98 s
> warning: developer note bnl-scalar-alias-capture still requires a named owner
73.98 s
> warning: developer note aa-aa-three-loop-performance-smoke still requires a named owner
73.98 s
> warning: developer note network-simplification still requires a named owner
73.98 s
> warning: investigation developer note network-simplification has no immutable evidence revision
73.98 s
> warning: developer note spenso-large-expressions still requires a named owner
73.98 s
> warning: developer note spenso-improvement-effects still requires a named owner
73.98 s
> warning: archived developer note spenso-improvement-effects has no immutable evidence revision
73.98 s
> warning: developer note spenso-test-baseline still requires a named owner
73.98 s
> warning: archived developer note spenso-test-baseline has no immutable evidence revision
73.98 s
> warning: developer note bnl-evaluator-atom-capture still requires a named owner
73.98 s
> warning: archived developer note bnl-evaluator-atom-capture has no immutable evidence revision
73.98 s
> warning: developer note uv-scalar-profile-benchmark still requires a named owner
73.98 s
> warning: archived developer note uv-scalar-profile-benchmark has no immutable evidence revision
73.98 s
> warning: developer note ci-test-failure-summary-2026-03-25 still requires a named owner
73.98 s
> warning: archived developer note ci-test-failure-summary-2026-03-25 has no immutable evidence revision
73.98 s
> warning: developer note network-execution-rebase-record still requires a named owner
73.98 s
> warning: archived developer note network-execution-rebase-record has no immutable evidence revision
73.98 s
> warning: developer note ratatui-integration-dashboard-history still requires a named owner
73.98 s
> warning: archived developer note ratatui-integration-dashboard-history has no immutable evidence revision
73.98 s
> warning: developer note nix-crane-cache-reuse still requires a named owner
73.98 s
>
73.98 s
> thread 'tests::every_product_requires_a_task_chooser_and_each_supported_interface' (270) panicked at crates/alphal00p-docs-builder/src/lib.rs:11901:9:
73.98 s
> assertion failed: format!("{error:#}").contains("has no quickstart page")
73.98 s
> stack backtrace:
73.98 s
> 0: __rustc::rust_begin_unwind
73.98 s
> 1: core::panicking::panic_fmt
73.98 s
> 2: core::panicking::panic
73.98 s
> 3: alphal00p_docs_builder::tests::every_product_requires_a_task_chooser_and_each_supported_interface
73.98 s
> 4: <alphal00p_docs_builder::tests::every_product_requires_a_task_chooser_and_each_supported_interface::{closure#0} as core::ops::function::FnOnce<()>>::call_once
73.98 s
> note: Some details are omitted, run with `RUST_BACKTRACE=full` for a verbose backtrace.
73.98 s
>
73.98 s
> FAIL [ 0.113s] ( 98/111) alphal00p-docs-builder tests :: pdf_manual_chapter_order_must_match_the_page_registry
73.98 s
> stdout ---
73.98 s
>
73.98 s
> running 1 test
73.98 s
> test tests::pdf_manual_chapter_order_must_match_the_page_registry ... FAILED
73.98 s
>
73.98 s
> failures:
73.98 s
>
73.98 s
> failures:
73.98 s
> tests::pdf_manual_chapter_order_must_match_the_page_registry
73.98 s
>
73.98 s
> test result: FAILED. 0 passed; 1 failed; 0 ignored; 0 measured; 110 filtered out; finished in 0.11s
73.98 s
>
73.98 s
> stderr ---
73.98 s
> warning: developer note gammaloop-architecture still requires a named owner
73.98 s
> warning: developer note integration-dashboard still requires a named owner
73.98 s
> warning: developer note uv-renormalization still requires a named owner
73.98 s
> warning: developer note spenso-parsing-flow still requires a named owner
73.98 s
> warning: developer note schoonschip-network still requires a named owner
73.98 s
> warning: developer note gammaloop-draw-style-migration still requires a named owner
73.98 s
> warning: developer note gammaloop-drawing-architecture still requires a named owner
73.98 s
> warning: developer note spenso-symbolica-syntax-and-rewrites still requires a named owner
73.98 s
> warning: developer note spenso-architecture still requires a named owner
73.98 s
> warning: developer note idenso-architecture still requires a named owner
73.98 s
> warning: developer note idenso-form-color-dirac-source-map still requires a named owner
73.98 s
> warning: developer note linnet-architecture still requires a named owner
73.98 s
> warning: developer note vakint-architecture still requires a named owner
73.98 s
> warning: developer note gammaloop-roadmap still requires a named owner
73.98 s
> warning: developer note cff-surface-cache-ownership still requires a named owner
73.98 s
> warning: developer note gammaloop-drawing-evaluated-fields-history still requires a named owner
73.98 s
> warning: archived developer note gammaloop-drawing-evaluated-fields-history has no immutable evidence revision
73.98 s
> warning: developer note bnl-benchmark-investigation still requires a named owner
73.98 s
> warning: developer note bnl-contraction-order-performance still requires a named owner
73.98 s
> warning: developer note bnl-scalar-alias-capture still requires a named owner
73.98 s
> warning: developer note aa-aa-three-loop-performance-smoke still requires a named owner
73.98 s
> warning: developer note network-simplification still requires a named owner
73.98 s
> warning: investigation developer note network-simplification has no immutable evidence revision
73.98 s
> warning: developer note spenso-large-expressions still requires a named owner
73.98 s
> warning: developer note spenso-improvement-effects still requires a named owner
73.98 s
> warning: archived developer note spenso-improvement-effects has no immutable evidence revision
73.98 s
> warning: developer note spenso-test-baseline still requires a named owner
73.98 s
> warning: archived developer note spenso-test-baseline has no immutable evidence revision
73.98 s
> warning: developer note bnl-evaluator-atom-capture still requires a named owner
73.98 s
> warning: archived developer note bnl-evaluator-atom-capture has no immutable evidence revision
73.98 s
> warning: developer note uv-scalar-profile-benchmark still requires a named owner
73.98 s
> warning: archived developer note uv-scalar-profile-benchmark has no immutable evidence revision
73.98 s
> warning: developer note ci-test-failure-summary-2026-03-25 still requires a named owner
73.98 s
> warning: archived developer note ci-test-failure-summary-2026-03-25 has no immutable evidence revision
73.98 s
> warning: developer note network-execution-rebase-record still requires a named owner
73.98 s
> warning: archived developer note network-execution-rebase-record has no immutable evidence revision
73.98 s
> warning: developer note ratatui-integration-dashboard-history still requires a named owner
73.98 s
> warning: archived developer note ratatui-integration-dashboard-history has no immutable evidence revision
73.98 s
> warning: developer note nix-crane-cache-reuse still requires a named owner
73.98 s
>
73.98 s
> thread 'tests::pdf_manual_chapter_order_must_match_the_page_registry' (327) panicked at crates/alphal00p-docs-builder/src/lib.rs:11952:9:
73.98 s
> assertion failed: format!("{error:#}").contains("PDF manual chapter order differs")
73.98 s
> stack backtrace:
73.98 s
> 0: __rustc::rust_begin_unwind
73.98 s
> 1: core::panicking::panic_fmt
73.98 s
> 2: core::panicking::panic
73.98 s
> 3: alphal00p_docs_builder::tests::pdf_manual_chapter_order_must_match_the_page_registry
73.98 s
> 4: <alphal00p_docs_builder::tests::pdf_manual_chapter_order_must_match_the_page_registry::{closure#0} as core::ops::function::FnOnce<()>>::call_once
73.98 s
> note: Some details are omitted, run with `RUST_BACKTRACE=full` for a verbose backtrace.
73.98 s
>
73.98 s
> ------------
73.98 s
> Summary [ 20.530s] 111 tests run: 108 passed , 3 failed , 0 skipped
73.98 s
> FAIL [ 0.119s] ( 70/111) alphal00p-docs-builder tests :: checked_in_registry_is_valid
73.98 s
> stdout ---
73.98 s
>
73.98 s
> running 1 test
73.98 s
> test tests::checked_in_registry_is_valid ... FAILED
73.98 s
>
73.98 s
> failures:
73.98 s
>
73.98 s
> failures:
73.98 s
> tests::checked_in_registry_is_valid
73.98 s
>
73.98 s
> test result: FAILED. 0 passed; 1 failed; 0 ignored; 0 measured; 110 filtered out; finished in 0.11s
73.98 s
>
73.98 s
> stderr ---
73.98 s
> warning: developer note gammaloop-architecture still requires a named owner
73.98 s
> warning: developer note integration-dashboard still requires a named owner
73.98 s
> warning: developer note uv-renormalization still requires a named owner
73.98 s
> warning: developer note spenso-parsing-flow still requires a named owner
73.98 s
> warning: developer note schoonschip-network still requires a named owner
73.98 s
> warning: developer note gammaloop-draw-style-migration still requires a named owner
73.98 s
> warning: developer note gammaloop-drawing-architecture still requires a named owner
73.98 s
> warning: developer note spenso-symbolica-syntax-and-rewrites still requires a named owner
73.98 s
> warning: developer note spenso-architecture still requires a named owner
73.98 s
> warning: developer note idenso-architecture still requires a named owner
73.98 s
> warning: developer note idenso-form-color-dirac-source-map still requires a named owner
73.98 s
> warning: developer note linnet-architecture still requires a named owner
73.98 s
> warning: developer note vakint-architecture still requires a named owner
73.98 s
> warning: developer note gammaloop-roadmap still requires a named owner
73.98 s
> warning: developer note cff-surface-cache-ownership still requires a named owner
73.98 s
> warning: developer note gammaloop-drawing-evaluated-fields-history still requires a named owner
73.98 s
> warning: archived developer note gammaloop-drawing-evaluated-fields-history has no immutable evidence revision
73.98 s
> warning: developer note bnl-benchmark-investigation still requires a named owner
73.98 s
> warning: developer note bnl-contraction-order-performance still requires a named owner
73.98 s
> warning: developer note bnl-scalar-alias-capture still requires a named owner
73.98 s
> warning: developer note aa-aa-three-loop-performance-smoke still requires a named owner
73.98 s
> warning: developer note network-simplification still requires a named owner
73.98 s
> warning: investigation developer note network-simplification has no immutable evidence revision
73.98 s
> warning: developer note spenso-large-expressions still requires a named owner
73.98 s
> warning: developer note spenso-improvement-effects still requires a named owner
73.98 s
> warning: archived developer note spenso-improvement-effects has no immutable evidence revision
73.98 s
> warning: developer note spenso-test-baseline still requires a named owner
73.98 s
> warning: archived developer note spenso-test-baseline has no immutable evidence revision
73.98 s
> warning: developer note bnl-evaluator-atom-capture still requires a named owner
73.98 s
> warning: archived developer note bnl-evaluator-atom-capture has no immutable evidence revision
73.98 s
> warning: developer note uv-scalar-profile-benchmark still requires a named owner
73.98 s
> warning: archived developer note uv-scalar-profile-benchmark has no immutable evidence revision
73.98 s
> warning: developer note ci-test-failure-summary-2026-03-25 still requires a named owner
73.98 s
> warning: archived developer note ci-test-failure-summary-2026-03-25 has no immutable evidence revision
73.98 s
> warning: developer note network-execution-rebase-record still requires a named owner
73.98 s
> warning: archived developer note network-execution-rebase-record has no immutable evidence revision
73.98 s
> warning: developer note ratatui-integration-dashboard-history still requires a named owner
73.98 s
> warning: archived developer note ratatui-integration-dashboard-history has no immutable evidence revision
73.98 s
> warning: developer note nix-crane-cache-reuse still requires a named owner
73.98 s
>
73.98 s
> thread 'tests::checked_in_registry_is_valid' (165) panicked at crates/alphal00p-docs-builder/src/lib.rs:11887:50:
73.98 s
> called `Result::unwrap()` on an `Err` value: developer note nix-crane-cache-reuse verified scope flake.nix changed (expected 188504937418859942a6770ca21a4f4e0a7ff125, found 2055acf4433777d5a18c44d88e8416b42a938f3a); owner review or an explicit no-impact attestation is required
73.98 s
>
73.98 s
> Location:
73.98 s
> crates/alphal00p-docs-builder/src/lib.rs:889:21
73.98 s
> stack backtrace:
73.98 s
> 0: __rustc::rust_begin_unwind
73.98 s
> 1: core::panicking::panic_fmt
73.98 s
> 2: core::result::unwrap_failed
73.98 s
> 3: alphal00p_docs_builder::tests::checked_in_registry_is_valid
73.98 s
> 4: <alphal00p_docs_builder::tests::checked_in_registry_is_valid::{closure#0} as core::ops::function::FnOnce<()>>::call_once
73.98 s
> note: Some details are omitted, run with `RUST_BACKTRACE=full` for a verbose backtrace.
73.98 s
>
73.98 s
> FAIL [ 0.126s] ( 85/111) alphal00p-docs-builder tests :: every_product_requires_a_task_chooser_and_each_supported_interface
73.98 s
> stdout ---
73.98 s
>
73.98 s
> running 1 test
73.98 s
> test tests::every_product_requires_a_task_chooser_and_each_supported_interface ... FAILED
73.98 s
>
73.98 s
> failures:
73.98 s
>
73.98 s
> failures:
73.98 s
> tests::every_product_requires_a_task_chooser_and_each_supported_interface
73.98 s
>
73.98 s
> test result: FAILED. 0 passed; 1 failed; 0 ignored; 0 measured; 110 filtered out; finished in 0.12s
73.98 s
>
73.98 s
> stderr ---
73.98 s
> warning: developer note gammaloop-architecture still requires a named owner
73.98 s
> warning: developer note integration-dashboard still requires a named owner
73.98 s
> warning: developer note uv-renormalization still requires a named owner
73.98 s
> warning: developer note spenso-parsing-flow still requires a named owner
73.98 s
> warning: developer note schoonschip-network still requires a named owner
73.98 s
> warning: developer note gammaloop-draw-style-migration still requires a named owner
73.98 s
> warning: developer note gammaloop-drawing-architecture still requires a named owner
73.98 s
> warning: developer note spenso-symbolica-syntax-and-rewrites still requires a named owner
73.98 s
> warning: developer note spenso-architecture still requires a named owner
73.98 s
> warning: developer note idenso-architecture still requires a named owner
73.98 s
> warning: developer note idenso-form-color-dirac-source-map still requires a named owner
73.98 s
> warning: developer note linnet-architecture still requires a named owner
73.98 s
> warning: developer note vakint-architecture still requires a named owner
73.98 s
> warning: developer note gammaloop-roadmap still requires a named owner
73.98 s
> warning: developer note cff-surface-cache-ownership still requires a named owner
73.98 s
> warning: developer note gammaloop-drawing-evaluated-fields-history still requires a named owner
73.98 s
> warning: archived developer note gammaloop-drawing-evaluated-fields-history has no immutable evidence revision
73.98 s
> warning: developer note bnl-benchmark-investigation still requires a named owner
73.98 s
> warning: developer note bnl-contraction-order-performance still requires a named owner
73.98 s
> warning: developer note bnl-scalar-alias-capture still requires a named owner
73.98 s
> warning: developer note aa-aa-three-loop-performance-smoke still requires a named owner
73.98 s
> warning: developer note network-simplification still requires a named owner
73.98 s
> warning: investigation developer note network-simplification has no immutable evidence revision
73.98 s
> warning: developer note spenso-large-expressions still requires a named owner
73.98 s
> warning: developer note spenso-improvement-effects still requires a named owner
73.98 s
> warning: archived developer note spenso-improvement-effects has no immutable evidence revision
73.98 s
> warning: developer note spenso-test-baseline still requires a named owner
73.98 s
> warning: archived developer note spenso-test-baseline has no immutable evidence revision
73.98 s
> warning: developer note bnl-evaluator-atom-capture still requires a named owner
73.98 s
> warning: archived developer note bnl-evaluator-atom-capture has no immutable evidence revision
73.98 s
> warning: developer note uv-scalar-profile-benchmark still requires a named owner
73.98 s
> warning: archived developer note uv-scalar-profile-benchmark has no immutable evidence revision
73.98 s
> warning: developer note ci-test-failure-summary-2026-03-25 still requires a named owner
73.98 s
> warning: archived developer note ci-test-failure-summary-2026-03-25 has no immutable evidence revision
73.98 s
> warning: developer note network-execution-rebase-record still requires a named owner
73.98 s
> warning: archived developer note network-execution-rebase-record has no immutable evidence revision
73.98 s
> warning: developer note ratatui-integration-dashboard-history still requires a named owner
73.98 s
> warning: archived developer note ratatui-integration-dashboard-history has no immutable evidence revision
73.98 s
> warning: developer note nix-crane-cache-reuse still requires a named owner
73.98 s
>
73.98 s
> thread 'tests::every_product_requires_a_task_chooser_and_each_supported_interface' (270) panicked at crates/alphal00p-docs-builder/src/lib.rs:11901:9:
73.98 s
> assertion failed: format!("{error:#}").contains("has no quickstart page")
73.98 s
> stack backtrace:
73.98 s
> 0: __rustc::rust_begin_unwind
73.98 s
> 1: core::panicking::panic_fmt
73.98 s
> 2: core::panicking::panic
73.98 s
> 3: alphal00p_docs_builder::tests::every_product_requires_a_task_chooser_and_each_supported_interface
73.98 s
> 4: <alphal00p_docs_builder::tests::every_product_requires_a_task_chooser_and_each_supported_interface::{closure#0} as core::ops::function::FnOnce<()>>::call_once
73.98 s
> note: Some details are omitted, run with `RUST_BACKTRACE=full` for a verbose backtrace.
73.98 s
>
73.98 s
> FAIL [ 0.113s] ( 98/111) alphal00p-docs-builder tests :: pdf_manual_chapter_order_must_match_the_page_registry
73.98 s
> stdout ---
73.98 s
>
73.98 s
> running 1 test
73.98 s
> test tests::pdf_manual_chapter_order_must_match_the_page_registry ... FAILED
73.98 s
>
73.98 s
> failures:
73.98 s
>
73.98 s
> failures:
73.98 s
> tests::pdf_manual_chapter_order_must_match_the_page_registry
73.98 s
>
73.98 s
> test result: FAILED. 0 passed; 1 failed; 0 ignored; 0 measured; 110 filtered out; finished in 0.11s
73.98 s
>
73.98 s
> stderr ---
73.98 s
> warning: developer note gammaloop-architecture still requires a named owner
73.98 s
> warning: developer note integration-dashboard still requires a named owner
73.98 s
> warning: developer note uv-renormalization still requires a named owner
73.98 s
> warning: developer note spenso-parsing-flow still requires a named owner
73.98 s
> warning: developer note schoonschip-network still requires a named owner
73.98 s
> warning: developer note gammaloop-draw-style-migration still requires a named owner
73.98 s
> warning: developer note gammaloop-drawing-architecture still requires a named owner
73.98 s
> warning: developer note spenso-symbolica-syntax-and-rewrites still requires a named owner
73.98 s
> warning: developer note spenso-architecture still requires a named owner
73.98 s
> warning: developer note idenso-architecture still requires a named owner
73.98 s
> warning: developer note idenso-form-color-dirac-source-map still requires a named owner
73.98 s
> warning: developer note linnet-architecture still requires a named owner
73.98 s
> warning: developer note vakint-architecture still requires a named owner
73.98 s
> warning: developer note gammaloop-roadmap still requires a named owner
73.98 s
> warning: developer note cff-surface-cache-ownership still requires a named owner
73.98 s
> warning: developer note gammaloop-drawing-evaluated-fields-history still requires a named owner
73.98 s
> warning: archived developer note gammaloop-drawing-evaluated-fields-history has no immutable evidence revision
73.98 s
> warning: developer note bnl-benchmark-investigation still requires a named owner
73.98 s
> warning: developer note bnl-contraction-order-performance still requires a named owner
73.98 s
> warning: developer note bnl-scalar-alias-capture still requires a named owner
73.98 s
> warning: developer note aa-aa-three-loop-performance-smoke still requires a named owner
73.98 s
> warning: developer note network-simplification still requires a named owner
73.98 s
> warning: investigation developer note network-simplification has no immutable evidence revision
73.98 s
> warning: developer note spenso-large-expressions still requires a named owner
73.98 s
> warning: developer note spenso-improvement-effects still requires a named owner
73.98 s
> warning: archived developer note spenso-improvement-effects has no immutable evidence revision
73.98 s
> warning: developer note spenso-test-baseline still requires a named owner
73.98 s
> warning: archived developer note spenso-test-baseline has no immutable evidence revision
73.98 s
> warning: developer note bnl-evaluator-atom-capture still requires a named owner
73.98 s
> warning: archived developer note bnl-evaluator-atom-capture has no immutable evidence revision
73.98 s
> warning: developer note uv-scalar-profile-benchmark still requires a named owner
73.98 s
> warning: archived developer note uv-scalar-profile-benchmark has no immutable evidence revision
73.98 s
> warning: developer note ci-test-failure-summary-2026-03-25 still requires a named owner
73.98 s
> warning: archived developer note ci-test-failure-summary-2026-03-25 has no immutable evidence revision
73.98 s
> warning: developer note network-execution-rebase-record still requires a named owner
73.98 s
> warning: archived developer note network-execution-rebase-record has no immutable evidence revision
73.98 s
> warning: developer note ratatui-integration-dashboard-history still requires a named owner
73.98 s
> warning: archived developer note ratatui-integration-dashboard-history has no immutable evidence revision
73.98 s
> warning: developer note nix-crane-cache-reuse still requires a named owner
73.98 s
>
73.98 s
> thread 'tests::pdf_manual_chapter_order_must_match_the_page_registry' (327) panicked at crates/alphal00p-docs-builder/src/lib.rs:11952:9:
73.98 s
> assertion failed: format!("{error:#}").contains("PDF manual chapter order differs")
73.98 s
> stack backtrace:
73.98 s
> 0: __rustc::rust_begin_unwind
73.98 s
> 1: core::panicking::panic_fmt
73.98 s
> 2: core::panicking::panic
73.98 s
> 3: alphal00p_docs_builder::tests::pdf_manual_chapter_order_must_match_the_page_registry
73.98 s
> 4: <alphal00p_docs_builder::tests::pdf_manual_chapter_order_must_match_the_page_registry::{closure#0} as core::ops::function::FnOnce<()>>::call_once
73.98 s
> note: Some details are omitted, run with `RUST_BACKTRACE=full` for a verbose backtrace.
73.98 s
>
73.98 s
> error : test run failed
73.98 s
>
73.98 s
> ========== nextest test summary ==========
73.98 s
> report: target/nextest/ci_gammaloop/junit.xml
73.98 s
> tests: 111, failures: 3, errors: 0
73.98 s
>
73.98 s
> 1. alphal00p-docs-builder::tests::checked_in_registry_is_valid
73.98 s
> failure: test failure with exit code 101
73.98 s
> thread 'tests::checked_in_registry_is_valid' (165) panicked at crates/alphal00p-docs-builder/src/lib.rs:11887:50:
73.98 s
> called `Result::unwrap()` on an `Err` value: developer note nix-crane-cache-reuse verified scope flake.nix changed (expected 188504937418859942a6770ca21a4f4e0a7ff125, found 2055acf4433777d5a18c44d88e8416b42a938f3a); owner review or an explicit no-impact attestation is required
73.98 s
>
73.98 s
> Location:
73.98 s
> crates/alphal00p-docs-builder/src/lib.rs:889:21
73.98 s
> stack backtrace:
73.98 s
> 0: __rustc::rust_begin_unwind
73.98 s
> 1: core::panicking::panic_fmt
73.98 s
> 2: core::result::unwrap_failed
73.98 s
> 3: alphal00p_docs_builder::tests::checked_in_registry_is_valid
73.98 s
> 4: <alphal00p_docs_builder::tests::checked_in_registry_is_valid::{closure#0} as core::ops::function::FnOnce<()>>::call_once
73.98 s
> note: Some details are omitted, run with `RUST_BACKTRACE=full` for a verbose backtrace.
73.98 s
> system-out
73.98 s
> running 1 test
73.98 s
> test tests::checked_in_registry_is_valid ... FAILED
73.98 s
>
73.98 s
> failures:
73.98 s
>
73.98 s
> failures:
73.98 s
> tests::checked_in_registry_is_valid
73.98 s
>
73.98 s
> test result: FAILED. 0 passed; 1 failed; 0 ignored; 0 measured; 110 filtered out; finished in 0.11s
73.98 s
> system-err
73.98 s
> warning: developer note gammaloop-architecture still requires a named owner
73.98 s
> warning: developer note integration-dashboard still requires a named owner
73.98 s
> warning: developer note uv-renormalization still requires a named owner
73.98 s
> warning: developer note spenso-parsing-flow still requires a named owner
73.98 s
> warning: developer note schoonschip-network still requires a named owner
73.98 s
> warning: developer note gammaloop-draw-style-migration still requires a named owner
73.98 s
> warning: developer note gammaloop-drawing-architecture still requires a named owner
73.98 s
> warning: developer note spenso-symbolica-syntax-and-rewrites still requires a named owner
73.98 s
> warning: developer note spenso-architecture still requires a named owner
73.98 s
> warning: developer note idenso-architecture still requires a named owner
73.98 s
> warning: developer note idenso-form-color-dirac-source-map still requires a named owner
73.98 s
> warning: developer note linnet-architecture still requires a named owner
73.98 s
> warning: developer note vakint-architecture still requires a named owner
73.98 s
> warning: developer note gammaloop-roadmap still requires a named owner
73.98 s
> warning: developer note cff-surface-cache-ownership still requires a named owner
73.98 s
> warning: developer note gammaloop-drawing-evaluated-fields-history still requires a named owner
73.98 s
> warning: archived developer note gammaloop-drawing-evaluated-fields-history has no immutable evidence revision
73.98 s
> warning: developer note bnl-benchmark-investigation still requires a named owner
73.98 s
> warning: developer note bnl-contraction-order-performance still requires a named owner
73.98 s
> warning: developer note bnl-scalar-alias-capture still requires a named owner
73.98 s
> warning: developer note aa-aa-three-loop-performance-smoke still requires a named owner
73.98 s
> warning: developer note network-simplification still requires a named owner
73.98 s
> warning: investigation developer note network-simplification has no immutable evidence revision
73.98 s
> warning: developer note spenso-large-expressions still requires a named owner
73.98 s
> warning: developer note spenso-improvement-effects still requires a named owner
73.98 s
> warning: archived developer note spenso-improvement-effects has no immutable evidence revision
73.98 s
> warning: developer note spenso-test-baseline still requires a named owner
73.98 s
> warning: archived developer note spenso-test-baseline has no immutable evidence revision
73.98 s
> warning: developer note bnl-evaluator-atom-capture still requires a named owner
73.98 s
> warning: archived developer note bnl-evaluator-atom-capture has no immutable evidence revision
73.98 s
> warning: developer note uv-scalar-profile-benchmark still requires a named owner
73.98 s
> warning: archived developer note uv-scalar-profile-benchmark has no immutable evidence revision
73.98 s
> warning: developer note ci-test-failure-summary-2026-03-25 still requires a named owner
73.98 s
> warning: archived developer note ci-test-failure-summary-2026-03-25 has no immutable evidence revision
73.98 s
> warning: developer note network-execution-rebase-record still requires a named owner
73.98 s
> warning: archived developer note network-execution-rebase-record has no immutable evidence revision
73.98 s
> warning: developer note ratatui-integration-dashboard-history still requires a named owner
73.98 s
> warning: archived developer note ratatui-integration-dashboard-history has no immutable evidence revision
73.98 s
> warning: developer note nix-crane-cache-reuse still requires a named owner
73.98 s
>
73.98 s
> thread 'tests::checked_in_registry_is_valid' (165) panicked at crates/alphal00p-docs-builder/src/lib.rs:11887:50:
73.98 s
> called `Result::unwrap()` on an `Err` value: developer note nix-crane-cache-reuse verified scope flake.nix changed (expected 188504937418859942a6770ca21a4f4e0a7ff125, found 2055acf4433777d5a18c44d88e8416b42a938f3a); owner review or an explicit no-impact attestation is required
73.98 s
>
73.98 s
> Location:
73.98 s
> crates/alphal00p-docs-builder/src/lib.rs:889:21
73.98 s
> stack backtrace:
73.98 s
> 0: __rustc::rust_begin_unwind
73.98 s
> 1: core::panicking::panic_fmt
73.98 s
> 2: core::result::unwrap_failed
73.98 s
> 3: alphal00p_docs_builder::tests::checked_in_registry_is_valid
73.98 s
> 4: <alphal00p_docs_builder::tests::checked_in_registry_is_valid::{closure#0} as core::ops::function::FnOnce<()>>::call_once
73.98 s
> note: Some details are omitted, run with `RUST_BACKTRACE=full` for a verbose backtrace.
73.98 s
>
73.98 s
> 2. alphal00p-docs-builder::tests::every_product_requires_a_task_chooser_and_each_supported_interface
73.98 s
> failure: test failure with exit code 101
73.98 s
> thread 'tests::every_product_requires_a_task_chooser_and_each_supported_interface' (270) panicked at crates/alphal00p-docs-builder/src/lib.rs:11901:9:
73.98 s
> assertion failed: format!("{error:#}").contains("has no quickstart page")
73.98 s
> stack backtrace:
73.98 s
> 0: __rustc::rust_begin_unwind
73.98 s
> 1: core::panicking::panic_fmt
73.98 s
> 2: core::panicking::panic
73.98 s
> 3: alphal00p_docs_builder::tests::every_product_requires_a_task_chooser_and_each_supported_interface
73.98 s
> 4: <alphal00p_docs_builder::tests::every_product_requires_a_task_chooser_and_each_supported_interface::{closure#0} as core::ops::function::FnOnce<()>>::call_once
73.98 s
> note: Some details are omitted, run with `RUST_BACKTRACE=full` for a verbose backtrace.
73.98 s
> system-out
73.98 s
> running 1 test
73.98 s
> test tests::every_product_requires_a_task_chooser_and_each_supported_interface ... FAILED
73.98 s
>
73.98 s
> failures:
73.98 s
>
73.98 s
> failures:
73.98 s
> tests::every_product_requires_a_task_chooser_and_each_supported_interface
73.98 s
>
73.98 s
> test result: FAILED. 0 passed; 1 failed; 0 ignored; 0 measured; 110 filtered out; finished in 0.12s
73.98 s
> system-err
73.98 s
> warning: developer note gammaloop-architecture still requires a named owner
73.98 s
> warning: developer note integration-dashboard still requires a named owner
73.98 s
> warning: developer note uv-renormalization still requires a named owner
73.98 s
> warning: developer note spenso-parsing-flow still requires a named owner
73.98 s
> warning: developer note schoonschip-network still requires a named owner
73.98 s
> warning: developer note gammaloop-draw-style-migration still requires a named owner
73.98 s
> warning: developer note gammaloop-drawing-architecture still requires a named owner
73.98 s
> warning: developer note spenso-symbolica-syntax-and-rewrites still requires a named owner
73.98 s
> warning: developer note spenso-architecture still requires a named owner
73.98 s
> warning: developer note idenso-architecture still requires a named owner
73.98 s
> warning: developer note idenso-form-color-dirac-source-map still requires a named owner
73.98 s
> warning: developer note linnet-architecture still requires a named owner
73.98 s
> warning: developer note vakint-architecture still requires a named owner
73.98 s
> warning: developer note gammaloop-roadmap still requires a named owner
73.98 s
> warning: developer note cff-surface-cache-ownership still requires a named owner
73.98 s
> warning: developer note gammaloop-drawing-evaluated-fields-history still requires a named owner
73.98 s
> warning: archived developer note gammaloop-drawing-evaluated-fields-history has no immutable evidence revision
73.98 s
> warning: developer note bnl-benchmark-investigation still requires a named owner
73.98 s
> warning: developer note bnl-contraction-order-performance still requires a named owner
73.98 s
> warning: developer note bnl-scalar-alias-capture still requires a named owner
73.98 s
> warning: developer note aa-aa-three-loop-performance-smoke still requires a named owner
73.98 s
> warning: developer note network-simplification still requires a named owner
73.98 s
> warning: investigation developer note network-simplification has no immutable evidence revision
73.98 s
> warning: developer note spenso-large-expressions still requires a named owner
73.98 s
> warning: developer note spenso-improvement-effects still requires a named owner
73.98 s
> warning: archived developer note spenso-improvement-effects has no immutable evidence revision
73.98 s
> warning: developer note spenso-test-baseline still requires a named owner
73.98 s
> warning: archived developer note spenso-test-baseline has no immutable evidence revision
73.98 s
> warning: developer note bnl-evaluator-atom-capture still requires a named owner
73.98 s
> warning: archived developer note bnl-evaluator-atom-capture has no immutable evidence revision
73.98 s
> warning: developer note uv-scalar-profile-benchmark still requires a named owner
73.98 s
> warning: archived developer note uv-scalar-profile-benchmark has no immutable evidence revision
73.98 s
> warning: developer note ci-test-failure-summary-2026-03-25 still requires a named owner
73.98 s
> warning: archived developer note ci-test-failure-summary-2026-03-25 has no immutable evidence revision
73.98 s
> warning: developer note network-execution-rebase-record still requires a named owner
73.98 s
> warning: archived developer note network-execution-rebase-record has no immutable evidence revision
73.98 s
> warning: developer note ratatui-integration-dashboard-history still requires a named owner
73.98 s
> warning: archived developer note ratatui-integration-dashboard-history has no immutable evidence revision
73.98 s
> warning: developer note nix-crane-cache-reuse still requires a named owner
73.98 s
>
73.98 s
> thread 'tests::every_product_requires_a_task_chooser_and_each_supported_interface' (270) panicked at crates/alphal00p-docs-builder/src/lib.rs:11901:9:
73.98 s
> assertion failed: format!("{error:#}").contains("has no quickstart page")
73.98 s
> stack backtrace:
73.98 s
> 0: __rustc::rust_begin_unwind
73.98 s
> 1: core::panicking::panic_fmt
73.98 s
> 2: core::panicking::panic
73.98 s
> 3: alphal00p_docs_builder::tests::every_product_requires_a_task_chooser_and_each_supported_interface
73.98 s
> 4: <alphal00p_docs_builder::tests::every_product_requires_a_task_chooser_and_each_supported_interface::{closure#0} as core::ops::function::FnOnce<()>>::call_once
73.98 s
> note: Some details are omitted, run with `RUST_BACKTRACE=full` for a verbose backtrace.
73.98 s
>
73.98 s
> 3. alphal00p-docs-builder::tests::pdf_manual_chapter_order_must_match_the_page_registry
73.98 s
> failure: test failure with exit code 101
73.98 s
> thread 'tests::pdf_manual_chapter_order_must_match_the_page_registry' (327) panicked at crates/alphal00p-docs-builder/src/lib.rs:11952:9:
73.98 s
> assertion failed: format!("{error:#}").contains("PDF manual chapter order differs")
73.98 s
> stack backtrace:
73.98 s
> 0: __rustc::rust_begin_unwind
73.98 s
> 1: core::panicking::panic_fmt
73.98 s
> 2: core::panicking::panic
73.98 s
> 3: alphal00p_docs_builder::tests::pdf_manual_chapter_order_must_match_the_page_registry
73.98 s
> 4: <alphal00p_docs_builder::tests::pdf_manual_chapter_order_must_match_the_page_registry::{closure#0} as core::ops::function::FnOnce<()>>::call_once
73.98 s
> note: Some details are omitted, run with `RUST_BACKTRACE=full` for a verbose backtrace.
73.98 s
> system-out
73.98 s
> running 1 test
73.98 s
> test tests::pdf_manual_chapter_order_must_match_the_page_registry ... FAILED
73.98 s
>
73.98 s
> failures:
73.98 s
>
73.98 s
> failures:
73.98 s
> tests::pdf_manual_chapter_order_must_match_the_page_registry
73.98 s
>
73.98 s
> test result: FAILED. 0 passed; 1 failed; 0 ignored; 0 measured; 110 filtered out; finished in 0.11s
73.98 s
> system-err
73.98 s
> warning: developer note gammaloop-architecture still requires a named owner
73.98 s
> warning: developer note integration-dashboard still requires a named owner
73.98 s
> warning: developer note uv-renormalization still requires a named owner
73.98 s
> warning: developer note spenso-parsing-flow still requires a named owner
73.98 s
> warning: developer note schoonschip-network still requires a named owner
73.98 s
> warning: developer note gammaloop-draw-style-migration still requires a named owner
73.98 s
> warning: developer note gammaloop-drawing-architecture still requires a named owner
73.98 s
> warning: developer note spenso-symbolica-syntax-and-rewrites still requires a named owner
73.98 s
> warning: developer note spenso-architecture still requires a named owner
73.98 s
> warning: developer note idenso-architecture still requires a named owner
73.98 s
> warning: developer note idenso-form-color-dirac-source-map still requires a named owner
73.98 s
> warning: developer note linnet-architecture still requires a named owner
73.98 s
> warning: developer note vakint-architecture still requires a named owner
73.98 s
> warning: developer note gammaloop-roadmap still requires a named owner
73.98 s
> warning: developer note cff-surface-cache-ownership still requires a named owner
73.98 s
> warning: developer note gammaloop-drawing-evaluated-fields-history still requires a named owner
73.98 s
> warning: archived developer note gammaloop-drawing-evaluated-fields-history has no immutable evidence revision
73.98 s
> warning: developer note bnl-benchmark-investigation still requires a named owner
73.98 s
> warning: developer note bnl-contraction-order-performance still requires a named owner
73.98 s
> warning: developer note bnl-scalar-alias-capture still requires a named owner
73.98 s
> warning: developer note aa-aa-three-loop-performance-smoke still requires a named owner
73.98 s
> warning: developer note network-simplification still requires a named owner
73.98 s
> warning: investigation developer note network-simplification has no immutable evidence revision
73.98 s
> warning: developer note spenso-large-expressions still requires a named owner
73.98 s
> warning: developer note spenso-improvement-effects still requires a named owner
73.98 s
> warning: archived developer note spenso-improvement-effects has no immutable evidence revision
73.98 s
> warning: developer note spenso-test-baseline still requires a named owner
73.98 s
> warning: archived developer note spenso-test-baseline has no immutable evidence revision
73.98 s
> warning: developer note bnl-evaluator-atom-capture still requires a named owner
73.98 s
> warning: archived developer note bnl-evaluator-atom-capture has no immutable evidence revision
73.98 s
> warning: developer note uv-scalar-profile-benchmark still requires a named owner
73.98 s
> warning: archived developer note uv-scalar-profile-benchmark has no immutable evidence revision
73.98 s
> warning: developer note ci-test-failure-summary-2026-03-25 still requires a named owner
73.98 s
> warning: archived developer note ci-test-failure-summary-2026-03-25 has no immutable evidence revision
73.98 s
> warning: developer note network-execution-rebase-record still requires a named owner
73.98 s
> warning: archived developer note network-execution-rebase-record has no immutable evidence revision
73.98 s
> warning: developer note ratatui-integration-dashboard-history still requires a named owner
73.98 s
> warning: archived developer note ratatui-integration-dashboard-history has no immutable evidence revision
73.98 s
> warning: developer note nix-crane-cache-reuse still requires a named owner
73.98 s
>
73.98 s
> thread 'tests::pdf_manual_chapter_order_must_match_the_page_registry' (327) panicked at crates/alphal00p-docs-builder/src/lib.rs:11952:9:
73.98 s
> assertion failed: format!("{error:#}").contains("PDF manual chapter order differs")
73.98 s
> stack backtrace:
73.98 s
> 0: __rustc::rust_begin_unwind
73.98 s
> 1: core::panicking::panic_fmt
73.98 s
> 2: core::panicking::panic
73.98 s
> 3: alphal00p_docs_builder::tests::pdf_manual_chapter_order_must_match_the_page_registry
73.98 s
> 4: <alphal00p_docs_builder::tests::pdf_manual_chapter_order_must_match_the_page_registry::{closure#0} as core::ops::function::FnOnce<()>>::call_once
73.98 s
> note: Some details are omitted, run with `RUST_BACKTRACE=full` for a verbose backtrace.
73.98 s
> =========================================
73.98 s
> Extracting 2 binaries to /build/source
73.98 s
> Extracted 5 files to /build/source in 0.06s
73.98 s
> ------------
73.98 s
> Nextest run ID 1d3999e8-c2e5-45d2-ae24-d6e7fa86840b with nextest profile: ci_gammaloop
73.98 s
> Starting 22 tests across 2 binaries
73.98 s
> ------------
73.98 s
> Summary [ 0.026s] 22 tests run: 22 passed , 0 skipped
73.98 s
>
73.98 s
> ========== nextest test summary ==========
73.98 s
> report: target/nextest/ci_gammaloop/junit.xml
73.98 s
> tests: 22, failures: 0, errors: 0
73.98 s
> No failing testcases found.
73.98 s
> =========================================
73.98 s
> Extracting 3 binaries (including 2 non-test binaries), 1 build script output directory, and 2 linked paths to /build/source
73.98 s
> Extracted 22 files to /build/source in 0.40s
73.98 s
> ------------
73.98 s
> Nextest run ID 3f0845e9-b888-46a0-a4d7-80b73b7070f3 with nextest profile: ci_gammaloop
73.98 s
> Starting 89 tests across 1 binary
73.98 s
> ------------
73.98 s
> Summary [ 0.061s] 89 tests run: 89 passed , 0 skipped
73.98 s
>
73.98 s
> ========== nextest test summary ==========
73.98 s
> report: target/nextest/ci_gammaloop/junit.xml
73.98 s
> tests: 89, failures: 0, errors: 0
73.98 s
> No failing testcases found.
73.98 s
> =========================================
73.98 s
> Extracting 2 binaries to /build/source
73.98 s
> Extracted 5 files to /build/source in 0.06s
73.98 s
> ------------
73.98 s
> Nextest run ID 5dc8bf56-c159-4097-bca6-094dafefa799 with nextest profile: ci_gammaloop
73.98 s
> Starting 10 tests across 2 binaries
73.98 s
> ------------
73.98 s
> Summary [ 20.985s] 10 tests run: 10 passed , 0 skipped
73.98 s
>
73.98 s
> ========== nextest test summary ==========
73.98 s
> report: target/nextest/ci_gammaloop/junit.xml
73.98 s
> tests: 10, failures: 0, errors: 0
73.98 s
> No failing testcases found.
73.98 s
> =========================================
73.98 s
> Extracting 1 binary to /build/source
73.98 s
> Extracted 4 files to /build/source in 0.06s
73.98 s
> ------------
73.98 s
> Nextest run ID 652cb51e-5af1-430a-a42a-bb39b73da846 with nextest profile: ci_gammaloop
73.98 s
> Starting 0 tests across 1 binary
73.98 s
> ------------
73.98 s
> Summary [ 0.008s] 0 tests run: 0 passed , 0 skipped
73.98 s
>
73.98 s
> ========== nextest test summary ==========
73.98 s
> report: target/nextest/ci_gammaloop/junit.xml
73.98 s
> tests: 0, failures: 0, errors: 0
73.98 s
> No failing testcases found.
73.98 s
> =========================================
73.98 s
> Extracting 1 binary to /build/source
73.98 s
> Extracted 4 files to /build/source in 0.09s
73.98 s
> ------------
73.98 s
> Nextest run ID 60222e3b-1321-4ed0-8bc6-210332d80515 with nextest profile: ci_gammaloop
73.98 s
> Starting 5 tests across 1 binary
73.98 s
> ------------
73.98 s
> Summary [ 0.049s] 5 tests run: 5 passed , 0 skipped
73.98 s
>
73.98 s
> ========== nextest test summary ==========
73.98 s
> report: target/nextest/ci_gammaloop/junit.xml
73.98 s
> tests: 5, failures: 0, errors: 0
73.98 s
> No failing testcases found.
73.98 s
> =========================================
73.98 s
For full logs, run:
73.98 s
nix log /nix/store/iba9mhp7j85acznvf18xhmxcpgblqny8-gammaloop-nextest-docs.drv
74.21 s
Run failed.