1. 0.01 s $ /nix/store/9ypz3flqsrl5xl495mm8h645gadjsxi1-coreutils-9.11/bin/timeout --kill-after=15s 7200s /nix/store/23zk8sgzamrbmj1fday15szf7f2279s8-nix-2.34.7/bin/nix --extra-experimental-features nix-command --extra-experimental-features flakes flake clone git+https://github.com/alphal00p/gammaloop --dest /tmp/nix-ci-worker/stable-pwd/repo/
  2. 0.21 s Cloning into '/tmp/nix-ci-worker/stable-pwd/repo'...
  3. 1.72 s remote: Enumerating objects: 79689, done.
  4. 1.96 s remote: Counting objects: 0% (1/9284) remote: Counting objects: 1% (93/9284) remote: Counting objects: 2% (186/9284) remote: Counting objects: 3% (279/9284) remote: Counting objects: 4% (372/9284) remote: Counting objects: 5% (465/9284) remote: Counting objects: 6% (558/9284) remote: Counting objects: 7% (650/9284) remote: Counting objects: 8% (743/9284) remote: Counting objects: 9% (836/9284) remote: Counting objects: 10% (929/9284) remote: Counting objects: 11% (1022/9284) remote: Counting objects: 12% (1115/9284) remote: Counting objects: 13% (1207/9284) remote: Counting objects: 14% (1300/9284) remote: Counting objects: 15% (1393/9284) remote: Counting objects: 16% (1486/9284) remote: Counting objects: 17% (1579/9284) remote: Counting objects: 18% (1672/9284) remote: Counting objects: 19% (1764/9284) remote: Counting objects: 20% (1857/9284) remote: Counting objects: 21% (1950/9284) remote: Counting objects: 22% (2043/9284) remote: Counting objects: 23% (2136/9284) remote: Counting objects: 24% (2229/9284) remote: Counting objects: 25% (2321/9284) remote: Counting objects: 26% (2414/9284) remote: Counting objects: 27% (2507/9284) remote: Counting objects: 28% (2600/9284) remote: Counting objects: 29% (2693/9284) remote: Counting objects: 30% (2786/9284) remote: Counting objects: 31% (2879/9284) remote: Counting objects: 32% (2971/9284) remote: Counting objects: 33% (3064/9284) remote: Counting objects: 34% (3157/9284) remote: Counting objects: 35% (3250/9284) remote: Counting objects: 36% (3343/9284) remote: Counting objects: 37% (3436/9284) remote: Counting objects: 38% (3528/9284) remote: Counting objects: 39% (3621/9284) remote: Counting objects: 40% (3714/9284) remote: Counting objects: 41% (3807/9284) remote: Counting objects: 42% (3900/9284) remote: Counting objects: 43% (3993/9284) remote: Counting objects: 44% (4085/9284) remote: Counting objects: 45% (4178/9284) remote: Counting objects: 46% (4271/9284) remote: Counting objects: 47% (4364/9284) remote: Counting objects: 48% (4457/9284) remote: Counting objects: 49% (4550/9284) remote: Counting objects: 50% (4642/9284) remote: Counting objects: 51% (4735/9284) remote: Counting objects: 52% (4828/9284) remote: Counting objects: 53% (4921/9284) remote: Counting objects: 54% (5014/9284) remote: Counting objects: 55% (5107/9284) remote: Counting objects: 56% (5200/9284) remote: Counting objects: 57% (5292/9284) remote: Counting objects: 58% (5385/9284) remote: Counting objects: 59% (5478/9284) remote: Counting objects: 60% (5571/9284) remote: Counting objects: 61% (5664/9284) remote: Counting objects: 62% (5757/9284) remote: Counting objects: 63% (5849/9284) remote: Counting objects: 64% (5942/9284) remote: Counting objects: 65% (6035/9284) remote: Counting objects: 66% (6128/9284) remote: Counting objects: 67% (6221/9284) remote: Counting objects: 68% (6314/9284) remote: Counting objects: 69% (6406/9284) remote: Counting objects: 70% (6499/9284) remote: Counting objects: 71% (6592/9284) remote: Counting objects: 72% (6685/9284) remote: Counting objects: 73% (6778/9284) remote: Counting objects: 74% (6871/9284) remote: Counting objects: 75% (6963/9284) remote: Counting objects: 76% (7056/9284) remote: Counting objects: 77% (7149/9284) remote: Counting objects: 78% (7242/9284) remote: Counting objects: 79% (7335/9284) remote: Counting objects: 80% (7428/9284) remote: Counting objects: 81% (7521/9284) remote: Counting objects: 82% (7613/9284) remote: Counting objects: 83% (7706/9284) remote: Counting objects: 84% (7799/9284) remote: Counting objects: 85% (7892/9284) remote: Counting objects: 86% (7985/9284) remote: Counting objects: 87% (8078/9284) remote: Counting objects: 88% (8170/9284) remote: Counting objects: 89% (8263/9284) remote: Counting objects: 90% (8356/9284) remote: Counting objects: 91% (8449/9284) remote: Counting objects: 92% (8542/9284) remote: Counting objects: 93% (8635/9284) remote: Counting objects: 94% (8727/9284) remote: Counting objects: 95% (8820/9284) remote: Counting objects: 96% (8913/9284) remote: Counting objects: 97% (9006/9284) remote: Counting objects: 98% (9099/9284) remote: Counting objects: 99% (9192/9284) remote: Counting objects: 100% (9284/9284) remote: Counting objects: 100% (9284/9284), done.
  5. 3.95 s remote: Compressing objects: 0% (1/2087) remote: Compressing objects: 1% (21/2087) remote: Compressing objects: 2% (42/2087) remote: Compressing objects: 3% (63/2087) remote: Compressing objects: 4% (84/2087) remote: Compressing objects: 5% (105/2087) remote: Compressing objects: 6% (126/2087) remote: Compressing objects: 7% (147/2087) remote: Compressing objects: 8% (167/2087) remote: Compressing objects: 9% (188/2087) remote: Compressing objects: 10% (209/2087) remote: Compressing objects: 11% (230/2087) remote: Compressing objects: 12% (251/2087) remote: Compressing objects: 13% (272/2087) remote: Compressing objects: 14% (293/2087) remote: Compressing objects: 15% (314/2087) remote: Compressing objects: 15% (323/2087) remote: Compressing objects: 16% (334/2087) remote: Compressing objects: 17% (355/2087) remote: Compressing objects: 18% (376/2087) remote: Compressing objects: 19% (397/2087) remote: Compressing objects: 20% (418/2087) remote: Compressing objects: 21% (439/2087) remote: Compressing objects: 22% (460/2087) remote: Compressing objects: 23% (481/2087) remote: Compressing objects: 24% (501/2087) remote: Compressing objects: 25% (522/2087) remote: Compressing objects: 26% (543/2087) remote: Compressing objects: 27% (564/2087) remote: Compressing objects: 28% (585/2087) remote: Compressing objects: 28% (602/2087) remote: Compressing objects: 29% (606/2087) remote: Compressing objects: 30% (627/2087) remote: Compressing objects: 31% (647/2087) remote: Compressing objects: 32% (668/2087) remote: Compressing objects: 33% (689/2087) remote: Compressing objects: 34% (710/2087) remote: Compressing objects: 35% (731/2087) remote: Compressing objects: 36% (752/2087) remote: Compressing objects: 37% (773/2087) remote: Compressing objects: 38% (794/2087) remote: Compressing objects: 39% (814/2087) remote: Compressing objects: 40% (835/2087) remote: Compressing objects: 41% (856/2087) remote: Compressing objects: 42% (877/2087) remote: Compressing objects: 43% (898/2087) remote: Compressing objects: 44% (919/2087) remote: Compressing objects: 45% (940/2087) remote: Compressing objects: 46% (961/2087) remote: Compressing objects: 47% (981/2087) remote: Compressing objects: 48% (1002/2087) remote: Compressing objects: 49% (1023/2087) remote: Compressing objects: 50% (1044/2087) remote: Compressing objects: 51% (1065/2087) remote: Compressing objects: 52% (1086/2087) remote: Compressing objects: 53% (1107/2087) remote: Compressing objects: 54% (1127/2087) remote: Compressing objects: 55% (1148/2087) remote: Compressing objects: 56% (1169/2087) remote: Compressing objects: 57% (1190/2087) remote: Compressing objects: 58% (1211/2087) remote: Compressing objects: 59% (1232/2087) remote: Compressing objects: 60% (1253/2087) remote: Compressing objects: 61% (1274/2087) remote: Compressing objects: 62% (1294/2087) remote: Compressing objects: 63% (1315/2087) remote: Compressing objects: 64% (1336/2087) remote: Compressing objects: 65% (1357/2087) remote: Compressing objects: 66% (1378/2087) remote: Compressing objects: 67% (1399/2087) remote: Compressing objects: 68% (1420/2087) remote: Compressing objects: 69% (1441/2087) remote: Compressing objects: 70% (1461/2087) remote: Compressing objects: 71% (1482/2087) remote: Compressing objects: 72% (1503/2087) remote: Compressing objects: 73% (1524/2087) remote: Compressing objects: 74% (1545/2087) remote: Compressing objects: 75% (1566/2087) remote: Compressing objects: 76% (1587/2087) remote: Compressing objects: 77% (1607/2087) remote: Compressing objects: 78% (1628/2087) remote: Compressing objects: 79% (1649/2087) remote: Compressing objects: 80% (1670/2087) remote: Compressing objects: 81% (1691/2087) remote: Compressing objects: 82% (1712/2087) remote: Compressing objects: 83% (1733/2087) remote: Compressing objects: 84% (1754/2087) remote: Compressing objects: 85% (1774/2087) remote: Compressing objects: 86% (1795/2087) remote: Compressing objects: 87% (1816/2087) remote: Compressing objects: 88% (1837/2087) remote: Compressing objects: 89% (1858/2087) remote: Compressing objects: 90% (1879/2087) remote: Compressing objects: 91% (1900/2087) remote: Compressing objects: 92% (1921/2087) remote: Compressing objects: 93% (1941/2087) remote: Compressing objects: 94% (1962/2087) remote: Compressing objects: 95% (1983/2087) remote: Compressing objects: 96% (2004/2087) remote: Compressing objects: 97% (2025/2087) remote: Compressing objects: 98% (2046/2087) remote: Compressing objects: 99% (2067/2087) remote: Compressing objects: 100% (2087/2087) remote: Compressing objects: 100% (2087/2087), done.
  6. 8.17 s Receiving objects: 0% (1/79689) Receiving objects: 1% (797/79689) Receiving objects: 2% (1594/79689) Receiving objects: 3% (2391/79689) Receiving objects: 4% (3188/79689) Receiving objects: 5% (3985/79689) Receiving objects: 6% (4782/79689), 9.28 MiB | 18.54 MiB/s Receiving objects: 7% (5579/79689), 9.28 MiB | 18.54 MiB/s Receiving objects: 8% (6376/79689), 9.28 MiB | 18.54 MiB/s Receiving objects: 9% (7173/79689), 9.28 MiB | 18.54 MiB/s Receiving objects: 10% (7969/79689), 9.28 MiB | 18.54 MiB/s Receiving objects: 11% (8766/79689), 9.28 MiB | 18.54 MiB/s Receiving objects: 12% (9563/79689), 9.28 MiB | 18.54 MiB/s Receiving objects: 13% (10360/79689), 9.28 MiB | 18.54 MiB/s Receiving objects: 14% (11157/79689), 9.28 MiB | 18.54 MiB/s Receiving objects: 15% (11954/79689), 9.28 MiB | 18.54 MiB/s Receiving objects: 16% (12751/79689), 9.28 MiB | 18.54 MiB/s Receiving objects: 17% (13548/79689), 9.28 MiB | 18.54 MiB/s Receiving objects: 18% (14345/79689), 9.28 MiB | 18.54 MiB/s Receiving objects: 19% (15141/79689), 9.28 MiB | 18.54 MiB/s Receiving objects: 20% (15938/79689), 9.28 MiB | 18.54 MiB/s Receiving objects: 21% (16735/79689), 9.28 MiB | 18.54 MiB/s Receiving objects: 22% (17532/79689), 9.28 MiB | 18.54 MiB/s Receiving objects: 23% (18329/79689), 9.28 MiB | 18.54 MiB/s Receiving objects: 24% (19126/79689), 9.28 MiB | 18.54 MiB/s Receiving objects: 25% (19923/79689), 9.28 MiB | 18.54 MiB/s Receiving objects: 26% (20720/79689), 9.28 MiB | 18.54 MiB/s Receiving objects: 27% (21517/79689), 9.28 MiB | 18.54 MiB/s Receiving objects: 28% (22313/79689), 9.28 MiB | 18.54 MiB/s Receiving objects: 29% (23110/79689), 9.28 MiB | 18.54 MiB/s Receiving objects: 30% (23907/79689), 9.28 MiB | 18.54 MiB/s Receiving objects: 30% (24312/79689), 9.28 MiB | 18.54 MiB/s Receiving objects: 31% (24704/79689), 26.10 MiB | 26.09 MiB/s Receiving objects: 32% (25501/79689), 26.10 MiB | 26.09 MiB/s Receiving objects: 33% (26298/79689), 26.10 MiB | 26.09 MiB/s Receiving objects: 34% (27095/79689), 26.10 MiB | 26.09 MiB/s Receiving objects: 35% (27892/79689), 26.10 MiB | 26.09 MiB/s Receiving objects: 36% (28689/79689), 26.10 MiB | 26.09 MiB/s Receiving objects: 37% (29485/79689), 26.10 MiB | 26.09 MiB/s Receiving objects: 38% (30282/79689), 26.10 MiB | 26.09 MiB/s Receiving objects: 39% (31079/79689), 26.10 MiB | 26.09 MiB/s Receiving objects: 40% (31876/79689), 26.10 MiB | 26.09 MiB/s Receiving objects: 41% (32673/79689), 26.10 MiB | 26.09 MiB/s Receiving objects: 42% (33470/79689), 26.10 MiB | 26.09 MiB/s Receiving objects: 43% (34267/79689), 26.10 MiB | 26.09 MiB/s Receiving objects: 44% (35064/79689), 26.10 MiB | 26.09 MiB/s Receiving objects: 45% (35861/79689), 26.10 MiB | 26.09 MiB/s Receiving objects: 46% (36657/79689), 26.10 MiB | 26.09 MiB/s Receiving objects: 47% (37454/79689), 41.22 MiB | 27.47 MiB/s Receiving objects: 48% (38251/79689), 41.22 MiB | 27.47 MiB/s Receiving objects: 49% (39048/79689), 41.22 MiB | 27.47 MiB/s Receiving objects: 50% (39845/79689), 41.22 MiB | 27.47 MiB/s Receiving objects: 51% (40642/79689), 41.22 MiB | 27.47 MiB/s Receiving objects: 52% (41439/79689), 41.22 MiB | 27.47 MiB/s Receiving objects: 53% (42236/79689), 41.22 MiB | 27.47 MiB/s Receiving objects: 54% (43033/79689), 41.22 MiB | 27.47 MiB/s Receiving objects: 55% (43829/79689), 41.22 MiB | 27.47 MiB/s Receiving objects: 56% (44626/79689), 41.22 MiB | 27.47 MiB/s Receiving objects: 57% (45423/79689), 41.22 MiB | 27.47 MiB/s Receiving objects: 57% (46095/79689), 41.22 MiB | 27.47 MiB/s Receiving objects: 58% (46220/79689), 54.91 MiB | 27.45 MiB/s Receiving objects: 59% (47017/79689), 54.91 MiB | 27.45 MiB/s Receiving objects: 60% (47814/79689), 54.91 MiB | 27.45 MiB/s Receiving objects: 61% (48611/79689), 54.91 MiB | 27.45 MiB/s Receiving objects: 62% (49408/79689), 54.91 MiB | 27.45 MiB/s Receiving objects: 63% (50205/79689), 54.91 MiB | 27.45 MiB/s Receiving objects: 64% (51001/79689), 70.84 MiB | 28.33 MiB/s Receiving objects: 65% (51798/79689), 70.84 MiB | 28.33 MiB/s Receiving objects: 66% (52595/79689), 70.84 MiB | 28.33 MiB/s Receiving objects: 67% (53392/79689), 70.84 MiB | 28.33 MiB/s Receiving objects: 68% (54189/79689), 70.84 MiB | 28.33 MiB/s Receiving objects: 69% (54986/79689), 70.84 MiB | 28.33 MiB/s Receiving objects: 70% (55783/79689), 70.84 MiB | 28.33 MiB/s Receiving objects: 71% (56580/79689), 70.84 MiB | 28.33 MiB/s Receiving objects: 72% (57377/79689), 70.84 MiB | 28.33 MiB/s Receiving objects: 72% (58042/79689), 70.84 MiB | 28.33 MiB/s Receiving objects: 73% (58173/79689), 86.42 MiB | 28.80 MiB/s Receiving objects: 74% (58970/79689), 86.42 MiB | 28.80 MiB/s Receiving objects: 75% (59767/79689), 86.42 MiB | 28.80 MiB/s Receiving objects: 76% (60564/79689), 86.42 MiB | 28.80 MiB/s Receiving objects: 77% (61361/79689), 86.42 MiB | 28.80 MiB/s Receiving objects: 78% (62158/79689), 86.42 MiB | 28.80 MiB/s Receiving objects: 79% (62955/79689), 86.42 MiB | 28.80 MiB/s Receiving objects: 80% (63752/79689), 102.11 MiB | 29.11 MiB/s Receiving objects: 81% (64549/79689), 102.11 MiB | 29.11 MiB/s Receiving objects: 82% (65345/79689), 102.11 MiB | 29.11 MiB/s Receiving objects: 83% (66142/79689), 102.11 MiB | 29.11 MiB/s Receiving objects: 84% (66939/79689), 102.11 MiB | 29.11 MiB/s Receiving objects: 85% (67736/79689), 102.11 MiB | 29.11 MiB/s Receiving objects: 86% (68533/79689), 102.11 MiB | 29.11 MiB/s Receiving objects: 87% (69330/79689), 102.11 MiB | 29.11 MiB/s Receiving objects: 88% (70127/79689), 102.11 MiB | 29.11 MiB/s Receiving objects: 89% (70924/79689), 102.11 MiB | 29.11 MiB/s Receiving objects: 90% (71721/79689), 102.11 MiB | 29.11 MiB/s Receiving objects: 91% (72517/79689), 102.11 MiB | 29.11 MiB/s Receiving objects: 92% (73314/79689), 102.11 MiB | 29.11 MiB/s Receiving objects: 93% (74111/79689), 102.11 MiB | 29.11 MiB/s Receiving objects: 94% (74908/79689), 102.11 MiB | 29.11 MiB/s Receiving objects: 95% (75705/79689), 102.11 MiB | 29.11 MiB/s Receiving objects: 95% (76055/79689), 102.11 MiB | 29.11 MiB/s Receiving objects: 96% (76502/79689), 118.30 MiB | 29.51 MiB/s Receiving objects: 97% (77299/79689), 118.30 MiB | 29.51 MiB/s Receiving objects: 98% (78096/79689), 118.30 MiB | 29.51 MiB/s Receiving objects: 99% (78893/79689), 118.30 MiB | 29.51 MiB/s remote: Total 79689 (delta 7862), reused 7479 (delta 7191), pack-reused 70405 (from 2)
  7. 8.17 s Receiving objects: 100% (79689/79689), 118.30 MiB | 29.51 MiB/s Receiving objects: 100% (79689/79689), 124.05 MiB | 29.55 MiB/s, done.
  8. 9.56 s Resolving deltas: 0% (0/54343) Resolving deltas: 1% (544/54343) Resolving deltas: 2% (1089/54343) Resolving deltas: 3% (1632/54343) Resolving deltas: 4% (2174/54343) Resolving deltas: 5% (2718/54343) Resolving deltas: 6% (3261/54343) Resolving deltas: 7% (3806/54343) Resolving deltas: 8% (4348/54343) Resolving deltas: 9% (4891/54343) Resolving deltas: 10% (5436/54343) Resolving deltas: 11% (5978/54343) Resolving deltas: 12% (6522/54343) Resolving deltas: 13% (7065/54343) Resolving deltas: 14% (7609/54343) Resolving deltas: 15% (8153/54343) Resolving deltas: 16% (8695/54343) Resolving deltas: 17% (9239/54343) Resolving deltas: 18% (9782/54343) Resolving deltas: 19% (10326/54343) Resolving deltas: 20% (10869/54343) Resolving deltas: 21% (11414/54343) Resolving deltas: 22% (11956/54343) Resolving deltas: 23% (12499/54343) Resolving deltas: 24% (13043/54343) Resolving deltas: 25% (13586/54343) Resolving deltas: 26% (14130/54343) Resolving deltas: 27% (14673/54343) Resolving deltas: 28% (15217/54343) Resolving deltas: 29% (15760/54343) Resolving deltas: 30% (16303/54343) Resolving deltas: 31% (16847/54343) Resolving deltas: 32% (17390/54343) Resolving deltas: 33% (17934/54343) Resolving deltas: 34% (18478/54343) Resolving deltas: 35% (19021/54343) Resolving deltas: 36% (19564/54343) Resolving deltas: 37% (20107/54343) Resolving deltas: 38% (20652/54343) Resolving deltas: 39% (21194/54343) Resolving deltas: 40% (21738/54343) Resolving deltas: 41% (22281/54343) Resolving deltas: 42% (22826/54343) Resolving deltas: 43% (23368/54343) Resolving deltas: 44% (23911/54343) Resolving deltas: 45% (24455/54343) Resolving deltas: 46% (24998/54343) Resolving deltas: 47% (25542/54343) Resolving deltas: 48% (26085/54343) Resolving deltas: 49% (26629/54343) Resolving deltas: 50% (27172/54343) Resolving deltas: 51% (27715/54343) Resolving deltas: 52% (28259/54343) Resolving deltas: 53% (28802/54343) Resolving deltas: 54% (29346/54343) Resolving deltas: 55% (29889/54343) Resolving deltas: 56% (30435/54343) Resolving deltas: 57% (30976/54343) Resolving deltas: 58% (31519/54343) Resolving deltas: 59% (32063/54343) Resolving deltas: 60% (32606/54343) Resolving deltas: 61% (33150/54343) Resolving deltas: 62% (33693/54343) Resolving deltas: 63% (34240/54343) Resolving deltas: 64% (34785/54343) Resolving deltas: 65% (35323/54343) Resolving deltas: 66% (35867/54343) Resolving deltas: 67% (36410/54343) Resolving deltas: 68% (36954/54343) Resolving deltas: 69% (37497/54343) Resolving deltas: 70% (38042/54343) Resolving deltas: 71% (38584/54343) Resolving deltas: 72% (39127/54343) Resolving deltas: 73% (39671/54343) Resolving deltas: 73% (40002/54343) Resolving deltas: 74% (40214/54343) Resolving deltas: 75% (40758/54343) Resolving deltas: 76% (41301/54343) Resolving deltas: 77% (41846/54343) Resolving deltas: 78% (42388/54343) Resolving deltas: 79% (42931/54343) Resolving deltas: 80% (43476/54343) Resolving deltas: 81% (44018/54343) Resolving deltas: 82% (44562/54343) Resolving deltas: 83% (45105/54343) Resolving deltas: 84% (45649/54343) Resolving deltas: 85% (46192/54343) Resolving deltas: 86% (46735/54343) Resolving deltas: 87% (47280/54343) Resolving deltas: 88% (47822/54343) Resolving deltas: 89% (48366/54343) Resolving deltas: 90% (48909/54343) Resolving deltas: 91% (49453/54343) Resolving deltas: 92% (49996/54343) Resolving deltas: 93% (50539/54343) Resolving deltas: 94% (51083/54343) Resolving deltas: 95% (51626/54343) Resolving deltas: 96% (52170/54343) Resolving deltas: 97% (52713/54343) Resolving deltas: 98% (53257/54343) Resolving deltas: 99% (53803/54343) Resolving deltas: 100% (54343/54343) Resolving deltas: 100% (54343/54343), done.
  9. 10.06 s Fetching commit c36776102037cebc62eeb2aecd21b2f790609f5e for push-vrpyqyylypmw ...
  10. 10.07 s $ /nix/store/bcnisk3ydfgv26v2gw3zlky24g00yww2-git-2.54.0/bin/git fetch origin c36776102037cebc62eeb2aecd21b2f790609f5e
  11. 10.65 s From https://github.com/alphal00p/gammaloop
  12. 10.65 s * branch c36776102037cebc62eeb2aecd21b2f790609f5e -> FETCH_HEAD
  13. 10.67 s $ /nix/store/9ypz3flqsrl5xl495mm8h645gadjsxi1-coreutils-9.11/bin/timeout --kill-after=15s 7200s /nix/store/bcnisk3ydfgv26v2gw3zlky24g00yww2-git-2.54.0/bin/git -c advice.detachedHead=false checkout c36776102037cebc62eeb2aecd21b2f790609f5e
  14. 11.03 s HEAD is now at c36776102 match initial-cut styles across xbox views
  15. 11.03 s $ /nix/store/9ypz3flqsrl5xl495mm8h645gadjsxi1-coreutils-9.11/bin/timeout --kill-after=15s 7200s /nix/store/23zk8sgzamrbmj1fday15szf7f2279s8-nix-2.34.7/bin/nix --extra-experimental-features nix-command --extra-experimental-features flakes --log-format internal-json run .#packages.x86_64-linux.nix-ci-check-gammaloop-nextest-docs --print-build-logs
  16. 11.53 s stdenv.isDarwin is deprecated, use stdenv.hostPlatform.isDarwin instead
  17. 19.43 s
  18. 20.12 s evaluating derivation 'gevaluation warning: stdenv.isDarwin is deprecated, use stdenv.hostPlatform.isDarwin instead
  19. 26.38 s copying '/nix/store/fb2x evaluating derivation 'g copying '/nix/store/fb2x evaluating derivation 'g copying '/nix/store/fb2x evaluating derivation 'g copying '/nix/store/fb2x evaluating derivation 'g copying '/nix/store/fb2x evaluating derivation 'g copying '/nix/store/fb2x evaluating derivation 'g copying '/nix/store/fb2x evaluating derivation 'g querying gammaloop-nexte [0.0 KiB DL] querying ma [4.3 KiB DL] querying ch [10.8 KiB DL] querying l [0/9 built, 3/0/24 copie [0/9 built, 9/0/17 copie [1/0/7 built, 5/6/17 copbuilder.pl> Running phase: patchPhase
  20. 26.38 s builder.pl> Running phase: updateAutotoolsGnuConfigScriptsPhase
  21. 26.39 s builder.pl> Running phase: configurePhase
  22. 26.41 s builder.pl> no configure script, doing nothing
  23. 26.41 s [1/0/6 built, 3/8/17 copbuilder.pl> Running phase: buildPhase
  24. 26.42 s builder.pl> Running phase: checkPhase
  25. 26.43 s builder.pl> Running phase: installPhase
  26. 26.43 s builder.pl> no Makefile or custom installPhase, doing nothing
  27. 26.44 s builder.pl> Running phase: fixupPhase
  28. 26.45 s builder.pl> shrinking RPATHs of ELF executables and libraries in /nix/store/654vgnw02gp7qz9lnaa6mypnmbgp8473-builder.pl
  29. 26.45 s builder.pl> checking for references to /build/ in /nix/store/654vgnw02gp7qz9lnaa6mypnmbgp8473-builder.pl...
  30. 26.46 s builder.pl> patching script interpreter paths in /nix/store/654vgnw02gp7qz9lnaa6mypnmbgp8473-builder.pl
  31. 26.51 s builder.pl (post)> Uploading to the NixCI cache: /nix/store/654vgnw02gp7qz9lnaa6mypnmbgp8473-builder.pl
  32. 26.58 s [1/0/6 built, 3/9/17 copbuilder.pl (post)> warning: 'warn-short-path-literals' is deprecated, use 'lint-short-path-literals = ignore' instead
  33. 26.73 s builder.pl (post)> copying 0 paths...
  34. 26.82 s builder.pl (post)> warning: 'warn-short-path-literals' is deprecated, use 'lint-short-path-literals = ignore' instead
  35. 26.88 s builder.pl (post)> copying 0 paths...
  36. 27.67 s [1/4 built, 2/12/17 copi [1/4 built, 2/14/17 copi [1/4 built, 1/16/17 copi [1/1/3 built, 17 copied python3> structuredAttrs is enabled
  37. 27.79 s python3> created 227 symlinks in user environment
  38. 29.34 s python3 (post)> Uploading to the NixCI cache: /nix/store/v67wpyflacy0i2gvzasrxvw2gkz4mr12-python3-3.13.15-env
  39. 29.41 s python3 (post)> warning: 'warn-short-path-literals' is deprecated, use 'lint-short-path-literals = ignore' instead
  40. 29.55 s python3 (post)> copying 0 paths...
  41. 29.63 s python3 (post)> warning: 'warn-short-path-literals' is deprecated, use 'lint-short-path-literals = ignore' instead
  42. 29.93 s python3 (post)> copying 0 paths...
  43. 30.53 s [2/4 built, 17 copied (3 [1/2/3 built, 17 copied gammaloop-nextest-docs> Extracting 2 binaries to /build/source
  44. 30.60 s gammaloop-nextest-docs> Extracted 5 files to /build/source in 0.07s
  45. 30.61 s gammaloop-nextest-docs> ------------
  46. 30.61 s gammaloop-nextest-docs> Nextest run ID 49c2016a-0bbb-443e-8924-01bf7aeb5246 with nextest profile: ci_gammaloop
  47. 30.61 s gammaloop-nextest-docs> Starting 111 tests across 2 binaries
  48. 30.73 s gammaloop-nextest-docs> FAIL [ 0.119s] ( 70/111) alphal00p-docs-builder tests::checked_in_registry_is_valid
  49. 30.73 s gammaloop-nextest-docs> stdout ---
  50. 30.73 s gammaloop-nextest-docs>
  51. 30.73 s gammaloop-nextest-docs> running 1 test
  52. 30.73 s gammaloop-nextest-docs> test tests::checked_in_registry_is_valid ... FAILED
  53. 30.73 s gammaloop-nextest-docs>
  54. 30.73 s gammaloop-nextest-docs> failures:
  55. 30.73 s gammaloop-nextest-docs>
  56. 30.73 s gammaloop-nextest-docs> failures:
  57. 30.73 s gammaloop-nextest-docs> tests::checked_in_registry_is_valid
  58. 30.73 s gammaloop-nextest-docs>
  59. 30.73 s gammaloop-nextest-docs> test result: FAILED. 0 passed; 1 failed; 0 ignored; 0 measured; 110 filtered out; finished in 0.11s
  60. 30.73 s gammaloop-nextest-docs>
  61. 30.73 s gammaloop-nextest-docs> stderr ---
  62. 30.73 s gammaloop-nextest-docs> warning: developer note gammaloop-architecture still requires a named owner
  63. 30.73 s gammaloop-nextest-docs> warning: developer note integration-dashboard still requires a named owner
  64. 30.73 s gammaloop-nextest-docs> warning: developer note uv-renormalization still requires a named owner
  65. 30.73 s gammaloop-nextest-docs> warning: developer note spenso-parsing-flow still requires a named owner
  66. 30.73 s gammaloop-nextest-docs> warning: developer note schoonschip-network still requires a named owner
  67. 30.73 s gammaloop-nextest-docs> warning: developer note gammaloop-draw-style-migration still requires a named owner
  68. 30.73 s gammaloop-nextest-docs> warning: developer note gammaloop-drawing-architecture still requires a named owner
  69. 30.73 s gammaloop-nextest-docs> warning: developer note spenso-symbolica-syntax-and-rewrites still requires a named owner
  70. 30.73 s gammaloop-nextest-docs> warning: developer note spenso-architecture still requires a named owner
  71. 30.73 s gammaloop-nextest-docs> warning: developer note idenso-architecture still requires a named owner
  72. 30.73 s gammaloop-nextest-docs> warning: developer note idenso-form-color-dirac-source-map still requires a named owner
  73. 30.73 s gammaloop-nextest-docs> warning: developer note linnet-architecture still requires a named owner
  74. 30.73 s gammaloop-nextest-docs> warning: developer note vakint-architecture still requires a named owner
  75. 30.73 s gammaloop-nextest-docs> warning: developer note gammaloop-roadmap still requires a named owner
  76. 30.73 s gammaloop-nextest-docs> warning: developer note cff-surface-cache-ownership still requires a named owner
  77. 30.73 s gammaloop-nextest-docs> warning: developer note gammaloop-drawing-evaluated-fields-history still requires a named owner
  78. 30.73 s gammaloop-nextest-docs> warning: archived developer note gammaloop-drawing-evaluated-fields-history has no immutable evidence revision
  79. 30.73 s gammaloop-nextest-docs> warning: developer note bnl-benchmark-investigation still requires a named owner
  80. 30.73 s gammaloop-nextest-docs> warning: developer note bnl-contraction-order-performance still requires a named owner
  81. 30.73 s gammaloop-nextest-docs> warning: developer note bnl-scalar-alias-capture still requires a named owner
  82. 30.73 s gammaloop-nextest-docs> warning: developer note aa-aa-three-loop-performance-smoke still requires a named owner
  83. 30.73 s gammaloop-nextest-docs> warning: developer note network-simplification still requires a named owner
  84. 30.73 s gammaloop-nextest-docs> warning: investigation developer note network-simplification has no immutable evidence revision
  85. 30.73 s gammaloop-nextest-docs> warning: developer note spenso-large-expressions still requires a named owner
  86. 30.73 s gammaloop-nextest-docs> warning: developer note spenso-improvement-effects still requires a named owner
  87. 30.73 s gammaloop-nextest-docs> warning: archived developer note spenso-improvement-effects has no immutable evidence revision
  88. 30.73 s gammaloop-nextest-docs> warning: developer note spenso-test-baseline still requires a named owner
  89. 30.73 s gammaloop-nextest-docs> warning: archived developer note spenso-test-baseline has no immutable evidence revision
  90. 30.73 s gammaloop-nextest-docs> warning: developer note bnl-evaluator-atom-capture still requires a named owner
  91. 30.73 s gammaloop-nextest-docs> warning: archived developer note bnl-evaluator-atom-capture has no immutable evidence revision
  92. 30.73 s gammaloop-nextest-docs> warning: developer note uv-scalar-profile-benchmark still requires a named owner
  93. 30.73 s gammaloop-nextest-docs> warning: archived developer note uv-scalar-profile-benchmark has no immutable evidence revision
  94. 30.73 s gammaloop-nextest-docs> warning: developer note ci-test-failure-summary-2026-03-25 still requires a named owner
  95. 30.73 s gammaloop-nextest-docs> warning: archived developer note ci-test-failure-summary-2026-03-25 has no immutable evidence revision
  96. 30.73 s gammaloop-nextest-docs> warning: developer note network-execution-rebase-record still requires a named owner
  97. 30.73 s gammaloop-nextest-docs> warning: archived developer note network-execution-rebase-record has no immutable evidence revision
  98. 30.73 s gammaloop-nextest-docs> warning: developer note ratatui-integration-dashboard-history still requires a named owner
  99. 30.73 s gammaloop-nextest-docs> warning: archived developer note ratatui-integration-dashboard-history has no immutable evidence revision
  100. 30.73 s gammaloop-nextest-docs> warning: developer note nix-crane-cache-reuse still requires a named owner
  101. 30.73 s gammaloop-nextest-docs>
  102. 30.73 s gammaloop-nextest-docs> thread 'tests::checked_in_registry_is_valid' (165) panicked at crates/alphal00p-docs-builder/src/lib.rs:11887:50:
  103. 30.73 s gammaloop-nextest-docs> called `Result::unwrap()` on an `Err` value: developer note nix-crane-cache-reuse verified scope flake.nix changed (expected 188504937418859942a6770ca21a4f4e0a7ff125, found 2055acf4433777d5a18c44d88e8416b42a938f3a); owner review or an explicit no-impact attestation is required
  104. 30.73 s gammaloop-nextest-docs>
  105. 30.73 s gammaloop-nextest-docs> Location:
  106. 30.73 s gammaloop-nextest-docs> crates/alphal00p-docs-builder/src/lib.rs:889:21
  107. 30.73 s gammaloop-nextest-docs> stack backtrace:
  108. 30.73 s gammaloop-nextest-docs> 0: __rustc::rust_begin_unwind
  109. 30.73 s gammaloop-nextest-docs> 1: core::panicking::panic_fmt
  110. 30.73 s gammaloop-nextest-docs> 2: core::result::unwrap_failed
  111. 30.73 s gammaloop-nextest-docs> 3: alphal00p_docs_builder::tests::checked_in_registry_is_valid
  112. 30.73 s gammaloop-nextest-docs> 4: <alphal00p_docs_builder::tests::checked_in_registry_is_valid::{closure#0} as core::ops::function::FnOnce<()>>::call_once
  113. 30.73 s gammaloop-nextest-docs> note: Some details are omitted, run with `RUST_BACKTRACE=full` for a verbose backtrace.
  114. 30.73 s gammaloop-nextest-docs>
  115. 30.76 s gammaloop-nextest-docs> FAIL [ 0.126s] ( 85/111) alphal00p-docs-builder tests::every_product_requires_a_task_chooser_and_each_supported_interface
  116. 30.76 s gammaloop-nextest-docs> stdout ---
  117. 30.76 s gammaloop-nextest-docs>
  118. 30.76 s gammaloop-nextest-docs> running 1 test
  119. 30.76 s gammaloop-nextest-docs> test tests::every_product_requires_a_task_chooser_and_each_supported_interface ... FAILED
  120. 30.76 s gammaloop-nextest-docs>
  121. 30.76 s gammaloop-nextest-docs> failures:
  122. 30.76 s gammaloop-nextest-docs>
  123. 30.76 s gammaloop-nextest-docs> failures:
  124. 30.76 s gammaloop-nextest-docs> tests::every_product_requires_a_task_chooser_and_each_supported_interface
  125. 30.76 s gammaloop-nextest-docs>
  126. 30.76 s gammaloop-nextest-docs> test result: FAILED. 0 passed; 1 failed; 0 ignored; 0 measured; 110 filtered out; finished in 0.12s
  127. 30.76 s gammaloop-nextest-docs>
  128. 30.76 s gammaloop-nextest-docs> stderr ---
  129. 30.76 s gammaloop-nextest-docs> warning: developer note gammaloop-architecture still requires a named owner
  130. 30.76 s gammaloop-nextest-docs> warning: developer note integration-dashboard still requires a named owner
  131. 30.76 s gammaloop-nextest-docs> warning: developer note uv-renormalization still requires a named owner
  132. 30.76 s gammaloop-nextest-docs> warning: developer note spenso-parsing-flow still requires a named owner
  133. 30.76 s gammaloop-nextest-docs> warning: developer note schoonschip-network still requires a named owner
  134. 30.76 s gammaloop-nextest-docs> warning: developer note gammaloop-draw-style-migration still requires a named owner
  135. 30.76 s gammaloop-nextest-docs> warning: developer note gammaloop-drawing-architecture still requires a named owner
  136. 30.76 s gammaloop-nextest-docs> warning: developer note spenso-symbolica-syntax-and-rewrites still requires a named owner
  137. 30.76 s gammaloop-nextest-docs> warning: developer note spenso-architecture still requires a named owner
  138. 30.76 s gammaloop-nextest-docs> warning: developer note idenso-architecture still requires a named owner
  139. 30.76 s gammaloop-nextest-docs> warning: developer note idenso-form-color-dirac-source-map still requires a named owner
  140. 30.76 s gammaloop-nextest-docs> warning: developer note linnet-architecture still requires a named owner
  141. 30.76 s gammaloop-nextest-docs> warning: developer note vakint-architecture still requires a named owner
  142. 30.76 s gammaloop-nextest-docs> warning: developer note gammaloop-roadmap still requires a named owner
  143. 30.76 s gammaloop-nextest-docs> warning: developer note cff-surface-cache-ownership still requires a named owner
  144. 30.76 s gammaloop-nextest-docs> warning: developer note gammaloop-drawing-evaluated-fields-history still requires a named owner
  145. 30.76 s gammaloop-nextest-docs> warning: archived developer note gammaloop-drawing-evaluated-fields-history has no immutable evidence revision
  146. 30.76 s gammaloop-nextest-docs> warning: developer note bnl-benchmark-investigation still requires a named owner
  147. 30.76 s gammaloop-nextest-docs> warning: developer note bnl-contraction-order-performance still requires a named owner
  148. 30.76 s gammaloop-nextest-docs> warning: developer note bnl-scalar-alias-capture still requires a named owner
  149. 30.76 s gammaloop-nextest-docs> warning: developer note aa-aa-three-loop-performance-smoke still requires a named owner
  150. 30.76 s gammaloop-nextest-docs> warning: developer note network-simplification still requires a named owner
  151. 30.76 s gammaloop-nextest-docs> warning: investigation developer note network-simplification has no immutable evidence revision
  152. 30.76 s gammaloop-nextest-docs> warning: developer note spenso-large-expressions still requires a named owner
  153. 30.76 s gammaloop-nextest-docs> warning: developer note spenso-improvement-effects still requires a named owner
  154. 30.76 s gammaloop-nextest-docs> warning: archived developer note spenso-improvement-effects has no immutable evidence revision
  155. 30.76 s gammaloop-nextest-docs> warning: developer note spenso-test-baseline still requires a named owner
  156. 30.76 s gammaloop-nextest-docs> warning: archived developer note spenso-test-baseline has no immutable evidence revision
  157. 30.76 s gammaloop-nextest-docs> warning: developer note bnl-evaluator-atom-capture still requires a named owner
  158. 30.76 s gammaloop-nextest-docs> warning: archived developer note bnl-evaluator-atom-capture has no immutable evidence revision
  159. 30.76 s gammaloop-nextest-docs> warning: developer note uv-scalar-profile-benchmark still requires a named owner
  160. 30.76 s gammaloop-nextest-docs> warning: archived developer note uv-scalar-profile-benchmark has no immutable evidence revision
  161. 30.76 s gammaloop-nextest-docs> warning: developer note ci-test-failure-summary-2026-03-25 still requires a named owner
  162. 30.76 s gammaloop-nextest-docs> warning: archived developer note ci-test-failure-summary-2026-03-25 has no immutable evidence revision
  163. 30.76 s gammaloop-nextest-docs> warning: developer note network-execution-rebase-record still requires a named owner
  164. 30.76 s gammaloop-nextest-docs> warning: archived developer note network-execution-rebase-record has no immutable evidence revision
  165. 30.76 s gammaloop-nextest-docs> warning: developer note ratatui-integration-dashboard-history still requires a named owner
  166. 30.76 s gammaloop-nextest-docs> warning: archived developer note ratatui-integration-dashboard-history has no immutable evidence revision
  167. 30.76 s gammaloop-nextest-docs> warning: developer note nix-crane-cache-reuse still requires a named owner
  168. 30.76 s gammaloop-nextest-docs>
  169. 30.76 s gammaloop-nextest-docs> thread 'tests::every_product_requires_a_task_chooser_and_each_supported_interface' (270) panicked at crates/alphal00p-docs-builder/src/lib.rs:11901:9:
  170. 30.76 s gammaloop-nextest-docs> assertion failed: format!("{error:#}").contains("has no quickstart page")
  171. 30.76 s gammaloop-nextest-docs> stack backtrace:
  172. 30.76 s gammaloop-nextest-docs> 0: __rustc::rust_begin_unwind
  173. 30.76 s gammaloop-nextest-docs> 1: core::panicking::panic_fmt
  174. 30.76 s gammaloop-nextest-docs> 2: core::panicking::panic
  175. 30.76 s gammaloop-nextest-docs> 3: alphal00p_docs_builder::tests::every_product_requires_a_task_chooser_and_each_supported_interface
  176. 30.76 s gammaloop-nextest-docs> 4: <alphal00p_docs_builder::tests::every_product_requires_a_task_chooser_and_each_supported_interface::{closure#0} as core::ops::function::FnOnce<()>>::call_once
  177. 30.76 s gammaloop-nextest-docs> note: Some details are omitted, run with `RUST_BACKTRACE=full` for a verbose backtrace.
  178. 30.76 s gammaloop-nextest-docs>
  179. 30.78 s gammaloop-nextest-docs> FAIL [ 0.113s] ( 98/111) alphal00p-docs-builder tests::pdf_manual_chapter_order_must_match_the_page_registry
  180. 30.78 s gammaloop-nextest-docs> stdout ---
  181. 30.78 s gammaloop-nextest-docs>
  182. 30.78 s gammaloop-nextest-docs> running 1 test
  183. 30.78 s gammaloop-nextest-docs> test tests::pdf_manual_chapter_order_must_match_the_page_registry ... FAILED
  184. 30.78 s gammaloop-nextest-docs>
  185. 30.78 s gammaloop-nextest-docs> failures:
  186. 30.78 s gammaloop-nextest-docs>
  187. 30.78 s gammaloop-nextest-docs> failures:
  188. 30.78 s gammaloop-nextest-docs> tests::pdf_manual_chapter_order_must_match_the_page_registry
  189. 30.78 s gammaloop-nextest-docs>
  190. 30.78 s gammaloop-nextest-docs> test result: FAILED. 0 passed; 1 failed; 0 ignored; 0 measured; 110 filtered out; finished in 0.11s
  191. 30.78 s gammaloop-nextest-docs>
  192. 30.78 s gammaloop-nextest-docs> stderr ---
  193. 30.78 s gammaloop-nextest-docs> warning: developer note gammaloop-architecture still requires a named owner
  194. 30.78 s gammaloop-nextest-docs> warning: developer note integration-dashboard still requires a named owner
  195. 30.78 s gammaloop-nextest-docs> warning: developer note uv-renormalization still requires a named owner
  196. 30.78 s gammaloop-nextest-docs> warning: developer note spenso-parsing-flow still requires a named owner
  197. 30.78 s gammaloop-nextest-docs> warning: developer note schoonschip-network still requires a named owner
  198. 30.78 s gammaloop-nextest-docs> warning: developer note gammaloop-draw-style-migration still requires a named owner
  199. 30.78 s gammaloop-nextest-docs> warning: developer note gammaloop-drawing-architecture still requires a named owner
  200. 30.78 s gammaloop-nextest-docs> warning: developer note spenso-symbolica-syntax-and-rewrites still requires a named owner
  201. 30.78 s gammaloop-nextest-docs> warning: developer note spenso-architecture still requires a named owner
  202. 30.78 s gammaloop-nextest-docs> warning: developer note idenso-architecture still requires a named owner
  203. 30.78 s gammaloop-nextest-docs> warning: developer note idenso-form-color-dirac-source-map still requires a named owner
  204. 30.78 s gammaloop-nextest-docs> warning: developer note linnet-architecture still requires a named owner
  205. 30.78 s gammaloop-nextest-docs> warning: developer note vakint-architecture still requires a named owner
  206. 30.78 s gammaloop-nextest-docs> warning: developer note gammaloop-roadmap still requires a named owner
  207. 30.78 s gammaloop-nextest-docs> warning: developer note cff-surface-cache-ownership still requires a named owner
  208. 30.78 s gammaloop-nextest-docs> warning: developer note gammaloop-drawing-evaluated-fields-history still requires a named owner
  209. 30.78 s gammaloop-nextest-docs> warning: archived developer note gammaloop-drawing-evaluated-fields-history has no immutable evidence revision
  210. 30.78 s gammaloop-nextest-docs> warning: developer note bnl-benchmark-investigation still requires a named owner
  211. 30.78 s gammaloop-nextest-docs> warning: developer note bnl-contraction-order-performance still requires a named owner
  212. 30.78 s gammaloop-nextest-docs> warning: developer note bnl-scalar-alias-capture still requires a named owner
  213. 30.78 s gammaloop-nextest-docs> warning: developer note aa-aa-three-loop-performance-smoke still requires a named owner
  214. 30.78 s gammaloop-nextest-docs> warning: developer note network-simplification still requires a named owner
  215. 30.78 s gammaloop-nextest-docs> warning: investigation developer note network-simplification has no immutable evidence revision
  216. 30.78 s gammaloop-nextest-docs> warning: developer note spenso-large-expressions still requires a named owner
  217. 30.78 s gammaloop-nextest-docs> warning: developer note spenso-improvement-effects still requires a named owner
  218. 30.78 s gammaloop-nextest-docs> warning: archived developer note spenso-improvement-effects has no immutable evidence revision
  219. 30.78 s gammaloop-nextest-docs> warning: developer note spenso-test-baseline still requires a named owner
  220. 30.78 s gammaloop-nextest-docs> warning: archived developer note spenso-test-baseline has no immutable evidence revision
  221. 30.78 s gammaloop-nextest-docs> warning: developer note bnl-evaluator-atom-capture still requires a named owner
  222. 30.78 s gammaloop-nextest-docs> warning: archived developer note bnl-evaluator-atom-capture has no immutable evidence revision
  223. 30.78 s gammaloop-nextest-docs> warning: developer note uv-scalar-profile-benchmark still requires a named owner
  224. 30.78 s gammaloop-nextest-docs> warning: archived developer note uv-scalar-profile-benchmark has no immutable evidence revision
  225. 30.78 s gammaloop-nextest-docs> warning: developer note ci-test-failure-summary-2026-03-25 still requires a named owner
  226. 30.78 s gammaloop-nextest-docs> warning: archived developer note ci-test-failure-summary-2026-03-25 has no immutable evidence revision
  227. 30.78 s gammaloop-nextest-docs> warning: developer note network-execution-rebase-record still requires a named owner
  228. 30.78 s gammaloop-nextest-docs> warning: archived developer note network-execution-rebase-record has no immutable evidence revision
  229. 30.78 s gammaloop-nextest-docs> warning: developer note ratatui-integration-dashboard-history still requires a named owner
  230. 30.78 s gammaloop-nextest-docs> warning: archived developer note ratatui-integration-dashboard-history has no immutable evidence revision
  231. 30.78 s gammaloop-nextest-docs> warning: developer note nix-crane-cache-reuse still requires a named owner
  232. 30.78 s gammaloop-nextest-docs>
  233. 30.78 s gammaloop-nextest-docs> thread 'tests::pdf_manual_chapter_order_must_match_the_page_registry' (327) panicked at crates/alphal00p-docs-builder/src/lib.rs:11952:9:
  234. 30.78 s gammaloop-nextest-docs> assertion failed: format!("{error:#}").contains("PDF manual chapter order differs")
  235. 30.78 s gammaloop-nextest-docs> stack backtrace:
  236. 30.78 s gammaloop-nextest-docs> 0: __rustc::rust_begin_unwind
  237. 30.78 s gammaloop-nextest-docs> 1: core::panicking::panic_fmt
  238. 30.78 s gammaloop-nextest-docs> 2: core::panicking::panic
  239. 30.78 s gammaloop-nextest-docs> 3: alphal00p_docs_builder::tests::pdf_manual_chapter_order_must_match_the_page_registry
  240. 30.78 s gammaloop-nextest-docs> 4: <alphal00p_docs_builder::tests::pdf_manual_chapter_order_must_match_the_page_registry::{closure#0} as core::ops::function::FnOnce<()>>::call_once
  241. 30.78 s gammaloop-nextest-docs> note: Some details are omitted, run with `RUST_BACKTRACE=full` for a verbose backtrace.
  242. 30.78 s gammaloop-nextest-docs>
  243. 51.14 s gammaloop-nextest-docs> ------------
  244. 51.14 s gammaloop-nextest-docs> Summary [ 20.530s] 111 tests run: 108 passed, 3 failed, 0 skipped
  245. 51.14 s gammaloop-nextest-docs> FAIL [ 0.119s] ( 70/111) alphal00p-docs-builder tests::checked_in_registry_is_valid
  246. 51.14 s gammaloop-nextest-docs> stdout ---
  247. 51.14 s gammaloop-nextest-docs>
  248. 51.14 s gammaloop-nextest-docs> running 1 test
  249. 51.14 s gammaloop-nextest-docs> test tests::checked_in_registry_is_valid ... FAILED
  250. 51.14 s gammaloop-nextest-docs>
  251. 51.14 s gammaloop-nextest-docs> failures:
  252. 51.14 s gammaloop-nextest-docs>
  253. 51.14 s gammaloop-nextest-docs> failures:
  254. 51.14 s gammaloop-nextest-docs> tests::checked_in_registry_is_valid
  255. 51.14 s gammaloop-nextest-docs>
  256. 51.14 s gammaloop-nextest-docs> test result: FAILED. 0 passed; 1 failed; 0 ignored; 0 measured; 110 filtered out; finished in 0.11s
  257. 51.14 s gammaloop-nextest-docs>
  258. 51.14 s gammaloop-nextest-docs> stderr ---
  259. 51.14 s gammaloop-nextest-docs> warning: developer note gammaloop-architecture still requires a named owner
  260. 51.14 s gammaloop-nextest-docs> warning: developer note integration-dashboard still requires a named owner
  261. 51.14 s gammaloop-nextest-docs> warning: developer note uv-renormalization still requires a named owner
  262. 51.14 s gammaloop-nextest-docs> warning: developer note spenso-parsing-flow still requires a named owner
  263. 51.14 s gammaloop-nextest-docs> warning: developer note schoonschip-network still requires a named owner
  264. 51.14 s gammaloop-nextest-docs> warning: developer note gammaloop-draw-style-migration still requires a named owner
  265. 51.14 s gammaloop-nextest-docs> warning: developer note gammaloop-drawing-architecture still requires a named owner
  266. 51.14 s gammaloop-nextest-docs> warning: developer note spenso-symbolica-syntax-and-rewrites still requires a named owner
  267. 51.14 s gammaloop-nextest-docs> warning: developer note spenso-architecture still requires a named owner
  268. 51.14 s gammaloop-nextest-docs> warning: developer note idenso-architecture still requires a named owner
  269. 51.14 s gammaloop-nextest-docs> warning: developer note idenso-form-color-dirac-source-map still requires a named owner
  270. 51.14 s gammaloop-nextest-docs> warning: developer note linnet-architecture still requires a named owner
  271. 51.14 s gammaloop-nextest-docs> warning: developer note vakint-architecture still requires a named owner
  272. 51.14 s gammaloop-nextest-docs> warning: developer note gammaloop-roadmap still requires a named owner
  273. 51.14 s gammaloop-nextest-docs> warning: developer note cff-surface-cache-ownership still requires a named owner
  274. 51.14 s gammaloop-nextest-docs> warning: developer note gammaloop-drawing-evaluated-fields-history still requires a named owner
  275. 51.14 s gammaloop-nextest-docs> warning: archived developer note gammaloop-drawing-evaluated-fields-history has no immutable evidence revision
  276. 51.14 s gammaloop-nextest-docs> warning: developer note bnl-benchmark-investigation still requires a named owner
  277. 51.14 s gammaloop-nextest-docs> warning: developer note bnl-contraction-order-performance still requires a named owner
  278. 51.14 s gammaloop-nextest-docs> warning: developer note bnl-scalar-alias-capture still requires a named owner
  279. 51.14 s gammaloop-nextest-docs> warning: developer note aa-aa-three-loop-performance-smoke still requires a named owner
  280. 51.14 s gammaloop-nextest-docs> warning: developer note network-simplification still requires a named owner
  281. 51.14 s gammaloop-nextest-docs> warning: investigation developer note network-simplification has no immutable evidence revision
  282. 51.14 s gammaloop-nextest-docs> warning: developer note spenso-large-expressions still requires a named owner
  283. 51.14 s gammaloop-nextest-docs> warning: developer note spenso-improvement-effects still requires a named owner
  284. 51.14 s gammaloop-nextest-docs> warning: archived developer note spenso-improvement-effects has no immutable evidence revision
  285. 51.14 s gammaloop-nextest-docs> warning: developer note spenso-test-baseline still requires a named owner
  286. 51.14 s gammaloop-nextest-docs> warning: archived developer note spenso-test-baseline has no immutable evidence revision
  287. 51.14 s gammaloop-nextest-docs> warning: developer note bnl-evaluator-atom-capture still requires a named owner
  288. 51.14 s gammaloop-nextest-docs> warning: archived developer note bnl-evaluator-atom-capture has no immutable evidence revision
  289. 51.14 s gammaloop-nextest-docs> warning: developer note uv-scalar-profile-benchmark still requires a named owner
  290. 51.14 s gammaloop-nextest-docs> warning: archived developer note uv-scalar-profile-benchmark has no immutable evidence revision
  291. 51.14 s gammaloop-nextest-docs> warning: developer note ci-test-failure-summary-2026-03-25 still requires a named owner
  292. 51.14 s gammaloop-nextest-docs> warning: archived developer note ci-test-failure-summary-2026-03-25 has no immutable evidence revision
  293. 51.14 s gammaloop-nextest-docs> warning: developer note network-execution-rebase-record still requires a named owner
  294. 51.14 s gammaloop-nextest-docs> warning: archived developer note network-execution-rebase-record has no immutable evidence revision
  295. 51.14 s gammaloop-nextest-docs> warning: developer note ratatui-integration-dashboard-history still requires a named owner
  296. 51.14 s gammaloop-nextest-docs> warning: archived developer note ratatui-integration-dashboard-history has no immutable evidence revision
  297. 51.14 s gammaloop-nextest-docs> warning: developer note nix-crane-cache-reuse still requires a named owner
  298. 51.14 s gammaloop-nextest-docs>
  299. 51.14 s gammaloop-nextest-docs> thread 'tests::checked_in_registry_is_valid' (165) panicked at crates/alphal00p-docs-builder/src/lib.rs:11887:50:
  300. 51.14 s gammaloop-nextest-docs> called `Result::unwrap()` on an `Err` value: developer note nix-crane-cache-reuse verified scope flake.nix changed (expected 188504937418859942a6770ca21a4f4e0a7ff125, found 2055acf4433777d5a18c44d88e8416b42a938f3a); owner review or an explicit no-impact attestation is required
  301. 51.14 s gammaloop-nextest-docs>
  302. 51.14 s gammaloop-nextest-docs> Location:
  303. 51.14 s gammaloop-nextest-docs> crates/alphal00p-docs-builder/src/lib.rs:889:21
  304. 51.14 s gammaloop-nextest-docs> stack backtrace:
  305. 51.14 s gammaloop-nextest-docs> 0: __rustc::rust_begin_unwind
  306. 51.14 s gammaloop-nextest-docs> 1: core::panicking::panic_fmt
  307. 51.14 s gammaloop-nextest-docs> 2: core::result::unwrap_failed
  308. 51.14 s gammaloop-nextest-docs> 3: alphal00p_docs_builder::tests::checked_in_registry_is_valid
  309. 51.14 s gammaloop-nextest-docs> 4: <alphal00p_docs_builder::tests::checked_in_registry_is_valid::{closure#0} as core::ops::function::FnOnce<()>>::call_once
  310. 51.14 s gammaloop-nextest-docs> note: Some details are omitted, run with `RUST_BACKTRACE=full` for a verbose backtrace.
  311. 51.14 s gammaloop-nextest-docs>
  312. 51.14 s gammaloop-nextest-docs> FAIL [ 0.126s] ( 85/111) alphal00p-docs-builder tests::every_product_requires_a_task_chooser_and_each_supported_interface
  313. 51.14 s gammaloop-nextest-docs> stdout ---
  314. 51.14 s gammaloop-nextest-docs>
  315. 51.14 s gammaloop-nextest-docs> running 1 test
  316. 51.14 s gammaloop-nextest-docs> test tests::every_product_requires_a_task_chooser_and_each_supported_interface ... FAILED
  317. 51.14 s gammaloop-nextest-docs>
  318. 51.14 s gammaloop-nextest-docs> failures:
  319. 51.14 s gammaloop-nextest-docs>
  320. 51.14 s gammaloop-nextest-docs> failures:
  321. 51.14 s gammaloop-nextest-docs> tests::every_product_requires_a_task_chooser_and_each_supported_interface
  322. 51.14 s gammaloop-nextest-docs>
  323. 51.14 s gammaloop-nextest-docs> test result: FAILED. 0 passed; 1 failed; 0 ignored; 0 measured; 110 filtered out; finished in 0.12s
  324. 51.14 s gammaloop-nextest-docs>
  325. 51.14 s gammaloop-nextest-docs> stderr ---
  326. 51.14 s gammaloop-nextest-docs> warning: developer note gammaloop-architecture still requires a named owner
  327. 51.14 s gammaloop-nextest-docs> warning: developer note integration-dashboard still requires a named owner
  328. 51.14 s gammaloop-nextest-docs> warning: developer note uv-renormalization still requires a named owner
  329. 51.14 s gammaloop-nextest-docs> warning: developer note spenso-parsing-flow still requires a named owner
  330. 51.14 s gammaloop-nextest-docs> warning: developer note schoonschip-network still requires a named owner
  331. 51.14 s gammaloop-nextest-docs> warning: developer note gammaloop-draw-style-migration still requires a named owner
  332. 51.14 s gammaloop-nextest-docs> warning: developer note gammaloop-drawing-architecture still requires a named owner
  333. 51.14 s gammaloop-nextest-docs> warning: developer note spenso-symbolica-syntax-and-rewrites still requires a named owner
  334. 51.14 s gammaloop-nextest-docs> warning: developer note spenso-architecture still requires a named owner
  335. 51.14 s gammaloop-nextest-docs> warning: developer note idenso-architecture still requires a named owner
  336. 51.14 s gammaloop-nextest-docs> warning: developer note idenso-form-color-dirac-source-map still requires a named owner
  337. 51.14 s gammaloop-nextest-docs> warning: developer note linnet-architecture still requires a named owner
  338. 51.14 s gammaloop-nextest-docs> warning: developer note vakint-architecture still requires a named owner
  339. 51.14 s gammaloop-nextest-docs> warning: developer note gammaloop-roadmap still requires a named owner
  340. 51.14 s gammaloop-nextest-docs> warning: developer note cff-surface-cache-ownership still requires a named owner
  341. 51.14 s gammaloop-nextest-docs> warning: developer note gammaloop-drawing-evaluated-fields-history still requires a named owner
  342. 51.14 s gammaloop-nextest-docs> warning: archived developer note gammaloop-drawing-evaluated-fields-history has no immutable evidence revision
  343. 51.14 s gammaloop-nextest-docs> warning: developer note bnl-benchmark-investigation still requires a named owner
  344. 51.14 s gammaloop-nextest-docs> warning: developer note bnl-contraction-order-performance still requires a named owner
  345. 51.14 s gammaloop-nextest-docs> warning: developer note bnl-scalar-alias-capture still requires a named owner
  346. 51.14 s gammaloop-nextest-docs> warning: developer note aa-aa-three-loop-performance-smoke still requires a named owner
  347. 51.14 s gammaloop-nextest-docs> warning: developer note network-simplification still requires a named owner
  348. 51.14 s gammaloop-nextest-docs> warning: investigation developer note network-simplification has no immutable evidence revision
  349. 51.14 s gammaloop-nextest-docs> warning: developer note spenso-large-expressions still requires a named owner
  350. 51.14 s gammaloop-nextest-docs> warning: developer note spenso-improvement-effects still requires a named owner
  351. 51.14 s gammaloop-nextest-docs> warning: archived developer note spenso-improvement-effects has no immutable evidence revision
  352. 51.14 s gammaloop-nextest-docs> warning: developer note spenso-test-baseline still requires a named owner
  353. 51.14 s gammaloop-nextest-docs> warning: archived developer note spenso-test-baseline has no immutable evidence revision
  354. 51.14 s gammaloop-nextest-docs> warning: developer note bnl-evaluator-atom-capture still requires a named owner
  355. 51.14 s gammaloop-nextest-docs> warning: archived developer note bnl-evaluator-atom-capture has no immutable evidence revision
  356. 51.14 s gammaloop-nextest-docs> warning: developer note uv-scalar-profile-benchmark still requires a named owner
  357. 51.14 s gammaloop-nextest-docs> warning: archived developer note uv-scalar-profile-benchmark has no immutable evidence revision
  358. 51.14 s gammaloop-nextest-docs> warning: developer note ci-test-failure-summary-2026-03-25 still requires a named owner
  359. 51.14 s gammaloop-nextest-docs> warning: archived developer note ci-test-failure-summary-2026-03-25 has no immutable evidence revision
  360. 51.14 s gammaloop-nextest-docs> warning: developer note network-execution-rebase-record still requires a named owner
  361. 51.14 s gammaloop-nextest-docs> warning: archived developer note network-execution-rebase-record has no immutable evidence revision
  362. 51.14 s gammaloop-nextest-docs> warning: developer note ratatui-integration-dashboard-history still requires a named owner
  363. 51.14 s gammaloop-nextest-docs> warning: archived developer note ratatui-integration-dashboard-history has no immutable evidence revision
  364. 51.14 s gammaloop-nextest-docs> warning: developer note nix-crane-cache-reuse still requires a named owner
  365. 51.14 s gammaloop-nextest-docs>
  366. 51.14 s gammaloop-nextest-docs> thread 'tests::every_product_requires_a_task_chooser_and_each_supported_interface' (270) panicked at crates/alphal00p-docs-builder/src/lib.rs:11901:9:
  367. 51.14 s gammaloop-nextest-docs> assertion failed: format!("{error:#}").contains("has no quickstart page")
  368. 51.14 s gammaloop-nextest-docs> stack backtrace:
  369. 51.14 s gammaloop-nextest-docs> 0: __rustc::rust_begin_unwind
  370. 51.14 s gammaloop-nextest-docs> 1: core::panicking::panic_fmt
  371. 51.14 s gammaloop-nextest-docs> 2: core::panicking::panic
  372. 51.14 s gammaloop-nextest-docs> 3: alphal00p_docs_builder::tests::every_product_requires_a_task_chooser_and_each_supported_interface
  373. 51.14 s gammaloop-nextest-docs> 4: <alphal00p_docs_builder::tests::every_product_requires_a_task_chooser_and_each_supported_interface::{closure#0} as core::ops::function::FnOnce<()>>::call_once
  374. 51.14 s gammaloop-nextest-docs> note: Some details are omitted, run with `RUST_BACKTRACE=full` for a verbose backtrace.
  375. 51.14 s gammaloop-nextest-docs>
  376. 51.14 s gammaloop-nextest-docs> FAIL [ 0.113s] ( 98/111) alphal00p-docs-builder tests::pdf_manual_chapter_order_must_match_the_page_registry
  377. 51.14 s gammaloop-nextest-docs> stdout ---
  378. 51.14 s gammaloop-nextest-docs>
  379. 51.14 s gammaloop-nextest-docs> running 1 test
  380. 51.14 s gammaloop-nextest-docs> test tests::pdf_manual_chapter_order_must_match_the_page_registry ... FAILED
  381. 51.14 s gammaloop-nextest-docs>
  382. 51.14 s gammaloop-nextest-docs> failures:
  383. 51.14 s gammaloop-nextest-docs>
  384. 51.14 s gammaloop-nextest-docs> failures:
  385. 51.14 s gammaloop-nextest-docs> tests::pdf_manual_chapter_order_must_match_the_page_registry
  386. 51.14 s gammaloop-nextest-docs>
  387. 51.14 s gammaloop-nextest-docs> test result: FAILED. 0 passed; 1 failed; 0 ignored; 0 measured; 110 filtered out; finished in 0.11s
  388. 51.14 s gammaloop-nextest-docs>
  389. 51.14 s gammaloop-nextest-docs> stderr ---
  390. 51.14 s gammaloop-nextest-docs> warning: developer note gammaloop-architecture still requires a named owner
  391. 51.14 s gammaloop-nextest-docs> warning: developer note integration-dashboard still requires a named owner
  392. 51.14 s gammaloop-nextest-docs> warning: developer note uv-renormalization still requires a named owner
  393. 51.14 s gammaloop-nextest-docs> warning: developer note spenso-parsing-flow still requires a named owner
  394. 51.14 s gammaloop-nextest-docs> warning: developer note schoonschip-network still requires a named owner
  395. 51.14 s gammaloop-nextest-docs> warning: developer note gammaloop-draw-style-migration still requires a named owner
  396. 51.14 s gammaloop-nextest-docs> warning: developer note gammaloop-drawing-architecture still requires a named owner
  397. 51.14 s gammaloop-nextest-docs> warning: developer note spenso-symbolica-syntax-and-rewrites still requires a named owner
  398. 51.14 s gammaloop-nextest-docs> warning: developer note spenso-architecture still requires a named owner
  399. 51.14 s gammaloop-nextest-docs> warning: developer note idenso-architecture still requires a named owner
  400. 51.14 s gammaloop-nextest-docs> warning: developer note idenso-form-color-dirac-source-map still requires a named owner
  401. 51.14 s gammaloop-nextest-docs> warning: developer note linnet-architecture still requires a named owner
  402. 51.14 s gammaloop-nextest-docs> warning: developer note vakint-architecture still requires a named owner
  403. 51.14 s gammaloop-nextest-docs> warning: developer note gammaloop-roadmap still requires a named owner
  404. 51.14 s gammaloop-nextest-docs> warning: developer note cff-surface-cache-ownership still requires a named owner
  405. 51.14 s gammaloop-nextest-docs> warning: developer note gammaloop-drawing-evaluated-fields-history still requires a named owner
  406. 51.14 s gammaloop-nextest-docs> warning: archived developer note gammaloop-drawing-evaluated-fields-history has no immutable evidence revision
  407. 51.14 s gammaloop-nextest-docs> warning: developer note bnl-benchmark-investigation still requires a named owner
  408. 51.14 s gammaloop-nextest-docs> warning: developer note bnl-contraction-order-performance still requires a named owner
  409. 51.14 s gammaloop-nextest-docs> warning: developer note bnl-scalar-alias-capture still requires a named owner
  410. 51.14 s gammaloop-nextest-docs> warning: developer note aa-aa-three-loop-performance-smoke still requires a named owner
  411. 51.14 s gammaloop-nextest-docs> warning: developer note network-simplification still requires a named owner
  412. 51.14 s gammaloop-nextest-docs> warning: investigation developer note network-simplification has no immutable evidence revision
  413. 51.14 s gammaloop-nextest-docs> warning: developer note spenso-large-expressions still requires a named owner
  414. 51.14 s gammaloop-nextest-docs> warning: developer note spenso-improvement-effects still requires a named owner
  415. 51.14 s gammaloop-nextest-docs> warning: archived developer note spenso-improvement-effects has no immutable evidence revision
  416. 51.14 s gammaloop-nextest-docs> warning: developer note spenso-test-baseline still requires a named owner
  417. 51.14 s gammaloop-nextest-docs> warning: archived developer note spenso-test-baseline has no immutable evidence revision
  418. 51.14 s gammaloop-nextest-docs> warning: developer note bnl-evaluator-atom-capture still requires a named owner
  419. 51.14 s gammaloop-nextest-docs> warning: archived developer note bnl-evaluator-atom-capture has no immutable evidence revision
  420. 51.14 s gammaloop-nextest-docs> warning: developer note uv-scalar-profile-benchmark still requires a named owner
  421. 51.14 s gammaloop-nextest-docs> warning: archived developer note uv-scalar-profile-benchmark has no immutable evidence revision
  422. 51.14 s gammaloop-nextest-docs> warning: developer note ci-test-failure-summary-2026-03-25 still requires a named owner
  423. 51.14 s gammaloop-nextest-docs> warning: archived developer note ci-test-failure-summary-2026-03-25 has no immutable evidence revision
  424. 51.14 s gammaloop-nextest-docs> warning: developer note network-execution-rebase-record still requires a named owner
  425. 51.14 s gammaloop-nextest-docs> warning: archived developer note network-execution-rebase-record has no immutable evidence revision
  426. 51.14 s gammaloop-nextest-docs> warning: developer note ratatui-integration-dashboard-history still requires a named owner
  427. 51.14 s gammaloop-nextest-docs> warning: archived developer note ratatui-integration-dashboard-history has no immutable evidence revision
  428. 51.14 s gammaloop-nextest-docs> warning: developer note nix-crane-cache-reuse still requires a named owner
  429. 51.14 s gammaloop-nextest-docs>
  430. 51.14 s gammaloop-nextest-docs> thread 'tests::pdf_manual_chapter_order_must_match_the_page_registry' (327) panicked at crates/alphal00p-docs-builder/src/lib.rs:11952:9:
  431. 51.14 s gammaloop-nextest-docs> assertion failed: format!("{error:#}").contains("PDF manual chapter order differs")
  432. 51.14 s gammaloop-nextest-docs> stack backtrace:
  433. 51.14 s gammaloop-nextest-docs> 0: __rustc::rust_begin_unwind
  434. 51.14 s gammaloop-nextest-docs> 1: core::panicking::panic_fmt
  435. 51.14 s gammaloop-nextest-docs> 2: core::panicking::panic
  436. 51.14 s gammaloop-nextest-docs> 3: alphal00p_docs_builder::tests::pdf_manual_chapter_order_must_match_the_page_registry
  437. 51.14 s gammaloop-nextest-docs> 4: <alphal00p_docs_builder::tests::pdf_manual_chapter_order_must_match_the_page_registry::{closure#0} as core::ops::function::FnOnce<()>>::call_once
  438. 51.14 s gammaloop-nextest-docs> note: Some details are omitted, run with `RUST_BACKTRACE=full` for a verbose backtrace.
  439. 51.14 s gammaloop-nextest-docs>
  440. 51.15 s gammaloop-nextest-docs> error: test run failed
  441. 51.23 s gammaloop-nextest-docs>
  442. 51.23 s gammaloop-nextest-docs> ========== nextest test summary ==========
  443. 51.23 s gammaloop-nextest-docs> report: target/nextest/ci_gammaloop/junit.xml
  444. 51.23 s gammaloop-nextest-docs> tests: 111, failures: 3, errors: 0
  445. 51.23 s gammaloop-nextest-docs>
  446. 51.23 s gammaloop-nextest-docs> 1. alphal00p-docs-builder::tests::checked_in_registry_is_valid
  447. 51.23 s gammaloop-nextest-docs> failure: test failure with exit code 101
  448. 51.23 s gammaloop-nextest-docs> thread 'tests::checked_in_registry_is_valid' (165) panicked at crates/alphal00p-docs-builder/src/lib.rs:11887:50:
  449. 51.23 s gammaloop-nextest-docs> called `Result::unwrap()` on an `Err` value: developer note nix-crane-cache-reuse verified scope flake.nix changed (expected 188504937418859942a6770ca21a4f4e0a7ff125, found 2055acf4433777d5a18c44d88e8416b42a938f3a); owner review or an explicit no-impact attestation is required
  450. 51.23 s gammaloop-nextest-docs>
  451. 51.23 s gammaloop-nextest-docs> Location:
  452. 51.23 s gammaloop-nextest-docs> crates/alphal00p-docs-builder/src/lib.rs:889:21
  453. 51.23 s gammaloop-nextest-docs> stack backtrace:
  454. 51.23 s gammaloop-nextest-docs> 0: __rustc::rust_begin_unwind
  455. 51.23 s gammaloop-nextest-docs> 1: core::panicking::panic_fmt
  456. 51.23 s gammaloop-nextest-docs> 2: core::result::unwrap_failed
  457. 51.23 s gammaloop-nextest-docs> 3: alphal00p_docs_builder::tests::checked_in_registry_is_valid
  458. 51.23 s gammaloop-nextest-docs> 4: <alphal00p_docs_builder::tests::checked_in_registry_is_valid::{closure#0} as core::ops::function::FnOnce<()>>::call_once
  459. 51.23 s gammaloop-nextest-docs> note: Some details are omitted, run with `RUST_BACKTRACE=full` for a verbose backtrace.
  460. 51.23 s gammaloop-nextest-docs> system-out
  461. 51.23 s gammaloop-nextest-docs> running 1 test
  462. 51.23 s gammaloop-nextest-docs> test tests::checked_in_registry_is_valid ... FAILED
  463. 51.23 s gammaloop-nextest-docs>
  464. 51.23 s gammaloop-nextest-docs> failures:
  465. 51.23 s gammaloop-nextest-docs>
  466. 51.23 s gammaloop-nextest-docs> failures:
  467. 51.23 s gammaloop-nextest-docs> tests::checked_in_registry_is_valid
  468. 51.23 s gammaloop-nextest-docs>
  469. 51.23 s gammaloop-nextest-docs> test result: FAILED. 0 passed; 1 failed; 0 ignored; 0 measured; 110 filtered out; finished in 0.11s
  470. 51.23 s gammaloop-nextest-docs> system-err
  471. 51.23 s gammaloop-nextest-docs> warning: developer note gammaloop-architecture still requires a named owner
  472. 51.23 s gammaloop-nextest-docs> warning: developer note integration-dashboard still requires a named owner
  473. 51.23 s gammaloop-nextest-docs> warning: developer note uv-renormalization still requires a named owner
  474. 51.23 s gammaloop-nextest-docs> warning: developer note spenso-parsing-flow still requires a named owner
  475. 51.23 s gammaloop-nextest-docs> warning: developer note schoonschip-network still requires a named owner
  476. 51.23 s gammaloop-nextest-docs> warning: developer note gammaloop-draw-style-migration still requires a named owner
  477. 51.23 s gammaloop-nextest-docs> warning: developer note gammaloop-drawing-architecture still requires a named owner
  478. 51.23 s gammaloop-nextest-docs> warning: developer note spenso-symbolica-syntax-and-rewrites still requires a named owner
  479. 51.23 s gammaloop-nextest-docs> warning: developer note spenso-architecture still requires a named owner
  480. 51.23 s gammaloop-nextest-docs> warning: developer note idenso-architecture still requires a named owner
  481. 51.23 s gammaloop-nextest-docs> warning: developer note idenso-form-color-dirac-source-map still requires a named owner
  482. 51.23 s gammaloop-nextest-docs> warning: developer note linnet-architecture still requires a named owner
  483. 51.23 s gammaloop-nextest-docs> warning: developer note vakint-architecture still requires a named owner
  484. 51.23 s gammaloop-nextest-docs> warning: developer note gammaloop-roadmap still requires a named owner
  485. 51.23 s gammaloop-nextest-docs> warning: developer note cff-surface-cache-ownership still requires a named owner
  486. 51.23 s gammaloop-nextest-docs> warning: developer note gammaloop-drawing-evaluated-fields-history still requires a named owner
  487. 51.23 s gammaloop-nextest-docs> warning: archived developer note gammaloop-drawing-evaluated-fields-history has no immutable evidence revision
  488. 51.23 s gammaloop-nextest-docs> warning: developer note bnl-benchmark-investigation still requires a named owner
  489. 51.23 s gammaloop-nextest-docs> warning: developer note bnl-contraction-order-performance still requires a named owner
  490. 51.23 s gammaloop-nextest-docs> warning: developer note bnl-scalar-alias-capture still requires a named owner
  491. 51.23 s gammaloop-nextest-docs> warning: developer note aa-aa-three-loop-performance-smoke still requires a named owner
  492. 51.23 s gammaloop-nextest-docs> warning: developer note network-simplification still requires a named owner
  493. 51.23 s gammaloop-nextest-docs> warning: investigation developer note network-simplification has no immutable evidence revision
  494. 51.23 s gammaloop-nextest-docs> warning: developer note spenso-large-expressions still requires a named owner
  495. 51.23 s gammaloop-nextest-docs> warning: developer note spenso-improvement-effects still requires a named owner
  496. 51.23 s gammaloop-nextest-docs> warning: archived developer note spenso-improvement-effects has no immutable evidence revision
  497. 51.23 s gammaloop-nextest-docs> warning: developer note spenso-test-baseline still requires a named owner
  498. 51.23 s gammaloop-nextest-docs> warning: archived developer note spenso-test-baseline has no immutable evidence revision
  499. 51.23 s gammaloop-nextest-docs> warning: developer note bnl-evaluator-atom-capture still requires a named owner
  500. 51.23 s gammaloop-nextest-docs> warning: archived developer note bnl-evaluator-atom-capture has no immutable evidence revision
  501. 51.23 s gammaloop-nextest-docs> warning: developer note uv-scalar-profile-benchmark still requires a named owner
  502. 51.23 s gammaloop-nextest-docs> warning: archived developer note uv-scalar-profile-benchmark has no immutable evidence revision
  503. 51.23 s gammaloop-nextest-docs> warning: developer note ci-test-failure-summary-2026-03-25 still requires a named owner
  504. 51.23 s gammaloop-nextest-docs> warning: archived developer note ci-test-failure-summary-2026-03-25 has no immutable evidence revision
  505. 51.23 s gammaloop-nextest-docs> warning: developer note network-execution-rebase-record still requires a named owner
  506. 51.23 s gammaloop-nextest-docs> warning: archived developer note network-execution-rebase-record has no immutable evidence revision
  507. 51.23 s gammaloop-nextest-docs> warning: developer note ratatui-integration-dashboard-history still requires a named owner
  508. 51.23 s gammaloop-nextest-docs> warning: archived developer note ratatui-integration-dashboard-history has no immutable evidence revision
  509. 51.23 s gammaloop-nextest-docs> warning: developer note nix-crane-cache-reuse still requires a named owner
  510. 51.23 s gammaloop-nextest-docs>
  511. 51.23 s gammaloop-nextest-docs> thread 'tests::checked_in_registry_is_valid' (165) panicked at crates/alphal00p-docs-builder/src/lib.rs:11887:50:
  512. 51.23 s gammaloop-nextest-docs> called `Result::unwrap()` on an `Err` value: developer note nix-crane-cache-reuse verified scope flake.nix changed (expected 188504937418859942a6770ca21a4f4e0a7ff125, found 2055acf4433777d5a18c44d88e8416b42a938f3a); owner review or an explicit no-impact attestation is required
  513. 51.23 s gammaloop-nextest-docs>
  514. 51.23 s gammaloop-nextest-docs> Location:
  515. 51.23 s gammaloop-nextest-docs> crates/alphal00p-docs-builder/src/lib.rs:889:21
  516. 51.23 s gammaloop-nextest-docs> stack backtrace:
  517. 51.23 s gammaloop-nextest-docs> 0: __rustc::rust_begin_unwind
  518. 51.23 s gammaloop-nextest-docs> 1: core::panicking::panic_fmt
  519. 51.23 s gammaloop-nextest-docs> 2: core::result::unwrap_failed
  520. 51.23 s gammaloop-nextest-docs> 3: alphal00p_docs_builder::tests::checked_in_registry_is_valid
  521. 51.23 s gammaloop-nextest-docs> 4: <alphal00p_docs_builder::tests::checked_in_registry_is_valid::{closure#0} as core::ops::function::FnOnce<()>>::call_once
  522. 51.23 s gammaloop-nextest-docs> note: Some details are omitted, run with `RUST_BACKTRACE=full` for a verbose backtrace.
  523. 51.23 s gammaloop-nextest-docs>
  524. 51.23 s gammaloop-nextest-docs> 2. alphal00p-docs-builder::tests::every_product_requires_a_task_chooser_and_each_supported_interface
  525. 51.23 s gammaloop-nextest-docs> failure: test failure with exit code 101
  526. 51.23 s gammaloop-nextest-docs> thread 'tests::every_product_requires_a_task_chooser_and_each_supported_interface' (270) panicked at crates/alphal00p-docs-builder/src/lib.rs:11901:9:
  527. 51.23 s gammaloop-nextest-docs> assertion failed: format!("{error:#}").contains("has no quickstart page")
  528. 51.23 s gammaloop-nextest-docs> stack backtrace:
  529. 51.23 s gammaloop-nextest-docs> 0: __rustc::rust_begin_unwind
  530. 51.23 s gammaloop-nextest-docs> 1: core::panicking::panic_fmt
  531. 51.23 s gammaloop-nextest-docs> 2: core::panicking::panic
  532. 51.23 s gammaloop-nextest-docs> 3: alphal00p_docs_builder::tests::every_product_requires_a_task_chooser_and_each_supported_interface
  533. 51.23 s gammaloop-nextest-docs> 4: <alphal00p_docs_builder::tests::every_product_requires_a_task_chooser_and_each_supported_interface::{closure#0} as core::ops::function::FnOnce<()>>::call_once
  534. 51.23 s gammaloop-nextest-docs> note: Some details are omitted, run with `RUST_BACKTRACE=full` for a verbose backtrace.
  535. 51.23 s gammaloop-nextest-docs> system-out
  536. 51.23 s gammaloop-nextest-docs> running 1 test
  537. 51.23 s gammaloop-nextest-docs> test tests::every_product_requires_a_task_chooser_and_each_supported_interface ... FAILED
  538. 51.23 s gammaloop-nextest-docs>
  539. 51.23 s gammaloop-nextest-docs> failures:
  540. 51.23 s gammaloop-nextest-docs>
  541. 51.23 s gammaloop-nextest-docs> failures:
  542. 51.23 s gammaloop-nextest-docs> tests::every_product_requires_a_task_chooser_and_each_supported_interface
  543. 51.23 s gammaloop-nextest-docs>
  544. 51.23 s gammaloop-nextest-docs> test result: FAILED. 0 passed; 1 failed; 0 ignored; 0 measured; 110 filtered out; finished in 0.12s
  545. 51.23 s gammaloop-nextest-docs> system-err
  546. 51.23 s gammaloop-nextest-docs> warning: developer note gammaloop-architecture still requires a named owner
  547. 51.23 s gammaloop-nextest-docs> warning: developer note integration-dashboard still requires a named owner
  548. 51.23 s gammaloop-nextest-docs> warning: developer note uv-renormalization still requires a named owner
  549. 51.23 s gammaloop-nextest-docs> warning: developer note spenso-parsing-flow still requires a named owner
  550. 51.23 s gammaloop-nextest-docs> warning: developer note schoonschip-network still requires a named owner
  551. 51.23 s gammaloop-nextest-docs> warning: developer note gammaloop-draw-style-migration still requires a named owner
  552. 51.23 s gammaloop-nextest-docs> warning: developer note gammaloop-drawing-architecture still requires a named owner
  553. 51.23 s gammaloop-nextest-docs> warning: developer note spenso-symbolica-syntax-and-rewrites still requires a named owner
  554. 51.23 s gammaloop-nextest-docs> warning: developer note spenso-architecture still requires a named owner
  555. 51.23 s gammaloop-nextest-docs> warning: developer note idenso-architecture still requires a named owner
  556. 51.23 s gammaloop-nextest-docs> warning: developer note idenso-form-color-dirac-source-map still requires a named owner
  557. 51.23 s gammaloop-nextest-docs> warning: developer note linnet-architecture still requires a named owner
  558. 51.23 s gammaloop-nextest-docs> warning: developer note vakint-architecture still requires a named owner
  559. 51.23 s gammaloop-nextest-docs> warning: developer note gammaloop-roadmap still requires a named owner
  560. 51.23 s gammaloop-nextest-docs> warning: developer note cff-surface-cache-ownership still requires a named owner
  561. 51.23 s gammaloop-nextest-docs> warning: developer note gammaloop-drawing-evaluated-fields-history still requires a named owner
  562. 51.23 s gammaloop-nextest-docs> warning: archived developer note gammaloop-drawing-evaluated-fields-history has no immutable evidence revision
  563. 51.23 s gammaloop-nextest-docs> warning: developer note bnl-benchmark-investigation still requires a named owner
  564. 51.23 s gammaloop-nextest-docs> warning: developer note bnl-contraction-order-performance still requires a named owner
  565. 51.23 s gammaloop-nextest-docs> warning: developer note bnl-scalar-alias-capture still requires a named owner
  566. 51.23 s gammaloop-nextest-docs> warning: developer note aa-aa-three-loop-performance-smoke still requires a named owner
  567. 51.23 s gammaloop-nextest-docs> warning: developer note network-simplification still requires a named owner
  568. 51.23 s gammaloop-nextest-docs> warning: investigation developer note network-simplification has no immutable evidence revision
  569. 51.23 s gammaloop-nextest-docs> warning: developer note spenso-large-expressions still requires a named owner
  570. 51.23 s gammaloop-nextest-docs> warning: developer note spenso-improvement-effects still requires a named owner
  571. 51.23 s gammaloop-nextest-docs> warning: archived developer note spenso-improvement-effects has no immutable evidence revision
  572. 51.23 s gammaloop-nextest-docs> warning: developer note spenso-test-baseline still requires a named owner
  573. 51.23 s gammaloop-nextest-docs> warning: archived developer note spenso-test-baseline has no immutable evidence revision
  574. 51.23 s gammaloop-nextest-docs> warning: developer note bnl-evaluator-atom-capture still requires a named owner
  575. 51.23 s gammaloop-nextest-docs> warning: archived developer note bnl-evaluator-atom-capture has no immutable evidence revision
  576. 51.23 s gammaloop-nextest-docs> warning: developer note uv-scalar-profile-benchmark still requires a named owner
  577. 51.23 s gammaloop-nextest-docs> warning: archived developer note uv-scalar-profile-benchmark has no immutable evidence revision
  578. 51.23 s gammaloop-nextest-docs> warning: developer note ci-test-failure-summary-2026-03-25 still requires a named owner
  579. 51.23 s gammaloop-nextest-docs> warning: archived developer note ci-test-failure-summary-2026-03-25 has no immutable evidence revision
  580. 51.23 s gammaloop-nextest-docs> warning: developer note network-execution-rebase-record still requires a named owner
  581. 51.23 s gammaloop-nextest-docs> warning: archived developer note network-execution-rebase-record has no immutable evidence revision
  582. 51.23 s gammaloop-nextest-docs> warning: developer note ratatui-integration-dashboard-history still requires a named owner
  583. 51.23 s gammaloop-nextest-docs> warning: archived developer note ratatui-integration-dashboard-history has no immutable evidence revision
  584. 51.23 s gammaloop-nextest-docs> warning: developer note nix-crane-cache-reuse still requires a named owner
  585. 51.23 s gammaloop-nextest-docs>
  586. 51.23 s gammaloop-nextest-docs> thread 'tests::every_product_requires_a_task_chooser_and_each_supported_interface' (270) panicked at crates/alphal00p-docs-builder/src/lib.rs:11901:9:
  587. 51.23 s gammaloop-nextest-docs> assertion failed: format!("{error:#}").contains("has no quickstart page")
  588. 51.23 s gammaloop-nextest-docs> stack backtrace:
  589. 51.23 s gammaloop-nextest-docs> 0: __rustc::rust_begin_unwind
  590. 51.23 s gammaloop-nextest-docs> 1: core::panicking::panic_fmt
  591. 51.23 s gammaloop-nextest-docs> 2: core::panicking::panic
  592. 51.23 s gammaloop-nextest-docs> 3: alphal00p_docs_builder::tests::every_product_requires_a_task_chooser_and_each_supported_interface
  593. 51.23 s gammaloop-nextest-docs> 4: <alphal00p_docs_builder::tests::every_product_requires_a_task_chooser_and_each_supported_interface::{closure#0} as core::ops::function::FnOnce<()>>::call_once
  594. 51.23 s gammaloop-nextest-docs> note: Some details are omitted, run with `RUST_BACKTRACE=full` for a verbose backtrace.
  595. 51.23 s gammaloop-nextest-docs>
  596. 51.23 s gammaloop-nextest-docs> 3. alphal00p-docs-builder::tests::pdf_manual_chapter_order_must_match_the_page_registry
  597. 51.23 s gammaloop-nextest-docs> failure: test failure with exit code 101
  598. 51.23 s gammaloop-nextest-docs> thread 'tests::pdf_manual_chapter_order_must_match_the_page_registry' (327) panicked at crates/alphal00p-docs-builder/src/lib.rs:11952:9:
  599. 51.23 s gammaloop-nextest-docs> assertion failed: format!("{error:#}").contains("PDF manual chapter order differs")
  600. 51.23 s gammaloop-nextest-docs> stack backtrace:
  601. 51.23 s gammaloop-nextest-docs> 0: __rustc::rust_begin_unwind
  602. 51.23 s gammaloop-nextest-docs> 1: core::panicking::panic_fmt
  603. 51.23 s gammaloop-nextest-docs> 2: core::panicking::panic
  604. 51.23 s gammaloop-nextest-docs> 3: alphal00p_docs_builder::tests::pdf_manual_chapter_order_must_match_the_page_registry
  605. 51.23 s gammaloop-nextest-docs> 4: <alphal00p_docs_builder::tests::pdf_manual_chapter_order_must_match_the_page_registry::{closure#0} as core::ops::function::FnOnce<()>>::call_once
  606. 51.23 s gammaloop-nextest-docs> note: Some details are omitted, run with `RUST_BACKTRACE=full` for a verbose backtrace.
  607. 51.23 s gammaloop-nextest-docs> system-out
  608. 51.23 s gammaloop-nextest-docs> running 1 test
  609. 51.23 s gammaloop-nextest-docs> test tests::pdf_manual_chapter_order_must_match_the_page_registry ... FAILED
  610. 51.23 s gammaloop-nextest-docs>
  611. 51.23 s gammaloop-nextest-docs> failures:
  612. 51.23 s gammaloop-nextest-docs>
  613. 51.23 s gammaloop-nextest-docs> failures:
  614. 51.23 s gammaloop-nextest-docs> tests::pdf_manual_chapter_order_must_match_the_page_registry
  615. 51.23 s gammaloop-nextest-docs>
  616. 51.23 s gammaloop-nextest-docs> test result: FAILED. 0 passed; 1 failed; 0 ignored; 0 measured; 110 filtered out; finished in 0.11s
  617. 51.23 s gammaloop-nextest-docs> system-err
  618. 51.23 s gammaloop-nextest-docs> warning: developer note gammaloop-architecture still requires a named owner
  619. 51.23 s gammaloop-nextest-docs> warning: developer note integration-dashboard still requires a named owner
  620. 51.23 s gammaloop-nextest-docs> warning: developer note uv-renormalization still requires a named owner
  621. 51.23 s gammaloop-nextest-docs> warning: developer note spenso-parsing-flow still requires a named owner
  622. 51.23 s gammaloop-nextest-docs> warning: developer note schoonschip-network still requires a named owner
  623. 51.23 s gammaloop-nextest-docs> warning: developer note gammaloop-draw-style-migration still requires a named owner
  624. 51.23 s gammaloop-nextest-docs> warning: developer note gammaloop-drawing-architecture still requires a named owner
  625. 51.23 s gammaloop-nextest-docs> warning: developer note spenso-symbolica-syntax-and-rewrites still requires a named owner
  626. 51.23 s gammaloop-nextest-docs> warning: developer note spenso-architecture still requires a named owner
  627. 51.23 s gammaloop-nextest-docs> warning: developer note idenso-architecture still requires a named owner
  628. 51.23 s gammaloop-nextest-docs> warning: developer note idenso-form-color-dirac-source-map still requires a named owner
  629. 51.23 s gammaloop-nextest-docs> warning: developer note linnet-architecture still requires a named owner
  630. 51.23 s gammaloop-nextest-docs> warning: developer note vakint-architecture still requires a named owner
  631. 51.23 s gammaloop-nextest-docs> warning: developer note gammaloop-roadmap still requires a named owner
  632. 51.23 s gammaloop-nextest-docs> warning: developer note cff-surface-cache-ownership still requires a named owner
  633. 51.23 s gammaloop-nextest-docs> warning: developer note gammaloop-drawing-evaluated-fields-history still requires a named owner
  634. 51.23 s gammaloop-nextest-docs> warning: archived developer note gammaloop-drawing-evaluated-fields-history has no immutable evidence revision
  635. 51.23 s gammaloop-nextest-docs> warning: developer note bnl-benchmark-investigation still requires a named owner
  636. 51.23 s gammaloop-nextest-docs> warning: developer note bnl-contraction-order-performance still requires a named owner
  637. 51.23 s gammaloop-nextest-docs> warning: developer note bnl-scalar-alias-capture still requires a named owner
  638. 51.23 s gammaloop-nextest-docs> warning: developer note aa-aa-three-loop-performance-smoke still requires a named owner
  639. 51.23 s gammaloop-nextest-docs> warning: developer note network-simplification still requires a named owner
  640. 51.23 s gammaloop-nextest-docs> warning: investigation developer note network-simplification has no immutable evidence revision
  641. 51.23 s gammaloop-nextest-docs> warning: developer note spenso-large-expressions still requires a named owner
  642. 51.23 s gammaloop-nextest-docs> warning: developer note spenso-improvement-effects still requires a named owner
  643. 51.23 s gammaloop-nextest-docs> warning: archived developer note spenso-improvement-effects has no immutable evidence revision
  644. 51.23 s gammaloop-nextest-docs> warning: developer note spenso-test-baseline still requires a named owner
  645. 51.23 s gammaloop-nextest-docs> warning: archived developer note spenso-test-baseline has no immutable evidence revision
  646. 51.23 s gammaloop-nextest-docs> warning: developer note bnl-evaluator-atom-capture still requires a named owner
  647. 51.23 s gammaloop-nextest-docs> warning: archived developer note bnl-evaluator-atom-capture has no immutable evidence revision
  648. 51.23 s gammaloop-nextest-docs> warning: developer note uv-scalar-profile-benchmark still requires a named owner
  649. 51.23 s gammaloop-nextest-docs> warning: archived developer note uv-scalar-profile-benchmark has no immutable evidence revision
  650. 51.23 s gammaloop-nextest-docs> warning: developer note ci-test-failure-summary-2026-03-25 still requires a named owner
  651. 51.23 s gammaloop-nextest-docs> warning: archived developer note ci-test-failure-summary-2026-03-25 has no immutable evidence revision
  652. 51.23 s gammaloop-nextest-docs> warning: developer note network-execution-rebase-record still requires a named owner
  653. 51.23 s gammaloop-nextest-docs> warning: archived developer note network-execution-rebase-record has no immutable evidence revision
  654. 51.23 s gammaloop-nextest-docs> warning: developer note ratatui-integration-dashboard-history still requires a named owner
  655. 51.23 s gammaloop-nextest-docs> warning: archived developer note ratatui-integration-dashboard-history has no immutable evidence revision
  656. 51.23 s gammaloop-nextest-docs> warning: developer note nix-crane-cache-reuse still requires a named owner
  657. 51.23 s gammaloop-nextest-docs>
  658. 51.23 s gammaloop-nextest-docs> thread 'tests::pdf_manual_chapter_order_must_match_the_page_registry' (327) panicked at crates/alphal00p-docs-builder/src/lib.rs:11952:9:
  659. 51.23 s gammaloop-nextest-docs> assertion failed: format!("{error:#}").contains("PDF manual chapter order differs")
  660. 51.23 s gammaloop-nextest-docs> stack backtrace:
  661. 51.23 s gammaloop-nextest-docs> 0: __rustc::rust_begin_unwind
  662. 51.23 s gammaloop-nextest-docs> 1: core::panicking::panic_fmt
  663. 51.23 s gammaloop-nextest-docs> 2: core::panicking::panic
  664. 51.23 s gammaloop-nextest-docs> 3: alphal00p_docs_builder::tests::pdf_manual_chapter_order_must_match_the_page_registry
  665. 51.23 s gammaloop-nextest-docs> 4: <alphal00p_docs_builder::tests::pdf_manual_chapter_order_must_match_the_page_registry::{closure#0} as core::ops::function::FnOnce<()>>::call_once
  666. 51.23 s gammaloop-nextest-docs> note: Some details are omitted, run with `RUST_BACKTRACE=full` for a verbose backtrace.
  667. 51.23 s gammaloop-nextest-docs> =========================================
  668. 51.25 s gammaloop-nextest-docs> Extracting 2 binaries to /build/source
  669. 51.31 s gammaloop-nextest-docs> Extracted 5 files to /build/source in 0.06s
  670. 51.33 s gammaloop-nextest-docs> ------------
  671. 51.33 s gammaloop-nextest-docs> Nextest run ID 1d3999e8-c2e5-45d2-ae24-d6e7fa86840b with nextest profile: ci_gammaloop
  672. 51.33 s gammaloop-nextest-docs> Starting 22 tests across 2 binaries
  673. 51.35 s gammaloop-nextest-docs> ------------
  674. 51.35 s gammaloop-nextest-docs> Summary [ 0.026s] 22 tests run: 22 passed, 0 skipped
  675. 51.41 s gammaloop-nextest-docs>
  676. 51.41 s gammaloop-nextest-docs> ========== nextest test summary ==========
  677. 51.41 s gammaloop-nextest-docs> report: target/nextest/ci_gammaloop/junit.xml
  678. 51.41 s gammaloop-nextest-docs> tests: 22, failures: 0, errors: 0
  679. 51.41 s gammaloop-nextest-docs> No failing testcases found.
  680. 51.41 s gammaloop-nextest-docs> =========================================
  681. 51.44 s gammaloop-nextest-docs> Extracting 3 binaries (including 2 non-test binaries), 1 build script output directory, and 2 linked paths to /build/source
  682. 51.84 s gammaloop-nextest-docs> Extracted 22 files to /build/source in 0.40s
  683. 51.85 s gammaloop-nextest-docs> ------------
  684. 51.85 s gammaloop-nextest-docs> Nextest run ID 3f0845e9-b888-46a0-a4d7-80b73b7070f3 with nextest profile: ci_gammaloop
  685. 51.85 s gammaloop-nextest-docs> Starting 89 tests across 1 binary
  686. 51.91 s gammaloop-nextest-docs> ------------
  687. 51.91 s gammaloop-nextest-docs> Summary [ 0.061s] 89 tests run: 89 passed, 0 skipped
  688. 51.97 s gammaloop-nextest-docs>
  689. 51.97 s gammaloop-nextest-docs> ========== nextest test summary ==========
  690. 51.97 s gammaloop-nextest-docs> report: target/nextest/ci_gammaloop/junit.xml
  691. 51.97 s gammaloop-nextest-docs> tests: 89, failures: 0, errors: 0
  692. 51.97 s gammaloop-nextest-docs> No failing testcases found.
  693. 51.97 s gammaloop-nextest-docs> =========================================
  694. 51.99 s gammaloop-nextest-docs> Extracting 2 binaries to /build/source
  695. 52.05 s gammaloop-nextest-docs> Extracted 5 files to /build/source in 0.06s
  696. 52.07 s gammaloop-nextest-docs> ------------
  697. 52.07 s gammaloop-nextest-docs> Nextest run ID 5dc8bf56-c159-4097-bca6-094dafefa799 with nextest profile: ci_gammaloop
  698. 52.07 s gammaloop-nextest-docs> Starting 10 tests across 2 binaries
  699. 73.06 s gammaloop-nextest-docs> ------------
  700. 73.06 s gammaloop-nextest-docs> Summary [ 20.985s] 10 tests run: 10 passed, 0 skipped
  701. 73.13 s gammaloop-nextest-docs>
  702. 73.13 s gammaloop-nextest-docs> ========== nextest test summary ==========
  703. 73.13 s gammaloop-nextest-docs> report: target/nextest/ci_gammaloop/junit.xml
  704. 73.13 s gammaloop-nextest-docs> tests: 10, failures: 0, errors: 0
  705. 73.13 s gammaloop-nextest-docs> No failing testcases found.
  706. 73.13 s gammaloop-nextest-docs> =========================================
  707. 73.17 s gammaloop-nextest-docs> Extracting 1 binary to /build/source
  708. 73.22 s gammaloop-nextest-docs> Extracted 4 files to /build/source in 0.06s
  709. 73.24 s gammaloop-nextest-docs> ------------
  710. 73.24 s gammaloop-nextest-docs> Nextest run ID 652cb51e-5af1-430a-a42a-bb39b73da846 with nextest profile: ci_gammaloop
  711. 73.24 s gammaloop-nextest-docs> Starting 0 tests across 1 binary
  712. 73.25 s gammaloop-nextest-docs> ------------
  713. 73.25 s gammaloop-nextest-docs> Summary [ 0.008s] 0 tests run: 0 passed, 0 skipped
  714. 73.33 s gammaloop-nextest-docs>
  715. 73.33 s gammaloop-nextest-docs> ========== nextest test summary ==========
  716. 73.33 s gammaloop-nextest-docs> report: target/nextest/ci_gammaloop/junit.xml
  717. 73.33 s gammaloop-nextest-docs> tests: 0, failures: 0, errors: 0
  718. 73.33 s gammaloop-nextest-docs> No failing testcases found.
  719. 73.33 s gammaloop-nextest-docs> =========================================
  720. 73.37 s gammaloop-nextest-docs> Extracting 1 binary to /build/source
  721. 73.46 s gammaloop-nextest-docs> Extracted 4 files to /build/source in 0.09s
  722. 73.51 s gammaloop-nextest-docs> ------------
  723. 73.51 s gammaloop-nextest-docs> Nextest run ID 60222e3b-1321-4ed0-8bc6-210332d80515 with nextest profile: ci_gammaloop
  724. 73.51 s gammaloop-nextest-docs> Starting 5 tests across 1 binary
  725. 73.55 s gammaloop-nextest-docs> ------------
  726. 73.55 s gammaloop-nextest-docs> Summary [ 0.049s] 5 tests run: 5 passed, 0 skipped
  727. 73.62 s gammaloop-nextest-docs>
  728. 73.62 s gammaloop-nextest-docs> ========== nextest test summary ==========
  729. 73.62 s gammaloop-nextest-docs> report: target/nextest/ci_gammaloop/junit.xml
  730. 73.62 s gammaloop-nextest-docs> tests: 5, failures: 0, errors: 0
  731. 73.62 s gammaloop-nextest-docs> No failing testcases found.
  732. 73.62 s gammaloop-nextest-docs> =========================================
  733. 73.98 s [2 built (1 failed), 17 error: Cannot build '/nix/store/iba9mhp7j85acznvf18xhmxcpgblqny8-gammaloop-nextest-docs.drv'.
  734. 73.98 s Reason: builder failed with exit code 100.
  735. 73.98 s Output paths:
  736. 73.98 s /nix/store/dhrilg2md2vkpn5szwq1dqhrk46mlnir-gammaloop-nextest-docs
  737. 73.98 s Last 690 log lines:
  738. 73.98 s > Extracting 2 binaries to /build/source
  739. 73.98 s > Extracted 5 files to /build/source in 0.07s
  740. 73.98 s > ------------
  741. 73.98 s > Nextest run ID 49c2016a-0bbb-443e-8924-01bf7aeb5246 with nextest profile: ci_gammaloop
  742. 73.98 s > Starting 111 tests across 2 binaries
  743. 73.98 s > FAIL [ 0.119s] ( 70/111) alphal00p-docs-builder tests::checked_in_registry_is_valid
  744. 73.98 s > stdout ---
  745. 73.98 s >
  746. 73.98 s > running 1 test
  747. 73.98 s > test tests::checked_in_registry_is_valid ... FAILED
  748. 73.98 s >
  749. 73.98 s > failures:
  750. 73.98 s >
  751. 73.98 s > failures:
  752. 73.98 s > tests::checked_in_registry_is_valid
  753. 73.98 s >
  754. 73.98 s > test result: FAILED. 0 passed; 1 failed; 0 ignored; 0 measured; 110 filtered out; finished in 0.11s
  755. 73.98 s >
  756. 73.98 s > stderr ---
  757. 73.98 s > warning: developer note gammaloop-architecture still requires a named owner
  758. 73.98 s > warning: developer note integration-dashboard still requires a named owner
  759. 73.98 s > warning: developer note uv-renormalization still requires a named owner
  760. 73.98 s > warning: developer note spenso-parsing-flow still requires a named owner
  761. 73.98 s > warning: developer note schoonschip-network still requires a named owner
  762. 73.98 s > warning: developer note gammaloop-draw-style-migration still requires a named owner
  763. 73.98 s > warning: developer note gammaloop-drawing-architecture still requires a named owner
  764. 73.98 s > warning: developer note spenso-symbolica-syntax-and-rewrites still requires a named owner
  765. 73.98 s > warning: developer note spenso-architecture still requires a named owner
  766. 73.98 s > warning: developer note idenso-architecture still requires a named owner
  767. 73.98 s > warning: developer note idenso-form-color-dirac-source-map still requires a named owner
  768. 73.98 s > warning: developer note linnet-architecture still requires a named owner
  769. 73.98 s > warning: developer note vakint-architecture still requires a named owner
  770. 73.98 s > warning: developer note gammaloop-roadmap still requires a named owner
  771. 73.98 s > warning: developer note cff-surface-cache-ownership still requires a named owner
  772. 73.98 s > warning: developer note gammaloop-drawing-evaluated-fields-history still requires a named owner
  773. 73.98 s > warning: archived developer note gammaloop-drawing-evaluated-fields-history has no immutable evidence revision
  774. 73.98 s > warning: developer note bnl-benchmark-investigation still requires a named owner
  775. 73.98 s > warning: developer note bnl-contraction-order-performance still requires a named owner
  776. 73.98 s > warning: developer note bnl-scalar-alias-capture still requires a named owner
  777. 73.98 s > warning: developer note aa-aa-three-loop-performance-smoke still requires a named owner
  778. 73.98 s > warning: developer note network-simplification still requires a named owner
  779. 73.98 s > warning: investigation developer note network-simplification has no immutable evidence revision
  780. 73.98 s > warning: developer note spenso-large-expressions still requires a named owner
  781. 73.98 s > warning: developer note spenso-improvement-effects still requires a named owner
  782. 73.98 s > warning: archived developer note spenso-improvement-effects has no immutable evidence revision
  783. 73.98 s > warning: developer note spenso-test-baseline still requires a named owner
  784. 73.98 s > warning: archived developer note spenso-test-baseline has no immutable evidence revision
  785. 73.98 s > warning: developer note bnl-evaluator-atom-capture still requires a named owner
  786. 73.98 s > warning: archived developer note bnl-evaluator-atom-capture has no immutable evidence revision
  787. 73.98 s > warning: developer note uv-scalar-profile-benchmark still requires a named owner
  788. 73.98 s > warning: archived developer note uv-scalar-profile-benchmark has no immutable evidence revision
  789. 73.98 s > warning: developer note ci-test-failure-summary-2026-03-25 still requires a named owner
  790. 73.98 s > warning: archived developer note ci-test-failure-summary-2026-03-25 has no immutable evidence revision
  791. 73.98 s > warning: developer note network-execution-rebase-record still requires a named owner
  792. 73.98 s > warning: archived developer note network-execution-rebase-record has no immutable evidence revision
  793. 73.98 s > warning: developer note ratatui-integration-dashboard-history still requires a named owner
  794. 73.98 s > warning: archived developer note ratatui-integration-dashboard-history has no immutable evidence revision
  795. 73.98 s > warning: developer note nix-crane-cache-reuse still requires a named owner
  796. 73.98 s >
  797. 73.98 s > thread 'tests::checked_in_registry_is_valid' (165) panicked at crates/alphal00p-docs-builder/src/lib.rs:11887:50:
  798. 73.98 s > called `Result::unwrap()` on an `Err` value: developer note nix-crane-cache-reuse verified scope flake.nix changed (expected 188504937418859942a6770ca21a4f4e0a7ff125, found 2055acf4433777d5a18c44d88e8416b42a938f3a); owner review or an explicit no-impact attestation is required
  799. 73.98 s >
  800. 73.98 s > Location:
  801. 73.98 s > crates/alphal00p-docs-builder/src/lib.rs:889:21
  802. 73.98 s > stack backtrace:
  803. 73.98 s > 0: __rustc::rust_begin_unwind
  804. 73.98 s > 1: core::panicking::panic_fmt
  805. 73.98 s > 2: core::result::unwrap_failed
  806. 73.98 s > 3: alphal00p_docs_builder::tests::checked_in_registry_is_valid
  807. 73.98 s > 4: <alphal00p_docs_builder::tests::checked_in_registry_is_valid::{closure#0} as core::ops::function::FnOnce<()>>::call_once
  808. 73.98 s > note: Some details are omitted, run with `RUST_BACKTRACE=full` for a verbose backtrace.
  809. 73.98 s >
  810. 73.98 s > FAIL [ 0.126s] ( 85/111) alphal00p-docs-builder tests::every_product_requires_a_task_chooser_and_each_supported_interface
  811. 73.98 s > stdout ---
  812. 73.98 s >
  813. 73.98 s > running 1 test
  814. 73.98 s > test tests::every_product_requires_a_task_chooser_and_each_supported_interface ... FAILED
  815. 73.98 s >
  816. 73.98 s > failures:
  817. 73.98 s >
  818. 73.98 s > failures:
  819. 73.98 s > tests::every_product_requires_a_task_chooser_and_each_supported_interface
  820. 73.98 s >
  821. 73.98 s > test result: FAILED. 0 passed; 1 failed; 0 ignored; 0 measured; 110 filtered out; finished in 0.12s
  822. 73.98 s >
  823. 73.98 s > stderr ---
  824. 73.98 s > warning: developer note gammaloop-architecture still requires a named owner
  825. 73.98 s > warning: developer note integration-dashboard still requires a named owner
  826. 73.98 s > warning: developer note uv-renormalization still requires a named owner
  827. 73.98 s > warning: developer note spenso-parsing-flow still requires a named owner
  828. 73.98 s > warning: developer note schoonschip-network still requires a named owner
  829. 73.98 s > warning: developer note gammaloop-draw-style-migration still requires a named owner
  830. 73.98 s > warning: developer note gammaloop-drawing-architecture still requires a named owner
  831. 73.98 s > warning: developer note spenso-symbolica-syntax-and-rewrites still requires a named owner
  832. 73.98 s > warning: developer note spenso-architecture still requires a named owner
  833. 73.98 s > warning: developer note idenso-architecture still requires a named owner
  834. 73.98 s > warning: developer note idenso-form-color-dirac-source-map still requires a named owner
  835. 73.98 s > warning: developer note linnet-architecture still requires a named owner
  836. 73.98 s > warning: developer note vakint-architecture still requires a named owner
  837. 73.98 s > warning: developer note gammaloop-roadmap still requires a named owner
  838. 73.98 s > warning: developer note cff-surface-cache-ownership still requires a named owner
  839. 73.98 s > warning: developer note gammaloop-drawing-evaluated-fields-history still requires a named owner
  840. 73.98 s > warning: archived developer note gammaloop-drawing-evaluated-fields-history has no immutable evidence revision
  841. 73.98 s > warning: developer note bnl-benchmark-investigation still requires a named owner
  842. 73.98 s > warning: developer note bnl-contraction-order-performance still requires a named owner
  843. 73.98 s > warning: developer note bnl-scalar-alias-capture still requires a named owner
  844. 73.98 s > warning: developer note aa-aa-three-loop-performance-smoke still requires a named owner
  845. 73.98 s > warning: developer note network-simplification still requires a named owner
  846. 73.98 s > warning: investigation developer note network-simplification has no immutable evidence revision
  847. 73.98 s > warning: developer note spenso-large-expressions still requires a named owner
  848. 73.98 s > warning: developer note spenso-improvement-effects still requires a named owner
  849. 73.98 s > warning: archived developer note spenso-improvement-effects has no immutable evidence revision
  850. 73.98 s > warning: developer note spenso-test-baseline still requires a named owner
  851. 73.98 s > warning: archived developer note spenso-test-baseline has no immutable evidence revision
  852. 73.98 s > warning: developer note bnl-evaluator-atom-capture still requires a named owner
  853. 73.98 s > warning: archived developer note bnl-evaluator-atom-capture has no immutable evidence revision
  854. 73.98 s > warning: developer note uv-scalar-profile-benchmark still requires a named owner
  855. 73.98 s > warning: archived developer note uv-scalar-profile-benchmark has no immutable evidence revision
  856. 73.98 s > warning: developer note ci-test-failure-summary-2026-03-25 still requires a named owner
  857. 73.98 s > warning: archived developer note ci-test-failure-summary-2026-03-25 has no immutable evidence revision
  858. 73.98 s > warning: developer note network-execution-rebase-record still requires a named owner
  859. 73.98 s > warning: archived developer note network-execution-rebase-record has no immutable evidence revision
  860. 73.98 s > warning: developer note ratatui-integration-dashboard-history still requires a named owner
  861. 73.98 s > warning: archived developer note ratatui-integration-dashboard-history has no immutable evidence revision
  862. 73.98 s > warning: developer note nix-crane-cache-reuse still requires a named owner
  863. 73.98 s >
  864. 73.98 s > thread 'tests::every_product_requires_a_task_chooser_and_each_supported_interface' (270) panicked at crates/alphal00p-docs-builder/src/lib.rs:11901:9:
  865. 73.98 s > assertion failed: format!("{error:#}").contains("has no quickstart page")
  866. 73.98 s > stack backtrace:
  867. 73.98 s > 0: __rustc::rust_begin_unwind
  868. 73.98 s > 1: core::panicking::panic_fmt
  869. 73.98 s > 2: core::panicking::panic
  870. 73.98 s > 3: alphal00p_docs_builder::tests::every_product_requires_a_task_chooser_and_each_supported_interface
  871. 73.98 s > 4: <alphal00p_docs_builder::tests::every_product_requires_a_task_chooser_and_each_supported_interface::{closure#0} as core::ops::function::FnOnce<()>>::call_once
  872. 73.98 s > note: Some details are omitted, run with `RUST_BACKTRACE=full` for a verbose backtrace.
  873. 73.98 s >
  874. 73.98 s > FAIL [ 0.113s] ( 98/111) alphal00p-docs-builder tests::pdf_manual_chapter_order_must_match_the_page_registry
  875. 73.98 s > stdout ---
  876. 73.98 s >
  877. 73.98 s > running 1 test
  878. 73.98 s > test tests::pdf_manual_chapter_order_must_match_the_page_registry ... FAILED
  879. 73.98 s >
  880. 73.98 s > failures:
  881. 73.98 s >
  882. 73.98 s > failures:
  883. 73.98 s > tests::pdf_manual_chapter_order_must_match_the_page_registry
  884. 73.98 s >
  885. 73.98 s > test result: FAILED. 0 passed; 1 failed; 0 ignored; 0 measured; 110 filtered out; finished in 0.11s
  886. 73.98 s >
  887. 73.98 s > stderr ---
  888. 73.98 s > warning: developer note gammaloop-architecture still requires a named owner
  889. 73.98 s > warning: developer note integration-dashboard still requires a named owner
  890. 73.98 s > warning: developer note uv-renormalization still requires a named owner
  891. 73.98 s > warning: developer note spenso-parsing-flow still requires a named owner
  892. 73.98 s > warning: developer note schoonschip-network still requires a named owner
  893. 73.98 s > warning: developer note gammaloop-draw-style-migration still requires a named owner
  894. 73.98 s > warning: developer note gammaloop-drawing-architecture still requires a named owner
  895. 73.98 s > warning: developer note spenso-symbolica-syntax-and-rewrites still requires a named owner
  896. 73.98 s > warning: developer note spenso-architecture still requires a named owner
  897. 73.98 s > warning: developer note idenso-architecture still requires a named owner
  898. 73.98 s > warning: developer note idenso-form-color-dirac-source-map still requires a named owner
  899. 73.98 s > warning: developer note linnet-architecture still requires a named owner
  900. 73.98 s > warning: developer note vakint-architecture still requires a named owner
  901. 73.98 s > warning: developer note gammaloop-roadmap still requires a named owner
  902. 73.98 s > warning: developer note cff-surface-cache-ownership still requires a named owner
  903. 73.98 s > warning: developer note gammaloop-drawing-evaluated-fields-history still requires a named owner
  904. 73.98 s > warning: archived developer note gammaloop-drawing-evaluated-fields-history has no immutable evidence revision
  905. 73.98 s > warning: developer note bnl-benchmark-investigation still requires a named owner
  906. 73.98 s > warning: developer note bnl-contraction-order-performance still requires a named owner
  907. 73.98 s > warning: developer note bnl-scalar-alias-capture still requires a named owner
  908. 73.98 s > warning: developer note aa-aa-three-loop-performance-smoke still requires a named owner
  909. 73.98 s > warning: developer note network-simplification still requires a named owner
  910. 73.98 s > warning: investigation developer note network-simplification has no immutable evidence revision
  911. 73.98 s > warning: developer note spenso-large-expressions still requires a named owner
  912. 73.98 s > warning: developer note spenso-improvement-effects still requires a named owner
  913. 73.98 s > warning: archived developer note spenso-improvement-effects has no immutable evidence revision
  914. 73.98 s > warning: developer note spenso-test-baseline still requires a named owner
  915. 73.98 s > warning: archived developer note spenso-test-baseline has no immutable evidence revision
  916. 73.98 s > warning: developer note bnl-evaluator-atom-capture still requires a named owner
  917. 73.98 s > warning: archived developer note bnl-evaluator-atom-capture has no immutable evidence revision
  918. 73.98 s > warning: developer note uv-scalar-profile-benchmark still requires a named owner
  919. 73.98 s > warning: archived developer note uv-scalar-profile-benchmark has no immutable evidence revision
  920. 73.98 s > warning: developer note ci-test-failure-summary-2026-03-25 still requires a named owner
  921. 73.98 s > warning: archived developer note ci-test-failure-summary-2026-03-25 has no immutable evidence revision
  922. 73.98 s > warning: developer note network-execution-rebase-record still requires a named owner
  923. 73.98 s > warning: archived developer note network-execution-rebase-record has no immutable evidence revision
  924. 73.98 s > warning: developer note ratatui-integration-dashboard-history still requires a named owner
  925. 73.98 s > warning: archived developer note ratatui-integration-dashboard-history has no immutable evidence revision
  926. 73.98 s > warning: developer note nix-crane-cache-reuse still requires a named owner
  927. 73.98 s >
  928. 73.98 s > thread 'tests::pdf_manual_chapter_order_must_match_the_page_registry' (327) panicked at crates/alphal00p-docs-builder/src/lib.rs:11952:9:
  929. 73.98 s > assertion failed: format!("{error:#}").contains("PDF manual chapter order differs")
  930. 73.98 s > stack backtrace:
  931. 73.98 s > 0: __rustc::rust_begin_unwind
  932. 73.98 s > 1: core::panicking::panic_fmt
  933. 73.98 s > 2: core::panicking::panic
  934. 73.98 s > 3: alphal00p_docs_builder::tests::pdf_manual_chapter_order_must_match_the_page_registry
  935. 73.98 s > 4: <alphal00p_docs_builder::tests::pdf_manual_chapter_order_must_match_the_page_registry::{closure#0} as core::ops::function::FnOnce<()>>::call_once
  936. 73.98 s > note: Some details are omitted, run with `RUST_BACKTRACE=full` for a verbose backtrace.
  937. 73.98 s >
  938. 73.98 s > ------------
  939. 73.98 s > Summary [ 20.530s] 111 tests run: 108 passed, 3 failed, 0 skipped
  940. 73.98 s > FAIL [ 0.119s] ( 70/111) alphal00p-docs-builder tests::checked_in_registry_is_valid
  941. 73.98 s > stdout ---
  942. 73.98 s >
  943. 73.98 s > running 1 test
  944. 73.98 s > test tests::checked_in_registry_is_valid ... FAILED
  945. 73.98 s >
  946. 73.98 s > failures:
  947. 73.98 s >
  948. 73.98 s > failures:
  949. 73.98 s > tests::checked_in_registry_is_valid
  950. 73.98 s >
  951. 73.98 s > test result: FAILED. 0 passed; 1 failed; 0 ignored; 0 measured; 110 filtered out; finished in 0.11s
  952. 73.98 s >
  953. 73.98 s > stderr ---
  954. 73.98 s > warning: developer note gammaloop-architecture still requires a named owner
  955. 73.98 s > warning: developer note integration-dashboard still requires a named owner
  956. 73.98 s > warning: developer note uv-renormalization still requires a named owner
  957. 73.98 s > warning: developer note spenso-parsing-flow still requires a named owner
  958. 73.98 s > warning: developer note schoonschip-network still requires a named owner
  959. 73.98 s > warning: developer note gammaloop-draw-style-migration still requires a named owner
  960. 73.98 s > warning: developer note gammaloop-drawing-architecture still requires a named owner
  961. 73.98 s > warning: developer note spenso-symbolica-syntax-and-rewrites still requires a named owner
  962. 73.98 s > warning: developer note spenso-architecture still requires a named owner
  963. 73.98 s > warning: developer note idenso-architecture still requires a named owner
  964. 73.98 s > warning: developer note idenso-form-color-dirac-source-map still requires a named owner
  965. 73.98 s > warning: developer note linnet-architecture still requires a named owner
  966. 73.98 s > warning: developer note vakint-architecture still requires a named owner
  967. 73.98 s > warning: developer note gammaloop-roadmap still requires a named owner
  968. 73.98 s > warning: developer note cff-surface-cache-ownership still requires a named owner
  969. 73.98 s > warning: developer note gammaloop-drawing-evaluated-fields-history still requires a named owner
  970. 73.98 s > warning: archived developer note gammaloop-drawing-evaluated-fields-history has no immutable evidence revision
  971. 73.98 s > warning: developer note bnl-benchmark-investigation still requires a named owner
  972. 73.98 s > warning: developer note bnl-contraction-order-performance still requires a named owner
  973. 73.98 s > warning: developer note bnl-scalar-alias-capture still requires a named owner
  974. 73.98 s > warning: developer note aa-aa-three-loop-performance-smoke still requires a named owner
  975. 73.98 s > warning: developer note network-simplification still requires a named owner
  976. 73.98 s > warning: investigation developer note network-simplification has no immutable evidence revision
  977. 73.98 s > warning: developer note spenso-large-expressions still requires a named owner
  978. 73.98 s > warning: developer note spenso-improvement-effects still requires a named owner
  979. 73.98 s > warning: archived developer note spenso-improvement-effects has no immutable evidence revision
  980. 73.98 s > warning: developer note spenso-test-baseline still requires a named owner
  981. 73.98 s > warning: archived developer note spenso-test-baseline has no immutable evidence revision
  982. 73.98 s > warning: developer note bnl-evaluator-atom-capture still requires a named owner
  983. 73.98 s > warning: archived developer note bnl-evaluator-atom-capture has no immutable evidence revision
  984. 73.98 s > warning: developer note uv-scalar-profile-benchmark still requires a named owner
  985. 73.98 s > warning: archived developer note uv-scalar-profile-benchmark has no immutable evidence revision
  986. 73.98 s > warning: developer note ci-test-failure-summary-2026-03-25 still requires a named owner
  987. 73.98 s > warning: archived developer note ci-test-failure-summary-2026-03-25 has no immutable evidence revision
  988. 73.98 s > warning: developer note network-execution-rebase-record still requires a named owner
  989. 73.98 s > warning: archived developer note network-execution-rebase-record has no immutable evidence revision
  990. 73.98 s > warning: developer note ratatui-integration-dashboard-history still requires a named owner
  991. 73.98 s > warning: archived developer note ratatui-integration-dashboard-history has no immutable evidence revision
  992. 73.98 s > warning: developer note nix-crane-cache-reuse still requires a named owner
  993. 73.98 s >
  994. 73.98 s > thread 'tests::checked_in_registry_is_valid' (165) panicked at crates/alphal00p-docs-builder/src/lib.rs:11887:50:
  995. 73.98 s > called `Result::unwrap()` on an `Err` value: developer note nix-crane-cache-reuse verified scope flake.nix changed (expected 188504937418859942a6770ca21a4f4e0a7ff125, found 2055acf4433777d5a18c44d88e8416b42a938f3a); owner review or an explicit no-impact attestation is required
  996. 73.98 s >
  997. 73.98 s > Location:
  998. 73.98 s > crates/alphal00p-docs-builder/src/lib.rs:889:21
  999. 73.98 s > stack backtrace:
  1000. 73.98 s > 0: __rustc::rust_begin_unwind
  1001. 73.98 s > 1: core::panicking::panic_fmt
  1002. 73.98 s > 2: core::result::unwrap_failed
  1003. 73.98 s > 3: alphal00p_docs_builder::tests::checked_in_registry_is_valid
  1004. 73.98 s > 4: <alphal00p_docs_builder::tests::checked_in_registry_is_valid::{closure#0} as core::ops::function::FnOnce<()>>::call_once
  1005. 73.98 s > note: Some details are omitted, run with `RUST_BACKTRACE=full` for a verbose backtrace.
  1006. 73.98 s >
  1007. 73.98 s > FAIL [ 0.126s] ( 85/111) alphal00p-docs-builder tests::every_product_requires_a_task_chooser_and_each_supported_interface
  1008. 73.98 s > stdout ---
  1009. 73.98 s >
  1010. 73.98 s > running 1 test
  1011. 73.98 s > test tests::every_product_requires_a_task_chooser_and_each_supported_interface ... FAILED
  1012. 73.98 s >
  1013. 73.98 s > failures:
  1014. 73.98 s >
  1015. 73.98 s > failures:
  1016. 73.98 s > tests::every_product_requires_a_task_chooser_and_each_supported_interface
  1017. 73.98 s >
  1018. 73.98 s > test result: FAILED. 0 passed; 1 failed; 0 ignored; 0 measured; 110 filtered out; finished in 0.12s
  1019. 73.98 s >
  1020. 73.98 s > stderr ---
  1021. 73.98 s > warning: developer note gammaloop-architecture still requires a named owner
  1022. 73.98 s > warning: developer note integration-dashboard still requires a named owner
  1023. 73.98 s > warning: developer note uv-renormalization still requires a named owner
  1024. 73.98 s > warning: developer note spenso-parsing-flow still requires a named owner
  1025. 73.98 s > warning: developer note schoonschip-network still requires a named owner
  1026. 73.98 s > warning: developer note gammaloop-draw-style-migration still requires a named owner
  1027. 73.98 s > warning: developer note gammaloop-drawing-architecture still requires a named owner
  1028. 73.98 s > warning: developer note spenso-symbolica-syntax-and-rewrites still requires a named owner
  1029. 73.98 s > warning: developer note spenso-architecture still requires a named owner
  1030. 73.98 s > warning: developer note idenso-architecture still requires a named owner
  1031. 73.98 s > warning: developer note idenso-form-color-dirac-source-map still requires a named owner
  1032. 73.98 s > warning: developer note linnet-architecture still requires a named owner
  1033. 73.98 s > warning: developer note vakint-architecture still requires a named owner
  1034. 73.98 s > warning: developer note gammaloop-roadmap still requires a named owner
  1035. 73.98 s > warning: developer note cff-surface-cache-ownership still requires a named owner
  1036. 73.98 s > warning: developer note gammaloop-drawing-evaluated-fields-history still requires a named owner
  1037. 73.98 s > warning: archived developer note gammaloop-drawing-evaluated-fields-history has no immutable evidence revision
  1038. 73.98 s > warning: developer note bnl-benchmark-investigation still requires a named owner
  1039. 73.98 s > warning: developer note bnl-contraction-order-performance still requires a named owner
  1040. 73.98 s > warning: developer note bnl-scalar-alias-capture still requires a named owner
  1041. 73.98 s > warning: developer note aa-aa-three-loop-performance-smoke still requires a named owner
  1042. 73.98 s > warning: developer note network-simplification still requires a named owner
  1043. 73.98 s > warning: investigation developer note network-simplification has no immutable evidence revision
  1044. 73.98 s > warning: developer note spenso-large-expressions still requires a named owner
  1045. 73.98 s > warning: developer note spenso-improvement-effects still requires a named owner
  1046. 73.98 s > warning: archived developer note spenso-improvement-effects has no immutable evidence revision
  1047. 73.98 s > warning: developer note spenso-test-baseline still requires a named owner
  1048. 73.98 s > warning: archived developer note spenso-test-baseline has no immutable evidence revision
  1049. 73.98 s > warning: developer note bnl-evaluator-atom-capture still requires a named owner
  1050. 73.98 s > warning: archived developer note bnl-evaluator-atom-capture has no immutable evidence revision
  1051. 73.98 s > warning: developer note uv-scalar-profile-benchmark still requires a named owner
  1052. 73.98 s > warning: archived developer note uv-scalar-profile-benchmark has no immutable evidence revision
  1053. 73.98 s > warning: developer note ci-test-failure-summary-2026-03-25 still requires a named owner
  1054. 73.98 s > warning: archived developer note ci-test-failure-summary-2026-03-25 has no immutable evidence revision
  1055. 73.98 s > warning: developer note network-execution-rebase-record still requires a named owner
  1056. 73.98 s > warning: archived developer note network-execution-rebase-record has no immutable evidence revision
  1057. 73.98 s > warning: developer note ratatui-integration-dashboard-history still requires a named owner
  1058. 73.98 s > warning: archived developer note ratatui-integration-dashboard-history has no immutable evidence revision
  1059. 73.98 s > warning: developer note nix-crane-cache-reuse still requires a named owner
  1060. 73.98 s >
  1061. 73.98 s > thread 'tests::every_product_requires_a_task_chooser_and_each_supported_interface' (270) panicked at crates/alphal00p-docs-builder/src/lib.rs:11901:9:
  1062. 73.98 s > assertion failed: format!("{error:#}").contains("has no quickstart page")
  1063. 73.98 s > stack backtrace:
  1064. 73.98 s > 0: __rustc::rust_begin_unwind
  1065. 73.98 s > 1: core::panicking::panic_fmt
  1066. 73.98 s > 2: core::panicking::panic
  1067. 73.98 s > 3: alphal00p_docs_builder::tests::every_product_requires_a_task_chooser_and_each_supported_interface
  1068. 73.98 s > 4: <alphal00p_docs_builder::tests::every_product_requires_a_task_chooser_and_each_supported_interface::{closure#0} as core::ops::function::FnOnce<()>>::call_once
  1069. 73.98 s > note: Some details are omitted, run with `RUST_BACKTRACE=full` for a verbose backtrace.
  1070. 73.98 s >
  1071. 73.98 s > FAIL [ 0.113s] ( 98/111) alphal00p-docs-builder tests::pdf_manual_chapter_order_must_match_the_page_registry
  1072. 73.98 s > stdout ---
  1073. 73.98 s >
  1074. 73.98 s > running 1 test
  1075. 73.98 s > test tests::pdf_manual_chapter_order_must_match_the_page_registry ... FAILED
  1076. 73.98 s >
  1077. 73.98 s > failures:
  1078. 73.98 s >
  1079. 73.98 s > failures:
  1080. 73.98 s > tests::pdf_manual_chapter_order_must_match_the_page_registry
  1081. 73.98 s >
  1082. 73.98 s > test result: FAILED. 0 passed; 1 failed; 0 ignored; 0 measured; 110 filtered out; finished in 0.11s
  1083. 73.98 s >
  1084. 73.98 s > stderr ---
  1085. 73.98 s > warning: developer note gammaloop-architecture still requires a named owner
  1086. 73.98 s > warning: developer note integration-dashboard still requires a named owner
  1087. 73.98 s > warning: developer note uv-renormalization still requires a named owner
  1088. 73.98 s > warning: developer note spenso-parsing-flow still requires a named owner
  1089. 73.98 s > warning: developer note schoonschip-network still requires a named owner
  1090. 73.98 s > warning: developer note gammaloop-draw-style-migration still requires a named owner
  1091. 73.98 s > warning: developer note gammaloop-drawing-architecture still requires a named owner
  1092. 73.98 s > warning: developer note spenso-symbolica-syntax-and-rewrites still requires a named owner
  1093. 73.98 s > warning: developer note spenso-architecture still requires a named owner
  1094. 73.98 s > warning: developer note idenso-architecture still requires a named owner
  1095. 73.98 s > warning: developer note idenso-form-color-dirac-source-map still requires a named owner
  1096. 73.98 s > warning: developer note linnet-architecture still requires a named owner
  1097. 73.98 s > warning: developer note vakint-architecture still requires a named owner
  1098. 73.98 s > warning: developer note gammaloop-roadmap still requires a named owner
  1099. 73.98 s > warning: developer note cff-surface-cache-ownership still requires a named owner
  1100. 73.98 s > warning: developer note gammaloop-drawing-evaluated-fields-history still requires a named owner
  1101. 73.98 s > warning: archived developer note gammaloop-drawing-evaluated-fields-history has no immutable evidence revision
  1102. 73.98 s > warning: developer note bnl-benchmark-investigation still requires a named owner
  1103. 73.98 s > warning: developer note bnl-contraction-order-performance still requires a named owner
  1104. 73.98 s > warning: developer note bnl-scalar-alias-capture still requires a named owner
  1105. 73.98 s > warning: developer note aa-aa-three-loop-performance-smoke still requires a named owner
  1106. 73.98 s > warning: developer note network-simplification still requires a named owner
  1107. 73.98 s > warning: investigation developer note network-simplification has no immutable evidence revision
  1108. 73.98 s > warning: developer note spenso-large-expressions still requires a named owner
  1109. 73.98 s > warning: developer note spenso-improvement-effects still requires a named owner
  1110. 73.98 s > warning: archived developer note spenso-improvement-effects has no immutable evidence revision
  1111. 73.98 s > warning: developer note spenso-test-baseline still requires a named owner
  1112. 73.98 s > warning: archived developer note spenso-test-baseline has no immutable evidence revision
  1113. 73.98 s > warning: developer note bnl-evaluator-atom-capture still requires a named owner
  1114. 73.98 s > warning: archived developer note bnl-evaluator-atom-capture has no immutable evidence revision
  1115. 73.98 s > warning: developer note uv-scalar-profile-benchmark still requires a named owner
  1116. 73.98 s > warning: archived developer note uv-scalar-profile-benchmark has no immutable evidence revision
  1117. 73.98 s > warning: developer note ci-test-failure-summary-2026-03-25 still requires a named owner
  1118. 73.98 s > warning: archived developer note ci-test-failure-summary-2026-03-25 has no immutable evidence revision
  1119. 73.98 s > warning: developer note network-execution-rebase-record still requires a named owner
  1120. 73.98 s > warning: archived developer note network-execution-rebase-record has no immutable evidence revision
  1121. 73.98 s > warning: developer note ratatui-integration-dashboard-history still requires a named owner
  1122. 73.98 s > warning: archived developer note ratatui-integration-dashboard-history has no immutable evidence revision
  1123. 73.98 s > warning: developer note nix-crane-cache-reuse still requires a named owner
  1124. 73.98 s >
  1125. 73.98 s > thread 'tests::pdf_manual_chapter_order_must_match_the_page_registry' (327) panicked at crates/alphal00p-docs-builder/src/lib.rs:11952:9:
  1126. 73.98 s > assertion failed: format!("{error:#}").contains("PDF manual chapter order differs")
  1127. 73.98 s > stack backtrace:
  1128. 73.98 s > 0: __rustc::rust_begin_unwind
  1129. 73.98 s > 1: core::panicking::panic_fmt
  1130. 73.98 s > 2: core::panicking::panic
  1131. 73.98 s > 3: alphal00p_docs_builder::tests::pdf_manual_chapter_order_must_match_the_page_registry
  1132. 73.98 s > 4: <alphal00p_docs_builder::tests::pdf_manual_chapter_order_must_match_the_page_registry::{closure#0} as core::ops::function::FnOnce<()>>::call_once
  1133. 73.98 s > note: Some details are omitted, run with `RUST_BACKTRACE=full` for a verbose backtrace.
  1134. 73.98 s >
  1135. 73.98 s > error: test run failed
  1136. 73.98 s >
  1137. 73.98 s > ========== nextest test summary ==========
  1138. 73.98 s > report: target/nextest/ci_gammaloop/junit.xml
  1139. 73.98 s > tests: 111, failures: 3, errors: 0
  1140. 73.98 s >
  1141. 73.98 s > 1. alphal00p-docs-builder::tests::checked_in_registry_is_valid
  1142. 73.98 s > failure: test failure with exit code 101
  1143. 73.98 s > thread 'tests::checked_in_registry_is_valid' (165) panicked at crates/alphal00p-docs-builder/src/lib.rs:11887:50:
  1144. 73.98 s > called `Result::unwrap()` on an `Err` value: developer note nix-crane-cache-reuse verified scope flake.nix changed (expected 188504937418859942a6770ca21a4f4e0a7ff125, found 2055acf4433777d5a18c44d88e8416b42a938f3a); owner review or an explicit no-impact attestation is required
  1145. 73.98 s >
  1146. 73.98 s > Location:
  1147. 73.98 s > crates/alphal00p-docs-builder/src/lib.rs:889:21
  1148. 73.98 s > stack backtrace:
  1149. 73.98 s > 0: __rustc::rust_begin_unwind
  1150. 73.98 s > 1: core::panicking::panic_fmt
  1151. 73.98 s > 2: core::result::unwrap_failed
  1152. 73.98 s > 3: alphal00p_docs_builder::tests::checked_in_registry_is_valid
  1153. 73.98 s > 4: <alphal00p_docs_builder::tests::checked_in_registry_is_valid::{closure#0} as core::ops::function::FnOnce<()>>::call_once
  1154. 73.98 s > note: Some details are omitted, run with `RUST_BACKTRACE=full` for a verbose backtrace.
  1155. 73.98 s > system-out
  1156. 73.98 s > running 1 test
  1157. 73.98 s > test tests::checked_in_registry_is_valid ... FAILED
  1158. 73.98 s >
  1159. 73.98 s > failures:
  1160. 73.98 s >
  1161. 73.98 s > failures:
  1162. 73.98 s > tests::checked_in_registry_is_valid
  1163. 73.98 s >
  1164. 73.98 s > test result: FAILED. 0 passed; 1 failed; 0 ignored; 0 measured; 110 filtered out; finished in 0.11s
  1165. 73.98 s > system-err
  1166. 73.98 s > warning: developer note gammaloop-architecture still requires a named owner
  1167. 73.98 s > warning: developer note integration-dashboard still requires a named owner
  1168. 73.98 s > warning: developer note uv-renormalization still requires a named owner
  1169. 73.98 s > warning: developer note spenso-parsing-flow still requires a named owner
  1170. 73.98 s > warning: developer note schoonschip-network still requires a named owner
  1171. 73.98 s > warning: developer note gammaloop-draw-style-migration still requires a named owner
  1172. 73.98 s > warning: developer note gammaloop-drawing-architecture still requires a named owner
  1173. 73.98 s > warning: developer note spenso-symbolica-syntax-and-rewrites still requires a named owner
  1174. 73.98 s > warning: developer note spenso-architecture still requires a named owner
  1175. 73.98 s > warning: developer note idenso-architecture still requires a named owner
  1176. 73.98 s > warning: developer note idenso-form-color-dirac-source-map still requires a named owner
  1177. 73.98 s > warning: developer note linnet-architecture still requires a named owner
  1178. 73.98 s > warning: developer note vakint-architecture still requires a named owner
  1179. 73.98 s > warning: developer note gammaloop-roadmap still requires a named owner
  1180. 73.98 s > warning: developer note cff-surface-cache-ownership still requires a named owner
  1181. 73.98 s > warning: developer note gammaloop-drawing-evaluated-fields-history still requires a named owner
  1182. 73.98 s > warning: archived developer note gammaloop-drawing-evaluated-fields-history has no immutable evidence revision
  1183. 73.98 s > warning: developer note bnl-benchmark-investigation still requires a named owner
  1184. 73.98 s > warning: developer note bnl-contraction-order-performance still requires a named owner
  1185. 73.98 s > warning: developer note bnl-scalar-alias-capture still requires a named owner
  1186. 73.98 s > warning: developer note aa-aa-three-loop-performance-smoke still requires a named owner
  1187. 73.98 s > warning: developer note network-simplification still requires a named owner
  1188. 73.98 s > warning: investigation developer note network-simplification has no immutable evidence revision
  1189. 73.98 s > warning: developer note spenso-large-expressions still requires a named owner
  1190. 73.98 s > warning: developer note spenso-improvement-effects still requires a named owner
  1191. 73.98 s > warning: archived developer note spenso-improvement-effects has no immutable evidence revision
  1192. 73.98 s > warning: developer note spenso-test-baseline still requires a named owner
  1193. 73.98 s > warning: archived developer note spenso-test-baseline has no immutable evidence revision
  1194. 73.98 s > warning: developer note bnl-evaluator-atom-capture still requires a named owner
  1195. 73.98 s > warning: archived developer note bnl-evaluator-atom-capture has no immutable evidence revision
  1196. 73.98 s > warning: developer note uv-scalar-profile-benchmark still requires a named owner
  1197. 73.98 s > warning: archived developer note uv-scalar-profile-benchmark has no immutable evidence revision
  1198. 73.98 s > warning: developer note ci-test-failure-summary-2026-03-25 still requires a named owner
  1199. 73.98 s > warning: archived developer note ci-test-failure-summary-2026-03-25 has no immutable evidence revision
  1200. 73.98 s > warning: developer note network-execution-rebase-record still requires a named owner
  1201. 73.98 s > warning: archived developer note network-execution-rebase-record has no immutable evidence revision
  1202. 73.98 s > warning: developer note ratatui-integration-dashboard-history still requires a named owner
  1203. 73.98 s > warning: archived developer note ratatui-integration-dashboard-history has no immutable evidence revision
  1204. 73.98 s > warning: developer note nix-crane-cache-reuse still requires a named owner
  1205. 73.98 s >
  1206. 73.98 s > thread 'tests::checked_in_registry_is_valid' (165) panicked at crates/alphal00p-docs-builder/src/lib.rs:11887:50:
  1207. 73.98 s > called `Result::unwrap()` on an `Err` value: developer note nix-crane-cache-reuse verified scope flake.nix changed (expected 188504937418859942a6770ca21a4f4e0a7ff125, found 2055acf4433777d5a18c44d88e8416b42a938f3a); owner review or an explicit no-impact attestation is required
  1208. 73.98 s >
  1209. 73.98 s > Location:
  1210. 73.98 s > crates/alphal00p-docs-builder/src/lib.rs:889:21
  1211. 73.98 s > stack backtrace:
  1212. 73.98 s > 0: __rustc::rust_begin_unwind
  1213. 73.98 s > 1: core::panicking::panic_fmt
  1214. 73.98 s > 2: core::result::unwrap_failed
  1215. 73.98 s > 3: alphal00p_docs_builder::tests::checked_in_registry_is_valid
  1216. 73.98 s > 4: <alphal00p_docs_builder::tests::checked_in_registry_is_valid::{closure#0} as core::ops::function::FnOnce<()>>::call_once
  1217. 73.98 s > note: Some details are omitted, run with `RUST_BACKTRACE=full` for a verbose backtrace.
  1218. 73.98 s >
  1219. 73.98 s > 2. alphal00p-docs-builder::tests::every_product_requires_a_task_chooser_and_each_supported_interface
  1220. 73.98 s > failure: test failure with exit code 101
  1221. 73.98 s > thread 'tests::every_product_requires_a_task_chooser_and_each_supported_interface' (270) panicked at crates/alphal00p-docs-builder/src/lib.rs:11901:9:
  1222. 73.98 s > assertion failed: format!("{error:#}").contains("has no quickstart page")
  1223. 73.98 s > stack backtrace:
  1224. 73.98 s > 0: __rustc::rust_begin_unwind
  1225. 73.98 s > 1: core::panicking::panic_fmt
  1226. 73.98 s > 2: core::panicking::panic
  1227. 73.98 s > 3: alphal00p_docs_builder::tests::every_product_requires_a_task_chooser_and_each_supported_interface
  1228. 73.98 s > 4: <alphal00p_docs_builder::tests::every_product_requires_a_task_chooser_and_each_supported_interface::{closure#0} as core::ops::function::FnOnce<()>>::call_once
  1229. 73.98 s > note: Some details are omitted, run with `RUST_BACKTRACE=full` for a verbose backtrace.
  1230. 73.98 s > system-out
  1231. 73.98 s > running 1 test
  1232. 73.98 s > test tests::every_product_requires_a_task_chooser_and_each_supported_interface ... FAILED
  1233. 73.98 s >
  1234. 73.98 s > failures:
  1235. 73.98 s >
  1236. 73.98 s > failures:
  1237. 73.98 s > tests::every_product_requires_a_task_chooser_and_each_supported_interface
  1238. 73.98 s >
  1239. 73.98 s > test result: FAILED. 0 passed; 1 failed; 0 ignored; 0 measured; 110 filtered out; finished in 0.12s
  1240. 73.98 s > system-err
  1241. 73.98 s > warning: developer note gammaloop-architecture still requires a named owner
  1242. 73.98 s > warning: developer note integration-dashboard still requires a named owner
  1243. 73.98 s > warning: developer note uv-renormalization still requires a named owner
  1244. 73.98 s > warning: developer note spenso-parsing-flow still requires a named owner
  1245. 73.98 s > warning: developer note schoonschip-network still requires a named owner
  1246. 73.98 s > warning: developer note gammaloop-draw-style-migration still requires a named owner
  1247. 73.98 s > warning: developer note gammaloop-drawing-architecture still requires a named owner
  1248. 73.98 s > warning: developer note spenso-symbolica-syntax-and-rewrites still requires a named owner
  1249. 73.98 s > warning: developer note spenso-architecture still requires a named owner
  1250. 73.98 s > warning: developer note idenso-architecture still requires a named owner
  1251. 73.98 s > warning: developer note idenso-form-color-dirac-source-map still requires a named owner
  1252. 73.98 s > warning: developer note linnet-architecture still requires a named owner
  1253. 73.98 s > warning: developer note vakint-architecture still requires a named owner
  1254. 73.98 s > warning: developer note gammaloop-roadmap still requires a named owner
  1255. 73.98 s > warning: developer note cff-surface-cache-ownership still requires a named owner
  1256. 73.98 s > warning: developer note gammaloop-drawing-evaluated-fields-history still requires a named owner
  1257. 73.98 s > warning: archived developer note gammaloop-drawing-evaluated-fields-history has no immutable evidence revision
  1258. 73.98 s > warning: developer note bnl-benchmark-investigation still requires a named owner
  1259. 73.98 s > warning: developer note bnl-contraction-order-performance still requires a named owner
  1260. 73.98 s > warning: developer note bnl-scalar-alias-capture still requires a named owner
  1261. 73.98 s > warning: developer note aa-aa-three-loop-performance-smoke still requires a named owner
  1262. 73.98 s > warning: developer note network-simplification still requires a named owner
  1263. 73.98 s > warning: investigation developer note network-simplification has no immutable evidence revision
  1264. 73.98 s > warning: developer note spenso-large-expressions still requires a named owner
  1265. 73.98 s > warning: developer note spenso-improvement-effects still requires a named owner
  1266. 73.98 s > warning: archived developer note spenso-improvement-effects has no immutable evidence revision
  1267. 73.98 s > warning: developer note spenso-test-baseline still requires a named owner
  1268. 73.98 s > warning: archived developer note spenso-test-baseline has no immutable evidence revision
  1269. 73.98 s > warning: developer note bnl-evaluator-atom-capture still requires a named owner
  1270. 73.98 s > warning: archived developer note bnl-evaluator-atom-capture has no immutable evidence revision
  1271. 73.98 s > warning: developer note uv-scalar-profile-benchmark still requires a named owner
  1272. 73.98 s > warning: archived developer note uv-scalar-profile-benchmark has no immutable evidence revision
  1273. 73.98 s > warning: developer note ci-test-failure-summary-2026-03-25 still requires a named owner
  1274. 73.98 s > warning: archived developer note ci-test-failure-summary-2026-03-25 has no immutable evidence revision
  1275. 73.98 s > warning: developer note network-execution-rebase-record still requires a named owner
  1276. 73.98 s > warning: archived developer note network-execution-rebase-record has no immutable evidence revision
  1277. 73.98 s > warning: developer note ratatui-integration-dashboard-history still requires a named owner
  1278. 73.98 s > warning: archived developer note ratatui-integration-dashboard-history has no immutable evidence revision
  1279. 73.98 s > warning: developer note nix-crane-cache-reuse still requires a named owner
  1280. 73.98 s >
  1281. 73.98 s > thread 'tests::every_product_requires_a_task_chooser_and_each_supported_interface' (270) panicked at crates/alphal00p-docs-builder/src/lib.rs:11901:9:
  1282. 73.98 s > assertion failed: format!("{error:#}").contains("has no quickstart page")
  1283. 73.98 s > stack backtrace:
  1284. 73.98 s > 0: __rustc::rust_begin_unwind
  1285. 73.98 s > 1: core::panicking::panic_fmt
  1286. 73.98 s > 2: core::panicking::panic
  1287. 73.98 s > 3: alphal00p_docs_builder::tests::every_product_requires_a_task_chooser_and_each_supported_interface
  1288. 73.98 s > 4: <alphal00p_docs_builder::tests::every_product_requires_a_task_chooser_and_each_supported_interface::{closure#0} as core::ops::function::FnOnce<()>>::call_once
  1289. 73.98 s > note: Some details are omitted, run with `RUST_BACKTRACE=full` for a verbose backtrace.
  1290. 73.98 s >
  1291. 73.98 s > 3. alphal00p-docs-builder::tests::pdf_manual_chapter_order_must_match_the_page_registry
  1292. 73.98 s > failure: test failure with exit code 101
  1293. 73.98 s > thread 'tests::pdf_manual_chapter_order_must_match_the_page_registry' (327) panicked at crates/alphal00p-docs-builder/src/lib.rs:11952:9:
  1294. 73.98 s > assertion failed: format!("{error:#}").contains("PDF manual chapter order differs")
  1295. 73.98 s > stack backtrace:
  1296. 73.98 s > 0: __rustc::rust_begin_unwind
  1297. 73.98 s > 1: core::panicking::panic_fmt
  1298. 73.98 s > 2: core::panicking::panic
  1299. 73.98 s > 3: alphal00p_docs_builder::tests::pdf_manual_chapter_order_must_match_the_page_registry
  1300. 73.98 s > 4: <alphal00p_docs_builder::tests::pdf_manual_chapter_order_must_match_the_page_registry::{closure#0} as core::ops::function::FnOnce<()>>::call_once
  1301. 73.98 s > note: Some details are omitted, run with `RUST_BACKTRACE=full` for a verbose backtrace.
  1302. 73.98 s > system-out
  1303. 73.98 s > running 1 test
  1304. 73.98 s > test tests::pdf_manual_chapter_order_must_match_the_page_registry ... FAILED
  1305. 73.98 s >
  1306. 73.98 s > failures:
  1307. 73.98 s >
  1308. 73.98 s > failures:
  1309. 73.98 s > tests::pdf_manual_chapter_order_must_match_the_page_registry
  1310. 73.98 s >
  1311. 73.98 s > test result: FAILED. 0 passed; 1 failed; 0 ignored; 0 measured; 110 filtered out; finished in 0.11s
  1312. 73.98 s > system-err
  1313. 73.98 s > warning: developer note gammaloop-architecture still requires a named owner
  1314. 73.98 s > warning: developer note integration-dashboard still requires a named owner
  1315. 73.98 s > warning: developer note uv-renormalization still requires a named owner
  1316. 73.98 s > warning: developer note spenso-parsing-flow still requires a named owner
  1317. 73.98 s > warning: developer note schoonschip-network still requires a named owner
  1318. 73.98 s > warning: developer note gammaloop-draw-style-migration still requires a named owner
  1319. 73.98 s > warning: developer note gammaloop-drawing-architecture still requires a named owner
  1320. 73.98 s > warning: developer note spenso-symbolica-syntax-and-rewrites still requires a named owner
  1321. 73.98 s > warning: developer note spenso-architecture still requires a named owner
  1322. 73.98 s > warning: developer note idenso-architecture still requires a named owner
  1323. 73.98 s > warning: developer note idenso-form-color-dirac-source-map still requires a named owner
  1324. 73.98 s > warning: developer note linnet-architecture still requires a named owner
  1325. 73.98 s > warning: developer note vakint-architecture still requires a named owner
  1326. 73.98 s > warning: developer note gammaloop-roadmap still requires a named owner
  1327. 73.98 s > warning: developer note cff-surface-cache-ownership still requires a named owner
  1328. 73.98 s > warning: developer note gammaloop-drawing-evaluated-fields-history still requires a named owner
  1329. 73.98 s > warning: archived developer note gammaloop-drawing-evaluated-fields-history has no immutable evidence revision
  1330. 73.98 s > warning: developer note bnl-benchmark-investigation still requires a named owner
  1331. 73.98 s > warning: developer note bnl-contraction-order-performance still requires a named owner
  1332. 73.98 s > warning: developer note bnl-scalar-alias-capture still requires a named owner
  1333. 73.98 s > warning: developer note aa-aa-three-loop-performance-smoke still requires a named owner
  1334. 73.98 s > warning: developer note network-simplification still requires a named owner
  1335. 73.98 s > warning: investigation developer note network-simplification has no immutable evidence revision
  1336. 73.98 s > warning: developer note spenso-large-expressions still requires a named owner
  1337. 73.98 s > warning: developer note spenso-improvement-effects still requires a named owner
  1338. 73.98 s > warning: archived developer note spenso-improvement-effects has no immutable evidence revision
  1339. 73.98 s > warning: developer note spenso-test-baseline still requires a named owner
  1340. 73.98 s > warning: archived developer note spenso-test-baseline has no immutable evidence revision
  1341. 73.98 s > warning: developer note bnl-evaluator-atom-capture still requires a named owner
  1342. 73.98 s > warning: archived developer note bnl-evaluator-atom-capture has no immutable evidence revision
  1343. 73.98 s > warning: developer note uv-scalar-profile-benchmark still requires a named owner
  1344. 73.98 s > warning: archived developer note uv-scalar-profile-benchmark has no immutable evidence revision
  1345. 73.98 s > warning: developer note ci-test-failure-summary-2026-03-25 still requires a named owner
  1346. 73.98 s > warning: archived developer note ci-test-failure-summary-2026-03-25 has no immutable evidence revision
  1347. 73.98 s > warning: developer note network-execution-rebase-record still requires a named owner
  1348. 73.98 s > warning: archived developer note network-execution-rebase-record has no immutable evidence revision
  1349. 73.98 s > warning: developer note ratatui-integration-dashboard-history still requires a named owner
  1350. 73.98 s > warning: archived developer note ratatui-integration-dashboard-history has no immutable evidence revision
  1351. 73.98 s > warning: developer note nix-crane-cache-reuse still requires a named owner
  1352. 73.98 s >
  1353. 73.98 s > thread 'tests::pdf_manual_chapter_order_must_match_the_page_registry' (327) panicked at crates/alphal00p-docs-builder/src/lib.rs:11952:9:
  1354. 73.98 s > assertion failed: format!("{error:#}").contains("PDF manual chapter order differs")
  1355. 73.98 s > stack backtrace:
  1356. 73.98 s > 0: __rustc::rust_begin_unwind
  1357. 73.98 s > 1: core::panicking::panic_fmt
  1358. 73.98 s > 2: core::panicking::panic
  1359. 73.98 s > 3: alphal00p_docs_builder::tests::pdf_manual_chapter_order_must_match_the_page_registry
  1360. 73.98 s > 4: <alphal00p_docs_builder::tests::pdf_manual_chapter_order_must_match_the_page_registry::{closure#0} as core::ops::function::FnOnce<()>>::call_once
  1361. 73.98 s > note: Some details are omitted, run with `RUST_BACKTRACE=full` for a verbose backtrace.
  1362. 73.98 s > =========================================
  1363. 73.98 s > Extracting 2 binaries to /build/source
  1364. 73.98 s > Extracted 5 files to /build/source in 0.06s
  1365. 73.98 s > ------------
  1366. 73.98 s > Nextest run ID 1d3999e8-c2e5-45d2-ae24-d6e7fa86840b with nextest profile: ci_gammaloop
  1367. 73.98 s > Starting 22 tests across 2 binaries
  1368. 73.98 s > ------------
  1369. 73.98 s > Summary [ 0.026s] 22 tests run: 22 passed, 0 skipped
  1370. 73.98 s >
  1371. 73.98 s > ========== nextest test summary ==========
  1372. 73.98 s > report: target/nextest/ci_gammaloop/junit.xml
  1373. 73.98 s > tests: 22, failures: 0, errors: 0
  1374. 73.98 s > No failing testcases found.
  1375. 73.98 s > =========================================
  1376. 73.98 s > Extracting 3 binaries (including 2 non-test binaries), 1 build script output directory, and 2 linked paths to /build/source
  1377. 73.98 s > Extracted 22 files to /build/source in 0.40s
  1378. 73.98 s > ------------
  1379. 73.98 s > Nextest run ID 3f0845e9-b888-46a0-a4d7-80b73b7070f3 with nextest profile: ci_gammaloop
  1380. 73.98 s > Starting 89 tests across 1 binary
  1381. 73.98 s > ------------
  1382. 73.98 s > Summary [ 0.061s] 89 tests run: 89 passed, 0 skipped
  1383. 73.98 s >
  1384. 73.98 s > ========== nextest test summary ==========
  1385. 73.98 s > report: target/nextest/ci_gammaloop/junit.xml
  1386. 73.98 s > tests: 89, failures: 0, errors: 0
  1387. 73.98 s > No failing testcases found.
  1388. 73.98 s > =========================================
  1389. 73.98 s > Extracting 2 binaries to /build/source
  1390. 73.98 s > Extracted 5 files to /build/source in 0.06s
  1391. 73.98 s > ------------
  1392. 73.98 s > Nextest run ID 5dc8bf56-c159-4097-bca6-094dafefa799 with nextest profile: ci_gammaloop
  1393. 73.98 s > Starting 10 tests across 2 binaries
  1394. 73.98 s > ------------
  1395. 73.98 s > Summary [ 20.985s] 10 tests run: 10 passed, 0 skipped
  1396. 73.98 s >
  1397. 73.98 s > ========== nextest test summary ==========
  1398. 73.98 s > report: target/nextest/ci_gammaloop/junit.xml
  1399. 73.98 s > tests: 10, failures: 0, errors: 0
  1400. 73.98 s > No failing testcases found.
  1401. 73.98 s > =========================================
  1402. 73.98 s > Extracting 1 binary to /build/source
  1403. 73.98 s > Extracted 4 files to /build/source in 0.06s
  1404. 73.98 s > ------------
  1405. 73.98 s > Nextest run ID 652cb51e-5af1-430a-a42a-bb39b73da846 with nextest profile: ci_gammaloop
  1406. 73.98 s > Starting 0 tests across 1 binary
  1407. 73.98 s > ------------
  1408. 73.98 s > Summary [ 0.008s] 0 tests run: 0 passed, 0 skipped
  1409. 73.98 s >
  1410. 73.98 s > ========== nextest test summary ==========
  1411. 73.98 s > report: target/nextest/ci_gammaloop/junit.xml
  1412. 73.98 s > tests: 0, failures: 0, errors: 0
  1413. 73.98 s > No failing testcases found.
  1414. 73.98 s > =========================================
  1415. 73.98 s > Extracting 1 binary to /build/source
  1416. 73.98 s > Extracted 4 files to /build/source in 0.09s
  1417. 73.98 s > ------------
  1418. 73.98 s > Nextest run ID 60222e3b-1321-4ed0-8bc6-210332d80515 with nextest profile: ci_gammaloop
  1419. 73.98 s > Starting 5 tests across 1 binary
  1420. 73.98 s > ------------
  1421. 73.98 s > Summary [ 0.049s] 5 tests run: 5 passed, 0 skipped
  1422. 73.98 s >
  1423. 73.98 s > ========== nextest test summary ==========
  1424. 73.98 s > report: target/nextest/ci_gammaloop/junit.xml
  1425. 73.98 s > tests: 5, failures: 0, errors: 0
  1426. 73.98 s > No failing testcases found.
  1427. 73.98 s > =========================================
  1428. 73.98 s For full logs, run:
  1429. 73.98 s nix log /nix/store/iba9mhp7j85acznvf18xhmxcpgblqny8-gammaloop-nextest-docs.drv
  1430. 74.21 s Run failed.