test packages.x86_64-linux.nix-ci-check-gammaloop-nextest-integration

Reproduce this run
Retry Run
  1. 140.02 s gammaloop-nextest-integration> | dod2_bubble | rls.integrated | GL0 | pass | 0.0sigma | compatible within 2sigma | - |
  2. 140.02 s gammaloop-nextest-integration> +-------------+-----------------+---------+--------+----------+-----------------------------------------------------------------------------------------------------------------------+-------+
  3. 140.02 s gammaloop-nextest-integration> | dod2_bubble | mu_r.inspect | inspect | pass | - | best inspect relative delta 6.951e-1 >= 1000*accuracy 1.000e-7 (accuracy=1.000e-10, exponent=+0.0, seed=0, probes=10) | - |
  4. 140.02 s gammaloop-nextest-integration> +-------------+-----------------+---------+--------+----------+-----------------------------------------------------------------------------------------------------------------------+-------+
  5. 140.02 s gammaloop-nextest-integration> | dod2_bubble | target | - | pass | - | 2sigma | - |
  6. 140.02 s gammaloop-nextest-integration> +-------------+-----------------+---------+--------+----------+-----------------------------------------------------------------------------------------------------------------------+-------+
  7. 140.02 s gammaloop-nextest-integration> test dod2_bubble_uv ... FAILED
  8. 140.02 s gammaloop-nextest-integration>
  9. 140.02 s gammaloop-nextest-integration> failures:
  10. 140.02 s gammaloop-nextest-integration>
  11. 140.02 s gammaloop-nextest-integration> failures:
  12. 140.02 s gammaloop-nextest-integration> dod2_bubble_uv
  13. 140.02 s gammaloop-nextest-integration>
  14. 140.02 s gammaloop-nextest-integration> test result: FAILED. 0 passed; 1 failed; 0 ignored; 0 measured; 24 filtered out; finished in 40.44s
  15. 140.02 s gammaloop-nextest-integration> system-err
  16. 140.02 s gammaloop-nextest-integration> [2026-08-28 10:41:19.261] @gammaloop_api::se... INFO : Running command run generate
  17. 140.02 s gammaloop-nextest-integration> [2026-08-28 10:41:19.261] @gammaloop_api::se... INFO : Starting command block generate
  18. 140.02 s gammaloop-nextest-integration> [2026-08-28 10:41:19.261] @gammaloop_api::se... INFO : Running command import model scalars-default.json
  19. 140.02 s gammaloop-nextest-integration> [2026-08-28 10:41:19.261] @import::model INFO : Loading built-in JSON model scalars-default
  20. 140.02 s gammaloop-nextest-integration> [2026-08-28 10:41:19.265] @gammalooprs::model INFO : The following 2 external parameters were forced to zero by the restriction card:
  21. 140.02 s gammaloop-nextest-integration> width_scalar_1, width_scalar_2
  22. 140.02 s gammaloop-nextest-integration> [2026-08-28 10:41:19.266] @gammaloop_api::se... INFO : Running command remove processes
  23. 140.02 s gammaloop-nextest-integration> [2026-08-28 10:41:19.266] @gammaloop_api::se... INFO : Running command set global kv global.generation.uv.generate_integrated=true
  24. 140.02 s gammaloop-nextest-integration> [2026-08-28 10:41:19.267] @gammaloop_api::se... INFO : Running command import graphs ./tests/resources/graphs/scalar/dod2_bubble.dot -p bubble_dod2 -i scalar_bubble_below_thres
  25. 140.02 s gammaloop-nextest-integration> [2026-08-28 10:41:19.267] @commands::import INFO : Loading graphs from '/build/source/tests/resources/graphs/scalar/dod2_bubble.dot'
  26. 140.02 s gammaloop-nextest-integration> [2026-08-28 10:41:19.269] @gammaloop_api::se... INFO : Running command generate existing -p bubble_dod2 -i scalar_bubble_below_thres
  27. 140.02 s gammaloop-nextest-integration> [2026-08-28 10:41:19.271] @approx::local_4d [{#uv, #inspect, #integrated}] DEBUG : Rescaled momenta expanded
  28. 140.02 s gammaloop-nextest-integration> field value
  29. 140.02 s gammaloop-nextest-integration> res n-terms: 1, byte size: 585,expr:
  30. 140.02 s gammaloop-nextest-integration> -SCALAR_COUPLING²·q₀(αᵉ².¹)·q₀(αᵉ³.¹)·q₂(αᵉ².¹)·q₂(αᵉ³.¹)
  31. 140.02 s gammaloop-nextest-integration> /(t²·denom(3,-q₀-q₂/t,mass_scalar_2²,-mass_scalar_2²+2·(q₀.q₂)/t+(q₂.q₂)/t²+(q₀.q₀))
  32. 140.02 s gammaloop-nextest-integration> ·denom(2,q₂/t,mass_scalar_2²,-mass_scalar_2²+(q₂.q₂)/t²))
  33. 140.02 s gammaloop-nextest-integration> [2026-08-28 10:41:19.283] @approx::local_4d [{#uv, #inspect, #integrated}] DEBUG : Rescaled momenta expanded
  34. 140.02 s gammaloop-nextest-integration> field value
  35. 140.02 s gammaloop-nextest-integration> res n-terms: 1, byte size: 3,expr:
  36. 140.02 s gammaloop-nextest-integration> 1
  37. 140.02 s gammaloop-nextest-integration> [2026-08-28 10:41:19.283] @approx::final_integrand[{#generation, #profile, #uv, #graph, #summary}] DEBUG : Computed global numerator
  38. 140.02 s gammaloop-nextest-integration> field value
  39. 140.02 s gammaloop-nextest-integration> global_num n-terms: 1, byte size: 4,expr:
  40. 140.02 s gammaloop-nextest-integration> 1/2
  41. 140.02 s gammaloop-nextest-integration> span build_3d{span_context=true graph=GL0 current=subgraph=0, topo_order=0, dod=0}
  42. 140.02 s gammaloop-nextest-integration> [2026-08-28 10:41:19.286] @uv::approx [{#generation, #uv, #fourd}] DEBUG : Computing 4D
  43. 140.02 s gammaloop-nextest-integration> field value
  44. 140.02 s gammaloop-nextest-integration> simple subgraph(S_11,S_y)*Approx(subgraph(S_y,0)) of GL0
  45. 140.02 s gammaloop-nextest-integration> span compute_4d{span_context=true graph=GL0 current=subgraph=y, topo_order=1, dod=2 given=subgraph=0, topo_order=0, dod=0 reduced=SubSet { set: BitVec<usize, bitvec::order::Lsb0> { addr: 0x7fffec00a8f0, head: 000000, bits: 6, capacity: 64 } [0, 0, 1, 1, 1, 1], id: PhantomData<linnet::half_edge::involution::Hedge> }}
  46. 140.02 s gammaloop-nextest-integration> [2026-08-28 10:41:19.287] @approx::local_4d [{#uv, #algebra, #integrated, #start}] DEBUG :
  47. 140.02 s gammaloop-nextest-integration> field value
  48. 140.02 s gammaloop-nextest-integration> integrand n-terms: 1, byte size: 409,expr:
  49. 140.02 s gammaloop-nextest-integration> SCALAR_COUPLING²·(q₀(αᵉ³.¹)+q₃(αᵉ³.¹))·q₀(αᵉ².¹)·q₀(αᵉ³.¹)·q₂(αᵉ².¹)
  50. 140.02 s gammaloop-nextest-integration> /(denom(2,q₂,mass_scalar_2²,-mass_scalar_2²+(q₂.q₂))·denom(3,q₃,mass_scalar_2²,-mass_scalar_2²+(q₃.q₃)))
  51. 140.02 s gammaloop-nextest-integration> reduced y
  52. 140.02 s gammaloop-nextest-integration> span grow{span_context=true current=subgraph=y, topo_order=1, dod=2 given=subgraph=0, topo_order=0, dod=0}
  53. 140.02 s gammaloop-nextest-integration> [2026-08-28 10:41:19.288] @approx::local_4d [{#uv, #inspect, #integrated}] DEBUG : Rescaled momenta expanded
  54. 140.02 s gammaloop-nextest-integration> field value
  55. 140.02 s gammaloop-nextest-integration> res n-terms: 1, byte size: 585,expr:
  56. 140.02 s gammaloop-nextest-integration> -SCALAR_COUPLING²·q₀(αᵉ².¹)·q₀(αᵉ³.¹)·q₂(αᵉ².¹)·q₂(αᵉ³.¹)
  57. 140.02 s gammaloop-nextest-integration> /(t²·denom(3,-q₀-q₂/t,mass_scalar_2²,-mass_scalar_2²+2·(q₀.q₂)/t+(q₂.q₂)/t²+(q₀.q₀))
  58. 140.02 s gammaloop-nextest-integration> ·denom(2,q₂/t,mass_scalar_2²,-mass_scalar_2²+(q₂.q₂)/t²))
  59. 140.02 s gammaloop-nextest-integration> span t{span_context=true current=subgraph=y, topo_order=1, dod=2 given=subgraph=0, topo_order=0, dod=0}
  60. 140.02 s gammaloop-nextest-integration> [2026-08-28 10:41:19.288] @approx::local_4d [{#uv, #integrated, #rescaled}] DEBUG : Rescaled expanded
  61. 140.02 s gammaloop-nextest-integration> field value
  62. 140.02 s gammaloop-nextest-integration> n_loops 1
  63. 140.02 s gammaloop-nextest-integration> res n-terms: 1, byte size: 707,expr:
  64. 140.02 s gammaloop-nextest-integration> -SCALAR_COUPLING²·q₀(αᵉ².¹)·q₀(αᵉ³.¹)·q₂(αᵉ².¹)·q₂(αᵉ³.¹)
  65. 140.02 s gammaloop-nextest-integration> /(t²·denom(3,-q₂,mUVexp²+t²·mass_scalar_2²,-mUV²+t²·(-mass_scalar_2²+2·(q₀.q₂)/t+(q₂.q₂)/t²+(q₀.q₀))+t²·mUVexp²)
  66. 140.02 s gammaloop-nextest-integration> ·denom(2,q₂,mUVexp²+t²·mass_scalar_2²,-mUV²+t²·(-mass_scalar_2²+(q₂.q₂)/t²)+t²·mUVexp²))
  67. 140.02 s gammaloop-nextest-integration> span t{span_context=true current=subgraph=y, topo_order=1, dod=2 given=subgraph=0, topo_order=0, dod=0}
  68. 140.02 s gammaloop-nextest-integration> [2026-08-28 10:41:19.289] @approx::local_4d [{#uv, #integrated, #series}] DEBUG : Series expanded
  69. 140.02 s gammaloop-nextest-integration> field value
  70. 140.02 s gammaloop-nextest-integration> res n-terms: 3, byte size: 1896,expr:
  71. 140.02 s gammaloop-nextest-integration> (1/2·SCALAR_COUPLING²·(2·mUVexp²-2·mass_scalar_2²)/(denom(2,q₂,mUVexp²,-mUV²+(q₂.q₂))²·denom(3,-q₂,mUVexp²,-mUV²+(q₂.q₂)))
  72. 140.02 s gammaloop-nextest-integration> -SCALAR_COUPLING²
  73. 140.02 s gammaloop-nextest-integration> ·(-1/2·(2·mUVexp²-2·mass_scalar_2²+2·(q₀.q₀))/denom(3,-q₂,mUVexp²,-mUV²+(q₂.q₂))
  74. 140.02 s gammaloop-nextest-integration> +4·(q₀.q₂)²/denom(3,-q₂,mUVexp²,-mUV²+(q₂.q₂))²
  75. 140.02 s gammaloop-nextest-integration> )/(denom(2,q₂,mUVexp²,-mUV²+(q₂.q₂))·denom(3,-q₂,mUVexp²,-mUV²+(q₂.q₂)))
  76. 140.02 s gammaloop-nextest-integration> )·q₀(αᵉ².¹)·q₀(αᵉ³.¹)·q₂(αᵉ².¹)·q₂(αᵉ³.¹)
  77. 140.02 s gammaloop-nextest-integration> +2·SCALAR_COUPLING²·(q₀.q₂)·q₀(αᵉ².¹)·q₀(αᵉ³.¹)·q₂(αᵉ².¹)·q₂(αᵉ³.¹)
  78. 140.02 s gammaloop-nextest-integration> /(t·denom(2,q₂,mUVexp²,-mUV²+(q₂.q₂))·denom(3,-q₂,mUVexp²,-mUV²+(q₂.q₂))²)
  79. 140.02 s gammaloop-nextest-integration> -SCALAR_COUPLING²·q₀(αᵉ².¹)·q₀(αᵉ³.¹)·q₂(αᵉ².¹)·q₂(αᵉ³.¹)
  80. 140.02 s gammaloop-nextest-integration> /(t²·denom(2,q₂,mUVexp²,-mUV²+(q₂.q₂))·denom(3,-q₂,mUVexp²,-mUV²+(q₂.q₂)))
  81. 140.02 s gammaloop-nextest-integration> span t{span_context=true current=subgraph=y, topo_order=1, dod=2 given=subgraph=0, topo_order=0, dod=0}
  82. 140.02 s gammaloop-nextest-integration> [2026-08-28 10:41:19.289] @approx::local_4d [{#uv, #integrated, #series}] DEBUG : Evaluated at t = 1
  83. 140.02 s gammaloop-nextest-integration> field value
  84. 140.02 s gammaloop-nextest-integration> res n-terms: 3, byte size: 1880,expr:
  85. 140.02 s gammaloop-nextest-integration> (1/2·SCALAR_COUPLING²·(2·mUVexp²-2·mass_scalar_2²)/(denom(2,q₂,mUVexp²,-mUV²+(q₂.q₂))²·denom(3,-q₂,mUVexp²,-mUV²+(q₂.q₂)))
  86. 140.02 s gammaloop-nextest-integration> -SCALAR_COUPLING²
  87. 140.02 s gammaloop-nextest-integration> ·(-1/2·(2·mUVexp²-2·mass_scalar_2²+2·(q₀.q₀))/denom(3,-q₂,mUVexp²,-mUV²+(q₂.q₂))
  88. 140.02 s gammaloop-nextest-integration> +4·(q₀.q₂)²/denom(3,-q₂,mUVexp²,-mUV²+(q₂.q₂))²
  89. 140.02 s gammaloop-nextest-integration> )/(denom(2,q₂,mUVexp²,-mUV²+(q₂.q₂))·denom(3,-q₂,mUVexp²,-mUV²+(q₂.q₂)))
  90. 140.02 s gammaloop-nextest-integration> )·q₀(αᵉ².¹)·q₀(αᵉ³.¹)·q₂(αᵉ².¹)·q₂(αᵉ³.¹)
  91. 140.02 s gammaloop-nextest-integration> -SCALAR_COUPLING²·q₀(αᵉ².¹)·q₀(αᵉ³.¹)·q₂(αᵉ².¹)·q₂(αᵉ³.¹)
  92. 140.02 s gammaloop-nextest-integration> /(denom(2,q₂,mUVexp²,-mUV²+(q₂.q₂))·denom(3,-q₂,mUVexp²,-mUV²+(q₂.q₂)))
  93. 140.02 s gammaloop-nextest-integration> +2·SCALAR_COUPLING²·(q₀.q₂)·q₀(αᵉ².¹)·q₀(αᵉ³.¹)·q₂(αᵉ².¹)·q₂(αᵉ³.¹)
  94. 140.02 s gammaloop-nextest-integration> /(denom(2,q₂,mUVexp²,-mUV²+(q₂.q₂))·denom(3,-q₂,mUVexp²,-mUV²+(q₂.q₂))²)
  95. 140.02 s gammaloop-nextest-integration> span t{span_context=true current=subgraph=y, topo_order=1, dod=2 given=subgraph=0, topo_order=0, dod=0}
  96. 140.02 s gammaloop-nextest-integration> [2026-08-28 10:41:19.291] @approx::local_4d [{#uv, #collect, #integrated}] DEBUG : After gamma chain collection
  97. 140.02 s gammaloop-nextest-integration> field value
  98. 140.02 s gammaloop-nextest-integration> expr n-terms: 3, byte size: 1880,expr:
  99. 140.02 s gammaloop-nextest-integration> (1/2·SCALAR_COUPLING²·(2·mUVexp²-2·mass_scalar_2²)/(denom(2,q₂,mUVexp²,-mUV²+(q₂.q₂))²·denom(3,-q₂,mUVexp²,-mUV²+(q₂.q₂)))
  100. 140.02 s gammaloop-nextest-integration> -SCALAR_COUPLING²
  101. 140.02 s gammaloop-nextest-integration> ·(-1/2·(2·mUVexp²-2·mass_scalar_2²+2·(q₀.q₀))/denom(3,-q₂,mUVexp²,-mUV²+(q₂.q₂))
  102. 140.02 s gammaloop-nextest-integration> +4·(q₀.q₂)²/denom(3,-q₂,mUVexp²,-mUV²+(q₂.q₂))²
  103. 140.02 s gammaloop-nextest-integration> )/(denom(2,q₂,mUVexp²,-mUV²+(q₂.q₂))·denom(3,-q₂,mUVexp²,-mUV²+(q₂.q₂)))
  104. 140.02 s gammaloop-nextest-integration> )·q₀(αᵉ².¹)·q₀(αᵉ³.¹)·q₂(αᵉ².¹)·q₂(αᵉ³.¹)
  105. 140.02 s gammaloop-nextest-integration> -SCALAR_COUPLING²·q₀(αᵉ².¹)·q₀(αᵉ³.¹)·q₂(αᵉ².¹)·q₂(αᵉ³.¹)
  106. 140.02 s gammaloop-nextest-integration> /(denom(2,q₂,mUVexp²,-mUV²+(q₂.q₂))·denom(3,-q₂,mUVexp²,-mUV²+(q₂.q₂)))
  107. 140.02 s gammaloop-nextest-integration> +2·SCALAR_COUPLING²·(q₀.q₂)·q₀(αᵉ².¹)·q₀(αᵉ³.¹)·q₂(αᵉ².¹)·q₂(αᵉ³.¹)
  108. 140.02 s gammaloop-nextest-integration> /(denom(2,q₂,mUVexp²,-mUV²+(q₂.q₂))·denom(3,-q₂,mUVexp²,-mUV²+(q₂.q₂))²)
  109. 140.02 s gammaloop-nextest-integration> span t{span_context=true current=subgraph=y, topo_order=1, dod=2 given=subgraph=0, topo_order=0, dod=0}
  110. 140.02 s gammaloop-nextest-integration> [2026-08-28 10:41:19.293] @approx::local_4d [{#profile, #uv, #collect, #integrated, #start, #trace}] DEBUG : After gamma schoonschip
  111. 140.02 s gammaloop-nextest-integration> field value
  112. 140.02 s gammaloop-nextest-integration> expr n-terms: 3, byte size: 1631,expr:
  113. 140.02 s gammaloop-nextest-integration> (1/2·SCALAR_COUPLING²·(2·mUVexp²-2·mass_scalar_2²)/(denom(2,q₂,mUVexp²,-mUV²+(q₂.q₂))²·denom(3,-q₂,mUVexp²,-mUV²+(q₂.q₂)))
  114. 140.02 s gammaloop-nextest-integration> -SCALAR_COUPLING²
  115. 140.02 s gammaloop-nextest-integration> ·(-1/2·(2·mUVexp²-2·mass_scalar_2²+2·(q₀.q₀))/denom(3,-q₂,mUVexp²,-mUV²+(q₂.q₂))
  116. 140.02 s gammaloop-nextest-integration> +4·(q₀.q₂)²/denom(3,-q₂,mUVexp²,-mUV²+(q₂.q₂))²
  117. 140.02 s gammaloop-nextest-integration> )/(denom(2,q₂,mUVexp²,-mUV²+(q₂.q₂))·denom(3,-q₂,mUVexp²,-mUV²+(q₂.q₂)))
  118. 140.02 s gammaloop-nextest-integration> )·(q₀.q₂)²
  119. 140.02 s gammaloop-nextest-integration> -SCALAR_COUPLING²·(q₀.q₂)²/(denom(2,q₂,mUVexp²,-mUV²+(q₂.q₂))·denom(3,-q₂,mUVexp²,-mUV²+(q₂.q₂)))
  120. 140.02 s gammaloop-nextest-integration> +2·SCALAR_COUPLING²·(q₀.q₂)·(q₀.q₂)²
  121. 140.02 s gammaloop-nextest-integration> /(denom(2,q₂,mUVexp²,-mUV²+(q₂.q₂))·denom(3,-q₂,mUVexp²,-mUV²+(q₂.q₂))²)
  122. 140.02 s gammaloop-nextest-integration> span t{span_context=true current=subgraph=y, topo_order=1, dod=2 given=subgraph=0, topo_order=0, dod=0}
  123. 140.02 s gammaloop-nextest-integration> [2026-08-28 10:41:19.295] @approx::local_4d [{#profile, #uv, #collect, #integrated, #start, #trace}] DEBUG : After gamma collection
  124. 140.02 s gammaloop-nextest-integration> field value
  125. 140.02 s gammaloop-nextest-integration> expr n-terms: 1, byte size: 1347,expr:
  126. 140.02 s gammaloop-nextest-integration> SCALAR_COUPLING²
  127. 140.02 s gammaloop-nextest-integration> ·(-denom(2,q₂,mUVexp²,-mUV²+(q₂.q₂))·denom(3,-q₂,mUVexp²,-mUV²+(q₂.q₂))²
  128. 140.02 s gammaloop-nextest-integration> +1/2·(2·mUVexp²-2·mass_scalar_2²)·denom(3,-q₂,mUVexp²,-mUV²+(q₂.q₂))²
  129. 140.02 s gammaloop-nextest-integration> -(-1/2·(2·mUVexp²-2·mass_scalar_2²+2·(q₀.q₀))·denom(3,-q₂,mUVexp²,-mUV²+(q₂.q₂))+4·(q₀.q₂)²)
  130. 140.02 s gammaloop-nextest-integration> ·denom(2,q₂,mUVexp²,-mUV²+(q₂.q₂))
  131. 140.02 s gammaloop-nextest-integration> +2·(q₀.q₂)·denom(2,q₂,mUVexp²,-mUV²+(q₂.q₂))·denom(3,-q₂,mUVexp²,-mUV²+(q₂.q₂))
  132. 140.02 s gammaloop-nextest-integration> )·(q₀.q₂)²/(denom(2,q₂,mUVexp²,-mUV²+(q₂.q₂))²·denom(3,-q₂,mUVexp²,-mUV²+(q₂.q₂))³)
  133. 140.02 s gammaloop-nextest-integration> span t{span_context=true current=subgraph=y, topo_order=1, dod=2 given=subgraph=0, topo_order=0, dod=0}
  134. 140.02 s gammaloop-nextest-integration> [2026-08-28 10:41:19.297] @approx::local_4d [{#profile, #uv, #gamma, #integrated, #start, #trace, #vakint}] DEBUG : After gamma simplification
  135. 140.02 s gammaloop-nextest-integration> ... omitted 3263 more lines; see full nextest output above
  136. 140.02 s gammaloop-nextest-integration>
  137. 140.02 s gammaloop-nextest-integration> 8. gammaloop-integration-tests::uv::sunrise_scalar_1_uv
  138. 140.05 s gammaloop-nextest-integration> failure: test failure with exit code 101
  139. 140.05 s gammaloop-nextest-integration> system-out
  140. 140.05 s gammaloop-nextest-integration> running 1 test
  141. 140.05 s gammaloop-nextest-integration> test sunrise_scalar_1_uv has been running for over 60 seconds
  142. 140.05 s gammaloop-nextest-integration> +------------------+------------------------+--------------+--------+----------+----------------------------------------------------------------------------------------------------------------------+-------+
  143. 140.05 s gammaloop-nextest-integration> | case | check | graph | status | sigma | threshold | error |
  144. 140.05 s gammaloop-nextest-integration> +------------------+------------------------+--------------+--------+----------+----------------------------------------------------------------------------------------------------------------------+-------+
  145. 140.05 s gammaloop-nextest-integration> | sunrise_scalar_1 | uv_profile | - | FAIL | - | - | - |
  146. 140.05 s gammaloop-nextest-integration> +------------------+------------------------+--------------+--------+----------+----------------------------------------------------------------------------------------------------------------------+-------+
  147. 140.05 s gammaloop-nextest-integration> | sunrise_scalar_1 | m_uv.inspect | inspect | pass | - | best inspect relative delta 1.624e0 >= 1000*accuracy 1.000e-3 (accuracy=1.000e-6, exponent=+1.0, seed=1, probes=10) | - |
  148. 140.05 s gammaloop-nextest-integration> +------------------+------------------------+--------------+--------+----------+----------------------------------------------------------------------------------------------------------------------+-------+
  149. 140.05 s gammaloop-nextest-integration> | sunrise_scalar_1 | m_uv.integrated | sunrise | pass | 0.1sigma | compatible within 2sigma | - |
  150. 140.05 s gammaloop-nextest-integration> +------------------+------------------------+--------------+--------+----------+----------------------------------------------------------------------------------------------------------------------+-------+
  151. 140.05 s gammaloop-nextest-integration> | sunrise_scalar_1 | rls.inspect | inspect | pass | - | best inspect relative delta 8.682e-1 >= 1000*accuracy 1.000e-3 (accuracy=1.000e-6, exponent=+1.0, seed=1, probes=10) | - |
  152. 140.05 s gammaloop-nextest-integration> +------------------+------------------------+--------------+--------+----------+----------------------------------------------------------------------------------------------------------------------+-------+
  153. 140.05 s gammaloop-nextest-integration> | sunrise_scalar_1 | rls.integrated | sunrise | pass | 0.0sigma | compatible within 2sigma | - |
  154. 140.05 s gammaloop-nextest-integration> +------------------+------------------------+--------------+--------+----------+----------------------------------------------------------------------------------------------------------------------+-------+
  155. 140.05 s gammaloop-nextest-integration> | sunrise_scalar_1 | mu_r.inspect | inspect | pass | - | best inspect relative delta 1.752e0 >= 1000*accuracy 1.000e-3 (accuracy=1.000e-6, exponent=+1.0, seed=1, probes=10) | - |
  156. 140.05 s gammaloop-nextest-integration> +------------------+------------------------+--------------+--------+----------+----------------------------------------------------------------------------------------------------------------------+-------+
  157. 140.05 s gammaloop-nextest-integration> | sunrise_scalar_1 | integrated.relerr | integrated | pass | - | relative error 9.20% <= 10.00% | - |
  158. 140.05 s gammaloop-nextest-integration> +------------------+------------------------+--------------+--------+----------+----------------------------------------------------------------------------------------------------------------------+-------+
  159. 140.05 s gammaloop-nextest-integration> | sunrise_scalar_1 | m_uv.integrated.relerr | m_uv-shifted | pass | - | relative error 5.89% <= 10.00% | - |
  160. 140.05 s gammaloop-nextest-integration> +------------------+------------------------+--------------+--------+----------+----------------------------------------------------------------------------------------------------------------------+-------+
  161. 140.05 s gammaloop-nextest-integration> | sunrise_scalar_1 | target | - | pass | - | 2sigma | - |
  162. 140.05 s gammaloop-nextest-integration> +------------------+------------------------+--------------+--------+----------+----------------------------------------------------------------------------------------------------------------------+-------+
  163. 140.05 s gammaloop-nextest-integration> test sunrise_scalar_1_uv ... FAILED
  164. 140.05 s gammaloop-nextest-integration>
  165. 140.05 s gammaloop-nextest-integration> failures:
  166. 140.05 s gammaloop-nextest-integration>
  167. 140.05 s gammaloop-nextest-integration> failures:
  168. 140.05 s gammaloop-nextest-integration> sunrise_scalar_1_uv
  169. 140.05 s gammaloop-nextest-integration>
  170. 140.05 s gammaloop-nextest-integration> test result: FAILED. 0 passed; 1 failed; 0 ignored; 0 measured; 24 filtered out; finished in 97.29s
  171. 140.05 s gammaloop-nextest-integration> system-err
  172. 140.05 s gammaloop-nextest-integration> [2026-08-28 10:41:24.107] @gammaloop_api::se... INFO : Running command run generate
  173. 140.05 s gammaloop-nextest-integration> [2026-08-28 10:41:24.107] @gammaloop_api::se... INFO : Starting command block generate
  174. 140.05 s gammaloop-nextest-integration> [2026-08-28 10:41:24.107] @gammaloop_api::se... INFO : Running command import model scalars-default.json
  175. 140.05 s gammaloop-nextest-integration> [2026-08-28 10:41:24.107] @import::model INFO : Loading built-in JSON model scalars-default
  176. 140.05 s gammaloop-nextest-integration> [2026-08-28 10:41:24.113] @gammalooprs::model INFO : The following 2 external parameters were forced to zero by the restriction card:
  177. 140.05 s gammaloop-nextest-integration> width_scalar_1, width_scalar_2
  178. 140.05 s gammaloop-nextest-integration> [2026-08-28 10:41:24.113] @gammaloop_api::se... INFO : Running command remove processes
  179. 140.05 s gammaloop-nextest-integration> [2026-08-28 10:41:24.113] @gammaloop_api::se... INFO : Running command set global kv global.generation.uv.generate_integrated=true
  180. 140.05 s gammaloop-nextest-integration> [2026-08-28 10:41:24.114] @gammaloop_api::se... INFO : Running command import graphs ./tests/resources/graphs/scalar_sunrise.dot -p sunrise_scalar_1 -i scalar_sunrise
  181. 140.05 s gammaloop-nextest-integration> [2026-08-28 10:41:24.114] @commands::import INFO : Loading graphs from '/build/source/tests/resources/graphs/scalar_sunrise.dot'
  182. 140.05 s gammaloop-nextest-integration> [2026-08-28 10:41:24.117] @gammaloop_api::se... INFO : Running command generate existing -p sunrise_scalar_1 -i scalar_sunrise
  183. 140.05 s gammaloop-nextest-integration> [2026-08-28 10:41:24.118] @approx::local_4d [{#uv, #inspect, #integrated}] DEBUG : Rescaled momenta expanded
  184. 140.05 s gammaloop-nextest-integration> field value
  185. 140.05 s gammaloop-nextest-integration> res n-terms: 1, byte size: 3,expr:
  186. 140.05 s gammaloop-nextest-integration> 1
  187. 140.05 s gammaloop-nextest-integration> [2026-08-28 10:41:24.120] @approx::local_4d [{#uv, #inspect, #integrated}] DEBUG : Rescaled momenta expanded
  188. 140.05 s gammaloop-nextest-integration> field value
  189. 140.05 s gammaloop-nextest-integration> res n-terms: 1, byte size: 611,expr:
  190. 140.05 s gammaloop-nextest-integration> 1/(denom(0,q₀/t,mass_scalar_1²,-mass_scalar_1²+(q₀.q₀)/t²)
  191. 140.05 s gammaloop-nextest-integration> ·denom(2,-q₁+q₃-q₀/t,mass_scalar_1²,
  192. 140.05 s gammaloop-nextest-integration> -mass_scalar_1²+2·(q₀.q₁)/t-2·(q₀.q₃)/t+(q₀.q₀)/t²+(q₁.q₁)
  193. 140.05 s gammaloop-nextest-integration> -2·(q₁.q₃)+(q₃.q₃)
  194. 140.05 s gammaloop-nextest-integration> ))
  195. 140.05 s gammaloop-nextest-integration> [2026-08-28 10:41:24.135] @approx::local_4d [{#uv, #inspect, #integrated}] DEBUG : Rescaled momenta expanded
  196. 140.05 s gammaloop-nextest-integration> field value
  197. 140.05 s gammaloop-nextest-integration> res n-terms: 1, byte size: 611,expr:
  198. 140.05 s gammaloop-nextest-integration> 1/(denom(1,q₁/t,mass_scalar_1²,-mass_scalar_1²+(q₁.q₁)/t²)
  199. 140.05 s gammaloop-nextest-integration> ·denom(2,-q₀+q₃-q₁/t,mass_scalar_1²,
  200. 140.05 s gammaloop-nextest-integration> -mass_scalar_1²+2·(q₀.q₁)/t-2·(q₁.q₃)/t+(q₁.q₁)/t²+(q₀.q₀)
  201. 140.05 s gammaloop-nextest-integration> -2·(q₀.q₃)+(q₃.q₃)
  202. 140.05 s gammaloop-nextest-integration> ))
  203. 140.05 s gammaloop-nextest-integration> [2026-08-28 10:41:24.137] @approx::local_4d [{#uv, #inspect, #integrated}] DEBUG : Rescaled momenta expanded
  204. 140.05 s gammaloop-nextest-integration> field value
  205. 140.05 s gammaloop-nextest-integration> res n-terms: 1, byte size: 611,expr:
  206. 140.05 s gammaloop-nextest-integration> 1/(denom(0,q₀/t,mass_scalar_1²,-mass_scalar_1²+(q₀.q₀)/t²)
  207. 140.05 s gammaloop-nextest-integration> ·denom(1,-q₂+q₃-q₀/t,mass_scalar_1²,
  208. 140.05 s gammaloop-nextest-integration> -mass_scalar_1²+2·(q₀.q₂)/t-2·(q₀.q₃)/t+(q₀.q₀)/t²+(q₂.q₂)
  209. 140.05 s gammaloop-nextest-integration> -2·(q₂.q₃)+(q₃.q₃)
  210. 140.05 s gammaloop-nextest-integration> ))
  211. 140.05 s gammaloop-nextest-integration> [2026-08-28 10:41:24.139] @approx::local_4d [{#uv, #inspect, #integrated}] DEBUG : Rescaled momenta expanded
  212. 140.05 s gammaloop-nextest-integration> field value
  213. 140.05 s gammaloop-nextest-integration> res n-terms: 1, byte size: 777,expr:
  214. 140.05 s gammaloop-nextest-integration> 1/(denom(0,q₀/t,mass_scalar_1²,-mass_scalar_1²+(q₀.q₀)/t²)·denom(1,q₁/t,mass_scalar_1²,-mass_scalar_1²+(q₁.q₁)/t²)
  215. 140.05 s gammaloop-nextest-integration> ·denom(2,q₄-q₀/t-q₁/t,mass_scalar_1²,
  216. 140.05 s gammaloop-nextest-integration> -mass_scalar_1²-2·(q₀.q₄)/t-2·(q₁.q₄)/t+(q₀.q₀)/t²+2·(q₀.q₁)/t²
  217. 140.05 s gammaloop-nextest-integration> +(q₁.q₁)/t²+(q₄.q₄)
  218. 140.05 s gammaloop-nextest-integration> ))
  219. 140.05 s gammaloop-nextest-integration> [2026-08-28 10:41:24.142] @approx::final_integrand[{#generation, #profile, #uv, #graph, #summary}] DEBUG : Computed global numerator
  220. 140.05 s gammaloop-nextest-integration> field value
  221. 140.05 s gammaloop-nextest-integration> global_num n-terms: 1, byte size: 3,expr:
  222. 140.05 s gammaloop-nextest-integration> 1
  223. 140.05 s gammaloop-nextest-integration> span build_3d{span_context=true graph=sunrise current=subgraph=0, topo_order=0, dod=0}
  224. 140.05 s gammaloop-nextest-integration> [2026-08-28 10:41:24.145] @uv::approx [{#generation, #uv, #fourd}] DEBUG : Computing 4D
  225. 140.05 s gammaloop-nextest-integration> field value
  226. 140.05 s gammaloop-nextest-integration> simple subgraph(S_47,S_3I)*Approx(subgraph(S_3I,0)) of sunrise
  227. 140.05 s gammaloop-nextest-integration> span compute_4d{span_context=true graph=sunrise current=subgraph=3I, topo_order=1, dod=0 given=subgraph=0, topo_order=0, dod=0 reduced=SubSet { set: BitVec<usize, bitvec::order::Lsb0> { addr: 0x7fffec01a980, head: 000000, bits: 8, capacity: 64 } [0, 0, 1, 1, 0, 0, 1, 1], id: PhantomData<linnet::half_edge::involution::Hedge> }}
  228. 140.05 s gammaloop-nextest-integration> [2026-08-28 10:41:24.146] @approx::local_4d [{#uv, #algebra, #integrated, #start}] DEBUG :
  229. 140.05 s gammaloop-nextest-integration> field value
  230. 140.05 s gammaloop-nextest-integration> integrand n-terms: 1, byte size: 217,expr:
  231. 140.05 s gammaloop-nextest-integration> 1/(denom(0,q₀,mass_scalar_1²,-mass_scalar_1²+(q₀.q₀))·denom(2,q₂,mass_scalar_1²,-mass_scalar_1²+(q₂.q₂)))
  232. 140.05 s gammaloop-nextest-integration> reduced 3I
  233. 140.05 s gammaloop-nextest-integration> span grow{span_context=true current=subgraph=3I, topo_order=1, dod=0 given=subgraph=0, topo_order=0, dod=0}
  234. 140.05 s gammaloop-nextest-integration> [2026-08-28 10:41:24.146] @approx::local_4d [{#uv, #inspect, #integrated}] DEBUG : Rescaled momenta expanded
  235. 140.05 s gammaloop-nextest-integration> field value
  236. 140.05 s gammaloop-nextest-integration> res n-terms: 1, byte size: 611,expr:
  237. 140.05 s gammaloop-nextest-integration> 1/(denom(0,q₀/t,mass_scalar_1²,-mass_scalar_1²+(q₀.q₀)/t²)
  238. 140.05 s gammaloop-nextest-integration> ·denom(2,-q₁+q₃-q₀/t,mass_scalar_1²,
  239. 140.05 s gammaloop-nextest-integration> -mass_scalar_1²+2·(q₀.q₁)/t-2·(q₀.q₃)/t+(q₀.q₀)/t²+(q₁.q₁)
  240. 140.05 s gammaloop-nextest-integration> -2·(q₁.q₃)+(q₃.q₃)
  241. 140.05 s gammaloop-nextest-integration> ))
  242. 140.05 s gammaloop-nextest-integration> span t{span_context=true current=subgraph=3I, topo_order=1, dod=0 given=subgraph=0, topo_order=0, dod=0}
  243. 140.05 s gammaloop-nextest-integration> [2026-08-28 10:41:24.146] @approx::local_4d [{#uv, #integrated, #rescaled}] DEBUG : Rescaled expanded
  244. 140.05 s gammaloop-nextest-integration> field value
  245. 140.05 s gammaloop-nextest-integration> n_loops 1
  246. 140.05 s gammaloop-nextest-integration> res n-terms: 1, byte size: 723,expr:
  247. 140.05 s gammaloop-nextest-integration> 1/(denom(0,q₀,mUVexp²+t²·mass_scalar_1²,-mUV²+t²·(-mass_scalar_1²+(q₀.q₀)/t²)+t²·mUVexp²)
  248. 140.05 s gammaloop-nextest-integration> ·denom(2,-q₀,mUVexp²+t²·mass_scalar_1²,
  249. 140.05 s gammaloop-nextest-integration> -mUV²
  250. 140.05 s gammaloop-nextest-integration> +t²
  251. 140.05 s gammaloop-nextest-integration> ·(-mass_scalar_1²+2·(q₀.q₁)/t-2·(q₀.q₃)/t+(q₀.q₀)/t²+(q₁.q₁)
  252. 140.05 s gammaloop-nextest-integration> -2·(q₁.q₃)+(q₃.q₃)
  253. 140.05 s gammaloop-nextest-integration> )
  254. 140.05 s gammaloop-nextest-integration> +t²·mUVexp²
  255. 140.05 s gammaloop-nextest-integration> ))
  256. 140.05 s gammaloop-nextest-integration> span t{span_context=true current=subgraph=3I, topo_order=1, dod=0 given=subgraph=0, topo_order=0, dod=0}
  257. 140.05 s gammaloop-nextest-integration> [2026-08-28 10:41:24.147] @approx::local_4d [{#uv, #integrated, #series}] DEBUG : Series expanded
  258. 140.05 s gammaloop-nextest-integration> field value
  259. 140.05 s gammaloop-nextest-integration> res n-terms: 1, byte size: 223,expr:
  260. 140.05 s gammaloop-nextest-integration> 1/(denom(0,q₀,mUVexp²,-mUV²+(q₀.q₀))·denom(2,-q₀,mUVexp²,-mUV²+(q₀.q₀)))
  261. 140.05 s gammaloop-nextest-integration> span t{span_context=true current=subgraph=3I, topo_order=1, dod=0 given=subgraph=0, topo_order=0, dod=0}
  262. 140.05 s gammaloop-nextest-integration> [2026-08-28 10:41:24.147] @approx::local_4d [{#uv, #integrated, #series}] DEBUG : Evaluated at t = 1
  263. 140.05 s gammaloop-nextest-integration> field value
  264. 140.05 s gammaloop-nextest-integration> res n-terms: 1, byte size: 223,expr:
  265. 140.05 s gammaloop-nextest-integration> 1/(denom(0,q₀,mUVexp²,-mUV²+(q₀.q₀))·denom(2,-q₀,mUVexp²,-mUV²+(q₀.q₀)))
  266. 140.05 s gammaloop-nextest-integration> span t{span_context=true current=subgraph=3I, topo_order=1, dod=0 given=subgraph=0, topo_order=0, dod=0}
  267. 140.05 s gammaloop-nextest-integration> [2026-08-28 10:41:24.147] @approx::local_4d [{#uv, #collect, #integrated}] DEBUG : After gamma chain collection
  268. 140.05 s gammaloop-nextest-integration> field value
  269. 140.05 s gammaloop-nextest-integration> expr n-terms: 1, byte size: 223,expr:
  270. 140.05 s gammaloop-nextest-integration> 1/(denom(0,q₀,mUVexp²,-mUV²+(q₀.q₀))·denom(2,-q₀,mUVexp²,-mUV²+(q₀.q₀)))
  271. 140.05 s gammaloop-nextest-integration> span t{span_context=true current=subgraph=3I, topo_order=1, dod=0 given=subgraph=0, topo_order=0, dod=0}
  272. 140.05 s gammaloop-nextest-integration> [2026-08-28 10:41:24.148] @approx::local_4d [{#profile, #uv, #collect, #integrated, #start, #trace}] DEBUG : After gamma schoonschip
  273. 140.05 s gammaloop-nextest-integration> field value
  274. 140.05 s gammaloop-nextest-integration> expr n-terms: 1, byte size: 223,expr:
  275. 140.05 s gammaloop-nextest-integration> 1/(denom(0,q₀,mUVexp²,-mUV²+(q₀.q₀))·denom(2,-q₀,mUVexp²,-mUV²+(q₀.q₀)))
  276. 140.05 s gammaloop-nextest-integration> span t{span_context=true current=subgraph=3I, topo_order=1, dod=0 given=subgraph=0, topo_order=0, dod=0}
  277. 140.05 s gammaloop-nextest-integration> [2026-08-28 10:41:24.148] @approx::local_4d [{#profile, #uv, #collect, #integrated, #start, #trace}] DEBUG : After gamma collection
  278. 140.05 s gammaloop-nextest-integration> field value
  279. 140.05 s gammaloop-nextest-integration> expr n-terms: 1, byte size: 223,expr:
  280. 140.05 s gammaloop-nextest-integration> 1/(denom(0,q₀,mUVexp²,-mUV²+(q₀.q₀))·denom(2,-q₀,mUVexp²,-mUV²+(q₀.q₀)))
  281. 140.05 s gammaloop-nextest-integration> span t{span_context=true current=subgraph=3I, topo_order=1, dod=0 given=subgraph=0, topo_order=0, dod=0}
  282. 140.05 s gammaloop-nextest-integration> [2026-08-28 10:41:24.149] @approx::local_4d [{#profile, #uv, #gamma, #integrated, #start, #trace, #vakint}] DEBUG : After gamma simplification
  283. 140.05 s gammaloop-nextest-integration> field value
  284. 140.05 s gammaloop-nextest-integration> expr n-terms: 1, byte size: 223,expr:
  285. 140.05 s gammaloop-nextest-integration> 1/(denom(0,q₀,mUVexp²,-mUV²+(q₀.q₀))·denom(2,-q₀,mUVexp²,-mUV²+(q₀.q₀)))
  286. 140.05 s gammaloop-nextest-integration> span t{span_context=true current=subgraph=3I, topo_order=1, dod=0 given=subgraph=0, topo_order=0, dod=0}
  287. 140.05 s gammaloop-nextest-integration> [2026-08-28 10:41:24.149] @approx::local_4d [{#profile, #uv, #integrated, #schoonschip, #start, #trace, #vakint}] DEBUG : After Schoonschip net
  288. 140.05 s gammaloop-nextest-integration> field value
  289. 140.05 s gammaloop-nextest-integration> expr n-terms: 1, byte size: 223,expr:
  290. 140.05 s gammaloop-nextest-integration> 1/(denom(0,q₀,mUVexp²,-mUV²+(q₀.q₀))·denom(2,-q₀,mUVexp²,-mUV²+(q₀.q₀)))
  291. 140.05 s gammaloop-nextest-integration> ... omitted 20090 more lines; see full nextest output above
  292. 140.05 s gammaloop-nextest-integration>
  293. 140.05 s gammaloop-nextest-integration> 9. gammaloop-integration-tests::uv::se1l_uv
  294. 140.05 s gammaloop-nextest-integration> failure: test failure with exit code 101
  295. 140.05 s gammaloop-nextest-integration> system-out
  296. 140.05 s gammaloop-nextest-integration> running 1 test
  297. 140.05 s gammaloop-nextest-integration> test se1l_uv has been running for over 60 seconds
  298. 140.05 s gammaloop-nextest-integration> +------+-----------------+---------+--------+----------+-----------------------------------------------------------------------------------------------------------------------+-------+
  299. 140.05 s gammaloop-nextest-integration> | case | check | graph | status | sigma | threshold | error |
  300. 140.05 s gammaloop-nextest-integration> +------+-----------------+---------+--------+----------+-----------------------------------------------------------------------------------------------------------------------+-------+
  301. 140.05 s gammaloop-nextest-integration> | se1l | uv_profile | - | FAIL | - | - | - |
  302. 140.05 s gammaloop-nextest-integration> +------+-----------------+---------+--------+----------+-----------------------------------------------------------------------------------------------------------------------+-------+
  303. 140.05 s gammaloop-nextest-integration> | se1l | m_uv.inspect | inspect | pass | - | best inspect relative delta 1.097e-1 >= 1000*accuracy 1.000e-7 (accuracy=1.000e-10, exponent=+2.0, seed=1, probes=10) | - |
  304. 140.05 s gammaloop-nextest-integration> +------+-----------------+---------+--------+----------+-----------------------------------------------------------------------------------------------------------------------+-------+
  305. 140.05 s gammaloop-nextest-integration> | se1l | m_uv.integrated | se1l | pass | 0.1sigma | compatible within 2sigma | - |
  306. 140.05 s gammaloop-nextest-integration> +------+-----------------+---------+--------+----------+-----------------------------------------------------------------------------------------------------------------------+-------+
  307. 140.05 s gammaloop-nextest-integration> | se1l | rls.inspect | inspect | pass | - | best inspect relative delta 4.499e-2 >= 1000*accuracy 1.000e-7 (accuracy=1.000e-10, exponent=+2.0, seed=1, probes=10) | - |
  308. 140.05 s gammaloop-nextest-integration> +------+-----------------+---------+--------+----------+-----------------------------------------------------------------------------------------------------------------------+-------+
  309. 140.05 s gammaloop-nextest-integration> | se1l | rls.integrated | se1l | pass | 0.0sigma | compatible within 2sigma | - |
  310. 140.05 s gammaloop-nextest-integration> +------+-----------------+---------+--------+----------+-----------------------------------------------------------------------------------------------------------------------+-------+
  311. 140.05 s gammaloop-nextest-integration> | se1l | mu_r.inspect | inspect | pass | - | best inspect relative delta 1.424e-1 >= 1000*accuracy 1.000e-7 (accuracy=1.000e-10, exponent=+2.0, seed=1, probes=10) | - |
  312. 140.05 s gammaloop-nextest-integration> +------+-----------------+---------+--------+----------+-----------------------------------------------------------------------------------------------------------------------+-------+
  313. 140.05 s gammaloop-nextest-integration> | se1l | target | - | pass | - | 2sigma | - |
  314. 140.05 s gammaloop-nextest-integration> +------+-----------------+---------+--------+----------+-----------------------------------------------------------------------------------------------------------------------+-------+
  315. 140.05 s gammaloop-nextest-integration> test se1l_uv ... FAILED
  316. 140.05 s gammaloop-nextest-integration>
  317. 140.05 s gammaloop-nextest-integration> failures:
  318. 140.05 s gammaloop-nextest-integration>
  319. 140.05 s gammaloop-nextest-integration> failures:
  320. 140.05 s gammaloop-nextest-integration> se1l_uv
  321. 140.05 s gammaloop-nextest-integration>
  322. 140.05 s gammaloop-nextest-integration> test result: FAILED. 0 passed; 1 failed; 0 ignored; 0 measured; 24 filtered out; finished in 107.08s
  323. 140.05 s gammaloop-nextest-integration> system-err
  324. 140.05 s gammaloop-nextest-integration> [2026-08-28 10:41:23.813] @gammaloop_api::se... INFO : Running command run generate
  325. 140.05 s gammaloop-nextest-integration> [2026-08-28 10:41:23.813] @gammaloop_api::se... INFO : Starting command block generate
  326. 140.05 s gammaloop-nextest-integration> [2026-08-28 10:41:23.814] @gammaloop_api::se... INFO : Running command import model sm-default
  327. 140.05 s gammaloop-nextest-integration> [2026-08-28 10:41:23.814] @import::model INFO : Loading built-in JSON model sm-default
  328. 140.05 s gammaloop-nextest-integration> [2026-08-28 10:41:23.845] @gammalooprs::model INFO : The following 11 external parameters were forced to zero by the restriction card:
  329. 140.05 s gammaloop-nextest-integration> lamWS, AWS, rhoWS, etaWS, ymc, yme, ymm, MC, Me, MM, WTau
  330. 140.05 s gammaloop-nextest-integration> [2026-08-28 10:41:23.845] @gammalooprs::model INFO : The following 34 vertex rules were removed by the restriction card:
  331. 140.05 s gammaloop-nextest-integration> V_82 -> (c~, d, G+) | V_83 -> (t~, d, G+) | V_84 -> (c~, s, G+) | V_85 -> (t~, s, G+) | V_86 -> (u~, b, G+) | V_87 -> (c~, b, G+) | V_90 -> (c~, d, W+) | V_91 -> (t~, d, W+) | V_92 -> (u~, s, W+) | V_94 -> (t~, s, W+) | V_95 -> (u~, b, W+) | V_96 -> (c~, b, W+) | V_101 -> (e+, e-, G0) | V_102 -> (mu+, mu-, G0) | V_104 -> (e+, e-, H) | V_105 -> (mu+, mu-, H) | V_110 -> (ve~, e-, G+) | V_111 -> (vm~, mu-, G+) | V_116 -> (b~, u, G-) | V_117 -> (d~, c, G-) | V_118 -> (s~, c, G-) | V_119 -> (b~, c, G-) | V_120 -> (d~, t, G-) | V_121 -> (s~, t, G-) | V_124 -> (s~, u, W-) | V_125 -> (b~, u, W-) | V_126 -> (d~, c, W-) | V_128 -> (b~, c, W-) | V_129 -> (d~, t, W-) | V_130 -> (s~, t, W-) | V_138 -> (c~, c, G0) | V_140 -> (c~, c, H) | V_145 -> (e+, ve, G-) | V_146 -> (mu+, vm, G-)
  332. 140.05 s gammaloop-nextest-integration> [2026-08-28 10:41:23.845] @gammalooprs::model INFO : The following 36 couplings were removed by the restriction card:
  333. 140.05 s gammaloop-nextest-integration> GC_13, GC_14, GC_16, GC_17, GC_18, GC_19, GC_20, GC_22, GC_23, GC_24, GC_25, GC_26, GC_28, GC_29, GC_42, GC_43, GC_44, GC_46, GC_47, GC_48, GC_84, GC_85, GC_86, GC_87, GC_88, GC_89, GC_90, GC_91, GC_92, GC_93, GC_101, GC_102, GC_103, GC_105, GC_106, GC_107
  334. 140.05 s gammaloop-nextest-integration> [2026-08-28 10:41:23.846] @gammaloop_api::se... INFO : Running command remove processes
  335. 140.05 s gammaloop-nextest-integration> [2026-08-28 10:41:23.846] @gammaloop_api::se... INFO : Running command set global kv global.generation.uv.generate_integrated=true
  336. 140.05 s gammaloop-nextest-integration> [2026-08-28 10:41:23.847] @gammaloop_api::se... INFO : Running command import graphs ./tests/resources/graphs/uv_tests/se1l.dot -p se1l -i se1l
  337. 140.05 s gammaloop-nextest-integration> [2026-08-28 10:41:23.847] @commands::import INFO : Loading graphs from '/build/source/tests/resources/graphs/uv_tests/se1l.dot'
  338. 140.05 s gammaloop-nextest-integration> [2026-08-28 10:41:23.851] @gammaloop_api::se... INFO : Running command generate existing -p se1l -i se1l
  339. 140.05 s gammaloop-nextest-integration> [2026-08-28 10:41:24.890] @commands::generate INFO :
  340. 140.05 s gammaloop-nextest-integration> Integrand generation summary
  341. 140.05 s gammaloop-nextest-integration> peak RAM 88.22 MiB | cores 1
  342. 140.05 s gammaloop-nextest-integration> ╭───────────┬───────┬─────────┬─────────────┬─────────────┬────────────────┬─────────────╮
  343. 140.05 s gammaloop-nextest-integration> │ integrand │ graph │ # evals │ expr build │ spenso │ symbolica eval │ compile │
  344. 140.05 s gammaloop-nextest-integration> ├───────────┼───────┼─────────┼─────────────┼─────────────┼────────────────┼─────────────┤
  345. 140.05 s gammaloop-nextest-integration> │ se1l │ se1l │ 5 │ 897ms (89%) │ 41ms (4.1%) │ 72ms (7.1%) │ 0ms (0.00%) │
  346. 140.05 s gammaloop-nextest-integration> ├───────────┼───────┼─────────┼─────────────┼─────────────┼────────────────┼─────────────┤
  347. 140.05 s gammaloop-nextest-integration> │ Total │ │ 5 │ 897ms (89%) │ 41ms (4.1%) │ 72ms (7.1%) │ 0ms (0.00%) │
  348. 140.05 s gammaloop-nextest-integration> ╰───────────┴───────┴─────────┴─────────────┴─────────────┴────────────────┴─────────────╯
  349. 140.05 s gammaloop-nextest-integration> [2026-08-28 10:41:24.891] @gammaloop_api::se... INFO : Running command set process -p se1l -i se1l kv general.m_uv=0.2
  350. 140.05 s gammaloop-nextest-integration> [2026-08-28 10:41:24.893] @gammaloop_api::se... INFO : Running command set process -p se1l -i se1l kv general.mu_r=0.2
  351. 140.05 s gammaloop-nextest-integration> [2026-08-28 10:41:24.894] @gammaloop_api::se... INFO : Running command set process -p se1l -i se1l kv general.renormalization_localization_scale=0.2
  352. 140.05 s gammaloop-nextest-integration> [2026-08-28 10:41:24.895] @gammaloop_api::se... INFO : Running command duplicate integrand -p se1l -i se1l --output_process_name se1l --output_integrand_name se1l_muv_shifted
  353. 140.05 s gammaloop-nextest-integration> [2026-08-28 10:41:24.897] @gammaloop_api::se... INFO : Running command set process -p se1l -i se1l_muv_shifted kv general.m_uv=0.5
  354. 140.05 s gammaloop-nextest-integration> [2026-08-28 10:41:24.899] @gammaloop_api::se... INFO : Running command duplicate integrand -p se1l -i se1l --output_process_name se1l --output_integrand_name se1l_rls_shifted
  355. 140.05 s gammaloop-nextest-integration> [2026-08-28 10:41:24.903] @gammaloop_api::se... INFO : Running command set process -p se1l -i se1l_rls_shifted kv general.renormalization_localization_scale=1
  356. 140.05 s gammaloop-nextest-integration> [2026-08-28 10:41:24.904] @gammaloop_api::se... INFO : Running command duplicate integrand -p se1l -i se1l --output_process_name se1l --output_integrand_name se1l_mur_shifted
  357. 140.05 s gammaloop-nextest-integration> [2026-08-28 10:41:24.908] @gammaloop_api::se... INFO : Running command set process -p se1l -i se1l_mur_shifted kv general.mu_r=0.8
  358. 140.05 s gammaloop-nextest-integration> [2026-08-28 10:41:24.916] @process::amplitude WARNING : External state 0 ('g', PDG 21, helicity +) is off shell: p^2 = +2.5e5, expected m^2 = +0e0 (|Δ| = +2.5e5). Fixed-helicity spinor/vector/tensor external states may be ill-defined at this kinematic point.
  359. 140.05 s gammaloop-nextest-integration> field value
  360. 140.05 s gammaloop-nextest-integration> span warm_up{integrand.name=se1l}
  361. 140.05 s gammaloop-nextest-integration> [2026-08-28 10:41:24.916] @process::amplitude WARNING : External state 1 ('g', PDG 21, helicity -) is off shell: p^2 = +2.5e5, expected m^2 = +0e0 (|Δ| = +2.5e5). Fixed-helicity spinor/vector/tensor external states may be ill-defined at this kinematic point.
  362. 140.05 s gammaloop-nextest-integration> field value
  363. 140.05 s gammaloop-nextest-integration> span warm_up{integrand.name=se1l}
  364. 140.05 s gammaloop-nextest-integration> [2026-08-28 10:41:24.917] @process::amplitude INFO : Input is above threshold: 1 existing threshold E-surfaces across 1/1 graph groups
  365. 140.05 s gammaloop-nextest-integration> field value
  366. 140.05 s gammaloop-nextest-integration> existing_esurfaces 1
  367. 140.05 s gammaloop-nextest-integration> group_count 1
  368. 140.05 s gammaloop-nextest-integration> groups_above_threshold 1
  369. 140.05 s gammaloop-nextest-integration> integrand se1l
  370. 140.05 s gammaloop-nextest-integration> span warm_up{integrand.name=se1l}
  371. 140.05 s gammaloop-nextest-integration> threshold_status above threshold
  372. 140.05 s gammaloop-nextest-integration> [2026-08-28 10:41:24.917] @process::amplitude INFO : overlap structure of group 0: [1: [0(2,3)]]
  373. 140.05 s gammaloop-nextest-integration> field value
  374. 140.05 s gammaloop-nextest-integration> span warm_up{integrand.name=se1l}
  375. 140.05 s gammaloop-nextest-integration> [2026-08-28 10:41:25.121] @commands::profile INFO :
  376. 140.05 s gammaloop-nextest-integration> ╭───────┬──────┬──────────┬───────┬─────┬──────────┬───────────╮
  377. 140.05 s gammaloop-nextest-integration> │ fixed │ → ∞ │ slope │ r2 │ DOD │ bare DOD │ inspect │
  378. 140.05 s gammaloop-nextest-integration> ├───────┼──────┼──────────┼───────┼─────┼──────────┼───────────┤
  379. 140.05 s gammaloop-nextest-integration> │ {} │ {e3} │ 1.639236 │ 0.904 │ 2 │ 2 │ arb retry │
  380. 140.05 s gammaloop-nextest-integration> │ {} │ {e2} │ 1.698834 │ 0.902 │ 2 │ 2 │ arb retry │
  381. 140.05 s gammaloop-nextest-integration> ╰───────┴──────┴──────────┴───────┴─────┴──────────┴───────────╯
  382. 140.05 s gammaloop-nextest-integration> [2026-08-28 10:41:25.121] @commands::profile INFO :
  383. 140.05 s gammaloop-nextest-integration> ╭───────┬──────┬─────────────┬──────────┬───────┬─────┬──────────┬───────────╮
  384. 140.05 s gammaloop-nextest-integration> │ fixed │ → ∞ │ orientation │ slope │ r2 │ DOD │ bare DOD │ inspect │
  385. 140.05 s gammaloop-nextest-integration> ├───────┼──────┼─────────────┼──────────┼───────┼─────┼──────────┼───────────┤
  386. 140.05 s gammaloop-nextest-integration> │ {} │ {e3} │ 00-+ │ 0.343429 │ 0.145 │ 0 │ 2 │ arb retry │
  387. 140.05 s gammaloop-nextest-integration> │ {} │ {e3} │ 00+- │ 0.342577 │ 0.135 │ 0 │ 2 │ arb retry │
  388. 140.05 s gammaloop-nextest-integration> │ {} │ {e2} │ 00-+ │ 0.385975 │ 0.161 │ 0 │ 2 │ arb retry │
  389. 140.05 s gammaloop-nextest-integration> │ {} │ {e2} │ 00+- │ 0.384920 │ 0.192 │ 0 │ 2 │ arb retry │
  390. 140.05 s gammaloop-nextest-integration> ╰───────┴──────┴─────────────┴──────────┴───────┴─────┴──────────┴───────────╯
  391. 140.05 s gammaloop-nextest-integration> [2026-08-28 10:41:25.122] @gammaloop_api::se... INFO : Running command set process kv integrator.target_relative_accuracy=0.001 integrator.n_increase=0 integrator.n_start=50000 integrator.n_max=400000 integrator.seed=1337
  392. 140.05 s gammaloop-nextest-integration> [2026-08-28 10:41:25.123] @commands::integrate INFO : Created workspace directory at /build/source/tests/artifacts/se1l/integration_workspace_se1l
  393. 140.05 s gammaloop-nextest-integration> [2026-08-28 10:41:25.141] @commands::integrate INFO : No integration state found, starting new integration
  394. 140.05 s gammaloop-nextest-integration> [2026-08-28 10:41:25.141] @commands::integrate INFO : Gammaloop now integrates se1l@se1l, se1l@se1l_muv_shifted, se1l@se1l_rls_shifted
  395. 140.05 s gammaloop-nextest-integration> [2026-08-28 10:41:25.141] @process::amplitude WARNING : External state 0 ('g', PDG 21, helicity +) is off shell: p^2 = +2.5e5, expected m^2 = +0e0 (|Δ| = +2.5e5). Fixed-helicity spinor/vector/tensor external states may be ill-defined at this kinematic point.
  396. 140.05 s gammaloop-nextest-integration> field value
  397. 140.05 s gammaloop-nextest-integration> span warm_up{integrand.name=se1l}
  398. 140.05 s gammaloop-nextest-integration> [2026-08-28 10:41:25.141] @process::amplitude WARNING : External state 1 ('g', PDG 21, helicity -) is off shell: p^2 = +2.5e5, expected m^2 = +0e0 (|Δ| = +2.5e5). Fixed-helicity spinor/vector/tensor external states may be ill-defined at this kinematic point.
  399. 140.05 s gammaloop-nextest-integration> field value
  400. 140.05 s gammaloop-nextest-integration> span warm_up{integrand.name=se1l}
  401. 140.05 s gammaloop-nextest-integration> [2026-08-28 10:41:25.142] @process::amplitude INFO : Input is above threshold: 1 existing threshold E-surfaces across 1/1 graph groups
  402. 140.05 s gammaloop-nextest-integration> field value
  403. 140.05 s gammaloop-nextest-integration> existing_esurfaces 1
  404. 140.05 s gammaloop-nextest-integration> group_count 1
  405. 140.05 s gammaloop-nextest-integration> groups_above_threshold 1
  406. 140.05 s gammaloop-nextest-integration> integrand se1l
  407. 140.05 s gammaloop-nextest-integration> span warm_up{integrand.name=se1l}
  408. 140.05 s gammaloop-nextest-integration> threshold_status above threshold
  409. 140.05 s gammaloop-nextest-integration> [2026-08-28 10:41:25.142] @process::amplitude INFO : overlap structure of group 0: [1: [0(2,3)]]
  410. 140.05 s gammaloop-nextest-integration> field value
  411. 140.05 s gammaloop-nextest-integration> span warm_up{integrand.name=se1l}
  412. 140.05 s gammaloop-nextest-integration> [2026-08-28 10:41:25.143] @process::amplitude WARNING : External state 0 ('g', PDG 21, helicity +) is off shell: p^2 = +2.5e5, expected m^2 = +0e0 (|Δ| = +2.5e5). Fixed-helicity spinor/vector/tensor external states may be ill-defined at this kinematic point.
  413. 140.05 s gammaloop-nextest-integration> field value
  414. 140.05 s gammaloop-nextest-integration> span warm_up{integrand.name=se1l_muv_shifted}
  415. 140.05 s gammaloop-nextest-integration> [2026-08-28 10:41:25.143] @process::amplitude WARNING : External state 1 ('g', PDG 21, helicity -) is off shell: p^2 = +2.5e5, expected m^2 = +0e0 (|Δ| = +2.5e5). Fixed-helicity spinor/vector/tensor external states may be ill-defined at this kinematic point.
  416. 140.05 s gammaloop-nextest-integration> field value
  417. 140.05 s gammaloop-nextest-integration> span warm_up{integrand.name=se1l_muv_shifted}
  418. 140.05 s gammaloop-nextest-integration> [2026-08-28 10:41:25.143] @process::amplitude INFO : Input is above threshold: 1 existing threshold E-surfaces across 1/1 graph groups
  419. 140.05 s gammaloop-nextest-integration> field value
  420. 140.05 s gammaloop-nextest-integration> existing_esurfaces 1
  421. 140.05 s gammaloop-nextest-integration> group_count 1
  422. 140.05 s gammaloop-nextest-integration> groups_above_threshold 1
  423. 140.05 s gammaloop-nextest-integration> integrand se1l_muv_shifted
  424. 140.05 s gammaloop-nextest-integration> span warm_up{integrand.name=se1l_muv_shifted}
  425. 140.05 s gammaloop-nextest-integration> threshold_status above threshold
  426. 140.05 s gammaloop-nextest-integration> [2026-08-28 10:41:25.143] @process::amplitude INFO : overlap structure of group 0: [1: [0(2,3)]]
  427. 140.05 s gammaloop-nextest-integration> field value
  428. 140.05 s gammaloop-nextest-integration> span warm_up{integrand.name=se1l_muv_shifted}
  429. 140.05 s gammaloop-nextest-integration> [2026-08-28 10:41:25.145] @process::amplitude WARNING : External state 0 ('g', PDG 21, helicity +) is off shell: p^2 = +2.5e5, expected m^2 = +0e0 (|Δ| = +2.5e5). Fixed-helicity spinor/vector/tensor external states may be ill-defined at this kinematic point.
  430. 140.05 s gammaloop-nextest-integration> field value
  431. 140.05 s gammaloop-nextest-integration> span warm_up{integrand.name=se1l_rls_shifted}
  432. 140.05 s gammaloop-nextest-integration> [2026-08-28 10:41:25.145] @process::amplitude WARNING : External state 1 ('g', PDG 21, helicity -) is off shell: p^2 = +2.5e5, expected m^2 = +0e0 (|Δ| = +2.5e5). Fixed-helicity spinor/vector/tensor external states may be ill-defined at this kinematic point.
  433. 140.05 s gammaloop-nextest-integration> field value
  434. 140.05 s gammaloop-nextest-integration> span warm_up{integrand.name=se1l_rls_shifted}
  435. 140.05 s gammaloop-nextest-integration> [2026-08-28 10:41:25.145] @process::amplitude INFO : Input is above threshold: 1 existing threshold E-surfaces across 1/1 graph groups
  436. 140.05 s gammaloop-nextest-integration> field value
  437. 140.05 s gammaloop-nextest-integration> existing_esurfaces 1
  438. 140.05 s gammaloop-nextest-integration> group_count 1
  439. 140.05 s gammaloop-nextest-integration> groups_above_threshold 1
  440. 140.05 s gammaloop-nextest-integration> integrand se1l_rls_shifted
  441. 140.05 s gammaloop-nextest-integration> span warm_up{integrand.name=se1l_rls_shifted}
  442. 140.05 s gammaloop-nextest-integration> threshold_status above threshold
  443. 140.05 s gammaloop-nextest-integration> ... omitted 1410 more lines; see full nextest output above
  444. 140.05 s gammaloop-nextest-integration> =========================================
  445. 140.49 s error: Cannot build '/nix/store/ifx25i75mrp4mx011vk3kpahjasmfqfi-gammaloop-nextest-integration.drv'.
  446. 140.49 s Reason: builder failed with exit code 100.
  447. 140.49 s Output paths:
  448. 140.49 s /nix/store/zp6pznmk8m5zpqbw5hmcyg91mpp8x0kf-gammaloop-nextest-integration
  449. 140.49 s Last 2048 log lines:
  450. 140.49 s > span warm_up{integrand.name=se1l_muv_shifted}
  451. 140.49 s > threshold_status above threshold
  452. 140.49 s > [2026-08-28 10:43:10.407] @process::amplitude INFO : overlap structure of group 0: [1: [0(2,3)]]
  453. 140.49 s > field value
  454. 140.49 s > span warm_up{integrand.name=se1l_muv_shifted}
  455. 140.49 s > [2026-08-28 10:43:10.411] @process::amplitude WARNING : External state 0 ('g', PDG 21, helicity +) is off shell: p^2 = +2.5e5, expected m^2 = +0e0 (|Δ| = +2.5e5). Fixed-helicity spinor/vector/tensor external states may be ill-defined at this kinematic point.
  456. 140.49 s > field value
  457. 140.49 s > span warm_up{integrand.name=se1l}
  458. 140.49 s > [2026-08-28 10:43:10.411] @process::amplitude WARNING : External state 1 ('g', PDG 21, helicity -) is off shell: p^2 = +2.5e5, expected m^2 = +0e0 (|Δ| = +2.5e5). Fixed-helicity spinor/vector/tensor external states may be ill-defined at this kinematic point.
  459. 140.49 s > field value
  460. 140.49 s > span warm_up{integrand.name=se1l}
  461. 140.49 s > [2026-08-28 10:43:10.411] @process::amplitude INFO : Input is above threshold: 1 existing threshold E-surfaces across 1/1 graph groups
  462. 140.49 s > field value
  463. 140.49 s > existing_esurfaces 1
  464. 140.49 s > group_count 1
  465. 140.49 s > groups_above_threshold 1
  466. 140.49 s > integrand se1l
  467. 140.49 s > span warm_up{integrand.name=se1l}
  468. 140.49 s > threshold_status above threshold
  469. 140.49 s > [2026-08-28 10:43:10.411] @process::amplitude INFO : overlap structure of group 0: [1: [0(2,3)]]
  470. 140.49 s > field value
  471. 140.49 s > span warm_up{integrand.name=se1l}
  472. 140.49 s > [2026-08-28 10:43:10.415] @process::amplitude WARNING : External state 0 ('g', PDG 21, helicity +) is off shell: p^2 = +2.5e5, expected m^2 = +0e0 (|Δ| = +2.5e5). Fixed-helicity spinor/vector/tensor external states may be ill-defined at this kinematic point.
  473. 140.49 s > field value
  474. 140.49 s > span warm_up{integrand.name=se1l_muv_shifted}
  475. 140.49 s > [2026-08-28 10:43:10.415] @process::amplitude WARNING : External state 1 ('g', PDG 21, helicity -) is off shell: p^2 = +2.5e5, expected m^2 = +0e0 (|Δ| = +2.5e5). Fixed-helicity spinor/vector/tensor external states may be ill-defined at this kinematic point.
  476. 140.49 s > field value
  477. 140.49 s > span warm_up{integrand.name=se1l_muv_shifted}
  478. 140.49 s > [2026-08-28 10:43:10.415] @process::amplitude INFO : Input is above threshold: 1 existing threshold E-surfaces across 1/1 graph groups
  479. 140.49 s > field value
  480. 140.49 s > existing_esurfaces 1
  481. 140.49 s > group_count 1
  482. 140.49 s > groups_above_threshold 1
  483. 140.49 s > integrand se1l_muv_shifted
  484. 140.49 s > span warm_up{integrand.name=se1l_muv_shifted}
  485. 140.49 s > threshold_status above threshold
  486. 140.49 s > [2026-08-28 10:43:10.415] @process::amplitude INFO : overlap structure of group 0: [1: [0(2,3)]]
  487. 140.49 s > field value
  488. 140.49 s > span warm_up{integrand.name=se1l_muv_shifted}
  489. 140.49 s > [2026-08-28 10:43:10.419] @process::amplitude WARNING : External state 0 ('g', PDG 21, helicity +) is off shell: p^2 = +2.5e5, expected m^2 = +0e0 (|Δ| = +2.5e5). Fixed-helicity spinor/vector/tensor external states may be ill-defined at this kinematic point.
  490. 140.49 s > field value
  491. 140.49 s > span warm_up{integrand.name=se1l}
  492. 140.49 s > [2026-08-28 10:43:10.419] @process::amplitude WARNING : External state 1 ('g', PDG 21, helicity -) is off shell: p^2 = +2.5e5, expected m^2 = +0e0 (|Δ| = +2.5e5). Fixed-helicity spinor/vector/tensor external states may be ill-defined at this kinematic point.
  493. 140.49 s > field value
  494. 140.49 s > span warm_up{integrand.name=se1l}
  495. 140.49 s > [2026-08-28 10:43:10.419] @process::amplitude INFO : Input is above threshold: 1 existing threshold E-surfaces across 1/1 graph groups
  496. 140.49 s > field value
  497. 140.49 s > existing_esurfaces 1
  498. 140.49 s > group_count 1
  499. 140.49 s > groups_above_threshold 1
  500. 140.49 s > integrand se1l
  501. 140.49 s > span warm_up{integrand.name=se1l}
  502. 140.49 s > threshold_status above threshold
  503. 140.49 s > [2026-08-28 10:43:10.419] @process::amplitude INFO : overlap structure of group 0: [1: [0(2,3)]]
  504. 140.49 s > field value
  505. 140.49 s > span warm_up{integrand.name=se1l}
  506. 140.49 s > [2026-08-28 10:43:10.423] @process::amplitude WARNING : External state 0 ('g', PDG 21, helicity +) is off shell: p^2 = +2.5e5, expected m^2 = +0e0 (|Δ| = +2.5e5). Fixed-helicity spinor/vector/tensor external states may be ill-defined at this kinematic point.
  507. 140.49 s > field value
  508. 140.49 s > span warm_up{integrand.name=se1l_muv_shifted}
  509. 140.49 s > [2026-08-28 10:43:10.423] @process::amplitude WARNING : External state 1 ('g', PDG 21, helicity -) is off shell: p^2 = +2.5e5, expected m^2 = +0e0 (|Δ| = +2.5e5). Fixed-helicity spinor/vector/tensor external states may be ill-defined at this kinematic point.
  510. 140.49 s > field value
  511. 140.49 s > span warm_up{integrand.name=se1l_muv_shifted}
  512. 140.49 s > [2026-08-28 10:43:10.423] @process::amplitude INFO : Input is above threshold: 1 existing threshold E-surfaces across 1/1 graph groups
  513. 140.49 s > field value
  514. 140.49 s > existing_esurfaces 1
  515. 140.49 s > group_count 1
  516. 140.49 s > groups_above_threshold 1
  517. 140.49 s > integrand se1l_muv_shifted
  518. 140.49 s > span warm_up{integrand.name=se1l_muv_shifted}
  519. 140.49 s > threshold_status above threshold
  520. 140.49 s > [2026-08-28 10:43:10.423] @process::amplitude INFO : overlap structure of group 0: [1: [0(2,3)]]
  521. 140.49 s > field value
  522. 140.49 s > span warm_up{integrand.name=se1l_muv_shifted}
  523. 140.49 s > [2026-08-28 10:43:10.426] @process::amplitude WARNING : External state 0 ('g', PDG 21, helicity +) is off shell: p^2 = +2.5e5, expected m^2 = +0e0 (|Δ| = +2.5e5). Fixed-helicity spinor/vector/tensor external states may be ill-defined at this kinematic point.
  524. 140.49 s > field value
  525. 140.49 s > span warm_up{integrand.name=se1l}
  526. 140.49 s > [2026-08-28 10:43:10.426] @process::amplitude WARNING : External state 1 ('g', PDG 21, helicity -) is off shell: p^2 = +2.5e5, expected m^2 = +0e0 (|Δ| = +2.5e5). Fixed-helicity spinor/vector/tensor external states may be ill-defined at this kinematic point.
  527. 140.49 s > field value
  528. 140.49 s > span warm_up{integrand.name=se1l}
  529. 140.49 s > [2026-08-28 10:43:10.427] @process::amplitude INFO : Input is above threshold: 1 existing threshold E-surfaces across 1/1 graph groups
  530. 140.49 s > field value
  531. 140.49 s > existing_esurfaces 1
  532. 140.49 s > group_count 1
  533. 140.49 s > groups_above_threshold 1
  534. 140.49 s > integrand se1l
  535. 140.49 s > span warm_up{integrand.name=se1l}
  536. 140.49 s > threshold_status above threshold
  537. 140.49 s > [2026-08-28 10:43:10.427] @process::amplitude INFO : overlap structure of group 0: [1: [0(2,3)]]
  538. 140.49 s > field value
  539. 140.49 s > span warm_up{integrand.name=se1l}
  540. 140.49 s > [2026-08-28 10:43:10.430] @process::amplitude WARNING : External state 0 ('g', PDG 21, helicity +) is off shell: p^2 = +2.5e5, expected m^2 = +0e0 (|Δ| = +2.5e5). Fixed-helicity spinor/vector/tensor external states may be ill-defined at this kinematic point.
  541. 140.49 s > field value
  542. 140.49 s > span warm_up{integrand.name=se1l_muv_shifted}
  543. 140.49 s > [2026-08-28 10:43:10.430] @process::amplitude WARNING : External state 1 ('g', PDG 21, helicity -) is off shell: p^2 = +2.5e5, expected m^2 = +0e0 (|Δ| = +2.5e5). Fixed-helicity spinor/vector/tensor external states may be ill-defined at this kinematic point.
  544. 140.49 s > field value
  545. 140.49 s > span warm_up{integrand.name=se1l_muv_shifted}
  546. 140.49 s > [2026-08-28 10:43:10.430] @process::amplitude INFO : Input is above threshold: 1 existing threshold E-surfaces across 1/1 graph groups
  547. 140.49 s > field value
  548. 140.49 s > existing_esurfaces 1
  549. 140.49 s > group_count 1
  550. 140.49 s > groups_above_threshold 1
  551. 140.49 s > integrand se1l_muv_shifted
  552. 140.49 s > span warm_up{integrand.name=se1l_muv_shifted}
  553. 140.49 s > threshold_status above threshold
  554. 140.49 s > [2026-08-28 10:43:10.431] @process::amplitude INFO : overlap structure of group 0: [1: [0(2,3)]]
  555. 140.49 s > field value
  556. 140.49 s > span warm_up{integrand.name=se1l_muv_shifted}
  557. 140.49 s > [2026-08-28 10:43:10.434] @process::amplitude WARNING : External state 0 ('g', PDG 21, helicity +) is off shell: p^2 = +2.5e5, expected m^2 = +0e0 (|Δ| = +2.5e5). Fixed-helicity spinor/vector/tensor external states may be ill-defined at this kinematic point.
  558. 140.49 s > field value
  559. 140.49 s > span warm_up{integrand.name=se1l}
  560. 140.49 s > [2026-08-28 10:43:10.434] @process::amplitude WARNING : External state 1 ('g', PDG 21, helicity -) is off shell: p^2 = +2.5e5, expected m^2 = +0e0 (|Δ| = +2.5e5). Fixed-helicity spinor/vector/tensor external states may be ill-defined at this kinematic point.
  561. 140.49 s > field value
  562. 140.49 s > span warm_up{integrand.name=se1l}
  563. 140.49 s > [2026-08-28 10:43:10.434] @process::amplitude INFO : Input is above threshold: 1 existing threshold E-surfaces across 1/1 graph groups
  564. 140.49 s > field value
  565. 140.49 s > existing_esurfaces 1
  566. 140.49 s > group_count 1
  567. 140.49 s > groups_above_threshold 1
  568. 140.49 s > integrand se1l
  569. 140.49 s > span warm_up{integrand.name=se1l}
  570. 140.49 s > threshold_status above threshold
  571. 140.49 s > [2026-08-28 10:43:10.434] @process::amplitude INFO : overlap structure of group 0: [1: [0(2,3)]]
  572. 140.49 s > field value
  573. 140.49 s > span warm_up{integrand.name=se1l}
  574. 140.49 s > [2026-08-28 10:43:10.438] @process::amplitude WARNING : External state 0 ('g', PDG 21, helicity +) is off shell: p^2 = +2.5e5, expected m^2 = +0e0 (|Δ| = +2.5e5). Fixed-helicity spinor/vector/tensor external states may be ill-defined at this kinematic point.
  575. 140.49 s > field value
  576. 140.49 s > span warm_up{integrand.name=se1l_rls_shifted}
  577. 140.49 s > [2026-08-28 10:43:10.438] @process::amplitude WARNING : External state 1 ('g', PDG 21, helicity -) is off shell: p^2 = +2.5e5, expected m^2 = +0e0 (|Δ| = +2.5e5). Fixed-helicity spinor/vector/tensor external states may be ill-defined at this kinematic point.
  578. 140.49 s > field value
  579. 140.49 s > span warm_up{integrand.name=se1l_rls_shifted}
  580. 140.49 s > [2026-08-28 10:43:10.438] @process::amplitude INFO : Input is above threshold: 1 existing threshold E-surfaces across 1/1 graph groups
  581. 140.49 s > field value
  582. 140.49 s > existing_esurfaces 1
  583. 140.49 s > group_count 1
  584. 140.49 s > groups_above_threshold 1
  585. 140.49 s > integrand se1l_rls_shifted
  586. 140.49 s > span warm_up{integrand.name=se1l_rls_shifted}
  587. 140.49 s > threshold_status above threshold
  588. 140.49 s > [2026-08-28 10:43:10.438] @process::amplitude INFO : overlap structure of group 0: [1: [0(2,3)]]
  589. 140.49 s > field value
  590. 140.49 s > span warm_up{integrand.name=se1l_rls_shifted}
  591. 140.49 s > [2026-08-28 10:43:10.442] @process::amplitude WARNING : External state 0 ('g', PDG 21, helicity +) is off shell: p^2 = +2.5e5, expected m^2 = +0e0 (|Δ| = +2.5e5). Fixed-helicity spinor/vector/tensor external states may be ill-defined at this kinematic point.
  592. 140.49 s > field value
  593. 140.49 s > span warm_up{integrand.name=se1l}
  594. 140.49 s > [2026-08-28 10:43:10.442] @process::amplitude WARNING : External state 1 ('g', PDG 21, helicity -) is off shell: p^2 = +2.5e5, expected m^2 = +0e0 (|Δ| = +2.5e5). Fixed-helicity spinor/vector/tensor external states may be ill-defined at this kinematic point.
  595. 140.49 s > field value
  596. 140.49 s > span warm_up{integrand.name=se1l}
  597. 140.49 s > [2026-08-28 10:43:10.442] @process::amplitude INFO : Input is above threshold: 1 existing threshold E-surfaces across 1/1 graph groups
  598. 140.49 s > field value
  599. 140.49 s > existing_esurfaces 1
  600. 140.49 s > group_count 1
  601. 140.49 s > groups_above_threshold 1
  602. 140.49 s > integrand se1l
  603. 140.49 s > span warm_up{integrand.name=se1l}
  604. 140.49 s > threshold_status above threshold
  605. 140.49 s > [2026-08-28 10:43:10.442] @process::amplitude INFO : overlap structure of group 0: [1: [0(2,3)]]
  606. 140.49 s > field value
  607. 140.49 s > span warm_up{integrand.name=se1l}
  608. 140.49 s > [2026-08-28 10:43:10.446] @process::amplitude WARNING : External state 0 ('g', PDG 21, helicity +) is off shell: p^2 = +2.5e5, expected m^2 = +0e0 (|Δ| = +2.5e5). Fixed-helicity spinor/vector/tensor external states may be ill-defined at this kinematic point.
  609. 140.49 s > field value
  610. 140.49 s > span warm_up{integrand.name=se1l_rls_shifted}
  611. 140.49 s > [2026-08-28 10:43:10.446] @process::amplitude WARNING : External state 1 ('g', PDG 21, helicity -) is off shell: p^2 = +2.5e5, expected m^2 = +0e0 (|Δ| = +2.5e5). Fixed-helicity spinor/vector/tensor external states may be ill-defined at this kinematic point.
  612. 140.49 s > field value
  613. 140.49 s > span warm_up{integrand.name=se1l_rls_shifted}
  614. 140.49 s > [2026-08-28 10:43:10.446] @process::amplitude INFO : Input is above threshold: 1 existing threshold E-surfaces across 1/1 graph groups
  615. 140.49 s > field value
  616. 140.49 s > existing_esurfaces 1
  617. 140.49 s > group_count 1
  618. 140.49 s > groups_above_threshold 1
  619. 140.49 s > integrand se1l_rls_shifted
  620. 140.49 s > span warm_up{integrand.name=se1l_rls_shifted}
  621. 140.49 s > threshold_status above threshold
  622. 140.49 s > [2026-08-28 10:43:10.446] @process::amplitude INFO : overlap structure of group 0: [1: [0(2,3)]]
  623. 140.49 s > field value
  624. 140.49 s > span warm_up{integrand.name=se1l_rls_shifted}
  625. 140.49 s > [2026-08-28 10:43:10.450] @process::amplitude WARNING : External state 0 ('g', PDG 21, helicity +) is off shell: p^2 = +2.5e5, expected m^2 = +0e0 (|Δ| = +2.5e5). Fixed-helicity spinor/vector/tensor external states may be ill-defined at this kinematic point.
  626. 140.49 s > field value
  627. 140.49 s > span warm_up{integrand.name=se1l}
  628. 140.49 s > [2026-08-28 10:43:10.450] @process::amplitude WARNING : External state 1 ('g', PDG 21, helicity -) is off shell: p^2 = +2.5e5, expected m^2 = +0e0 (|Δ| = +2.5e5). Fixed-helicity spinor/vector/tensor external states may be ill-defined at this kinematic point.
  629. 140.49 s > field value
  630. 140.49 s > span warm_up{integrand.name=se1l}
  631. 140.49 s > [2026-08-28 10:43:10.450] @process::amplitude INFO : Input is above threshold: 1 existing threshold E-surfaces across 1/1 graph groups
  632. 140.49 s > field value
  633. 140.49 s > existing_esurfaces 1
  634. 140.49 s > group_count 1
  635. 140.49 s > groups_above_threshold 1
  636. 140.49 s > integrand se1l
  637. 140.49 s > span warm_up{integrand.name=se1l}
  638. 140.49 s > threshold_status above threshold
  639. 140.49 s > [2026-08-28 10:43:10.450] @process::amplitude INFO : overlap structure of group 0: [1: [0(2,3)]]
  640. 140.49 s > field value
  641. 140.49 s > span warm_up{integrand.name=se1l}
  642. 140.49 s > [2026-08-28 10:43:10.453] @process::amplitude WARNING : External state 0 ('g', PDG 21, helicity +) is off shell: p^2 = +2.5e5, expected m^2 = +0e0 (|Δ| = +2.5e5). Fixed-helicity spinor/vector/tensor external states may be ill-defined at this kinematic point.
  643. 140.49 s > field value
  644. 140.49 s > span warm_up{integrand.name=se1l_rls_shifted}
  645. 140.49 s > [2026-08-28 10:43:10.453] @process::amplitude WARNING : External state 1 ('g', PDG 21, helicity -) is off shell: p^2 = +2.5e5, expected m^2 = +0e0 (|Δ| = +2.5e5). Fixed-helicity spinor/vector/tensor external states may be ill-defined at this kinematic point.
  646. 140.49 s > field value
  647. 140.49 s > span warm_up{integrand.name=se1l_rls_shifted}
  648. 140.49 s > [2026-08-28 10:43:10.454] @process::amplitude INFO : Input is above threshold: 1 existing threshold E-surfaces across 1/1 graph groups
  649. 140.49 s > field value
  650. 140.49 s > existing_esurfaces 1
  651. 140.49 s > group_count 1
  652. 140.49 s > groups_above_threshold 1
  653. 140.49 s > integrand se1l_rls_shifted
  654. 140.49 s > span warm_up{integrand.name=se1l_rls_shifted}
  655. 140.49 s > threshold_status above threshold
  656. 140.49 s > [2026-08-28 10:43:10.454] @process::amplitude INFO : overlap structure of group 0: [1: [0(2,3)]]
  657. 140.49 s > field value
  658. 140.49 s > span warm_up{integrand.name=se1l_rls_shifted}
  659. 140.49 s > [2026-08-28 10:43:10.457] @process::amplitude WARNING : External state 0 ('g', PDG 21, helicity +) is off shell: p^2 = +2.5e5, expected m^2 = +0e0 (|Δ| = +2.5e5). Fixed-helicity spinor/vector/tensor external states may be ill-defined at this kinematic point.
  660. 140.49 s > field value
  661. 140.49 s > span warm_up{integrand.name=se1l}
  662. 140.49 s > [2026-08-28 10:43:10.457] @process::amplitude WARNING : External state 1 ('g', PDG 21, helicity -) is off shell: p^2 = +2.5e5, expected m^2 = +0e0 (|Δ| = +2.5e5). Fixed-helicity spinor/vector/tensor external states may be ill-defined at this kinematic point.
  663. 140.49 s > field value
  664. 140.49 s > span warm_up{integrand.name=se1l}
  665. 140.49 s > [2026-08-28 10:43:10.457] @process::amplitude INFO : Input is above threshold: 1 existing threshold E-surfaces across 1/1 graph groups
  666. 140.49 s > field value
  667. 140.49 s > existing_esurfaces 1
  668. 140.49 s > group_count 1
  669. 140.49 s > groups_above_threshold 1
  670. 140.49 s > integrand se1l
  671. 140.49 s > span warm_up{integrand.name=se1l}
  672. 140.49 s > threshold_status above threshold
  673. 140.49 s > [2026-08-28 10:43:10.458] @process::amplitude INFO : overlap structure of group 0: [1: [0(2,3)]]
  674. 140.49 s > field value
  675. 140.49 s > span warm_up{integrand.name=se1l}
  676. 140.49 s > [2026-08-28 10:43:10.461] @process::amplitude WARNING : External state 0 ('g', PDG 21, helicity +) is off shell: p^2 = +2.5e5, expected m^2 = +0e0 (|Δ| = +2.5e5). Fixed-helicity spinor/vector/tensor external states may be ill-defined at this kinematic point.
  677. 140.49 s > field value
  678. 140.49 s > span warm_up{integrand.name=se1l_rls_shifted}
  679. 140.49 s > [2026-08-28 10:43:10.461] @process::amplitude WARNING : External state 1 ('g', PDG 21, helicity -) is off shell: p^2 = +2.5e5, expected m^2 = +0e0 (|Δ| = +2.5e5). Fixed-helicity spinor/vector/tensor external states may be ill-defined at this kinematic point.
  680. 140.49 s > field value
  681. 140.49 s > span warm_up{integrand.name=se1l_rls_shifted}
  682. 140.49 s > [2026-08-28 10:43:10.461] @process::amplitude INFO : Input is above threshold: 1 existing threshold E-surfaces across 1/1 graph groups
  683. 140.49 s > field value
  684. 140.49 s > existing_esurfaces 1
  685. 140.49 s > group_count 1
  686. 140.49 s > groups_above_threshold 1
  687. 140.49 s > integrand se1l_rls_shifted
  688. 140.49 s > span warm_up{integrand.name=se1l_rls_shifted}
  689. 140.49 s > threshold_status above threshold
  690. 140.49 s > [2026-08-28 10:43:10.461] @process::amplitude INFO : overlap structure of group 0: [1: [0(2,3)]]
  691. 140.49 s > field value
  692. 140.49 s > span warm_up{integrand.name=se1l_rls_shifted}
  693. 140.49 s > [2026-08-28 10:43:10.465] @process::amplitude WARNING : External state 0 ('g', PDG 21, helicity +) is off shell: p^2 = +2.5e5, expected m^2 = +0e0 (|Δ| = +2.5e5). Fixed-helicity spinor/vector/tensor external states may be ill-defined at this kinematic point.
  694. 140.49 s > field value
  695. 140.49 s > span warm_up{integrand.name=se1l}
  696. 140.49 s > [2026-08-28 10:43:10.465] @process::amplitude WARNING : External state 1 ('g', PDG 21, helicity -) is off shell: p^2 = +2.5e5, expected m^2 = +0e0 (|Δ| = +2.5e5). Fixed-helicity spinor/vector/tensor external states may be ill-defined at this kinematic point.
  697. 140.49 s > field value
  698. 140.49 s > span warm_up{integrand.name=se1l}
  699. 140.49 s > [2026-08-28 10:43:10.465] @process::amplitude INFO : Input is above threshold: 1 existing threshold E-surfaces across 1/1 graph groups
  700. 140.49 s > field value
  701. 140.49 s > existing_esurfaces 1
  702. 140.49 s > group_count 1
  703. 140.49 s > groups_above_threshold 1
  704. 140.49 s > integrand se1l
  705. 140.49 s > span warm_up{integrand.name=se1l}
  706. 140.49 s > threshold_status above threshold
  707. 140.49 s > [2026-08-28 10:43:10.465] @process::amplitude INFO : overlap structure of group 0: [1: [0(2,3)]]
  708. 140.49 s > field value
  709. 140.49 s > span warm_up{integrand.name=se1l}
  710. 140.49 s > [2026-08-28 10:43:10.469] @process::amplitude WARNING : External state 0 ('g', PDG 21, helicity +) is off shell: p^2 = +2.5e5, expected m^2 = +0e0 (|Δ| = +2.5e5). Fixed-helicity spinor/vector/tensor external states may be ill-defined at this kinematic point.
  711. 140.49 s > field value
  712. 140.49 s > span warm_up{integrand.name=se1l_rls_shifted}
  713. 140.49 s > [2026-08-28 10:43:10.469] @process::amplitude WARNING : External state 1 ('g', PDG 21, helicity -) is off shell: p^2 = +2.5e5, expected m^2 = +0e0 (|Δ| = +2.5e5). Fixed-helicity spinor/vector/tensor external states may be ill-defined at this kinematic point.
  714. 140.49 s > field value
  715. 140.49 s > span warm_up{integrand.name=se1l_rls_shifted}
  716. 140.49 s > [2026-08-28 10:43:10.469] @process::amplitude INFO : Input is above threshold: 1 existing threshold E-surfaces across 1/1 graph groups
  717. 140.49 s > field value
  718. 140.49 s > existing_esurfaces 1
  719. 140.49 s > group_count 1
  720. 140.49 s > groups_above_threshold 1
  721. 140.49 s > integrand se1l_rls_shifted
  722. 140.49 s > span warm_up{integrand.name=se1l_rls_shifted}
  723. 140.49 s > threshold_status above threshold
  724. 140.49 s > [2026-08-28 10:43:10.469] @process::amplitude INFO : overlap structure of group 0: [1: [0(2,3)]]
  725. 140.49 s > field value
  726. 140.49 s > span warm_up{integrand.name=se1l_rls_shifted}
  727. 140.49 s > [2026-08-28 10:43:10.473] @process::amplitude WARNING : External state 0 ('g', PDG 21, helicity +) is off shell: p^2 = +2.5e5, expected m^2 = +0e0 (|Δ| = +2.5e5). Fixed-helicity spinor/vector/tensor external states may be ill-defined at this kinematic point.
  728. 140.49 s > field value
  729. 140.49 s > span warm_up{integrand.name=se1l}
  730. 140.49 s > [2026-08-28 10:43:10.473] @process::amplitude WARNING : External state 1 ('g', PDG 21, helicity -) is off shell: p^2 = +2.5e5, expected m^2 = +0e0 (|Δ| = +2.5e5). Fixed-helicity spinor/vector/tensor external states may be ill-defined at this kinematic point.
  731. 140.49 s > field value
  732. 140.49 s > span warm_up{integrand.name=se1l}
  733. 140.49 s > [2026-08-28 10:43:10.473] @process::amplitude INFO : Input is above threshold: 1 existing threshold E-surfaces across 1/1 graph groups
  734. 140.49 s > field value
  735. 140.49 s > existing_esurfaces 1
  736. 140.49 s > group_count 1
  737. 140.49 s > groups_above_threshold 1
  738. 140.49 s > integrand se1l
  739. 140.49 s > span warm_up{integrand.name=se1l}
  740. 140.49 s > threshold_status above threshold
  741. 140.49 s > [2026-08-28 10:43:10.473] @process::amplitude INFO : overlap structure of group 0: [1: [0(2,3)]]
  742. 140.49 s > field value
  743. 140.49 s > span warm_up{integrand.name=se1l}
  744. 140.49 s > [2026-08-28 10:43:10.477] @process::amplitude WARNING : External state 0 ('g', PDG 21, helicity +) is off shell: p^2 = +2.5e5, expected m^2 = +0e0 (|Δ| = +2.5e5). Fixed-helicity spinor/vector/tensor external states may be ill-defined at this kinematic point.
  745. 140.49 s > field value
  746. 140.49 s > span warm_up{integrand.name=se1l_rls_shifted}
  747. 140.49 s > [2026-08-28 10:43:10.477] @process::amplitude WARNING : External state 1 ('g', PDG 21, helicity -) is off shell: p^2 = +2.5e5, expected m^2 = +0e0 (|Δ| = +2.5e5). Fixed-helicity spinor/vector/tensor external states may be ill-defined at this kinematic point.
  748. 140.49 s > field value
  749. 140.49 s > span warm_up{integrand.name=se1l_rls_shifted}
  750. 140.49 s > [2026-08-28 10:43:10.477] @process::amplitude INFO : Input is above threshold: 1 existing threshold E-surfaces across 1/1 graph groups
  751. 140.49 s > field value
  752. 140.49 s > existing_esurfaces 1
  753. 140.49 s > group_count 1
  754. 140.49 s > groups_above_threshold 1
  755. 140.49 s > integrand se1l_rls_shifted
  756. 140.49 s > span warm_up{integrand.name=se1l_rls_shifted}
  757. 140.49 s > threshold_status above threshold
  758. 140.49 s > [2026-08-28 10:43:10.477] @process::amplitude INFO : overlap structure of group 0: [1: [0(2,3)]]
  759. 140.49 s > field value
  760. 140.49 s > span warm_up{integrand.name=se1l_rls_shifted}
  761. 140.49 s > [2026-08-28 10:43:10.480] @process::amplitude WARNING : External state 0 ('g', PDG 21, helicity +) is off shell: p^2 = +2.5e5, expected m^2 = +0e0 (|Δ| = +2.5e5). Fixed-helicity spinor/vector/tensor external states may be ill-defined at this kinematic point.
  762. 140.49 s > field value
  763. 140.49 s > span warm_up{integrand.name=se1l}
  764. 140.49 s > [2026-08-28 10:43:10.480] @process::amplitude WARNING : External state 1 ('g', PDG 21, helicity -) is off shell: p^2 = +2.5e5, expected m^2 = +0e0 (|Δ| = +2.5e5). Fixed-helicity spinor/vector/tensor external states may be ill-defined at this kinematic point.
  765. 140.49 s > field value
  766. 140.49 s > span warm_up{integrand.name=se1l}
  767. 140.49 s > [2026-08-28 10:43:10.480] @process::amplitude INFO : Input is above threshold: 1 existing threshold E-surfaces across 1/1 graph groups
  768. 140.49 s > field value
  769. 140.49 s > existing_esurfaces 1
  770. 140.49 s > group_count 1
  771. 140.49 s > groups_above_threshold 1
  772. 140.49 s > integrand se1l
  773. 140.49 s > span warm_up{integrand.name=se1l}
  774. 140.49 s > threshold_status above threshold
  775. 140.49 s > [2026-08-28 10:43:10.481] @process::amplitude INFO : overlap structure of group 0: [1: [0(2,3)]]
  776. 140.49 s > field value
  777. 140.49 s > span warm_up{integrand.name=se1l}
  778. 140.49 s > [2026-08-28 10:43:10.484] @process::amplitude WARNING : External state 0 ('g', PDG 21, helicity +) is off shell: p^2 = +2.5e5, expected m^2 = +0e0 (|Δ| = +2.5e5). Fixed-helicity spinor/vector/tensor external states may be ill-defined at this kinematic point.
  779. 140.49 s > field value
  780. 140.49 s > span warm_up{integrand.name=se1l_rls_shifted}
  781. 140.49 s > [2026-08-28 10:43:10.484] @process::amplitude WARNING : External state 1 ('g', PDG 21, helicity -) is off shell: p^2 = +2.5e5, expected m^2 = +0e0 (|Δ| = +2.5e5). Fixed-helicity spinor/vector/tensor external states may be ill-defined at this kinematic point.
  782. 140.49 s > field value
  783. 140.49 s > span warm_up{integrand.name=se1l_rls_shifted}
  784. 140.49 s > [2026-08-28 10:43:10.484] @process::amplitude INFO : Input is above threshold: 1 existing threshold E-surfaces across 1/1 graph groups
  785. 140.49 s > field value
  786. 140.49 s > existing_esurfaces 1
  787. 140.49 s > group_count 1
  788. 140.49 s > groups_above_threshold 1
  789. 140.49 s > integrand se1l_rls_shifted
  790. 140.49 s > span warm_up{integrand.name=se1l_rls_shifted}
  791. 140.49 s > threshold_status above threshold
  792. 140.49 s > [2026-08-28 10:43:10.484] @process::amplitude INFO : overlap structure of group 0: [1: [0(2,3)]]
  793. 140.49 s > field value
  794. 140.49 s > span warm_up{integrand.name=se1l_rls_shifted}
  795. 140.49 s > [2026-08-28 10:43:10.488] @process::amplitude WARNING : External state 0 ('g', PDG 21, helicity +) is off shell: p^2 = +2.5e5, expected m^2 = +0e0 (|Δ| = +2.5e5). Fixed-helicity spinor/vector/tensor external states may be ill-defined at this kinematic point.
  796. 140.49 s > field value
  797. 140.49 s > span warm_up{integrand.name=se1l}
  798. 140.49 s > [2026-08-28 10:43:10.488] @process::amplitude WARNING : External state 1 ('g', PDG 21, helicity -) is off shell: p^2 = +2.5e5, expected m^2 = +0e0 (|Δ| = +2.5e5). Fixed-helicity spinor/vector/tensor external states may be ill-defined at this kinematic point.
  799. 140.49 s > field value
  800. 140.49 s > span warm_up{integrand.name=se1l}
  801. 140.49 s > [2026-08-28 10:43:10.488] @process::amplitude INFO : Input is above threshold: 1 existing threshold E-surfaces across 1/1 graph groups
  802. 140.49 s > field value
  803. 140.49 s > existing_esurfaces 1
  804. 140.49 s > group_count 1
  805. 140.49 s > groups_above_threshold 1
  806. 140.49 s > integrand se1l
  807. 140.49 s > span warm_up{integrand.name=se1l}
  808. 140.49 s > threshold_status above threshold
  809. 140.49 s > [2026-08-28 10:43:10.488] @process::amplitude INFO : overlap structure of group 0: [1: [0(2,3)]]
  810. 140.49 s > field value
  811. 140.49 s > span warm_up{integrand.name=se1l}
  812. 140.49 s > [2026-08-28 10:43:10.492] @process::amplitude WARNING : External state 0 ('g', PDG 21, helicity +) is off shell: p^2 = +2.5e5, expected m^2 = +0e0 (|Δ| = +2.5e5). Fixed-helicity spinor/vector/tensor external states may be ill-defined at this kinematic point.
  813. 140.49 s > field value
  814. 140.49 s > span warm_up{integrand.name=se1l_rls_shifted}
  815. 140.49 s > [2026-08-28 10:43:10.492] @process::amplitude WARNING : External state 1 ('g', PDG 21, helicity -) is off shell: p^2 = +2.5e5, expected m^2 = +0e0 (|Δ| = +2.5e5). Fixed-helicity spinor/vector/tensor external states may be ill-defined at this kinematic point.
  816. 140.49 s > field value
  817. 140.49 s > span warm_up{integrand.name=se1l_rls_shifted}
  818. 140.49 s > [2026-08-28 10:43:10.492] @process::amplitude INFO : Input is above threshold: 1 existing threshold E-surfaces across 1/1 graph groups
  819. 140.49 s > field value
  820. 140.49 s > existing_esurfaces 1
  821. 140.49 s > group_count 1
  822. 140.49 s > groups_above_threshold 1
  823. 140.49 s > integrand se1l_rls_shifted
  824. 140.49 s > span warm_up{integrand.name=se1l_rls_shifted}
  825. 140.49 s > threshold_status above threshold
  826. 140.49 s > [2026-08-28 10:43:10.492] @process::amplitude INFO : overlap structure of group 0: [1: [0(2,3)]]
  827. 140.49 s > field value
  828. 140.49 s > span warm_up{integrand.name=se1l_rls_shifted}
  829. 140.49 s > [2026-08-28 10:43:10.496] @process::amplitude WARNING : External state 0 ('g', PDG 21, helicity +) is off shell: p^2 = +2.5e5, expected m^2 = +0e0 (|Δ| = +2.5e5). Fixed-helicity spinor/vector/tensor external states may be ill-defined at this kinematic point.
  830. 140.49 s > field value
  831. 140.49 s > span warm_up{integrand.name=se1l}
  832. 140.49 s > [2026-08-28 10:43:10.496] @process::amplitude WARNING : External state 1 ('g', PDG 21, helicity -) is off shell: p^2 = +2.5e5, expected m^2 = +0e0 (|Δ| = +2.5e5). Fixed-helicity spinor/vector/tensor external states may be ill-defined at this kinematic point.
  833. 140.49 s > field value
  834. 140.49 s > span warm_up{integrand.name=se1l}
  835. 140.49 s > [2026-08-28 10:43:10.496] @process::amplitude INFO : Input is above threshold: 1 existing threshold E-surfaces across 1/1 graph groups
  836. 140.49 s > field value
  837. 140.49 s > existing_esurfaces 1
  838. 140.49 s > group_count 1
  839. 140.49 s > groups_above_threshold 1
  840. 140.49 s > integrand se1l
  841. 140.49 s > span warm_up{integrand.name=se1l}
  842. 140.49 s > threshold_status above threshold
  843. 140.49 s > [2026-08-28 10:43:10.496] @process::amplitude INFO : overlap structure of group 0: [1: [0(2,3)]]
  844. 140.49 s > field value
  845. 140.49 s > span warm_up{integrand.name=se1l}
  846. 140.49 s > [2026-08-28 10:43:10.499] @process::amplitude WARNING : External state 0 ('g', PDG 21, helicity +) is off shell: p^2 = +2.5e5, expected m^2 = +0e0 (|Δ| = +2.5e5). Fixed-helicity spinor/vector/tensor external states may be ill-defined at this kinematic point.
  847. 140.49 s > field value
  848. 140.49 s > span warm_up{integrand.name=se1l_rls_shifted}
  849. 140.49 s > [2026-08-28 10:43:10.499] @process::amplitude WARNING : External state 1 ('g', PDG 21, helicity -) is off shell: p^2 = +2.5e5, expected m^2 = +0e0 (|Δ| = +2.5e5). Fixed-helicity spinor/vector/tensor external states may be ill-defined at this kinematic point.
  850. 140.49 s > field value
  851. 140.49 s > span warm_up{integrand.name=se1l_rls_shifted}
  852. 140.49 s > [2026-08-28 10:43:10.500] @process::amplitude INFO : Input is above threshold: 1 existing threshold E-surfaces across 1/1 graph groups
  853. 140.49 s > field value
  854. 140.49 s > existing_esurfaces 1
  855. 140.49 s > group_count 1
  856. 140.49 s > groups_above_threshold 1
  857. 140.49 s > integrand se1l_rls_shifted
  858. 140.49 s > span warm_up{integrand.name=se1l_rls_shifted}
  859. 140.49 s > threshold_status above threshold
  860. 140.49 s > [2026-08-28 10:43:10.500] @process::amplitude INFO : overlap structure of group 0: [1: [0(2,3)]]
  861. 140.49 s > field value
  862. 140.49 s > span warm_up{integrand.name=se1l_rls_shifted}
  863. 140.49 s > [2026-08-28 10:43:10.503] @process::amplitude WARNING : External state 0 ('g', PDG 21, helicity +) is off shell: p^2 = +2.5e5, expected m^2 = +0e0 (|Δ| = +2.5e5). Fixed-helicity spinor/vector/tensor external states may be ill-defined at this kinematic point.
  864. 140.49 s > field value
  865. 140.49 s > span warm_up{integrand.name=se1l}
  866. 140.49 s > [2026-08-28 10:43:10.503] @process::amplitude WARNING : External state 1 ('g', PDG 21, helicity -) is off shell: p^2 = +2.5e5, expected m^2 = +0e0 (|Δ| = +2.5e5). Fixed-helicity spinor/vector/tensor external states may be ill-defined at this kinematic point.
  867. 140.49 s > field value
  868. 140.49 s > span warm_up{integrand.name=se1l}
  869. 140.49 s > [2026-08-28 10:43:10.503] @process::amplitude INFO : Input is above threshold: 1 existing threshold E-surfaces across 1/1 graph groups
  870. 140.49 s > field value
  871. 140.49 s > existing_esurfaces 1
  872. 140.49 s > group_count 1
  873. 140.49 s > groups_above_threshold 1
  874. 140.49 s > integrand se1l
  875. 140.49 s > span warm_up{integrand.name=se1l}
  876. 140.49 s > threshold_status above threshold
  877. 140.49 s > [2026-08-28 10:43:10.503] @process::amplitude INFO : overlap structure of group 0: [1: [0(2,3)]]
  878. 140.49 s > field value
  879. 140.49 s > span warm_up{integrand.name=se1l}
  880. 140.49 s > [2026-08-28 10:43:10.507] @process::amplitude WARNING : External state 0 ('g', PDG 21, helicity +) is off shell: p^2 = +2.5e5, expected m^2 = +0e0 (|Δ| = +2.5e5). Fixed-helicity spinor/vector/tensor external states may be ill-defined at this kinematic point.
  881. 140.49 s > field value
  882. 140.49 s > span warm_up{integrand.name=se1l_rls_shifted}
  883. 140.49 s > [2026-08-28 10:43:10.507] @process::amplitude WARNING : External state 1 ('g', PDG 21, helicity -) is off shell: p^2 = +2.5e5, expected m^2 = +0e0 (|Δ| = +2.5e5). Fixed-helicity spinor/vector/tensor external states may be ill-defined at this kinematic point.
  884. 140.49 s > field value
  885. 140.49 s > span warm_up{integrand.name=se1l_rls_shifted}
  886. 140.49 s > [2026-08-28 10:43:10.507] @process::amplitude INFO : Input is above threshold: 1 existing threshold E-surfaces across 1/1 graph groups
  887. 140.49 s > field value
  888. 140.49 s > existing_esurfaces 1
  889. 140.49 s > group_count 1
  890. 140.49 s > groups_above_threshold 1
  891. 140.49 s > integrand se1l_rls_shifted
  892. 140.49 s > span warm_up{integrand.name=se1l_rls_shifted}
  893. 140.49 s > threshold_status above threshold
  894. 140.49 s > [2026-08-28 10:43:10.507] @process::amplitude INFO : overlap structure of group 0: [1: [0(2,3)]]
  895. 140.49 s > field value
  896. 140.49 s > span warm_up{integrand.name=se1l_rls_shifted}
  897. 140.49 s > [2026-08-28 10:43:10.511] @process::amplitude WARNING : External state 0 ('g', PDG 21, helicity +) is off shell: p^2 = +2.5e5, expected m^2 = +0e0 (|Δ| = +2.5e5). Fixed-helicity spinor/vector/tensor external states may be ill-defined at this kinematic point.
  898. 140.49 s > field value
  899. 140.49 s > span warm_up{integrand.name=se1l}
  900. 140.49 s > [2026-08-28 10:43:10.511] @process::amplitude WARNING : External state 1 ('g', PDG 21, helicity -) is off shell: p^2 = +2.5e5, expected m^2 = +0e0 (|Δ| = +2.5e5). Fixed-helicity spinor/vector/tensor external states may be ill-defined at this kinematic point.
  901. 140.49 s > field value
  902. 140.49 s > span warm_up{integrand.name=se1l}
  903. 140.49 s > [2026-08-28 10:43:10.511] @process::amplitude INFO : Input is above threshold: 1 existing threshold E-surfaces across 1/1 graph groups
  904. 140.49 s > field value
  905. 140.49 s > existing_esurfaces 1
  906. 140.49 s > group_count 1
  907. 140.49 s > groups_above_threshold 1
  908. 140.49 s > integrand se1l
  909. 140.49 s > span warm_up{integrand.name=se1l}
  910. 140.49 s > threshold_status above threshold
  911. 140.49 s > [2026-08-28 10:43:10.511] @process::amplitude INFO : overlap structure of group 0: [1: [0(2,3)]]
  912. 140.49 s > field value
  913. 140.49 s > span warm_up{integrand.name=se1l}
  914. 140.49 s > [2026-08-28 10:43:10.515] @process::amplitude WARNING : External state 0 ('g', PDG 21, helicity +) is off shell: p^2 = +2.5e5, expected m^2 = +0e0 (|Δ| = +2.5e5). Fixed-helicity spinor/vector/tensor external states may be ill-defined at this kinematic point.
  915. 140.49 s > field value
  916. 140.49 s > span warm_up{integrand.name=se1l_mur_shifted}
  917. 140.49 s > [2026-08-28 10:43:10.515] @process::amplitude WARNING : External state 1 ('g', PDG 21, helicity -) is off shell: p^2 = +2.5e5, expected m^2 = +0e0 (|Δ| = +2.5e5). Fixed-helicity spinor/vector/tensor external states may be ill-defined at this kinematic point.
  918. 140.49 s > field value
  919. 140.49 s > span warm_up{integrand.name=se1l_mur_shifted}
  920. 140.49 s > [2026-08-28 10:43:10.515] @process::amplitude INFO : Input is above threshold: 1 existing threshold E-surfaces across 1/1 graph groups
  921. 140.49 s > field value
  922. 140.49 s > existing_esurfaces 1
  923. 140.49 s > group_count 1
  924. 140.49 s > groups_above_threshold 1
  925. 140.49 s > integrand se1l_mur_shifted
  926. 140.49 s > span warm_up{integrand.name=se1l_mur_shifted}
  927. 140.49 s > threshold_status above threshold
  928. 140.49 s > [2026-08-28 10:43:10.515] @process::amplitude INFO : overlap structure of group 0: [1: [0(2,3)]]
  929. 140.49 s > field value
  930. 140.49 s > span warm_up{integrand.name=se1l_mur_shifted}
  931. 140.49 s > [2026-08-28 10:43:10.519] @process::amplitude WARNING : External state 0 ('g', PDG 21, helicity +) is off shell: p^2 = +2.5e5, expected m^2 = +0e0 (|Δ| = +2.5e5). Fixed-helicity spinor/vector/tensor external states may be ill-defined at this kinematic point.
  932. 140.49 s > field value
  933. 140.49 s > span warm_up{integrand.name=se1l}
  934. 140.49 s > [2026-08-28 10:43:10.519] @process::amplitude WARNING : External state 1 ('g', PDG 21, helicity -) is off shell: p^2 = +2.5e5, expected m^2 = +0e0 (|Δ| = +2.5e5). Fixed-helicity spinor/vector/tensor external states may be ill-defined at this kinematic point.
  935. 140.49 s > field value
  936. 140.49 s > span warm_up{integrand.name=se1l}
  937. 140.49 s > [2026-08-28 10:43:10.519] @process::amplitude INFO : Input is above threshold: 1 existing threshold E-surfaces across 1/1 graph groups
  938. 140.49 s > field value
  939. 140.49 s > existing_esurfaces 1
  940. 140.49 s > group_count 1
  941. 140.49 s > groups_above_threshold 1
  942. 140.49 s > integrand se1l
  943. 140.49 s > span warm_up{integrand.name=se1l}
  944. 140.49 s > threshold_status above threshold
  945. 140.49 s > [2026-08-28 10:43:10.519] @process::amplitude INFO : overlap structure of group 0: [1: [0(2,3)]]
  946. 140.49 s > field value
  947. 140.49 s > span warm_up{integrand.name=se1l}
  948. 140.49 s > [2026-08-28 10:43:10.522] @process::amplitude WARNING : External state 0 ('g', PDG 21, helicity +) is off shell: p^2 = +2.5e5, expected m^2 = +0e0 (|Δ| = +2.5e5). Fixed-helicity spinor/vector/tensor external states may be ill-defined at this kinematic point.
  949. 140.49 s > field value
  950. 140.49 s > span warm_up{integrand.name=se1l_mur_shifted}
  951. 140.49 s > [2026-08-28 10:43:10.522] @process::amplitude WARNING : External state 1 ('g', PDG 21, helicity -) is off shell: p^2 = +2.5e5, expected m^2 = +0e0 (|Δ| = +2.5e5). Fixed-helicity spinor/vector/tensor external states may be ill-defined at this kinematic point.
  952. 140.49 s > field value
  953. 140.49 s > span warm_up{integrand.name=se1l_mur_shifted}
  954. 140.49 s > [2026-08-28 10:43:10.523] @process::amplitude INFO : Input is above threshold: 1 existing threshold E-surfaces across 1/1 graph groups
  955. 140.49 s > field value
  956. 140.49 s > existing_esurfaces 1
  957. 140.49 s > group_count 1
  958. 140.49 s > groups_above_threshold 1
  959. 140.49 s > integrand se1l_mur_shifted
  960. 140.49 s > span warm_up{integrand.name=se1l_mur_shifted}
  961. 140.49 s > threshold_status above threshold
  962. 140.49 s > [2026-08-28 10:43:10.523] @process::amplitude INFO : overlap structure of group 0: [1: [0(2,3)]]
  963. 140.49 s > field value
  964. 140.49 s > span warm_up{integrand.name=se1l_mur_shifted}
  965. 140.49 s > [2026-08-28 10:43:10.526] @process::amplitude WARNING : External state 0 ('g', PDG 21, helicity +) is off shell: p^2 = +2.5e5, expected m^2 = +0e0 (|Δ| = +2.5e5). Fixed-helicity spinor/vector/tensor external states may be ill-defined at this kinematic point.
  966. 140.49 s > field value
  967. 140.49 s > span warm_up{integrand.name=se1l}
  968. 140.49 s > [2026-08-28 10:43:10.526] @process::amplitude WARNING : External state 1 ('g', PDG 21, helicity -) is off shell: p^2 = +2.5e5, expected m^2 = +0e0 (|Δ| = +2.5e5). Fixed-helicity spinor/vector/tensor external states may be ill-defined at this kinematic point.
  969. 140.49 s > field value
  970. 140.49 s > span warm_up{integrand.name=se1l}
  971. 140.49 s > [2026-08-28 10:43:10.526] @process::amplitude INFO : Input is above threshold: 1 existing threshold E-surfaces across 1/1 graph groups
  972. 140.49 s > field value
  973. 140.49 s > existing_esurfaces 1
  974. 140.49 s > group_count 1
  975. 140.49 s > groups_above_threshold 1
  976. 140.49 s > integrand se1l
  977. 140.49 s > span warm_up{integrand.name=se1l}
  978. 140.49 s > threshold_status above threshold
  979. 140.49 s > [2026-08-28 10:43:10.526] @process::amplitude INFO : overlap structure of group 0: [1: [0(2,3)]]
  980. 140.49 s > field value
  981. 140.49 s > span warm_up{integrand.name=se1l}
  982. 140.49 s > [2026-08-28 10:43:10.530] @process::amplitude WARNING : External state 0 ('g', PDG 21, helicity +) is off shell: p^2 = +2.5e5, expected m^2 = +0e0 (|Δ| = +2.5e5). Fixed-helicity spinor/vector/tensor external states may be ill-defined at this kinematic point.
  983. 140.49 s > field value
  984. 140.49 s > span warm_up{integrand.name=se1l_mur_shifted}
  985. 140.49 s > [2026-08-28 10:43:10.530] @process::amplitude WARNING : External state 1 ('g', PDG 21, helicity -) is off shell: p^2 = +2.5e5, expected m^2 = +0e0 (|Δ| = +2.5e5). Fixed-helicity spinor/vector/tensor external states may be ill-defined at this kinematic point.
  986. 140.49 s > field value
  987. 140.49 s > span warm_up{integrand.name=se1l_mur_shifted}
  988. 140.49 s > [2026-08-28 10:43:10.530] @process::amplitude INFO : Input is above threshold: 1 existing threshold E-surfaces across 1/1 graph groups
  989. 140.49 s > field value
  990. 140.49 s > existing_esurfaces 1
  991. 140.49 s > group_count 1
  992. 140.49 s > groups_above_threshold 1
  993. 140.49 s > integrand se1l_mur_shifted
  994. 140.49 s > span warm_up{integrand.name=se1l_mur_shifted}
  995. 140.49 s > threshold_status above threshold
  996. 140.49 s > [2026-08-28 10:43:10.530] @process::amplitude INFO : overlap structure of group 0: [1: [0(2,3)]]
  997. 140.49 s > field value
  998. 140.49 s > span warm_up{integrand.name=se1l_mur_shifted}
  999. 140.49 s > [2026-08-28 10:43:10.534] @process::amplitude WARNING : External state 0 ('g', PDG 21, helicity +) is off shell: p^2 = +2.5e5, expected m^2 = +0e0 (|Δ| = +2.5e5). Fixed-helicity spinor/vector/tensor external states may be ill-defined at this kinematic point.
  1000. 140.49 s > field value
  1001. 140.49 s > span warm_up{integrand.name=se1l}
  1002. 140.49 s > [2026-08-28 10:43:10.534] @process::amplitude WARNING : External state 1 ('g', PDG 21, helicity -) is off shell: p^2 = +2.5e5, expected m^2 = +0e0 (|Δ| = +2.5e5). Fixed-helicity spinor/vector/tensor external states may be ill-defined at this kinematic point.
  1003. 140.49 s > field value
  1004. 140.49 s > span warm_up{integrand.name=se1l}
  1005. 140.49 s > [2026-08-28 10:43:10.534] @process::amplitude INFO : Input is above threshold: 1 existing threshold E-surfaces across 1/1 graph groups
  1006. 140.49 s > field value
  1007. 140.49 s > existing_esurfaces 1
  1008. 140.49 s > group_count 1
  1009. 140.49 s > groups_above_threshold 1
  1010. 140.49 s > integrand se1l
  1011. 140.49 s > span warm_up{integrand.name=se1l}
  1012. 140.49 s > threshold_status above threshold
  1013. 140.49 s > [2026-08-28 10:43:10.534] @process::amplitude INFO : overlap structure of group 0: [1: [0(2,3)]]
  1014. 140.49 s > field value
  1015. 140.49 s > span warm_up{integrand.name=se1l}
  1016. 140.49 s > [2026-08-28 10:43:10.537] @process::amplitude WARNING : External state 0 ('g', PDG 21, helicity +) is off shell: p^2 = +2.5e5, expected m^2 = +0e0 (|Δ| = +2.5e5). Fixed-helicity spinor/vector/tensor external states may be ill-defined at this kinematic point.
  1017. 140.49 s > field value
  1018. 140.49 s > span warm_up{integrand.name=se1l_mur_shifted}
  1019. 140.49 s > [2026-08-28 10:43:10.537] @process::amplitude WARNING : External state 1 ('g', PDG 21, helicity -) is off shell: p^2 = +2.5e5, expected m^2 = +0e0 (|Δ| = +2.5e5). Fixed-helicity spinor/vector/tensor external states may be ill-defined at this kinematic point.
  1020. 140.49 s > field value
  1021. 140.49 s > span warm_up{integrand.name=se1l_mur_shifted}
  1022. 140.49 s > [2026-08-28 10:43:10.538] @process::amplitude INFO : Input is above threshold: 1 existing threshold E-surfaces across 1/1 graph groups
  1023. 140.49 s > field value
  1024. 140.49 s > existing_esurfaces 1
  1025. 140.49 s > group_count 1
  1026. 140.49 s > groups_above_threshold 1
  1027. 140.49 s > integrand se1l_mur_shifted
  1028. 140.49 s > span warm_up{integrand.name=se1l_mur_shifted}
  1029. 140.49 s > threshold_status above threshold
  1030. 140.49 s > [2026-08-28 10:43:10.538] @process::amplitude INFO : overlap structure of group 0: [1: [0(2,3)]]
  1031. 140.49 s > field value
  1032. 140.49 s > span warm_up{integrand.name=se1l_mur_shifted}
  1033. 140.49 s > [2026-08-28 10:43:10.541] @process::amplitude WARNING : External state 0 ('g', PDG 21, helicity +) is off shell: p^2 = +2.5e5, expected m^2 = +0e0 (|Δ| = +2.5e5). Fixed-helicity spinor/vector/tensor external states may be ill-defined at this kinematic point.
  1034. 140.49 s > field value
  1035. 140.49 s > span warm_up{integrand.name=se1l}
  1036. 140.49 s > [2026-08-28 10:43:10.541] @process::amplitude WARNING : External state 1 ('g', PDG 21, helicity -) is off shell: p^2 = +2.5e5, expected m^2 = +0e0 (|Δ| = +2.5e5). Fixed-helicity spinor/vector/tensor external states may be ill-defined at this kinematic point.
  1037. 140.49 s > field value
  1038. 140.49 s > span warm_up{integrand.name=se1l}
  1039. 140.49 s > [2026-08-28 10:43:10.541] @process::amplitude INFO : Input is above threshold: 1 existing threshold E-surfaces across 1/1 graph groups
  1040. 140.49 s > field value
  1041. 140.49 s > existing_esurfaces 1
  1042. 140.49 s > group_count 1
  1043. 140.49 s > groups_above_threshold 1
  1044. 140.49 s > integrand se1l
  1045. 140.49 s > span warm_up{integrand.name=se1l}
  1046. 140.49 s > threshold_status above threshold
  1047. 140.49 s > [2026-08-28 10:43:10.541] @process::amplitude INFO : overlap structure of group 0: [1: [0(2,3)]]
  1048. 140.49 s > field value
  1049. 140.49 s > span warm_up{integrand.name=se1l}
  1050. 140.49 s > [2026-08-28 10:43:10.545] @process::amplitude WARNING : External state 0 ('g', PDG 21, helicity +) is off shell: p^2 = +2.5e5, expected m^2 = +0e0 (|Δ| = +2.5e5). Fixed-helicity spinor/vector/tensor external states may be ill-defined at this kinematic point.
  1051. 140.49 s > field value
  1052. 140.49 s > span warm_up{integrand.name=se1l_mur_shifted}
  1053. 140.49 s > [2026-08-28 10:43:10.545] @process::amplitude WARNING : External state 1 ('g', PDG 21, helicity -) is off shell: p^2 = +2.5e5, expected m^2 = +0e0 (|Δ| = +2.5e5). Fixed-helicity spinor/vector/tensor external states may be ill-defined at this kinematic point.
  1054. 140.49 s > field value
  1055. 140.49 s > span warm_up{integrand.name=se1l_mur_shifted}
  1056. 140.49 s > [2026-08-28 10:43:10.545] @process::amplitude INFO : Input is above threshold: 1 existing threshold E-surfaces across 1/1 graph groups
  1057. 140.49 s > field value
  1058. 140.49 s > existing_esurfaces 1
  1059. 140.49 s > group_count 1
  1060. 140.49 s > groups_above_threshold 1
  1061. 140.49 s > integrand se1l_mur_shifted
  1062. 140.49 s > span warm_up{integrand.name=se1l_mur_shifted}
  1063. 140.49 s > threshold_status above threshold
  1064. 140.49 s > [2026-08-28 10:43:10.545] @process::amplitude INFO : overlap structure of group 0: [1: [0(2,3)]]
  1065. 140.49 s > field value
  1066. 140.49 s > span warm_up{integrand.name=se1l_mur_shifted}
  1067. 140.49 s > [2026-08-28 10:43:10.548] @process::amplitude WARNING : External state 0 ('g', PDG 21, helicity +) is off shell: p^2 = +2.5e5, expected m^2 = +0e0 (|Δ| = +2.5e5). Fixed-helicity spinor/vector/tensor external states may be ill-defined at this kinematic point.
  1068. 140.49 s > field value
  1069. 140.49 s > span warm_up{integrand.name=se1l}
  1070. 140.49 s > [2026-08-28 10:43:10.548] @process::amplitude WARNING : External state 1 ('g', PDG 21, helicity -) is off shell: p^2 = +2.5e5, expected m^2 = +0e0 (|Δ| = +2.5e5). Fixed-helicity spinor/vector/tensor external states may be ill-defined at this kinematic point.
  1071. 140.49 s > field value
  1072. 140.49 s > span warm_up{integrand.name=se1l}
  1073. 140.49 s > [2026-08-28 10:43:10.549] @process::amplitude INFO : Input is above threshold: 1 existing threshold E-surfaces across 1/1 graph groups
  1074. 140.49 s > field value
  1075. 140.49 s > existing_esurfaces 1
  1076. 140.49 s > group_count 1
  1077. 140.49 s > groups_above_threshold 1
  1078. 140.49 s > integrand se1l
  1079. 140.49 s > span warm_up{integrand.name=se1l}
  1080. 140.49 s > threshold_status above threshold
  1081. 140.49 s > [2026-08-28 10:43:10.549] @process::amplitude INFO : overlap structure of group 0: [1: [0(2,3)]]
  1082. 140.49 s > field value
  1083. 140.49 s > span warm_up{integrand.name=se1l}
  1084. 140.49 s > [2026-08-28 10:43:10.552] @process::amplitude WARNING : External state 0 ('g', PDG 21, helicity +) is off shell: p^2 = +2.5e5, expected m^2 = +0e0 (|Δ| = +2.5e5). Fixed-helicity spinor/vector/tensor external states may be ill-defined at this kinematic point.
  1085. 140.49 s > field value
  1086. 140.49 s > span warm_up{integrand.name=se1l_mur_shifted}
  1087. 140.49 s > [2026-08-28 10:43:10.552] @process::amplitude WARNING : External state 1 ('g', PDG 21, helicity -) is off shell: p^2 = +2.5e5, expected m^2 = +0e0 (|Δ| = +2.5e5). Fixed-helicity spinor/vector/tensor external states may be ill-defined at this kinematic point.
  1088. 140.49 s > field value
  1089. 140.49 s > span warm_up{integrand.name=se1l_mur_shifted}
  1090. 140.49 s > [2026-08-28 10:43:10.552] @process::amplitude INFO : Input is above threshold: 1 existing threshold E-surfaces across 1/1 graph groups
  1091. 140.49 s > field value
  1092. 140.49 s > existing_esurfaces 1
  1093. 140.49 s > group_count 1
  1094. 140.49 s > groups_above_threshold 1
  1095. 140.49 s > integrand se1l_mur_shifted
  1096. 140.49 s > span warm_up{integrand.name=se1l_mur_shifted}
  1097. 140.49 s > threshold_status above threshold
  1098. 140.49 s > [2026-08-28 10:43:10.552] @process::amplitude INFO : overlap structure of group 0: [1: [0(2,3)]]
  1099. 140.49 s > field value
  1100. 140.49 s > span warm_up{integrand.name=se1l_mur_shifted}
  1101. 140.49 s > [2026-08-28 10:43:10.556] @process::amplitude WARNING : External state 0 ('g', PDG 21, helicity +) is off shell: p^2 = +2.5e5, expected m^2 = +0e0 (|Δ| = +2.5e5). Fixed-helicity spinor/vector/tensor external states may be ill-defined at this kinematic point.
  1102. 140.49 s > field value
  1103. 140.49 s > span warm_up{integrand.name=se1l}
  1104. 140.49 s > [2026-08-28 10:43:10.556] @process::amplitude WARNING : External state 1 ('g', PDG 21, helicity -) is off shell: p^2 = +2.5e5, expected m^2 = +0e0 (|Δ| = +2.5e5). Fixed-helicity spinor/vector/tensor external states may be ill-defined at this kinematic point.
  1105. 140.49 s > field value
  1106. 140.49 s > span warm_up{integrand.name=se1l}
  1107. 140.49 s > [2026-08-28 10:43:10.556] @process::amplitude INFO : Input is above threshold: 1 existing threshold E-surfaces across 1/1 graph groups
  1108. 140.49 s > field value
  1109. 140.49 s > existing_esurfaces 1
  1110. 140.49 s > group_count 1
  1111. 140.49 s > groups_above_threshold 1
  1112. 140.49 s > integrand se1l
  1113. 140.49 s > span warm_up{integrand.name=se1l}
  1114. 140.49 s > threshold_status above threshold
  1115. 140.49 s > [2026-08-28 10:43:10.556] @process::amplitude INFO : overlap structure of group 0: [1: [0(2,3)]]
  1116. 140.49 s > field value
  1117. 140.49 s > span warm_up{integrand.name=se1l}
  1118. 140.49 s > [2026-08-28 10:43:10.559] @process::amplitude WARNING : External state 0 ('g', PDG 21, helicity +) is off shell: p^2 = +2.5e5, expected m^2 = +0e0 (|Δ| = +2.5e5). Fixed-helicity spinor/vector/tensor external states may be ill-defined at this kinematic point.
  1119. 140.49 s > field value
  1120. 140.49 s > span warm_up{integrand.name=se1l_mur_shifted}
  1121. 140.49 s > [2026-08-28 10:43:10.559] @process::amplitude WARNING : External state 1 ('g', PDG 21, helicity -) is off shell: p^2 = +2.5e5, expected m^2 = +0e0 (|Δ| = +2.5e5). Fixed-helicity spinor/vector/tensor external states may be ill-defined at this kinematic point.
  1122. 140.49 s > field value
  1123. 140.49 s > span warm_up{integrand.name=se1l_mur_shifted}
  1124. 140.49 s > [2026-08-28 10:43:10.560] @process::amplitude INFO : Input is above threshold: 1 existing threshold E-surfaces across 1/1 graph groups
  1125. 140.49 s > field value
  1126. 140.49 s > existing_esurfaces 1
  1127. 140.49 s > group_count 1
  1128. 140.49 s > groups_above_threshold 1
  1129. 140.49 s > integrand se1l_mur_shifted
  1130. 140.49 s > span warm_up{integrand.name=se1l_mur_shifted}
  1131. 140.49 s > threshold_status above threshold
  1132. 140.49 s > [2026-08-28 10:43:10.560] @process::amplitude INFO : overlap structure of group 0: [1: [0(2,3)]]
  1133. 140.49 s > field value
  1134. 140.49 s > span warm_up{integrand.name=se1l_mur_shifted}
  1135. 140.49 s > [2026-08-28 10:43:10.563] @process::amplitude WARNING : External state 0 ('g', PDG 21, helicity +) is off shell: p^2 = +2.5e5, expected m^2 = +0e0 (|Δ| = +2.5e5). Fixed-helicity spinor/vector/tensor external states may be ill-defined at this kinematic point.
  1136. 140.49 s > field value
  1137. 140.49 s > span warm_up{integrand.name=se1l}
  1138. 140.49 s > [2026-08-28 10:43:10.563] @process::amplitude WARNING : External state 1 ('g', PDG 21, helicity -) is off shell: p^2 = +2.5e5, expected m^2 = +0e0 (|Δ| = +2.5e5). Fixed-helicity spinor/vector/tensor external states may be ill-defined at this kinematic point.
  1139. 140.49 s > field value
  1140. 140.49 s > span warm_up{integrand.name=se1l}
  1141. 140.49 s > [2026-08-28 10:43:10.563] @process::amplitude INFO : Input is above threshold: 1 existing threshold E-surfaces across 1/1 graph groups
  1142. 140.49 s > field value
  1143. 140.49 s > existing_esurfaces 1
  1144. 140.49 s > group_count 1
  1145. 140.49 s > groups_above_threshold 1
  1146. 140.49 s > integrand se1l
  1147. 140.49 s > span warm_up{integrand.name=se1l}
  1148. 140.49 s > threshold_status above threshold
  1149. 140.49 s > [2026-08-28 10:43:10.563] @process::amplitude INFO : overlap structure of group 0: [1: [0(2,3)]]
  1150. 140.49 s > field value
  1151. 140.49 s > span warm_up{integrand.name=se1l}
  1152. 140.49 s > [2026-08-28 10:43:10.567] @process::amplitude WARNING : External state 0 ('g', PDG 21, helicity +) is off shell: p^2 = +2.5e5, expected m^2 = +0e0 (|Δ| = +2.5e5). Fixed-helicity spinor/vector/tensor external states may be ill-defined at this kinematic point.
  1153. 140.49 s > field value
  1154. 140.49 s > span warm_up{integrand.name=se1l_mur_shifted}
  1155. 140.49 s > [2026-08-28 10:43:10.567] @process::amplitude WARNING : External state 1 ('g', PDG 21, helicity -) is off shell: p^2 = +2.5e5, expected m^2 = +0e0 (|Δ| = +2.5e5). Fixed-helicity spinor/vector/tensor external states may be ill-defined at this kinematic point.
  1156. 140.49 s > field value
  1157. 140.49 s > span warm_up{integrand.name=se1l_mur_shifted}
  1158. 140.49 s > [2026-08-28 10:43:10.567] @process::amplitude INFO : Input is above threshold: 1 existing threshold E-surfaces across 1/1 graph groups
  1159. 140.49 s > field value
  1160. 140.49 s > existing_esurfaces 1
  1161. 140.49 s > group_count 1
  1162. 140.49 s > groups_above_threshold 1
  1163. 140.49 s > integrand se1l_mur_shifted
  1164. 140.49 s > span warm_up{integrand.name=se1l_mur_shifted}
  1165. 140.49 s > threshold_status above threshold
  1166. 140.49 s > [2026-08-28 10:43:10.567] @process::amplitude INFO : overlap structure of group 0: [1: [0(2,3)]]
  1167. 140.49 s > field value
  1168. 140.49 s > span warm_up{integrand.name=se1l_mur_shifted}
  1169. 140.49 s > [2026-08-28 10:43:10.571] @process::amplitude WARNING : External state 0 ('g', PDG 21, helicity +) is off shell: p^2 = +2.5e5, expected m^2 = +0e0 (|Δ| = +2.5e5). Fixed-helicity spinor/vector/tensor external states may be ill-defined at this kinematic point.
  1170. 140.49 s > field value
  1171. 140.49 s > span warm_up{integrand.name=se1l}
  1172. 140.49 s > [2026-08-28 10:43:10.571] @process::amplitude WARNING : External state 1 ('g', PDG 21, helicity -) is off shell: p^2 = +2.5e5, expected m^2 = +0e0 (|Δ| = +2.5e5). Fixed-helicity spinor/vector/tensor external states may be ill-defined at this kinematic point.
  1173. 140.49 s > field value
  1174. 140.49 s > span warm_up{integrand.name=se1l}
  1175. 140.49 s > [2026-08-28 10:43:10.571] @process::amplitude INFO : Input is above threshold: 1 existing threshold E-surfaces across 1/1 graph groups
  1176. 140.49 s > field value
  1177. 140.49 s > existing_esurfaces 1
  1178. 140.49 s > group_count 1
  1179. 140.49 s > groups_above_threshold 1
  1180. 140.49 s > integrand se1l
  1181. 140.49 s > span warm_up{integrand.name=se1l}
  1182. 140.49 s > threshold_status above threshold
  1183. 140.49 s > [2026-08-28 10:43:10.571] @process::amplitude INFO : overlap structure of group 0: [1: [0(2,3)]]
  1184. 140.49 s > field value
  1185. 140.49 s > span warm_up{integrand.name=se1l}
  1186. 140.49 s > [2026-08-28 10:43:10.574] @process::amplitude WARNING : External state 0 ('g', PDG 21, helicity +) is off shell: p^2 = +2.5e5, expected m^2 = +0e0 (|Δ| = +2.5e5). Fixed-helicity spinor/vector/tensor external states may be ill-defined at this kinematic point.
  1187. 140.49 s > field value
  1188. 140.49 s > span warm_up{integrand.name=se1l_mur_shifted}
  1189. 140.49 s > [2026-08-28 10:43:10.574] @process::amplitude WARNING : External state 1 ('g', PDG 21, helicity -) is off shell: p^2 = +2.5e5, expected m^2 = +0e0 (|Δ| = +2.5e5). Fixed-helicity spinor/vector/tensor external states may be ill-defined at this kinematic point.
  1190. 140.49 s > field value
  1191. 140.49 s > span warm_up{integrand.name=se1l_mur_shifted}
  1192. 140.49 s > [2026-08-28 10:43:10.575] @process::amplitude INFO : Input is above threshold: 1 existing threshold E-surfaces across 1/1 graph groups
  1193. 140.49 s > field value
  1194. 140.49 s > existing_esurfaces 1
  1195. 140.49 s > group_count 1
  1196. 140.49 s > groups_above_threshold 1
  1197. 140.49 s > integrand se1l_mur_shifted
  1198. 140.49 s > span warm_up{integrand.name=se1l_mur_shifted}
  1199. 140.49 s > threshold_status above threshold
  1200. 140.49 s > [2026-08-28 10:43:10.575] @process::amplitude INFO : overlap structure of group 0: [1: [0(2,3)]]
  1201. 140.49 s > field value
  1202. 140.49 s > span warm_up{integrand.name=se1l_mur_shifted}
  1203. 140.49 s > [2026-08-28 10:43:10.578] @process::amplitude WARNING : External state 0 ('g', PDG 21, helicity +) is off shell: p^2 = +2.5e5, expected m^2 = +0e0 (|Δ| = +2.5e5). Fixed-helicity spinor/vector/tensor external states may be ill-defined at this kinematic point.
  1204. 140.49 s > field value
  1205. 140.49 s > span warm_up{integrand.name=se1l}
  1206. 140.49 s > [2026-08-28 10:43:10.578] @process::amplitude WARNING : External state 1 ('g', PDG 21, helicity -) is off shell: p^2 = +2.5e5, expected m^2 = +0e0 (|Δ| = +2.5e5). Fixed-helicity spinor/vector/tensor external states may be ill-defined at this kinematic point.
  1207. 140.49 s > field value
  1208. 140.49 s > span warm_up{integrand.name=se1l}
  1209. 140.49 s > [2026-08-28 10:43:10.578] @process::amplitude INFO : Input is above threshold: 1 existing threshold E-surfaces across 1/1 graph groups
  1210. 140.49 s > field value
  1211. 140.49 s > existing_esurfaces 1
  1212. 140.49 s > group_count 1
  1213. 140.49 s > groups_above_threshold 1
  1214. 140.49 s > integrand se1l
  1215. 140.49 s > span warm_up{integrand.name=se1l}
  1216. 140.49 s > threshold_status above threshold
  1217. 140.49 s > [2026-08-28 10:43:10.578] @process::amplitude INFO : overlap structure of group 0: [1: [0(2,3)]]
  1218. 140.49 s > field value
  1219. 140.49 s > span warm_up{integrand.name=se1l}
  1220. 140.49 s > [2026-08-28 10:43:10.582] @process::amplitude WARNING : External state 0 ('g', PDG 21, helicity +) is off shell: p^2 = +2.5e5, expected m^2 = +0e0 (|Δ| = +2.5e5). Fixed-helicity spinor/vector/tensor external states may be ill-defined at this kinematic point.
  1221. 140.49 s > field value
  1222. 140.49 s > span warm_up{integrand.name=se1l_mur_shifted}
  1223. 140.49 s > [2026-08-28 10:43:10.582] @process::amplitude WARNING : External state 1 ('g', PDG 21, helicity -) is off shell: p^2 = +2.5e5, expected m^2 = +0e0 (|Δ| = +2.5e5). Fixed-helicity spinor/vector/tensor external states may be ill-defined at this kinematic point.
  1224. 140.49 s > field value
  1225. 140.49 s > span warm_up{integrand.name=se1l_mur_shifted}
  1226. 140.49 s > [2026-08-28 10:43:10.582] @process::amplitude INFO : Input is above threshold: 1 existing threshold E-surfaces across 1/1 graph groups
  1227. 140.49 s > field value
  1228. 140.49 s > existing_esurfaces 1
  1229. 140.49 s > group_count 1
  1230. 140.49 s > groups_above_threshold 1
  1231. 140.49 s > integrand se1l_mur_shifted
  1232. 140.49 s > span warm_up{integrand.name=se1l_mur_shifted}
  1233. 140.49 s > threshold_status above threshold
  1234. 140.49 s > [2026-08-28 10:43:10.582] @process::amplitude INFO : overlap structure of group 0: [1: [0(2,3)]]
  1235. 140.49 s > field value
  1236. 140.49 s > span warm_up{integrand.name=se1l_mur_shifted}
  1237. 140.49 s > The application panicked (crashed).
  1238. 140.49 s > Message: Integrated UV case failed: se1l
  1239. 140.49 s > Location: tests/tests/uv.rs:1068
  1240. 140.49 s >
  1241. 140.49 s > ━━━━━━━━━━━━━━━━━━━━━━━━━━━━━━━━━━ BACKTRACE ━━━━━━━━━━━━━━━━━━━━━━━━━━━━━━━━━━━
  1242. 140.49 s > 1: <color_eyre[51793ea62743adbd]::config::PanicHook>::panic_report<unknown>
  1243. 140.49 s > at <unknown source file>:<unknown line>
  1244. 140.49 s > 2: <color_eyre[51793ea62743adbd]::config::PanicHook>::into_panic_hook::{closure#0}<unknown>
  1245. 140.49 s > at <unknown source file>:<unknown line>
  1246. 140.49 s > 3: std[bcb96dfbba0ab899]::panicking::panic_with_hook<unknown>
  1247. 140.49 s > at <unknown source file>:<unknown line>
  1248. 140.49 s > 4: std[bcb96dfbba0ab899]::panicking::panic_handler::{closure#0}<unknown>
  1249. 140.49 s > at <unknown source file>:<unknown line>
  1250. 140.49 s > 5: std[bcb96dfbba0ab899]::sys::backtrace::__rust_end_short_backtrace::<std[bcb96dfbba0ab899]::panicking::panic_handler::{closure#0}, !><unknown>
  1251. 140.49 s > at <unknown source file>:<unknown line>
  1252. 140.49 s > 6: __rustc[6c289b9f9c454d21]::rust_begin_unwind<unknown>
  1253. 140.49 s > at <unknown source file>:<unknown line>
  1254. 140.49 s > 7: core[940e698046960fd5]::panicking::panic_fmt<unknown>
  1255. 140.49 s > at <unknown source file>:<unknown line>
  1256. 140.49 s > 8: uv[52cf2b63f0104e31]::run_single_integrated_uv_case<unknown>
  1257. 140.49 s > at <unknown source file>:<unknown line>
  1258. 140.49 s > 9: <uv[52cf2b63f0104e31]::se1l_uv::{closure#0} as core[940e698046960fd5]::ops::function::FnOnce<()>>::call_once<unknown>
  1259. 140.49 s > at <unknown source file>:<unknown line>
  1260. 140.49 s > 10: test[75d6903177b1d7e9]::__rust_begin_short_backtrace::<core[940e698046960fd5]::result::Result<(), alloc[2ea6bcb46fca0c42]::string::String>, fn() -> core[940e698046960fd5]::result::Result<(), alloc[2ea6bcb46fca0c42]::string::String>><unknown>
  1261. 140.49 s > at <unknown source file>:<unknown line>
  1262. 140.49 s > 11: test[75d6903177b1d7e9]::run_test::{closure#0}<unknown>
  1263. 140.49 s > at <unknown source file>:<unknown line>
  1264. 140.49 s > 12: std[bcb96dfbba0ab899]::sys::backtrace::__rust_begin_short_backtrace::<test[75d6903177b1d7e9]::run_test::{closure#1}, ()><unknown>
  1265. 140.49 s > at <unknown source file>:<unknown line>
  1266. 140.49 s > 13: <std[bcb96dfbba0ab899]::thread::lifecycle::spawn_unchecked<test[75d6903177b1d7e9]::run_test::{closure#1}, ()>::{closure#1} as core[940e698046960fd5]::ops::function::FnOnce<()>>::call_once::{shim:vtable#0}<unknown>
  1267. 140.49 s > at <unknown source file>:<unknown line>
  1268. 140.49 s > 14: <std[bcb96dfbba0ab899]::sys::thread::unix::Thread>::new::thread_start<unknown>
  1269. 140.49 s > at <unknown source file>:<unknown line>
  1270. 140.49 s > 15: start_thread<unknown>
  1271. 140.49 s > at <unknown source file>:<unknown line>
  1272. 140.49 s > 16: __clone3<unknown>
  1273. 140.49 s > at <unknown source file>:<unknown line>
  1274. 140.49 s >
  1275. 140.49 s > Run with COLORBT_SHOW_HIDDEN=1 environment variable to disable frame filtering.
  1276. 140.49 s > Run with RUST_BACKTRACE=full to include source snippets.
  1277. 140.49 s >
  1278. 140.49 s > error: test run failed
  1279. 140.49 s >
  1280. 140.49 s > ========== nextest test summary ==========
  1281. 140.49 s > report: target/nextest/ci_gammaloop/junit.xml
  1282. 140.49 s > tests: 106, failures: 9, errors: 0
  1283. 140.49 s >
  1284. 140.49 s > 1. gammaloop-integration-tests::test_runs::approach::approach_momentum_space_reports_incomplete_triplet_cleanly
  1285. 140.49 s > failure: test failure with exit code 101
  1286. 140.49 s > system-out
  1287. 140.49 s > running 1 test
  1288. 140.49 s > test approach::approach_momentum_space_reports_incomplete_triplet_cleanly ... FAILED
  1289. 140.49 s >
  1290. 140.49 s > failures:
  1291. 140.49 s >
  1292. 140.49 s > failures:
  1293. 140.49 s > approach::approach_momentum_space_reports_incomplete_triplet_cleanly
  1294. 140.49 s >
  1295. 140.49 s > test result: FAILED. 0 passed; 1 failed; 0 ignored; 0 measured; 82 filtered out; finished in 0.73s
  1296. 140.49 s > system-err
  1297. 140.49 s > [2026-08-28 10:41:14.923] @gammaloop_api::se... INFO : Running command import model scalars-default.json
  1298. 140.49 s > [2026-08-28 10:41:14.924] @import::model INFO : Loading built-in JSON model scalars-default
  1299. 140.49 s > [2026-08-28 10:41:14.927] @gammalooprs::model INFO : The following 2 external parameters were forced to zero by the restriction card:
  1300. 140.49 s > width_scalar_1, width_scalar_2
  1301. 140.49 s > [2026-08-28 10:41:14.928] @gammaloop_api::se... INFO : Running command remove processes
  1302. 140.49 s > [2026-08-28 10:41:14.929] @gammaloop_api::se... INFO : Running command generate amp scalar_1 > scalar_0 scalar_0 [{1}] --allowed-vertex-interactions V_3_SCALAR_022 V_3_SCALAR_122 -p triangle -i scalar_tri
  1303. 140.49 s > [2026-08-28 10:41:14.930] @feyngen::diagram_... INFO : 0s | Δ=0s | Starting Feynman graph generation with Symbolica...
  1304. 140.49 s > [2026-08-28 10:41:14.930] @feyngen::diagram_... INFO : 0s | Δ=0s | Number of graphs resulting from Symbolica generation: 1
  1305. 140.49 s > [2026-08-28 10:41:14.930] @feyngen::diagram_... INFO : 0s | Δ=0s | Number of graphs retained after removal of vetoed topologies: 1
  1306. 140.49 s > [2026-08-28 10:41:14.930] @feyngen::diagram_... INFO : 0s | Δ=0s | Number of graphs after vertex info assignment: 1
  1307. 140.49 s > [2026-08-28 10:41:14.930] @feyngen::diagram_... INFO : 0s | Δ=0s | Number of graphs after all complete graphs filters are applied: 1
  1308. 140.49 s > [2026-08-28 10:41:14.931] @feyngen::diagram_... INFO : 0s | Δ=0s | Number of graphs after closed fermion chains analysis: 1
  1309. 140.49 s > [2026-08-28 10:41:14.931] @feyngen::diagram_... INFO : 0s | Δ=0s | Number of graphs after symmetrization of external states: 1
  1310. 140.49 s > [2026-08-28 10:41:14.931] @feyngen::diagram_... INFO : 0s | Δ=0s | Number of graphs after canonization of vertices, edges and flows (graph labels assigned here): 1
  1311. 140.49 s > [2026-08-28 10:41:14.937] @feyngen::diagram_... INFO : 0s | Δ=0s | Number of graphs after numerator-aware grouping with strategy 'up to a scalar rescaling': 1 (1 isomorphically unique graph, 0 color zero, 0 lorentz zero, 0 grouped and 0 cancellation)
  1312. 140.49 s > [2026-08-28 10:41:14.937] @feyngen::diagram_... INFO : ( Sum of the symmetry factors from each graph generated = 1 )
  1313. 140.49 s > [2026-08-28 10:41:14.937] @commands::generate INFO : Generated amplitude 1 graphs.
  1314. 140.49 s > [2026-08-28 10:41:14.969] @settings::runtime WARNING : No external kinematics were provided; using default-generated external momenta and helicities.
  1315. 140.49 s > [2026-08-28 10:41:15.047] @commands::generate INFO :
  1316. 140.49 s > Integrand generation summary
  1317. 140.49 s > peak RAM 65.80 MiB | cores 1
  1318. 140.49 s > ╭────────────┬───────┬─────────┬────────────┬────────────┬────────────────┬─────────────╮
  1319. 140.49 s > │ integrand │ graph │ # evals │ expr build │ spenso │ symbolica eval │ compile │
  1320. 140.49 s > ├────────────┼───────┼─────────┼────────────┼────────────┼────────────────┼─────────────┤
  1321. 140.49 s > │ scalar_tri │ GL0 │ 9 │ 18ms (69%) │ 2ms (7.8%) │ 6ms (23%) │ 0ms (0.00%) │
  1322. 140.49 s > ├────────────┼───────┼─────────┼────────────┼────────────┼────────────────┼─────────────┤
  1323. 140.49 s > │ Total │ │ 9 │ 18ms (69%) │ 2ms (7.8%) │ 6ms (23%) │ 0ms (0.00%) │
  1324. 140.49 s > ╰────────────┴───────┴─────────┴────────────┴────────────┴────────────────┴─────────────╯
  1325. 140.49 s > [2026-08-28 10:41:15.048] @gammaloop_api::se... INFO : Running command generate amp scalar_0 scalar_0 > scalar_0 scalar_0 [{1}] --allowed-vertex-interactions V_3_SCALAR_022 -p box -i scalar_box --select-graphs GL0
  1326. 140.49 s > [2026-08-28 10:41:15.049] @feyngen::diagram_... INFO : 0s | Δ=0s | Starting Feynman graph generation with Symbolica...
  1327. 140.49 s > [2026-08-28 10:41:15.049] @feyngen::diagram_... INFO : 0s | Δ=0s | Number of graphs resulting from Symbolica generation: 3
  1328. 140.49 s > [2026-08-28 10:41:15.053] @feyngen::diagram_... INFO : 0s | Δ=0s | Number of graphs retained after removal of vetoed topologies: 3
  1329. 140.49 s > [2026-08-28 10:41:15.053] @feyngen::diagram_... INFO : 0s | Δ=0s | Number of graphs after vertex info assignment: 3
  1330. 140.49 s > [2026-08-28 10:41:15.053] @feyngen::diagram_... INFO : 0s | Δ=0s | Number of graphs after all complete graphs filters are applied: 3
  1331. 140.49 s > [2026-08-28 10:41:15.061] @feyngen::diagram_... INFO : 0s | Δ=0s | Number of graphs after closed fermion chains analysis: 3
  1332. 140.49 s > [2026-08-28 10:41:15.061] @feyngen::diagram_... INFO : 0s | Δ=0s | Number of graphs after symmetrization of external states: 3
  1333. 140.49 s > [2026-08-28 10:41:15.062] @feyngen::diagram_... INFO : 0s | Δ=0s | Number of graphs after canonization of vertices, edges and flows (graph labels assigned here): 3
  1334. 140.49 s > [2026-08-28 10:41:15.072] @feyngen::diagram_... INFO : 0s | Δ=0s | Number of graphs after numerator-aware grouping with strategy 'up to a scalar rescaling': 1 (1 isomorphically unique graph, 0 color zero, 0 lorentz zero, 0 grouped and 0 cancellation)
  1335. 140.49 s > [2026-08-28 10:41:15.072] @feyngen::diagram_... INFO : ( Sum of the symmetry factors from each graph generated = 1 )
  1336. 140.49 s > [2026-08-28 10:41:15.072] @commands::generate INFO : Generated amplitude 1 graphs.
  1337. 140.49 s > [2026-08-28 10:41:15.256] @settings::runtime WARNING : No external kinematics were provided; using default-generated external momenta and helicities.
  1338. 140.49 s > [2026-08-28 10:41:15.282] @commands::generate INFO :
  1339. 140.49 s > Integrand generation summary
  1340. 140.49 s > peak RAM 68.22 MiB | cores 1
  1341. 140.49 s > ╭────────────┬───────┬─────────┬─────────────┬─────────────┬────────────────┬─────────────╮
  1342. 140.49 s > │ integrand │ graph │ # evals │ expr build │ spenso │ symbolica eval │ compile │
  1343. 140.49 s > ├────────────┼───────┼─────────┼─────────────┼─────────────┼────────────────┼─────────────┤
  1344. 140.49 s > │ scalar_box │ GL0 │ 13 │ 108ms (62%) │ 10ms (5.9%) │ 57ms (33%) │ 0ms (0.00%) │
  1345. 140.49 s > ├────────────┼───────┼─────────┼─────────────┼─────────────┼────────────────┼─────────────┤
  1346. 140.49 s > │ Total │ │ 13 │ 108ms (62%) │ 10ms (5.9%) │ 57ms (33%) │ 0ms (0.00%) │
  1347. 140.49 s > ╰────────────┴───────┴─────────┴─────────────┴─────────────┴────────────────┴─────────────╯
  1348. 140.49 s > [2026-08-28 10:41:15.283] @gammaloop_api::se... INFO : Running command generate
  1349. 140.49 s > [2026-08-28 10:41:15.383] @settings::runtime WARNING : No external kinematics were provided; using default-generated external momenta and helicities.
  1350. 140.49 s > [2026-08-28 10:41:15.423] @settings::runtime WARNING : No external kinematics were provided; using default-generated external momenta and helicities.
  1351. 140.49 s > [2026-08-28 10:41:15.494] @commands::generate INFO :
  1352. 140.49 s > Integrand generation summary
  1353. 140.49 s > peak RAM 70.89 MiB | cores 1
  1354. 140.49 s > ╭────────────┬───────┬─────────┬────────────┬─────────────┬────────────────┬─────────────╮
  1355. 140.49 s > │ integrand │ graph │ # evals │ expr build │ spenso │ symbolica eval │ compile │
  1356. 140.49 s > ├────────────┼───────┼─────────┼────────────┼─────────────┼────────────────┼─────────────┤
  1357. 140.49 s > │ scalar_tri │ GL0 │ 9 │ 18ms (70%) │ 1ms (6.7%) │ 6ms (24%) │ 0ms (0.00%) │
  1358. 140.49 s > │ scalar_box │ GL0 │ 13 │ 70ms (65%) │ 8ms (7.5%) │ 30ms (28%) │ 0ms (0.00%) │
  1359. 140.49 s > ├────────────┼───────┼─────────┼────────────┼─────────────┼────────────────┼─────────────┤
  1360. 140.49 s > │ Total │ │ 22 │ 89ms (66%) │ 10ms (7.4%) │ 36ms (27%) │ 0ms (0.00%) │
  1361. 140.49 s > ╰────────────┴───────┴─────────┴────────────┴─────────────┴────────────────┴─────────────╯
  1362. 140.49 s > [2026-08-28 10:41:15.495] @gammaloop_api::se... INFO : Running command set model mass_scalar_2=2.0
  1363. 140.49 s > [2026-08-28 10:41:15.496] @gammaloop_api::se... INFO : Running command set model mass_scalar_1=1.0
  1364. 140.49 s > [2026-08-28 10:41:15.498] @gammaloop_api::se... INFO : Running command set process -p triangle -i scalar_tri string '
  1365. 140.49 s > [kinematics.externals]
  1366. 140.49 s > type = "constant"
  1367. 140.49 s >
  1368. 140.49 s > [kinematics.externals.data]
  1369. 140.49 s > [...]
  1370. 140.49 s > [2026-08-28 10:41:15.500] @gammaloop_api::se... INFO : Running command set process -p box -i scalar_box string '
  1371. 140.49 s > [kinematics.externals]
  1372. 140.49 s > type = "constant"
  1373. 140.49 s >
  1374. 140.49 s > [kinematics.externals.data]
  1375. 140.49 s > [...]
  1376. 140.49 s > [2026-08-28 10:41:15.500] @gammaloop_api::se... INFO : Running command approach -x 1.0000000000000001e-1,2.0000000000000001e-1,2.9999999999999999e-1,4.0000000000000002e-1 --approach-axis 1.0000000000000000e-3,0.0000000000000000e0,0.0000000000000000e0,0.0000000000000000e0 --n-points 1 --n-cores 1 --output-results /build/source/tests/artifacts/scalar_box_invalid_momentum_approach/approach_momentum.json --momentum-space --graph-id 0
  1377. 140.49 s > The application panicked (crashed).
  1378. 140.49 s > Message: There are 2 processes available. Please specify a process.
  1379. 140.49 s > Location: tests/tests/test_runs/approach.rs:332
  1380. 140.49 s >
  1381. 140.49 s > ━━━━━━━━━━━━━━━━━━━━━━━━━━━━━━━━━━ BACKTRACE ━━━━━━━━━━━━━━━━━━━━━━━━━━━━━━━━━━━
  1382. 140.49 s > 1: <color_eyre[51793ea62743adbd]::config::PanicHook>::panic_report<unknown>
  1383. 140.49 s > at <unknown source file>:<unknown line>
  1384. 140.49 s > 2: <color_eyre[51793ea62743adbd]::config::PanicHook>::into_panic_hook::{closure#0}<unknown>
  1385. 140.49 s > at <unknown source file>:<unknown line>
  1386. 140.49 s > 3: std[bcb96dfbba0ab899]::panicking::panic_with_hook<unknown>
  1387. 140.49 s > at <unknown source file>:<unknown line>
  1388. 140.49 s > 4: std[bcb96dfbba0ab899]::panicking::panic_handler::{closure#0}<unknown>
  1389. 140.49 s > at <unknown source file>:<unknown line>
  1390. 140.49 s > 5: std[bcb96dfbba0ab899]::sys::backtrace::__rust_end_short_backtrace::<std[bcb96dfbba0ab899]::panicking::panic_handler::{closure#0}, !><unknown>
  1391. 140.49 s > at <unknown source file>:<unknown line>
  1392. 140.49 s > 6: __rustc[6c289b9f9c454d21]::rust_begin_unwind<unknown>
  1393. 140.49 s > at <unknown source file>:<unknown line>
  1394. 140.49 s > 7: core[940e698046960fd5]::panicking::panic_fmt<unknown>
  1395. 140.49 s > at <unknown source file>:<unknown line>
  1396. 140.49 s > 8: test_runs[3e7a390caee4e338]::approach::approach_momentum_space_reports_incomplete_triplet_cleanly<unknown>
  1397. 140.49 s > at <unknown source file>:<unknown line>
  1398. 140.49 s > 9: <test_runs[3e7a390caee4e338]::approach::approach_momentum_space_reports_incomplete_triplet_cleanly::{closure#0} as core[940e698046960fd5]::ops::function::FnOnce<()>>::call_once<unknown>
  1399. 140.49 s > at <unknown source file>:<unknown line>
  1400. 140.49 s > 10: test[75d6903177b1d7e9]::__rust_begin_short_backtrace::<core[940e698046960fd5]::result::Result<(), alloc[2ea6bcb46fca0c42]::string::String>, fn() -> core[940e698046960fd5]::result::Result<(), alloc[2ea6bcb46fca0c42]::string::String>><unknown>
  1401. 140.49 s > at <unknown source file>:<unknown line>
  1402. 140.49 s > 11: test[75d6903177b1d7e9]::run_test::{closure#0}<unknown>
  1403. 140.49 s > at <unknown source file>:<unknown line>
  1404. 140.49 s > 12: std[bcb96dfbba0ab899]::sys::backtrace::__rust_begin_short_backtrace::<test[75d6903177b1d7e9]::run_test::{closure#1}, ()><unknown>
  1405. 140.49 s > at <unknown source file>:<unknown line>
  1406. 140.49 s > 13: <std[bcb96dfbba0ab899]::thread::lifecycle::spawn_unchecked<test[75d6903177b1d7e9]::run_test::{closure#1}, ()>::{closure#1} as core[940e698046960fd5]::ops::function::FnOnce<()>>::call_once::{shim:vtable#0}<unknown>
  1407. 140.49 s > at <unknown source file>:<unknown line>
  1408. 140.49 s > 14: <std[bcb96dfbba0ab899]::sys::thread::unix::Thread>::new::thread_start<unknown>
  1409. 140.49 s > at <unknown source file>:<unknown line>
  1410. 140.49 s > 15: start_thread<unknown>
  1411. 140.49 s > at <unknown source file>:<unknown line>
  1412. 140.49 s > 16: __clone3<unknown>
  1413. 140.49 s > at <unknown source file>:<unknown line>
  1414. 140.49 s >
  1415. 140.49 s > Run with COLORBT_SHOW_HIDDEN=1 environment variable to disable frame filtering.
  1416. 140.49 s > ... omitted 1 more lines; see full nextest output above
  1417. 140.49 s >
  1418. 140.49 s > 2. gammaloop-integration-tests::test_runs::profile_bulk::dotted_bubble_amp_bulk_profile_passes
  1419. 140.49 s > failure: test failure with exit code 101
  1420. 140.49 s > Error:
  1421. 140.49 s > 0: IR profiling requested arbitrary precision but received a quad-precision result
  1422. 140.49 s >
  1423. 140.49 s > Location:
  1424. 140.49 s > crates/gammalooprs/src/integrands/process/ir.rs:2123
  1425. 140.49 s >
  1426. 140.49 s > ━━━━━━━━━━━━━━━━━━━━━━━━━━━━━━━━━━ BACKTRACE ━━━━━━━━━━━━━━━━━━━━━━━━━━━━━━━━━━━
  1427. 140.49 s > 1: <color_eyre[51793ea62743adbd]::config::EyreHook>::into_eyre_hook::{closure#0}<unknown>
  1428. 140.49 s > at <unknown source file>:<unknown line>
  1429. 140.49 s > 2: eyre[cb2fd339c0c40fca]::capture_handler<unknown>
  1430. 140.49 s > at <unknown source file>:<unknown line>
  1431. 140.49 s > 3: eyre[cb2fd339c0c40fca]::private::format_err<unknown>
  1432. 140.49 s > at <unknown source file>:<unknown line>
  1433. 140.49 s > 4: gammalooprs[d7a7c067ebd19583]::integrands::process::ir::evaluate_profile_momentum_point_arb::<gammalooprs[d7a7c067ebd19583]::integrands::process::amplitude::AmplitudeIntegrand><unknown>
  1434. 140.49 s > at <unknown source file>:<unknown line>
  1435. 140.49 s > 5: <gammalooprs[d7a7c067ebd19583]::integrands::process::amplitude::AmplitudeIntegrand>::test_single_ir_limit_impl<unknown>
  1436. 140.49 s > at <unknown source file>:<unknown line>
  1437. 140.49 s > 6: gammalooprs[d7a7c067ebd19583]::integrands::process::ir::run_ir_profile::<gammalooprs[d7a7c067ebd19583]::integrands::process::amplitude::AmplitudeIntegrand, <gammalooprs[d7a7c067ebd19583]::integrands::process::amplitude::AmplitudeIntegrand>::enumerate_ir_limits, <gammalooprs[d7a7c067ebd19583]::integrands::process::amplitude::AmplitudeIntegrand>::graph_cut_definitions, <gammalooprs[d7a7c067ebd19583]::integrands::process::amplitude::AmplitudeIntegrand>::test_single_ir_limit_impl><unknown>
  1438. 140.49 s > at <unknown source file>:<unknown line>
  1439. 140.49 s > 7: <gammalooprs[d7a7c067ebd19583]::integrands::process::amplitude::AmplitudeIntegrand>::test_ir<unknown>
  1440. 140.49 s > at <unknown source file>:<unknown line>
  1441. 140.49 s > 8: <gammaloop_api[92ae732909e47e14]::commands::profile::Profile>::run<unknown>
  1442. 140.49 s > at <unknown source file>:<unknown line>
  1443. 140.49 s > 9: test_runs[3e7a390caee4e338]::profile_bulk::dotted_bubble_amp_bulk_profile_passes<unknown>
  1444. 140.49 s > at <unknown source file>:<unknown line>
  1445. 140.49 s > 10: <test_runs[3e7a390caee4e338]::profile_bulk::dotted_bubble_amp_bulk_profile_passes::{closure#0} as core[940e698046960fd5]::ops::function::FnOnce<()>>::call_once<unknown>
  1446. 140.49 s > at <unknown source file>:<unknown line>
  1447. 140.49 s > 11: test[75d6903177b1d7e9]::__rust_begin_short_backtrace::<core[940e698046960fd5]::result::Result<(), alloc[2ea6bcb46fca0c42]::string::String>, fn() -> core[940e698046960fd5]::result::Result<(), alloc[2ea6bcb46fca0c42]::string::String>><unknown>
  1448. 140.49 s > at <unknown source file>:<unknown line>
  1449. 140.49 s > 12: test[75d6903177b1d7e9]::run_test::{closure#0}<unknown>
  1450. 140.49 s > at <unknown source file>:<unknown line>
  1451. 140.49 s > 13: std[bcb96dfbba0ab899]::sys::backtrace::__rust_begin_short_backtrace::<test[75d6903177b1d7e9]::run_test::{closure#1}, ()><unknown>
  1452. 140.49 s > at <unknown source file>:<unknown line>
  1453. 140.49 s > 14: <std[bcb96dfbba0ab899]::thread::lifecycle::spawn_unchecked<test[75d6903177b1d7e9]::run_test::{closure#1}, ()>::{closure#1} as core[940e698046960fd5]::ops::function::FnOnce<()>>::call_once::{shim:vtable#0}<unknown>
  1454. 140.49 s > at <unknown source file>:<unknown line>
  1455. 140.49 s > 15: <std[bcb96dfbba0ab899]::sys::thread::unix::Thread>::new::thread_start<unknown>
  1456. 140.49 s > at <unknown source file>:<unknown line>
  1457. 140.49 s > 16: start_thread<unknown>
  1458. 140.49 s > at <unknown source file>:<unknown line>
  1459. 140.49 s > 17: __clone3<unknown>
  1460. 140.49 s > at <unknown source file>:<unknown line>
  1461. 140.49 s >
  1462. 140.49 s > Run with COLORBT_SHOW_HIDDEN=1 environment variable to disable frame filtering.
  1463. 140.49 s > Run with RUST_BACKTRACE=full to include source snippets.
  1464. 140.49 s > Warning: SpanTrace capture is Unsupported.
  1465. 140.49 s > Ensure that you've setup a tracing-error ErrorLayer and the semver versions are compatible
  1466. 140.49 s > system-out
  1467. 140.49 s > running 1 test
  1468. 140.49 s > test profile_bulk::dotted_bubble_amp_bulk_profile_passes ... FAILED
  1469. 140.49 s >
  1470. 140.49 s > failures:
  1471. 140.49 s >
  1472. 140.49 s > failures:
  1473. 140.49 s > profile_bulk::dotted_bubble_amp_bulk_profile_passes
  1474. 140.49 s >
  1475. 140.49 s > test result: FAILED. 0 passed; 1 failed; 0 ignored; 0 measured; 82 filtered out; finished in 0.31s
  1476. 140.49 s > system-err
  1477. 140.49 s > [2026-08-28 10:41:16.984] @gammaloop_api::se... INFO : Running command import model ./assets/models/json/scalars/scalars_2p_3p.json
  1478. 140.49 s > [2026-08-28 10:41:16.984] @import::model INFO : Loading JSON model scalars_2p_3p-default from /build/source/assets/models/json/scalars/scalars_2p_3p
  1479. 140.49 s > [2026-08-28 10:41:16.988] @gammaloop_api::se... INFO : Running command import graphs ./tests/resources/graphs/dotted_bubble_amp.dot
  1480. 140.49 s > [2026-08-28 10:41:16.988] @commands::import INFO : Loading graphs from '/build/source/tests/resources/graphs/dotted_bubble_amp.dot'
  1481. 140.49 s > [2026-08-28 10:41:16.999] @gammaloop_api::se... INFO : Running command generate
  1482. 140.49 s > [2026-08-28 10:41:17.112] @commands::generate INFO :
  1483. 140.49 s > Integrand generation summary
  1484. 140.49 s > peak RAM 65.06 MiB | cores 1
  1485. 140.49 s > ╭───────────┬───────────────────┬─────────┬────────────┬────────────┬────────────────┬─────────────╮
  1486. 140.49 s > │ integrand │ graph │ # evals │ expr build │ spenso │ symbolica eval │ compile │
  1487. 140.49 s > ├───────────┼───────────────────┼─────────┼────────────┼────────────┼────────────────┼─────────────┤
  1488. 140.49 s > │ default │ dotted_bubble_amp │ 8 │ 12ms (37%) │ 1ms (5.7%) │ 19ms (57%) │ 0ms (0.00%) │
  1489. 140.49 s > ├───────────┼───────────────────┼─────────┼────────────┼────────────┼────────────────┼─────────────┤
  1490. 140.49 s > │ Total │ │ 8 │ 12ms (37%) │ 1ms (5.7%) │ 19ms (57%) │ 0ms (0.00%) │
  1491. 140.49 s > ╰───────────┴───────────────────┴─────────┴────────────┴────────────┴────────────────┴─────────────╯
  1492. 140.49 s > [2026-08-28 10:41:17.113] @process::amplitude INFO : Input is above threshold: 1 existing threshold E-surfaces across 1/1 graph groups
  1493. 140.49 s > [2026-08-28 10:41:17.113] @process::amplitude INFO : overlap structure of group 0: [1: [1(1,3)]]
  1494. 140.49 s > Error:
  1495. 140.49 s > 0: IR profiling requested arbitrary precision but received a quad-precision result
  1496. 140.49 s >
  1497. 140.49 s > Location:
  1498. 140.49 s > crates/gammalooprs/src/integrands/process/ir.rs:2123
  1499. 140.49 s >
  1500. 140.49 s > ━━━━━━━━━━━━━━━━━━━━━━━━━━━━━━━━━━ BACKTRACE ━━━━━━━━━━━━━━━━━━━━━━━━━━━━━━━━━━━
  1501. 140.49 s > 1: <color_eyre[51793ea62743adbd]::config::EyreHook>::into_eyre_hook::{closure#0}<unknown>
  1502. 140.49 s > at <unknown source file>:<unknown line>
  1503. 140.49 s > 2: eyre[cb2fd339c0c40fca]::capture_handler<unknown>
  1504. 140.49 s > at <unknown source file>:<unknown line>
  1505. 140.49 s > 3: eyre[cb2fd339c0c40fca]::private::format_err<unknown>
  1506. 140.49 s > at <unknown source file>:<unknown line>
  1507. 140.49 s > 4: gammalooprs[d7a7c067ebd19583]::integrands::process::ir::evaluate_profile_momentum_point_arb::<gammalooprs[d7a7c067ebd19583]::integrands::process::amplitude::AmplitudeIntegrand><unknown>
  1508. 140.49 s > at <unknown source file>:<unknown line>
  1509. 140.49 s > 5: <gammalooprs[d7a7c067ebd19583]::integrands::process::amplitude::AmplitudeIntegrand>::test_single_ir_limit_impl<unknown>
  1510. 140.49 s > at <unknown source file>:<unknown line>
  1511. 140.49 s > 6: gammalooprs[d7a7c067ebd19583]::integrands::process::ir::run_ir_profile::<gammalooprs[d7a7c067ebd19583]::integrands::process::amplitude::AmplitudeIntegrand, <gammalooprs[d7a7c067ebd19583]::integrands::process::amplitude::AmplitudeIntegrand>::enumerate_ir_limits, <gammalooprs[d7a7c067ebd19583]::integrands::process::amplitude::AmplitudeIntegrand>::graph_cut_definitions, <gammalooprs[d7a7c067ebd19583]::integrands::process::amplitude::AmplitudeIntegrand>::test_single_ir_limit_impl><unknown>
  1512. 140.49 s > at <unknown source file>:<unknown line>
  1513. 140.49 s > 7: <gammalooprs[d7a7c067ebd19583]::integrands::process::amplitude::AmplitudeIntegrand>::test_ir<unknown>
  1514. 140.49 s > at <unknown source file>:<unknown line>
  1515. 140.49 s > 8: <gammaloop_api[92ae732909e47e14]::commands::profile::Profile>::run<unknown>
  1516. 140.49 s > at <unknown source file>:<unknown line>
  1517. 140.49 s > 9: test_runs[3e7a390caee4e338]::profile_bulk::dotted_bubble_amp_bulk_profile_passes<unknown>
  1518. 140.49 s > at <unknown source file>:<unknown line>
  1519. 140.49 s > 10: <test_runs[3e7a390caee4e338]::profile_bulk::dotted_bubble_amp_bulk_profile_passes::{closure#0} as core[940e698046960fd5]::ops::function::FnOnce<()>>::call_once<unknown>
  1520. 140.49 s > at <unknown source file>:<unknown line>
  1521. 140.49 s > 11: test[75d6903177b1d7e9]::__rust_begin_short_backtrace::<core[940e698046960fd5]::result::Result<(), alloc[2ea6bcb46fca0c42]::string::String>, fn() -> core[940e698046960fd5]::result::Result<(), alloc[2ea6bcb46fca0c42]::string::String>><unknown>
  1522. 140.49 s > at <unknown source file>:<unknown line>
  1523. 140.49 s > 12: test[75d6903177b1d7e9]::run_test::{closure#0}<unknown>
  1524. 140.49 s > at <unknown source file>:<unknown line>
  1525. 140.49 s > 13: std[bcb96dfbba0ab899]::sys::backtrace::__rust_begin_short_backtrace::<test[75d6903177b1d7e9]::run_test::{closure#1}, ()><unknown>
  1526. 140.49 s > at <unknown source file>:<unknown line>
  1527. 140.49 s > 14: <std[bcb96dfbba0ab899]::thread::lifecycle::spawn_unchecked<test[75d6903177b1d7e9]::run_test::{closure#1}, ()>::{closure#1} as core[940e698046960fd5]::ops::function::FnOnce<()>>::call_once::{shim:vtable#0}<unknown>
  1528. 140.49 s > at <unknown source file>:<unknown line>
  1529. 140.49 s > 15: <std[bcb96dfbba0ab899]::sys::thread::unix::Thread>::new::thread_start<unknown>
  1530. 140.49 s > at <unknown source file>:<unknown line>
  1531. 140.49 s > 16: start_thread<unknown>
  1532. 140.49 s > at <unknown source file>:<unknown line>
  1533. 140.49 s > 17: __clone3<unknown>
  1534. 140.49 s > at <unknown source file>:<unknown line>
  1535. 140.49 s >
  1536. 140.49 s > Run with COLORBT_SHOW_HIDDEN=1 environment variable to disable frame filtering.
  1537. 140.49 s > Run with RUST_BACKTRACE=full to include source snippets.
  1538. 140.49 s > Warning: SpanTrace capture is Unsupported.
  1539. 140.49 s > Ensure that you've setup a tracing-error ErrorLayer and the semver versions are compatible
  1540. 140.49 s >
  1541. 140.49 s > 3. gammaloop-integration-tests::test_runs::profile_bulk::double_dotted_bubble_amp_bulk_profile_passes
  1542. 140.49 s > failure: test failure with exit code 101
  1543. 140.49 s > Error:
  1544. 140.49 s > 0: IR profiling requested arbitrary precision but received a quad-precision result
  1545. 140.49 s >
  1546. 140.49 s > Location:
  1547. 140.49 s > crates/gammalooprs/src/integrands/process/ir.rs:2123
  1548. 140.49 s >
  1549. 140.49 s > ━━━━━━━━━━━━━━━━━━━━━━━━━━━━━━━━━━ BACKTRACE ━━━━━━━━━━━━━━━━━━━━━━━━━━━━━━━━━━━
  1550. 140.49 s > 1: <color_eyre[51793ea62743adbd]::config::EyreHook>::into_eyre_hook::{closure#0}<unknown>
  1551. 140.49 s > at <unknown source file>:<unknown line>
  1552. 140.49 s > 2: eyre[cb2fd339c0c40fca]::capture_handler<unknown>
  1553. 140.49 s > at <unknown source file>:<unknown line>
  1554. 140.49 s > 3: eyre[cb2fd339c0c40fca]::private::format_err<unknown>
  1555. 140.49 s > at <unknown source file>:<unknown line>
  1556. 140.49 s > 4: gammalooprs[d7a7c067ebd19583]::integrands::process::ir::evaluate_profile_momentum_point_arb::<gammalooprs[d7a7c067ebd19583]::integrands::process::amplitude::AmplitudeIntegrand><unknown>
  1557. 140.49 s > at <unknown source file>:<unknown line>
  1558. 140.49 s > 5: <gammalooprs[d7a7c067ebd19583]::integrands::process::amplitude::AmplitudeIntegrand>::test_single_ir_limit_impl<unknown>
  1559. 140.49 s > at <unknown source file>:<unknown line>
  1560. 140.49 s > 6: gammalooprs[d7a7c067ebd19583]::integrands::process::ir::run_ir_profile::<gammalooprs[d7a7c067ebd19583]::integrands::process::amplitude::AmplitudeIntegrand, <gammalooprs[d7a7c067ebd19583]::integrands::process::amplitude::AmplitudeIntegrand>::enumerate_ir_limits, <gammalooprs[d7a7c067ebd19583]::integrands::process::amplitude::AmplitudeIntegrand>::graph_cut_definitions, <gammalooprs[d7a7c067ebd19583]::integrands::process::amplitude::AmplitudeIntegrand>::test_single_ir_limit_impl><unknown>
  1561. 140.49 s > at <unknown source file>:<unknown line>
  1562. 140.49 s > 7: <gammalooprs[d7a7c067ebd19583]::integrands::process::amplitude::AmplitudeIntegrand>::test_ir<unknown>
  1563. 140.49 s > at <unknown source file>:<unknown line>
  1564. 140.49 s > 8: <gammaloop_api[92ae732909e47e14]::commands::profile::Profile>::run<unknown>
  1565. 140.49 s > at <unknown source file>:<unknown line>
  1566. 140.49 s > 9: test_runs[3e7a390caee4e338]::profile_bulk::double_dotted_bubble_amp_bulk_profile_passes<unknown>
  1567. 140.49 s > at <unknown source file>:<unknown line>
  1568. 140.49 s > 10: <test_runs[3e7a390caee4e338]::profile_bulk::double_dotted_bubble_amp_bulk_profile_passes::{closure#0} as core[940e698046960fd5]::ops::function::FnOnce<()>>::call_once<unknown>
  1569. 140.49 s > at <unknown source file>:<unknown line>
  1570. 140.49 s > 11: test[75d6903177b1d7e9]::__rust_begin_short_backtrace::<core[940e698046960fd5]::result::Result<(), alloc[2ea6bcb46fca0c42]::string::String>, fn() -> core[940e698046960fd5]::result::Result<(), alloc[2ea6bcb46fca0c42]::string::String>><unknown>
  1571. 140.49 s > at <unknown source file>:<unknown line>
  1572. 140.49 s > 12: test[75d6903177b1d7e9]::run_test::{closure#0}<unknown>
  1573. 140.49 s > at <unknown source file>:<unknown line>
  1574. 140.49 s > 13: std[bcb96dfbba0ab899]::sys::backtrace::__rust_begin_short_backtrace::<test[75d6903177b1d7e9]::run_test::{closure#1}, ()><unknown>
  1575. 140.49 s > at <unknown source file>:<unknown line>
  1576. 140.49 s > 14: <std[bcb96dfbba0ab899]::thread::lifecycle::spawn_unchecked<test[75d6903177b1d7e9]::run_test::{closure#1}, ()>::{closure#1} as core[940e698046960fd5]::ops::function::FnOnce<()>>::call_once::{shim:vtable#0}<unknown>
  1577. 140.49 s > at <unknown source file>:<unknown line>
  1578. 140.49 s > 15: <std[bcb96dfbba0ab899]::sys::thread::unix::Thread>::new::thread_start<unknown>
  1579. 140.49 s > at <unknown source file>:<unknown line>
  1580. 140.49 s > 16: start_thread<unknown>
  1581. 140.49 s > at <unknown source file>:<unknown line>
  1582. 140.49 s > 17: __clone3<unknown>
  1583. 140.49 s > at <unknown source file>:<unknown line>
  1584. 140.49 s >
  1585. 140.49 s > Run with COLORBT_SHOW_HIDDEN=1 environment variable to disable frame filtering.
  1586. 140.49 s > Run with RUST_BACKTRACE=full to include source snippets.
  1587. 140.49 s > Warning: SpanTrace capture is Unsupported.
  1588. 140.49 s > Ensure that you've setup a tracing-error ErrorLayer and the semver versions are compatible
  1589. 140.49 s > system-out
  1590. 140.49 s > running 1 test
  1591. 140.49 s > test profile_bulk::double_dotted_bubble_amp_bulk_profile_passes ... FAILED
  1592. 140.49 s >
  1593. 140.49 s > failures:
  1594. 140.49 s >
  1595. 140.49 s > failures:
  1596. 140.49 s > profile_bulk::double_dotted_bubble_amp_bulk_profile_passes
  1597. 140.49 s >
  1598. 140.49 s > test result: FAILED. 0 passed; 1 failed; 0 ignored; 0 measured; 82 filtered out; finished in 0.41s
  1599. 140.49 s > system-err
  1600. 140.49 s > [2026-08-28 10:41:17.106] @gammaloop_api::se... INFO : Running command import model ./assets/models/json/scalars/scalars_2p_3p.json
  1601. 140.49 s > [2026-08-28 10:41:17.106] @import::model INFO : Loading JSON model scalars_2p_3p-default from /build/source/assets/models/json/scalars/scalars_2p_3p
  1602. 140.49 s > [2026-08-28 10:41:17.111] @gammaloop_api::se... INFO : Running command import graphs ./tests/resources/graphs/double_dotted_bubble_amp.dot
  1603. 140.49 s > [2026-08-28 10:41:17.111] @commands::import INFO : Loading graphs from '/build/source/tests/resources/graphs/double_dotted_bubble_amp.dot'
  1604. 140.49 s > [2026-08-28 10:41:17.129] @gammaloop_api::se... INFO : Running command generate
  1605. 140.49 s > [2026-08-28 10:41:17.242] @commands::generate INFO :
  1606. 140.49 s > Integrand generation summary
  1607. 140.49 s > peak RAM 62.86 MiB | cores 1
  1608. 140.49 s > ╭───────────┬──────────────────────────┬─────────┬────────────┬────────────┬────────────────┬─────────────╮
  1609. 140.49 s > │ integrand │ graph │ # evals │ expr build │ spenso │ symbolica eval │ compile │
  1610. 140.49 s > ├───────────┼──────────────────────────┼─────────┼────────────┼────────────┼────────────────┼─────────────┤
  1611. 140.49 s > │ default │ double_dotted_bubble_amp │ 11 │ 38ms (55%) │ 5ms (8.4%) │ 25ms (36%) │ 0ms (0.00%) │
  1612. 140.49 s > ├───────────┼──────────────────────────┼─────────┼────────────┼────────────┼────────────────┼─────────────┤
  1613. 140.49 s > │ Total │ │ 11 │ 38ms (55%) │ 5ms (8.4%) │ 25ms (36%) │ 0ms (0.00%) │
  1614. 140.49 s > ╰───────────┴──────────────────────────┴─────────┴────────────┴────────────┴────────────────┴─────────────╯
  1615. 140.49 s > [2026-08-28 10:41:17.244] @process::amplitude INFO : Input is above threshold: 1 existing threshold E-surfaces across 1/1 graph groups
  1616. 140.49 s > [2026-08-28 10:41:17.244] @process::amplitude INFO : overlap structure of group 0: [1: [1(1,4)]]
  1617. 140.49 s > Error:
  1618. 140.49 s > 0: IR profiling requested arbitrary precision but received a quad-precision result
  1619. 140.49 s >
  1620. 140.49 s > Location:
  1621. 140.49 s > crates/gammalooprs/src/integrands/process/ir.rs:2123
  1622. 140.49 s >
  1623. 140.49 s > ━━━━━━━━━━━━━━━━━━━━━━━━━━━━━━━━━━ BACKTRACE ━━━━━━━━━━━━━━━━━━━━━━━━━━━━━━━━━━━
  1624. 140.49 s > 1: <color_eyre[51793ea62743adbd]::config::EyreHook>::into_eyre_hook::{closure#0}<unknown>
  1625. 140.49 s > at <unknown source file>:<unknown line>
  1626. 140.49 s > 2: eyre[cb2fd339c0c40fca]::capture_handler<unknown>
  1627. 140.49 s > at <unknown source file>:<unknown line>
  1628. 140.49 s > 3: eyre[cb2fd339c0c40fca]::private::format_err<unknown>
  1629. 140.49 s > at <unknown source file>:<unknown line>
  1630. 140.49 s > 4: gammalooprs[d7a7c067ebd19583]::integrands::process::ir::evaluate_profile_momentum_point_arb::<gammalooprs[d7a7c067ebd19583]::integrands::process::amplitude::AmplitudeIntegrand><unknown>
  1631. 140.49 s > at <unknown source file>:<unknown line>
  1632. 140.49 s > 5: <gammalooprs[d7a7c067ebd19583]::integrands::process::amplitude::AmplitudeIntegrand>::test_single_ir_limit_impl<unknown>
  1633. 140.49 s > at <unknown source file>:<unknown line>
  1634. 140.49 s > 6: gammalooprs[d7a7c067ebd19583]::integrands::process::ir::run_ir_profile::<gammalooprs[d7a7c067ebd19583]::integrands::process::amplitude::AmplitudeIntegrand, <gammalooprs[d7a7c067ebd19583]::integrands::process::amplitude::AmplitudeIntegrand>::enumerate_ir_limits, <gammalooprs[d7a7c067ebd19583]::integrands::process::amplitude::AmplitudeIntegrand>::graph_cut_definitions, <gammalooprs[d7a7c067ebd19583]::integrands::process::amplitude::AmplitudeIntegrand>::test_single_ir_limit_impl><unknown>
  1635. 140.49 s > at <unknown source file>:<unknown line>
  1636. 140.49 s > 7: <gammalooprs[d7a7c067ebd19583]::integrands::process::amplitude::AmplitudeIntegrand>::test_ir<unknown>
  1637. 140.49 s > at <unknown source file>:<unknown line>
  1638. 140.49 s > 8: <gammaloop_api[92ae732909e47e14]::commands::profile::Profile>::run<unknown>
  1639. 140.49 s > at <unknown source file>:<unknown line>
  1640. 140.49 s > 9: test_runs[3e7a390caee4e338]::profile_bulk::double_dotted_bubble_amp_bulk_profile_passes<unknown>
  1641. 140.49 s > at <unknown source file>:<unknown line>
  1642. 140.49 s > 10: <test_runs[3e7a390caee4e338]::profile_bulk::double_dotted_bubble_amp_bulk_profile_passes::{closure#0} as core[940e698046960fd5]::ops::function::FnOnce<()>>::call_once<unknown>
  1643. 140.49 s > at <unknown source file>:<unknown line>
  1644. 140.49 s > 11: test[75d6903177b1d7e9]::__rust_begin_short_backtrace::<core[940e698046960fd5]::result::Result<(), alloc[2ea6bcb46fca0c42]::string::String>, fn() -> core[940e698046960fd5]::result::Result<(), alloc[2ea6bcb46fca0c42]::string::String>><unknown>
  1645. 140.49 s > at <unknown source file>:<unknown line>
  1646. 140.49 s > 12: test[75d6903177b1d7e9]::run_test::{closure#0}<unknown>
  1647. 140.49 s > at <unknown source file>:<unknown line>
  1648. 140.49 s > 13: std[bcb96dfbba0ab899]::sys::backtrace::__rust_begin_short_backtrace::<test[75d6903177b1d7e9]::run_test::{closure#1}, ()><unknown>
  1649. 140.49 s > at <unknown source file>:<unknown line>
  1650. 140.49 s > 14: <std[bcb96dfbba0ab899]::thread::lifecycle::spawn_unchecked<test[75d6903177b1d7e9]::run_test::{closure#1}, ()>::{closure#1} as core[940e698046960fd5]::ops::function::FnOnce<()>>::call_once::{shim:vtable#0}<unknown>
  1651. 140.49 s > at <unknown source file>:<unknown line>
  1652. 140.49 s > 15: <std[bcb96dfbba0ab899]::sys::thread::unix::Thread>::new::thread_start<unknown>
  1653. 140.49 s > at <unknown source file>:<unknown line>
  1654. 140.49 s > 16: start_thread<unknown>
  1655. 140.49 s > at <unknown source file>:<unknown line>
  1656. 140.49 s > 17: __clone3<unknown>
  1657. 140.49 s > at <unknown source file>:<unknown line>
  1658. 140.49 s >
  1659. 140.49 s > Run with COLORBT_SHOW_HIDDEN=1 environment variable to disable frame filtering.
  1660. 140.49 s > Run with RUST_BACKTRACE=full to include source snippets.
  1661. 140.49 s > Warning: SpanTrace capture is Unsupported.
  1662. 140.49 s > Ensure that you've setup a tracing-error ErrorLayer and the semver versions are compatible
  1663. 140.49 s >
  1664. 140.49 s > 4. gammaloop-integration-tests::test_runs::profile_bulk::box_4e_bulk_profile_passes
  1665. 140.49 s > failure: test failure with exit code 101
  1666. 140.49 s > Error:
  1667. 140.49 s > 0: IR profiling requested arbitrary precision but received a quad-precision result
  1668. 140.49 s >
  1669. 140.49 s > Location:
  1670. 140.49 s > crates/gammalooprs/src/integrands/process/ir.rs:2123
  1671. 140.49 s >
  1672. 140.49 s > ━━━━━━━━━━━━━━━━━━━━━━━━━━━━━━━━━━ BACKTRACE ━━━━━━━━━━━━━━━━━━━━━━━━━━━━━━━━━━━
  1673. 140.49 s > 1: <color_eyre[51793ea62743adbd]::config::EyreHook>::into_eyre_hook::{closure#0}<unknown>
  1674. 140.49 s > at <unknown source file>:<unknown line>
  1675. 140.49 s > 2: eyre[cb2fd339c0c40fca]::capture_handler<unknown>
  1676. 140.49 s > at <unknown source file>:<unknown line>
  1677. 140.49 s > 3: eyre[cb2fd339c0c40fca]::private::format_err<unknown>
  1678. 140.49 s > at <unknown source file>:<unknown line>
  1679. 140.49 s > 4: gammalooprs[d7a7c067ebd19583]::integrands::process::ir::evaluate_profile_momentum_point_arb::<gammalooprs[d7a7c067ebd19583]::integrands::process::amplitude::AmplitudeIntegrand><unknown>
  1680. 140.49 s > at <unknown source file>:<unknown line>
  1681. 140.49 s > 5: <gammalooprs[d7a7c067ebd19583]::integrands::process::amplitude::AmplitudeIntegrand>::test_single_ir_limit_impl<unknown>
  1682. 140.49 s > at <unknown source file>:<unknown line>
  1683. 140.49 s > 6: gammalooprs[d7a7c067ebd19583]::integrands::process::ir::run_ir_profile::<gammalooprs[d7a7c067ebd19583]::integrands::process::amplitude::AmplitudeIntegrand, <gammalooprs[d7a7c067ebd19583]::integrands::process::amplitude::AmplitudeIntegrand>::enumerate_ir_limits, <gammalooprs[d7a7c067ebd19583]::integrands::process::amplitude::AmplitudeIntegrand>::graph_cut_definitions, <gammalooprs[d7a7c067ebd19583]::integrands::process::amplitude::AmplitudeIntegrand>::test_single_ir_limit_impl><unknown>
  1684. 140.49 s > at <unknown source file>:<unknown line>
  1685. 140.49 s > 7: <gammalooprs[d7a7c067ebd19583]::integrands::process::amplitude::AmplitudeIntegrand>::test_ir<unknown>
  1686. 140.49 s > at <unknown source file>:<unknown line>
  1687. 140.49 s > 8: <gammaloop_api[92ae732909e47e14]::commands::profile::Profile>::run<unknown>
  1688. 140.49 s > at <unknown source file>:<unknown line>
  1689. 140.49 s > 9: test_runs[3e7a390caee4e338]::profile_bulk::box_4e_bulk_profile_passes<unknown>
  1690. 140.49 s > at <unknown source file>:<unknown line>
  1691. 140.49 s > 10: <test_runs[3e7a390caee4e338]::profile_bulk::box_4e_bulk_profile_passes::{closure#0} as core[940e698046960fd5]::ops::function::FnOnce<()>>::call_once<unknown>
  1692. 140.49 s > at <unknown source file>:<unknown line>
  1693. 140.49 s > 11: test[75d6903177b1d7e9]::__rust_begin_short_backtrace::<core[940e698046960fd5]::result::Result<(), alloc[2ea6bcb46fca0c42]::string::String>, fn() -> core[940e698046960fd5]::result::Result<(), alloc[2ea6bcb46fca0c42]::string::String>><unknown>
  1694. 140.49 s > at <unknown source file>:<unknown line>
  1695. 140.49 s > 12: test[75d6903177b1d7e9]::run_test::{closure#0}<unknown>
  1696. 140.49 s > at <unknown source file>:<unknown line>
  1697. 140.49 s > 13: std[bcb96dfbba0ab899]::sys::backtrace::__rust_begin_short_backtrace::<test[75d6903177b1d7e9]::run_test::{closure#1}, ()><unknown>
  1698. 140.49 s > at <unknown source file>:<unknown line>
  1699. 140.49 s > 14: <std[bcb96dfbba0ab899]::thread::lifecycle::spawn_unchecked<test[75d6903177b1d7e9]::run_test::{closure#1}, ()>::{closure#1} as core[940e698046960fd5]::ops::function::FnOnce<()>>::call_once::{shim:vtable#0}<unknown>
  1700. 140.49 s > at <unknown source file>:<unknown line>
  1701. 140.49 s > 15: <std[bcb96dfbba0ab899]::sys::thread::unix::Thread>::new::thread_start<unknown>
  1702. 140.49 s > at <unknown source file>:<unknown line>
  1703. 140.49 s > 16: start_thread<unknown>
  1704. 140.49 s > at <unknown source file>:<unknown line>
  1705. 140.49 s > 17: __clone3<unknown>
  1706. 140.49 s > at <unknown source file>:<unknown line>
  1707. 140.49 s >
  1708. 140.49 s > Run with COLORBT_SHOW_HIDDEN=1 environment variable to disable frame filtering.
  1709. 140.49 s > Run with RUST_BACKTRACE=full to include source snippets.
  1710. 140.49 s > Warning: SpanTrace capture is Unsupported.
  1711. 140.49 s > Ensure that you've setup a tracing-error ErrorLayer and the semver versions are compatible
  1712. 140.49 s > system-out
  1713. 140.49 s > running 1 test
  1714. 140.49 s > test profile_bulk::box_4e_bulk_profile_passes ... FAILED
  1715. 140.49 s >
  1716. 140.49 s > failures:
  1717. 140.49 s >
  1718. 140.49 s > failures:
  1719. 140.49 s > profile_bulk::box_4e_bulk_profile_passes
  1720. 140.49 s >
  1721. 140.49 s > test result: FAILED. 0 passed; 1 failed; 0 ignored; 0 measured; 82 filtered out; finished in 0.69s
  1722. 140.49 s > system-err
  1723. 140.49 s > [2026-08-28 10:41:17.058] @gammaloop_api::se... INFO : Running command import model ./assets/models/json/scalars/scalars.json
  1724. 140.49 s > [2026-08-28 10:41:17.058] @import::model INFO : Loading JSON model scalars-default from /build/source/assets/models/json/scalars/scalars
  1725. 140.49 s > [2026-08-28 10:41:17.070] @gammalooprs::model INFO : The following 2 external parameters were forced to zero by the restriction card:
  1726. 140.49 s > width_scalar_1, width_scalar_2
  1727. 140.49 s > [2026-08-28 10:41:17.071] @gammaloop_api::se... INFO : Running command import graphs ./tests/resources/graphs/massless_box.dot
  1728. 140.49 s > [2026-08-28 10:41:17.072] @commands::import INFO : Loading graphs from '/build/source/tests/resources/graphs/massless_box.dot'
  1729. 140.49 s > [2026-08-28 10:41:17.084] @gammaloop_api::se... INFO : Running command generate
  1730. 140.49 s > [2026-08-28 10:41:17.425] @commands::generate INFO :
  1731. 140.49 s > Integrand generation summary
  1732. 140.49 s > peak RAM 66.41 MiB | cores 1
  1733. 140.49 s > ╭───────────┬────────────────┬─────────┬─────────────┬────────────┬────────────────┬─────────────╮
  1734. 140.49 s > │ integrand │ graph │ # evals │ expr build │ spenso │ symbolica eval │ compile │
  1735. 140.49 s > ├───────────┼────────────────┼─────────┼─────────────┼────────────┼────────────────┼─────────────┤
  1736. 140.49 s > │ default │ massless_box_0 │ 14 │ 241ms (77%) │ 37ms (12%) │ 34ms (11%) │ 0ms (0.00%) │
  1737. 140.49 s > ├───────────┼────────────────┼─────────┼─────────────┼────────────┼────────────────┼─────────────┤
  1738. 140.49 s > │ Total │ │ 14 │ 241ms (77%) │ 37ms (12%) │ 34ms (11%) │ 0ms (0.00%) │
  1739. 140.49 s > ╰───────────┴────────────────┴─────────┴─────────────┴────────────┴────────────────┴─────────────╯
  1740. 140.49 s > [2026-08-28 10:41:17.428] @process::amplitude INFO : Input is above threshold: 4 existing threshold E-surfaces across 1/1 graph groups
  1741. 140.49 s > [2026-08-28 10:41:17.431] @process::amplitude INFO : overlap structure of group 0: [2: [4(3,4), 9(3,5)], 2: [8(4,6), 11(5,6)], 2: [9(3,5), 11(5,6)], 2: [4(3,4), 8(4,6)]]
  1742. 140.49 s > Error:
  1743. 140.49 s > 0: IR profiling requested arbitrary precision but received a quad-precision result
  1744. 140.49 s >
  1745. 140.49 s > Location:
  1746. 140.49 s > crates/gammalooprs/src/integrands/process/ir.rs:2123
  1747. 140.49 s >
  1748. 140.49 s > ━━━━━━━━━━━━━━━━━━━━━━━━━━━━━━━━━━ BACKTRACE ━━━━━━━━━━━━━━━━━━━━━━━━━━━━━━━━━━━
  1749. 140.49 s > 1: <color_eyre[51793ea62743adbd]::config::EyreHook>::into_eyre_hook::{closure#0}<unknown>
  1750. 140.49 s > at <unknown source file>:<unknown line>
  1751. 140.49 s > 2: eyre[cb2fd339c0c40fca]::capture_handler<unknown>
  1752. 140.49 s > at <unknown source file>:<unknown line>
  1753. 140.49 s > 3: eyre[cb2fd339c0c40fca]::private::format_err<unknown>
  1754. 140.49 s > at <unknown source file>:<unknown line>
  1755. 140.49 s > 4: gammalooprs[d7a7c067ebd19583]::integrands::process::ir::evaluate_profile_momentum_point_arb::<gammalooprs[d7a7c067ebd19583]::integrands::process::amplitude::AmplitudeIntegrand><unknown>
  1756. 140.49 s > at <unknown source file>:<unknown line>
  1757. 140.49 s > 5: <gammalooprs[d7a7c067ebd19583]::integrands::process::amplitude::AmplitudeIntegrand>::test_single_ir_limit_impl<unknown>
  1758. 140.49 s > at <unknown source file>:<unknown line>
  1759. 140.49 s > 6: gammalooprs[d7a7c067ebd19583]::integrands::process::ir::run_ir_profile::<gammalooprs[d7a7c067ebd19583]::integrands::process::amplitude::AmplitudeIntegrand, <gammalooprs[d7a7c067ebd19583]::integrands::process::amplitude::AmplitudeIntegrand>::enumerate_ir_limits, <gammalooprs[d7a7c067ebd19583]::integrands::process::amplitude::AmplitudeIntegrand>::graph_cut_definitions, <gammalooprs[d7a7c067ebd19583]::integrands::process::amplitude::AmplitudeIntegrand>::test_single_ir_limit_impl><unknown>
  1760. 140.49 s > at <unknown source file>:<unknown line>
  1761. 140.49 s > 7: <gammalooprs[d7a7c067ebd19583]::integrands::process::amplitude::AmplitudeIntegrand>::test_ir<unknown>
  1762. 140.49 s > at <unknown source file>:<unknown line>
  1763. 140.49 s > 8: <gammaloop_api[92ae732909e47e14]::commands::profile::Profile>::run<unknown>
  1764. 140.49 s > at <unknown source file>:<unknown line>
  1765. 140.49 s > 9: test_runs[3e7a390caee4e338]::profile_bulk::box_4e_bulk_profile_passes<unknown>
  1766. 140.49 s > at <unknown source file>:<unknown line>
  1767. 140.49 s > 10: <test_runs[3e7a390caee4e338]::profile_bulk::box_4e_bulk_profile_passes::{closure#0} as core[940e698046960fd5]::ops::function::FnOnce<()>>::call_once<unknown>
  1768. 140.49 s > at <unknown source file>:<unknown line>
  1769. 140.49 s > 11: test[75d6903177b1d7e9]::__rust_begin_short_backtrace::<core[940e698046960fd5]::result::Result<(), alloc[2ea6bcb46fca0c42]::string::String>, fn() -> core[940e698046960fd5]::result::Result<(), alloc[2ea6bcb46fca0c42]::string::String>><unknown>
  1770. 140.49 s > at <unknown source file>:<unknown line>
  1771. 140.49 s > 12: test[75d6903177b1d7e9]::run_test::{closure#0}<unknown>
  1772. 140.49 s > at <unknown source file>:<unknown line>
  1773. 140.49 s > 13: std[bcb96dfbba0ab899]::sys::backtrace::__rust_begin_short_backtrace::<test[75d6903177b1d7e9]::run_test::{closure#1}, ()><unknown>
  1774. 140.49 s > at <unknown source file>:<unknown line>
  1775. 140.49 s > 14: <std[bcb96dfbba0ab899]::thread::lifecycle::spawn_unchecked<test[75d6903177b1d7e9]::run_test::{closure#1}, ()>::{closure#1} as core[940e698046960fd5]::ops::function::FnOnce<()>>::call_once::{shim:vtable#0}<unknown>
  1776. 140.49 s > at <unknown source file>:<unknown line>
  1777. 140.49 s > 15: <std[bcb96dfbba0ab899]::sys::thread::unix::Thread>::new::thread_start<unknown>
  1778. 140.49 s > at <unknown source file>:<unknown line>
  1779. 140.49 s > 16: start_thread<unknown>
  1780. 140.49 s > at <unknown source file>:<unknown line>
  1781. 140.49 s > 17: __clone3<unknown>
  1782. 140.49 s > at <unknown source file>:<unknown line>
  1783. 140.49 s >
  1784. 140.49 s > Run with COLORBT_SHOW_HIDDEN=1 environment variable to disable frame filtering.
  1785. 140.49 s > Run with RUST_BACKTRACE=full to include source snippets.
  1786. 140.49 s > Warning: SpanTrace capture is Unsupported.
  1787. 140.49 s > Ensure that you've setup a tracing-error ErrorLayer and the semver versions are compatible
  1788. 140.49 s >
  1789. 140.49 s > 5. gammaloop-integration-tests::test_runs::profile_bulk::massless_triangle_bulk_profile_passes
  1790. 140.49 s > failure: test failure with exit code 101
  1791. 140.49 s > Error:
  1792. 140.49 s > 0: IR profiling requested arbitrary precision but received a quad-precision result
  1793. 140.49 s >
  1794. 140.49 s > Location:
  1795. 140.49 s > crates/gammalooprs/src/integrands/process/ir.rs:2123
  1796. 140.49 s >
  1797. 140.49 s > ━━━━━━━━━━━━━━━━━━━━━━━━━━━━━━━━━━ BACKTRACE ━━━━━━━━━━━━━━━━━━━━━━━━━━━━━━━━━━━
  1798. 140.49 s > 1: <color_eyre[51793ea62743adbd]::config::EyreHook>::into_eyre_hook::{closure#0}<unknown>
  1799. 140.49 s > at <unknown source file>:<unknown line>
  1800. 140.49 s > 2: eyre[cb2fd339c0c40fca]::capture_handler<unknown>
  1801. 140.49 s > at <unknown source file>:<unknown line>
  1802. 140.49 s > 3: eyre[cb2fd339c0c40fca]::private::format_err<unknown>
  1803. 140.49 s > at <unknown source file>:<unknown line>
  1804. 140.49 s > 4: gammalooprs[d7a7c067ebd19583]::integrands::process::ir::evaluate_profile_momentum_point_arb::<gammalooprs[d7a7c067ebd19583]::integrands::process::amplitude::AmplitudeIntegrand><unknown>
  1805. 140.49 s > at <unknown source file>:<unknown line>
  1806. 140.49 s > 5: <gammalooprs[d7a7c067ebd19583]::integrands::process::amplitude::AmplitudeIntegrand>::test_single_ir_limit_impl<unknown>
  1807. 140.49 s > at <unknown source file>:<unknown line>
  1808. 140.49 s > 6: gammalooprs[d7a7c067ebd19583]::integrands::process::ir::run_ir_profile::<gammalooprs[d7a7c067ebd19583]::integrands::process::amplitude::AmplitudeIntegrand, <gammalooprs[d7a7c067ebd19583]::integrands::process::amplitude::AmplitudeIntegrand>::enumerate_ir_limits, <gammalooprs[d7a7c067ebd19583]::integrands::process::amplitude::AmplitudeIntegrand>::graph_cut_definitions, <gammalooprs[d7a7c067ebd19583]::integrands::process::amplitude::AmplitudeIntegrand>::test_single_ir_limit_impl><unknown>
  1809. 140.49 s > at <unknown source file>:<unknown line>
  1810. 140.49 s > 7: <gammalooprs[d7a7c067ebd19583]::integrands::process::amplitude::AmplitudeIntegrand>::test_ir<unknown>
  1811. 140.49 s > at <unknown source file>:<unknown line>
  1812. 140.49 s > 8: <gammaloop_api[92ae732909e47e14]::commands::profile::Profile>::run<unknown>
  1813. 140.49 s > at <unknown source file>:<unknown line>
  1814. 140.49 s > 9: test_runs[3e7a390caee4e338]::profile_bulk::massless_triangle_bulk_profile_passes<unknown>
  1815. 140.49 s > at <unknown source file>:<unknown line>
  1816. 140.49 s > 10: <test_runs[3e7a390caee4e338]::profile_bulk::massless_triangle_bulk_profile_passes::{closure#0} as core[940e698046960fd5]::ops::function::FnOnce<()>>::call_once<unknown>
  1817. 140.49 s > at <unknown source file>:<unknown line>
  1818. 140.49 s > 11: test[75d6903177b1d7e9]::__rust_begin_short_backtrace::<core[940e698046960fd5]::result::Result<(), alloc[2ea6bcb46fca0c42]::string::String>, fn() -> core[940e698046960fd5]::result::Result<(), alloc[2ea6bcb46fca0c42]::string::String>><unknown>
  1819. 140.49 s > at <unknown source file>:<unknown line>
  1820. 140.49 s > 12: test[75d6903177b1d7e9]::run_test::{closure#0}<unknown>
  1821. 140.49 s > at <unknown source file>:<unknown line>
  1822. 140.49 s > 13: std[bcb96dfbba0ab899]::sys::backtrace::__rust_begin_short_backtrace::<test[75d6903177b1d7e9]::run_test::{closure#1}, ()><unknown>
  1823. 140.49 s > at <unknown source file>:<unknown line>
  1824. 140.49 s > 14: <std[bcb96dfbba0ab899]::thread::lifecycle::spawn_unchecked<test[75d6903177b1d7e9]::run_test::{closure#1}, ()>::{closure#1} as core[940e698046960fd5]::ops::function::FnOnce<()>>::call_once::{shim:vtable#0}<unknown>
  1825. 140.49 s > at <unknown source file>:<unknown line>
  1826. 140.49 s > 15: <std[bcb96dfbba0ab899]::sys::thread::unix::Thread>::new::thread_start<unknown>
  1827. 140.49 s > at <unknown source file>:<unknown line>
  1828. 140.49 s > 16: start_thread<unknown>
  1829. 140.49 s > at <unknown source file>:<unknown line>
  1830. 140.49 s > 17: __clone3<unknown>
  1831. 140.49 s > at <unknown source file>:<unknown line>
  1832. 140.49 s >
  1833. 140.49 s > Run with COLORBT_SHOW_HIDDEN=1 environment variable to disable frame filtering.
  1834. 140.49 s > Run with RUST_BACKTRACE=full to include source snippets.
  1835. 140.49 s > Warning: SpanTrace capture is Unsupported.
  1836. 140.49 s > Ensure that you've setup a tracing-error ErrorLayer and the semver versions are compatible
  1837. 140.49 s > system-out
  1838. 140.49 s > running 1 test
  1839. 140.49 s > test profile_bulk::massless_triangle_bulk_profile_passes ... FAILED
  1840. 140.49 s >
  1841. 140.49 s > failures:
  1842. 140.49 s >
  1843. 140.49 s > failures:
  1844. 140.49 s > profile_bulk::massless_triangle_bulk_profile_passes
  1845. 140.49 s >
  1846. 140.49 s > test result: FAILED. 0 passed; 1 failed; 0 ignored; 0 measured; 82 filtered out; finished in 0.36s
  1847. 140.49 s > system-err
  1848. 140.49 s > [2026-08-28 10:41:17.375] @gammaloop_api::se... INFO : Running command import model scalars
  1849. 140.49 s > [2026-08-28 10:41:17.375] @import::model INFO : Loading built-in JSON model scalars-default
  1850. 140.49 s > [2026-08-28 10:41:17.380] @gammalooprs::model INFO : The following 2 external parameters were forced to zero by the restriction card:
  1851. 140.49 s > width_scalar_1, width_scalar_2
  1852. 140.49 s > [2026-08-28 10:41:17.381] @gammaloop_api::se... INFO : Running command import graphs ./tests/resources/graphs/massless_triangle.dot
  1853. 140.49 s > [2026-08-28 10:41:17.381] @commands::import INFO : Loading graphs from '/build/source/tests/resources/graphs/massless_triangle.dot'
  1854. 140.49 s > [2026-08-28 10:41:17.387] @gammaloop_api::se... INFO : Running command generate
  1855. 140.49 s > [2026-08-28 10:41:17.496] @commands::generate INFO :
  1856. 140.49 s > Integrand generation summary
  1857. 140.49 s > peak RAM 65.37 MiB | cores 1
  1858. 140.49 s > ╭───────────┬─────────────────────┬─────────┬────────────┬────────────┬────────────────┬─────────────╮
  1859. 140.49 s > │ integrand │ graph │ # evals │ expr build │ spenso │ symbolica eval │ compile │
  1860. 140.49 s > ├───────────┼─────────────────────┼─────────┼────────────┼────────────┼────────────────┼─────────────┤
  1861. 140.49 s > │ default │ massless_triangle_0 │ 9 │ 17ms (54%) │ 2ms (6.7%) │ 13ms (40%) │ 0ms (0.00%) │
  1862. 140.49 s > ├───────────┼─────────────────────┼─────────┼────────────┼────────────┼────────────────┼─────────────┤
  1863. 140.49 s > │ Total │ │ 9 │ 17ms (54%) │ 2ms (6.7%) │ 13ms (40%) │ 0ms (0.00%) │
  1864. 140.49 s > ╰───────────┴─────────────────────┴─────────┴────────────┴────────────┴────────────────┴─────────────╯
  1865. 140.49 s > [2026-08-28 10:41:17.498] @process::amplitude INFO : Input is above threshold: 2 existing threshold E-surfaces across 1/1 graph groups
  1866. 140.49 s > [2026-08-28 10:41:17.498] @process::amplitude INFO : overlap structure of group 0: [2: [0(1,5), 1(1,3)]]
  1867. 140.49 s > Error:
  1868. 140.49 s > 0: IR profiling requested arbitrary precision but received a quad-precision result
  1869. 140.49 s >
  1870. 140.49 s > Location:
  1871. 140.49 s > crates/gammalooprs/src/integrands/process/ir.rs:2123
  1872. 140.49 s >
  1873. 140.49 s > ━━━━━━━━━━━━━━━━━━━━━━━━━━━━━━━━━━ BACKTRACE ━━━━━━━━━━━━━━━━━━━━━━━━━━━━━━━━━━━
  1874. 140.49 s > 1: <color_eyre[51793ea62743adbd]::config::EyreHook>::into_eyre_hook::{closure#0}<unknown>
  1875. 140.49 s > at <unknown source file>:<unknown line>
  1876. 140.49 s > 2: eyre[cb2fd339c0c40fca]::capture_handler<unknown>
  1877. 140.49 s > at <unknown source file>:<unknown line>
  1878. 140.49 s > 3: eyre[cb2fd339c0c40fca]::private::format_err<unknown>
  1879. 140.49 s > at <unknown source file>:<unknown line>
  1880. 140.49 s > 4: gammalooprs[d7a7c067ebd19583]::integrands::process::ir::evaluate_profile_momentum_point_arb::<gammalooprs[d7a7c067ebd19583]::integrands::process::amplitude::AmplitudeIntegrand><unknown>
  1881. 140.49 s > at <unknown source file>:<unknown line>
  1882. 140.49 s > 5: <gammalooprs[d7a7c067ebd19583]::integrands::process::amplitude::AmplitudeIntegrand>::test_single_ir_limit_impl<unknown>
  1883. 140.49 s > at <unknown source file>:<unknown line>
  1884. 140.49 s > 6: gammalooprs[d7a7c067ebd19583]::integrands::process::ir::run_ir_profile::<gammalooprs[d7a7c067ebd19583]::integrands::process::amplitude::AmplitudeIntegrand, <gammalooprs[d7a7c067ebd19583]::integrands::process::amplitude::AmplitudeIntegrand>::enumerate_ir_limits, <gammalooprs[d7a7c067ebd19583]::integrands::process::amplitude::AmplitudeIntegrand>::graph_cut_definitions, <gammalooprs[d7a7c067ebd19583]::integrands::process::amplitude::AmplitudeIntegrand>::test_single_ir_limit_impl><unknown>
  1885. 140.49 s > at <unknown source file>:<unknown line>
  1886. 140.49 s > 7: <gammalooprs[d7a7c067ebd19583]::integrands::process::amplitude::AmplitudeIntegrand>::test_ir<unknown>
  1887. 140.49 s > at <unknown source file>:<unknown line>
  1888. 140.49 s > 8: <gammaloop_api[92ae732909e47e14]::commands::profile::Profile>::run<unknown>
  1889. 140.49 s > at <unknown source file>:<unknown line>
  1890. 140.49 s > 9: test_runs[3e7a390caee4e338]::profile_bulk::massless_triangle_bulk_profile_passes<unknown>
  1891. 140.49 s > at <unknown source file>:<unknown line>
  1892. 140.49 s > 10: <test_runs[3e7a390caee4e338]::profile_bulk::massless_triangle_bulk_profile_passes::{closure#0} as core[940e698046960fd5]::ops::function::FnOnce<()>>::call_once<unknown>
  1893. 140.49 s > at <unknown source file>:<unknown line>
  1894. 140.49 s > 11: test[75d6903177b1d7e9]::__rust_begin_short_backtrace::<core[940e698046960fd5]::result::Result<(), alloc[2ea6bcb46fca0c42]::string::String>, fn() -> core[940e698046960fd5]::result::Result<(), alloc[2ea6bcb46fca0c42]::string::String>><unknown>
  1895. 140.49 s > at <unknown source file>:<unknown line>
  1896. 140.49 s > 12: test[75d6903177b1d7e9]::run_test::{closure#0}<unknown>
  1897. 140.49 s > at <unknown source file>:<unknown line>
  1898. 140.49 s > 13: std[bcb96dfbba0ab899]::sys::backtrace::__rust_begin_short_backtrace::<test[75d6903177b1d7e9]::run_test::{closure#1}, ()><unknown>
  1899. 140.49 s > at <unknown source file>:<unknown line>
  1900. 140.49 s > 14: <std[bcb96dfbba0ab899]::thread::lifecycle::spawn_unchecked<test[75d6903177b1d7e9]::run_test::{closure#1}, ()>::{closure#1} as core[940e698046960fd5]::ops::function::FnOnce<()>>::call_once::{shim:vtable#0}<unknown>
  1901. 140.49 s > at <unknown source file>:<unknown line>
  1902. 140.49 s > 15: <std[bcb96dfbba0ab899]::sys::thread::unix::Thread>::new::thread_start<unknown>
  1903. 140.49 s > at <unknown source file>:<unknown line>
  1904. 140.49 s > 16: start_thread<unknown>
  1905. 140.49 s > at <unknown source file>:<unknown line>
  1906. 140.49 s > 17: __clone3<unknown>
  1907. 140.49 s > at <unknown source file>:<unknown line>
  1908. 140.49 s >
  1909. 140.49 s > Run with COLORBT_SHOW_HIDDEN=1 environment variable to disable frame filtering.
  1910. 140.49 s > Run with RUST_BACKTRACE=full to include source snippets.
  1911. 140.49 s > Warning: SpanTrace capture is Unsupported.
  1912. 140.49 s > Ensure that you've setup a tracing-error ErrorLayer and the semver versions are compatible
  1913. 140.49 s >
  1914. 140.49 s > 6. gammaloop-integration-tests::test_runs::profile_bulk::scalar_self_energy_amp_bulk_profile_passes
  1915. 140.49 s > failure: test failure with exit code 101
  1916. 140.49 s > Error:
  1917. 140.49 s > 0: IR profiling requested arbitrary precision but received a quad-precision result
  1918. 140.49 s >
  1919. 140.49 s > Location:
  1920. 140.49 s > crates/gammalooprs/src/integrands/process/ir.rs:2123
  1921. 140.49 s >
  1922. 140.49 s > ━━━━━━━━━━━━━━━━━━━━━━━━━━━━━━━━━━ BACKTRACE ━━━━━━━━━━━━━━━━━━━━━━━━━━━━━━━━━━━
  1923. 140.49 s > 1: <color_eyre[51793ea62743adbd]::config::EyreHook>::into_eyre_hook::{closure#0}<unknown>
  1924. 140.49 s > at <unknown source file>:<unknown line>
  1925. 140.49 s > 2: eyre[cb2fd339c0c40fca]::capture_handler<unknown>
  1926. 140.49 s > at <unknown source file>:<unknown line>
  1927. 140.49 s > 3: eyre[cb2fd339c0c40fca]::private::format_err<unknown>
  1928. 140.49 s > at <unknown source file>:<unknown line>
  1929. 140.49 s > 4: gammalooprs[d7a7c067ebd19583]::integrands::process::ir::evaluate_profile_momentum_point_arb::<gammalooprs[d7a7c067ebd19583]::integrands::process::amplitude::AmplitudeIntegrand><unknown>
  1930. 140.49 s > at <unknown source file>:<unknown line>
  1931. 140.49 s > 5: <gammalooprs[d7a7c067ebd19583]::integrands::process::amplitude::AmplitudeIntegrand>::test_single_ir_limit_impl<unknown>
  1932. 140.49 s > at <unknown source file>:<unknown line>
  1933. 140.49 s > 6: gammalooprs[d7a7c067ebd19583]::integrands::process::ir::run_ir_profile::<gammalooprs[d7a7c067ebd19583]::integrands::process::amplitude::AmplitudeIntegrand, <gammalooprs[d7a7c067ebd19583]::integrands::process::amplitude::AmplitudeIntegrand>::enumerate_ir_limits, <gammalooprs[d7a7c067ebd19583]::integrands::process::amplitude::AmplitudeIntegrand>::graph_cut_definitions, <gammalooprs[d7a7c067ebd19583]::integrands::process::amplitude::AmplitudeIntegrand>::test_single_ir_limit_impl><unknown>
  1934. 140.49 s > at <unknown source file>:<unknown line>
  1935. 140.49 s > 7: <gammalooprs[d7a7c067ebd19583]::integrands::process::amplitude::AmplitudeIntegrand>::test_ir<unknown>
  1936. 140.49 s > at <unknown source file>:<unknown line>
  1937. 140.49 s > 8: <gammaloop_api[92ae732909e47e14]::commands::profile::Profile>::run<unknown>
  1938. 140.49 s > at <unknown source file>:<unknown line>
  1939. 140.49 s > 9: test_runs[3e7a390caee4e338]::profile_bulk::scalar_self_energy_amp_bulk_profile_passes<unknown>
  1940. 140.49 s > at <unknown source file>:<unknown line>
  1941. 140.49 s > 10: <test_runs[3e7a390caee4e338]::profile_bulk::scalar_self_energy_amp_bulk_profile_passes::{closure#0} as core[940e698046960fd5]::ops::function::FnOnce<()>>::call_once<unknown>
  1942. 140.49 s > at <unknown source file>:<unknown line>
  1943. 140.49 s > 11: test[75d6903177b1d7e9]::__rust_begin_short_backtrace::<core[940e698046960fd5]::result::Result<(), alloc[2ea6bcb46fca0c42]::string::String>, fn() -> core[940e698046960fd5]::result::Result<(), alloc[2ea6bcb46fca0c42]::string::String>><unknown>
  1944. 140.49 s > at <unknown source file>:<unknown line>
  1945. 140.49 s > 12: test[75d6903177b1d7e9]::run_test::{closure#0}<unknown>
  1946. 140.49 s > at <unknown source file>:<unknown line>
  1947. 140.49 s > 13: std[bcb96dfbba0ab899]::sys::backtrace::__rust_begin_short_backtrace::<test[75d6903177b1d7e9]::run_test::{closure#1}, ()><unknown>
  1948. 140.49 s > at <unknown source file>:<unknown line>
  1949. 140.49 s > 14: <std[bcb96dfbba0ab899]::thread::lifecycle::spawn_unchecked<test[75d6903177b1d7e9]::run_test::{closure#1}, ()>::{closure#1} as core[940e698046960fd5]::ops::function::FnOnce<()>>::call_once::{shim:vtable#0}<unknown>
  1950. 140.49 s > at <unknown source file>:<unknown line>
  1951. 140.49 s > 15: <std[bcb96dfbba0ab899]::sys::thread::unix::Thread>::new::thread_start<unknown>
  1952. 140.49 s > at <unknown source file>:<unknown line>
  1953. 140.49 s > 16: start_thread<unknown>
  1954. 140.49 s > at <unknown source file>:<unknown line>
  1955. 140.49 s > 17: __clone3<unknown>
  1956. 140.49 s > at <unknown source file>:<unknown line>
  1957. 140.49 s >
  1958. 140.49 s > Run with COLORBT_SHOW_HIDDEN=1 environment variable to disable frame filtering.
  1959. 140.49 s > Run with RUST_BACKTRACE=full to include source snippets.
  1960. 140.49 s > Warning: SpanTrace capture is Unsupported.
  1961. 140.49 s > Ensure that you've setup a tracing-error ErrorLayer and the semver versions are compatible
  1962. 140.49 s > system-out
  1963. 140.49 s > running 1 test
  1964. 140.49 s > test profile_bulk::scalar_self_energy_amp_bulk_profile_passes ... FAILED
  1965. 140.49 s >
  1966. 140.49 s > failures:
  1967. 140.49 s >
  1968. 140.49 s > failures:
  1969. 140.49 s > profile_bulk::scalar_self_energy_amp_bulk_profile_passes
  1970. 140.49 s >
  1971. 140.49 s > test result: FAILED. 0 passed; 1 failed; 0 ignored; 0 measured; 82 filtered out; finished in 0.71s
  1972. 140.49 s > system-err
  1973. 140.49 s > [2026-08-28 10:41:17.537] @gammaloop_api::se... INFO : Running command import model ./assets/models/json/scalars/scalars.json
  1974. 140.49 s > [2026-08-28 10:41:17.537] @import::model INFO : Loading JSON model scalars-default from /build/source/assets/models/json/scalars/scalars
  1975. 140.49 s > [2026-08-28 10:41:17.544] @gammalooprs::model INFO : The following 2 external parameters were forced to zero by the restriction card:
  1976. 140.49 s > width_scalar_1, width_scalar_2
  1977. 140.49 s > [2026-08-28 10:41:17.550] @gammaloop_api::se... INFO : Running command import graphs ./tests/resources/graphs/scalar_self_energy_amp.dot
  1978. 140.49 s > [2026-08-28 10:41:17.550] @commands::import INFO : Loading graphs from '/build/source/tests/resources/graphs/scalar_self_energy_amp.dot'
  1979. 140.49 s > [2026-08-28 10:41:17.561] @gammaloop_api::se... INFO : Running command generate
  1980. 140.49 s > [2026-08-28 10:41:17.986] @commands::generate INFO :
  1981. 140.49 s > Integrand generation summary
  1982. 140.49 s > peak RAM 70.89 MiB | cores 1
  1983. 140.49 s > ╭───────────┬────────────────────────┬─────────┬─────────────┬─────────────┬────────────────┬─────────────╮
  1984. 140.49 s > │ integrand │ graph │ # evals │ expr build │ spenso │ symbolica eval │ compile │
  1985. 140.49 s > ├───────────┼────────────────────────┼─────────┼─────────────┼─────────────┼────────────────┼─────────────┤
  1986. 140.49 s > │ default │ scalar_self_energy_amp │ 6 │ 345ms (93%) │ 15ms (4.3%) │ 8ms (2.4%) │ 0ms (0.00%) │
  1987. 140.49 s > ├───────────┼────────────────────────┼─────────┼─────────────┼─────────────┼────────────────┼─────────────┤
  1988. 140.49 s > │ Total │ │ 6 │ 345ms (93%) │ 15ms (4.3%) │ 8ms (2.4%) │ 0ms (0.00%) │
  1989. 140.49 s > ╰───────────┴────────────────────────┴─────────┴─────────────┴─────────────┴────────────────┴─────────────╯
  1990. 140.49 s > [2026-08-28 10:41:17.988] @process::amplitude INFO : Input is above threshold: 2 existing threshold E-surfaces across 1/1 graph groups
  1991. 140.49 s > [2026-08-28 10:41:17.988] @process::amplitude INFO : overlap structure of group 0: [2: [2(1,5), 4(2,3,5)]]
  1992. 140.49 s > Error:
  1993. 140.49 s > 0: IR profiling requested arbitrary precision but received a quad-precision result
  1994. 140.49 s >
  1995. 140.49 s > Location:
  1996. 140.49 s > crates/gammalooprs/src/integrands/process/ir.rs:2123
  1997. 140.49 s >
  1998. 140.49 s > ━━━━━━━━━━━━━━━━━━━━━━━━━━━━━━━━━━ BACKTRACE ━━━━━━━━━━━━━━━━━━━━━━━━━━━━━━━━━━━
  1999. 140.49 s > 1: <color_eyre[51793ea62743adbd]::config::EyreHook>::into_eyre_hook::{closure#0}<unknown>
  2000. 140.49 s > at <unknown source file>:<unknown line>
  2001. 140.49 s > 2: eyre[cb2fd339c0c40fca]::capture_handler<unknown>
  2002. 140.49 s > at <unknown source file>:<unknown line>
  2003. 140.49 s > 3: eyre[cb2fd339c0c40fca]::private::format_err<unknown>
  2004. 140.49 s > at <unknown source file>:<unknown line>
  2005. 140.49 s > 4: gammalooprs[d7a7c067ebd19583]::integrands::process::ir::evaluate_profile_momentum_point_arb::<gammalooprs[d7a7c067ebd19583]::integrands::process::amplitude::AmplitudeIntegrand><unknown>
  2006. 140.49 s > at <unknown source file>:<unknown line>
  2007. 140.49 s > 5: <gammalooprs[d7a7c067ebd19583]::integrands::process::amplitude::AmplitudeIntegrand>::test_single_ir_limit_impl<unknown>
  2008. 140.49 s > at <unknown source file>:<unknown line>
  2009. 140.49 s > 6: gammalooprs[d7a7c067ebd19583]::integrands::process::ir::run_ir_profile::<gammalooprs[d7a7c067ebd19583]::integrands::process::amplitude::AmplitudeIntegrand, <gammalooprs[d7a7c067ebd19583]::integrands::process::amplitude::AmplitudeIntegrand>::enumerate_ir_limits, <gammalooprs[d7a7c067ebd19583]::integrands::process::amplitude::AmplitudeIntegrand>::graph_cut_definitions, <gammalooprs[d7a7c067ebd19583]::integrands::process::amplitude::AmplitudeIntegrand>::test_single_ir_limit_impl><unknown>
  2010. 140.49 s > at <unknown source file>:<unknown line>
  2011. 140.49 s > 7: <gammalooprs[d7a7c067ebd19583]::integrands::process::amplitude::AmplitudeIntegrand>::test_ir<unknown>
  2012. 140.49 s > at <unknown source file>:<unknown line>
  2013. 140.49 s > 8: <gammaloop_api[92ae732909e47e14]::commands::profile::Profile>::run<unknown>
  2014. 140.49 s > at <unknown source file>:<unknown line>
  2015. 140.49 s > 9: test_runs[3e7a390caee4e338]::profile_bulk::scalar_self_energy_amp_bulk_profile_passes<unknown>
  2016. 140.49 s > at <unknown source file>:<unknown line>
  2017. 140.49 s > 10: <test_runs[3e7a390caee4e338]::profile_bulk::scalar_self_energy_amp_bulk_profile_passes::{closure#0} as core[940e698046960fd5]::ops::function::FnOnce<()>>::call_once<unknown>
  2018. 140.49 s > at <unknown source file>:<unknown line>
  2019. 140.49 s > 11: test[75d6903177b1d7e9]::__rust_begin_short_backtrace::<core[940e698046960fd5]::result::Result<(), alloc[2ea6bcb46fca0c42]::string::String>, fn() -> core[940e698046960fd5]::result::Result<(), alloc[2ea6bcb46fca0c42]::string::String>><unknown>
  2020. 140.49 s > at <unknown source file>:<unknown line>
  2021. 140.49 s > 12: test[75d6903177b1d7e9]::run_test::{closure#0}<unknown>
  2022. 140.49 s > at <unknown source file>:<unknown line>
  2023. 140.49 s > 13: std[bcb96dfbba0ab899]::sys::backtrace::__rust_begin_short_backtrace::<test[75d6903177b1d7e9]::run_test::{closure#1}, ()><unknown>
  2024. 140.49 s > at <unknown source file>:<unknown line>
  2025. 140.49 s > 14: <std[bcb96dfbba0ab899]::thread::lifecycle::spawn_unchecked<test[75d6903177b1d7e9]::run_test::{closure#1}, ()>::{closure#1} as core[940e698046960fd5]::ops::function::FnOnce<()>>::call_once::{shim:vtable#0}<unknown>
  2026. 140.49 s > at <unknown source file>:<unknown line>
  2027. 140.49 s > 15: <std[bcb96dfbba0ab899]::sys::thread::unix::Thread>::new::thread_start<unknown>
  2028. 140.49 s > at <unknown source file>:<unknown line>
  2029. 140.49 s > 16: start_thread<unknown>
  2030. 140.49 s > at <unknown source file>:<unknown line>
  2031. 140.49 s > 17: __clone3<unknown>
  2032. 140.49 s > at <unknown source file>:<unknown line>
  2033. 140.49 s >
  2034. 140.49 s > Run with COLORBT_SHOW_HIDDEN=1 environment variable to disable frame filtering.
  2035. 140.49 s > Run with RUST_BACKTRACE=full to include source snippets.
  2036. 140.49 s > Warning: SpanTrace capture is Unsupported.
  2037. 140.49 s > Ensure that you've setup a tracing-error ErrorLayer and the semver versions are compatible
  2038. 140.49 s >
  2039. 140.49 s > 7. gammaloop-integration-tests::uv::dod2_bubble_uv
  2040. 140.49 s > failure: test failure with exit code 101
  2041. 140.49 s > system-out
  2042. 140.49 s > running 1 test
  2043. 140.49 s > +-------------+-----------------+---------+--------+----------+-----------------------------------------------------------------------------------------------------------------------+-------+
  2044. 140.49 s > | case | check | graph | status | sigma | threshold | error |
  2045. 140.49 s > +-------------+-----------------+---------+--------+----------+-----------------------------------------------------------------------------------------------------------------------+-------+
  2046. 140.49 s > | dod2_bubble | uv_profile | - | FAIL | - | - | - |
  2047. 140.49 s > +-------------+-----------------+---------+--------+----------+-----------------------------------------------------------------------------------------------------------------------+-------+
  2048. 140.49 s > | dod2_bubble | m_uv.inspect | inspect | pass | - | best inspect relative delta 1.000e0 >= 1000*accuracy 1.000e-7 (accuracy=1.000e-10, exponent=+8.0, seed=0, probes=10) | - |
  2049. 140.49 s > +-------------+-----------------+---------+--------+----------+-----------------------------------------------------------------------------------------------------------------------+-------+
  2050. 140.49 s > | dod2_bubble | m_uv.integrated | GL0 | pass | 0.0sigma | compatible within 2sigma | - |
  2051. 140.49 s > +-------------+-----------------+---------+--------+----------+-----------------------------------------------------------------------------------------------------------------------+-------+
  2052. 140.49 s > | dod2_bubble | rls.inspect | inspect | pass | - | best inspect relative delta 2.822e-3 >= 1000*accuracy 1.000e-7 (accuracy=1.000e-10, exponent=+2.0, seed=1, probes=10) | - |
  2053. 140.49 s > +-------------+-----------------+---------+--------+----------+-----------------------------------------------------------------------------------------------------------------------+-------+
  2054. 140.49 s > | dod2_bubble | rls.integrated | GL0 | pass | 0.0sigma | compatible within 2sigma | - |
  2055. 140.49 s > +-------------+-----------------+---------+--------+----------+-----------------------------------------------------------------------------------------------------------------------+-------+
  2056. 140.49 s > | dod2_bubble | mu_r.inspect | inspect | pass | - | best inspect relative delta 6.951e-1 >= 1000*accuracy 1.000e-7 (accuracy=1.000e-10, exponent=+0.0, seed=0, probes=10) | - |
  2057. 140.49 s > +-------------+-----------------+---------+--------+----------+-----------------------------------------------------------------------------------------------------------------------+-------+
  2058. 140.49 s > | dod2_bubble | target | - | pass | - | 2sigma | - |
  2059. 140.49 s > +-------------+-----------------+---------+--------+----------+-----------------------------------------------------------------------------------------------------------------------+-------+
  2060. 140.49 s > test dod2_bubble_uv ... FAILED
  2061. 140.49 s >
  2062. 140.49 s > failures:
  2063. 140.49 s >
  2064. 140.49 s > failures:
  2065. 140.49 s > dod2_bubble_uv
  2066. 140.49 s >
  2067. 140.49 s > test result: FAILED. 0 passed; 1 failed; 0 ignored; 0 measured; 24 filtered out; finished in 40.44s
  2068. 140.49 s > system-err
  2069. 140.49 s > [2026-08-28 10:41:19.261] @gammaloop_api::se... INFO : Running command run generate
  2070. 140.49 s > [2026-08-28 10:41:19.261] @gammaloop_api::se... INFO : Starting command block generate
  2071. 140.49 s > [2026-08-28 10:41:19.261] @gammaloop_api::se... INFO : Running command import model scalars-default.json
  2072. 140.49 s > [2026-08-28 10:41:19.261] @import::model INFO : Loading built-in JSON model scalars-default
  2073. 140.49 s > [2026-08-28 10:41:19.265] @gammalooprs::model INFO : The following 2 external parameters were forced to zero by the restriction card:
  2074. 140.49 s > width_scalar_1, width_scalar_2
  2075. 140.49 s > [2026-08-28 10:41:19.266] @gammaloop_api::se... INFO : Running command remove processes
  2076. 140.49 s > [2026-08-28 10:41:19.266] @gammaloop_api::se... INFO : Running command set global kv global.generation.uv.generate_integrated=true
  2077. 140.49 s > [2026-08-28 10:41:19.267] @gammaloop_api::se... INFO : Running command import graphs ./tests/resources/graphs/scalar/dod2_bubble.dot -p bubble_dod2 -i scalar_bubble_below_thres
  2078. 140.50 s > [2026-08-28 10:41:19.267] @commands::import INFO : Loading graphs from '/build/source/tests/resources/graphs/scalar/dod2_bubble.dot'
  2079. 140.50 s > [2026-08-28 10:41:19.269] @gammaloop_api::se... INFO : Running command generate existing -p bubble_dod2 -i scalar_bubble_below_thres
  2080. 140.50 s > [2026-08-28 10:41:19.271] @approx::local_4d [{#uv, #inspect, #integrated}] DEBUG : Rescaled momenta expanded
  2081. 140.50 s > field value
  2082. 140.50 s > res n-terms: 1, byte size: 585,expr:
  2083. 140.50 s > -SCALAR_COUPLING²·q₀(αᵉ².¹)·q₀(αᵉ³.¹)·q₂(αᵉ².¹)·q₂(αᵉ³.¹)
  2084. 140.50 s > /(t²·denom(3,-q₀-q₂/t,mass_scalar_2²,-mass_scalar_2²+2·(q₀.q₂)/t+(q₂.q₂)/t²+(q₀.q₀))
  2085. 140.50 s > ·denom(2,q₂/t,mass_scalar_2²,-mass_scalar_2²+(q₂.q₂)/t²))
  2086. 140.50 s > [2026-08-28 10:41:19.283] @approx::local_4d [{#uv, #inspect, #integrated}] DEBUG : Rescaled momenta expanded
  2087. 140.50 s > field value
  2088. 140.50 s > res n-terms: 1, byte size: 3,expr:
  2089. 140.50 s > 1
  2090. 140.50 s > [2026-08-28 10:41:19.283] @approx::final_integrand[{#generation, #profile, #uv, #graph, #summary}] DEBUG : Computed global numerator
  2091. 140.50 s > field value
  2092. 140.50 s > global_num n-terms: 1, byte size: 4,expr:
  2093. 140.50 s > 1/2
  2094. 140.50 s > span build_3d{span_context=true graph=GL0 current=subgraph=0, topo_order=0, dod=0}
  2095. 140.50 s > [2026-08-28 10:41:19.286] @uv::approx [{#generation, #uv, #fourd}] DEBUG : Computing 4D
  2096. 140.50 s > field value
  2097. 140.50 s > simple subgraph(S_11,S_y)*Approx(subgraph(S_y,0)) of GL0
  2098. 140.50 s > span compute_4d{span_context=true graph=GL0 current=subgraph=y, topo_order=1, dod=2 given=subgraph=0, topo_order=0, dod=0 reduced=SubSet { set: BitVec<usize, bitvec::order::Lsb0> { addr: 0x7fffec00a8f0, head: 000000, bits: 6, capacity: 64 } [0, 0, 1, 1, 1, 1], id: PhantomData<linnet::half_edge::involution::Hedge> }}
  2099. 140.50 s > [2026-08-28 10:41:19.287] @approx::local_4d [{#uv, #algebra, #integrated, #start}] DEBUG :
  2100. 140.50 s > field value
  2101. 140.50 s > integrand n-terms: 1, byte size: 409,expr:
  2102. 140.50 s > SCALAR_COUPLING²·(q₀(αᵉ³.¹)+q₃(αᵉ³.¹))·q₀(αᵉ².¹)·q₀(αᵉ³.¹)·q₂(αᵉ².¹)
  2103. 140.50 s > /(denom(2,q₂,mass_scalar_2²,-mass_scalar_2²+(q₂.q₂))·denom(3,q₃,mass_scalar_2²,-mass_scalar_2²+(q₃.q₃)))
  2104. 140.50 s > reduced y
  2105. 140.50 s > span grow{span_context=true current=subgraph=y, topo_order=1, dod=2 given=subgraph=0, topo_order=0, dod=0}
  2106. 140.50 s > [2026-08-28 10:41:19.288] @approx::local_4d [{#uv, #inspect, #integrated}] DEBUG : Rescaled momenta expanded
  2107. 140.50 s > field value
  2108. 140.50 s > res n-terms: 1, byte size: 585,expr:
  2109. 140.50 s > -SCALAR_COUPLING²·q₀(αᵉ².¹)·q₀(αᵉ³.¹)·q₂(αᵉ².¹)·q₂(αᵉ³.¹)
  2110. 140.50 s > /(t²·denom(3,-q₀-q₂/t,mass_scalar_2²,-mass_scalar_2²+2·(q₀.q₂)/t+(q₂.q₂)/t²+(q₀.q₀))
  2111. 140.50 s > ·denom(2,q₂/t,mass_scalar_2²,-mass_scalar_2²+(q₂.q₂)/t²))
  2112. 140.50 s > span t{span_context=true current=subgraph=y, topo_order=1, dod=2 given=subgraph=0, topo_order=0, dod=0}
  2113. 140.50 s > [2026-08-28 10:41:19.288] @approx::local_4d [{#uv, #integrated, #rescaled}] DEBUG : Rescaled expanded
  2114. 140.50 s > field value
  2115. 140.50 s > n_loops 1
  2116. 140.50 s > res n-terms: 1, byte size: 707,expr:
  2117. 140.50 s > -SCALAR_COUPLING²·q₀(αᵉ².¹)·q₀(αᵉ³.¹)·q₂(αᵉ².¹)·q₂(αᵉ³.¹)
  2118. 140.50 s > /(t²·denom(3,-q₂,mUVexp²+t²·mass_scalar_2²,-mUV²+t²·(-mass_scalar_2²+2·(q₀.q₂)/t+(q₂.q₂)/t²+(q₀.q₀))+t²·mUVexp²)
  2119. 140.50 s > ·denom(2,q₂,mUVexp²+t²·mass_scalar_2²,-mUV²+t²·(-mass_scalar_2²+(q₂.q₂)/t²)+t²·mUVexp²))
  2120. 140.50 s > span t{span_context=true current=subgraph=y, topo_order=1, dod=2 given=subgraph=0, topo_order=0, dod=0}
  2121. 140.50 s > [2026-08-28 10:41:19.289] @approx::local_4d [{#uv, #integrated, #series}] DEBUG : Series expanded
  2122. 140.50 s > field value
  2123. 140.50 s > res n-terms: 3, byte size: 1896,expr:
  2124. 140.50 s > (1/2·SCALAR_COUPLING²·(2·mUVexp²-2·mass_scalar_2²)/(denom(2,q₂,mUVexp²,-mUV²+(q₂.q₂))²·denom(3,-q₂,mUVexp²,-mUV²+(q₂.q₂)))
  2125. 140.50 s > -SCALAR_COUPLING²
  2126. 140.50 s > ·(-1/2·(2·mUVexp²-2·mass_scalar_2²+2·(q₀.q₀))/denom(3,-q₂,mUVexp²,-mUV²+(q₂.q₂))
  2127. 140.50 s > +4·(q₀.q₂)²/denom(3,-q₂,mUVexp²,-mUV²+(q₂.q₂))²
  2128. 140.50 s > )/(denom(2,q₂,mUVexp²,-mUV²+(q₂.q₂))·denom(3,-q₂,mUVexp²,-mUV²+(q₂.q₂)))
  2129. 140.50 s > )·q₀(αᵉ².¹)·q₀(αᵉ³.¹)·q₂(αᵉ².¹)·q₂(αᵉ³.¹)
  2130. 140.50 s > +2·SCALAR_COUPLING²·(q₀.q₂)·q₀(αᵉ².¹)·q₀(αᵉ³.¹)·q₂(αᵉ².¹)·q₂(αᵉ³.¹)
  2131. 140.50 s > /(t·denom(2,q₂,mUVexp²,-mUV²+(q₂.q₂))·denom(3,-q₂,mUVexp²,-mUV²+(q₂.q₂))²)
  2132. 140.50 s > -SCALAR_COUPLING²·q₀(αᵉ².¹)·q₀(αᵉ³.¹)·q₂(αᵉ².¹)·q₂(αᵉ³.¹)
  2133. 140.50 s > /(t²·denom(2,q₂,mUVexp²,-mUV²+(q₂.q₂))·denom(3,-q₂,mUVexp²,-mUV²+(q₂.q₂)))
  2134. 140.50 s > span t{span_context=true current=subgraph=y, topo_order=1, dod=2 given=subgraph=0, topo_order=0, dod=0}
  2135. 140.50 s > [2026-08-28 10:41:19.289] @approx::local_4d [{#uv, #integrated, #series}] DEBUG : Evaluated at t = 1
  2136. 140.50 s > field value
  2137. 140.50 s > res n-terms: 3, byte size: 1880,expr:
  2138. 140.50 s > (1/2·SCALAR_COUPLING²·(2·mUVexp²-2·mass_scalar_2²)/(denom(2,q₂,mUVexp²,-mUV²+(q₂.q₂))²·denom(3,-q₂,mUVexp²,-mUV²+(q₂.q₂)))
  2139. 140.50 s > -SCALAR_COUPLING²
  2140. 140.50 s > ·(-1/2·(2·mUVexp²-2·mass_scalar_2²+2·(q₀.q₀))/denom(3,-q₂,mUVexp²,-mUV²+(q₂.q₂))
  2141. 140.50 s > +4·(q₀.q₂)²/denom(3,-q₂,mUVexp²,-mUV²+(q₂.q₂))²
  2142. 140.50 s > )/(denom(2,q₂,mUVexp²,-mUV²+(q₂.q₂))·denom(3,-q₂,mUVexp²,-mUV²+(q₂.q₂)))
  2143. 140.50 s > )·q₀(αᵉ².¹)·q₀(αᵉ³.¹)·q₂(αᵉ².¹)·q₂(αᵉ³.¹)
  2144. 140.50 s > -SCALAR_COUPLING²·q₀(αᵉ².¹)·q₀(αᵉ³.¹)·q₂(αᵉ².¹)·q₂(αᵉ³.¹)
  2145. 140.50 s > /(denom(2,q₂,mUVexp²,-mUV²+(q₂.q₂))·denom(3,-q₂,mUVexp²,-mUV²+(q₂.q₂)))
  2146. 140.50 s > +2·SCALAR_COUPLING²·(q₀.q₂)·q₀(αᵉ².¹)·q₀(αᵉ³.¹)·q₂(αᵉ².¹)·q₂(αᵉ³.¹)
  2147. 140.50 s > /(denom(2,q₂,mUVexp²,-mUV²+(q₂.q₂))·denom(3,-q₂,mUVexp²,-mUV²+(q₂.q₂))²)
  2148. 140.50 s > span t{span_context=true current=subgraph=y, topo_order=1, dod=2 given=subgraph=0, topo_order=0, dod=0}
  2149. 140.50 s > [2026-08-28 10:41:19.291] @approx::local_4d [{#uv, #collect, #integrated}] DEBUG : After gamma chain collection
  2150. 140.50 s > field value
  2151. 140.50 s > expr n-terms: 3, byte size: 1880,expr:
  2152. 140.50 s > (1/2·SCALAR_COUPLING²·(2·mUVexp²-2·mass_scalar_2²)/(denom(2,q₂,mUVexp²,-mUV²+(q₂.q₂))²·denom(3,-q₂,mUVexp²,-mUV²+(q₂.q₂)))
  2153. 140.50 s > -SCALAR_COUPLING²
  2154. 140.50 s > ·(-1/2·(2·mUVexp²-2·mass_scalar_2²+2·(q₀.q₀))/denom(3,-q₂,mUVexp²,-mUV²+(q₂.q₂))
  2155. 140.50 s > +4·(q₀.q₂)²/denom(3,-q₂,mUVexp²,-mUV²+(q₂.q₂))²
  2156. 140.50 s > )/(denom(2,q₂,mUVexp²,-mUV²+(q₂.q₂))·denom(3,-q₂,mUVexp²,-mUV²+(q₂.q₂)))
  2157. 140.50 s > )·q₀(αᵉ².¹)·q₀(αᵉ³.¹)·q₂(αᵉ².¹)·q₂(αᵉ³.¹)
  2158. 140.50 s > -SCALAR_COUPLING²·q₀(αᵉ².¹)·q₀(αᵉ³.¹)·q₂(αᵉ².¹)·q₂(αᵉ³.¹)
  2159. 140.50 s > /(denom(2,q₂,mUVexp²,-mUV²+(q₂.q₂))·denom(3,-q₂,mUVexp²,-mUV²+(q₂.q₂)))
  2160. 140.50 s > +2·SCALAR_COUPLING²·(q₀.q₂)·q₀(αᵉ².¹)·q₀(αᵉ³.¹)·q₂(αᵉ².¹)·q₂(αᵉ³.¹)
  2161. 140.50 s > /(denom(2,q₂,mUVexp²,-mUV²+(q₂.q₂))·denom(3,-q₂,mUVexp²,-mUV²+(q₂.q₂))²)
  2162. 140.50 s > span t{span_context=true current=subgraph=y, topo_order=1, dod=2 given=subgraph=0, topo_order=0, dod=0}
  2163. 140.50 s > [2026-08-28 10:41:19.293] @approx::local_4d [{#profile, #uv, #collect, #integrated, #start, #trace}] DEBUG : After gamma schoonschip
  2164. 140.50 s > field value
  2165. 140.50 s > expr n-terms: 3, byte size: 1631,expr:
  2166. 140.50 s > (1/2·SCALAR_COUPLING²·(2·mUVexp²-2·mass_scalar_2²)/(denom(2,q₂,mUVexp²,-mUV²+(q₂.q₂))²·denom(3,-q₂,mUVexp²,-mUV²+(q₂.q₂)))
  2167. 140.50 s > -SCALAR_COUPLING²
  2168. 140.50 s > ·(-1/2·(2·mUVexp²-2·mass_scalar_2²+2·(q₀.q₀))/denom(3,-q₂,mUVexp²,-mUV²+(q₂.q₂))
  2169. 140.50 s > +4·(q₀.q₂)²/denom(3,-q₂,mUVexp²,-mUV²+(q₂.q₂))²
  2170. 140.50 s > )/(denom(2,q₂,mUVexp²,-mUV²+(q₂.q₂))·denom(3,-q₂,mUVexp²,-mUV²+(q₂.q₂)))
  2171. 140.50 s > )·(q₀.q₂)²
  2172. 140.50 s > -SCALAR_COUPLING²·(q₀.q₂)²/(denom(2,q₂,mUVexp²,-mUV²+(q₂.q₂))·denom(3,-q₂,mUVexp²,-mUV²+(q₂.q₂)))
  2173. 140.50 s > +2·SCALAR_COUPLING²·(q₀.q₂)·(q₀.q₂)²
  2174. 140.50 s > /(denom(2,q₂,mUVexp²,-mUV²+(q₂.q₂))·denom(3,-q₂,mUVexp²,-mUV²+(q₂.q₂))²)
  2175. 140.50 s > span t{span_context=true current=subgraph=y, topo_order=1, dod=2 given=subgraph=0, topo_order=0, dod=0}
  2176. 140.50 s > [2026-08-28 10:41:19.295] @approx::local_4d [{#profile, #uv, #collect, #integrated, #start, #trace}] DEBUG : After gamma collection
  2177. 140.50 s > field value
  2178. 140.50 s > expr n-terms: 1, byte size: 1347,expr:
  2179. 140.50 s > SCALAR_COUPLING²
  2180. 140.50 s > ·(-denom(2,q₂,mUVexp²,-mUV²+(q₂.q₂))·denom(3,-q₂,mUVexp²,-mUV²+(q₂.q₂))²
  2181. 140.50 s > +1/2·(2·mUVexp²-2·mass_scalar_2²)·denom(3,-q₂,mUVexp²,-mUV²+(q₂.q₂))²
  2182. 140.50 s > -(-1/2·(2·mUVexp²-2·mass_scalar_2²+2·(q₀.q₀))·denom(3,-q₂,mUVexp²,-mUV²+(q₂.q₂))+4·(q₀.q₂)²)
  2183. 140.50 s > ·denom(2,q₂,mUVexp²,-mUV²+(q₂.q₂))
  2184. 140.50 s > +2·(q₀.q₂)·denom(2,q₂,mUVexp²,-mUV²+(q₂.q₂))·denom(3,-q₂,mUVexp²,-mUV²+(q₂.q₂))
  2185. 140.50 s > )·(q₀.q₂)²/(denom(2,q₂,mUVexp²,-mUV²+(q₂.q₂))²·denom(3,-q₂,mUVexp²,-mUV²+(q₂.q₂))³)
  2186. 140.50 s > span t{span_context=true current=subgraph=y, topo_order=1, dod=2 given=subgraph=0, topo_order=0, dod=0}
  2187. 140.50 s > [2026-08-28 10:41:19.297] @approx::local_4d [{#profile, #uv, #gamma, #integrated, #start, #trace, #vakint}] DEBUG : After gamma simplification
  2188. 140.50 s > ... omitted 3263 more lines; see full nextest output above
  2189. 140.50 s >
  2190. 140.50 s > 8. gammaloop-integration-tests::uv::sunrise_scalar_1_uv
  2191. 140.50 s > failure: test failure with exit code 101
  2192. 140.50 s > system-out
  2193. 140.50 s > running 1 test
  2194. 140.50 s > test sunrise_scalar_1_uv has been running for over 60 seconds
  2195. 140.50 s > +------------------+------------------------+--------------+--------+----------+----------------------------------------------------------------------------------------------------------------------+-------+
  2196. 140.50 s > | case | check | graph | status | sigma | threshold | error |
  2197. 140.50 s > +------------------+------------------------+--------------+--------+----------+----------------------------------------------------------------------------------------------------------------------+-------+
  2198. 140.50 s > | sunrise_scalar_1 | uv_profile | - | FAIL | - | - | - |
  2199. 140.50 s > +------------------+------------------------+--------------+--------+----------+----------------------------------------------------------------------------------------------------------------------+-------+
  2200. 140.50 s > | sunrise_scalar_1 | m_uv.inspect | inspect | pass | - | best inspect relative delta 1.624e0 >= 1000*accuracy 1.000e-3 (accuracy=1.000e-6, exponent=+1.0, seed=1, probes=10) | - |
  2201. 140.50 s > +------------------+------------------------+--------------+--------+----------+----------------------------------------------------------------------------------------------------------------------+-------+
  2202. 140.50 s > | sunrise_scalar_1 | m_uv.integrated | sunrise | pass | 0.1sigma | compatible within 2sigma | - |
  2203. 140.50 s > +------------------+------------------------+--------------+--------+----------+----------------------------------------------------------------------------------------------------------------------+-------+
  2204. 140.50 s > | sunrise_scalar_1 | rls.inspect | inspect | pass | - | best inspect relative delta 8.682e-1 >= 1000*accuracy 1.000e-3 (accuracy=1.000e-6, exponent=+1.0, seed=1, probes=10) | - |
  2205. 140.50 s > +------------------+------------------------+--------------+--------+----------+----------------------------------------------------------------------------------------------------------------------+-------+
  2206. 140.50 s > | sunrise_scalar_1 | rls.integrated | sunrise | pass | 0.0sigma | compatible within 2sigma | - |
  2207. 140.50 s > +------------------+------------------------+--------------+--------+----------+----------------------------------------------------------------------------------------------------------------------+-------+
  2208. 140.50 s > | sunrise_scalar_1 | mu_r.inspect | inspect | pass | - | best inspect relative delta 1.752e0 >= 1000*accuracy 1.000e-3 (accuracy=1.000e-6, exponent=+1.0, seed=1, probes=10) | - |
  2209. 140.50 s > +------------------+------------------------+--------------+--------+----------+----------------------------------------------------------------------------------------------------------------------+-------+
  2210. 140.50 s > | sunrise_scalar_1 | integrated.relerr | integrated | pass | - | relative error 9.20% <= 10.00% | - |
  2211. 140.50 s > +------------------+------------------------+--------------+--------+----------+----------------------------------------------------------------------------------------------------------------------+-------+
  2212. 140.50 s > | sunrise_scalar_1 | m_uv.integrated.relerr | m_uv-shifted | pass | - | relative error 5.89% <= 10.00% | - |
  2213. 140.50 s > +------------------+------------------------+--------------+--------+----------+----------------------------------------------------------------------------------------------------------------------+-------+
  2214. 140.50 s > | sunrise_scalar_1 | target | - | pass | - | 2sigma | - |
  2215. 140.50 s > +------------------+------------------------+--------------+--------+----------+----------------------------------------------------------------------------------------------------------------------+-------+
  2216. 140.50 s > test sunrise_scalar_1_uv ... FAILED
  2217. 140.50 s >
  2218. 140.50 s > failures:
  2219. 140.50 s >
  2220. 140.50 s > failures:
  2221. 140.50 s > sunrise_scalar_1_uv
  2222. 140.50 s >
  2223. 140.50 s > test result: FAILED. 0 passed; 1 failed; 0 ignored; 0 measured; 24 filtered out; finished in 97.29s
  2224. 140.50 s > system-err
  2225. 140.50 s > [2026-08-28 10:41:24.107] @gammaloop_api::se... INFO : Running command run generate
  2226. 140.50 s > [2026-08-28 10:41:24.107] @gammaloop_api::se... INFO : Starting command block generate
  2227. 140.50 s > [2026-08-28 10:41:24.107] @gammaloop_api::se... INFO : Running command import model scalars-default.json
  2228. 140.50 s > [2026-08-28 10:41:24.107] @import::model INFO : Loading built-in JSON model scalars-default
  2229. 140.50 s > [2026-08-28 10:41:24.113] @gammalooprs::model INFO : The following 2 external parameters were forced to zero by the restriction card:
  2230. 140.50 s > width_scalar_1, width_scalar_2
  2231. 140.50 s > [2026-08-28 10:41:24.113] @gammaloop_api::se... INFO : Running command remove processes
  2232. 140.50 s > [2026-08-28 10:41:24.113] @gammaloop_api::se... INFO : Running command set global kv global.generation.uv.generate_integrated=true
  2233. 140.50 s > [2026-08-28 10:41:24.114] @gammaloop_api::se... INFO : Running command import graphs ./tests/resources/graphs/scalar_sunrise.dot -p sunrise_scalar_1 -i scalar_sunrise
  2234. 140.50 s > [2026-08-28 10:41:24.114] @commands::import INFO : Loading graphs from '/build/source/tests/resources/graphs/scalar_sunrise.dot'
  2235. 140.50 s > [2026-08-28 10:41:24.117] @gammaloop_api::se... INFO : Running command generate existing -p sunrise_scalar_1 -i scalar_sunrise
  2236. 140.50 s > [2026-08-28 10:41:24.118] @approx::local_4d [{#uv, #inspect, #integrated}] DEBUG : Rescaled momenta expanded
  2237. 140.50 s > field value
  2238. 140.50 s > res n-terms: 1, byte size: 3,expr:
  2239. 140.50 s > 1
  2240. 140.50 s > [2026-08-28 10:41:24.120] @approx::local_4d [{#uv, #inspect, #integrated}] DEBUG : Rescaled momenta expanded
  2241. 140.50 s > field value
  2242. 140.50 s > res n-terms: 1, byte size: 611,expr:
  2243. 140.50 s > 1/(denom(0,q₀/t,mass_scalar_1²,-mass_scalar_1²+(q₀.q₀)/t²)
  2244. 140.50 s > ·denom(2,-q₁+q₃-q₀/t,mass_scalar_1²,
  2245. 140.50 s > -mass_scalar_1²+2·(q₀.q₁)/t-2·(q₀.q₃)/t+(q₀.q₀)/t²+(q₁.q₁)
  2246. 140.50 s > -2·(q₁.q₃)+(q₃.q₃)
  2247. 140.50 s > ))
  2248. 140.50 s > [2026-08-28 10:41:24.135] @approx::local_4d [{#uv, #inspect, #integrated}] DEBUG : Rescaled momenta expanded
  2249. 140.50 s > field value
  2250. 140.50 s > res n-terms: 1, byte size: 611,expr:
  2251. 140.50 s > 1/(denom(1,q₁/t,mass_scalar_1²,-mass_scalar_1²+(q₁.q₁)/t²)
  2252. 140.50 s > ·denom(2,-q₀+q₃-q₁/t,mass_scalar_1²,
  2253. 140.50 s > -mass_scalar_1²+2·(q₀.q₁)/t-2·(q₁.q₃)/t+(q₁.q₁)/t²+(q₀.q₀)
  2254. 140.50 s > -2·(q₀.q₃)+(q₃.q₃)
  2255. 140.50 s > ))
  2256. 140.50 s > [2026-08-28 10:41:24.137] @approx::local_4d [{#uv, #inspect, #integrated}] DEBUG : Rescaled momenta expanded
  2257. 140.50 s > field value
  2258. 140.50 s > res n-terms: 1, byte size: 611,expr:
  2259. 140.50 s > 1/(denom(0,q₀/t,mass_scalar_1²,-mass_scalar_1²+(q₀.q₀)/t²)
  2260. 140.50 s > ·denom(1,-q₂+q₃-q₀/t,mass_scalar_1²,
  2261. 140.50 s > -mass_scalar_1²+2·(q₀.q₂)/t-2·(q₀.q₃)/t+(q₀.q₀)/t²+(q₂.q₂)
  2262. 140.50 s > -2·(q₂.q₃)+(q₃.q₃)
  2263. 140.50 s > ))
  2264. 140.50 s > [2026-08-28 10:41:24.139] @approx::local_4d [{#uv, #inspect, #integrated}] DEBUG : Rescaled momenta expanded
  2265. 140.50 s > field value
  2266. 140.50 s > res n-terms: 1, byte size: 777,expr:
  2267. 140.50 s > 1/(denom(0,q₀/t,mass_scalar_1²,-mass_scalar_1²+(q₀.q₀)/t²)·denom(1,q₁/t,mass_scalar_1²,-mass_scalar_1²+(q₁.q₁)/t²)
  2268. 140.50 s > ·denom(2,q₄-q₀/t-q₁/t,mass_scalar_1²,
  2269. 140.50 s > -mass_scalar_1²-2·(q₀.q₄)/t-2·(q₁.q₄)/t+(q₀.q₀)/t²+2·(q₀.q₁)/t²
  2270. 140.50 s > +(q₁.q₁)/t²+(q₄.q₄)
  2271. 140.50 s > ))
  2272. 140.50 s > [2026-08-28 10:41:24.142] @approx::final_integrand[{#generation, #profile, #uv, #graph, #summary}] DEBUG : Computed global numerator
  2273. 140.50 s > field value
  2274. 140.50 s > global_num n-terms: 1, byte size: 3,expr:
  2275. 140.50 s > 1
  2276. 140.50 s > span build_3d{span_context=true graph=sunrise current=subgraph=0, topo_order=0, dod=0}
  2277. 140.50 s > [2026-08-28 10:41:24.145] @uv::approx [{#generation, #uv, #fourd}] DEBUG : Computing 4D
  2278. 140.50 s > field value
  2279. 140.50 s > simple subgraph(S_47,S_3I)*Approx(subgraph(S_3I,0)) of sunrise
  2280. 140.50 s > span compute_4d{span_context=true graph=sunrise current=subgraph=3I, topo_order=1, dod=0 given=subgraph=0, topo_order=0, dod=0 reduced=SubSet { set: BitVec<usize, bitvec::order::Lsb0> { addr: 0x7fffec01a980, head: 000000, bits: 8, capacity: 64 } [0, 0, 1, 1, 0, 0, 1, 1], id: PhantomData<linnet::half_edge::involution::Hedge> }}
  2281. 140.50 s > [2026-08-28 10:41:24.146] @approx::local_4d [{#uv, #algebra, #integrated, #start}] DEBUG :
  2282. 140.50 s > field value
  2283. 140.50 s > integrand n-terms: 1, byte size: 217,expr:
  2284. 140.50 s > 1/(denom(0,q₀,mass_scalar_1²,-mass_scalar_1²+(q₀.q₀))·denom(2,q₂,mass_scalar_1²,-mass_scalar_1²+(q₂.q₂)))
  2285. 140.50 s > reduced 3I
  2286. 140.50 s > span grow{span_context=true current=subgraph=3I, topo_order=1, dod=0 given=subgraph=0, topo_order=0, dod=0}
  2287. 140.50 s > [2026-08-28 10:41:24.146] @approx::local_4d [{#uv, #inspect, #integrated}] DEBUG : Rescaled momenta expanded
  2288. 140.50 s > field value
  2289. 140.50 s > res n-terms: 1, byte size: 611,expr:
  2290. 140.50 s > 1/(denom(0,q₀/t,mass_scalar_1²,-mass_scalar_1²+(q₀.q₀)/t²)
  2291. 140.50 s > ·denom(2,-q₁+q₃-q₀/t,mass_scalar_1²,
  2292. 140.50 s > -mass_scalar_1²+2·(q₀.q₁)/t-2·(q₀.q₃)/t+(q₀.q₀)/t²+(q₁.q₁)
  2293. 140.50 s > -2·(q₁.q₃)+(q₃.q₃)
  2294. 140.50 s > ))
  2295. 140.50 s > span t{span_context=true current=subgraph=3I, topo_order=1, dod=0 given=subgraph=0, topo_order=0, dod=0}
  2296. 140.50 s > [2026-08-28 10:41:24.146] @approx::local_4d [{#uv, #integrated, #rescaled}] DEBUG : Rescaled expanded
  2297. 140.50 s > field value
  2298. 140.50 s > n_loops 1
  2299. 140.50 s > res n-terms: 1, byte size: 723,expr:
  2300. 140.50 s > 1/(denom(0,q₀,mUVexp²+t²·mass_scalar_1²,-mUV²+t²·(-mass_scalar_1²+(q₀.q₀)/t²)+t²·mUVexp²)
  2301. 140.50 s > ·denom(2,-q₀,mUVexp²+t²·mass_scalar_1²,
  2302. 140.50 s > -mUV²
  2303. 140.50 s > +t²
  2304. 140.50 s > ·(-mass_scalar_1²+2·(q₀.q₁)/t-2·(q₀.q₃)/t+(q₀.q₀)/t²+(q₁.q₁)
  2305. 140.50 s > -2·(q₁.q₃)+(q₃.q₃)
  2306. 140.50 s > )
  2307. 140.50 s > +t²·mUVexp²
  2308. 140.50 s > ))
  2309. 140.50 s > span t{span_context=true current=subgraph=3I, topo_order=1, dod=0 given=subgraph=0, topo_order=0, dod=0}
  2310. 140.50 s > [2026-08-28 10:41:24.147] @approx::local_4d [{#uv, #integrated, #series}] DEBUG : Series expanded
  2311. 140.50 s > field value
  2312. 140.50 s > res n-terms: 1, byte size: 223,expr:
  2313. 140.50 s > 1/(denom(0,q₀,mUVexp²,-mUV²+(q₀.q₀))·denom(2,-q₀,mUVexp²,-mUV²+(q₀.q₀)))
  2314. 140.50 s > span t{span_context=true current=subgraph=3I, topo_order=1, dod=0 given=subgraph=0, topo_order=0, dod=0}
  2315. 140.50 s > [2026-08-28 10:41:24.147] @approx::local_4d [{#uv, #integrated, #series}] DEBUG : Evaluated at t = 1
  2316. 140.50 s > field value
  2317. 140.50 s > res n-terms: 1, byte size: 223,expr:
  2318. 140.50 s > 1/(denom(0,q₀,mUVexp²,-mUV²+(q₀.q₀))·denom(2,-q₀,mUVexp²,-mUV²+(q₀.q₀)))
  2319. 140.50 s > span t{span_context=true current=subgraph=3I, topo_order=1, dod=0 given=subgraph=0, topo_order=0, dod=0}
  2320. 140.50 s > [2026-08-28 10:41:24.147] @approx::local_4d [{#uv, #collect, #integrated}] DEBUG : After gamma chain collection
  2321. 140.50 s > field value
  2322. 140.50 s > expr n-terms: 1, byte size: 223,expr:
  2323. 140.50 s > 1/(denom(0,q₀,mUVexp²,-mUV²+(q₀.q₀))·denom(2,-q₀,mUVexp²,-mUV²+(q₀.q₀)))
  2324. 140.50 s > span t{span_context=true current=subgraph=3I, topo_order=1, dod=0 given=subgraph=0, topo_order=0, dod=0}
  2325. 140.50 s > [2026-08-28 10:41:24.148] @approx::local_4d [{#profile, #uv, #collect, #integrated, #start, #trace}] DEBUG : After gamma schoonschip
  2326. 140.50 s > field value
  2327. 140.50 s > expr n-terms: 1, byte size: 223,expr:
  2328. 140.50 s > 1/(denom(0,q₀,mUVexp²,-mUV²+(q₀.q₀))·denom(2,-q₀,mUVexp²,-mUV²+(q₀.q₀)))
  2329. 140.50 s > span t{span_context=true current=subgraph=3I, topo_order=1, dod=0 given=subgraph=0, topo_order=0, dod=0}
  2330. 140.50 s > [2026-08-28 10:41:24.148] @approx::local_4d [{#profile, #uv, #collect, #integrated, #start, #trace}] DEBUG : After gamma collection
  2331. 140.50 s > field value
  2332. 140.50 s > expr n-terms: 1, byte size: 223,expr:
  2333. 140.50 s > 1/(denom(0,q₀,mUVexp²,-mUV²+(q₀.q₀))·denom(2,-q₀,mUVexp²,-mUV²+(q₀.q₀)))
  2334. 140.50 s > span t{span_context=true current=subgraph=3I, topo_order=1, dod=0 given=subgraph=0, topo_order=0, dod=0}
  2335. 140.50 s > [2026-08-28 10:41:24.149] @approx::local_4d [{#profile, #uv, #gamma, #integrated, #start, #trace, #vakint}] DEBUG : After gamma simplification
  2336. 140.50 s > field value
  2337. 140.50 s > expr n-terms: 1, byte size: 223,expr:
  2338. 140.50 s > 1/(denom(0,q₀,mUVexp²,-mUV²+(q₀.q₀))·denom(2,-q₀,mUVexp²,-mUV²+(q₀.q₀)))
  2339. 140.50 s > span t{span_context=true current=subgraph=3I, topo_order=1, dod=0 given=subgraph=0, topo_order=0, dod=0}
  2340. 140.50 s > [2026-08-28 10:41:24.149] @approx::local_4d [{#profile, #uv, #integrated, #schoonschip, #start, #trace, #vakint}] DEBUG : After Schoonschip net
  2341. 140.50 s > field value
  2342. 140.50 s > expr n-terms: 1, byte size: 223,expr:
  2343. 140.50 s > 1/(denom(0,q₀,mUVexp²,-mUV²+(q₀.q₀))·denom(2,-q₀,mUVexp²,-mUV²+(q₀.q₀)))
  2344. 140.50 s > ... omitted 20090 more lines; see full nextest output above
  2345. 140.50 s >
  2346. 140.50 s > 9. gammaloop-integration-tests::uv::se1l_uv
  2347. 140.50 s > failure: test failure with exit code 101
  2348. 140.50 s > system-out
  2349. 140.50 s > running 1 test
  2350. 140.50 s > test se1l_uv has been running for over 60 seconds
  2351. 140.50 s > +------+-----------------+---------+--------+----------+-----------------------------------------------------------------------------------------------------------------------+-------+
  2352. 140.50 s > | case | check | graph | status | sigma | threshold | error |
  2353. 140.50 s > +------+-----------------+---------+--------+----------+-----------------------------------------------------------------------------------------------------------------------+-------+
  2354. 140.50 s > | se1l | uv_profile | - | FAIL | - | - | - |
  2355. 140.50 s > +------+-----------------+---------+--------+----------+-----------------------------------------------------------------------------------------------------------------------+-------+
  2356. 140.50 s > | se1l | m_uv.inspect | inspect | pass | - | best inspect relative delta 1.097e-1 >= 1000*accuracy 1.000e-7 (accuracy=1.000e-10, exponent=+2.0, seed=1, probes=10) | - |
  2357. 140.50 s > +------+-----------------+---------+--------+----------+-----------------------------------------------------------------------------------------------------------------------+-------+
  2358. 140.50 s > | se1l | m_uv.integrated | se1l | pass | 0.1sigma | compatible within 2sigma | - |
  2359. 140.50 s > +------+-----------------+---------+--------+----------+-----------------------------------------------------------------------------------------------------------------------+-------+
  2360. 140.50 s > | se1l | rls.inspect | inspect | pass | - | best inspect relative delta 4.499e-2 >= 1000*accuracy 1.000e-7 (accuracy=1.000e-10, exponent=+2.0, seed=1, probes=10) | - |
  2361. 140.50 s > +------+-----------------+---------+--------+----------+-----------------------------------------------------------------------------------------------------------------------+-------+
  2362. 140.50 s > | se1l | rls.integrated | se1l | pass | 0.0sigma | compatible within 2sigma | - |
  2363. 140.50 s > +------+-----------------+---------+--------+----------+-----------------------------------------------------------------------------------------------------------------------+-------+
  2364. 140.50 s > | se1l | mu_r.inspect | inspect | pass | - | best inspect relative delta 1.424e-1 >= 1000*accuracy 1.000e-7 (accuracy=1.000e-10, exponent=+2.0, seed=1, probes=10) | - |
  2365. 140.50 s > +------+-----------------+---------+--------+----------+-----------------------------------------------------------------------------------------------------------------------+-------+
  2366. 140.50 s > | se1l | target | - | pass | - | 2sigma | - |
  2367. 140.50 s > +------+-----------------+---------+--------+----------+-----------------------------------------------------------------------------------------------------------------------+-------+
  2368. 140.50 s > test se1l_uv ... FAILED
  2369. 140.50 s >
  2370. 140.50 s > failures:
  2371. 140.50 s >
  2372. 140.50 s > failures:
  2373. 140.50 s > se1l_uv
  2374. 140.50 s >
  2375. 140.50 s > test result: FAILED. 0 passed; 1 failed; 0 ignored; 0 measured; 24 filtered out; finished in 107.08s
  2376. 140.50 s > system-err
  2377. 140.50 s > [2026-08-28 10:41:23.813] @gammaloop_api::se... INFO : Running command run generate
  2378. 140.50 s > [2026-08-28 10:41:23.813] @gammaloop_api::se... INFO : Starting command block generate
  2379. 140.50 s > [2026-08-28 10:41:23.814] @gammaloop_api::se... INFO : Running command import model sm-default
  2380. 140.50 s > [2026-08-28 10:41:23.814] @import::model INFO : Loading built-in JSON model sm-default
  2381. 140.50 s > [2026-08-28 10:41:23.845] @gammalooprs::model INFO : The following 11 external parameters were forced to zero by the restriction card:
  2382. 140.50 s > lamWS, AWS, rhoWS, etaWS, ymc, yme, ymm, MC, Me, MM, WTau
  2383. 140.50 s > [2026-08-28 10:41:23.845] @gammalooprs::model INFO : The following 34 vertex rules were removed by the restriction card:
  2384. 140.50 s > V_82 -> (c~, d, G+) | V_83 -> (t~, d, G+) | V_84 -> (c~, s, G+) | V_85 -> (t~, s, G+) | V_86 -> (u~, b, G+) | V_87 -> (c~, b, G+) | V_90 -> (c~, d, W+) | V_91 -> (t~, d, W+) | V_92 -> (u~, s, W+) | V_94 -> (t~, s, W+) | V_95 -> (u~, b, W+) | V_96 -> (c~, b, W+) | V_101 -> (e+, e-, G0) | V_102 -> (mu+, mu-, G0) | V_104 -> (e+, e-, H) | V_105 -> (mu+, mu-, H) | V_110 -> (ve~, e-, G+) | V_111 -> (vm~, mu-, G+) | V_116 -> (b~, u, G-) | V_117 -> (d~, c, G-) | V_118 -> (s~, c, G-) | V_119 -> (b~, c, G-) | V_120 -> (d~, t, G-) | V_121 -> (s~, t, G-) | V_124 -> (s~, u, W-) | V_125 -> (b~, u, W-) | V_126 -> (d~, c, W-) | V_128 -> (b~, c, W-) | V_129 -> (d~, t, W-) | V_130 -> (s~, t, W-) | V_138 -> (c~, c, G0) | V_140 -> (c~, c, H) | V_145 -> (e+, ve, G-) | V_146 -> (mu+, vm, G-)
  2385. 140.50 s > [2026-08-28 10:41:23.845] @gammalooprs::model INFO : The following 36 couplings were removed by the restriction card:
  2386. 140.50 s > GC_13, GC_14, GC_16, GC_17, GC_18, GC_19, GC_20, GC_22, GC_23, GC_24, GC_25, GC_26, GC_28, GC_29, GC_42, GC_43, GC_44, GC_46, GC_47, GC_48, GC_84, GC_85, GC_86, GC_87, GC_88, GC_89, GC_90, GC_91, GC_92, GC_93, GC_101, GC_102, GC_103, GC_105, GC_106, GC_107
  2387. 140.50 s > [2026-08-28 10:41:23.846] @gammaloop_api::se... INFO : Running command remove processes
  2388. 140.50 s > [2026-08-28 10:41:23.846] @gammaloop_api::se... INFO : Running command set global kv global.generation.uv.generate_integrated=true
  2389. 140.50 s > [2026-08-28 10:41:23.847] @gammaloop_api::se... INFO : Running command import graphs ./tests/resources/graphs/uv_tests/se1l.dot -p se1l -i se1l
  2390. 140.50 s > [2026-08-28 10:41:23.847] @commands::import INFO : Loading graphs from '/build/source/tests/resources/graphs/uv_tests/se1l.dot'
  2391. 140.50 s > [2026-08-28 10:41:23.851] @gammaloop_api::se... INFO : Running command generate existing -p se1l -i se1l
  2392. 140.50 s > [2026-08-28 10:41:24.890] @commands::generate INFO :
  2393. 140.50 s > Integrand generation summary
  2394. 140.50 s > peak RAM 88.22 MiB | cores 1
  2395. 140.50 s > ╭───────────┬───────┬─────────┬─────────────┬─────────────┬────────────────┬─────────────╮
  2396. 140.50 s > │ integrand │ graph │ # evals │ expr build │ spenso │ symbolica eval │ compile │
  2397. 140.50 s > ├───────────┼───────┼─────────┼─────────────┼─────────────┼────────────────┼─────────────┤
  2398. 140.50 s > │ se1l │ se1l │ 5 │ 897ms (89%) │ 41ms (4.1%) │ 72ms (7.1%) │ 0ms (0.00%) │
  2399. 140.50 s > ├───────────┼───────┼─────────┼─────────────┼─────────────┼────────────────┼─────────────┤
  2400. 140.50 s > │ Total │ │ 5 │ 897ms (89%) │ 41ms (4.1%) │ 72ms (7.1%) │ 0ms (0.00%) │
  2401. 140.50 s > ╰───────────┴───────┴─────────┴─────────────┴─────────────┴────────────────┴─────────────╯
  2402. 140.50 s > [2026-08-28 10:41:24.891] @gammaloop_api::se... INFO : Running command set process -p se1l -i se1l kv general.m_uv=0.2
  2403. 140.50 s > [2026-08-28 10:41:24.893] @gammaloop_api::se... INFO : Running command set process -p se1l -i se1l kv general.mu_r=0.2
  2404. 140.50 s > [2026-08-28 10:41:24.894] @gammaloop_api::se... INFO : Running command set process -p se1l -i se1l kv general.renormalization_localization_scale=0.2
  2405. 140.50 s > [2026-08-28 10:41:24.895] @gammaloop_api::se... INFO : Running command duplicate integrand -p se1l -i se1l --output_process_name se1l --output_integrand_name se1l_muv_shifted
  2406. 140.50 s > [2026-08-28 10:41:24.897] @gammaloop_api::se... INFO : Running command set process -p se1l -i se1l_muv_shifted kv general.m_uv=0.5
  2407. 140.50 s > [2026-08-28 10:41:24.899] @gammaloop_api::se... INFO : Running command duplicate integrand -p se1l -i se1l --output_process_name se1l --output_integrand_name se1l_rls_shifted
  2408. 140.50 s > [2026-08-28 10:41:24.903] @gammaloop_api::se... INFO : Running command set process -p se1l -i se1l_rls_shifted kv general.renormalization_localization_scale=1
  2409. 140.50 s > [2026-08-28 10:41:24.904] @gammaloop_api::se... INFO : Running command duplicate integrand -p se1l -i se1l --output_process_name se1l --output_integrand_name se1l_mur_shifted
  2410. 140.50 s > [2026-08-28 10:41:24.908] @gammaloop_api::se... INFO : Running command set process -p se1l -i se1l_mur_shifted kv general.mu_r=0.8
  2411. 140.50 s > [2026-08-28 10:41:24.916] @process::amplitude WARNING : External state 0 ('g', PDG 21, helicity +) is off shell: p^2 = +2.5e5, expected m^2 = +0e0 (|Δ| = +2.5e5). Fixed-helicity spinor/vector/tensor external states may be ill-defined at this kinematic point.
  2412. 140.50 s > field value
  2413. 140.50 s > span warm_up{integrand.name=se1l}
  2414. 140.50 s > [2026-08-28 10:41:24.916] @process::amplitude WARNING : External state 1 ('g', PDG 21, helicity -) is off shell: p^2 = +2.5e5, expected m^2 = +0e0 (|Δ| = +2.5e5). Fixed-helicity spinor/vector/tensor external states may be ill-defined at this kinematic point.
  2415. 140.50 s > field value
  2416. 140.50 s > span warm_up{integrand.name=se1l}
  2417. 140.50 s > [2026-08-28 10:41:24.917] @process::amplitude INFO : Input is above threshold: 1 existing threshold E-surfaces across 1/1 graph groups
  2418. 140.50 s > field value
  2419. 140.50 s > existing_esurfaces 1
  2420. 140.50 s > group_count 1
  2421. 140.50 s > groups_above_threshold 1
  2422. 140.50 s > integrand se1l
  2423. 140.50 s > span warm_up{integrand.name=se1l}
  2424. 140.50 s > threshold_status above threshold
  2425. 140.50 s > [2026-08-28 10:41:24.917] @process::amplitude INFO : overlap structure of group 0: [1: [0(2,3)]]
  2426. 140.50 s > field value
  2427. 140.50 s > span warm_up{integrand.name=se1l}
  2428. 140.50 s > [2026-08-28 10:41:25.121] @commands::profile INFO :
  2429. 140.50 s > ╭───────┬──────┬──────────┬───────┬─────┬──────────┬───────────╮
  2430. 140.50 s > │ fixed │ → ∞ │ slope │ r2 │ DOD │ bare DOD │ inspect │
  2431. 140.50 s > ├───────┼──────┼──────────┼───────┼─────┼──────────┼───────────┤
  2432. 140.50 s > │ {} │ {e3} │ 1.639236 │ 0.904 │ 2 │ 2 │ arb retry │
  2433. 140.50 s > │ {} │ {e2} │ 1.698834 │ 0.902 │ 2 │ 2 │ arb retry │
  2434. 140.50 s > ╰───────┴──────┴──────────┴───────┴─────┴──────────┴───────────╯
  2435. 140.50 s > [2026-08-28 10:41:25.121] @commands::profile INFO :
  2436. 140.50 s > ╭───────┬──────┬─────────────┬──────────┬───────┬─────┬──────────┬───────────╮
  2437. 140.50 s > │ fixed │ → ∞ │ orientation │ slope │ r2 │ DOD │ bare DOD │ inspect │
  2438. 140.50 s > ├───────┼──────┼─────────────┼──────────┼───────┼─────┼──────────┼───────────┤
  2439. 140.50 s > │ {} │ {e3} │ 00-+ │ 0.343429 │ 0.145 │ 0 │ 2 │ arb retry │
  2440. 140.50 s > │ {} │ {e3} │ 00+- │ 0.342577 │ 0.135 │ 0 │ 2 │ arb retry │
  2441. 140.50 s > │ {} │ {e2} │ 00-+ │ 0.385975 │ 0.161 │ 0 │ 2 │ arb retry │
  2442. 140.50 s > │ {} │ {e2} │ 00+- │ 0.384920 │ 0.192 │ 0 │ 2 │ arb retry │
  2443. 140.50 s > ╰───────┴──────┴─────────────┴──────────┴───────┴─────┴──────────┴───────────╯
  2444. 140.50 s > [2026-08-28 10:41:25.122] @gammaloop_api::se... INFO : Running command set process kv integrator.target_relative_accuracy=0.001 integrator.n_increase=0 integrator.n_start=50000 integrator.n_max=400000 integrator.seed=1337
  2445. 140.50 s > [2026-08-28 10:41:25.123] @commands::integrate INFO : Created workspace directory at /build/source/tests/artifacts/se1l/integration_workspace_se1l
  2446. 140.50 s > [2026-08-28 10:41:25.141] @commands::integrate INFO : No integration state found, starting new integration
  2447. 140.50 s > [2026-08-28 10:41:25.141] @commands::integrate INFO : Gammaloop now integrates se1l@se1l, se1l@se1l_muv_shifted, se1l@se1l_rls_shifted
  2448. 140.50 s > [2026-08-28 10:41:25.141] @process::amplitude WARNING : External state 0 ('g', PDG 21, helicity +) is off shell: p^2 = +2.5e5, expected m^2 = +0e0 (|Δ| = +2.5e5). Fixed-helicity spinor/vector/tensor external states may be ill-defined at this kinematic point.
  2449. 140.50 s > field value
  2450. 140.50 s > span warm_up{integrand.name=se1l}
  2451. 140.50 s > [2026-08-28 10:41:25.141] @process::amplitude WARNING : External state 1 ('g', PDG 21, helicity -) is off shell: p^2 = +2.5e5, expected m^2 = +0e0 (|Δ| = +2.5e5). Fixed-helicity spinor/vector/tensor external states may be ill-defined at this kinematic point.
  2452. 140.50 s > field value
  2453. 140.50 s > span warm_up{integrand.name=se1l}
  2454. 140.50 s > [2026-08-28 10:41:25.142] @process::amplitude INFO : Input is above threshold: 1 existing threshold E-surfaces across 1/1 graph groups
  2455. 140.50 s > field value
  2456. 140.50 s > existing_esurfaces 1
  2457. 140.50 s > group_count 1
  2458. 140.50 s > groups_above_threshold 1
  2459. 140.50 s > integrand se1l
  2460. 140.50 s > span warm_up{integrand.name=se1l}
  2461. 140.50 s > threshold_status above threshold
  2462. 140.50 s > [2026-08-28 10:41:25.142] @process::amplitude INFO : overlap structure of group 0: [1: [0(2,3)]]
  2463. 140.50 s > field value
  2464. 140.50 s > span warm_up{integrand.name=se1l}
  2465. 140.50 s > [2026-08-28 10:41:25.143] @process::amplitude WARNING : External state 0 ('g', PDG 21, helicity +) is off shell: p^2 = +2.5e5, expected m^2 = +0e0 (|Δ| = +2.5e5). Fixed-helicity spinor/vector/tensor external states may be ill-defined at this kinematic point.
  2466. 140.50 s > field value
  2467. 140.50 s > span warm_up{integrand.name=se1l_muv_shifted}
  2468. 140.50 s > [2026-08-28 10:41:25.143] @process::amplitude WARNING : External state 1 ('g', PDG 21, helicity -) is off shell: p^2 = +2.5e5, expected m^2 = +0e0 (|Δ| = +2.5e5). Fixed-helicity spinor/vector/tensor external states may be ill-defined at this kinematic point.
  2469. 140.50 s > field value
  2470. 140.50 s > span warm_up{integrand.name=se1l_muv_shifted}
  2471. 140.50 s > [2026-08-28 10:41:25.143] @process::amplitude INFO : Input is above threshold: 1 existing threshold E-surfaces across 1/1 graph groups
  2472. 140.50 s > field value
  2473. 140.50 s > existing_esurfaces 1
  2474. 140.50 s > group_count 1
  2475. 140.50 s > groups_above_threshold 1
  2476. 140.50 s > integrand se1l_muv_shifted
  2477. 140.50 s > span warm_up{integrand.name=se1l_muv_shifted}
  2478. 140.50 s > threshold_status above threshold
  2479. 140.50 s > [2026-08-28 10:41:25.143] @process::amplitude INFO : overlap structure of group 0: [1: [0(2,3)]]
  2480. 140.50 s > field value
  2481. 140.50 s > span warm_up{integrand.name=se1l_muv_shifted}
  2482. 140.50 s > [2026-08-28 10:41:25.145] @process::amplitude WARNING : External state 0 ('g', PDG 21, helicity +) is off shell: p^2 = +2.5e5, expected m^2 = +0e0 (|Δ| = +2.5e5). Fixed-helicity spinor/vector/tensor external states may be ill-defined at this kinematic point.
  2483. 140.50 s > field value
  2484. 140.50 s > span warm_up{integrand.name=se1l_rls_shifted}
  2485. 140.50 s > [2026-08-28 10:41:25.145] @process::amplitude WARNING : External state 1 ('g', PDG 21, helicity -) is off shell: p^2 = +2.5e5, expected m^2 = +0e0 (|Δ| = +2.5e5). Fixed-helicity spinor/vector/tensor external states may be ill-defined at this kinematic point.
  2486. 140.50 s > field value
  2487. 140.50 s > span warm_up{integrand.name=se1l_rls_shifted}
  2488. 140.50 s > [2026-08-28 10:41:25.145] @process::amplitude INFO : Input is above threshold: 1 existing threshold E-surfaces across 1/1 graph groups
  2489. 140.50 s > field value
  2490. 140.50 s > existing_esurfaces 1
  2491. 140.50 s > group_count 1
  2492. 140.50 s > groups_above_threshold 1
  2493. 140.50 s > integrand se1l_rls_shifted
  2494. 140.50 s > span warm_up{integrand.name=se1l_rls_shifted}
  2495. 140.50 s > threshold_status above threshold
  2496. 140.50 s > ... omitted 1410 more lines; see full nextest output above
  2497. 140.50 s > =========================================
  2498. 140.50 s For full logs, run:
  2499. 140.50 s nix log /nix/store/ifx25i75mrp4mx011vk3kpahjasmfqfi-gammaloop-nextest-integration.drv
  2500. 140.62 s [0 built (1 failed), 0.0Run failed.