test packages.x86_64-linux.nix-ci-check-gammaloop-nextest-integration

Reproduce this run
Original Run
  1. 125.85 s gammaloop-nextest-integration> | dod2_bubble | rls.integrated | GL0 | pass | 0.0sigma | compatible within 2sigma | - |
  2. 125.85 s gammaloop-nextest-integration> +-------------+-----------------+---------+--------+----------+-----------------------------------------------------------------------------------------------------------------------+-------+
  3. 125.85 s gammaloop-nextest-integration> | dod2_bubble | mu_r.inspect | inspect | pass | - | best inspect relative delta 6.951e-1 >= 1000*accuracy 1.000e-7 (accuracy=1.000e-10, exponent=+0.0, seed=0, probes=10) | - |
  4. 125.85 s gammaloop-nextest-integration> +-------------+-----------------+---------+--------+----------+-----------------------------------------------------------------------------------------------------------------------+-------+
  5. 125.85 s gammaloop-nextest-integration> | dod2_bubble | target | - | pass | - | 2sigma | - |
  6. 125.85 s gammaloop-nextest-integration> +-------------+-----------------+---------+--------+----------+-----------------------------------------------------------------------------------------------------------------------+-------+
  7. 125.85 s gammaloop-nextest-integration> test dod2_bubble_uv ... FAILED
  8. 125.85 s gammaloop-nextest-integration>
  9. 125.85 s gammaloop-nextest-integration> failures:
  10. 125.85 s gammaloop-nextest-integration>
  11. 125.85 s gammaloop-nextest-integration> failures:
  12. 125.85 s gammaloop-nextest-integration> dod2_bubble_uv
  13. 125.85 s gammaloop-nextest-integration>
  14. 125.85 s gammaloop-nextest-integration> test result: FAILED. 0 passed; 1 failed; 0 ignored; 0 measured; 24 filtered out; finished in 38.47s
  15. 125.85 s gammaloop-nextest-integration> system-err
  16. 125.85 s gammaloop-nextest-integration> [2026-08-28 10:43:37.462] @gammaloop_api::se... INFO : Running command run generate
  17. 125.85 s gammaloop-nextest-integration> [2026-08-28 10:43:37.462] @gammaloop_api::se... INFO : Starting command block generate
  18. 125.85 s gammaloop-nextest-integration> [2026-08-28 10:43:37.462] @gammaloop_api::se... INFO : Running command import model scalars-default.json
  19. 125.85 s gammaloop-nextest-integration> [2026-08-28 10:43:37.462] @import::model INFO : Loading built-in JSON model scalars-default
  20. 125.85 s gammaloop-nextest-integration> [2026-08-28 10:43:37.466] @gammalooprs::model INFO : The following 2 external parameters were forced to zero by the restriction card:
  21. 125.85 s gammaloop-nextest-integration> width_scalar_1, width_scalar_2
  22. 125.85 s gammaloop-nextest-integration> [2026-08-28 10:43:37.466] @gammaloop_api::se... INFO : Running command remove processes
  23. 125.85 s gammaloop-nextest-integration> [2026-08-28 10:43:37.466] @gammaloop_api::se... INFO : Running command set global kv global.generation.uv.generate_integrated=true
  24. 125.85 s gammaloop-nextest-integration> [2026-08-28 10:43:37.467] @gammaloop_api::se... INFO : Running command import graphs ./tests/resources/graphs/scalar/dod2_bubble.dot -p bubble_dod2 -i scalar_bubble_below_thres
  25. 125.85 s gammaloop-nextest-integration> [2026-08-28 10:43:37.467] @commands::import INFO : Loading graphs from '/build/source/tests/resources/graphs/scalar/dod2_bubble.dot'
  26. 125.85 s gammaloop-nextest-integration> [2026-08-28 10:43:37.469] @gammaloop_api::se... INFO : Running command generate existing -p bubble_dod2 -i scalar_bubble_below_thres
  27. 125.85 s gammaloop-nextest-integration> [2026-08-28 10:43:37.470] @approx::local_4d [{#uv, #inspect, #integrated}] DEBUG : Rescaled momenta expanded
  28. 125.85 s gammaloop-nextest-integration> field value
  29. 125.85 s gammaloop-nextest-integration> res n-terms: 1, byte size: 3,expr:
  30. 125.85 s gammaloop-nextest-integration> 1
  31. 125.85 s gammaloop-nextest-integration> [2026-08-28 10:43:37.471] @approx::local_4d [{#uv, #inspect, #integrated}] DEBUG : Rescaled momenta expanded
  32. 125.85 s gammaloop-nextest-integration> field value
  33. 125.85 s gammaloop-nextest-integration> res n-terms: 1, byte size: 585,expr:
  34. 125.85 s gammaloop-nextest-integration> -SCALAR_COUPLING²·q₀(αᵉ².¹)·q₀(αᵉ³.¹)·q₂(αᵉ².¹)·q₂(αᵉ³.¹)
  35. 125.85 s gammaloop-nextest-integration> /(t²·denom(3,-q₀-q₂/t,mass_scalar_2²,-mass_scalar_2²+2·(q₀.q₂)/t+(q₂.q₂)/t²+(q₀.q₀))
  36. 125.85 s gammaloop-nextest-integration> ·denom(2,q₂/t,mass_scalar_2²,-mass_scalar_2²+(q₂.q₂)/t²))
  37. 125.85 s gammaloop-nextest-integration> [2026-08-28 10:43:37.479] @approx::final_integrand[{#generation, #profile, #uv, #graph, #summary}] DEBUG : Computed global numerator
  38. 125.85 s gammaloop-nextest-integration> field value
  39. 125.85 s gammaloop-nextest-integration> global_num n-terms: 1, byte size: 4,expr:
  40. 125.85 s gammaloop-nextest-integration> 1/2
  41. 125.85 s gammaloop-nextest-integration> span build_3d{span_context=true graph=GL0 current=subgraph=0, topo_order=0, dod=0}
  42. 125.85 s gammaloop-nextest-integration> [2026-08-28 10:43:37.482] @uv::approx [{#generation, #uv, #fourd}] DEBUG : Computing 4D
  43. 125.85 s gammaloop-nextest-integration> field value
  44. 125.85 s gammaloop-nextest-integration> simple subgraph(S_11,S_y)*Approx(subgraph(S_y,0)) of GL0
  45. 125.85 s gammaloop-nextest-integration> span compute_4d{span_context=true graph=GL0 current=subgraph=y, topo_order=1, dod=2 given=subgraph=0, topo_order=0, dod=0 reduced=SubSet { set: BitVec<usize, bitvec::order::Lsb0> { addr: 0x7fffec023490, head: 000000, bits: 6, capacity: 64 } [0, 0, 1, 1, 1, 1], id: PhantomData<linnet::half_edge::involution::Hedge> }}
  46. 125.85 s gammaloop-nextest-integration> [2026-08-28 10:43:37.482] @approx::local_4d [{#uv, #algebra, #integrated, #start}] DEBUG :
  47. 125.85 s gammaloop-nextest-integration> field value
  48. 125.85 s gammaloop-nextest-integration> integrand n-terms: 1, byte size: 409,expr:
  49. 125.85 s gammaloop-nextest-integration> SCALAR_COUPLING²·(q₀(αᵉ³.¹)+q₃(αᵉ³.¹))·q₀(αᵉ².¹)·q₀(αᵉ³.¹)·q₂(αᵉ².¹)
  50. 125.85 s gammaloop-nextest-integration> /(denom(2,q₂,mass_scalar_2²,-mass_scalar_2²+(q₂.q₂))·denom(3,q₃,mass_scalar_2²,-mass_scalar_2²+(q₃.q₃)))
  51. 125.85 s gammaloop-nextest-integration> reduced y
  52. 125.85 s gammaloop-nextest-integration> span grow{span_context=true current=subgraph=y, topo_order=1, dod=2 given=subgraph=0, topo_order=0, dod=0}
  53. 125.85 s gammaloop-nextest-integration> [2026-08-28 10:43:37.483] @approx::local_4d [{#uv, #inspect, #integrated}] DEBUG : Rescaled momenta expanded
  54. 125.85 s gammaloop-nextest-integration> field value
  55. 125.85 s gammaloop-nextest-integration> res n-terms: 1, byte size: 585,expr:
  56. 125.85 s gammaloop-nextest-integration> -SCALAR_COUPLING²·q₀(αᵉ².¹)·q₀(αᵉ³.¹)·q₂(αᵉ².¹)·q₂(αᵉ³.¹)
  57. 125.85 s gammaloop-nextest-integration> /(t²·denom(3,-q₀-q₂/t,mass_scalar_2²,-mass_scalar_2²+2·(q₀.q₂)/t+(q₂.q₂)/t²+(q₀.q₀))
  58. 125.85 s gammaloop-nextest-integration> ·denom(2,q₂/t,mass_scalar_2²,-mass_scalar_2²+(q₂.q₂)/t²))
  59. 125.85 s gammaloop-nextest-integration> span t{span_context=true current=subgraph=y, topo_order=1, dod=2 given=subgraph=0, topo_order=0, dod=0}
  60. 125.85 s gammaloop-nextest-integration> [2026-08-28 10:43:37.483] @approx::local_4d [{#uv, #integrated, #rescaled}] DEBUG : Rescaled expanded
  61. 125.85 s gammaloop-nextest-integration> field value
  62. 125.85 s gammaloop-nextest-integration> n_loops 1
  63. 125.85 s gammaloop-nextest-integration> res n-terms: 1, byte size: 707,expr:
  64. 125.85 s gammaloop-nextest-integration> -SCALAR_COUPLING²·q₀(αᵉ².¹)·q₀(αᵉ³.¹)·q₂(αᵉ².¹)·q₂(αᵉ³.¹)
  65. 125.85 s gammaloop-nextest-integration> /(t²·denom(3,-q₂,mUVexp²+t²·mass_scalar_2²,-mUV²+t²·(-mass_scalar_2²+2·(q₀.q₂)/t+(q₂.q₂)/t²+(q₀.q₀))+t²·mUVexp²)
  66. 125.85 s gammaloop-nextest-integration> ·denom(2,q₂,mUVexp²+t²·mass_scalar_2²,-mUV²+t²·(-mass_scalar_2²+(q₂.q₂)/t²)+t²·mUVexp²))
  67. 125.85 s gammaloop-nextest-integration> span t{span_context=true current=subgraph=y, topo_order=1, dod=2 given=subgraph=0, topo_order=0, dod=0}
  68. 125.85 s gammaloop-nextest-integration> [2026-08-28 10:43:37.484] @approx::local_4d [{#uv, #integrated, #series}] DEBUG : Series expanded
  69. 125.85 s gammaloop-nextest-integration> field value
  70. 125.85 s gammaloop-nextest-integration> res n-terms: 3, byte size: 1896,expr:
  71. 125.85 s gammaloop-nextest-integration> (1/2·SCALAR_COUPLING²·(2·mUVexp²-2·mass_scalar_2²)/(denom(2,q₂,mUVexp²,-mUV²+(q₂.q₂))²·denom(3,-q₂,mUVexp²,-mUV²+(q₂.q₂)))
  72. 125.85 s gammaloop-nextest-integration> -SCALAR_COUPLING²
  73. 125.85 s gammaloop-nextest-integration> ·(-1/2·(2·mUVexp²-2·mass_scalar_2²+2·(q₀.q₀))/denom(3,-q₂,mUVexp²,-mUV²+(q₂.q₂))
  74. 125.85 s gammaloop-nextest-integration> +4·(q₀.q₂)²/denom(3,-q₂,mUVexp²,-mUV²+(q₂.q₂))²
  75. 125.85 s gammaloop-nextest-integration> )/(denom(2,q₂,mUVexp²,-mUV²+(q₂.q₂))·denom(3,-q₂,mUVexp²,-mUV²+(q₂.q₂)))
  76. 125.85 s gammaloop-nextest-integration> )·q₀(αᵉ².¹)·q₀(αᵉ³.¹)·q₂(αᵉ².¹)·q₂(αᵉ³.¹)
  77. 125.85 s gammaloop-nextest-integration> +2·SCALAR_COUPLING²·(q₀.q₂)·q₀(αᵉ².¹)·q₀(αᵉ³.¹)·q₂(αᵉ².¹)·q₂(αᵉ³.¹)
  78. 125.85 s gammaloop-nextest-integration> /(t·denom(2,q₂,mUVexp²,-mUV²+(q₂.q₂))·denom(3,-q₂,mUVexp²,-mUV²+(q₂.q₂))²)
  79. 125.85 s gammaloop-nextest-integration> -SCALAR_COUPLING²·q₀(αᵉ².¹)·q₀(αᵉ³.¹)·q₂(αᵉ².¹)·q₂(αᵉ³.¹)
  80. 125.85 s gammaloop-nextest-integration> /(t²·denom(2,q₂,mUVexp²,-mUV²+(q₂.q₂))·denom(3,-q₂,mUVexp²,-mUV²+(q₂.q₂)))
  81. 125.85 s gammaloop-nextest-integration> span t{span_context=true current=subgraph=y, topo_order=1, dod=2 given=subgraph=0, topo_order=0, dod=0}
  82. 125.85 s gammaloop-nextest-integration> [2026-08-28 10:43:37.485] @approx::local_4d [{#uv, #integrated, #series}] DEBUG : Evaluated at t = 1
  83. 125.85 s gammaloop-nextest-integration> field value
  84. 125.85 s gammaloop-nextest-integration> res n-terms: 3, byte size: 1880,expr:
  85. 125.85 s gammaloop-nextest-integration> (1/2·SCALAR_COUPLING²·(2·mUVexp²-2·mass_scalar_2²)/(denom(2,q₂,mUVexp²,-mUV²+(q₂.q₂))²·denom(3,-q₂,mUVexp²,-mUV²+(q₂.q₂)))
  86. 125.85 s gammaloop-nextest-integration> -SCALAR_COUPLING²
  87. 125.85 s gammaloop-nextest-integration> ·(-1/2·(2·mUVexp²-2·mass_scalar_2²+2·(q₀.q₀))/denom(3,-q₂,mUVexp²,-mUV²+(q₂.q₂))
  88. 125.85 s gammaloop-nextest-integration> +4·(q₀.q₂)²/denom(3,-q₂,mUVexp²,-mUV²+(q₂.q₂))²
  89. 125.85 s gammaloop-nextest-integration> )/(denom(2,q₂,mUVexp²,-mUV²+(q₂.q₂))·denom(3,-q₂,mUVexp²,-mUV²+(q₂.q₂)))
  90. 125.85 s gammaloop-nextest-integration> )·q₀(αᵉ².¹)·q₀(αᵉ³.¹)·q₂(αᵉ².¹)·q₂(αᵉ³.¹)
  91. 125.85 s gammaloop-nextest-integration> -SCALAR_COUPLING²·q₀(αᵉ².¹)·q₀(αᵉ³.¹)·q₂(αᵉ².¹)·q₂(αᵉ³.¹)
  92. 125.85 s gammaloop-nextest-integration> /(denom(2,q₂,mUVexp²,-mUV²+(q₂.q₂))·denom(3,-q₂,mUVexp²,-mUV²+(q₂.q₂)))
  93. 125.85 s gammaloop-nextest-integration> +2·SCALAR_COUPLING²·(q₀.q₂)·q₀(αᵉ².¹)·q₀(αᵉ³.¹)·q₂(αᵉ².¹)·q₂(αᵉ³.¹)
  94. 125.85 s gammaloop-nextest-integration> /(denom(2,q₂,mUVexp²,-mUV²+(q₂.q₂))·denom(3,-q₂,mUVexp²,-mUV²+(q₂.q₂))²)
  95. 125.85 s gammaloop-nextest-integration> span t{span_context=true current=subgraph=y, topo_order=1, dod=2 given=subgraph=0, topo_order=0, dod=0}
  96. 125.85 s gammaloop-nextest-integration> [2026-08-28 10:43:37.486] @approx::local_4d [{#uv, #collect, #integrated}] DEBUG : After gamma chain collection
  97. 125.85 s gammaloop-nextest-integration> field value
  98. 125.85 s gammaloop-nextest-integration> expr n-terms: 3, byte size: 1880,expr:
  99. 125.85 s gammaloop-nextest-integration> (1/2·SCALAR_COUPLING²·(2·mUVexp²-2·mass_scalar_2²)/(denom(2,q₂,mUVexp²,-mUV²+(q₂.q₂))²·denom(3,-q₂,mUVexp²,-mUV²+(q₂.q₂)))
  100. 125.85 s gammaloop-nextest-integration> -SCALAR_COUPLING²
  101. 125.85 s gammaloop-nextest-integration> ·(-1/2·(2·mUVexp²-2·mass_scalar_2²+2·(q₀.q₀))/denom(3,-q₂,mUVexp²,-mUV²+(q₂.q₂))
  102. 125.85 s gammaloop-nextest-integration> +4·(q₀.q₂)²/denom(3,-q₂,mUVexp²,-mUV²+(q₂.q₂))²
  103. 125.85 s gammaloop-nextest-integration> )/(denom(2,q₂,mUVexp²,-mUV²+(q₂.q₂))·denom(3,-q₂,mUVexp²,-mUV²+(q₂.q₂)))
  104. 125.85 s gammaloop-nextest-integration> )·q₀(αᵉ².¹)·q₀(αᵉ³.¹)·q₂(αᵉ².¹)·q₂(αᵉ³.¹)
  105. 125.85 s gammaloop-nextest-integration> -SCALAR_COUPLING²·q₀(αᵉ².¹)·q₀(αᵉ³.¹)·q₂(αᵉ².¹)·q₂(αᵉ³.¹)
  106. 125.85 s gammaloop-nextest-integration> /(denom(2,q₂,mUVexp²,-mUV²+(q₂.q₂))·denom(3,-q₂,mUVexp²,-mUV²+(q₂.q₂)))
  107. 125.85 s gammaloop-nextest-integration> +2·SCALAR_COUPLING²·(q₀.q₂)·q₀(αᵉ².¹)·q₀(αᵉ³.¹)·q₂(αᵉ².¹)·q₂(αᵉ³.¹)
  108. 125.85 s gammaloop-nextest-integration> /(denom(2,q₂,mUVexp²,-mUV²+(q₂.q₂))·denom(3,-q₂,mUVexp²,-mUV²+(q₂.q₂))²)
  109. 125.85 s gammaloop-nextest-integration> span t{span_context=true current=subgraph=y, topo_order=1, dod=2 given=subgraph=0, topo_order=0, dod=0}
  110. 125.85 s gammaloop-nextest-integration> [2026-08-28 10:43:37.489] @approx::local_4d [{#profile, #uv, #collect, #integrated, #start, #trace}] DEBUG : After gamma schoonschip
  111. 125.85 s gammaloop-nextest-integration> field value
  112. 125.85 s gammaloop-nextest-integration> expr n-terms: 3, byte size: 1631,expr:
  113. 125.85 s gammaloop-nextest-integration> (1/2·SCALAR_COUPLING²·(2·mUVexp²-2·mass_scalar_2²)/(denom(2,q₂,mUVexp²,-mUV²+(q₂.q₂))²·denom(3,-q₂,mUVexp²,-mUV²+(q₂.q₂)))
  114. 125.85 s gammaloop-nextest-integration> -SCALAR_COUPLING²
  115. 125.85 s gammaloop-nextest-integration> ·(-1/2·(2·mUVexp²-2·mass_scalar_2²+2·(q₀.q₀))/denom(3,-q₂,mUVexp²,-mUV²+(q₂.q₂))
  116. 125.85 s gammaloop-nextest-integration> +4·(q₀.q₂)²/denom(3,-q₂,mUVexp²,-mUV²+(q₂.q₂))²
  117. 125.85 s gammaloop-nextest-integration> )/(denom(2,q₂,mUVexp²,-mUV²+(q₂.q₂))·denom(3,-q₂,mUVexp²,-mUV²+(q₂.q₂)))
  118. 125.85 s gammaloop-nextest-integration> )·(q₀.q₂)²
  119. 125.85 s gammaloop-nextest-integration> -SCALAR_COUPLING²·(q₀.q₂)²/(denom(2,q₂,mUVexp²,-mUV²+(q₂.q₂))·denom(3,-q₂,mUVexp²,-mUV²+(q₂.q₂)))
  120. 125.85 s gammaloop-nextest-integration> +2·SCALAR_COUPLING²·(q₀.q₂)·(q₀.q₂)²
  121. 125.85 s gammaloop-nextest-integration> /(denom(2,q₂,mUVexp²,-mUV²+(q₂.q₂))·denom(3,-q₂,mUVexp²,-mUV²+(q₂.q₂))²)
  122. 125.85 s gammaloop-nextest-integration> span t{span_context=true current=subgraph=y, topo_order=1, dod=2 given=subgraph=0, topo_order=0, dod=0}
  123. 125.85 s gammaloop-nextest-integration> [2026-08-28 10:43:37.491] @approx::local_4d [{#profile, #uv, #collect, #integrated, #start, #trace}] DEBUG : After gamma collection
  124. 125.85 s gammaloop-nextest-integration> field value
  125. 125.85 s gammaloop-nextest-integration> expr n-terms: 1, byte size: 1347,expr:
  126. 125.85 s gammaloop-nextest-integration> SCALAR_COUPLING²
  127. 125.85 s gammaloop-nextest-integration> ·(-denom(2,q₂,mUVexp²,-mUV²+(q₂.q₂))·denom(3,-q₂,mUVexp²,-mUV²+(q₂.q₂))²
  128. 125.85 s gammaloop-nextest-integration> +1/2·(2·mUVexp²-2·mass_scalar_2²)·denom(3,-q₂,mUVexp²,-mUV²+(q₂.q₂))²
  129. 125.85 s gammaloop-nextest-integration> -(-1/2·(2·mUVexp²-2·mass_scalar_2²+2·(q₀.q₀))·denom(3,-q₂,mUVexp²,-mUV²+(q₂.q₂))+4·(q₀.q₂)²)
  130. 125.85 s gammaloop-nextest-integration> ·denom(2,q₂,mUVexp²,-mUV²+(q₂.q₂))
  131. 125.85 s gammaloop-nextest-integration> +2·(q₀.q₂)·denom(2,q₂,mUVexp²,-mUV²+(q₂.q₂))·denom(3,-q₂,mUVexp²,-mUV²+(q₂.q₂))
  132. 125.85 s gammaloop-nextest-integration> )·(q₀.q₂)²/(denom(2,q₂,mUVexp²,-mUV²+(q₂.q₂))²·denom(3,-q₂,mUVexp²,-mUV²+(q₂.q₂))³)
  133. 125.85 s gammaloop-nextest-integration> span t{span_context=true current=subgraph=y, topo_order=1, dod=2 given=subgraph=0, topo_order=0, dod=0}
  134. 125.85 s gammaloop-nextest-integration> [2026-08-28 10:43:37.492] @approx::local_4d [{#profile, #uv, #gamma, #integrated, #start, #trace, #vakint}] DEBUG : After gamma simplification
  135. 125.85 s gammaloop-nextest-integration> ... omitted 3263 more lines; see full nextest output above
  136. 125.85 s gammaloop-nextest-integration>
  137. 125.85 s gammaloop-nextest-integration> 8. gammaloop-integration-tests::uv::sunrise_scalar_1_uv
  138. 125.87 s gammaloop-nextest-integration> failure: test failure with exit code 101
  139. 125.87 s gammaloop-nextest-integration> system-out
  140. 125.87 s gammaloop-nextest-integration> running 1 test
  141. 125.87 s gammaloop-nextest-integration> test sunrise_scalar_1_uv has been running for over 60 seconds
  142. 125.87 s gammaloop-nextest-integration> +------------------+------------------------+--------------+--------+----------+----------------------------------------------------------------------------------------------------------------------+-------+
  143. 125.87 s gammaloop-nextest-integration> | case | check | graph | status | sigma | threshold | error |
  144. 125.87 s gammaloop-nextest-integration> +------------------+------------------------+--------------+--------+----------+----------------------------------------------------------------------------------------------------------------------+-------+
  145. 125.87 s gammaloop-nextest-integration> | sunrise_scalar_1 | uv_profile | - | FAIL | - | - | - |
  146. 125.87 s gammaloop-nextest-integration> +------------------+------------------------+--------------+--------+----------+----------------------------------------------------------------------------------------------------------------------+-------+
  147. 125.87 s gammaloop-nextest-integration> | sunrise_scalar_1 | m_uv.inspect | inspect | pass | - | best inspect relative delta 1.624e0 >= 1000*accuracy 1.000e-3 (accuracy=1.000e-6, exponent=+1.0, seed=1, probes=10) | - |
  148. 125.87 s gammaloop-nextest-integration> +------------------+------------------------+--------------+--------+----------+----------------------------------------------------------------------------------------------------------------------+-------+
  149. 125.87 s gammaloop-nextest-integration> | sunrise_scalar_1 | m_uv.integrated | sunrise | pass | 0.1sigma | compatible within 2sigma | - |
  150. 125.87 s gammaloop-nextest-integration> +------------------+------------------------+--------------+--------+----------+----------------------------------------------------------------------------------------------------------------------+-------+
  151. 125.87 s gammaloop-nextest-integration> | sunrise_scalar_1 | rls.inspect | inspect | pass | - | best inspect relative delta 8.682e-1 >= 1000*accuracy 1.000e-3 (accuracy=1.000e-6, exponent=+1.0, seed=1, probes=10) | - |
  152. 125.87 s gammaloop-nextest-integration> +------------------+------------------------+--------------+--------+----------+----------------------------------------------------------------------------------------------------------------------+-------+
  153. 125.87 s gammaloop-nextest-integration> | sunrise_scalar_1 | rls.integrated | sunrise | pass | 0.0sigma | compatible within 2sigma | - |
  154. 125.87 s gammaloop-nextest-integration> +------------------+------------------------+--------------+--------+----------+----------------------------------------------------------------------------------------------------------------------+-------+
  155. 125.87 s gammaloop-nextest-integration> | sunrise_scalar_1 | mu_r.inspect | inspect | pass | - | best inspect relative delta 1.752e0 >= 1000*accuracy 1.000e-3 (accuracy=1.000e-6, exponent=+1.0, seed=1, probes=10) | - |
  156. 125.87 s gammaloop-nextest-integration> +------------------+------------------------+--------------+--------+----------+----------------------------------------------------------------------------------------------------------------------+-------+
  157. 125.87 s gammaloop-nextest-integration> | sunrise_scalar_1 | integrated.relerr | integrated | pass | - | relative error 9.20% <= 10.00% | - |
  158. 125.87 s gammaloop-nextest-integration> +------------------+------------------------+--------------+--------+----------+----------------------------------------------------------------------------------------------------------------------+-------+
  159. 125.87 s gammaloop-nextest-integration> | sunrise_scalar_1 | m_uv.integrated.relerr | m_uv-shifted | pass | - | relative error 5.89% <= 10.00% | - |
  160. 125.87 s gammaloop-nextest-integration> +------------------+------------------------+--------------+--------+----------+----------------------------------------------------------------------------------------------------------------------+-------+
  161. 125.87 s gammaloop-nextest-integration> | sunrise_scalar_1 | target | - | pass | - | 2sigma | - |
  162. 125.87 s gammaloop-nextest-integration> +------------------+------------------------+--------------+--------+----------+----------------------------------------------------------------------------------------------------------------------+-------+
  163. 125.87 s gammaloop-nextest-integration> test sunrise_scalar_1_uv ... FAILED
  164. 125.87 s gammaloop-nextest-integration>
  165. 125.87 s gammaloop-nextest-integration> failures:
  166. 125.87 s gammaloop-nextest-integration>
  167. 125.87 s gammaloop-nextest-integration> failures:
  168. 125.87 s gammaloop-nextest-integration> sunrise_scalar_1_uv
  169. 125.87 s gammaloop-nextest-integration>
  170. 125.87 s gammaloop-nextest-integration> test result: FAILED. 0 passed; 1 failed; 0 ignored; 0 measured; 24 filtered out; finished in 92.49s
  171. 125.88 s gammaloop-nextest-integration> system-err
  172. 125.88 s gammaloop-nextest-integration> [2026-08-28 10:43:41.759] @gammaloop_api::se... INFO : Running command run generate
  173. 125.88 s gammaloop-nextest-integration> [2026-08-28 10:43:41.759] @gammaloop_api::se... INFO : Starting command block generate
  174. 125.88 s gammaloop-nextest-integration> [2026-08-28 10:43:41.760] @gammaloop_api::se... INFO : Running command import model scalars-default.json
  175. 125.88 s gammaloop-nextest-integration> [2026-08-28 10:43:41.760] @import::model INFO : Loading built-in JSON model scalars-default
  176. 125.88 s gammaloop-nextest-integration> [2026-08-28 10:43:41.764] @gammalooprs::model INFO : The following 2 external parameters were forced to zero by the restriction card:
  177. 125.88 s gammaloop-nextest-integration> width_scalar_1, width_scalar_2
  178. 125.88 s gammaloop-nextest-integration> [2026-08-28 10:43:41.764] @gammaloop_api::se... INFO : Running command remove processes
  179. 125.88 s gammaloop-nextest-integration> [2026-08-28 10:43:41.764] @gammaloop_api::se... INFO : Running command set global kv global.generation.uv.generate_integrated=true
  180. 125.88 s gammaloop-nextest-integration> [2026-08-28 10:43:41.765] @gammaloop_api::se... INFO : Running command import graphs ./tests/resources/graphs/scalar_sunrise.dot -p sunrise_scalar_1 -i scalar_sunrise
  181. 125.88 s gammaloop-nextest-integration> [2026-08-28 10:43:41.765] @commands::import INFO : Loading graphs from '/build/source/tests/resources/graphs/scalar_sunrise.dot'
  182. 125.88 s gammaloop-nextest-integration> [2026-08-28 10:43:41.767] @gammaloop_api::se... INFO : Running command generate existing -p sunrise_scalar_1 -i scalar_sunrise
  183. 125.88 s gammaloop-nextest-integration> [2026-08-28 10:43:41.769] @approx::local_4d [{#uv, #inspect, #integrated}] DEBUG : Rescaled momenta expanded
  184. 125.88 s gammaloop-nextest-integration> field value
  185. 125.88 s gammaloop-nextest-integration> res n-terms: 1, byte size: 611,expr:
  186. 125.88 s gammaloop-nextest-integration> 1/(denom(0,q₀/t,mass_scalar_1²,-mass_scalar_1²+(q₀.q₀)/t²)
  187. 125.88 s gammaloop-nextest-integration> ·denom(1,-q₂+q₃-q₀/t,mass_scalar_1²,
  188. 125.88 s gammaloop-nextest-integration> -mass_scalar_1²+2·(q₀.q₂)/t-2·(q₀.q₃)/t+(q₀.q₀)/t²+(q₂.q₂)
  189. 125.88 s gammaloop-nextest-integration> -2·(q₂.q₃)+(q₃.q₃)
  190. 125.88 s gammaloop-nextest-integration> ))
  191. 125.88 s gammaloop-nextest-integration> [2026-08-28 10:43:41.786] @approx::local_4d [{#uv, #inspect, #integrated}] DEBUG : Rescaled momenta expanded
  192. 125.88 s gammaloop-nextest-integration> field value
  193. 125.88 s gammaloop-nextest-integration> res n-terms: 1, byte size: 3,expr:
  194. 125.88 s gammaloop-nextest-integration> 1
  195. 125.88 s gammaloop-nextest-integration> [2026-08-28 10:43:41.787] @approx::local_4d [{#uv, #inspect, #integrated}] DEBUG : Rescaled momenta expanded
  196. 125.88 s gammaloop-nextest-integration> field value
  197. 125.88 s gammaloop-nextest-integration> res n-terms: 1, byte size: 611,expr:
  198. 125.88 s gammaloop-nextest-integration> 1/(denom(0,q₀/t,mass_scalar_1²,-mass_scalar_1²+(q₀.q₀)/t²)
  199. 125.88 s gammaloop-nextest-integration> ·denom(2,-q₁+q₃-q₀/t,mass_scalar_1²,
  200. 125.88 s gammaloop-nextest-integration> -mass_scalar_1²+2·(q₀.q₁)/t-2·(q₀.q₃)/t+(q₀.q₀)/t²+(q₁.q₁)
  201. 125.88 s gammaloop-nextest-integration> -2·(q₁.q₃)+(q₃.q₃)
  202. 125.88 s gammaloop-nextest-integration> ))
  203. 125.88 s gammaloop-nextest-integration> [2026-08-28 10:43:41.789] @approx::local_4d [{#uv, #inspect, #integrated}] DEBUG : Rescaled momenta expanded
  204. 125.88 s gammaloop-nextest-integration> field value
  205. 125.88 s gammaloop-nextest-integration> res n-terms: 1, byte size: 611,expr:
  206. 125.88 s gammaloop-nextest-integration> 1/(denom(1,q₁/t,mass_scalar_1²,-mass_scalar_1²+(q₁.q₁)/t²)
  207. 125.88 s gammaloop-nextest-integration> ·denom(2,-q₀+q₃-q₁/t,mass_scalar_1²,
  208. 125.88 s gammaloop-nextest-integration> -mass_scalar_1²+2·(q₀.q₁)/t-2·(q₁.q₃)/t+(q₁.q₁)/t²+(q₀.q₀)
  209. 125.88 s gammaloop-nextest-integration> -2·(q₀.q₃)+(q₃.q₃)
  210. 125.88 s gammaloop-nextest-integration> ))
  211. 125.88 s gammaloop-nextest-integration> [2026-08-28 10:43:41.791] @approx::local_4d [{#uv, #inspect, #integrated}] DEBUG : Rescaled momenta expanded
  212. 125.88 s gammaloop-nextest-integration> field value
  213. 125.88 s gammaloop-nextest-integration> res n-terms: 1, byte size: 777,expr:
  214. 125.88 s gammaloop-nextest-integration> 1/(denom(0,q₀/t,mass_scalar_1²,-mass_scalar_1²+(q₀.q₀)/t²)·denom(1,q₁/t,mass_scalar_1²,-mass_scalar_1²+(q₁.q₁)/t²)
  215. 125.88 s gammaloop-nextest-integration> ·denom(2,q₄-q₀/t-q₁/t,mass_scalar_1²,
  216. 125.88 s gammaloop-nextest-integration> -mass_scalar_1²-2·(q₀.q₄)/t-2·(q₁.q₄)/t+(q₀.q₀)/t²+2·(q₀.q₁)/t²
  217. 125.88 s gammaloop-nextest-integration> +(q₁.q₁)/t²+(q₄.q₄)
  218. 125.88 s gammaloop-nextest-integration> ))
  219. 125.88 s gammaloop-nextest-integration> [2026-08-28 10:43:41.794] @approx::final_integrand[{#generation, #profile, #uv, #graph, #summary}] DEBUG : Computed global numerator
  220. 125.88 s gammaloop-nextest-integration> field value
  221. 125.88 s gammaloop-nextest-integration> global_num n-terms: 1, byte size: 3,expr:
  222. 125.88 s gammaloop-nextest-integration> 1
  223. 125.88 s gammaloop-nextest-integration> span build_3d{span_context=true graph=sunrise current=subgraph=0, topo_order=0, dod=0}
  224. 125.88 s gammaloop-nextest-integration> [2026-08-28 10:43:41.797] @uv::approx [{#generation, #uv, #fourd}] DEBUG : Computing 4D
  225. 125.88 s gammaloop-nextest-integration> field value
  226. 125.88 s gammaloop-nextest-integration> simple subgraph(S_47,S_y)*Approx(subgraph(S_y,0)) of sunrise
  227. 125.88 s gammaloop-nextest-integration> span compute_4d{span_context=true graph=sunrise current=subgraph=y, topo_order=1, dod=0 given=subgraph=0, topo_order=0, dod=0 reduced=SubSet { set: BitVec<usize, bitvec::order::Lsb0> { addr: 0x7fffec0167f0, head: 000000, bits: 8, capacity: 64 } [0, 0, 1, 1, 1, 1, 0, 0], id: PhantomData<linnet::half_edge::involution::Hedge> }}
  228. 125.88 s gammaloop-nextest-integration> [2026-08-28 10:43:41.798] @approx::local_4d [{#uv, #algebra, #integrated, #start}] DEBUG :
  229. 125.88 s gammaloop-nextest-integration> field value
  230. 125.88 s gammaloop-nextest-integration> integrand n-terms: 1, byte size: 217,expr:
  231. 125.88 s gammaloop-nextest-integration> 1/(denom(0,q₀,mass_scalar_1²,-mass_scalar_1²+(q₀.q₀))·denom(1,q₁,mass_scalar_1²,-mass_scalar_1²+(q₁.q₁)))
  232. 125.88 s gammaloop-nextest-integration> reduced y
  233. 125.88 s gammaloop-nextest-integration> span grow{span_context=true current=subgraph=y, topo_order=1, dod=0 given=subgraph=0, topo_order=0, dod=0}
  234. 125.88 s gammaloop-nextest-integration> [2026-08-28 10:43:41.798] @approx::local_4d [{#uv, #inspect, #integrated}] DEBUG : Rescaled momenta expanded
  235. 125.88 s gammaloop-nextest-integration> field value
  236. 125.88 s gammaloop-nextest-integration> res n-terms: 1, byte size: 611,expr:
  237. 125.88 s gammaloop-nextest-integration> 1/(denom(0,q₀/t,mass_scalar_1²,-mass_scalar_1²+(q₀.q₀)/t²)
  238. 125.88 s gammaloop-nextest-integration> ·denom(1,-q₂+q₃-q₀/t,mass_scalar_1²,
  239. 125.88 s gammaloop-nextest-integration> -mass_scalar_1²+2·(q₀.q₂)/t-2·(q₀.q₃)/t+(q₀.q₀)/t²+(q₂.q₂)
  240. 125.88 s gammaloop-nextest-integration> -2·(q₂.q₃)+(q₃.q₃)
  241. 125.88 s gammaloop-nextest-integration> ))
  242. 125.88 s gammaloop-nextest-integration> span t{span_context=true current=subgraph=y, topo_order=1, dod=0 given=subgraph=0, topo_order=0, dod=0}
  243. 125.88 s gammaloop-nextest-integration> [2026-08-28 10:43:41.798] @approx::local_4d [{#uv, #integrated, #rescaled}] DEBUG : Rescaled expanded
  244. 125.88 s gammaloop-nextest-integration> field value
  245. 125.88 s gammaloop-nextest-integration> n_loops 1
  246. 125.88 s gammaloop-nextest-integration> res n-terms: 1, byte size: 723,expr:
  247. 125.88 s gammaloop-nextest-integration> 1/(denom(0,q₀,mUVexp²+t²·mass_scalar_1²,-mUV²+t²·(-mass_scalar_1²+(q₀.q₀)/t²)+t²·mUVexp²)
  248. 125.88 s gammaloop-nextest-integration> ·denom(1,-q₀,mUVexp²+t²·mass_scalar_1²,
  249. 125.88 s gammaloop-nextest-integration> -mUV²
  250. 125.88 s gammaloop-nextest-integration> +t²
  251. 125.88 s gammaloop-nextest-integration> ·(-mass_scalar_1²+2·(q₀.q₂)/t-2·(q₀.q₃)/t+(q₀.q₀)/t²+(q₂.q₂)
  252. 125.88 s gammaloop-nextest-integration> -2·(q₂.q₃)+(q₃.q₃)
  253. 125.88 s gammaloop-nextest-integration> )
  254. 125.88 s gammaloop-nextest-integration> +t²·mUVexp²
  255. 125.88 s gammaloop-nextest-integration> ))
  256. 125.88 s gammaloop-nextest-integration> span t{span_context=true current=subgraph=y, topo_order=1, dod=0 given=subgraph=0, topo_order=0, dod=0}
  257. 125.88 s gammaloop-nextest-integration> [2026-08-28 10:43:41.799] @approx::local_4d [{#uv, #integrated, #series}] DEBUG : Series expanded
  258. 125.88 s gammaloop-nextest-integration> field value
  259. 125.88 s gammaloop-nextest-integration> res n-terms: 1, byte size: 223,expr:
  260. 125.88 s gammaloop-nextest-integration> 1/(denom(0,q₀,mUVexp²,-mUV²+(q₀.q₀))·denom(1,-q₀,mUVexp²,-mUV²+(q₀.q₀)))
  261. 125.88 s gammaloop-nextest-integration> span t{span_context=true current=subgraph=y, topo_order=1, dod=0 given=subgraph=0, topo_order=0, dod=0}
  262. 125.88 s gammaloop-nextest-integration> [2026-08-28 10:43:41.799] @approx::local_4d [{#uv, #integrated, #series}] DEBUG : Evaluated at t = 1
  263. 125.88 s gammaloop-nextest-integration> field value
  264. 125.88 s gammaloop-nextest-integration> res n-terms: 1, byte size: 223,expr:
  265. 125.88 s gammaloop-nextest-integration> 1/(denom(0,q₀,mUVexp²,-mUV²+(q₀.q₀))·denom(1,-q₀,mUVexp²,-mUV²+(q₀.q₀)))
  266. 125.88 s gammaloop-nextest-integration> span t{span_context=true current=subgraph=y, topo_order=1, dod=0 given=subgraph=0, topo_order=0, dod=0}
  267. 125.88 s gammaloop-nextest-integration> [2026-08-28 10:43:41.799] @approx::local_4d [{#uv, #collect, #integrated}] DEBUG : After gamma chain collection
  268. 125.88 s gammaloop-nextest-integration> field value
  269. 125.88 s gammaloop-nextest-integration> expr n-terms: 1, byte size: 223,expr:
  270. 125.88 s gammaloop-nextest-integration> 1/(denom(0,q₀,mUVexp²,-mUV²+(q₀.q₀))·denom(1,-q₀,mUVexp²,-mUV²+(q₀.q₀)))
  271. 125.88 s gammaloop-nextest-integration> span t{span_context=true current=subgraph=y, topo_order=1, dod=0 given=subgraph=0, topo_order=0, dod=0}
  272. 125.88 s gammaloop-nextest-integration> [2026-08-28 10:43:41.800] @approx::local_4d [{#profile, #uv, #collect, #integrated, #start, #trace}] DEBUG : After gamma schoonschip
  273. 125.88 s gammaloop-nextest-integration> field value
  274. 125.88 s gammaloop-nextest-integration> expr n-terms: 1, byte size: 223,expr:
  275. 125.88 s gammaloop-nextest-integration> 1/(denom(0,q₀,mUVexp²,-mUV²+(q₀.q₀))·denom(1,-q₀,mUVexp²,-mUV²+(q₀.q₀)))
  276. 125.88 s gammaloop-nextest-integration> span t{span_context=true current=subgraph=y, topo_order=1, dod=0 given=subgraph=0, topo_order=0, dod=0}
  277. 125.88 s gammaloop-nextest-integration> [2026-08-28 10:43:41.800] @approx::local_4d [{#profile, #uv, #collect, #integrated, #start, #trace}] DEBUG : After gamma collection
  278. 125.88 s gammaloop-nextest-integration> field value
  279. 125.88 s gammaloop-nextest-integration> expr n-terms: 1, byte size: 223,expr:
  280. 125.88 s gammaloop-nextest-integration> 1/(denom(0,q₀,mUVexp²,-mUV²+(q₀.q₀))·denom(1,-q₀,mUVexp²,-mUV²+(q₀.q₀)))
  281. 125.88 s gammaloop-nextest-integration> span t{span_context=true current=subgraph=y, topo_order=1, dod=0 given=subgraph=0, topo_order=0, dod=0}
  282. 125.88 s gammaloop-nextest-integration> [2026-08-28 10:43:41.801] @approx::local_4d [{#profile, #uv, #gamma, #integrated, #start, #trace, #vakint}] DEBUG : After gamma simplification
  283. 125.88 s gammaloop-nextest-integration> field value
  284. 125.88 s gammaloop-nextest-integration> expr n-terms: 1, byte size: 223,expr:
  285. 125.88 s gammaloop-nextest-integration> 1/(denom(0,q₀,mUVexp²,-mUV²+(q₀.q₀))·denom(1,-q₀,mUVexp²,-mUV²+(q₀.q₀)))
  286. 125.88 s gammaloop-nextest-integration> span t{span_context=true current=subgraph=y, topo_order=1, dod=0 given=subgraph=0, topo_order=0, dod=0}
  287. 125.88 s gammaloop-nextest-integration> [2026-08-28 10:43:41.801] @approx::local_4d [{#profile, #uv, #integrated, #schoonschip, #start, #trace, #vakint}] DEBUG : After Schoonschip net
  288. 125.88 s gammaloop-nextest-integration> field value
  289. 125.88 s gammaloop-nextest-integration> expr n-terms: 1, byte size: 223,expr:
  290. 125.88 s gammaloop-nextest-integration> 1/(denom(0,q₀,mUVexp²,-mUV²+(q₀.q₀))·denom(1,-q₀,mUVexp²,-mUV²+(q₀.q₀)))
  291. 125.88 s gammaloop-nextest-integration> ... omitted 20095 more lines; see full nextest output above
  292. 125.88 s gammaloop-nextest-integration>
  293. 125.88 s gammaloop-nextest-integration> 9. gammaloop-integration-tests::uv::se1l_uv
  294. 125.88 s gammaloop-nextest-integration> failure: test failure with exit code 101
  295. 125.88 s gammaloop-nextest-integration> system-out
  296. 125.88 s gammaloop-nextest-integration> running 1 test
  297. 125.88 s gammaloop-nextest-integration> test se1l_uv has been running for over 60 seconds
  298. 125.88 s gammaloop-nextest-integration> +------+-----------------+---------+--------+----------+-----------------------------------------------------------------------------------------------------------------------+-------+
  299. 125.88 s gammaloop-nextest-integration> | case | check | graph | status | sigma | threshold | error |
  300. 125.88 s gammaloop-nextest-integration> +------+-----------------+---------+--------+----------+-----------------------------------------------------------------------------------------------------------------------+-------+
  301. 125.88 s gammaloop-nextest-integration> | se1l | uv_profile | - | FAIL | - | - | - |
  302. 125.88 s gammaloop-nextest-integration> +------+-----------------+---------+--------+----------+-----------------------------------------------------------------------------------------------------------------------+-------+
  303. 125.88 s gammaloop-nextest-integration> | se1l | m_uv.inspect | inspect | pass | - | best inspect relative delta 1.097e-1 >= 1000*accuracy 1.000e-7 (accuracy=1.000e-10, exponent=+2.0, seed=1, probes=10) | - |
  304. 125.88 s gammaloop-nextest-integration> +------+-----------------+---------+--------+----------+-----------------------------------------------------------------------------------------------------------------------+-------+
  305. 125.88 s gammaloop-nextest-integration> | se1l | m_uv.integrated | se1l | pass | 0.1sigma | compatible within 2sigma | - |
  306. 125.88 s gammaloop-nextest-integration> +------+-----------------+---------+--------+----------+-----------------------------------------------------------------------------------------------------------------------+-------+
  307. 125.88 s gammaloop-nextest-integration> | se1l | rls.inspect | inspect | pass | - | best inspect relative delta 4.499e-2 >= 1000*accuracy 1.000e-7 (accuracy=1.000e-10, exponent=+2.0, seed=1, probes=10) | - |
  308. 125.88 s gammaloop-nextest-integration> +------+-----------------+---------+--------+----------+-----------------------------------------------------------------------------------------------------------------------+-------+
  309. 125.88 s gammaloop-nextest-integration> | se1l | rls.integrated | se1l | pass | 0.0sigma | compatible within 2sigma | - |
  310. 125.88 s gammaloop-nextest-integration> +------+-----------------+---------+--------+----------+-----------------------------------------------------------------------------------------------------------------------+-------+
  311. 125.88 s gammaloop-nextest-integration> | se1l | mu_r.inspect | inspect | pass | - | best inspect relative delta 1.424e-1 >= 1000*accuracy 1.000e-7 (accuracy=1.000e-10, exponent=+2.0, seed=1, probes=10) | - |
  312. 125.88 s gammaloop-nextest-integration> +------+-----------------+---------+--------+----------+-----------------------------------------------------------------------------------------------------------------------+-------+
  313. 125.88 s gammaloop-nextest-integration> | se1l | target | - | pass | - | 2sigma | - |
  314. 125.88 s gammaloop-nextest-integration> +------+-----------------+---------+--------+----------+-----------------------------------------------------------------------------------------------------------------------+-------+
  315. 125.88 s gammaloop-nextest-integration> test se1l_uv ... FAILED
  316. 125.88 s gammaloop-nextest-integration>
  317. 125.88 s gammaloop-nextest-integration> failures:
  318. 125.88 s gammaloop-nextest-integration>
  319. 125.88 s gammaloop-nextest-integration> failures:
  320. 125.88 s gammaloop-nextest-integration> se1l_uv
  321. 125.88 s gammaloop-nextest-integration>
  322. 125.88 s gammaloop-nextest-integration> test result: FAILED. 0 passed; 1 failed; 0 ignored; 0 measured; 24 filtered out; finished in 102.41s
  323. 125.88 s gammaloop-nextest-integration> system-err
  324. 125.88 s gammaloop-nextest-integration> [2026-08-28 10:43:41.288] @gammaloop_api::se... INFO : Running command run generate
  325. 125.88 s gammaloop-nextest-integration> [2026-08-28 10:43:41.288] @gammaloop_api::se... INFO : Starting command block generate
  326. 125.88 s gammaloop-nextest-integration> [2026-08-28 10:43:41.288] @gammaloop_api::se... INFO : Running command import model sm-default
  327. 125.88 s gammaloop-nextest-integration> [2026-08-28 10:43:41.288] @import::model INFO : Loading built-in JSON model sm-default
  328. 125.88 s gammaloop-nextest-integration> [2026-08-28 10:43:41.312] @gammalooprs::model INFO : The following 11 external parameters were forced to zero by the restriction card:
  329. 125.88 s gammaloop-nextest-integration> lamWS, AWS, rhoWS, etaWS, ymc, yme, ymm, MC, Me, MM, WTau
  330. 125.88 s gammaloop-nextest-integration> [2026-08-28 10:43:41.312] @gammalooprs::model INFO : The following 34 vertex rules were removed by the restriction card:
  331. 125.88 s gammaloop-nextest-integration> V_82 -> (c~, d, G+) | V_83 -> (t~, d, G+) | V_84 -> (c~, s, G+) | V_85 -> (t~, s, G+) | V_86 -> (u~, b, G+) | V_87 -> (c~, b, G+) | V_90 -> (c~, d, W+) | V_91 -> (t~, d, W+) | V_92 -> (u~, s, W+) | V_94 -> (t~, s, W+) | V_95 -> (u~, b, W+) | V_96 -> (c~, b, W+) | V_101 -> (e+, e-, G0) | V_102 -> (mu+, mu-, G0) | V_104 -> (e+, e-, H) | V_105 -> (mu+, mu-, H) | V_110 -> (ve~, e-, G+) | V_111 -> (vm~, mu-, G+) | V_116 -> (b~, u, G-) | V_117 -> (d~, c, G-) | V_118 -> (s~, c, G-) | V_119 -> (b~, c, G-) | V_120 -> (d~, t, G-) | V_121 -> (s~, t, G-) | V_124 -> (s~, u, W-) | V_125 -> (b~, u, W-) | V_126 -> (d~, c, W-) | V_128 -> (b~, c, W-) | V_129 -> (d~, t, W-) | V_130 -> (s~, t, W-) | V_138 -> (c~, c, G0) | V_140 -> (c~, c, H) | V_145 -> (e+, ve, G-) | V_146 -> (mu+, vm, G-)
  332. 125.88 s gammaloop-nextest-integration> [2026-08-28 10:43:41.312] @gammalooprs::model INFO : The following 36 couplings were removed by the restriction card:
  333. 125.88 s gammaloop-nextest-integration> GC_13, GC_14, GC_16, GC_17, GC_18, GC_19, GC_20, GC_22, GC_23, GC_24, GC_25, GC_26, GC_28, GC_29, GC_42, GC_43, GC_44, GC_46, GC_47, GC_48, GC_84, GC_85, GC_86, GC_87, GC_88, GC_89, GC_90, GC_91, GC_92, GC_93, GC_101, GC_102, GC_103, GC_105, GC_106, GC_107
  334. 125.88 s gammaloop-nextest-integration> [2026-08-28 10:43:41.313] @gammaloop_api::se... INFO : Running command remove processes
  335. 125.88 s gammaloop-nextest-integration> [2026-08-28 10:43:41.313] @gammaloop_api::se... INFO : Running command set global kv global.generation.uv.generate_integrated=true
  336. 125.88 s gammaloop-nextest-integration> [2026-08-28 10:43:41.313] @gammaloop_api::se... INFO : Running command import graphs ./tests/resources/graphs/uv_tests/se1l.dot -p se1l -i se1l
  337. 125.88 s gammaloop-nextest-integration> [2026-08-28 10:43:41.313] @commands::import INFO : Loading graphs from '/build/source/tests/resources/graphs/uv_tests/se1l.dot'
  338. 125.88 s gammaloop-nextest-integration> [2026-08-28 10:43:41.316] @gammaloop_api::se... INFO : Running command generate existing -p se1l -i se1l
  339. 125.88 s gammaloop-nextest-integration> [2026-08-28 10:43:42.260] @commands::generate INFO :
  340. 125.88 s gammaloop-nextest-integration> Integrand generation summary
  341. 125.88 s gammaloop-nextest-integration> peak RAM 88.97 MiB | cores 1
  342. 125.88 s gammaloop-nextest-integration> ╭───────────┬───────┬─────────┬─────────────┬─────────────┬────────────────┬─────────────╮
  343. 125.88 s gammaloop-nextest-integration> │ integrand │ graph │ # evals │ expr build │ spenso │ symbolica eval │ compile │
  344. 125.88 s gammaloop-nextest-integration> ├───────────┼───────┼─────────┼─────────────┼─────────────┼────────────────┼─────────────┤
  345. 125.88 s gammaloop-nextest-integration> │ se1l │ se1l │ 5 │ 794ms (88%) │ 35ms (3.9%) │ 74ms (8.3%) │ 0ms (0.00%) │
  346. 125.88 s gammaloop-nextest-integration> ├───────────┼───────┼─────────┼─────────────┼─────────────┼────────────────┼─────────────┤
  347. 125.88 s gammaloop-nextest-integration> │ Total │ │ 5 │ 794ms (88%) │ 35ms (3.9%) │ 74ms (8.3%) │ 0ms (0.00%) │
  348. 125.88 s gammaloop-nextest-integration> ╰───────────┴───────┴─────────┴─────────────┴─────────────┴────────────────┴─────────────╯
  349. 125.88 s gammaloop-nextest-integration> [2026-08-28 10:43:42.261] @gammaloop_api::se... INFO : Running command set process -p se1l -i se1l kv general.m_uv=0.2
  350. 125.88 s gammaloop-nextest-integration> [2026-08-28 10:43:42.262] @gammaloop_api::se... INFO : Running command set process -p se1l -i se1l kv general.mu_r=0.2
  351. 125.88 s gammaloop-nextest-integration> [2026-08-28 10:43:42.263] @gammaloop_api::se... INFO : Running command set process -p se1l -i se1l kv general.renormalization_localization_scale=0.2
  352. 125.88 s gammaloop-nextest-integration> [2026-08-28 10:43:42.264] @gammaloop_api::se... INFO : Running command duplicate integrand -p se1l -i se1l --output_process_name se1l --output_integrand_name se1l_muv_shifted
  353. 125.88 s gammaloop-nextest-integration> [2026-08-28 10:43:42.265] @gammaloop_api::se... INFO : Running command set process -p se1l -i se1l_muv_shifted kv general.m_uv=0.5
  354. 125.88 s gammaloop-nextest-integration> [2026-08-28 10:43:42.266] @gammaloop_api::se... INFO : Running command duplicate integrand -p se1l -i se1l --output_process_name se1l --output_integrand_name se1l_rls_shifted
  355. 125.88 s gammaloop-nextest-integration> [2026-08-28 10:43:42.267] @gammaloop_api::se... INFO : Running command set process -p se1l -i se1l_rls_shifted kv general.renormalization_localization_scale=1
  356. 125.88 s gammaloop-nextest-integration> [2026-08-28 10:43:42.268] @gammaloop_api::se... INFO : Running command duplicate integrand -p se1l -i se1l --output_process_name se1l --output_integrand_name se1l_mur_shifted
  357. 125.88 s gammaloop-nextest-integration> [2026-08-28 10:43:42.270] @gammaloop_api::se... INFO : Running command set process -p se1l -i se1l_mur_shifted kv general.mu_r=0.8
  358. 125.88 s gammaloop-nextest-integration> [2026-08-28 10:43:42.275] @process::amplitude WARNING : External state 0 ('g', PDG 21, helicity +) is off shell: p^2 = +2.5e5, expected m^2 = +0e0 (|Δ| = +2.5e5). Fixed-helicity spinor/vector/tensor external states may be ill-defined at this kinematic point.
  359. 125.88 s gammaloop-nextest-integration> field value
  360. 125.88 s gammaloop-nextest-integration> span warm_up{integrand.name=se1l}
  361. 125.88 s gammaloop-nextest-integration> [2026-08-28 10:43:42.275] @process::amplitude WARNING : External state 1 ('g', PDG 21, helicity -) is off shell: p^2 = +2.5e5, expected m^2 = +0e0 (|Δ| = +2.5e5). Fixed-helicity spinor/vector/tensor external states may be ill-defined at this kinematic point.
  362. 125.88 s gammaloop-nextest-integration> field value
  363. 125.88 s gammaloop-nextest-integration> span warm_up{integrand.name=se1l}
  364. 125.88 s gammaloop-nextest-integration> [2026-08-28 10:43:42.275] @process::amplitude INFO : Input is above threshold: 1 existing threshold E-surfaces across 1/1 graph groups
  365. 125.88 s gammaloop-nextest-integration> field value
  366. 125.88 s gammaloop-nextest-integration> existing_esurfaces 1
  367. 125.88 s gammaloop-nextest-integration> group_count 1
  368. 125.88 s gammaloop-nextest-integration> groups_above_threshold 1
  369. 125.88 s gammaloop-nextest-integration> integrand se1l
  370. 125.88 s gammaloop-nextest-integration> span warm_up{integrand.name=se1l}
  371. 125.88 s gammaloop-nextest-integration> threshold_status above threshold
  372. 125.88 s gammaloop-nextest-integration> [2026-08-28 10:43:42.275] @process::amplitude INFO : overlap structure of group 0: [1: [0(2,3)]]
  373. 125.88 s gammaloop-nextest-integration> field value
  374. 125.88 s gammaloop-nextest-integration> span warm_up{integrand.name=se1l}
  375. 125.88 s gammaloop-nextest-integration> [2026-08-28 10:43:42.434] @commands::profile INFO :
  376. 125.88 s gammaloop-nextest-integration> ╭───────┬──────┬──────────┬───────┬─────┬──────────┬───────────╮
  377. 125.88 s gammaloop-nextest-integration> │ fixed │ → ∞ │ slope │ r2 │ DOD │ bare DOD │ inspect │
  378. 125.88 s gammaloop-nextest-integration> ├───────┼──────┼──────────┼───────┼─────┼──────────┼───────────┤
  379. 125.88 s gammaloop-nextest-integration> │ {} │ {e3} │ 1.639236 │ 0.904 │ 2 │ 2 │ arb retry │
  380. 125.88 s gammaloop-nextest-integration> │ {} │ {e2} │ 1.698834 │ 0.902 │ 2 │ 2 │ arb retry │
  381. 125.88 s gammaloop-nextest-integration> ╰───────┴──────┴──────────┴───────┴─────┴──────────┴───────────╯
  382. 125.88 s gammaloop-nextest-integration> [2026-08-28 10:43:42.434] @commands::profile INFO :
  383. 125.88 s gammaloop-nextest-integration> ╭───────┬──────┬─────────────┬──────────┬───────┬─────┬──────────┬───────────╮
  384. 125.88 s gammaloop-nextest-integration> │ fixed │ → ∞ │ orientation │ slope │ r2 │ DOD │ bare DOD │ inspect │
  385. 125.88 s gammaloop-nextest-integration> ├───────┼──────┼─────────────┼──────────┼───────┼─────┼──────────┼───────────┤
  386. 125.88 s gammaloop-nextest-integration> │ {} │ {e3} │ 00-+ │ 0.343429 │ 0.145 │ 0 │ 2 │ arb retry │
  387. 125.88 s gammaloop-nextest-integration> │ {} │ {e3} │ 00+- │ 0.342577 │ 0.135 │ 0 │ 2 │ arb retry │
  388. 125.88 s gammaloop-nextest-integration> │ {} │ {e2} │ 00-+ │ 0.385975 │ 0.161 │ 0 │ 2 │ arb retry │
  389. 125.88 s gammaloop-nextest-integration> │ {} │ {e2} │ 00+- │ 0.384920 │ 0.192 │ 0 │ 2 │ arb retry │
  390. 125.88 s gammaloop-nextest-integration> ╰───────┴──────┴─────────────┴──────────┴───────┴─────┴──────────┴───────────╯
  391. 125.88 s gammaloop-nextest-integration> [2026-08-28 10:43:42.435] @gammaloop_api::se... INFO : Running command set process kv integrator.target_relative_accuracy=0.001 integrator.n_increase=0 integrator.n_start=50000 integrator.n_max=400000 integrator.seed=1337
  392. 125.88 s gammaloop-nextest-integration> [2026-08-28 10:43:42.435] @commands::integrate INFO : Created workspace directory at /build/source/tests/artifacts/se1l/integration_workspace_se1l
  393. 125.88 s gammaloop-nextest-integration> [2026-08-28 10:43:42.459] @commands::integrate INFO : No integration state found, starting new integration
  394. 125.88 s gammaloop-nextest-integration> [2026-08-28 10:43:42.459] @commands::integrate INFO : Gammaloop now integrates se1l@se1l, se1l@se1l_muv_shifted, se1l@se1l_rls_shifted
  395. 125.88 s gammaloop-nextest-integration> [2026-08-28 10:43:42.459] @process::amplitude WARNING : External state 0 ('g', PDG 21, helicity +) is off shell: p^2 = +2.5e5, expected m^2 = +0e0 (|Δ| = +2.5e5). Fixed-helicity spinor/vector/tensor external states may be ill-defined at this kinematic point.
  396. 125.88 s gammaloop-nextest-integration> field value
  397. 125.88 s gammaloop-nextest-integration> span warm_up{integrand.name=se1l}
  398. 125.88 s gammaloop-nextest-integration> [2026-08-28 10:43:42.459] @process::amplitude WARNING : External state 1 ('g', PDG 21, helicity -) is off shell: p^2 = +2.5e5, expected m^2 = +0e0 (|Δ| = +2.5e5). Fixed-helicity spinor/vector/tensor external states may be ill-defined at this kinematic point.
  399. 125.88 s gammaloop-nextest-integration> field value
  400. 125.88 s gammaloop-nextest-integration> span warm_up{integrand.name=se1l}
  401. 125.88 s gammaloop-nextest-integration> [2026-08-28 10:43:42.460] @process::amplitude INFO : Input is above threshold: 1 existing threshold E-surfaces across 1/1 graph groups
  402. 125.88 s gammaloop-nextest-integration> field value
  403. 125.88 s gammaloop-nextest-integration> existing_esurfaces 1
  404. 125.88 s gammaloop-nextest-integration> group_count 1
  405. 125.88 s gammaloop-nextest-integration> groups_above_threshold 1
  406. 125.88 s gammaloop-nextest-integration> integrand se1l
  407. 125.88 s gammaloop-nextest-integration> span warm_up{integrand.name=se1l}
  408. 125.88 s gammaloop-nextest-integration> threshold_status above threshold
  409. 125.88 s gammaloop-nextest-integration> [2026-08-28 10:43:42.460] @process::amplitude INFO : overlap structure of group 0: [1: [0(2,3)]]
  410. 125.88 s gammaloop-nextest-integration> field value
  411. 125.88 s gammaloop-nextest-integration> span warm_up{integrand.name=se1l}
  412. 125.88 s gammaloop-nextest-integration> [2026-08-28 10:43:42.461] @process::amplitude WARNING : External state 0 ('g', PDG 21, helicity +) is off shell: p^2 = +2.5e5, expected m^2 = +0e0 (|Δ| = +2.5e5). Fixed-helicity spinor/vector/tensor external states may be ill-defined at this kinematic point.
  413. 125.88 s gammaloop-nextest-integration> field value
  414. 125.88 s gammaloop-nextest-integration> span warm_up{integrand.name=se1l_muv_shifted}
  415. 125.88 s gammaloop-nextest-integration> [2026-08-28 10:43:42.461] @process::amplitude WARNING : External state 1 ('g', PDG 21, helicity -) is off shell: p^2 = +2.5e5, expected m^2 = +0e0 (|Δ| = +2.5e5). Fixed-helicity spinor/vector/tensor external states may be ill-defined at this kinematic point.
  416. 125.88 s gammaloop-nextest-integration> field value
  417. 125.88 s gammaloop-nextest-integration> span warm_up{integrand.name=se1l_muv_shifted}
  418. 125.88 s gammaloop-nextest-integration> [2026-08-28 10:43:42.461] @process::amplitude INFO : Input is above threshold: 1 existing threshold E-surfaces across 1/1 graph groups
  419. 125.88 s gammaloop-nextest-integration> field value
  420. 125.88 s gammaloop-nextest-integration> existing_esurfaces 1
  421. 125.88 s gammaloop-nextest-integration> group_count 1
  422. 125.88 s gammaloop-nextest-integration> groups_above_threshold 1
  423. 125.88 s gammaloop-nextest-integration> integrand se1l_muv_shifted
  424. 125.88 s gammaloop-nextest-integration> span warm_up{integrand.name=se1l_muv_shifted}
  425. 125.88 s gammaloop-nextest-integration> threshold_status above threshold
  426. 125.88 s gammaloop-nextest-integration> [2026-08-28 10:43:42.461] @process::amplitude INFO : overlap structure of group 0: [1: [0(2,3)]]
  427. 125.88 s gammaloop-nextest-integration> field value
  428. 125.88 s gammaloop-nextest-integration> span warm_up{integrand.name=se1l_muv_shifted}
  429. 125.88 s gammaloop-nextest-integration> [2026-08-28 10:43:42.463] @process::amplitude WARNING : External state 0 ('g', PDG 21, helicity +) is off shell: p^2 = +2.5e5, expected m^2 = +0e0 (|Δ| = +2.5e5). Fixed-helicity spinor/vector/tensor external states may be ill-defined at this kinematic point.
  430. 125.88 s gammaloop-nextest-integration> field value
  431. 125.88 s gammaloop-nextest-integration> span warm_up{integrand.name=se1l_rls_shifted}
  432. 125.88 s gammaloop-nextest-integration> [2026-08-28 10:43:42.463] @process::amplitude WARNING : External state 1 ('g', PDG 21, helicity -) is off shell: p^2 = +2.5e5, expected m^2 = +0e0 (|Δ| = +2.5e5). Fixed-helicity spinor/vector/tensor external states may be ill-defined at this kinematic point.
  433. 125.88 s gammaloop-nextest-integration> field value
  434. 125.88 s gammaloop-nextest-integration> span warm_up{integrand.name=se1l_rls_shifted}
  435. 125.88 s gammaloop-nextest-integration> [2026-08-28 10:43:42.463] @process::amplitude INFO : Input is above threshold: 1 existing threshold E-surfaces across 1/1 graph groups
  436. 125.88 s gammaloop-nextest-integration> field value
  437. 125.88 s gammaloop-nextest-integration> existing_esurfaces 1
  438. 125.88 s gammaloop-nextest-integration> group_count 1
  439. 125.88 s gammaloop-nextest-integration> groups_above_threshold 1
  440. 125.88 s gammaloop-nextest-integration> integrand se1l_rls_shifted
  441. 125.88 s gammaloop-nextest-integration> span warm_up{integrand.name=se1l_rls_shifted}
  442. 125.88 s gammaloop-nextest-integration> threshold_status above threshold
  443. 125.88 s gammaloop-nextest-integration> ... omitted 1410 more lines; see full nextest output above
  444. 125.88 s gammaloop-nextest-integration> =========================================
  445. 126.31 s error: Cannot build '/nix/store/ifx25i75mrp4mx011vk3kpahjasmfqfi-gammaloop-nextest-integration.drv'.
  446. 126.31 s Reason: builder failed with exit code 100.
  447. 126.31 s Output paths:
  448. 126.31 s /nix/store/zp6pznmk8m5zpqbw5hmcyg91mpp8x0kf-gammaloop-nextest-integration
  449. 126.31 s Last 2048 log lines:
  450. 126.31 s > span warm_up{integrand.name=se1l_muv_shifted}
  451. 126.31 s > threshold_status above threshold
  452. 126.31 s > [2026-08-28 10:45:23.409] @process::amplitude INFO : overlap structure of group 0: [1: [0(2,3)]]
  453. 126.31 s > field value
  454. 126.31 s > span warm_up{integrand.name=se1l_muv_shifted}
  455. 126.31 s > [2026-08-28 10:45:23.412] @process::amplitude WARNING : External state 0 ('g', PDG 21, helicity +) is off shell: p^2 = +2.5e5, expected m^2 = +0e0 (|Δ| = +2.5e5). Fixed-helicity spinor/vector/tensor external states may be ill-defined at this kinematic point.
  456. 126.31 s > field value
  457. 126.31 s > span warm_up{integrand.name=se1l}
  458. 126.31 s > [2026-08-28 10:45:23.412] @process::amplitude WARNING : External state 1 ('g', PDG 21, helicity -) is off shell: p^2 = +2.5e5, expected m^2 = +0e0 (|Δ| = +2.5e5). Fixed-helicity spinor/vector/tensor external states may be ill-defined at this kinematic point.
  459. 126.31 s > field value
  460. 126.31 s > span warm_up{integrand.name=se1l}
  461. 126.31 s > [2026-08-28 10:45:23.413] @process::amplitude INFO : Input is above threshold: 1 existing threshold E-surfaces across 1/1 graph groups
  462. 126.31 s > field value
  463. 126.31 s > existing_esurfaces 1
  464. 126.31 s > group_count 1
  465. 126.31 s > groups_above_threshold 1
  466. 126.31 s > integrand se1l
  467. 126.31 s > span warm_up{integrand.name=se1l}
  468. 126.31 s > threshold_status above threshold
  469. 126.31 s > [2026-08-28 10:45:23.413] @process::amplitude INFO : overlap structure of group 0: [1: [0(2,3)]]
  470. 126.31 s > field value
  471. 126.31 s > span warm_up{integrand.name=se1l}
  472. 126.31 s > [2026-08-28 10:45:23.416] @process::amplitude WARNING : External state 0 ('g', PDG 21, helicity +) is off shell: p^2 = +2.5e5, expected m^2 = +0e0 (|Δ| = +2.5e5). Fixed-helicity spinor/vector/tensor external states may be ill-defined at this kinematic point.
  473. 126.31 s > field value
  474. 126.31 s > span warm_up{integrand.name=se1l_muv_shifted}
  475. 126.31 s > [2026-08-28 10:45:23.416] @process::amplitude WARNING : External state 1 ('g', PDG 21, helicity -) is off shell: p^2 = +2.5e5, expected m^2 = +0e0 (|Δ| = +2.5e5). Fixed-helicity spinor/vector/tensor external states may be ill-defined at this kinematic point.
  476. 126.31 s > field value
  477. 126.31 s > span warm_up{integrand.name=se1l_muv_shifted}
  478. 126.31 s > [2026-08-28 10:45:23.416] @process::amplitude INFO : Input is above threshold: 1 existing threshold E-surfaces across 1/1 graph groups
  479. 126.31 s > field value
  480. 126.31 s > existing_esurfaces 1
  481. 126.31 s > group_count 1
  482. 126.31 s > groups_above_threshold 1
  483. 126.31 s > integrand se1l_muv_shifted
  484. 126.31 s > span warm_up{integrand.name=se1l_muv_shifted}
  485. 126.31 s > threshold_status above threshold
  486. 126.31 s > [2026-08-28 10:45:23.416] @process::amplitude INFO : overlap structure of group 0: [1: [0(2,3)]]
  487. 126.31 s > field value
  488. 126.31 s > span warm_up{integrand.name=se1l_muv_shifted}
  489. 126.31 s > [2026-08-28 10:45:23.419] @process::amplitude WARNING : External state 0 ('g', PDG 21, helicity +) is off shell: p^2 = +2.5e5, expected m^2 = +0e0 (|Δ| = +2.5e5). Fixed-helicity spinor/vector/tensor external states may be ill-defined at this kinematic point.
  490. 126.31 s > field value
  491. 126.31 s > span warm_up{integrand.name=se1l}
  492. 126.31 s > [2026-08-28 10:45:23.420] @process::amplitude WARNING : External state 1 ('g', PDG 21, helicity -) is off shell: p^2 = +2.5e5, expected m^2 = +0e0 (|Δ| = +2.5e5). Fixed-helicity spinor/vector/tensor external states may be ill-defined at this kinematic point.
  493. 126.31 s > field value
  494. 126.31 s > span warm_up{integrand.name=se1l}
  495. 126.31 s > [2026-08-28 10:45:23.420] @process::amplitude INFO : Input is above threshold: 1 existing threshold E-surfaces across 1/1 graph groups
  496. 126.31 s > field value
  497. 126.31 s > existing_esurfaces 1
  498. 126.31 s > group_count 1
  499. 126.31 s > groups_above_threshold 1
  500. 126.31 s > integrand se1l
  501. 126.31 s > span warm_up{integrand.name=se1l}
  502. 126.31 s > threshold_status above threshold
  503. 126.31 s > [2026-08-28 10:45:23.420] @process::amplitude INFO : overlap structure of group 0: [1: [0(2,3)]]
  504. 126.31 s > field value
  505. 126.31 s > span warm_up{integrand.name=se1l}
  506. 126.31 s > [2026-08-28 10:45:23.423] @process::amplitude WARNING : External state 0 ('g', PDG 21, helicity +) is off shell: p^2 = +2.5e5, expected m^2 = +0e0 (|Δ| = +2.5e5). Fixed-helicity spinor/vector/tensor external states may be ill-defined at this kinematic point.
  507. 126.31 s > field value
  508. 126.31 s > span warm_up{integrand.name=se1l_muv_shifted}
  509. 126.31 s > [2026-08-28 10:45:23.423] @process::amplitude WARNING : External state 1 ('g', PDG 21, helicity -) is off shell: p^2 = +2.5e5, expected m^2 = +0e0 (|Δ| = +2.5e5). Fixed-helicity spinor/vector/tensor external states may be ill-defined at this kinematic point.
  510. 126.31 s > field value
  511. 126.31 s > span warm_up{integrand.name=se1l_muv_shifted}
  512. 126.31 s > [2026-08-28 10:45:23.423] @process::amplitude INFO : Input is above threshold: 1 existing threshold E-surfaces across 1/1 graph groups
  513. 126.31 s > field value
  514. 126.31 s > existing_esurfaces 1
  515. 126.31 s > group_count 1
  516. 126.31 s > groups_above_threshold 1
  517. 126.31 s > integrand se1l_muv_shifted
  518. 126.31 s > span warm_up{integrand.name=se1l_muv_shifted}
  519. 126.31 s > threshold_status above threshold
  520. 126.31 s > [2026-08-28 10:45:23.423] @process::amplitude INFO : overlap structure of group 0: [1: [0(2,3)]]
  521. 126.31 s > field value
  522. 126.31 s > span warm_up{integrand.name=se1l_muv_shifted}
  523. 126.31 s > [2026-08-28 10:45:23.427] @process::amplitude WARNING : External state 0 ('g', PDG 21, helicity +) is off shell: p^2 = +2.5e5, expected m^2 = +0e0 (|Δ| = +2.5e5). Fixed-helicity spinor/vector/tensor external states may be ill-defined at this kinematic point.
  524. 126.31 s > field value
  525. 126.31 s > span warm_up{integrand.name=se1l}
  526. 126.31 s > [2026-08-28 10:45:23.427] @process::amplitude WARNING : External state 1 ('g', PDG 21, helicity -) is off shell: p^2 = +2.5e5, expected m^2 = +0e0 (|Δ| = +2.5e5). Fixed-helicity spinor/vector/tensor external states may be ill-defined at this kinematic point.
  527. 126.31 s > field value
  528. 126.31 s > span warm_up{integrand.name=se1l}
  529. 126.31 s > [2026-08-28 10:45:23.427] @process::amplitude INFO : Input is above threshold: 1 existing threshold E-surfaces across 1/1 graph groups
  530. 126.31 s > field value
  531. 126.31 s > existing_esurfaces 1
  532. 126.31 s > group_count 1
  533. 126.31 s > groups_above_threshold 1
  534. 126.31 s > integrand se1l
  535. 126.31 s > span warm_up{integrand.name=se1l}
  536. 126.31 s > threshold_status above threshold
  537. 126.31 s > [2026-08-28 10:45:23.427] @process::amplitude INFO : overlap structure of group 0: [1: [0(2,3)]]
  538. 126.32 s > field value
  539. 126.32 s > span warm_up{integrand.name=se1l}
  540. 126.32 s > [2026-08-28 10:45:23.430] @process::amplitude WARNING : External state 0 ('g', PDG 21, helicity +) is off shell: p^2 = +2.5e5, expected m^2 = +0e0 (|Δ| = +2.5e5). Fixed-helicity spinor/vector/tensor external states may be ill-defined at this kinematic point.
  541. 126.32 s > field value
  542. 126.32 s > span warm_up{integrand.name=se1l_muv_shifted}
  543. 126.32 s > [2026-08-28 10:45:23.430] @process::amplitude WARNING : External state 1 ('g', PDG 21, helicity -) is off shell: p^2 = +2.5e5, expected m^2 = +0e0 (|Δ| = +2.5e5). Fixed-helicity spinor/vector/tensor external states may be ill-defined at this kinematic point.
  544. 126.32 s > field value
  545. 126.32 s > span warm_up{integrand.name=se1l_muv_shifted}
  546. 126.32 s > [2026-08-28 10:45:23.430] @process::amplitude INFO : Input is above threshold: 1 existing threshold E-surfaces across 1/1 graph groups
  547. 126.32 s > field value
  548. 126.32 s > existing_esurfaces 1
  549. 126.32 s > group_count 1
  550. 126.32 s > groups_above_threshold 1
  551. 126.32 s > integrand se1l_muv_shifted
  552. 126.32 s > span warm_up{integrand.name=se1l_muv_shifted}
  553. 126.32 s > threshold_status above threshold
  554. 126.32 s > [2026-08-28 10:45:23.430] @process::amplitude INFO : overlap structure of group 0: [1: [0(2,3)]]
  555. 126.32 s > field value
  556. 126.32 s > span warm_up{integrand.name=se1l_muv_shifted}
  557. 126.32 s > [2026-08-28 10:45:23.434] @process::amplitude WARNING : External state 0 ('g', PDG 21, helicity +) is off shell: p^2 = +2.5e5, expected m^2 = +0e0 (|Δ| = +2.5e5). Fixed-helicity spinor/vector/tensor external states may be ill-defined at this kinematic point.
  558. 126.32 s > field value
  559. 126.32 s > span warm_up{integrand.name=se1l}
  560. 126.32 s > [2026-08-28 10:45:23.434] @process::amplitude WARNING : External state 1 ('g', PDG 21, helicity -) is off shell: p^2 = +2.5e5, expected m^2 = +0e0 (|Δ| = +2.5e5). Fixed-helicity spinor/vector/tensor external states may be ill-defined at this kinematic point.
  561. 126.32 s > field value
  562. 126.32 s > span warm_up{integrand.name=se1l}
  563. 126.32 s > [2026-08-28 10:45:23.434] @process::amplitude INFO : Input is above threshold: 1 existing threshold E-surfaces across 1/1 graph groups
  564. 126.32 s > field value
  565. 126.32 s > existing_esurfaces 1
  566. 126.32 s > group_count 1
  567. 126.32 s > groups_above_threshold 1
  568. 126.32 s > integrand se1l
  569. 126.32 s > span warm_up{integrand.name=se1l}
  570. 126.32 s > threshold_status above threshold
  571. 126.32 s > [2026-08-28 10:45:23.434] @process::amplitude INFO : overlap structure of group 0: [1: [0(2,3)]]
  572. 126.32 s > field value
  573. 126.32 s > span warm_up{integrand.name=se1l}
  574. 126.32 s > [2026-08-28 10:45:23.437] @process::amplitude WARNING : External state 0 ('g', PDG 21, helicity +) is off shell: p^2 = +2.5e5, expected m^2 = +0e0 (|Δ| = +2.5e5). Fixed-helicity spinor/vector/tensor external states may be ill-defined at this kinematic point.
  575. 126.32 s > field value
  576. 126.32 s > span warm_up{integrand.name=se1l_rls_shifted}
  577. 126.32 s > [2026-08-28 10:45:23.437] @process::amplitude WARNING : External state 1 ('g', PDG 21, helicity -) is off shell: p^2 = +2.5e5, expected m^2 = +0e0 (|Δ| = +2.5e5). Fixed-helicity spinor/vector/tensor external states may be ill-defined at this kinematic point.
  578. 126.32 s > field value
  579. 126.32 s > span warm_up{integrand.name=se1l_rls_shifted}
  580. 126.32 s > [2026-08-28 10:45:23.438] @process::amplitude INFO : Input is above threshold: 1 existing threshold E-surfaces across 1/1 graph groups
  581. 126.32 s > field value
  582. 126.32 s > existing_esurfaces 1
  583. 126.32 s > group_count 1
  584. 126.32 s > groups_above_threshold 1
  585. 126.32 s > integrand se1l_rls_shifted
  586. 126.32 s > span warm_up{integrand.name=se1l_rls_shifted}
  587. 126.32 s > threshold_status above threshold
  588. 126.32 s > [2026-08-28 10:45:23.438] @process::amplitude INFO : overlap structure of group 0: [1: [0(2,3)]]
  589. 126.32 s > field value
  590. 126.32 s > span warm_up{integrand.name=se1l_rls_shifted}
  591. 126.32 s > [2026-08-28 10:45:23.441] @process::amplitude WARNING : External state 0 ('g', PDG 21, helicity +) is off shell: p^2 = +2.5e5, expected m^2 = +0e0 (|Δ| = +2.5e5). Fixed-helicity spinor/vector/tensor external states may be ill-defined at this kinematic point.
  592. 126.32 s > field value
  593. 126.32 s > span warm_up{integrand.name=se1l}
  594. 126.32 s > [2026-08-28 10:45:23.441] @process::amplitude WARNING : External state 1 ('g', PDG 21, helicity -) is off shell: p^2 = +2.5e5, expected m^2 = +0e0 (|Δ| = +2.5e5). Fixed-helicity spinor/vector/tensor external states may be ill-defined at this kinematic point.
  595. 126.32 s > field value
  596. 126.32 s > span warm_up{integrand.name=se1l}
  597. 126.32 s > [2026-08-28 10:45:23.441] @process::amplitude INFO : Input is above threshold: 1 existing threshold E-surfaces across 1/1 graph groups
  598. 126.32 s > field value
  599. 126.32 s > existing_esurfaces 1
  600. 126.32 s > group_count 1
  601. 126.32 s > groups_above_threshold 1
  602. 126.32 s > integrand se1l
  603. 126.32 s > span warm_up{integrand.name=se1l}
  604. 126.32 s > threshold_status above threshold
  605. 126.32 s > [2026-08-28 10:45:23.441] @process::amplitude INFO : overlap structure of group 0: [1: [0(2,3)]]
  606. 126.32 s > field value
  607. 126.32 s > span warm_up{integrand.name=se1l}
  608. 126.32 s > [2026-08-28 10:45:23.445] @process::amplitude WARNING : External state 0 ('g', PDG 21, helicity +) is off shell: p^2 = +2.5e5, expected m^2 = +0e0 (|Δ| = +2.5e5). Fixed-helicity spinor/vector/tensor external states may be ill-defined at this kinematic point.
  609. 126.32 s > field value
  610. 126.32 s > span warm_up{integrand.name=se1l_rls_shifted}
  611. 126.32 s > [2026-08-28 10:45:23.445] @process::amplitude WARNING : External state 1 ('g', PDG 21, helicity -) is off shell: p^2 = +2.5e5, expected m^2 = +0e0 (|Δ| = +2.5e5). Fixed-helicity spinor/vector/tensor external states may be ill-defined at this kinematic point.
  612. 126.32 s > field value
  613. 126.32 s > span warm_up{integrand.name=se1l_rls_shifted}
  614. 126.32 s > [2026-08-28 10:45:23.445] @process::amplitude INFO : Input is above threshold: 1 existing threshold E-surfaces across 1/1 graph groups
  615. 126.32 s > field value
  616. 126.32 s > existing_esurfaces 1
  617. 126.32 s > group_count 1
  618. 126.32 s > groups_above_threshold 1
  619. 126.32 s > integrand se1l_rls_shifted
  620. 126.32 s > span warm_up{integrand.name=se1l_rls_shifted}
  621. 126.32 s > threshold_status above threshold
  622. 126.32 s > [2026-08-28 10:45:23.445] @process::amplitude INFO : overlap structure of group 0: [1: [0(2,3)]]
  623. 126.32 s > field value
  624. 126.32 s > span warm_up{integrand.name=se1l_rls_shifted}
  625. 126.32 s > [2026-08-28 10:45:23.449] @process::amplitude WARNING : External state 0 ('g', PDG 21, helicity +) is off shell: p^2 = +2.5e5, expected m^2 = +0e0 (|Δ| = +2.5e5). Fixed-helicity spinor/vector/tensor external states may be ill-defined at this kinematic point.
  626. 126.32 s > field value
  627. 126.32 s > span warm_up{integrand.name=se1l}
  628. 126.32 s > [2026-08-28 10:45:23.449] @process::amplitude WARNING : External state 1 ('g', PDG 21, helicity -) is off shell: p^2 = +2.5e5, expected m^2 = +0e0 (|Δ| = +2.5e5). Fixed-helicity spinor/vector/tensor external states may be ill-defined at this kinematic point.
  629. 126.32 s > field value
  630. 126.32 s > span warm_up{integrand.name=se1l}
  631. 126.32 s > [2026-08-28 10:45:23.449] @process::amplitude INFO : Input is above threshold: 1 existing threshold E-surfaces across 1/1 graph groups
  632. 126.32 s > field value
  633. 126.32 s > existing_esurfaces 1
  634. 126.32 s > group_count 1
  635. 126.32 s > groups_above_threshold 1
  636. 126.32 s > integrand se1l
  637. 126.32 s > span warm_up{integrand.name=se1l}
  638. 126.32 s > threshold_status above threshold
  639. 126.32 s > [2026-08-28 10:45:23.449] @process::amplitude INFO : overlap structure of group 0: [1: [0(2,3)]]
  640. 126.32 s > field value
  641. 126.32 s > span warm_up{integrand.name=se1l}
  642. 126.32 s > [2026-08-28 10:45:23.453] @process::amplitude WARNING : External state 0 ('g', PDG 21, helicity +) is off shell: p^2 = +2.5e5, expected m^2 = +0e0 (|Δ| = +2.5e5). Fixed-helicity spinor/vector/tensor external states may be ill-defined at this kinematic point.
  643. 126.32 s > field value
  644. 126.32 s > span warm_up{integrand.name=se1l_rls_shifted}
  645. 126.32 s > [2026-08-28 10:45:23.453] @process::amplitude WARNING : External state 1 ('g', PDG 21, helicity -) is off shell: p^2 = +2.5e5, expected m^2 = +0e0 (|Δ| = +2.5e5). Fixed-helicity spinor/vector/tensor external states may be ill-defined at this kinematic point.
  646. 126.32 s > field value
  647. 126.32 s > span warm_up{integrand.name=se1l_rls_shifted}
  648. 126.32 s > [2026-08-28 10:45:23.453] @process::amplitude INFO : Input is above threshold: 1 existing threshold E-surfaces across 1/1 graph groups
  649. 126.32 s > field value
  650. 126.32 s > existing_esurfaces 1
  651. 126.32 s > group_count 1
  652. 126.32 s > groups_above_threshold 1
  653. 126.32 s > integrand se1l_rls_shifted
  654. 126.32 s > span warm_up{integrand.name=se1l_rls_shifted}
  655. 126.32 s > threshold_status above threshold
  656. 126.32 s > [2026-08-28 10:45:23.453] @process::amplitude INFO : overlap structure of group 0: [1: [0(2,3)]]
  657. 126.32 s > field value
  658. 126.32 s > span warm_up{integrand.name=se1l_rls_shifted}
  659. 126.32 s > [2026-08-28 10:45:23.457] @process::amplitude WARNING : External state 0 ('g', PDG 21, helicity +) is off shell: p^2 = +2.5e5, expected m^2 = +0e0 (|Δ| = +2.5e5). Fixed-helicity spinor/vector/tensor external states may be ill-defined at this kinematic point.
  660. 126.32 s > field value
  661. 126.32 s > span warm_up{integrand.name=se1l}
  662. 126.32 s > [2026-08-28 10:45:23.457] @process::amplitude WARNING : External state 1 ('g', PDG 21, helicity -) is off shell: p^2 = +2.5e5, expected m^2 = +0e0 (|Δ| = +2.5e5). Fixed-helicity spinor/vector/tensor external states may be ill-defined at this kinematic point.
  663. 126.32 s > field value
  664. 126.32 s > span warm_up{integrand.name=se1l}
  665. 126.32 s > [2026-08-28 10:45:23.457] @process::amplitude INFO : Input is above threshold: 1 existing threshold E-surfaces across 1/1 graph groups
  666. 126.32 s > field value
  667. 126.32 s > existing_esurfaces 1
  668. 126.32 s > group_count 1
  669. 126.32 s > groups_above_threshold 1
  670. 126.32 s > integrand se1l
  671. 126.32 s > span warm_up{integrand.name=se1l}
  672. 126.32 s > threshold_status above threshold
  673. 126.32 s > [2026-08-28 10:45:23.457] @process::amplitude INFO : overlap structure of group 0: [1: [0(2,3)]]
  674. 126.32 s > field value
  675. 126.32 s > span warm_up{integrand.name=se1l}
  676. 126.32 s > [2026-08-28 10:45:23.461] @process::amplitude WARNING : External state 0 ('g', PDG 21, helicity +) is off shell: p^2 = +2.5e5, expected m^2 = +0e0 (|Δ| = +2.5e5). Fixed-helicity spinor/vector/tensor external states may be ill-defined at this kinematic point.
  677. 126.32 s > field value
  678. 126.32 s > span warm_up{integrand.name=se1l_rls_shifted}
  679. 126.32 s > [2026-08-28 10:45:23.461] @process::amplitude WARNING : External state 1 ('g', PDG 21, helicity -) is off shell: p^2 = +2.5e5, expected m^2 = +0e0 (|Δ| = +2.5e5). Fixed-helicity spinor/vector/tensor external states may be ill-defined at this kinematic point.
  680. 126.32 s > field value
  681. 126.32 s > span warm_up{integrand.name=se1l_rls_shifted}
  682. 126.32 s > [2026-08-28 10:45:23.461] @process::amplitude INFO : Input is above threshold: 1 existing threshold E-surfaces across 1/1 graph groups
  683. 126.32 s > field value
  684. 126.32 s > existing_esurfaces 1
  685. 126.32 s > group_count 1
  686. 126.32 s > groups_above_threshold 1
  687. 126.32 s > integrand se1l_rls_shifted
  688. 126.32 s > span warm_up{integrand.name=se1l_rls_shifted}
  689. 126.32 s > threshold_status above threshold
  690. 126.32 s > [2026-08-28 10:45:23.461] @process::amplitude INFO : overlap structure of group 0: [1: [0(2,3)]]
  691. 126.32 s > field value
  692. 126.32 s > span warm_up{integrand.name=se1l_rls_shifted}
  693. 126.32 s > [2026-08-28 10:45:23.465] @process::amplitude WARNING : External state 0 ('g', PDG 21, helicity +) is off shell: p^2 = +2.5e5, expected m^2 = +0e0 (|Δ| = +2.5e5). Fixed-helicity spinor/vector/tensor external states may be ill-defined at this kinematic point.
  694. 126.32 s > field value
  695. 126.32 s > span warm_up{integrand.name=se1l}
  696. 126.32 s > [2026-08-28 10:45:23.465] @process::amplitude WARNING : External state 1 ('g', PDG 21, helicity -) is off shell: p^2 = +2.5e5, expected m^2 = +0e0 (|Δ| = +2.5e5). Fixed-helicity spinor/vector/tensor external states may be ill-defined at this kinematic point.
  697. 126.32 s > field value
  698. 126.32 s > span warm_up{integrand.name=se1l}
  699. 126.32 s > [2026-08-28 10:45:23.465] @process::amplitude INFO : Input is above threshold: 1 existing threshold E-surfaces across 1/1 graph groups
  700. 126.32 s > field value
  701. 126.32 s > existing_esurfaces 1
  702. 126.32 s > group_count 1
  703. 126.32 s > groups_above_threshold 1
  704. 126.32 s > integrand se1l
  705. 126.32 s > span warm_up{integrand.name=se1l}
  706. 126.32 s > threshold_status above threshold
  707. 126.32 s > [2026-08-28 10:45:23.465] @process::amplitude INFO : overlap structure of group 0: [1: [0(2,3)]]
  708. 126.32 s > field value
  709. 126.32 s > span warm_up{integrand.name=se1l}
  710. 126.32 s > [2026-08-28 10:45:23.469] @process::amplitude WARNING : External state 0 ('g', PDG 21, helicity +) is off shell: p^2 = +2.5e5, expected m^2 = +0e0 (|Δ| = +2.5e5). Fixed-helicity spinor/vector/tensor external states may be ill-defined at this kinematic point.
  711. 126.32 s > field value
  712. 126.32 s > span warm_up{integrand.name=se1l_rls_shifted}
  713. 126.32 s > [2026-08-28 10:45:23.469] @process::amplitude WARNING : External state 1 ('g', PDG 21, helicity -) is off shell: p^2 = +2.5e5, expected m^2 = +0e0 (|Δ| = +2.5e5). Fixed-helicity spinor/vector/tensor external states may be ill-defined at this kinematic point.
  714. 126.32 s > field value
  715. 126.32 s > span warm_up{integrand.name=se1l_rls_shifted}
  716. 126.32 s > [2026-08-28 10:45:23.469] @process::amplitude INFO : Input is above threshold: 1 existing threshold E-surfaces across 1/1 graph groups
  717. 126.32 s > field value
  718. 126.32 s > existing_esurfaces 1
  719. 126.32 s > group_count 1
  720. 126.32 s > groups_above_threshold 1
  721. 126.32 s > integrand se1l_rls_shifted
  722. 126.32 s > span warm_up{integrand.name=se1l_rls_shifted}
  723. 126.32 s > threshold_status above threshold
  724. 126.32 s > [2026-08-28 10:45:23.469] @process::amplitude INFO : overlap structure of group 0: [1: [0(2,3)]]
  725. 126.32 s > field value
  726. 126.32 s > span warm_up{integrand.name=se1l_rls_shifted}
  727. 126.32 s > [2026-08-28 10:45:23.473] @process::amplitude WARNING : External state 0 ('g', PDG 21, helicity +) is off shell: p^2 = +2.5e5, expected m^2 = +0e0 (|Δ| = +2.5e5). Fixed-helicity spinor/vector/tensor external states may be ill-defined at this kinematic point.
  728. 126.32 s > field value
  729. 126.32 s > span warm_up{integrand.name=se1l}
  730. 126.32 s > [2026-08-28 10:45:23.473] @process::amplitude WARNING : External state 1 ('g', PDG 21, helicity -) is off shell: p^2 = +2.5e5, expected m^2 = +0e0 (|Δ| = +2.5e5). Fixed-helicity spinor/vector/tensor external states may be ill-defined at this kinematic point.
  731. 126.32 s > field value
  732. 126.32 s > span warm_up{integrand.name=se1l}
  733. 126.32 s > [2026-08-28 10:45:23.473] @process::amplitude INFO : Input is above threshold: 1 existing threshold E-surfaces across 1/1 graph groups
  734. 126.32 s > field value
  735. 126.32 s > existing_esurfaces 1
  736. 126.32 s > group_count 1
  737. 126.32 s > groups_above_threshold 1
  738. 126.32 s > integrand se1l
  739. 126.32 s > span warm_up{integrand.name=se1l}
  740. 126.32 s > threshold_status above threshold
  741. 126.32 s > [2026-08-28 10:45:23.473] @process::amplitude INFO : overlap structure of group 0: [1: [0(2,3)]]
  742. 126.32 s > field value
  743. 126.32 s > span warm_up{integrand.name=se1l}
  744. 126.32 s > [2026-08-28 10:45:23.477] @process::amplitude WARNING : External state 0 ('g', PDG 21, helicity +) is off shell: p^2 = +2.5e5, expected m^2 = +0e0 (|Δ| = +2.5e5). Fixed-helicity spinor/vector/tensor external states may be ill-defined at this kinematic point.
  745. 126.32 s > field value
  746. 126.32 s > span warm_up{integrand.name=se1l_rls_shifted}
  747. 126.32 s > [2026-08-28 10:45:23.477] @process::amplitude WARNING : External state 1 ('g', PDG 21, helicity -) is off shell: p^2 = +2.5e5, expected m^2 = +0e0 (|Δ| = +2.5e5). Fixed-helicity spinor/vector/tensor external states may be ill-defined at this kinematic point.
  748. 126.32 s > field value
  749. 126.32 s > span warm_up{integrand.name=se1l_rls_shifted}
  750. 126.32 s > [2026-08-28 10:45:23.477] @process::amplitude INFO : Input is above threshold: 1 existing threshold E-surfaces across 1/1 graph groups
  751. 126.32 s > field value
  752. 126.32 s > existing_esurfaces 1
  753. 126.32 s > group_count 1
  754. 126.32 s > groups_above_threshold 1
  755. 126.32 s > integrand se1l_rls_shifted
  756. 126.32 s > span warm_up{integrand.name=se1l_rls_shifted}
  757. 126.32 s > threshold_status above threshold
  758. 126.32 s > [2026-08-28 10:45:23.477] @process::amplitude INFO : overlap structure of group 0: [1: [0(2,3)]]
  759. 126.32 s > field value
  760. 126.32 s > span warm_up{integrand.name=se1l_rls_shifted}
  761. 126.32 s > [2026-08-28 10:45:23.480] @process::amplitude WARNING : External state 0 ('g', PDG 21, helicity +) is off shell: p^2 = +2.5e5, expected m^2 = +0e0 (|Δ| = +2.5e5). Fixed-helicity spinor/vector/tensor external states may be ill-defined at this kinematic point.
  762. 126.32 s > field value
  763. 126.32 s > span warm_up{integrand.name=se1l}
  764. 126.32 s > [2026-08-28 10:45:23.480] @process::amplitude WARNING : External state 1 ('g', PDG 21, helicity -) is off shell: p^2 = +2.5e5, expected m^2 = +0e0 (|Δ| = +2.5e5). Fixed-helicity spinor/vector/tensor external states may be ill-defined at this kinematic point.
  765. 126.32 s > field value
  766. 126.32 s > span warm_up{integrand.name=se1l}
  767. 126.32 s > [2026-08-28 10:45:23.481] @process::amplitude INFO : Input is above threshold: 1 existing threshold E-surfaces across 1/1 graph groups
  768. 126.32 s > field value
  769. 126.32 s > existing_esurfaces 1
  770. 126.32 s > group_count 1
  771. 126.32 s > groups_above_threshold 1
  772. 126.32 s > integrand se1l
  773. 126.32 s > span warm_up{integrand.name=se1l}
  774. 126.32 s > threshold_status above threshold
  775. 126.32 s > [2026-08-28 10:45:23.481] @process::amplitude INFO : overlap structure of group 0: [1: [0(2,3)]]
  776. 126.32 s > field value
  777. 126.32 s > span warm_up{integrand.name=se1l}
  778. 126.32 s > [2026-08-28 10:45:23.484] @process::amplitude WARNING : External state 0 ('g', PDG 21, helicity +) is off shell: p^2 = +2.5e5, expected m^2 = +0e0 (|Δ| = +2.5e5). Fixed-helicity spinor/vector/tensor external states may be ill-defined at this kinematic point.
  779. 126.32 s > field value
  780. 126.32 s > span warm_up{integrand.name=se1l_rls_shifted}
  781. 126.32 s > [2026-08-28 10:45:23.484] @process::amplitude WARNING : External state 1 ('g', PDG 21, helicity -) is off shell: p^2 = +2.5e5, expected m^2 = +0e0 (|Δ| = +2.5e5). Fixed-helicity spinor/vector/tensor external states may be ill-defined at this kinematic point.
  782. 126.32 s > field value
  783. 126.32 s > span warm_up{integrand.name=se1l_rls_shifted}
  784. 126.32 s > [2026-08-28 10:45:23.484] @process::amplitude INFO : Input is above threshold: 1 existing threshold E-surfaces across 1/1 graph groups
  785. 126.32 s > field value
  786. 126.32 s > existing_esurfaces 1
  787. 126.32 s > group_count 1
  788. 126.32 s > groups_above_threshold 1
  789. 126.32 s > integrand se1l_rls_shifted
  790. 126.32 s > span warm_up{integrand.name=se1l_rls_shifted}
  791. 126.32 s > threshold_status above threshold
  792. 126.32 s > [2026-08-28 10:45:23.485] @process::amplitude INFO : overlap structure of group 0: [1: [0(2,3)]]
  793. 126.32 s > field value
  794. 126.32 s > span warm_up{integrand.name=se1l_rls_shifted}
  795. 126.32 s > [2026-08-28 10:45:23.488] @process::amplitude WARNING : External state 0 ('g', PDG 21, helicity +) is off shell: p^2 = +2.5e5, expected m^2 = +0e0 (|Δ| = +2.5e5). Fixed-helicity spinor/vector/tensor external states may be ill-defined at this kinematic point.
  796. 126.32 s > field value
  797. 126.32 s > span warm_up{integrand.name=se1l}
  798. 126.32 s > [2026-08-28 10:45:23.488] @process::amplitude WARNING : External state 1 ('g', PDG 21, helicity -) is off shell: p^2 = +2.5e5, expected m^2 = +0e0 (|Δ| = +2.5e5). Fixed-helicity spinor/vector/tensor external states may be ill-defined at this kinematic point.
  799. 126.32 s > field value
  800. 126.32 s > span warm_up{integrand.name=se1l}
  801. 126.32 s > [2026-08-28 10:45:23.488] @process::amplitude INFO : Input is above threshold: 1 existing threshold E-surfaces across 1/1 graph groups
  802. 126.32 s > field value
  803. 126.32 s > existing_esurfaces 1
  804. 126.32 s > group_count 1
  805. 126.32 s > groups_above_threshold 1
  806. 126.32 s > integrand se1l
  807. 126.32 s > span warm_up{integrand.name=se1l}
  808. 126.32 s > threshold_status above threshold
  809. 126.32 s > [2026-08-28 10:45:23.489] @process::amplitude INFO : overlap structure of group 0: [1: [0(2,3)]]
  810. 126.32 s > field value
  811. 126.32 s > span warm_up{integrand.name=se1l}
  812. 126.32 s > [2026-08-28 10:45:23.492] @process::amplitude WARNING : External state 0 ('g', PDG 21, helicity +) is off shell: p^2 = +2.5e5, expected m^2 = +0e0 (|Δ| = +2.5e5). Fixed-helicity spinor/vector/tensor external states may be ill-defined at this kinematic point.
  813. 126.32 s > field value
  814. 126.32 s > span warm_up{integrand.name=se1l_rls_shifted}
  815. 126.32 s > [2026-08-28 10:45:23.492] @process::amplitude WARNING : External state 1 ('g', PDG 21, helicity -) is off shell: p^2 = +2.5e5, expected m^2 = +0e0 (|Δ| = +2.5e5). Fixed-helicity spinor/vector/tensor external states may be ill-defined at this kinematic point.
  816. 126.32 s > field value
  817. 126.32 s > span warm_up{integrand.name=se1l_rls_shifted}
  818. 126.32 s > [2026-08-28 10:45:23.492] @process::amplitude INFO : Input is above threshold: 1 existing threshold E-surfaces across 1/1 graph groups
  819. 126.32 s > field value
  820. 126.32 s > existing_esurfaces 1
  821. 126.32 s > group_count 1
  822. 126.32 s > groups_above_threshold 1
  823. 126.32 s > integrand se1l_rls_shifted
  824. 126.32 s > span warm_up{integrand.name=se1l_rls_shifted}
  825. 126.32 s > threshold_status above threshold
  826. 126.32 s > [2026-08-28 10:45:23.492] @process::amplitude INFO : overlap structure of group 0: [1: [0(2,3)]]
  827. 126.32 s > field value
  828. 126.32 s > span warm_up{integrand.name=se1l_rls_shifted}
  829. 126.32 s > [2026-08-28 10:45:23.496] @process::amplitude WARNING : External state 0 ('g', PDG 21, helicity +) is off shell: p^2 = +2.5e5, expected m^2 = +0e0 (|Δ| = +2.5e5). Fixed-helicity spinor/vector/tensor external states may be ill-defined at this kinematic point.
  830. 126.32 s > field value
  831. 126.32 s > span warm_up{integrand.name=se1l}
  832. 126.32 s > [2026-08-28 10:45:23.496] @process::amplitude WARNING : External state 1 ('g', PDG 21, helicity -) is off shell: p^2 = +2.5e5, expected m^2 = +0e0 (|Δ| = +2.5e5). Fixed-helicity spinor/vector/tensor external states may be ill-defined at this kinematic point.
  833. 126.32 s > field value
  834. 126.32 s > span warm_up{integrand.name=se1l}
  835. 126.32 s > [2026-08-28 10:45:23.496] @process::amplitude INFO : Input is above threshold: 1 existing threshold E-surfaces across 1/1 graph groups
  836. 126.32 s > field value
  837. 126.32 s > existing_esurfaces 1
  838. 126.32 s > group_count 1
  839. 126.32 s > groups_above_threshold 1
  840. 126.32 s > integrand se1l
  841. 126.32 s > span warm_up{integrand.name=se1l}
  842. 126.32 s > threshold_status above threshold
  843. 126.32 s > [2026-08-28 10:45:23.496] @process::amplitude INFO : overlap structure of group 0: [1: [0(2,3)]]
  844. 126.32 s > field value
  845. 126.32 s > span warm_up{integrand.name=se1l}
  846. 126.32 s > [2026-08-28 10:45:23.499] @process::amplitude WARNING : External state 0 ('g', PDG 21, helicity +) is off shell: p^2 = +2.5e5, expected m^2 = +0e0 (|Δ| = +2.5e5). Fixed-helicity spinor/vector/tensor external states may be ill-defined at this kinematic point.
  847. 126.32 s > field value
  848. 126.32 s > span warm_up{integrand.name=se1l_rls_shifted}
  849. 126.32 s > [2026-08-28 10:45:23.500] @process::amplitude WARNING : External state 1 ('g', PDG 21, helicity -) is off shell: p^2 = +2.5e5, expected m^2 = +0e0 (|Δ| = +2.5e5). Fixed-helicity spinor/vector/tensor external states may be ill-defined at this kinematic point.
  850. 126.32 s > field value
  851. 126.32 s > span warm_up{integrand.name=se1l_rls_shifted}
  852. 126.32 s > [2026-08-28 10:45:23.500] @process::amplitude INFO : Input is above threshold: 1 existing threshold E-surfaces across 1/1 graph groups
  853. 126.32 s > field value
  854. 126.32 s > existing_esurfaces 1
  855. 126.32 s > group_count 1
  856. 126.32 s > groups_above_threshold 1
  857. 126.32 s > integrand se1l_rls_shifted
  858. 126.32 s > span warm_up{integrand.name=se1l_rls_shifted}
  859. 126.32 s > threshold_status above threshold
  860. 126.32 s > [2026-08-28 10:45:23.500] @process::amplitude INFO : overlap structure of group 0: [1: [0(2,3)]]
  861. 126.32 s > field value
  862. 126.32 s > span warm_up{integrand.name=se1l_rls_shifted}
  863. 126.32 s > [2026-08-28 10:45:23.503] @process::amplitude WARNING : External state 0 ('g', PDG 21, helicity +) is off shell: p^2 = +2.5e5, expected m^2 = +0e0 (|Δ| = +2.5e5). Fixed-helicity spinor/vector/tensor external states may be ill-defined at this kinematic point.
  864. 126.32 s > field value
  865. 126.32 s > span warm_up{integrand.name=se1l}
  866. 126.32 s > [2026-08-28 10:45:23.503] @process::amplitude WARNING : External state 1 ('g', PDG 21, helicity -) is off shell: p^2 = +2.5e5, expected m^2 = +0e0 (|Δ| = +2.5e5). Fixed-helicity spinor/vector/tensor external states may be ill-defined at this kinematic point.
  867. 126.32 s > field value
  868. 126.32 s > span warm_up{integrand.name=se1l}
  869. 126.32 s > [2026-08-28 10:45:23.503] @process::amplitude INFO : Input is above threshold: 1 existing threshold E-surfaces across 1/1 graph groups
  870. 126.32 s > field value
  871. 126.32 s > existing_esurfaces 1
  872. 126.32 s > group_count 1
  873. 126.32 s > groups_above_threshold 1
  874. 126.32 s > integrand se1l
  875. 126.32 s > span warm_up{integrand.name=se1l}
  876. 126.32 s > threshold_status above threshold
  877. 126.32 s > [2026-08-28 10:45:23.503] @process::amplitude INFO : overlap structure of group 0: [1: [0(2,3)]]
  878. 126.32 s > field value
  879. 126.32 s > span warm_up{integrand.name=se1l}
  880. 126.32 s > [2026-08-28 10:45:23.507] @process::amplitude WARNING : External state 0 ('g', PDG 21, helicity +) is off shell: p^2 = +2.5e5, expected m^2 = +0e0 (|Δ| = +2.5e5). Fixed-helicity spinor/vector/tensor external states may be ill-defined at this kinematic point.
  881. 126.32 s > field value
  882. 126.32 s > span warm_up{integrand.name=se1l_rls_shifted}
  883. 126.32 s > [2026-08-28 10:45:23.507] @process::amplitude WARNING : External state 1 ('g', PDG 21, helicity -) is off shell: p^2 = +2.5e5, expected m^2 = +0e0 (|Δ| = +2.5e5). Fixed-helicity spinor/vector/tensor external states may be ill-defined at this kinematic point.
  884. 126.32 s > field value
  885. 126.32 s > span warm_up{integrand.name=se1l_rls_shifted}
  886. 126.32 s > [2026-08-28 10:45:23.507] @process::amplitude INFO : Input is above threshold: 1 existing threshold E-surfaces across 1/1 graph groups
  887. 126.32 s > field value
  888. 126.32 s > existing_esurfaces 1
  889. 126.32 s > group_count 1
  890. 126.32 s > groups_above_threshold 1
  891. 126.32 s > integrand se1l_rls_shifted
  892. 126.32 s > span warm_up{integrand.name=se1l_rls_shifted}
  893. 126.32 s > threshold_status above threshold
  894. 126.32 s > [2026-08-28 10:45:23.507] @process::amplitude INFO : overlap structure of group 0: [1: [0(2,3)]]
  895. 126.32 s > field value
  896. 126.32 s > span warm_up{integrand.name=se1l_rls_shifted}
  897. 126.32 s > [2026-08-28 10:45:23.511] @process::amplitude WARNING : External state 0 ('g', PDG 21, helicity +) is off shell: p^2 = +2.5e5, expected m^2 = +0e0 (|Δ| = +2.5e5). Fixed-helicity spinor/vector/tensor external states may be ill-defined at this kinematic point.
  898. 126.32 s > field value
  899. 126.32 s > span warm_up{integrand.name=se1l}
  900. 126.32 s > [2026-08-28 10:45:23.511] @process::amplitude WARNING : External state 1 ('g', PDG 21, helicity -) is off shell: p^2 = +2.5e5, expected m^2 = +0e0 (|Δ| = +2.5e5). Fixed-helicity spinor/vector/tensor external states may be ill-defined at this kinematic point.
  901. 126.32 s > field value
  902. 126.32 s > span warm_up{integrand.name=se1l}
  903. 126.32 s > [2026-08-28 10:45:23.511] @process::amplitude INFO : Input is above threshold: 1 existing threshold E-surfaces across 1/1 graph groups
  904. 126.32 s > field value
  905. 126.32 s > existing_esurfaces 1
  906. 126.32 s > group_count 1
  907. 126.32 s > groups_above_threshold 1
  908. 126.32 s > integrand se1l
  909. 126.32 s > span warm_up{integrand.name=se1l}
  910. 126.32 s > threshold_status above threshold
  911. 126.32 s > [2026-08-28 10:45:23.511] @process::amplitude INFO : overlap structure of group 0: [1: [0(2,3)]]
  912. 126.32 s > field value
  913. 126.32 s > span warm_up{integrand.name=se1l}
  914. 126.32 s > [2026-08-28 10:45:23.514] @process::amplitude WARNING : External state 0 ('g', PDG 21, helicity +) is off shell: p^2 = +2.5e5, expected m^2 = +0e0 (|Δ| = +2.5e5). Fixed-helicity spinor/vector/tensor external states may be ill-defined at this kinematic point.
  915. 126.32 s > field value
  916. 126.32 s > span warm_up{integrand.name=se1l_mur_shifted}
  917. 126.32 s > [2026-08-28 10:45:23.514] @process::amplitude WARNING : External state 1 ('g', PDG 21, helicity -) is off shell: p^2 = +2.5e5, expected m^2 = +0e0 (|Δ| = +2.5e5). Fixed-helicity spinor/vector/tensor external states may be ill-defined at this kinematic point.
  918. 126.32 s > field value
  919. 126.32 s > span warm_up{integrand.name=se1l_mur_shifted}
  920. 126.32 s > [2026-08-28 10:45:23.515] @process::amplitude INFO : Input is above threshold: 1 existing threshold E-surfaces across 1/1 graph groups
  921. 126.32 s > field value
  922. 126.32 s > existing_esurfaces 1
  923. 126.32 s > group_count 1
  924. 126.32 s > groups_above_threshold 1
  925. 126.32 s > integrand se1l_mur_shifted
  926. 126.32 s > span warm_up{integrand.name=se1l_mur_shifted}
  927. 126.32 s > threshold_status above threshold
  928. 126.32 s > [2026-08-28 10:45:23.515] @process::amplitude INFO : overlap structure of group 0: [1: [0(2,3)]]
  929. 126.32 s > field value
  930. 126.32 s > span warm_up{integrand.name=se1l_mur_shifted}
  931. 126.32 s > [2026-08-28 10:45:23.518] @process::amplitude WARNING : External state 0 ('g', PDG 21, helicity +) is off shell: p^2 = +2.5e5, expected m^2 = +0e0 (|Δ| = +2.5e5). Fixed-helicity spinor/vector/tensor external states may be ill-defined at this kinematic point.
  932. 126.32 s > field value
  933. 126.32 s > span warm_up{integrand.name=se1l}
  934. 126.32 s > [2026-08-28 10:45:23.518] @process::amplitude WARNING : External state 1 ('g', PDG 21, helicity -) is off shell: p^2 = +2.5e5, expected m^2 = +0e0 (|Δ| = +2.5e5). Fixed-helicity spinor/vector/tensor external states may be ill-defined at this kinematic point.
  935. 126.32 s > field value
  936. 126.32 s > span warm_up{integrand.name=se1l}
  937. 126.32 s > [2026-08-28 10:45:23.518] @process::amplitude INFO : Input is above threshold: 1 existing threshold E-surfaces across 1/1 graph groups
  938. 126.32 s > field value
  939. 126.32 s > existing_esurfaces 1
  940. 126.32 s > group_count 1
  941. 126.32 s > groups_above_threshold 1
  942. 126.32 s > integrand se1l
  943. 126.32 s > span warm_up{integrand.name=se1l}
  944. 126.32 s > threshold_status above threshold
  945. 126.32 s > [2026-08-28 10:45:23.518] @process::amplitude INFO : overlap structure of group 0: [1: [0(2,3)]]
  946. 126.32 s > field value
  947. 126.32 s > span warm_up{integrand.name=se1l}
  948. 126.32 s > [2026-08-28 10:45:23.522] @process::amplitude WARNING : External state 0 ('g', PDG 21, helicity +) is off shell: p^2 = +2.5e5, expected m^2 = +0e0 (|Δ| = +2.5e5). Fixed-helicity spinor/vector/tensor external states may be ill-defined at this kinematic point.
  949. 126.32 s > field value
  950. 126.32 s > span warm_up{integrand.name=se1l_mur_shifted}
  951. 126.32 s > [2026-08-28 10:45:23.522] @process::amplitude WARNING : External state 1 ('g', PDG 21, helicity -) is off shell: p^2 = +2.5e5, expected m^2 = +0e0 (|Δ| = +2.5e5). Fixed-helicity spinor/vector/tensor external states may be ill-defined at this kinematic point.
  952. 126.32 s > field value
  953. 126.32 s > span warm_up{integrand.name=se1l_mur_shifted}
  954. 126.32 s > [2026-08-28 10:45:23.523] @process::amplitude INFO : Input is above threshold: 1 existing threshold E-surfaces across 1/1 graph groups
  955. 126.32 s > field value
  956. 126.32 s > existing_esurfaces 1
  957. 126.32 s > group_count 1
  958. 126.32 s > groups_above_threshold 1
  959. 126.32 s > integrand se1l_mur_shifted
  960. 126.32 s > span warm_up{integrand.name=se1l_mur_shifted}
  961. 126.32 s > threshold_status above threshold
  962. 126.32 s > [2026-08-28 10:45:23.523] @process::amplitude INFO : overlap structure of group 0: [1: [0(2,3)]]
  963. 126.32 s > field value
  964. 126.32 s > span warm_up{integrand.name=se1l_mur_shifted}
  965. 126.32 s > [2026-08-28 10:45:23.526] @process::amplitude WARNING : External state 0 ('g', PDG 21, helicity +) is off shell: p^2 = +2.5e5, expected m^2 = +0e0 (|Δ| = +2.5e5). Fixed-helicity spinor/vector/tensor external states may be ill-defined at this kinematic point.
  966. 126.32 s > field value
  967. 126.32 s > span warm_up{integrand.name=se1l}
  968. 126.32 s > [2026-08-28 10:45:23.526] @process::amplitude WARNING : External state 1 ('g', PDG 21, helicity -) is off shell: p^2 = +2.5e5, expected m^2 = +0e0 (|Δ| = +2.5e5). Fixed-helicity spinor/vector/tensor external states may be ill-defined at this kinematic point.
  969. 126.32 s > field value
  970. 126.32 s > span warm_up{integrand.name=se1l}
  971. 126.32 s > [2026-08-28 10:45:23.526] @process::amplitude INFO : Input is above threshold: 1 existing threshold E-surfaces across 1/1 graph groups
  972. 126.32 s > field value
  973. 126.32 s > existing_esurfaces 1
  974. 126.32 s > group_count 1
  975. 126.32 s > groups_above_threshold 1
  976. 126.32 s > integrand se1l
  977. 126.32 s > span warm_up{integrand.name=se1l}
  978. 126.32 s > threshold_status above threshold
  979. 126.32 s > [2026-08-28 10:45:23.526] @process::amplitude INFO : overlap structure of group 0: [1: [0(2,3)]]
  980. 126.32 s > field value
  981. 126.32 s > span warm_up{integrand.name=se1l}
  982. 126.32 s > [2026-08-28 10:45:23.530] @process::amplitude WARNING : External state 0 ('g', PDG 21, helicity +) is off shell: p^2 = +2.5e5, expected m^2 = +0e0 (|Δ| = +2.5e5). Fixed-helicity spinor/vector/tensor external states may be ill-defined at this kinematic point.
  983. 126.32 s > field value
  984. 126.32 s > span warm_up{integrand.name=se1l_mur_shifted}
  985. 126.32 s > [2026-08-28 10:45:23.530] @process::amplitude WARNING : External state 1 ('g', PDG 21, helicity -) is off shell: p^2 = +2.5e5, expected m^2 = +0e0 (|Δ| = +2.5e5). Fixed-helicity spinor/vector/tensor external states may be ill-defined at this kinematic point.
  986. 126.32 s > field value
  987. 126.32 s > span warm_up{integrand.name=se1l_mur_shifted}
  988. 126.32 s > [2026-08-28 10:45:23.530] @process::amplitude INFO : Input is above threshold: 1 existing threshold E-surfaces across 1/1 graph groups
  989. 126.32 s > field value
  990. 126.32 s > existing_esurfaces 1
  991. 126.32 s > group_count 1
  992. 126.32 s > groups_above_threshold 1
  993. 126.32 s > integrand se1l_mur_shifted
  994. 126.32 s > span warm_up{integrand.name=se1l_mur_shifted}
  995. 126.32 s > threshold_status above threshold
  996. 126.32 s > [2026-08-28 10:45:23.530] @process::amplitude INFO : overlap structure of group 0: [1: [0(2,3)]]
  997. 126.32 s > field value
  998. 126.32 s > span warm_up{integrand.name=se1l_mur_shifted}
  999. 126.32 s > [2026-08-28 10:45:23.534] @process::amplitude WARNING : External state 0 ('g', PDG 21, helicity +) is off shell: p^2 = +2.5e5, expected m^2 = +0e0 (|Δ| = +2.5e5). Fixed-helicity spinor/vector/tensor external states may be ill-defined at this kinematic point.
  1000. 126.32 s > field value
  1001. 126.32 s > span warm_up{integrand.name=se1l}
  1002. 126.32 s > [2026-08-28 10:45:23.534] @process::amplitude WARNING : External state 1 ('g', PDG 21, helicity -) is off shell: p^2 = +2.5e5, expected m^2 = +0e0 (|Δ| = +2.5e5). Fixed-helicity spinor/vector/tensor external states may be ill-defined at this kinematic point.
  1003. 126.32 s > field value
  1004. 126.32 s > span warm_up{integrand.name=se1l}
  1005. 126.32 s > [2026-08-28 10:45:23.534] @process::amplitude INFO : Input is above threshold: 1 existing threshold E-surfaces across 1/1 graph groups
  1006. 126.32 s > field value
  1007. 126.32 s > existing_esurfaces 1
  1008. 126.32 s > group_count 1
  1009. 126.32 s > groups_above_threshold 1
  1010. 126.32 s > integrand se1l
  1011. 126.32 s > span warm_up{integrand.name=se1l}
  1012. 126.32 s > threshold_status above threshold
  1013. 126.32 s > [2026-08-28 10:45:23.534] @process::amplitude INFO : overlap structure of group 0: [1: [0(2,3)]]
  1014. 126.32 s > field value
  1015. 126.32 s > span warm_up{integrand.name=se1l}
  1016. 126.32 s > [2026-08-28 10:45:23.538] @process::amplitude WARNING : External state 0 ('g', PDG 21, helicity +) is off shell: p^2 = +2.5e5, expected m^2 = +0e0 (|Δ| = +2.5e5). Fixed-helicity spinor/vector/tensor external states may be ill-defined at this kinematic point.
  1017. 126.32 s > field value
  1018. 126.32 s > span warm_up{integrand.name=se1l_mur_shifted}
  1019. 126.32 s > [2026-08-28 10:45:23.538] @process::amplitude WARNING : External state 1 ('g', PDG 21, helicity -) is off shell: p^2 = +2.5e5, expected m^2 = +0e0 (|Δ| = +2.5e5). Fixed-helicity spinor/vector/tensor external states may be ill-defined at this kinematic point.
  1020. 126.32 s > field value
  1021. 126.32 s > span warm_up{integrand.name=se1l_mur_shifted}
  1022. 126.32 s > [2026-08-28 10:45:23.538] @process::amplitude INFO : Input is above threshold: 1 existing threshold E-surfaces across 1/1 graph groups
  1023. 126.32 s > field value
  1024. 126.32 s > existing_esurfaces 1
  1025. 126.32 s > group_count 1
  1026. 126.32 s > groups_above_threshold 1
  1027. 126.32 s > integrand se1l_mur_shifted
  1028. 126.32 s > span warm_up{integrand.name=se1l_mur_shifted}
  1029. 126.32 s > threshold_status above threshold
  1030. 126.32 s > [2026-08-28 10:45:23.538] @process::amplitude INFO : overlap structure of group 0: [1: [0(2,3)]]
  1031. 126.32 s > field value
  1032. 126.32 s > span warm_up{integrand.name=se1l_mur_shifted}
  1033. 126.32 s > [2026-08-28 10:45:23.542] @process::amplitude WARNING : External state 0 ('g', PDG 21, helicity +) is off shell: p^2 = +2.5e5, expected m^2 = +0e0 (|Δ| = +2.5e5). Fixed-helicity spinor/vector/tensor external states may be ill-defined at this kinematic point.
  1034. 126.32 s > field value
  1035. 126.32 s > span warm_up{integrand.name=se1l}
  1036. 126.32 s > [2026-08-28 10:45:23.542] @process::amplitude WARNING : External state 1 ('g', PDG 21, helicity -) is off shell: p^2 = +2.5e5, expected m^2 = +0e0 (|Δ| = +2.5e5). Fixed-helicity spinor/vector/tensor external states may be ill-defined at this kinematic point.
  1037. 126.32 s > field value
  1038. 126.32 s > span warm_up{integrand.name=se1l}
  1039. 126.32 s > [2026-08-28 10:45:23.542] @process::amplitude INFO : Input is above threshold: 1 existing threshold E-surfaces across 1/1 graph groups
  1040. 126.32 s > field value
  1041. 126.32 s > existing_esurfaces 1
  1042. 126.32 s > group_count 1
  1043. 126.32 s > groups_above_threshold 1
  1044. 126.32 s > integrand se1l
  1045. 126.32 s > span warm_up{integrand.name=se1l}
  1046. 126.32 s > threshold_status above threshold
  1047. 126.32 s > [2026-08-28 10:45:23.542] @process::amplitude INFO : overlap structure of group 0: [1: [0(2,3)]]
  1048. 126.32 s > field value
  1049. 126.32 s > span warm_up{integrand.name=se1l}
  1050. 126.32 s > [2026-08-28 10:45:23.546] @process::amplitude WARNING : External state 0 ('g', PDG 21, helicity +) is off shell: p^2 = +2.5e5, expected m^2 = +0e0 (|Δ| = +2.5e5). Fixed-helicity spinor/vector/tensor external states may be ill-defined at this kinematic point.
  1051. 126.32 s > field value
  1052. 126.32 s > span warm_up{integrand.name=se1l_mur_shifted}
  1053. 126.32 s > [2026-08-28 10:45:23.546] @process::amplitude WARNING : External state 1 ('g', PDG 21, helicity -) is off shell: p^2 = +2.5e5, expected m^2 = +0e0 (|Δ| = +2.5e5). Fixed-helicity spinor/vector/tensor external states may be ill-defined at this kinematic point.
  1054. 126.32 s > field value
  1055. 126.32 s > span warm_up{integrand.name=se1l_mur_shifted}
  1056. 126.32 s > [2026-08-28 10:45:23.546] @process::amplitude INFO : Input is above threshold: 1 existing threshold E-surfaces across 1/1 graph groups
  1057. 126.32 s > field value
  1058. 126.32 s > existing_esurfaces 1
  1059. 126.32 s > group_count 1
  1060. 126.32 s > groups_above_threshold 1
  1061. 126.32 s > integrand se1l_mur_shifted
  1062. 126.32 s > span warm_up{integrand.name=se1l_mur_shifted}
  1063. 126.32 s > threshold_status above threshold
  1064. 126.32 s > [2026-08-28 10:45:23.546] @process::amplitude INFO : overlap structure of group 0: [1: [0(2,3)]]
  1065. 126.32 s > field value
  1066. 126.32 s > span warm_up{integrand.name=se1l_mur_shifted}
  1067. 126.32 s > [2026-08-28 10:45:23.549] @process::amplitude WARNING : External state 0 ('g', PDG 21, helicity +) is off shell: p^2 = +2.5e5, expected m^2 = +0e0 (|Δ| = +2.5e5). Fixed-helicity spinor/vector/tensor external states may be ill-defined at this kinematic point.
  1068. 126.32 s > field value
  1069. 126.32 s > span warm_up{integrand.name=se1l}
  1070. 126.32 s > [2026-08-28 10:45:23.549] @process::amplitude WARNING : External state 1 ('g', PDG 21, helicity -) is off shell: p^2 = +2.5e5, expected m^2 = +0e0 (|Δ| = +2.5e5). Fixed-helicity spinor/vector/tensor external states may be ill-defined at this kinematic point.
  1071. 126.32 s > field value
  1072. 126.32 s > span warm_up{integrand.name=se1l}
  1073. 126.32 s > [2026-08-28 10:45:23.550] @process::amplitude INFO : Input is above threshold: 1 existing threshold E-surfaces across 1/1 graph groups
  1074. 126.32 s > field value
  1075. 126.32 s > existing_esurfaces 1
  1076. 126.32 s > group_count 1
  1077. 126.32 s > groups_above_threshold 1
  1078. 126.32 s > integrand se1l
  1079. 126.32 s > span warm_up{integrand.name=se1l}
  1080. 126.32 s > threshold_status above threshold
  1081. 126.32 s > [2026-08-28 10:45:23.550] @process::amplitude INFO : overlap structure of group 0: [1: [0(2,3)]]
  1082. 126.32 s > field value
  1083. 126.32 s > span warm_up{integrand.name=se1l}
  1084. 126.32 s > [2026-08-28 10:45:23.553] @process::amplitude WARNING : External state 0 ('g', PDG 21, helicity +) is off shell: p^2 = +2.5e5, expected m^2 = +0e0 (|Δ| = +2.5e5). Fixed-helicity spinor/vector/tensor external states may be ill-defined at this kinematic point.
  1085. 126.32 s > field value
  1086. 126.32 s > span warm_up{integrand.name=se1l_mur_shifted}
  1087. 126.32 s > [2026-08-28 10:45:23.553] @process::amplitude WARNING : External state 1 ('g', PDG 21, helicity -) is off shell: p^2 = +2.5e5, expected m^2 = +0e0 (|Δ| = +2.5e5). Fixed-helicity spinor/vector/tensor external states may be ill-defined at this kinematic point.
  1088. 126.32 s > field value
  1089. 126.32 s > span warm_up{integrand.name=se1l_mur_shifted}
  1090. 126.32 s > [2026-08-28 10:45:23.553] @process::amplitude INFO : Input is above threshold: 1 existing threshold E-surfaces across 1/1 graph groups
  1091. 126.32 s > field value
  1092. 126.32 s > existing_esurfaces 1
  1093. 126.32 s > group_count 1
  1094. 126.32 s > groups_above_threshold 1
  1095. 126.32 s > integrand se1l_mur_shifted
  1096. 126.32 s > span warm_up{integrand.name=se1l_mur_shifted}
  1097. 126.32 s > threshold_status above threshold
  1098. 126.32 s > [2026-08-28 10:45:23.553] @process::amplitude INFO : overlap structure of group 0: [1: [0(2,3)]]
  1099. 126.32 s > field value
  1100. 126.32 s > span warm_up{integrand.name=se1l_mur_shifted}
  1101. 126.32 s > [2026-08-28 10:45:23.557] @process::amplitude WARNING : External state 0 ('g', PDG 21, helicity +) is off shell: p^2 = +2.5e5, expected m^2 = +0e0 (|Δ| = +2.5e5). Fixed-helicity spinor/vector/tensor external states may be ill-defined at this kinematic point.
  1102. 126.32 s > field value
  1103. 126.32 s > span warm_up{integrand.name=se1l}
  1104. 126.32 s > [2026-08-28 10:45:23.557] @process::amplitude WARNING : External state 1 ('g', PDG 21, helicity -) is off shell: p^2 = +2.5e5, expected m^2 = +0e0 (|Δ| = +2.5e5). Fixed-helicity spinor/vector/tensor external states may be ill-defined at this kinematic point.
  1105. 126.32 s > field value
  1106. 126.32 s > span warm_up{integrand.name=se1l}
  1107. 126.32 s > [2026-08-28 10:45:23.557] @process::amplitude INFO : Input is above threshold: 1 existing threshold E-surfaces across 1/1 graph groups
  1108. 126.32 s > field value
  1109. 126.32 s > existing_esurfaces 1
  1110. 126.32 s > group_count 1
  1111. 126.32 s > groups_above_threshold 1
  1112. 126.32 s > integrand se1l
  1113. 126.32 s > span warm_up{integrand.name=se1l}
  1114. 126.32 s > threshold_status above threshold
  1115. 126.32 s > [2026-08-28 10:45:23.557] @process::amplitude INFO : overlap structure of group 0: [1: [0(2,3)]]
  1116. 126.32 s > field value
  1117. 126.32 s > span warm_up{integrand.name=se1l}
  1118. 126.32 s > [2026-08-28 10:45:23.561] @process::amplitude WARNING : External state 0 ('g', PDG 21, helicity +) is off shell: p^2 = +2.5e5, expected m^2 = +0e0 (|Δ| = +2.5e5). Fixed-helicity spinor/vector/tensor external states may be ill-defined at this kinematic point.
  1119. 126.32 s > field value
  1120. 126.32 s > span warm_up{integrand.name=se1l_mur_shifted}
  1121. 126.32 s > [2026-08-28 10:45:23.561] @process::amplitude WARNING : External state 1 ('g', PDG 21, helicity -) is off shell: p^2 = +2.5e5, expected m^2 = +0e0 (|Δ| = +2.5e5). Fixed-helicity spinor/vector/tensor external states may be ill-defined at this kinematic point.
  1122. 126.32 s > field value
  1123. 126.32 s > span warm_up{integrand.name=se1l_mur_shifted}
  1124. 126.32 s > [2026-08-28 10:45:23.561] @process::amplitude INFO : Input is above threshold: 1 existing threshold E-surfaces across 1/1 graph groups
  1125. 126.32 s > field value
  1126. 126.32 s > existing_esurfaces 1
  1127. 126.32 s > group_count 1
  1128. 126.32 s > groups_above_threshold 1
  1129. 126.32 s > integrand se1l_mur_shifted
  1130. 126.32 s > span warm_up{integrand.name=se1l_mur_shifted}
  1131. 126.32 s > threshold_status above threshold
  1132. 126.32 s > [2026-08-28 10:45:23.561] @process::amplitude INFO : overlap structure of group 0: [1: [0(2,3)]]
  1133. 126.32 s > field value
  1134. 126.32 s > span warm_up{integrand.name=se1l_mur_shifted}
  1135. 126.32 s > [2026-08-28 10:45:23.565] @process::amplitude WARNING : External state 0 ('g', PDG 21, helicity +) is off shell: p^2 = +2.5e5, expected m^2 = +0e0 (|Δ| = +2.5e5). Fixed-helicity spinor/vector/tensor external states may be ill-defined at this kinematic point.
  1136. 126.32 s > field value
  1137. 126.32 s > span warm_up{integrand.name=se1l}
  1138. 126.32 s > [2026-08-28 10:45:23.565] @process::amplitude WARNING : External state 1 ('g', PDG 21, helicity -) is off shell: p^2 = +2.5e5, expected m^2 = +0e0 (|Δ| = +2.5e5). Fixed-helicity spinor/vector/tensor external states may be ill-defined at this kinematic point.
  1139. 126.32 s > field value
  1140. 126.32 s > span warm_up{integrand.name=se1l}
  1141. 126.32 s > [2026-08-28 10:45:23.565] @process::amplitude INFO : Input is above threshold: 1 existing threshold E-surfaces across 1/1 graph groups
  1142. 126.32 s > field value
  1143. 126.32 s > existing_esurfaces 1
  1144. 126.32 s > group_count 1
  1145. 126.32 s > groups_above_threshold 1
  1146. 126.32 s > integrand se1l
  1147. 126.32 s > span warm_up{integrand.name=se1l}
  1148. 126.32 s > threshold_status above threshold
  1149. 126.32 s > [2026-08-28 10:45:23.565] @process::amplitude INFO : overlap structure of group 0: [1: [0(2,3)]]
  1150. 126.32 s > field value
  1151. 126.32 s > span warm_up{integrand.name=se1l}
  1152. 126.32 s > [2026-08-28 10:45:23.569] @process::amplitude WARNING : External state 0 ('g', PDG 21, helicity +) is off shell: p^2 = +2.5e5, expected m^2 = +0e0 (|Δ| = +2.5e5). Fixed-helicity spinor/vector/tensor external states may be ill-defined at this kinematic point.
  1153. 126.32 s > field value
  1154. 126.32 s > span warm_up{integrand.name=se1l_mur_shifted}
  1155. 126.32 s > [2026-08-28 10:45:23.569] @process::amplitude WARNING : External state 1 ('g', PDG 21, helicity -) is off shell: p^2 = +2.5e5, expected m^2 = +0e0 (|Δ| = +2.5e5). Fixed-helicity spinor/vector/tensor external states may be ill-defined at this kinematic point.
  1156. 126.32 s > field value
  1157. 126.32 s > span warm_up{integrand.name=se1l_mur_shifted}
  1158. 126.32 s > [2026-08-28 10:45:23.569] @process::amplitude INFO : Input is above threshold: 1 existing threshold E-surfaces across 1/1 graph groups
  1159. 126.32 s > field value
  1160. 126.32 s > existing_esurfaces 1
  1161. 126.32 s > group_count 1
  1162. 126.32 s > groups_above_threshold 1
  1163. 126.32 s > integrand se1l_mur_shifted
  1164. 126.32 s > span warm_up{integrand.name=se1l_mur_shifted}
  1165. 126.32 s > threshold_status above threshold
  1166. 126.32 s > [2026-08-28 10:45:23.569] @process::amplitude INFO : overlap structure of group 0: [1: [0(2,3)]]
  1167. 126.32 s > field value
  1168. 126.32 s > span warm_up{integrand.name=se1l_mur_shifted}
  1169. 126.32 s > [2026-08-28 10:45:23.572] @process::amplitude WARNING : External state 0 ('g', PDG 21, helicity +) is off shell: p^2 = +2.5e5, expected m^2 = +0e0 (|Δ| = +2.5e5). Fixed-helicity spinor/vector/tensor external states may be ill-defined at this kinematic point.
  1170. 126.32 s > field value
  1171. 126.32 s > span warm_up{integrand.name=se1l}
  1172. 126.32 s > [2026-08-28 10:45:23.573] @process::amplitude WARNING : External state 1 ('g', PDG 21, helicity -) is off shell: p^2 = +2.5e5, expected m^2 = +0e0 (|Δ| = +2.5e5). Fixed-helicity spinor/vector/tensor external states may be ill-defined at this kinematic point.
  1173. 126.32 s > field value
  1174. 126.32 s > span warm_up{integrand.name=se1l}
  1175. 126.32 s > [2026-08-28 10:45:23.573] @process::amplitude INFO : Input is above threshold: 1 existing threshold E-surfaces across 1/1 graph groups
  1176. 126.32 s > field value
  1177. 126.32 s > existing_esurfaces 1
  1178. 126.32 s > group_count 1
  1179. 126.32 s > groups_above_threshold 1
  1180. 126.32 s > integrand se1l
  1181. 126.32 s > span warm_up{integrand.name=se1l}
  1182. 126.32 s > threshold_status above threshold
  1183. 126.32 s > [2026-08-28 10:45:23.573] @process::amplitude INFO : overlap structure of group 0: [1: [0(2,3)]]
  1184. 126.32 s > field value
  1185. 126.32 s > span warm_up{integrand.name=se1l}
  1186. 126.32 s > [2026-08-28 10:45:23.576] @process::amplitude WARNING : External state 0 ('g', PDG 21, helicity +) is off shell: p^2 = +2.5e5, expected m^2 = +0e0 (|Δ| = +2.5e5). Fixed-helicity spinor/vector/tensor external states may be ill-defined at this kinematic point.
  1187. 126.32 s > field value
  1188. 126.32 s > span warm_up{integrand.name=se1l_mur_shifted}
  1189. 126.32 s > [2026-08-28 10:45:23.576] @process::amplitude WARNING : External state 1 ('g', PDG 21, helicity -) is off shell: p^2 = +2.5e5, expected m^2 = +0e0 (|Δ| = +2.5e5). Fixed-helicity spinor/vector/tensor external states may be ill-defined at this kinematic point.
  1190. 126.32 s > field value
  1191. 126.32 s > span warm_up{integrand.name=se1l_mur_shifted}
  1192. 126.32 s > [2026-08-28 10:45:23.576] @process::amplitude INFO : Input is above threshold: 1 existing threshold E-surfaces across 1/1 graph groups
  1193. 126.32 s > field value
  1194. 126.32 s > existing_esurfaces 1
  1195. 126.32 s > group_count 1
  1196. 126.32 s > groups_above_threshold 1
  1197. 126.32 s > integrand se1l_mur_shifted
  1198. 126.32 s > span warm_up{integrand.name=se1l_mur_shifted}
  1199. 126.32 s > threshold_status above threshold
  1200. 126.32 s > [2026-08-28 10:45:23.577] @process::amplitude INFO : overlap structure of group 0: [1: [0(2,3)]]
  1201. 126.32 s > field value
  1202. 126.32 s > span warm_up{integrand.name=se1l_mur_shifted}
  1203. 126.32 s > [2026-08-28 10:45:23.580] @process::amplitude WARNING : External state 0 ('g', PDG 21, helicity +) is off shell: p^2 = +2.5e5, expected m^2 = +0e0 (|Δ| = +2.5e5). Fixed-helicity spinor/vector/tensor external states may be ill-defined at this kinematic point.
  1204. 126.32 s > field value
  1205. 126.32 s > span warm_up{integrand.name=se1l}
  1206. 126.32 s > [2026-08-28 10:45:23.580] @process::amplitude WARNING : External state 1 ('g', PDG 21, helicity -) is off shell: p^2 = +2.5e5, expected m^2 = +0e0 (|Δ| = +2.5e5). Fixed-helicity spinor/vector/tensor external states may be ill-defined at this kinematic point.
  1207. 126.32 s > field value
  1208. 126.32 s > span warm_up{integrand.name=se1l}
  1209. 126.32 s > [2026-08-28 10:45:23.580] @process::amplitude INFO : Input is above threshold: 1 existing threshold E-surfaces across 1/1 graph groups
  1210. 126.32 s > field value
  1211. 126.32 s > existing_esurfaces 1
  1212. 126.32 s > group_count 1
  1213. 126.32 s > groups_above_threshold 1
  1214. 126.32 s > integrand se1l
  1215. 126.32 s > span warm_up{integrand.name=se1l}
  1216. 126.32 s > threshold_status above threshold
  1217. 126.32 s > [2026-08-28 10:45:23.580] @process::amplitude INFO : overlap structure of group 0: [1: [0(2,3)]]
  1218. 126.32 s > field value
  1219. 126.32 s > span warm_up{integrand.name=se1l}
  1220. 126.32 s > [2026-08-28 10:45:23.584] @process::amplitude WARNING : External state 0 ('g', PDG 21, helicity +) is off shell: p^2 = +2.5e5, expected m^2 = +0e0 (|Δ| = +2.5e5). Fixed-helicity spinor/vector/tensor external states may be ill-defined at this kinematic point.
  1221. 126.32 s > field value
  1222. 126.32 s > span warm_up{integrand.name=se1l_mur_shifted}
  1223. 126.32 s > [2026-08-28 10:45:23.584] @process::amplitude WARNING : External state 1 ('g', PDG 21, helicity -) is off shell: p^2 = +2.5e5, expected m^2 = +0e0 (|Δ| = +2.5e5). Fixed-helicity spinor/vector/tensor external states may be ill-defined at this kinematic point.
  1224. 126.32 s > field value
  1225. 126.32 s > span warm_up{integrand.name=se1l_mur_shifted}
  1226. 126.32 s > [2026-08-28 10:45:23.584] @process::amplitude INFO : Input is above threshold: 1 existing threshold E-surfaces across 1/1 graph groups
  1227. 126.32 s > field value
  1228. 126.32 s > existing_esurfaces 1
  1229. 126.32 s > group_count 1
  1230. 126.32 s > groups_above_threshold 1
  1231. 126.32 s > integrand se1l_mur_shifted
  1232. 126.32 s > span warm_up{integrand.name=se1l_mur_shifted}
  1233. 126.32 s > threshold_status above threshold
  1234. 126.32 s > [2026-08-28 10:45:23.584] @process::amplitude INFO : overlap structure of group 0: [1: [0(2,3)]]
  1235. 126.32 s > field value
  1236. 126.32 s > span warm_up{integrand.name=se1l_mur_shifted}
  1237. 126.32 s > The application panicked (crashed).
  1238. 126.32 s > Message: Integrated UV case failed: se1l
  1239. 126.32 s > Location: tests/tests/uv.rs:1068
  1240. 126.32 s >
  1241. 126.32 s > ━━━━━━━━━━━━━━━━━━━━━━━━━━━━━━━━━━ BACKTRACE ━━━━━━━━━━━━━━━━━━━━━━━━━━━━━━━━━━━
  1242. 126.32 s > 1: <color_eyre[51793ea62743adbd]::config::PanicHook>::panic_report<unknown>
  1243. 126.32 s > at <unknown source file>:<unknown line>
  1244. 126.32 s > 2: <color_eyre[51793ea62743adbd]::config::PanicHook>::into_panic_hook::{closure#0}<unknown>
  1245. 126.32 s > at <unknown source file>:<unknown line>
  1246. 126.32 s > 3: std[bcb96dfbba0ab899]::panicking::panic_with_hook<unknown>
  1247. 126.32 s > at <unknown source file>:<unknown line>
  1248. 126.32 s > 4: std[bcb96dfbba0ab899]::panicking::panic_handler::{closure#0}<unknown>
  1249. 126.32 s > at <unknown source file>:<unknown line>
  1250. 126.32 s > 5: std[bcb96dfbba0ab899]::sys::backtrace::__rust_end_short_backtrace::<std[bcb96dfbba0ab899]::panicking::panic_handler::{closure#0}, !><unknown>
  1251. 126.32 s > at <unknown source file>:<unknown line>
  1252. 126.32 s > 6: __rustc[6c289b9f9c454d21]::rust_begin_unwind<unknown>
  1253. 126.32 s > at <unknown source file>:<unknown line>
  1254. 126.32 s > 7: core[940e698046960fd5]::panicking::panic_fmt<unknown>
  1255. 126.32 s > at <unknown source file>:<unknown line>
  1256. 126.32 s > 8: uv[52cf2b63f0104e31]::run_single_integrated_uv_case<unknown>
  1257. 126.32 s > at <unknown source file>:<unknown line>
  1258. 126.32 s > 9: <uv[52cf2b63f0104e31]::se1l_uv::{closure#0} as core[940e698046960fd5]::ops::function::FnOnce<()>>::call_once<unknown>
  1259. 126.32 s > at <unknown source file>:<unknown line>
  1260. 126.32 s > 10: test[75d6903177b1d7e9]::__rust_begin_short_backtrace::<core[940e698046960fd5]::result::Result<(), alloc[2ea6bcb46fca0c42]::string::String>, fn() -> core[940e698046960fd5]::result::Result<(), alloc[2ea6bcb46fca0c42]::string::String>><unknown>
  1261. 126.32 s > at <unknown source file>:<unknown line>
  1262. 126.32 s > 11: test[75d6903177b1d7e9]::run_test::{closure#0}<unknown>
  1263. 126.32 s > at <unknown source file>:<unknown line>
  1264. 126.32 s > 12: std[bcb96dfbba0ab899]::sys::backtrace::__rust_begin_short_backtrace::<test[75d6903177b1d7e9]::run_test::{closure#1}, ()><unknown>
  1265. 126.32 s > at <unknown source file>:<unknown line>
  1266. 126.32 s > 13: <std[bcb96dfbba0ab899]::thread::lifecycle::spawn_unchecked<test[75d6903177b1d7e9]::run_test::{closure#1}, ()>::{closure#1} as core[940e698046960fd5]::ops::function::FnOnce<()>>::call_once::{shim:vtable#0}<unknown>
  1267. 126.32 s > at <unknown source file>:<unknown line>
  1268. 126.32 s > 14: <std[bcb96dfbba0ab899]::sys::thread::unix::Thread>::new::thread_start<unknown>
  1269. 126.32 s > at <unknown source file>:<unknown line>
  1270. 126.32 s > 15: start_thread<unknown>
  1271. 126.32 s > at <unknown source file>:<unknown line>
  1272. 126.32 s > 16: __clone3<unknown>
  1273. 126.32 s > at <unknown source file>:<unknown line>
  1274. 126.32 s >
  1275. 126.32 s > Run with COLORBT_SHOW_HIDDEN=1 environment variable to disable frame filtering.
  1276. 126.32 s > Run with RUST_BACKTRACE=full to include source snippets.
  1277. 126.32 s >
  1278. 126.32 s > error: test run failed
  1279. 126.32 s >
  1280. 126.32 s > ========== nextest test summary ==========
  1281. 126.32 s > report: target/nextest/ci_gammaloop/junit.xml
  1282. 126.32 s > tests: 106, failures: 9, errors: 0
  1283. 126.32 s >
  1284. 126.32 s > 1. gammaloop-integration-tests::test_runs::approach::approach_momentum_space_reports_incomplete_triplet_cleanly
  1285. 126.32 s > failure: test failure with exit code 101
  1286. 126.32 s > system-out
  1287. 126.32 s > running 1 test
  1288. 126.32 s > test approach::approach_momentum_space_reports_incomplete_triplet_cleanly ... FAILED
  1289. 126.32 s >
  1290. 126.32 s > failures:
  1291. 126.32 s >
  1292. 126.32 s > failures:
  1293. 126.32 s > approach::approach_momentum_space_reports_incomplete_triplet_cleanly
  1294. 126.32 s >
  1295. 126.32 s > test result: FAILED. 0 passed; 1 failed; 0 ignored; 0 measured; 82 filtered out; finished in 0.59s
  1296. 126.32 s > system-err
  1297. 126.32 s > [2026-08-28 10:43:33.671] @gammaloop_api::se... INFO : Running command import model scalars-default.json
  1298. 126.32 s > [2026-08-28 10:43:33.671] @import::model INFO : Loading built-in JSON model scalars-default
  1299. 126.32 s > [2026-08-28 10:43:33.677] @gammalooprs::model INFO : The following 2 external parameters were forced to zero by the restriction card:
  1300. 126.32 s > width_scalar_1, width_scalar_2
  1301. 126.32 s > [2026-08-28 10:43:33.679] @gammaloop_api::se... INFO : Running command remove processes
  1302. 126.32 s > [2026-08-28 10:43:33.680] @gammaloop_api::se... INFO : Running command generate amp scalar_1 > scalar_0 scalar_0 [{1}] --allowed-vertex-interactions V_3_SCALAR_022 V_3_SCALAR_122 -p triangle -i scalar_tri
  1303. 126.32 s > [2026-08-28 10:43:33.681] @feyngen::diagram_... INFO : 0s | Δ=0s | Starting Feynman graph generation with Symbolica...
  1304. 126.32 s > [2026-08-28 10:43:33.681] @feyngen::diagram_... INFO : 0s | Δ=0s | Number of graphs resulting from Symbolica generation: 1
  1305. 126.32 s > [2026-08-28 10:43:33.681] @feyngen::diagram_... INFO : 0s | Δ=0s | Number of graphs retained after removal of vetoed topologies: 1
  1306. 126.32 s > [2026-08-28 10:43:33.682] @feyngen::diagram_... INFO : 0s | Δ=0s | Number of graphs after vertex info assignment: 1
  1307. 126.32 s > [2026-08-28 10:43:33.682] @feyngen::diagram_... INFO : 0s | Δ=0s | Number of graphs after all complete graphs filters are applied: 1
  1308. 126.32 s > [2026-08-28 10:43:33.682] @feyngen::diagram_... INFO : 0s | Δ=0s | Number of graphs after closed fermion chains analysis: 1
  1309. 126.32 s > [2026-08-28 10:43:33.682] @feyngen::diagram_... INFO : 0s | Δ=0s | Number of graphs after symmetrization of external states: 1
  1310. 126.32 s > [2026-08-28 10:43:33.682] @feyngen::diagram_... INFO : 0s | Δ=0s | Number of graphs after canonization of vertices, edges and flows (graph labels assigned here): 1
  1311. 126.32 s > [2026-08-28 10:43:33.690] @feyngen::diagram_... INFO : 0s | Δ=0s | Number of graphs after numerator-aware grouping with strategy 'up to a scalar rescaling': 1 (1 isomorphically unique graph, 0 color zero, 0 lorentz zero, 0 grouped and 0 cancellation)
  1312. 126.32 s > [2026-08-28 10:43:33.690] @feyngen::diagram_... INFO : ( Sum of the symmetry factors from each graph generated = 1 )
  1313. 126.32 s > [2026-08-28 10:43:33.690] @commands::generate INFO : Generated amplitude 1 graphs.
  1314. 126.32 s > [2026-08-28 10:43:33.710] @settings::runtime WARNING : No external kinematics were provided; using default-generated external momenta and helicities.
  1315. 126.32 s > [2026-08-28 10:43:33.793] @commands::generate INFO :
  1316. 126.32 s > Integrand generation summary
  1317. 126.32 s > peak RAM 65.38 MiB | cores 1
  1318. 126.32 s > ╭────────────┬───────┬─────────┬────────────┬───────────┬────────────────┬─────────────╮
  1319. 126.32 s > │ integrand │ graph │ # evals │ expr build │ spenso │ symbolica eval │ compile │
  1320. 126.32 s > ├────────────┼───────┼─────────┼────────────┼───────────┼────────────────┼─────────────┤
  1321. 126.32 s > │ scalar_tri │ GL0 │ 9 │ 10ms (58%) │ 2ms (11%) │ 5ms (31%) │ 0ms (0.00%) │
  1322. 126.32 s > ├────────────┼───────┼─────────┼────────────┼───────────┼────────────────┼─────────────┤
  1323. 126.32 s > │ Total │ │ 9 │ 10ms (58%) │ 2ms (11%) │ 5ms (31%) │ 0ms (0.00%) │
  1324. 126.32 s > ╰────────────┴───────┴─────────┴────────────┴───────────┴────────────────┴─────────────╯
  1325. 126.32 s > [2026-08-28 10:43:33.794] @gammaloop_api::se... INFO : Running command generate amp scalar_0 scalar_0 > scalar_0 scalar_0 [{1}] --allowed-vertex-interactions V_3_SCALAR_022 -p box -i scalar_box --select-graphs GL0
  1326. 126.32 s > [2026-08-28 10:43:33.796] @feyngen::diagram_... INFO : 0s | Δ=0s | Starting Feynman graph generation with Symbolica...
  1327. 126.32 s > [2026-08-28 10:43:33.796] @feyngen::diagram_... INFO : 0s | Δ=0s | Number of graphs resulting from Symbolica generation: 3
  1328. 126.32 s > [2026-08-28 10:43:33.796] @feyngen::diagram_... INFO : 0s | Δ=0s | Number of graphs retained after removal of vetoed topologies: 3
  1329. 126.32 s > [2026-08-28 10:43:33.796] @feyngen::diagram_... INFO : 0s | Δ=0s | Number of graphs after vertex info assignment: 3
  1330. 126.32 s > [2026-08-28 10:43:33.796] @feyngen::diagram_... INFO : 0s | Δ=0s | Number of graphs after all complete graphs filters are applied: 3
  1331. 126.32 s > [2026-08-28 10:43:33.796] @feyngen::diagram_... INFO : 0s | Δ=0s | Number of graphs after closed fermion chains analysis: 3
  1332. 126.32 s > [2026-08-28 10:43:33.796] @feyngen::diagram_... INFO : 0s | Δ=0s | Number of graphs after symmetrization of external states: 3
  1333. 126.32 s > [2026-08-28 10:43:33.796] @feyngen::diagram_... INFO : 0s | Δ=0s | Number of graphs after canonization of vertices, edges and flows (graph labels assigned here): 3
  1334. 126.32 s > [2026-08-28 10:43:33.804] @feyngen::diagram_... INFO : 0s | Δ=0s | Number of graphs after numerator-aware grouping with strategy 'up to a scalar rescaling': 1 (1 isomorphically unique graph, 0 color zero, 0 lorentz zero, 0 grouped and 0 cancellation)
  1335. 126.32 s > [2026-08-28 10:43:33.804] @feyngen::diagram_... INFO : ( Sum of the symmetry factors from each graph generated = 1 )
  1336. 126.32 s > [2026-08-28 10:43:33.804] @commands::generate INFO : Generated amplitude 1 graphs.
  1337. 126.32 s > [2026-08-28 10:43:33.888] @settings::runtime WARNING : No external kinematics were provided; using default-generated external momenta and helicities.
  1338. 126.32 s > [2026-08-28 10:43:33.909] @commands::generate INFO :
  1339. 126.32 s > Integrand generation summary
  1340. 126.32 s > peak RAM 67.89 MiB | cores 1
  1341. 126.32 s > ╭────────────┬───────┬─────────┬────────────┬────────────┬────────────────┬─────────────╮
  1342. 126.32 s > │ integrand │ graph │ # evals │ expr build │ spenso │ symbolica eval │ compile │
  1343. 126.32 s > ├────────────┼───────┼─────────┼────────────┼────────────┼────────────────┼─────────────┤
  1344. 126.32 s > │ scalar_box │ GL0 │ 13 │ 46ms (58%) │ 7ms (9.0%) │ 27ms (33%) │ 0ms (0.00%) │
  1345. 126.32 s > ├────────────┼───────┼─────────┼────────────┼────────────┼────────────────┼─────────────┤
  1346. 126.32 s > │ Total │ │ 13 │ 46ms (58%) │ 7ms (9.0%) │ 27ms (33%) │ 0ms (0.00%) │
  1347. 126.32 s > ╰────────────┴───────┴─────────┴────────────┴────────────┴────────────────┴─────────────╯
  1348. 126.32 s > [2026-08-28 10:43:33.910] @gammaloop_api::se... INFO : Running command generate
  1349. 126.32 s > [2026-08-28 10:43:33.979] @settings::runtime WARNING : No external kinematics were provided; using default-generated external momenta and helicities.
  1350. 126.32 s > [2026-08-28 10:43:34.033] @settings::runtime WARNING : No external kinematics were provided; using default-generated external momenta and helicities.
  1351. 126.32 s > [2026-08-28 10:43:34.117] @commands::generate INFO :
  1352. 126.32 s > Integrand generation summary
  1353. 126.32 s > peak RAM 71.19 MiB | cores 1
  1354. 126.32 s > ╭────────────┬───────┬─────────┬────────────┬────────────┬────────────────┬─────────────╮
  1355. 126.32 s > │ integrand │ graph │ # evals │ expr build │ spenso │ symbolica eval │ compile │
  1356. 126.32 s > ├────────────┼───────┼─────────┼────────────┼────────────┼────────────────┼─────────────┤
  1357. 126.32 s > │ scalar_tri │ GL0 │ 9 │ 10ms (50%) │ 2ms (11%) │ 8ms (39%) │ 0ms (0.00%) │
  1358. 126.32 s > │ scalar_box │ GL0 │ 13 │ 43ms (45%) │ 9ms (9.8%) │ 43ms (45%) │ 0ms (0.00%) │
  1359. 126.32 s > ├────────────┼───────┼─────────┼────────────┼────────────┼────────────────┼─────────────┤
  1360. 126.32 s > │ Total │ │ 22 │ 54ms (46%) │ 11ms (10%) │ 52ms (44%) │ 0ms (0.00%) │
  1361. 126.32 s > ╰────────────┴───────┴─────────┴────────────┴────────────┴────────────────┴─────────────╯
  1362. 126.32 s > [2026-08-28 10:43:34.118] @gammaloop_api::se... INFO : Running command set model mass_scalar_2=2.0
  1363. 126.32 s > [2026-08-28 10:43:34.119] @gammaloop_api::se... INFO : Running command set model mass_scalar_1=1.0
  1364. 126.32 s > [2026-08-28 10:43:34.121] @gammaloop_api::se... INFO : Running command set process -p triangle -i scalar_tri string '
  1365. 126.32 s > [kinematics.externals]
  1366. 126.32 s > type = "constant"
  1367. 126.32 s >
  1368. 126.32 s > [kinematics.externals.data]
  1369. 126.32 s > [...]
  1370. 126.32 s > [2026-08-28 10:43:34.122] @gammaloop_api::se... INFO : Running command set process -p box -i scalar_box string '
  1371. 126.32 s > [kinematics.externals]
  1372. 126.32 s > type = "constant"
  1373. 126.32 s >
  1374. 126.32 s > [kinematics.externals.data]
  1375. 126.32 s > [...]
  1376. 126.32 s > [2026-08-28 10:43:34.123] @gammaloop_api::se... INFO : Running command approach -x 1.0000000000000001e-1,2.0000000000000001e-1,2.9999999999999999e-1,4.0000000000000002e-1 --approach-axis 1.0000000000000000e-3,0.0000000000000000e0,0.0000000000000000e0,0.0000000000000000e0 --n-points 1 --n-cores 1 --output-results /build/source/tests/artifacts/scalar_box_invalid_momentum_approach/approach_momentum.json --momentum-space --graph-id 0
  1377. 126.32 s > The application panicked (crashed).
  1378. 126.32 s > Message: There are 2 processes available. Please specify a process.
  1379. 126.32 s > Location: tests/tests/test_runs/approach.rs:332
  1380. 126.32 s >
  1381. 126.32 s > ━━━━━━━━━━━━━━━━━━━━━━━━━━━━━━━━━━ BACKTRACE ━━━━━━━━━━━━━━━━━━━━━━━━━━━━━━━━━━━
  1382. 126.32 s > 1: <color_eyre[51793ea62743adbd]::config::PanicHook>::panic_report<unknown>
  1383. 126.32 s > at <unknown source file>:<unknown line>
  1384. 126.32 s > 2: <color_eyre[51793ea62743adbd]::config::PanicHook>::into_panic_hook::{closure#0}<unknown>
  1385. 126.32 s > at <unknown source file>:<unknown line>
  1386. 126.32 s > 3: std[bcb96dfbba0ab899]::panicking::panic_with_hook<unknown>
  1387. 126.32 s > at <unknown source file>:<unknown line>
  1388. 126.32 s > 4: std[bcb96dfbba0ab899]::panicking::panic_handler::{closure#0}<unknown>
  1389. 126.32 s > at <unknown source file>:<unknown line>
  1390. 126.32 s > 5: std[bcb96dfbba0ab899]::sys::backtrace::__rust_end_short_backtrace::<std[bcb96dfbba0ab899]::panicking::panic_handler::{closure#0}, !><unknown>
  1391. 126.32 s > at <unknown source file>:<unknown line>
  1392. 126.32 s > 6: __rustc[6c289b9f9c454d21]::rust_begin_unwind<unknown>
  1393. 126.32 s > at <unknown source file>:<unknown line>
  1394. 126.32 s > 7: core[940e698046960fd5]::panicking::panic_fmt<unknown>
  1395. 126.32 s > at <unknown source file>:<unknown line>
  1396. 126.32 s > 8: test_runs[3e7a390caee4e338]::approach::approach_momentum_space_reports_incomplete_triplet_cleanly<unknown>
  1397. 126.32 s > at <unknown source file>:<unknown line>
  1398. 126.32 s > 9: <test_runs[3e7a390caee4e338]::approach::approach_momentum_space_reports_incomplete_triplet_cleanly::{closure#0} as core[940e698046960fd5]::ops::function::FnOnce<()>>::call_once<unknown>
  1399. 126.32 s > at <unknown source file>:<unknown line>
  1400. 126.32 s > 10: test[75d6903177b1d7e9]::__rust_begin_short_backtrace::<core[940e698046960fd5]::result::Result<(), alloc[2ea6bcb46fca0c42]::string::String>, fn() -> core[940e698046960fd5]::result::Result<(), alloc[2ea6bcb46fca0c42]::string::String>><unknown>
  1401. 126.32 s > at <unknown source file>:<unknown line>
  1402. 126.32 s > 11: test[75d6903177b1d7e9]::run_test::{closure#0}<unknown>
  1403. 126.32 s > at <unknown source file>:<unknown line>
  1404. 126.32 s > 12: std[bcb96dfbba0ab899]::sys::backtrace::__rust_begin_short_backtrace::<test[75d6903177b1d7e9]::run_test::{closure#1}, ()><unknown>
  1405. 126.32 s > at <unknown source file>:<unknown line>
  1406. 126.32 s > 13: <std[bcb96dfbba0ab899]::thread::lifecycle::spawn_unchecked<test[75d6903177b1d7e9]::run_test::{closure#1}, ()>::{closure#1} as core[940e698046960fd5]::ops::function::FnOnce<()>>::call_once::{shim:vtable#0}<unknown>
  1407. 126.32 s > at <unknown source file>:<unknown line>
  1408. 126.32 s > 14: <std[bcb96dfbba0ab899]::sys::thread::unix::Thread>::new::thread_start<unknown>
  1409. 126.32 s > at <unknown source file>:<unknown line>
  1410. 126.32 s > 15: start_thread<unknown>
  1411. 126.32 s > at <unknown source file>:<unknown line>
  1412. 126.32 s > 16: __clone3<unknown>
  1413. 126.32 s > at <unknown source file>:<unknown line>
  1414. 126.32 s >
  1415. 126.32 s > Run with COLORBT_SHOW_HIDDEN=1 environment variable to disable frame filtering.
  1416. 126.32 s > ... omitted 1 more lines; see full nextest output above
  1417. 126.32 s >
  1418. 126.32 s > 2. gammaloop-integration-tests::test_runs::profile_bulk::double_dotted_bubble_amp_bulk_profile_passes
  1419. 126.32 s > failure: test failure with exit code 101
  1420. 126.32 s > Error:
  1421. 126.32 s > 0: IR profiling requested arbitrary precision but received a quad-precision result
  1422. 126.32 s >
  1423. 126.32 s > Location:
  1424. 126.32 s > crates/gammalooprs/src/integrands/process/ir.rs:2123
  1425. 126.32 s >
  1426. 126.32 s > ━━━━━━━━━━━━━━━━━━━━━━━━━━━━━━━━━━ BACKTRACE ━━━━━━━━━━━━━━━━━━━━━━━━━━━━━━━━━━━
  1427. 126.32 s > 1: <color_eyre[51793ea62743adbd]::config::EyreHook>::into_eyre_hook::{closure#0}<unknown>
  1428. 126.32 s > at <unknown source file>:<unknown line>
  1429. 126.32 s > 2: eyre[cb2fd339c0c40fca]::capture_handler<unknown>
  1430. 126.32 s > at <unknown source file>:<unknown line>
  1431. 126.32 s > 3: eyre[cb2fd339c0c40fca]::private::format_err<unknown>
  1432. 126.32 s > at <unknown source file>:<unknown line>
  1433. 126.32 s > 4: gammalooprs[d7a7c067ebd19583]::integrands::process::ir::evaluate_profile_momentum_point_arb::<gammalooprs[d7a7c067ebd19583]::integrands::process::amplitude::AmplitudeIntegrand><unknown>
  1434. 126.32 s > at <unknown source file>:<unknown line>
  1435. 126.32 s > 5: <gammalooprs[d7a7c067ebd19583]::integrands::process::amplitude::AmplitudeIntegrand>::test_single_ir_limit_impl<unknown>
  1436. 126.32 s > at <unknown source file>:<unknown line>
  1437. 126.32 s > 6: gammalooprs[d7a7c067ebd19583]::integrands::process::ir::run_ir_profile::<gammalooprs[d7a7c067ebd19583]::integrands::process::amplitude::AmplitudeIntegrand, <gammalooprs[d7a7c067ebd19583]::integrands::process::amplitude::AmplitudeIntegrand>::enumerate_ir_limits, <gammalooprs[d7a7c067ebd19583]::integrands::process::amplitude::AmplitudeIntegrand>::graph_cut_definitions, <gammalooprs[d7a7c067ebd19583]::integrands::process::amplitude::AmplitudeIntegrand>::test_single_ir_limit_impl><unknown>
  1438. 126.32 s > at <unknown source file>:<unknown line>
  1439. 126.32 s > 7: <gammalooprs[d7a7c067ebd19583]::integrands::process::amplitude::AmplitudeIntegrand>::test_ir<unknown>
  1440. 126.32 s > at <unknown source file>:<unknown line>
  1441. 126.32 s > 8: <gammaloop_api[92ae732909e47e14]::commands::profile::Profile>::run<unknown>
  1442. 126.32 s > at <unknown source file>:<unknown line>
  1443. 126.32 s > 9: test_runs[3e7a390caee4e338]::profile_bulk::double_dotted_bubble_amp_bulk_profile_passes<unknown>
  1444. 126.32 s > at <unknown source file>:<unknown line>
  1445. 126.32 s > 10: <test_runs[3e7a390caee4e338]::profile_bulk::double_dotted_bubble_amp_bulk_profile_passes::{closure#0} as core[940e698046960fd5]::ops::function::FnOnce<()>>::call_once<unknown>
  1446. 126.32 s > at <unknown source file>:<unknown line>
  1447. 126.32 s > 11: test[75d6903177b1d7e9]::__rust_begin_short_backtrace::<core[940e698046960fd5]::result::Result<(), alloc[2ea6bcb46fca0c42]::string::String>, fn() -> core[940e698046960fd5]::result::Result<(), alloc[2ea6bcb46fca0c42]::string::String>><unknown>
  1448. 126.32 s > at <unknown source file>:<unknown line>
  1449. 126.32 s > 12: test[75d6903177b1d7e9]::run_test::{closure#0}<unknown>
  1450. 126.32 s > at <unknown source file>:<unknown line>
  1451. 126.32 s > 13: std[bcb96dfbba0ab899]::sys::backtrace::__rust_begin_short_backtrace::<test[75d6903177b1d7e9]::run_test::{closure#1}, ()><unknown>
  1452. 126.32 s > at <unknown source file>:<unknown line>
  1453. 126.32 s > 14: <std[bcb96dfbba0ab899]::thread::lifecycle::spawn_unchecked<test[75d6903177b1d7e9]::run_test::{closure#1}, ()>::{closure#1} as core[940e698046960fd5]::ops::function::FnOnce<()>>::call_once::{shim:vtable#0}<unknown>
  1454. 126.32 s > at <unknown source file>:<unknown line>
  1455. 126.32 s > 15: <std[bcb96dfbba0ab899]::sys::thread::unix::Thread>::new::thread_start<unknown>
  1456. 126.32 s > at <unknown source file>:<unknown line>
  1457. 126.32 s > 16: start_thread<unknown>
  1458. 126.32 s > at <unknown source file>:<unknown line>
  1459. 126.32 s > 17: __clone3<unknown>
  1460. 126.32 s > at <unknown source file>:<unknown line>
  1461. 126.32 s >
  1462. 126.32 s > Run with COLORBT_SHOW_HIDDEN=1 environment variable to disable frame filtering.
  1463. 126.32 s > Run with RUST_BACKTRACE=full to include source snippets.
  1464. 126.32 s > Warning: SpanTrace capture is Unsupported.
  1465. 126.32 s > Ensure that you've setup a tracing-error ErrorLayer and the semver versions are compatible
  1466. 126.32 s > system-out
  1467. 126.32 s > running 1 test
  1468. 126.32 s > test profile_bulk::double_dotted_bubble_amp_bulk_profile_passes ... FAILED
  1469. 126.32 s >
  1470. 126.32 s > failures:
  1471. 126.32 s >
  1472. 126.32 s > failures:
  1473. 126.32 s > profile_bulk::double_dotted_bubble_amp_bulk_profile_passes
  1474. 126.32 s >
  1475. 126.32 s > test result: FAILED. 0 passed; 1 failed; 0 ignored; 0 measured; 82 filtered out; finished in 0.29s
  1476. 126.32 s > system-err
  1477. 126.32 s > [2026-08-28 10:43:35.474] @gammaloop_api::se... INFO : Running command import model ./assets/models/json/scalars/scalars_2p_3p.json
  1478. 126.32 s > [2026-08-28 10:43:35.474] @import::model INFO : Loading JSON model scalars_2p_3p-default from /build/source/assets/models/json/scalars/scalars_2p_3p
  1479. 126.32 s > [2026-08-28 10:43:35.476] @gammaloop_api::se... INFO : Running command import graphs ./tests/resources/graphs/double_dotted_bubble_amp.dot
  1480. 126.32 s > [2026-08-28 10:43:35.476] @commands::import INFO : Loading graphs from '/build/source/tests/resources/graphs/double_dotted_bubble_amp.dot'
  1481. 126.32 s > [2026-08-28 10:43:35.479] @gammaloop_api::se... INFO : Running command generate
  1482. 126.32 s > [2026-08-28 10:43:35.590] @commands::generate INFO :
  1483. 126.32 s > Integrand generation summary
  1484. 126.32 s > peak RAM 63.70 MiB | cores 1
  1485. 126.32 s > ╭───────────┬──────────────────────────┬─────────┬────────────┬────────────┬────────────────┬─────────────╮
  1486. 126.32 s > │ integrand │ graph │ # evals │ expr build │ spenso │ symbolica eval │ compile │
  1487. 126.32 s > ├───────────┼──────────────────────────┼─────────┼────────────┼────────────┼────────────────┼─────────────┤
  1488. 126.32 s > │ default │ double_dotted_bubble_amp │ 11 │ 25ms (47%) │ 2ms (5.0%) │ 26ms (48%) │ 0ms (0.00%) │
  1489. 126.32 s > ├───────────┼──────────────────────────┼─────────┼────────────┼────────────┼────────────────┼─────────────┤
  1490. 126.32 s > │ Total │ │ 11 │ 25ms (47%) │ 2ms (5.0%) │ 26ms (48%) │ 0ms (0.00%) │
  1491. 126.32 s > ╰───────────┴──────────────────────────┴─────────┴────────────┴────────────┴────────────────┴─────────────╯
  1492. 126.32 s > [2026-08-28 10:43:35.591] @process::amplitude INFO : Input is above threshold: 1 existing threshold E-surfaces across 1/1 graph groups
  1493. 126.32 s > [2026-08-28 10:43:35.591] @process::amplitude INFO : overlap structure of group 0: [1: [1(1,4)]]
  1494. 126.32 s > Error:
  1495. 126.32 s > 0: IR profiling requested arbitrary precision but received a quad-precision result
  1496. 126.32 s >
  1497. 126.32 s > Location:
  1498. 126.32 s > crates/gammalooprs/src/integrands/process/ir.rs:2123
  1499. 126.32 s >
  1500. 126.32 s > ━━━━━━━━━━━━━━━━━━━━━━━━━━━━━━━━━━ BACKTRACE ━━━━━━━━━━━━━━━━━━━━━━━━━━━━━━━━━━━
  1501. 126.32 s > 1: <color_eyre[51793ea62743adbd]::config::EyreHook>::into_eyre_hook::{closure#0}<unknown>
  1502. 126.32 s > at <unknown source file>:<unknown line>
  1503. 126.32 s > 2: eyre[cb2fd339c0c40fca]::capture_handler<unknown>
  1504. 126.32 s > at <unknown source file>:<unknown line>
  1505. 126.32 s > 3: eyre[cb2fd339c0c40fca]::private::format_err<unknown>
  1506. 126.32 s > at <unknown source file>:<unknown line>
  1507. 126.32 s > 4: gammalooprs[d7a7c067ebd19583]::integrands::process::ir::evaluate_profile_momentum_point_arb::<gammalooprs[d7a7c067ebd19583]::integrands::process::amplitude::AmplitudeIntegrand><unknown>
  1508. 126.32 s > at <unknown source file>:<unknown line>
  1509. 126.32 s > 5: <gammalooprs[d7a7c067ebd19583]::integrands::process::amplitude::AmplitudeIntegrand>::test_single_ir_limit_impl<unknown>
  1510. 126.32 s > at <unknown source file>:<unknown line>
  1511. 126.32 s > 6: gammalooprs[d7a7c067ebd19583]::integrands::process::ir::run_ir_profile::<gammalooprs[d7a7c067ebd19583]::integrands::process::amplitude::AmplitudeIntegrand, <gammalooprs[d7a7c067ebd19583]::integrands::process::amplitude::AmplitudeIntegrand>::enumerate_ir_limits, <gammalooprs[d7a7c067ebd19583]::integrands::process::amplitude::AmplitudeIntegrand>::graph_cut_definitions, <gammalooprs[d7a7c067ebd19583]::integrands::process::amplitude::AmplitudeIntegrand>::test_single_ir_limit_impl><unknown>
  1512. 126.32 s > at <unknown source file>:<unknown line>
  1513. 126.32 s > 7: <gammalooprs[d7a7c067ebd19583]::integrands::process::amplitude::AmplitudeIntegrand>::test_ir<unknown>
  1514. 126.32 s > at <unknown source file>:<unknown line>
  1515. 126.32 s > 8: <gammaloop_api[92ae732909e47e14]::commands::profile::Profile>::run<unknown>
  1516. 126.32 s > at <unknown source file>:<unknown line>
  1517. 126.32 s > 9: test_runs[3e7a390caee4e338]::profile_bulk::double_dotted_bubble_amp_bulk_profile_passes<unknown>
  1518. 126.32 s > at <unknown source file>:<unknown line>
  1519. 126.32 s > 10: <test_runs[3e7a390caee4e338]::profile_bulk::double_dotted_bubble_amp_bulk_profile_passes::{closure#0} as core[940e698046960fd5]::ops::function::FnOnce<()>>::call_once<unknown>
  1520. 126.32 s > at <unknown source file>:<unknown line>
  1521. 126.32 s > 11: test[75d6903177b1d7e9]::__rust_begin_short_backtrace::<core[940e698046960fd5]::result::Result<(), alloc[2ea6bcb46fca0c42]::string::String>, fn() -> core[940e698046960fd5]::result::Result<(), alloc[2ea6bcb46fca0c42]::string::String>><unknown>
  1522. 126.32 s > at <unknown source file>:<unknown line>
  1523. 126.32 s > 12: test[75d6903177b1d7e9]::run_test::{closure#0}<unknown>
  1524. 126.32 s > at <unknown source file>:<unknown line>
  1525. 126.32 s > 13: std[bcb96dfbba0ab899]::sys::backtrace::__rust_begin_short_backtrace::<test[75d6903177b1d7e9]::run_test::{closure#1}, ()><unknown>
  1526. 126.32 s > at <unknown source file>:<unknown line>
  1527. 126.32 s > 14: <std[bcb96dfbba0ab899]::thread::lifecycle::spawn_unchecked<test[75d6903177b1d7e9]::run_test::{closure#1}, ()>::{closure#1} as core[940e698046960fd5]::ops::function::FnOnce<()>>::call_once::{shim:vtable#0}<unknown>
  1528. 126.32 s > at <unknown source file>:<unknown line>
  1529. 126.32 s > 15: <std[bcb96dfbba0ab899]::sys::thread::unix::Thread>::new::thread_start<unknown>
  1530. 126.32 s > at <unknown source file>:<unknown line>
  1531. 126.32 s > 16: start_thread<unknown>
  1532. 126.32 s > at <unknown source file>:<unknown line>
  1533. 126.32 s > 17: __clone3<unknown>
  1534. 126.32 s > at <unknown source file>:<unknown line>
  1535. 126.32 s >
  1536. 126.32 s > Run with COLORBT_SHOW_HIDDEN=1 environment variable to disable frame filtering.
  1537. 126.32 s > Run with RUST_BACKTRACE=full to include source snippets.
  1538. 126.32 s > Warning: SpanTrace capture is Unsupported.
  1539. 126.32 s > Ensure that you've setup a tracing-error ErrorLayer and the semver versions are compatible
  1540. 126.32 s >
  1541. 126.32 s > 3. gammaloop-integration-tests::test_runs::profile_bulk::dotted_bubble_amp_bulk_profile_passes
  1542. 126.32 s > failure: test failure with exit code 101
  1543. 126.32 s > Error:
  1544. 126.32 s > 0: IR profiling requested arbitrary precision but received a quad-precision result
  1545. 126.32 s >
  1546. 126.32 s > Location:
  1547. 126.32 s > crates/gammalooprs/src/integrands/process/ir.rs:2123
  1548. 126.32 s >
  1549. 126.32 s > ━━━━━━━━━━━━━━━━━━━━━━━━━━━━━━━━━━ BACKTRACE ━━━━━━━━━━━━━━━━━━━━━━━━━━━━━━━━━━━
  1550. 126.32 s > 1: <color_eyre[51793ea62743adbd]::config::EyreHook>::into_eyre_hook::{closure#0}<unknown>
  1551. 126.32 s > at <unknown source file>:<unknown line>
  1552. 126.32 s > 2: eyre[cb2fd339c0c40fca]::capture_handler<unknown>
  1553. 126.32 s > at <unknown source file>:<unknown line>
  1554. 126.32 s > 3: eyre[cb2fd339c0c40fca]::private::format_err<unknown>
  1555. 126.32 s > at <unknown source file>:<unknown line>
  1556. 126.32 s > 4: gammalooprs[d7a7c067ebd19583]::integrands::process::ir::evaluate_profile_momentum_point_arb::<gammalooprs[d7a7c067ebd19583]::integrands::process::amplitude::AmplitudeIntegrand><unknown>
  1557. 126.32 s > at <unknown source file>:<unknown line>
  1558. 126.32 s > 5: <gammalooprs[d7a7c067ebd19583]::integrands::process::amplitude::AmplitudeIntegrand>::test_single_ir_limit_impl<unknown>
  1559. 126.32 s > at <unknown source file>:<unknown line>
  1560. 126.32 s > 6: gammalooprs[d7a7c067ebd19583]::integrands::process::ir::run_ir_profile::<gammalooprs[d7a7c067ebd19583]::integrands::process::amplitude::AmplitudeIntegrand, <gammalooprs[d7a7c067ebd19583]::integrands::process::amplitude::AmplitudeIntegrand>::enumerate_ir_limits, <gammalooprs[d7a7c067ebd19583]::integrands::process::amplitude::AmplitudeIntegrand>::graph_cut_definitions, <gammalooprs[d7a7c067ebd19583]::integrands::process::amplitude::AmplitudeIntegrand>::test_single_ir_limit_impl><unknown>
  1561. 126.32 s > at <unknown source file>:<unknown line>
  1562. 126.32 s > 7: <gammalooprs[d7a7c067ebd19583]::integrands::process::amplitude::AmplitudeIntegrand>::test_ir<unknown>
  1563. 126.32 s > at <unknown source file>:<unknown line>
  1564. 126.32 s > 8: <gammaloop_api[92ae732909e47e14]::commands::profile::Profile>::run<unknown>
  1565. 126.32 s > at <unknown source file>:<unknown line>
  1566. 126.32 s > 9: test_runs[3e7a390caee4e338]::profile_bulk::dotted_bubble_amp_bulk_profile_passes<unknown>
  1567. 126.32 s > at <unknown source file>:<unknown line>
  1568. 126.32 s > 10: <test_runs[3e7a390caee4e338]::profile_bulk::dotted_bubble_amp_bulk_profile_passes::{closure#0} as core[940e698046960fd5]::ops::function::FnOnce<()>>::call_once<unknown>
  1569. 126.32 s > at <unknown source file>:<unknown line>
  1570. 126.32 s > 11: test[75d6903177b1d7e9]::__rust_begin_short_backtrace::<core[940e698046960fd5]::result::Result<(), alloc[2ea6bcb46fca0c42]::string::String>, fn() -> core[940e698046960fd5]::result::Result<(), alloc[2ea6bcb46fca0c42]::string::String>><unknown>
  1571. 126.32 s > at <unknown source file>:<unknown line>
  1572. 126.32 s > 12: test[75d6903177b1d7e9]::run_test::{closure#0}<unknown>
  1573. 126.32 s > at <unknown source file>:<unknown line>
  1574. 126.32 s > 13: std[bcb96dfbba0ab899]::sys::backtrace::__rust_begin_short_backtrace::<test[75d6903177b1d7e9]::run_test::{closure#1}, ()><unknown>
  1575. 126.32 s > at <unknown source file>:<unknown line>
  1576. 126.32 s > 14: <std[bcb96dfbba0ab899]::thread::lifecycle::spawn_unchecked<test[75d6903177b1d7e9]::run_test::{closure#1}, ()>::{closure#1} as core[940e698046960fd5]::ops::function::FnOnce<()>>::call_once::{shim:vtable#0}<unknown>
  1577. 126.32 s > at <unknown source file>:<unknown line>
  1578. 126.32 s > 15: <std[bcb96dfbba0ab899]::sys::thread::unix::Thread>::new::thread_start<unknown>
  1579. 126.32 s > at <unknown source file>:<unknown line>
  1580. 126.32 s > 16: start_thread<unknown>
  1581. 126.32 s > at <unknown source file>:<unknown line>
  1582. 126.32 s > 17: __clone3<unknown>
  1583. 126.32 s > at <unknown source file>:<unknown line>
  1584. 126.32 s >
  1585. 126.32 s > Run with COLORBT_SHOW_HIDDEN=1 environment variable to disable frame filtering.
  1586. 126.32 s > Run with RUST_BACKTRACE=full to include source snippets.
  1587. 126.32 s > Warning: SpanTrace capture is Unsupported.
  1588. 126.32 s > Ensure that you've setup a tracing-error ErrorLayer and the semver versions are compatible
  1589. 126.32 s > system-out
  1590. 126.32 s > running 1 test
  1591. 126.32 s > test profile_bulk::dotted_bubble_amp_bulk_profile_passes ... FAILED
  1592. 126.32 s >
  1593. 126.32 s > failures:
  1594. 126.32 s >
  1595. 126.32 s > failures:
  1596. 126.32 s > profile_bulk::dotted_bubble_amp_bulk_profile_passes
  1597. 126.32 s >
  1598. 126.32 s > test result: FAILED. 0 passed; 1 failed; 0 ignored; 0 measured; 82 filtered out; finished in 0.35s
  1599. 126.32 s > system-err
  1600. 126.32 s > [2026-08-28 10:43:35.513] @gammaloop_api::se... INFO : Running command import model ./assets/models/json/scalars/scalars_2p_3p.json
  1601. 126.32 s > [2026-08-28 10:43:35.513] @import::model INFO : Loading JSON model scalars_2p_3p-default from /build/source/assets/models/json/scalars/scalars_2p_3p
  1602. 126.32 s > [2026-08-28 10:43:35.514] @gammaloop_api::se... INFO : Running command import graphs ./tests/resources/graphs/dotted_bubble_amp.dot
  1603. 126.32 s > [2026-08-28 10:43:35.514] @commands::import INFO : Loading graphs from '/build/source/tests/resources/graphs/dotted_bubble_amp.dot'
  1604. 126.32 s > [2026-08-28 10:43:35.520] @gammaloop_api::se... INFO : Running command generate
  1605. 126.32 s > [2026-08-28 10:43:35.631] @commands::generate INFO :
  1606. 126.32 s > Integrand generation summary
  1607. 126.32 s > peak RAM 64.52 MiB | cores 1
  1608. 126.32 s > ╭───────────┬───────────────────┬─────────┬────────────┬────────────┬────────────────┬─────────────╮
  1609. 126.32 s > │ integrand │ graph │ # evals │ expr build │ spenso │ symbolica eval │ compile │
  1610. 126.32 s > ├───────────┼───────────────────┼─────────┼────────────┼────────────┼────────────────┼─────────────┤
  1611. 126.32 s > │ default │ dotted_bubble_amp │ 8 │ 19ms (65%) │ 1ms (3.9%) │ 9ms (31%) │ 0ms (0.00%) │
  1612. 126.32 s > ├───────────┼───────────────────┼─────────┼────────────┼────────────┼────────────────┼─────────────┤
  1613. 126.32 s > │ Total │ │ 8 │ 19ms (65%) │ 1ms (3.9%) │ 9ms (31%) │ 0ms (0.00%) │
  1614. 126.32 s > ╰───────────┴───────────────────┴─────────┴────────────┴────────────┴────────────────┴─────────────╯
  1615. 126.32 s > [2026-08-28 10:43:35.632] @process::amplitude INFO : Input is above threshold: 1 existing threshold E-surfaces across 1/1 graph groups
  1616. 126.32 s > [2026-08-28 10:43:35.632] @process::amplitude INFO : overlap structure of group 0: [1: [1(1,3)]]
  1617. 126.32 s > Error:
  1618. 126.32 s > 0: IR profiling requested arbitrary precision but received a quad-precision result
  1619. 126.32 s >
  1620. 126.32 s > Location:
  1621. 126.32 s > crates/gammalooprs/src/integrands/process/ir.rs:2123
  1622. 126.32 s >
  1623. 126.32 s > ━━━━━━━━━━━━━━━━━━━━━━━━━━━━━━━━━━ BACKTRACE ━━━━━━━━━━━━━━━━━━━━━━━━━━━━━━━━━━━
  1624. 126.32 s > 1: <color_eyre[51793ea62743adbd]::config::EyreHook>::into_eyre_hook::{closure#0}<unknown>
  1625. 126.32 s > at <unknown source file>:<unknown line>
  1626. 126.32 s > 2: eyre[cb2fd339c0c40fca]::capture_handler<unknown>
  1627. 126.32 s > at <unknown source file>:<unknown line>
  1628. 126.32 s > 3: eyre[cb2fd339c0c40fca]::private::format_err<unknown>
  1629. 126.32 s > at <unknown source file>:<unknown line>
  1630. 126.32 s > 4: gammalooprs[d7a7c067ebd19583]::integrands::process::ir::evaluate_profile_momentum_point_arb::<gammalooprs[d7a7c067ebd19583]::integrands::process::amplitude::AmplitudeIntegrand><unknown>
  1631. 126.32 s > at <unknown source file>:<unknown line>
  1632. 126.32 s > 5: <gammalooprs[d7a7c067ebd19583]::integrands::process::amplitude::AmplitudeIntegrand>::test_single_ir_limit_impl<unknown>
  1633. 126.32 s > at <unknown source file>:<unknown line>
  1634. 126.32 s > 6: gammalooprs[d7a7c067ebd19583]::integrands::process::ir::run_ir_profile::<gammalooprs[d7a7c067ebd19583]::integrands::process::amplitude::AmplitudeIntegrand, <gammalooprs[d7a7c067ebd19583]::integrands::process::amplitude::AmplitudeIntegrand>::enumerate_ir_limits, <gammalooprs[d7a7c067ebd19583]::integrands::process::amplitude::AmplitudeIntegrand>::graph_cut_definitions, <gammalooprs[d7a7c067ebd19583]::integrands::process::amplitude::AmplitudeIntegrand>::test_single_ir_limit_impl><unknown>
  1635. 126.32 s > at <unknown source file>:<unknown line>
  1636. 126.32 s > 7: <gammalooprs[d7a7c067ebd19583]::integrands::process::amplitude::AmplitudeIntegrand>::test_ir<unknown>
  1637. 126.32 s > at <unknown source file>:<unknown line>
  1638. 126.32 s > 8: <gammaloop_api[92ae732909e47e14]::commands::profile::Profile>::run<unknown>
  1639. 126.32 s > at <unknown source file>:<unknown line>
  1640. 126.32 s > 9: test_runs[3e7a390caee4e338]::profile_bulk::dotted_bubble_amp_bulk_profile_passes<unknown>
  1641. 126.32 s > at <unknown source file>:<unknown line>
  1642. 126.32 s > 10: <test_runs[3e7a390caee4e338]::profile_bulk::dotted_bubble_amp_bulk_profile_passes::{closure#0} as core[940e698046960fd5]::ops::function::FnOnce<()>>::call_once<unknown>
  1643. 126.32 s > at <unknown source file>:<unknown line>
  1644. 126.32 s > 11: test[75d6903177b1d7e9]::__rust_begin_short_backtrace::<core[940e698046960fd5]::result::Result<(), alloc[2ea6bcb46fca0c42]::string::String>, fn() -> core[940e698046960fd5]::result::Result<(), alloc[2ea6bcb46fca0c42]::string::String>><unknown>
  1645. 126.32 s > at <unknown source file>:<unknown line>
  1646. 126.32 s > 12: test[75d6903177b1d7e9]::run_test::{closure#0}<unknown>
  1647. 126.32 s > at <unknown source file>:<unknown line>
  1648. 126.32 s > 13: std[bcb96dfbba0ab899]::sys::backtrace::__rust_begin_short_backtrace::<test[75d6903177b1d7e9]::run_test::{closure#1}, ()><unknown>
  1649. 126.32 s > at <unknown source file>:<unknown line>
  1650. 126.32 s > 14: <std[bcb96dfbba0ab899]::thread::lifecycle::spawn_unchecked<test[75d6903177b1d7e9]::run_test::{closure#1}, ()>::{closure#1} as core[940e698046960fd5]::ops::function::FnOnce<()>>::call_once::{shim:vtable#0}<unknown>
  1651. 126.32 s > at <unknown source file>:<unknown line>
  1652. 126.32 s > 15: <std[bcb96dfbba0ab899]::sys::thread::unix::Thread>::new::thread_start<unknown>
  1653. 126.32 s > at <unknown source file>:<unknown line>
  1654. 126.32 s > 16: start_thread<unknown>
  1655. 126.32 s > at <unknown source file>:<unknown line>
  1656. 126.32 s > 17: __clone3<unknown>
  1657. 126.32 s > at <unknown source file>:<unknown line>
  1658. 126.32 s >
  1659. 126.32 s > Run with COLORBT_SHOW_HIDDEN=1 environment variable to disable frame filtering.
  1660. 126.32 s > Run with RUST_BACKTRACE=full to include source snippets.
  1661. 126.32 s > Warning: SpanTrace capture is Unsupported.
  1662. 126.32 s > Ensure that you've setup a tracing-error ErrorLayer and the semver versions are compatible
  1663. 126.32 s >
  1664. 126.32 s > 4. gammaloop-integration-tests::test_runs::profile_bulk::massless_triangle_bulk_profile_passes
  1665. 126.32 s > failure: test failure with exit code 101
  1666. 126.32 s > Error:
  1667. 126.32 s > 0: IR profiling requested arbitrary precision but received a quad-precision result
  1668. 126.32 s >
  1669. 126.32 s > Location:
  1670. 126.32 s > crates/gammalooprs/src/integrands/process/ir.rs:2123
  1671. 126.32 s >
  1672. 126.32 s > ━━━━━━━━━━━━━━━━━━━━━━━━━━━━━━━━━━ BACKTRACE ━━━━━━━━━━━━━━━━━━━━━━━━━━━━━━━━━━━
  1673. 126.32 s > 1: <color_eyre[51793ea62743adbd]::config::EyreHook>::into_eyre_hook::{closure#0}<unknown>
  1674. 126.32 s > at <unknown source file>:<unknown line>
  1675. 126.32 s > 2: eyre[cb2fd339c0c40fca]::capture_handler<unknown>
  1676. 126.32 s > at <unknown source file>:<unknown line>
  1677. 126.32 s > 3: eyre[cb2fd339c0c40fca]::private::format_err<unknown>
  1678. 126.32 s > at <unknown source file>:<unknown line>
  1679. 126.32 s > 4: gammalooprs[d7a7c067ebd19583]::integrands::process::ir::evaluate_profile_momentum_point_arb::<gammalooprs[d7a7c067ebd19583]::integrands::process::amplitude::AmplitudeIntegrand><unknown>
  1680. 126.32 s > at <unknown source file>:<unknown line>
  1681. 126.32 s > 5: <gammalooprs[d7a7c067ebd19583]::integrands::process::amplitude::AmplitudeIntegrand>::test_single_ir_limit_impl<unknown>
  1682. 126.32 s > at <unknown source file>:<unknown line>
  1683. 126.32 s > 6: gammalooprs[d7a7c067ebd19583]::integrands::process::ir::run_ir_profile::<gammalooprs[d7a7c067ebd19583]::integrands::process::amplitude::AmplitudeIntegrand, <gammalooprs[d7a7c067ebd19583]::integrands::process::amplitude::AmplitudeIntegrand>::enumerate_ir_limits, <gammalooprs[d7a7c067ebd19583]::integrands::process::amplitude::AmplitudeIntegrand>::graph_cut_definitions, <gammalooprs[d7a7c067ebd19583]::integrands::process::amplitude::AmplitudeIntegrand>::test_single_ir_limit_impl><unknown>
  1684. 126.32 s > at <unknown source file>:<unknown line>
  1685. 126.32 s > 7: <gammalooprs[d7a7c067ebd19583]::integrands::process::amplitude::AmplitudeIntegrand>::test_ir<unknown>
  1686. 126.32 s > at <unknown source file>:<unknown line>
  1687. 126.32 s > 8: <gammaloop_api[92ae732909e47e14]::commands::profile::Profile>::run<unknown>
  1688. 126.32 s > at <unknown source file>:<unknown line>
  1689. 126.32 s > 9: test_runs[3e7a390caee4e338]::profile_bulk::massless_triangle_bulk_profile_passes<unknown>
  1690. 126.32 s > at <unknown source file>:<unknown line>
  1691. 126.32 s > 10: <test_runs[3e7a390caee4e338]::profile_bulk::massless_triangle_bulk_profile_passes::{closure#0} as core[940e698046960fd5]::ops::function::FnOnce<()>>::call_once<unknown>
  1692. 126.32 s > at <unknown source file>:<unknown line>
  1693. 126.32 s > 11: test[75d6903177b1d7e9]::__rust_begin_short_backtrace::<core[940e698046960fd5]::result::Result<(), alloc[2ea6bcb46fca0c42]::string::String>, fn() -> core[940e698046960fd5]::result::Result<(), alloc[2ea6bcb46fca0c42]::string::String>><unknown>
  1694. 126.32 s > at <unknown source file>:<unknown line>
  1695. 126.32 s > 12: test[75d6903177b1d7e9]::run_test::{closure#0}<unknown>
  1696. 126.32 s > at <unknown source file>:<unknown line>
  1697. 126.32 s > 13: std[bcb96dfbba0ab899]::sys::backtrace::__rust_begin_short_backtrace::<test[75d6903177b1d7e9]::run_test::{closure#1}, ()><unknown>
  1698. 126.32 s > at <unknown source file>:<unknown line>
  1699. 126.32 s > 14: <std[bcb96dfbba0ab899]::thread::lifecycle::spawn_unchecked<test[75d6903177b1d7e9]::run_test::{closure#1}, ()>::{closure#1} as core[940e698046960fd5]::ops::function::FnOnce<()>>::call_once::{shim:vtable#0}<unknown>
  1700. 126.32 s > at <unknown source file>:<unknown line>
  1701. 126.32 s > 15: <std[bcb96dfbba0ab899]::sys::thread::unix::Thread>::new::thread_start<unknown>
  1702. 126.32 s > at <unknown source file>:<unknown line>
  1703. 126.32 s > 16: start_thread<unknown>
  1704. 126.32 s > at <unknown source file>:<unknown line>
  1705. 126.32 s > 17: __clone3<unknown>
  1706. 126.32 s > at <unknown source file>:<unknown line>
  1707. 126.32 s >
  1708. 126.32 s > Run with COLORBT_SHOW_HIDDEN=1 environment variable to disable frame filtering.
  1709. 126.32 s > Run with RUST_BACKTRACE=full to include source snippets.
  1710. 126.32 s > Warning: SpanTrace capture is Unsupported.
  1711. 126.32 s > Ensure that you've setup a tracing-error ErrorLayer and the semver versions are compatible
  1712. 126.32 s > system-out
  1713. 126.32 s > running 1 test
  1714. 126.32 s > test profile_bulk::massless_triangle_bulk_profile_passes ... FAILED
  1715. 126.32 s >
  1716. 126.32 s > failures:
  1717. 126.32 s >
  1718. 126.32 s > failures:
  1719. 126.32 s > profile_bulk::massless_triangle_bulk_profile_passes
  1720. 126.32 s >
  1721. 126.32 s > test result: FAILED. 0 passed; 1 failed; 0 ignored; 0 measured; 82 filtered out; finished in 0.27s
  1722. 126.32 s > system-err
  1723. 126.32 s > [2026-08-28 10:43:35.614] @gammaloop_api::se... INFO : Running command import model scalars
  1724. 126.32 s > [2026-08-28 10:43:35.614] @import::model INFO : Loading built-in JSON model scalars-default
  1725. 126.32 s > [2026-08-28 10:43:35.617] @gammalooprs::model INFO : The following 2 external parameters were forced to zero by the restriction card:
  1726. 126.32 s > width_scalar_1, width_scalar_2
  1727. 126.32 s > [2026-08-28 10:43:35.618] @gammaloop_api::se... INFO : Running command import graphs ./tests/resources/graphs/massless_triangle.dot
  1728. 126.32 s > [2026-08-28 10:43:35.618] @commands::import INFO : Loading graphs from '/build/source/tests/resources/graphs/massless_triangle.dot'
  1729. 126.32 s > [2026-08-28 10:43:35.621] @gammaloop_api::se... INFO : Running command generate
  1730. 126.32 s > [2026-08-28 10:43:35.744] @commands::generate INFO :
  1731. 126.32 s > Integrand generation summary
  1732. 126.32 s > peak RAM 66.09 MiB | cores 1
  1733. 126.32 s > ╭───────────┬─────────────────────┬─────────┬────────────┬────────────┬────────────────┬─────────────╮
  1734. 126.32 s > │ integrand │ graph │ # evals │ expr build │ spenso │ symbolica eval │ compile │
  1735. 126.32 s > ├───────────┼─────────────────────┼─────────┼────────────┼────────────┼────────────────┼─────────────┤
  1736. 126.32 s > │ default │ massless_triangle_0 │ 9 │ 26ms (70%) │ 3ms (8.9%) │ 8ms (21%) │ 0ms (0.00%) │
  1737. 126.32 s > ├───────────┼─────────────────────┼─────────┼────────────┼────────────┼────────────────┼─────────────┤
  1738. 126.32 s > │ Total │ │ 9 │ 26ms (70%) │ 3ms (8.9%) │ 8ms (21%) │ 0ms (0.00%) │
  1739. 126.32 s > ╰───────────┴─────────────────────┴─────────┴────────────┴────────────┴────────────────┴─────────────╯
  1740. 126.32 s > [2026-08-28 10:43:35.746] @process::amplitude INFO : Input is above threshold: 2 existing threshold E-surfaces across 1/1 graph groups
  1741. 126.32 s > [2026-08-28 10:43:35.746] @process::amplitude INFO : overlap structure of group 0: [2: [0(1,5), 1(1,3)]]
  1742. 126.32 s > Error:
  1743. 126.32 s > 0: IR profiling requested arbitrary precision but received a quad-precision result
  1744. 126.32 s >
  1745. 126.32 s > Location:
  1746. 126.32 s > crates/gammalooprs/src/integrands/process/ir.rs:2123
  1747. 126.32 s >
  1748. 126.32 s > ━━━━━━━━━━━━━━━━━━━━━━━━━━━━━━━━━━ BACKTRACE ━━━━━━━━━━━━━━━━━━━━━━━━━━━━━━━━━━━
  1749. 126.32 s > 1: <color_eyre[51793ea62743adbd]::config::EyreHook>::into_eyre_hook::{closure#0}<unknown>
  1750. 126.32 s > at <unknown source file>:<unknown line>
  1751. 126.32 s > 2: eyre[cb2fd339c0c40fca]::capture_handler<unknown>
  1752. 126.32 s > at <unknown source file>:<unknown line>
  1753. 126.32 s > 3: eyre[cb2fd339c0c40fca]::private::format_err<unknown>
  1754. 126.32 s > at <unknown source file>:<unknown line>
  1755. 126.32 s > 4: gammalooprs[d7a7c067ebd19583]::integrands::process::ir::evaluate_profile_momentum_point_arb::<gammalooprs[d7a7c067ebd19583]::integrands::process::amplitude::AmplitudeIntegrand><unknown>
  1756. 126.32 s > at <unknown source file>:<unknown line>
  1757. 126.32 s > 5: <gammalooprs[d7a7c067ebd19583]::integrands::process::amplitude::AmplitudeIntegrand>::test_single_ir_limit_impl<unknown>
  1758. 126.32 s > at <unknown source file>:<unknown line>
  1759. 126.32 s > 6: gammalooprs[d7a7c067ebd19583]::integrands::process::ir::run_ir_profile::<gammalooprs[d7a7c067ebd19583]::integrands::process::amplitude::AmplitudeIntegrand, <gammalooprs[d7a7c067ebd19583]::integrands::process::amplitude::AmplitudeIntegrand>::enumerate_ir_limits, <gammalooprs[d7a7c067ebd19583]::integrands::process::amplitude::AmplitudeIntegrand>::graph_cut_definitions, <gammalooprs[d7a7c067ebd19583]::integrands::process::amplitude::AmplitudeIntegrand>::test_single_ir_limit_impl><unknown>
  1760. 126.32 s > at <unknown source file>:<unknown line>
  1761. 126.32 s > 7: <gammalooprs[d7a7c067ebd19583]::integrands::process::amplitude::AmplitudeIntegrand>::test_ir<unknown>
  1762. 126.32 s > at <unknown source file>:<unknown line>
  1763. 126.32 s > 8: <gammaloop_api[92ae732909e47e14]::commands::profile::Profile>::run<unknown>
  1764. 126.32 s > at <unknown source file>:<unknown line>
  1765. 126.32 s > 9: test_runs[3e7a390caee4e338]::profile_bulk::massless_triangle_bulk_profile_passes<unknown>
  1766. 126.32 s > at <unknown source file>:<unknown line>
  1767. 126.32 s > 10: <test_runs[3e7a390caee4e338]::profile_bulk::massless_triangle_bulk_profile_passes::{closure#0} as core[940e698046960fd5]::ops::function::FnOnce<()>>::call_once<unknown>
  1768. 126.32 s > at <unknown source file>:<unknown line>
  1769. 126.32 s > 11: test[75d6903177b1d7e9]::__rust_begin_short_backtrace::<core[940e698046960fd5]::result::Result<(), alloc[2ea6bcb46fca0c42]::string::String>, fn() -> core[940e698046960fd5]::result::Result<(), alloc[2ea6bcb46fca0c42]::string::String>><unknown>
  1770. 126.32 s > at <unknown source file>:<unknown line>
  1771. 126.32 s > 12: test[75d6903177b1d7e9]::run_test::{closure#0}<unknown>
  1772. 126.32 s > at <unknown source file>:<unknown line>
  1773. 126.32 s > 13: std[bcb96dfbba0ab899]::sys::backtrace::__rust_begin_short_backtrace::<test[75d6903177b1d7e9]::run_test::{closure#1}, ()><unknown>
  1774. 126.32 s > at <unknown source file>:<unknown line>
  1775. 126.32 s > 14: <std[bcb96dfbba0ab899]::thread::lifecycle::spawn_unchecked<test[75d6903177b1d7e9]::run_test::{closure#1}, ()>::{closure#1} as core[940e698046960fd5]::ops::function::FnOnce<()>>::call_once::{shim:vtable#0}<unknown>
  1776. 126.32 s > at <unknown source file>:<unknown line>
  1777. 126.32 s > 15: <std[bcb96dfbba0ab899]::sys::thread::unix::Thread>::new::thread_start<unknown>
  1778. 126.32 s > at <unknown source file>:<unknown line>
  1779. 126.32 s > 16: start_thread<unknown>
  1780. 126.32 s > at <unknown source file>:<unknown line>
  1781. 126.32 s > 17: __clone3<unknown>
  1782. 126.32 s > at <unknown source file>:<unknown line>
  1783. 126.32 s >
  1784. 126.32 s > Run with COLORBT_SHOW_HIDDEN=1 environment variable to disable frame filtering.
  1785. 126.32 s > Run with RUST_BACKTRACE=full to include source snippets.
  1786. 126.32 s > Warning: SpanTrace capture is Unsupported.
  1787. 126.32 s > Ensure that you've setup a tracing-error ErrorLayer and the semver versions are compatible
  1788. 126.32 s >
  1789. 126.32 s > 5. gammaloop-integration-tests::test_runs::profile_bulk::box_4e_bulk_profile_passes
  1790. 126.32 s > failure: test failure with exit code 101
  1791. 126.32 s > Error:
  1792. 126.32 s > 0: IR profiling requested arbitrary precision but received a quad-precision result
  1793. 126.32 s >
  1794. 126.32 s > Location:
  1795. 126.32 s > crates/gammalooprs/src/integrands/process/ir.rs:2123
  1796. 126.32 s >
  1797. 126.32 s > ━━━━━━━━━━━━━━━━━━━━━━━━━━━━━━━━━━ BACKTRACE ━━━━━━━━━━━━━━━━━━━━━━━━━━━━━━━━━━━
  1798. 126.32 s > 1: <color_eyre[51793ea62743adbd]::config::EyreHook>::into_eyre_hook::{closure#0}<unknown>
  1799. 126.32 s > at <unknown source file>:<unknown line>
  1800. 126.32 s > 2: eyre[cb2fd339c0c40fca]::capture_handler<unknown>
  1801. 126.32 s > at <unknown source file>:<unknown line>
  1802. 126.32 s > 3: eyre[cb2fd339c0c40fca]::private::format_err<unknown>
  1803. 126.32 s > at <unknown source file>:<unknown line>
  1804. 126.32 s > 4: gammalooprs[d7a7c067ebd19583]::integrands::process::ir::evaluate_profile_momentum_point_arb::<gammalooprs[d7a7c067ebd19583]::integrands::process::amplitude::AmplitudeIntegrand><unknown>
  1805. 126.32 s > at <unknown source file>:<unknown line>
  1806. 126.32 s > 5: <gammalooprs[d7a7c067ebd19583]::integrands::process::amplitude::AmplitudeIntegrand>::test_single_ir_limit_impl<unknown>
  1807. 126.32 s > at <unknown source file>:<unknown line>
  1808. 126.32 s > 6: gammalooprs[d7a7c067ebd19583]::integrands::process::ir::run_ir_profile::<gammalooprs[d7a7c067ebd19583]::integrands::process::amplitude::AmplitudeIntegrand, <gammalooprs[d7a7c067ebd19583]::integrands::process::amplitude::AmplitudeIntegrand>::enumerate_ir_limits, <gammalooprs[d7a7c067ebd19583]::integrands::process::amplitude::AmplitudeIntegrand>::graph_cut_definitions, <gammalooprs[d7a7c067ebd19583]::integrands::process::amplitude::AmplitudeIntegrand>::test_single_ir_limit_impl><unknown>
  1809. 126.32 s > at <unknown source file>:<unknown line>
  1810. 126.32 s > 7: <gammalooprs[d7a7c067ebd19583]::integrands::process::amplitude::AmplitudeIntegrand>::test_ir<unknown>
  1811. 126.32 s > at <unknown source file>:<unknown line>
  1812. 126.32 s > 8: <gammaloop_api[92ae732909e47e14]::commands::profile::Profile>::run<unknown>
  1813. 126.32 s > at <unknown source file>:<unknown line>
  1814. 126.32 s > 9: test_runs[3e7a390caee4e338]::profile_bulk::box_4e_bulk_profile_passes<unknown>
  1815. 126.32 s > at <unknown source file>:<unknown line>
  1816. 126.32 s > 10: <test_runs[3e7a390caee4e338]::profile_bulk::box_4e_bulk_profile_passes::{closure#0} as core[940e698046960fd5]::ops::function::FnOnce<()>>::call_once<unknown>
  1817. 126.32 s > at <unknown source file>:<unknown line>
  1818. 126.32 s > 11: test[75d6903177b1d7e9]::__rust_begin_short_backtrace::<core[940e698046960fd5]::result::Result<(), alloc[2ea6bcb46fca0c42]::string::String>, fn() -> core[940e698046960fd5]::result::Result<(), alloc[2ea6bcb46fca0c42]::string::String>><unknown>
  1819. 126.32 s > at <unknown source file>:<unknown line>
  1820. 126.32 s > 12: test[75d6903177b1d7e9]::run_test::{closure#0}<unknown>
  1821. 126.32 s > at <unknown source file>:<unknown line>
  1822. 126.32 s > 13: std[bcb96dfbba0ab899]::sys::backtrace::__rust_begin_short_backtrace::<test[75d6903177b1d7e9]::run_test::{closure#1}, ()><unknown>
  1823. 126.32 s > at <unknown source file>:<unknown line>
  1824. 126.32 s > 14: <std[bcb96dfbba0ab899]::thread::lifecycle::spawn_unchecked<test[75d6903177b1d7e9]::run_test::{closure#1}, ()>::{closure#1} as core[940e698046960fd5]::ops::function::FnOnce<()>>::call_once::{shim:vtable#0}<unknown>
  1825. 126.32 s > at <unknown source file>:<unknown line>
  1826. 126.32 s > 15: <std[bcb96dfbba0ab899]::sys::thread::unix::Thread>::new::thread_start<unknown>
  1827. 126.32 s > at <unknown source file>:<unknown line>
  1828. 126.32 s > 16: start_thread<unknown>
  1829. 126.32 s > at <unknown source file>:<unknown line>
  1830. 126.32 s > 17: __clone3<unknown>
  1831. 126.32 s > at <unknown source file>:<unknown line>
  1832. 126.32 s >
  1833. 126.32 s > Run with COLORBT_SHOW_HIDDEN=1 environment variable to disable frame filtering.
  1834. 126.32 s > Run with RUST_BACKTRACE=full to include source snippets.
  1835. 126.32 s > Warning: SpanTrace capture is Unsupported.
  1836. 126.32 s > Ensure that you've setup a tracing-error ErrorLayer and the semver versions are compatible
  1837. 126.32 s > system-out
  1838. 126.32 s > running 1 test
  1839. 126.32 s > test profile_bulk::box_4e_bulk_profile_passes ... FAILED
  1840. 126.32 s >
  1841. 126.32 s > failures:
  1842. 126.32 s >
  1843. 126.32 s > failures:
  1844. 126.32 s > profile_bulk::box_4e_bulk_profile_passes
  1845. 126.32 s >
  1846. 126.32 s > test result: FAILED. 0 passed; 1 failed; 0 ignored; 0 measured; 82 filtered out; finished in 0.59s
  1847. 126.32 s > system-err
  1848. 126.32 s > [2026-08-28 10:43:35.482] @gammaloop_api::se... INFO : Running command import model ./assets/models/json/scalars/scalars.json
  1849. 126.32 s > [2026-08-28 10:43:35.482] @import::model INFO : Loading JSON model scalars-default from /build/source/assets/models/json/scalars/scalars
  1850. 126.32 s > [2026-08-28 10:43:35.486] @gammalooprs::model INFO : The following 2 external parameters were forced to zero by the restriction card:
  1851. 126.32 s > width_scalar_1, width_scalar_2
  1852. 126.32 s > [2026-08-28 10:43:35.487] @gammaloop_api::se... INFO : Running command import graphs ./tests/resources/graphs/massless_box.dot
  1853. 126.32 s > [2026-08-28 10:43:35.487] @commands::import INFO : Loading graphs from '/build/source/tests/resources/graphs/massless_box.dot'
  1854. 126.32 s > [2026-08-28 10:43:35.492] @gammaloop_api::se... INFO : Running command generate
  1855. 126.32 s > [2026-08-28 10:43:35.823] @commands::generate INFO :
  1856. 126.32 s > Integrand generation summary
  1857. 126.32 s > peak RAM 68.23 MiB | cores 1
  1858. 126.32 s > ╭───────────┬────────────────┬─────────┬─────────────┬────────────┬────────────────┬─────────────╮
  1859. 126.32 s > │ integrand │ graph │ # evals │ expr build │ spenso │ symbolica eval │ compile │
  1860. 126.32 s > ├───────────┼────────────────┼─────────┼─────────────┼────────────┼────────────────┼─────────────┤
  1861. 126.32 s > │ default │ massless_box_0 │ 14 │ 181ms (82%) │ 25ms (12%) │ 14ms (6.4%) │ 0ms (0.00%) │
  1862. 126.32 s > ├───────────┼────────────────┼─────────┼─────────────┼────────────┼────────────────┼─────────────┤
  1863. 126.32 s > │ Total │ │ 14 │ 181ms (82%) │ 25ms (12%) │ 14ms (6.4%) │ 0ms (0.00%) │
  1864. 126.32 s > ╰───────────┴────────────────┴─────────┴─────────────┴────────────┴────────────────┴─────────────╯
  1865. 126.32 s > [2026-08-28 10:43:35.825] @process::amplitude INFO : Input is above threshold: 4 existing threshold E-surfaces across 1/1 graph groups
  1866. 126.32 s > [2026-08-28 10:43:35.830] @process::amplitude INFO : overlap structure of group 0: [2: [9(3,5), 11(5,6)], 2: [4(3,4), 9(3,5)], 2: [4(3,4), 8(4,6)], 2: [8(4,6), 11(5,6)]]
  1867. 126.32 s > Error:
  1868. 126.32 s > 0: IR profiling requested arbitrary precision but received a quad-precision result
  1869. 126.32 s >
  1870. 126.32 s > Location:
  1871. 126.32 s > crates/gammalooprs/src/integrands/process/ir.rs:2123
  1872. 126.32 s >
  1873. 126.32 s > ━━━━━━━━━━━━━━━━━━━━━━━━━━━━━━━━━━ BACKTRACE ━━━━━━━━━━━━━━━━━━━━━━━━━━━━━━━━━━━
  1874. 126.32 s > 1: <color_eyre[51793ea62743adbd]::config::EyreHook>::into_eyre_hook::{closure#0}<unknown>
  1875. 126.32 s > at <unknown source file>:<unknown line>
  1876. 126.32 s > 2: eyre[cb2fd339c0c40fca]::capture_handler<unknown>
  1877. 126.32 s > at <unknown source file>:<unknown line>
  1878. 126.32 s > 3: eyre[cb2fd339c0c40fca]::private::format_err<unknown>
  1879. 126.32 s > at <unknown source file>:<unknown line>
  1880. 126.32 s > 4: gammalooprs[d7a7c067ebd19583]::integrands::process::ir::evaluate_profile_momentum_point_arb::<gammalooprs[d7a7c067ebd19583]::integrands::process::amplitude::AmplitudeIntegrand><unknown>
  1881. 126.32 s > at <unknown source file>:<unknown line>
  1882. 126.32 s > 5: <gammalooprs[d7a7c067ebd19583]::integrands::process::amplitude::AmplitudeIntegrand>::test_single_ir_limit_impl<unknown>
  1883. 126.32 s > at <unknown source file>:<unknown line>
  1884. 126.32 s > 6: gammalooprs[d7a7c067ebd19583]::integrands::process::ir::run_ir_profile::<gammalooprs[d7a7c067ebd19583]::integrands::process::amplitude::AmplitudeIntegrand, <gammalooprs[d7a7c067ebd19583]::integrands::process::amplitude::AmplitudeIntegrand>::enumerate_ir_limits, <gammalooprs[d7a7c067ebd19583]::integrands::process::amplitude::AmplitudeIntegrand>::graph_cut_definitions, <gammalooprs[d7a7c067ebd19583]::integrands::process::amplitude::AmplitudeIntegrand>::test_single_ir_limit_impl><unknown>
  1885. 126.32 s > at <unknown source file>:<unknown line>
  1886. 126.32 s > 7: <gammalooprs[d7a7c067ebd19583]::integrands::process::amplitude::AmplitudeIntegrand>::test_ir<unknown>
  1887. 126.32 s > at <unknown source file>:<unknown line>
  1888. 126.32 s > 8: <gammaloop_api[92ae732909e47e14]::commands::profile::Profile>::run<unknown>
  1889. 126.32 s > at <unknown source file>:<unknown line>
  1890. 126.32 s > 9: test_runs[3e7a390caee4e338]::profile_bulk::box_4e_bulk_profile_passes<unknown>
  1891. 126.32 s > at <unknown source file>:<unknown line>
  1892. 126.32 s > 10: <test_runs[3e7a390caee4e338]::profile_bulk::box_4e_bulk_profile_passes::{closure#0} as core[940e698046960fd5]::ops::function::FnOnce<()>>::call_once<unknown>
  1893. 126.32 s > at <unknown source file>:<unknown line>
  1894. 126.32 s > 11: test[75d6903177b1d7e9]::__rust_begin_short_backtrace::<core[940e698046960fd5]::result::Result<(), alloc[2ea6bcb46fca0c42]::string::String>, fn() -> core[940e698046960fd5]::result::Result<(), alloc[2ea6bcb46fca0c42]::string::String>><unknown>
  1895. 126.32 s > at <unknown source file>:<unknown line>
  1896. 126.32 s > 12: test[75d6903177b1d7e9]::run_test::{closure#0}<unknown>
  1897. 126.32 s > at <unknown source file>:<unknown line>
  1898. 126.32 s > 13: std[bcb96dfbba0ab899]::sys::backtrace::__rust_begin_short_backtrace::<test[75d6903177b1d7e9]::run_test::{closure#1}, ()><unknown>
  1899. 126.32 s > at <unknown source file>:<unknown line>
  1900. 126.32 s > 14: <std[bcb96dfbba0ab899]::thread::lifecycle::spawn_unchecked<test[75d6903177b1d7e9]::run_test::{closure#1}, ()>::{closure#1} as core[940e698046960fd5]::ops::function::FnOnce<()>>::call_once::{shim:vtable#0}<unknown>
  1901. 126.32 s > at <unknown source file>:<unknown line>
  1902. 126.32 s > 15: <std[bcb96dfbba0ab899]::sys::thread::unix::Thread>::new::thread_start<unknown>
  1903. 126.32 s > at <unknown source file>:<unknown line>
  1904. 126.32 s > 16: start_thread<unknown>
  1905. 126.32 s > at <unknown source file>:<unknown line>
  1906. 126.32 s > 17: __clone3<unknown>
  1907. 126.32 s > at <unknown source file>:<unknown line>
  1908. 126.32 s >
  1909. 126.32 s > Run with COLORBT_SHOW_HIDDEN=1 environment variable to disable frame filtering.
  1910. 126.32 s > Run with RUST_BACKTRACE=full to include source snippets.
  1911. 126.32 s > Warning: SpanTrace capture is Unsupported.
  1912. 126.32 s > Ensure that you've setup a tracing-error ErrorLayer and the semver versions are compatible
  1913. 126.32 s >
  1914. 126.32 s > 6. gammaloop-integration-tests::test_runs::profile_bulk::scalar_self_energy_amp_bulk_profile_passes
  1915. 126.32 s > failure: test failure with exit code 101
  1916. 126.32 s > Error:
  1917. 126.32 s > 0: IR profiling requested arbitrary precision but received a quad-precision result
  1918. 126.32 s >
  1919. 126.32 s > Location:
  1920. 126.32 s > crates/gammalooprs/src/integrands/process/ir.rs:2123
  1921. 126.32 s >
  1922. 126.32 s > ━━━━━━━━━━━━━━━━━━━━━━━━━━━━━━━━━━ BACKTRACE ━━━━━━━━━━━━━━━━━━━━━━━━━━━━━━━━━━━
  1923. 126.32 s > 1: <color_eyre[51793ea62743adbd]::config::EyreHook>::into_eyre_hook::{closure#0}<unknown>
  1924. 126.32 s > at <unknown source file>:<unknown line>
  1925. 126.32 s > 2: eyre[cb2fd339c0c40fca]::capture_handler<unknown>
  1926. 126.32 s > at <unknown source file>:<unknown line>
  1927. 126.32 s > 3: eyre[cb2fd339c0c40fca]::private::format_err<unknown>
  1928. 126.32 s > at <unknown source file>:<unknown line>
  1929. 126.32 s > 4: gammalooprs[d7a7c067ebd19583]::integrands::process::ir::evaluate_profile_momentum_point_arb::<gammalooprs[d7a7c067ebd19583]::integrands::process::amplitude::AmplitudeIntegrand><unknown>
  1930. 126.32 s > at <unknown source file>:<unknown line>
  1931. 126.32 s > 5: <gammalooprs[d7a7c067ebd19583]::integrands::process::amplitude::AmplitudeIntegrand>::test_single_ir_limit_impl<unknown>
  1932. 126.32 s > at <unknown source file>:<unknown line>
  1933. 126.32 s > 6: gammalooprs[d7a7c067ebd19583]::integrands::process::ir::run_ir_profile::<gammalooprs[d7a7c067ebd19583]::integrands::process::amplitude::AmplitudeIntegrand, <gammalooprs[d7a7c067ebd19583]::integrands::process::amplitude::AmplitudeIntegrand>::enumerate_ir_limits, <gammalooprs[d7a7c067ebd19583]::integrands::process::amplitude::AmplitudeIntegrand>::graph_cut_definitions, <gammalooprs[d7a7c067ebd19583]::integrands::process::amplitude::AmplitudeIntegrand>::test_single_ir_limit_impl><unknown>
  1934. 126.32 s > at <unknown source file>:<unknown line>
  1935. 126.32 s > 7: <gammalooprs[d7a7c067ebd19583]::integrands::process::amplitude::AmplitudeIntegrand>::test_ir<unknown>
  1936. 126.32 s > at <unknown source file>:<unknown line>
  1937. 126.32 s > 8: <gammaloop_api[92ae732909e47e14]::commands::profile::Profile>::run<unknown>
  1938. 126.32 s > at <unknown source file>:<unknown line>
  1939. 126.32 s > 9: test_runs[3e7a390caee4e338]::profile_bulk::scalar_self_energy_amp_bulk_profile_passes<unknown>
  1940. 126.32 s > at <unknown source file>:<unknown line>
  1941. 126.32 s > 10: <test_runs[3e7a390caee4e338]::profile_bulk::scalar_self_energy_amp_bulk_profile_passes::{closure#0} as core[940e698046960fd5]::ops::function::FnOnce<()>>::call_once<unknown>
  1942. 126.32 s > at <unknown source file>:<unknown line>
  1943. 126.32 s > 11: test[75d6903177b1d7e9]::__rust_begin_short_backtrace::<core[940e698046960fd5]::result::Result<(), alloc[2ea6bcb46fca0c42]::string::String>, fn() -> core[940e698046960fd5]::result::Result<(), alloc[2ea6bcb46fca0c42]::string::String>><unknown>
  1944. 126.32 s > at <unknown source file>:<unknown line>
  1945. 126.32 s > 12: test[75d6903177b1d7e9]::run_test::{closure#0}<unknown>
  1946. 126.32 s > at <unknown source file>:<unknown line>
  1947. 126.32 s > 13: std[bcb96dfbba0ab899]::sys::backtrace::__rust_begin_short_backtrace::<test[75d6903177b1d7e9]::run_test::{closure#1}, ()><unknown>
  1948. 126.32 s > at <unknown source file>:<unknown line>
  1949. 126.32 s > 14: <std[bcb96dfbba0ab899]::thread::lifecycle::spawn_unchecked<test[75d6903177b1d7e9]::run_test::{closure#1}, ()>::{closure#1} as core[940e698046960fd5]::ops::function::FnOnce<()>>::call_once::{shim:vtable#0}<unknown>
  1950. 126.32 s > at <unknown source file>:<unknown line>
  1951. 126.32 s > 15: <std[bcb96dfbba0ab899]::sys::thread::unix::Thread>::new::thread_start<unknown>
  1952. 126.32 s > at <unknown source file>:<unknown line>
  1953. 126.32 s > 16: start_thread<unknown>
  1954. 126.32 s > at <unknown source file>:<unknown line>
  1955. 126.32 s > 17: __clone3<unknown>
  1956. 126.32 s > at <unknown source file>:<unknown line>
  1957. 126.32 s >
  1958. 126.32 s > Run with COLORBT_SHOW_HIDDEN=1 environment variable to disable frame filtering.
  1959. 126.32 s > Run with RUST_BACKTRACE=full to include source snippets.
  1960. 126.32 s > Warning: SpanTrace capture is Unsupported.
  1961. 126.32 s > Ensure that you've setup a tracing-error ErrorLayer and the semver versions are compatible
  1962. 126.32 s > system-out
  1963. 126.32 s > running 1 test
  1964. 126.32 s > test profile_bulk::scalar_self_energy_amp_bulk_profile_passes ... FAILED
  1965. 126.32 s >
  1966. 126.32 s > failures:
  1967. 126.32 s >
  1968. 126.32 s > failures:
  1969. 126.32 s > profile_bulk::scalar_self_energy_amp_bulk_profile_passes
  1970. 126.32 s >
  1971. 126.32 s > test result: FAILED. 0 passed; 1 failed; 0 ignored; 0 measured; 82 filtered out; finished in 0.59s
  1972. 126.32 s > system-err
  1973. 126.32 s > [2026-08-28 10:43:35.730] @gammaloop_api::se... INFO : Running command import model ./assets/models/json/scalars/scalars.json
  1974. 126.32 s > [2026-08-28 10:43:35.730] @import::model INFO : Loading JSON model scalars-default from /build/source/assets/models/json/scalars/scalars
  1975. 126.32 s > [2026-08-28 10:43:35.737] @gammalooprs::model INFO : The following 2 external parameters were forced to zero by the restriction card:
  1976. 126.32 s > width_scalar_1, width_scalar_2
  1977. 126.32 s > [2026-08-28 10:43:35.738] @gammaloop_api::se... INFO : Running command import graphs ./tests/resources/graphs/scalar_self_energy_amp.dot
  1978. 126.32 s > [2026-08-28 10:43:35.738] @commands::import INFO : Loading graphs from '/build/source/tests/resources/graphs/scalar_self_energy_amp.dot'
  1979. 126.32 s > [2026-08-28 10:43:35.745] @gammaloop_api::se... INFO : Running command generate
  1980. 126.32 s > [2026-08-28 10:43:36.192] @commands::generate INFO :
  1981. 126.32 s > Integrand generation summary
  1982. 126.32 s > peak RAM 72.38 MiB | cores 1
  1983. 126.32 s > ╭───────────┬────────────────────────┬─────────┬─────────────┬─────────────┬────────────────┬─────────────╮
  1984. 126.32 s > │ integrand │ graph │ # evals │ expr build │ spenso │ symbolica eval │ compile │
  1985. 126.32 s > ├───────────┼────────────────────────┼─────────┼─────────────┼─────────────┼────────────────┼─────────────┤
  1986. 126.32 s > │ default │ scalar_self_energy_amp │ 6 │ 308ms (94%) │ 11ms (3.6%) │ 7ms (2.4%) │ 0ms (0.00%) │
  1987. 126.32 s > ├───────────┼────────────────────────┼─────────┼─────────────┼─────────────┼────────────────┼─────────────┤
  1988. 126.32 s > │ Total │ │ 6 │ 308ms (94%) │ 11ms (3.6%) │ 7ms (2.4%) │ 0ms (0.00%) │
  1989. 126.32 s > ╰───────────┴────────────────────────┴─────────┴─────────────┴─────────────┴────────────────┴─────────────╯
  1990. 126.32 s > [2026-08-28 10:43:36.194] @process::amplitude INFO : Input is above threshold: 2 existing threshold E-surfaces across 1/1 graph groups
  1991. 126.32 s > [2026-08-28 10:43:36.194] @process::amplitude INFO : overlap structure of group 0: [2: [2(1,5), 4(2,3,5)]]
  1992. 126.32 s > Error:
  1993. 126.32 s > 0: IR profiling requested arbitrary precision but received a quad-precision result
  1994. 126.32 s >
  1995. 126.32 s > Location:
  1996. 126.32 s > crates/gammalooprs/src/integrands/process/ir.rs:2123
  1997. 126.32 s >
  1998. 126.32 s > ━━━━━━━━━━━━━━━━━━━━━━━━━━━━━━━━━━ BACKTRACE ━━━━━━━━━━━━━━━━━━━━━━━━━━━━━━━━━━━
  1999. 126.32 s > 1: <color_eyre[51793ea62743adbd]::config::EyreHook>::into_eyre_hook::{closure#0}<unknown>
  2000. 126.32 s > at <unknown source file>:<unknown line>
  2001. 126.32 s > 2: eyre[cb2fd339c0c40fca]::capture_handler<unknown>
  2002. 126.32 s > at <unknown source file>:<unknown line>
  2003. 126.32 s > 3: eyre[cb2fd339c0c40fca]::private::format_err<unknown>
  2004. 126.32 s > at <unknown source file>:<unknown line>
  2005. 126.32 s > 4: gammalooprs[d7a7c067ebd19583]::integrands::process::ir::evaluate_profile_momentum_point_arb::<gammalooprs[d7a7c067ebd19583]::integrands::process::amplitude::AmplitudeIntegrand><unknown>
  2006. 126.32 s > at <unknown source file>:<unknown line>
  2007. 126.32 s > 5: <gammalooprs[d7a7c067ebd19583]::integrands::process::amplitude::AmplitudeIntegrand>::test_single_ir_limit_impl<unknown>
  2008. 126.32 s > at <unknown source file>:<unknown line>
  2009. 126.32 s > 6: gammalooprs[d7a7c067ebd19583]::integrands::process::ir::run_ir_profile::<gammalooprs[d7a7c067ebd19583]::integrands::process::amplitude::AmplitudeIntegrand, <gammalooprs[d7a7c067ebd19583]::integrands::process::amplitude::AmplitudeIntegrand>::enumerate_ir_limits, <gammalooprs[d7a7c067ebd19583]::integrands::process::amplitude::AmplitudeIntegrand>::graph_cut_definitions, <gammalooprs[d7a7c067ebd19583]::integrands::process::amplitude::AmplitudeIntegrand>::test_single_ir_limit_impl><unknown>
  2010. 126.32 s > at <unknown source file>:<unknown line>
  2011. 126.32 s > 7: <gammalooprs[d7a7c067ebd19583]::integrands::process::amplitude::AmplitudeIntegrand>::test_ir<unknown>
  2012. 126.32 s > at <unknown source file>:<unknown line>
  2013. 126.32 s > 8: <gammaloop_api[92ae732909e47e14]::commands::profile::Profile>::run<unknown>
  2014. 126.32 s > at <unknown source file>:<unknown line>
  2015. 126.32 s > 9: test_runs[3e7a390caee4e338]::profile_bulk::scalar_self_energy_amp_bulk_profile_passes<unknown>
  2016. 126.32 s > at <unknown source file>:<unknown line>
  2017. 126.32 s > 10: <test_runs[3e7a390caee4e338]::profile_bulk::scalar_self_energy_amp_bulk_profile_passes::{closure#0} as core[940e698046960fd5]::ops::function::FnOnce<()>>::call_once<unknown>
  2018. 126.32 s > at <unknown source file>:<unknown line>
  2019. 126.32 s > 11: test[75d6903177b1d7e9]::__rust_begin_short_backtrace::<core[940e698046960fd5]::result::Result<(), alloc[2ea6bcb46fca0c42]::string::String>, fn() -> core[940e698046960fd5]::result::Result<(), alloc[2ea6bcb46fca0c42]::string::String>><unknown>
  2020. 126.32 s > at <unknown source file>:<unknown line>
  2021. 126.32 s > 12: test[75d6903177b1d7e9]::run_test::{closure#0}<unknown>
  2022. 126.32 s > at <unknown source file>:<unknown line>
  2023. 126.32 s > 13: std[bcb96dfbba0ab899]::sys::backtrace::__rust_begin_short_backtrace::<test[75d6903177b1d7e9]::run_test::{closure#1}, ()><unknown>
  2024. 126.32 s > at <unknown source file>:<unknown line>
  2025. 126.32 s > 14: <std[bcb96dfbba0ab899]::thread::lifecycle::spawn_unchecked<test[75d6903177b1d7e9]::run_test::{closure#1}, ()>::{closure#1} as core[940e698046960fd5]::ops::function::FnOnce<()>>::call_once::{shim:vtable#0}<unknown>
  2026. 126.32 s > at <unknown source file>:<unknown line>
  2027. 126.32 s > 15: <std[bcb96dfbba0ab899]::sys::thread::unix::Thread>::new::thread_start<unknown>
  2028. 126.32 s > at <unknown source file>:<unknown line>
  2029. 126.32 s > 16: start_thread<unknown>
  2030. 126.32 s > at <unknown source file>:<unknown line>
  2031. 126.32 s > 17: __clone3<unknown>
  2032. 126.32 s > at <unknown source file>:<unknown line>
  2033. 126.32 s >
  2034. 126.32 s > Run with COLORBT_SHOW_HIDDEN=1 environment variable to disable frame filtering.
  2035. 126.32 s > Run with RUST_BACKTRACE=full to include source snippets.
  2036. 126.32 s > Warning: SpanTrace capture is Unsupported.
  2037. 126.32 s > Ensure that you've setup a tracing-error ErrorLayer and the semver versions are compatible
  2038. 126.32 s >
  2039. 126.32 s > 7. gammaloop-integration-tests::uv::dod2_bubble_uv
  2040. 126.32 s > failure: test failure with exit code 101
  2041. 126.32 s > system-out
  2042. 126.32 s > running 1 test
  2043. 126.32 s > +-------------+-----------------+---------+--------+----------+-----------------------------------------------------------------------------------------------------------------------+-------+
  2044. 126.32 s > | case | check | graph | status | sigma | threshold | error |
  2045. 126.32 s > +-------------+-----------------+---------+--------+----------+-----------------------------------------------------------------------------------------------------------------------+-------+
  2046. 126.32 s > | dod2_bubble | uv_profile | - | FAIL | - | - | - |
  2047. 126.32 s > +-------------+-----------------+---------+--------+----------+-----------------------------------------------------------------------------------------------------------------------+-------+
  2048. 126.32 s > | dod2_bubble | m_uv.inspect | inspect | pass | - | best inspect relative delta 1.000e0 >= 1000*accuracy 1.000e-7 (accuracy=1.000e-10, exponent=+8.0, seed=0, probes=10) | - |
  2049. 126.32 s > +-------------+-----------------+---------+--------+----------+-----------------------------------------------------------------------------------------------------------------------+-------+
  2050. 126.32 s > | dod2_bubble | m_uv.integrated | GL0 | pass | 0.0sigma | compatible within 2sigma | - |
  2051. 126.32 s > +-------------+-----------------+---------+--------+----------+-----------------------------------------------------------------------------------------------------------------------+-------+
  2052. 126.32 s > | dod2_bubble | rls.inspect | inspect | pass | - | best inspect relative delta 2.822e-3 >= 1000*accuracy 1.000e-7 (accuracy=1.000e-10, exponent=+2.0, seed=1, probes=10) | - |
  2053. 126.32 s > +-------------+-----------------+---------+--------+----------+-----------------------------------------------------------------------------------------------------------------------+-------+
  2054. 126.32 s > | dod2_bubble | rls.integrated | GL0 | pass | 0.0sigma | compatible within 2sigma | - |
  2055. 126.32 s > +-------------+-----------------+---------+--------+----------+-----------------------------------------------------------------------------------------------------------------------+-------+
  2056. 126.32 s > | dod2_bubble | mu_r.inspect | inspect | pass | - | best inspect relative delta 6.951e-1 >= 1000*accuracy 1.000e-7 (accuracy=1.000e-10, exponent=+0.0, seed=0, probes=10) | - |
  2057. 126.32 s > +-------------+-----------------+---------+--------+----------+-----------------------------------------------------------------------------------------------------------------------+-------+
  2058. 126.32 s > | dod2_bubble | target | - | pass | - | 2sigma | - |
  2059. 126.32 s > +-------------+-----------------+---------+--------+----------+-----------------------------------------------------------------------------------------------------------------------+-------+
  2060. 126.32 s > test dod2_bubble_uv ... FAILED
  2061. 126.32 s >
  2062. 126.32 s > failures:
  2063. 126.32 s >
  2064. 126.32 s > failures:
  2065. 126.32 s > dod2_bubble_uv
  2066. 126.32 s >
  2067. 126.32 s > test result: FAILED. 0 passed; 1 failed; 0 ignored; 0 measured; 24 filtered out; finished in 38.47s
  2068. 126.32 s > system-err
  2069. 126.32 s > [2026-08-28 10:43:37.462] @gammaloop_api::se... INFO : Running command run generate
  2070. 126.32 s > [2026-08-28 10:43:37.462] @gammaloop_api::se... INFO : Starting command block generate
  2071. 126.32 s > [2026-08-28 10:43:37.462] @gammaloop_api::se... INFO : Running command import model scalars-default.json
  2072. 126.32 s > [2026-08-28 10:43:37.462] @import::model INFO : Loading built-in JSON model scalars-default
  2073. 126.32 s > [2026-08-28 10:43:37.466] @gammalooprs::model INFO : The following 2 external parameters were forced to zero by the restriction card:
  2074. 126.32 s > width_scalar_1, width_scalar_2
  2075. 126.32 s > [2026-08-28 10:43:37.466] @gammaloop_api::se... INFO : Running command remove processes
  2076. 126.32 s > [2026-08-28 10:43:37.466] @gammaloop_api::se... INFO : Running command set global kv global.generation.uv.generate_integrated=true
  2077. 126.32 s > [2026-08-28 10:43:37.467] @gammaloop_api::se... INFO : Running command import graphs ./tests/resources/graphs/scalar/dod2_bubble.dot -p bubble_dod2 -i scalar_bubble_below_thres
  2078. 126.32 s > [2026-08-28 10:43:37.467] @commands::import INFO : Loading graphs from '/build/source/tests/resources/graphs/scalar/dod2_bubble.dot'
  2079. 126.32 s > [2026-08-28 10:43:37.469] @gammaloop_api::se... INFO : Running command generate existing -p bubble_dod2 -i scalar_bubble_below_thres
  2080. 126.32 s > [2026-08-28 10:43:37.470] @approx::local_4d [{#uv, #inspect, #integrated}] DEBUG : Rescaled momenta expanded
  2081. 126.32 s > field value
  2082. 126.32 s > res n-terms: 1, byte size: 3,expr:
  2083. 126.32 s > 1
  2084. 126.32 s > [2026-08-28 10:43:37.471] @approx::local_4d [{#uv, #inspect, #integrated}] DEBUG : Rescaled momenta expanded
  2085. 126.32 s > field value
  2086. 126.32 s > res n-terms: 1, byte size: 585,expr:
  2087. 126.32 s > -SCALAR_COUPLING²·q₀(αᵉ².¹)·q₀(αᵉ³.¹)·q₂(αᵉ².¹)·q₂(αᵉ³.¹)
  2088. 126.32 s > /(t²·denom(3,-q₀-q₂/t,mass_scalar_2²,-mass_scalar_2²+2·(q₀.q₂)/t+(q₂.q₂)/t²+(q₀.q₀))
  2089. 126.32 s > ·denom(2,q₂/t,mass_scalar_2²,-mass_scalar_2²+(q₂.q₂)/t²))
  2090. 126.32 s > [2026-08-28 10:43:37.479] @approx::final_integrand[{#generation, #profile, #uv, #graph, #summary}] DEBUG : Computed global numerator
  2091. 126.32 s > field value
  2092. 126.32 s > global_num n-terms: 1, byte size: 4,expr:
  2093. 126.32 s > 1/2
  2094. 126.32 s > span build_3d{span_context=true graph=GL0 current=subgraph=0, topo_order=0, dod=0}
  2095. 126.32 s > [2026-08-28 10:43:37.482] @uv::approx [{#generation, #uv, #fourd}] DEBUG : Computing 4D
  2096. 126.32 s > field value
  2097. 126.32 s > simple subgraph(S_11,S_y)*Approx(subgraph(S_y,0)) of GL0
  2098. 126.32 s > span compute_4d{span_context=true graph=GL0 current=subgraph=y, topo_order=1, dod=2 given=subgraph=0, topo_order=0, dod=0 reduced=SubSet { set: BitVec<usize, bitvec::order::Lsb0> { addr: 0x7fffec023490, head: 000000, bits: 6, capacity: 64 } [0, 0, 1, 1, 1, 1], id: PhantomData<linnet::half_edge::involution::Hedge> }}
  2099. 126.32 s > [2026-08-28 10:43:37.482] @approx::local_4d [{#uv, #algebra, #integrated, #start}] DEBUG :
  2100. 126.32 s > field value
  2101. 126.32 s > integrand n-terms: 1, byte size: 409,expr:
  2102. 126.32 s > SCALAR_COUPLING²·(q₀(αᵉ³.¹)+q₃(αᵉ³.¹))·q₀(αᵉ².¹)·q₀(αᵉ³.¹)·q₂(αᵉ².¹)
  2103. 126.32 s > /(denom(2,q₂,mass_scalar_2²,-mass_scalar_2²+(q₂.q₂))·denom(3,q₃,mass_scalar_2²,-mass_scalar_2²+(q₃.q₃)))
  2104. 126.32 s > reduced y
  2105. 126.32 s > span grow{span_context=true current=subgraph=y, topo_order=1, dod=2 given=subgraph=0, topo_order=0, dod=0}
  2106. 126.32 s > [2026-08-28 10:43:37.483] @approx::local_4d [{#uv, #inspect, #integrated}] DEBUG : Rescaled momenta expanded
  2107. 126.32 s > field value
  2108. 126.32 s > res n-terms: 1, byte size: 585,expr:
  2109. 126.32 s > -SCALAR_COUPLING²·q₀(αᵉ².¹)·q₀(αᵉ³.¹)·q₂(αᵉ².¹)·q₂(αᵉ³.¹)
  2110. 126.32 s > /(t²·denom(3,-q₀-q₂/t,mass_scalar_2²,-mass_scalar_2²+2·(q₀.q₂)/t+(q₂.q₂)/t²+(q₀.q₀))
  2111. 126.32 s > ·denom(2,q₂/t,mass_scalar_2²,-mass_scalar_2²+(q₂.q₂)/t²))
  2112. 126.32 s > span t{span_context=true current=subgraph=y, topo_order=1, dod=2 given=subgraph=0, topo_order=0, dod=0}
  2113. 126.32 s > [2026-08-28 10:43:37.483] @approx::local_4d [{#uv, #integrated, #rescaled}] DEBUG : Rescaled expanded
  2114. 126.32 s > field value
  2115. 126.32 s > n_loops 1
  2116. 126.32 s > res n-terms: 1, byte size: 707,expr:
  2117. 126.32 s > -SCALAR_COUPLING²·q₀(αᵉ².¹)·q₀(αᵉ³.¹)·q₂(αᵉ².¹)·q₂(αᵉ³.¹)
  2118. 126.32 s > /(t²·denom(3,-q₂,mUVexp²+t²·mass_scalar_2²,-mUV²+t²·(-mass_scalar_2²+2·(q₀.q₂)/t+(q₂.q₂)/t²+(q₀.q₀))+t²·mUVexp²)
  2119. 126.32 s > ·denom(2,q₂,mUVexp²+t²·mass_scalar_2²,-mUV²+t²·(-mass_scalar_2²+(q₂.q₂)/t²)+t²·mUVexp²))
  2120. 126.32 s > span t{span_context=true current=subgraph=y, topo_order=1, dod=2 given=subgraph=0, topo_order=0, dod=0}
  2121. 126.32 s > [2026-08-28 10:43:37.484] @approx::local_4d [{#uv, #integrated, #series}] DEBUG : Series expanded
  2122. 126.32 s > field value
  2123. 126.32 s > res n-terms: 3, byte size: 1896,expr:
  2124. 126.32 s > (1/2·SCALAR_COUPLING²·(2·mUVexp²-2·mass_scalar_2²)/(denom(2,q₂,mUVexp²,-mUV²+(q₂.q₂))²·denom(3,-q₂,mUVexp²,-mUV²+(q₂.q₂)))
  2125. 126.32 s > -SCALAR_COUPLING²
  2126. 126.32 s > ·(-1/2·(2·mUVexp²-2·mass_scalar_2²+2·(q₀.q₀))/denom(3,-q₂,mUVexp²,-mUV²+(q₂.q₂))
  2127. 126.32 s > +4·(q₀.q₂)²/denom(3,-q₂,mUVexp²,-mUV²+(q₂.q₂))²
  2128. 126.32 s > )/(denom(2,q₂,mUVexp²,-mUV²+(q₂.q₂))·denom(3,-q₂,mUVexp²,-mUV²+(q₂.q₂)))
  2129. 126.32 s > )·q₀(αᵉ².¹)·q₀(αᵉ³.¹)·q₂(αᵉ².¹)·q₂(αᵉ³.¹)
  2130. 126.32 s > +2·SCALAR_COUPLING²·(q₀.q₂)·q₀(αᵉ².¹)·q₀(αᵉ³.¹)·q₂(αᵉ².¹)·q₂(αᵉ³.¹)
  2131. 126.32 s > /(t·denom(2,q₂,mUVexp²,-mUV²+(q₂.q₂))·denom(3,-q₂,mUVexp²,-mUV²+(q₂.q₂))²)
  2132. 126.32 s > -SCALAR_COUPLING²·q₀(αᵉ².¹)·q₀(αᵉ³.¹)·q₂(αᵉ².¹)·q₂(αᵉ³.¹)
  2133. 126.32 s > /(t²·denom(2,q₂,mUVexp²,-mUV²+(q₂.q₂))·denom(3,-q₂,mUVexp²,-mUV²+(q₂.q₂)))
  2134. 126.32 s > span t{span_context=true current=subgraph=y, topo_order=1, dod=2 given=subgraph=0, topo_order=0, dod=0}
  2135. 126.32 s > [2026-08-28 10:43:37.485] @approx::local_4d [{#uv, #integrated, #series}] DEBUG : Evaluated at t = 1
  2136. 126.32 s > field value
  2137. 126.32 s > res n-terms: 3, byte size: 1880,expr:
  2138. 126.32 s > (1/2·SCALAR_COUPLING²·(2·mUVexp²-2·mass_scalar_2²)/(denom(2,q₂,mUVexp²,-mUV²+(q₂.q₂))²·denom(3,-q₂,mUVexp²,-mUV²+(q₂.q₂)))
  2139. 126.32 s > -SCALAR_COUPLING²
  2140. 126.32 s > ·(-1/2·(2·mUVexp²-2·mass_scalar_2²+2·(q₀.q₀))/denom(3,-q₂,mUVexp²,-mUV²+(q₂.q₂))
  2141. 126.32 s > +4·(q₀.q₂)²/denom(3,-q₂,mUVexp²,-mUV²+(q₂.q₂))²
  2142. 126.32 s > )/(denom(2,q₂,mUVexp²,-mUV²+(q₂.q₂))·denom(3,-q₂,mUVexp²,-mUV²+(q₂.q₂)))
  2143. 126.32 s > )·q₀(αᵉ².¹)·q₀(αᵉ³.¹)·q₂(αᵉ².¹)·q₂(αᵉ³.¹)
  2144. 126.32 s > -SCALAR_COUPLING²·q₀(αᵉ².¹)·q₀(αᵉ³.¹)·q₂(αᵉ².¹)·q₂(αᵉ³.¹)
  2145. 126.32 s > /(denom(2,q₂,mUVexp²,-mUV²+(q₂.q₂))·denom(3,-q₂,mUVexp²,-mUV²+(q₂.q₂)))
  2146. 126.32 s > +2·SCALAR_COUPLING²·(q₀.q₂)·q₀(αᵉ².¹)·q₀(αᵉ³.¹)·q₂(αᵉ².¹)·q₂(αᵉ³.¹)
  2147. 126.32 s > /(denom(2,q₂,mUVexp²,-mUV²+(q₂.q₂))·denom(3,-q₂,mUVexp²,-mUV²+(q₂.q₂))²)
  2148. 126.32 s > span t{span_context=true current=subgraph=y, topo_order=1, dod=2 given=subgraph=0, topo_order=0, dod=0}
  2149. 126.32 s > [2026-08-28 10:43:37.486] @approx::local_4d [{#uv, #collect, #integrated}] DEBUG : After gamma chain collection
  2150. 126.32 s > field value
  2151. 126.32 s > expr n-terms: 3, byte size: 1880,expr:
  2152. 126.32 s > (1/2·SCALAR_COUPLING²·(2·mUVexp²-2·mass_scalar_2²)/(denom(2,q₂,mUVexp²,-mUV²+(q₂.q₂))²·denom(3,-q₂,mUVexp²,-mUV²+(q₂.q₂)))
  2153. 126.32 s > -SCALAR_COUPLING²
  2154. 126.32 s > ·(-1/2·(2·mUVexp²-2·mass_scalar_2²+2·(q₀.q₀))/denom(3,-q₂,mUVexp²,-mUV²+(q₂.q₂))
  2155. 126.32 s > +4·(q₀.q₂)²/denom(3,-q₂,mUVexp²,-mUV²+(q₂.q₂))²
  2156. 126.32 s > )/(denom(2,q₂,mUVexp²,-mUV²+(q₂.q₂))·denom(3,-q₂,mUVexp²,-mUV²+(q₂.q₂)))
  2157. 126.32 s > )·q₀(αᵉ².¹)·q₀(αᵉ³.¹)·q₂(αᵉ².¹)·q₂(αᵉ³.¹)
  2158. 126.32 s > -SCALAR_COUPLING²·q₀(αᵉ².¹)·q₀(αᵉ³.¹)·q₂(αᵉ².¹)·q₂(αᵉ³.¹)
  2159. 126.32 s > /(denom(2,q₂,mUVexp²,-mUV²+(q₂.q₂))·denom(3,-q₂,mUVexp²,-mUV²+(q₂.q₂)))
  2160. 126.32 s > +2·SCALAR_COUPLING²·(q₀.q₂)·q₀(αᵉ².¹)·q₀(αᵉ³.¹)·q₂(αᵉ².¹)·q₂(αᵉ³.¹)
  2161. 126.32 s > /(denom(2,q₂,mUVexp²,-mUV²+(q₂.q₂))·denom(3,-q₂,mUVexp²,-mUV²+(q₂.q₂))²)
  2162. 126.32 s > span t{span_context=true current=subgraph=y, topo_order=1, dod=2 given=subgraph=0, topo_order=0, dod=0}
  2163. 126.32 s > [2026-08-28 10:43:37.489] @approx::local_4d [{#profile, #uv, #collect, #integrated, #start, #trace}] DEBUG : After gamma schoonschip
  2164. 126.32 s > field value
  2165. 126.32 s > expr n-terms: 3, byte size: 1631,expr:
  2166. 126.32 s > (1/2·SCALAR_COUPLING²·(2·mUVexp²-2·mass_scalar_2²)/(denom(2,q₂,mUVexp²,-mUV²+(q₂.q₂))²·denom(3,-q₂,mUVexp²,-mUV²+(q₂.q₂)))
  2167. 126.32 s > -SCALAR_COUPLING²
  2168. 126.32 s > ·(-1/2·(2·mUVexp²-2·mass_scalar_2²+2·(q₀.q₀))/denom(3,-q₂,mUVexp²,-mUV²+(q₂.q₂))
  2169. 126.32 s > +4·(q₀.q₂)²/denom(3,-q₂,mUVexp²,-mUV²+(q₂.q₂))²
  2170. 126.32 s > )/(denom(2,q₂,mUVexp²,-mUV²+(q₂.q₂))·denom(3,-q₂,mUVexp²,-mUV²+(q₂.q₂)))
  2171. 126.32 s > )·(q₀.q₂)²
  2172. 126.32 s > -SCALAR_COUPLING²·(q₀.q₂)²/(denom(2,q₂,mUVexp²,-mUV²+(q₂.q₂))·denom(3,-q₂,mUVexp²,-mUV²+(q₂.q₂)))
  2173. 126.32 s > +2·SCALAR_COUPLING²·(q₀.q₂)·(q₀.q₂)²
  2174. 126.32 s > /(denom(2,q₂,mUVexp²,-mUV²+(q₂.q₂))·denom(3,-q₂,mUVexp²,-mUV²+(q₂.q₂))²)
  2175. 126.32 s > span t{span_context=true current=subgraph=y, topo_order=1, dod=2 given=subgraph=0, topo_order=0, dod=0}
  2176. 126.32 s > [2026-08-28 10:43:37.491] @approx::local_4d [{#profile, #uv, #collect, #integrated, #start, #trace}] DEBUG : After gamma collection
  2177. 126.32 s > field value
  2178. 126.32 s > expr n-terms: 1, byte size: 1347,expr:
  2179. 126.32 s > SCALAR_COUPLING²
  2180. 126.32 s > ·(-denom(2,q₂,mUVexp²,-mUV²+(q₂.q₂))·denom(3,-q₂,mUVexp²,-mUV²+(q₂.q₂))²
  2181. 126.32 s > +1/2·(2·mUVexp²-2·mass_scalar_2²)·denom(3,-q₂,mUVexp²,-mUV²+(q₂.q₂))²
  2182. 126.32 s > -(-1/2·(2·mUVexp²-2·mass_scalar_2²+2·(q₀.q₀))·denom(3,-q₂,mUVexp²,-mUV²+(q₂.q₂))+4·(q₀.q₂)²)
  2183. 126.32 s > ·denom(2,q₂,mUVexp²,-mUV²+(q₂.q₂))
  2184. 126.32 s > +2·(q₀.q₂)·denom(2,q₂,mUVexp²,-mUV²+(q₂.q₂))·denom(3,-q₂,mUVexp²,-mUV²+(q₂.q₂))
  2185. 126.32 s > )·(q₀.q₂)²/(denom(2,q₂,mUVexp²,-mUV²+(q₂.q₂))²·denom(3,-q₂,mUVexp²,-mUV²+(q₂.q₂))³)
  2186. 126.32 s > span t{span_context=true current=subgraph=y, topo_order=1, dod=2 given=subgraph=0, topo_order=0, dod=0}
  2187. 126.32 s > [2026-08-28 10:43:37.492] @approx::local_4d [{#profile, #uv, #gamma, #integrated, #start, #trace, #vakint}] DEBUG : After gamma simplification
  2188. 126.32 s > ... omitted 3263 more lines; see full nextest output above
  2189. 126.32 s >
  2190. 126.32 s > 8. gammaloop-integration-tests::uv::sunrise_scalar_1_uv
  2191. 126.32 s > failure: test failure with exit code 101
  2192. 126.32 s > system-out
  2193. 126.32 s > running 1 test
  2194. 126.32 s > test sunrise_scalar_1_uv has been running for over 60 seconds
  2195. 126.32 s > +------------------+------------------------+--------------+--------+----------+----------------------------------------------------------------------------------------------------------------------+-------+
  2196. 126.32 s > | case | check | graph | status | sigma | threshold | error |
  2197. 126.32 s > +------------------+------------------------+--------------+--------+----------+----------------------------------------------------------------------------------------------------------------------+-------+
  2198. 126.32 s > | sunrise_scalar_1 | uv_profile | - | FAIL | - | - | - |
  2199. 126.32 s > +------------------+------------------------+--------------+--------+----------+----------------------------------------------------------------------------------------------------------------------+-------+
  2200. 126.32 s > | sunrise_scalar_1 | m_uv.inspect | inspect | pass | - | best inspect relative delta 1.624e0 >= 1000*accuracy 1.000e-3 (accuracy=1.000e-6, exponent=+1.0, seed=1, probes=10) | - |
  2201. 126.32 s > +------------------+------------------------+--------------+--------+----------+----------------------------------------------------------------------------------------------------------------------+-------+
  2202. 126.32 s > | sunrise_scalar_1 | m_uv.integrated | sunrise | pass | 0.1sigma | compatible within 2sigma | - |
  2203. 126.32 s > +------------------+------------------------+--------------+--------+----------+----------------------------------------------------------------------------------------------------------------------+-------+
  2204. 126.32 s > | sunrise_scalar_1 | rls.inspect | inspect | pass | - | best inspect relative delta 8.682e-1 >= 1000*accuracy 1.000e-3 (accuracy=1.000e-6, exponent=+1.0, seed=1, probes=10) | - |
  2205. 126.32 s > +------------------+------------------------+--------------+--------+----------+----------------------------------------------------------------------------------------------------------------------+-------+
  2206. 126.32 s > | sunrise_scalar_1 | rls.integrated | sunrise | pass | 0.0sigma | compatible within 2sigma | - |
  2207. 126.32 s > +------------------+------------------------+--------------+--------+----------+----------------------------------------------------------------------------------------------------------------------+-------+
  2208. 126.32 s > | sunrise_scalar_1 | mu_r.inspect | inspect | pass | - | best inspect relative delta 1.752e0 >= 1000*accuracy 1.000e-3 (accuracy=1.000e-6, exponent=+1.0, seed=1, probes=10) | - |
  2209. 126.32 s > +------------------+------------------------+--------------+--------+----------+----------------------------------------------------------------------------------------------------------------------+-------+
  2210. 126.32 s > | sunrise_scalar_1 | integrated.relerr | integrated | pass | - | relative error 9.20% <= 10.00% | - |
  2211. 126.32 s > +------------------+------------------------+--------------+--------+----------+----------------------------------------------------------------------------------------------------------------------+-------+
  2212. 126.32 s > | sunrise_scalar_1 | m_uv.integrated.relerr | m_uv-shifted | pass | - | relative error 5.89% <= 10.00% | - |
  2213. 126.32 s > +------------------+------------------------+--------------+--------+----------+----------------------------------------------------------------------------------------------------------------------+-------+
  2214. 126.32 s > | sunrise_scalar_1 | target | - | pass | - | 2sigma | - |
  2215. 126.32 s > +------------------+------------------------+--------------+--------+----------+----------------------------------------------------------------------------------------------------------------------+-------+
  2216. 126.32 s > test sunrise_scalar_1_uv ... FAILED
  2217. 126.32 s >
  2218. 126.32 s > failures:
  2219. 126.32 s >
  2220. 126.32 s > failures:
  2221. 126.32 s > sunrise_scalar_1_uv
  2222. 126.32 s >
  2223. 126.32 s > test result: FAILED. 0 passed; 1 failed; 0 ignored; 0 measured; 24 filtered out; finished in 92.49s
  2224. 126.32 s > system-err
  2225. 126.32 s > [2026-08-28 10:43:41.759] @gammaloop_api::se... INFO : Running command run generate
  2226. 126.32 s > [2026-08-28 10:43:41.759] @gammaloop_api::se... INFO : Starting command block generate
  2227. 126.32 s > [2026-08-28 10:43:41.760] @gammaloop_api::se... INFO : Running command import model scalars-default.json
  2228. 126.32 s > [2026-08-28 10:43:41.760] @import::model INFO : Loading built-in JSON model scalars-default
  2229. 126.32 s > [2026-08-28 10:43:41.764] @gammalooprs::model INFO : The following 2 external parameters were forced to zero by the restriction card:
  2230. 126.32 s > width_scalar_1, width_scalar_2
  2231. 126.32 s > [2026-08-28 10:43:41.764] @gammaloop_api::se... INFO : Running command remove processes
  2232. 126.32 s > [2026-08-28 10:43:41.764] @gammaloop_api::se... INFO : Running command set global kv global.generation.uv.generate_integrated=true
  2233. 126.32 s > [2026-08-28 10:43:41.765] @gammaloop_api::se... INFO : Running command import graphs ./tests/resources/graphs/scalar_sunrise.dot -p sunrise_scalar_1 -i scalar_sunrise
  2234. 126.32 s > [2026-08-28 10:43:41.765] @commands::import INFO : Loading graphs from '/build/source/tests/resources/graphs/scalar_sunrise.dot'
  2235. 126.32 s > [2026-08-28 10:43:41.767] @gammaloop_api::se... INFO : Running command generate existing -p sunrise_scalar_1 -i scalar_sunrise
  2236. 126.32 s > [2026-08-28 10:43:41.769] @approx::local_4d [{#uv, #inspect, #integrated}] DEBUG : Rescaled momenta expanded
  2237. 126.32 s > field value
  2238. 126.32 s > res n-terms: 1, byte size: 611,expr:
  2239. 126.32 s > 1/(denom(0,q₀/t,mass_scalar_1²,-mass_scalar_1²+(q₀.q₀)/t²)
  2240. 126.32 s > ·denom(1,-q₂+q₃-q₀/t,mass_scalar_1²,
  2241. 126.32 s > -mass_scalar_1²+2·(q₀.q₂)/t-2·(q₀.q₃)/t+(q₀.q₀)/t²+(q₂.q₂)
  2242. 126.32 s > -2·(q₂.q₃)+(q₃.q₃)
  2243. 126.32 s > ))
  2244. 126.32 s > [2026-08-28 10:43:41.786] @approx::local_4d [{#uv, #inspect, #integrated}] DEBUG : Rescaled momenta expanded
  2245. 126.32 s > field value
  2246. 126.32 s > res n-terms: 1, byte size: 3,expr:
  2247. 126.32 s > 1
  2248. 126.32 s > [2026-08-28 10:43:41.787] @approx::local_4d [{#uv, #inspect, #integrated}] DEBUG : Rescaled momenta expanded
  2249. 126.32 s > field value
  2250. 126.32 s > res n-terms: 1, byte size: 611,expr:
  2251. 126.32 s > 1/(denom(0,q₀/t,mass_scalar_1²,-mass_scalar_1²+(q₀.q₀)/t²)
  2252. 126.32 s > ·denom(2,-q₁+q₃-q₀/t,mass_scalar_1²,
  2253. 126.32 s > -mass_scalar_1²+2·(q₀.q₁)/t-2·(q₀.q₃)/t+(q₀.q₀)/t²+(q₁.q₁)
  2254. 126.32 s > -2·(q₁.q₃)+(q₃.q₃)
  2255. 126.32 s > ))
  2256. 126.32 s > [2026-08-28 10:43:41.789] @approx::local_4d [{#uv, #inspect, #integrated}] DEBUG : Rescaled momenta expanded
  2257. 126.32 s > field value
  2258. 126.32 s > res n-terms: 1, byte size: 611,expr:
  2259. 126.32 s > 1/(denom(1,q₁/t,mass_scalar_1²,-mass_scalar_1²+(q₁.q₁)/t²)
  2260. 126.32 s > ·denom(2,-q₀+q₃-q₁/t,mass_scalar_1²,
  2261. 126.32 s > -mass_scalar_1²+2·(q₀.q₁)/t-2·(q₁.q₃)/t+(q₁.q₁)/t²+(q₀.q₀)
  2262. 126.32 s > -2·(q₀.q₃)+(q₃.q₃)
  2263. 126.32 s > ))
  2264. 126.32 s > [2026-08-28 10:43:41.791] @approx::local_4d [{#uv, #inspect, #integrated}] DEBUG : Rescaled momenta expanded
  2265. 126.32 s > field value
  2266. 126.32 s > res n-terms: 1, byte size: 777,expr:
  2267. 126.32 s > 1/(denom(0,q₀/t,mass_scalar_1²,-mass_scalar_1²+(q₀.q₀)/t²)·denom(1,q₁/t,mass_scalar_1²,-mass_scalar_1²+(q₁.q₁)/t²)
  2268. 126.32 s > ·denom(2,q₄-q₀/t-q₁/t,mass_scalar_1²,
  2269. 126.32 s > -mass_scalar_1²-2·(q₀.q₄)/t-2·(q₁.q₄)/t+(q₀.q₀)/t²+2·(q₀.q₁)/t²
  2270. 126.32 s > +(q₁.q₁)/t²+(q₄.q₄)
  2271. 126.32 s > ))
  2272. 126.32 s > [2026-08-28 10:43:41.794] @approx::final_integrand[{#generation, #profile, #uv, #graph, #summary}] DEBUG : Computed global numerator
  2273. 126.32 s > field value
  2274. 126.32 s > global_num n-terms: 1, byte size: 3,expr:
  2275. 126.32 s > 1
  2276. 126.32 s > span build_3d{span_context=true graph=sunrise current=subgraph=0, topo_order=0, dod=0}
  2277. 126.32 s > [2026-08-28 10:43:41.797] @uv::approx [{#generation, #uv, #fourd}] DEBUG : Computing 4D
  2278. 126.32 s > field value
  2279. 126.32 s > simple subgraph(S_47,S_y)*Approx(subgraph(S_y,0)) of sunrise
  2280. 126.32 s > span compute_4d{span_context=true graph=sunrise current=subgraph=y, topo_order=1, dod=0 given=subgraph=0, topo_order=0, dod=0 reduced=SubSet { set: BitVec<usize, bitvec::order::Lsb0> { addr: 0x7fffec0167f0, head: 000000, bits: 8, capacity: 64 } [0, 0, 1, 1, 1, 1, 0, 0], id: PhantomData<linnet::half_edge::involution::Hedge> }}
  2281. 126.32 s > [2026-08-28 10:43:41.798] @approx::local_4d [{#uv, #algebra, #integrated, #start}] DEBUG :
  2282. 126.32 s > field value
  2283. 126.32 s > integrand n-terms: 1, byte size: 217,expr:
  2284. 126.32 s > 1/(denom(0,q₀,mass_scalar_1²,-mass_scalar_1²+(q₀.q₀))·denom(1,q₁,mass_scalar_1²,-mass_scalar_1²+(q₁.q₁)))
  2285. 126.32 s > reduced y
  2286. 126.32 s > span grow{span_context=true current=subgraph=y, topo_order=1, dod=0 given=subgraph=0, topo_order=0, dod=0}
  2287. 126.32 s > [2026-08-28 10:43:41.798] @approx::local_4d [{#uv, #inspect, #integrated}] DEBUG : Rescaled momenta expanded
  2288. 126.32 s > field value
  2289. 126.32 s > res n-terms: 1, byte size: 611,expr:
  2290. 126.32 s > 1/(denom(0,q₀/t,mass_scalar_1²,-mass_scalar_1²+(q₀.q₀)/t²)
  2291. 126.32 s > ·denom(1,-q₂+q₃-q₀/t,mass_scalar_1²,
  2292. 126.32 s > -mass_scalar_1²+2·(q₀.q₂)/t-2·(q₀.q₃)/t+(q₀.q₀)/t²+(q₂.q₂)
  2293. 126.32 s > -2·(q₂.q₃)+(q₃.q₃)
  2294. 126.32 s > ))
  2295. 126.32 s > span t{span_context=true current=subgraph=y, topo_order=1, dod=0 given=subgraph=0, topo_order=0, dod=0}
  2296. 126.32 s > [2026-08-28 10:43:41.798] @approx::local_4d [{#uv, #integrated, #rescaled}] DEBUG : Rescaled expanded
  2297. 126.32 s > field value
  2298. 126.32 s > n_loops 1
  2299. 126.32 s > res n-terms: 1, byte size: 723,expr:
  2300. 126.32 s > 1/(denom(0,q₀,mUVexp²+t²·mass_scalar_1²,-mUV²+t²·(-mass_scalar_1²+(q₀.q₀)/t²)+t²·mUVexp²)
  2301. 126.32 s > ·denom(1,-q₀,mUVexp²+t²·mass_scalar_1²,
  2302. 126.32 s > -mUV²
  2303. 126.32 s > +t²
  2304. 126.32 s > ·(-mass_scalar_1²+2·(q₀.q₂)/t-2·(q₀.q₃)/t+(q₀.q₀)/t²+(q₂.q₂)
  2305. 126.32 s > -2·(q₂.q₃)+(q₃.q₃)
  2306. 126.32 s > )
  2307. 126.32 s > +t²·mUVexp²
  2308. 126.32 s > ))
  2309. 126.32 s > span t{span_context=true current=subgraph=y, topo_order=1, dod=0 given=subgraph=0, topo_order=0, dod=0}
  2310. 126.32 s > [2026-08-28 10:43:41.799] @approx::local_4d [{#uv, #integrated, #series}] DEBUG : Series expanded
  2311. 126.32 s > field value
  2312. 126.32 s > res n-terms: 1, byte size: 223,expr:
  2313. 126.32 s > 1/(denom(0,q₀,mUVexp²,-mUV²+(q₀.q₀))·denom(1,-q₀,mUVexp²,-mUV²+(q₀.q₀)))
  2314. 126.32 s > span t{span_context=true current=subgraph=y, topo_order=1, dod=0 given=subgraph=0, topo_order=0, dod=0}
  2315. 126.32 s > [2026-08-28 10:43:41.799] @approx::local_4d [{#uv, #integrated, #series}] DEBUG : Evaluated at t = 1
  2316. 126.32 s > field value
  2317. 126.32 s > res n-terms: 1, byte size: 223,expr:
  2318. 126.32 s > 1/(denom(0,q₀,mUVexp²,-mUV²+(q₀.q₀))·denom(1,-q₀,mUVexp²,-mUV²+(q₀.q₀)))
  2319. 126.32 s > span t{span_context=true current=subgraph=y, topo_order=1, dod=0 given=subgraph=0, topo_order=0, dod=0}
  2320. 126.32 s > [2026-08-28 10:43:41.799] @approx::local_4d [{#uv, #collect, #integrated}] DEBUG : After gamma chain collection
  2321. 126.32 s > field value
  2322. 126.32 s > expr n-terms: 1, byte size: 223,expr:
  2323. 126.32 s > 1/(denom(0,q₀,mUVexp²,-mUV²+(q₀.q₀))·denom(1,-q₀,mUVexp²,-mUV²+(q₀.q₀)))
  2324. 126.32 s > span t{span_context=true current=subgraph=y, topo_order=1, dod=0 given=subgraph=0, topo_order=0, dod=0}
  2325. 126.32 s > [2026-08-28 10:43:41.800] @approx::local_4d [{#profile, #uv, #collect, #integrated, #start, #trace}] DEBUG : After gamma schoonschip
  2326. 126.32 s > field value
  2327. 126.32 s > expr n-terms: 1, byte size: 223,expr:
  2328. 126.32 s > 1/(denom(0,q₀,mUVexp²,-mUV²+(q₀.q₀))·denom(1,-q₀,mUVexp²,-mUV²+(q₀.q₀)))
  2329. 126.32 s > span t{span_context=true current=subgraph=y, topo_order=1, dod=0 given=subgraph=0, topo_order=0, dod=0}
  2330. 126.32 s > [2026-08-28 10:43:41.800] @approx::local_4d [{#profile, #uv, #collect, #integrated, #start, #trace}] DEBUG : After gamma collection
  2331. 126.32 s > field value
  2332. 126.32 s > expr n-terms: 1, byte size: 223,expr:
  2333. 126.32 s > 1/(denom(0,q₀,mUVexp²,-mUV²+(q₀.q₀))·denom(1,-q₀,mUVexp²,-mUV²+(q₀.q₀)))
  2334. 126.32 s > span t{span_context=true current=subgraph=y, topo_order=1, dod=0 given=subgraph=0, topo_order=0, dod=0}
  2335. 126.32 s > [2026-08-28 10:43:41.801] @approx::local_4d [{#profile, #uv, #gamma, #integrated, #start, #trace, #vakint}] DEBUG : After gamma simplification
  2336. 126.32 s > field value
  2337. 126.32 s > expr n-terms: 1, byte size: 223,expr:
  2338. 126.32 s > 1/(denom(0,q₀,mUVexp²,-mUV²+(q₀.q₀))·denom(1,-q₀,mUVexp²,-mUV²+(q₀.q₀)))
  2339. 126.32 s > span t{span_context=true current=subgraph=y, topo_order=1, dod=0 given=subgraph=0, topo_order=0, dod=0}
  2340. 126.32 s > [2026-08-28 10:43:41.801] @approx::local_4d [{#profile, #uv, #integrated, #schoonschip, #start, #trace, #vakint}] DEBUG : After Schoonschip net
  2341. 126.32 s > field value
  2342. 126.32 s > expr n-terms: 1, byte size: 223,expr:
  2343. 126.32 s > 1/(denom(0,q₀,mUVexp²,-mUV²+(q₀.q₀))·denom(1,-q₀,mUVexp²,-mUV²+(q₀.q₀)))
  2344. 126.32 s > ... omitted 20095 more lines; see full nextest output above
  2345. 126.32 s >
  2346. 126.32 s > 9. gammaloop-integration-tests::uv::se1l_uv
  2347. 126.32 s > failure: test failure with exit code 101
  2348. 126.32 s > system-out
  2349. 126.32 s > running 1 test
  2350. 126.32 s > test se1l_uv has been running for over 60 seconds
  2351. 126.32 s > +------+-----------------+---------+--------+----------+-----------------------------------------------------------------------------------------------------------------------+-------+
  2352. 126.32 s > | case | check | graph | status | sigma | threshold | error |
  2353. 126.32 s > +------+-----------------+---------+--------+----------+-----------------------------------------------------------------------------------------------------------------------+-------+
  2354. 126.32 s > | se1l | uv_profile | - | FAIL | - | - | - |
  2355. 126.32 s > +------+-----------------+---------+--------+----------+-----------------------------------------------------------------------------------------------------------------------+-------+
  2356. 126.32 s > | se1l | m_uv.inspect | inspect | pass | - | best inspect relative delta 1.097e-1 >= 1000*accuracy 1.000e-7 (accuracy=1.000e-10, exponent=+2.0, seed=1, probes=10) | - |
  2357. 126.32 s > +------+-----------------+---------+--------+----------+-----------------------------------------------------------------------------------------------------------------------+-------+
  2358. 126.32 s > | se1l | m_uv.integrated | se1l | pass | 0.1sigma | compatible within 2sigma | - |
  2359. 126.32 s > +------+-----------------+---------+--------+----------+-----------------------------------------------------------------------------------------------------------------------+-------+
  2360. 126.32 s > | se1l | rls.inspect | inspect | pass | - | best inspect relative delta 4.499e-2 >= 1000*accuracy 1.000e-7 (accuracy=1.000e-10, exponent=+2.0, seed=1, probes=10) | - |
  2361. 126.32 s > +------+-----------------+---------+--------+----------+-----------------------------------------------------------------------------------------------------------------------+-------+
  2362. 126.32 s > | se1l | rls.integrated | se1l | pass | 0.0sigma | compatible within 2sigma | - |
  2363. 126.32 s > +------+-----------------+---------+--------+----------+-----------------------------------------------------------------------------------------------------------------------+-------+
  2364. 126.32 s > | se1l | mu_r.inspect | inspect | pass | - | best inspect relative delta 1.424e-1 >= 1000*accuracy 1.000e-7 (accuracy=1.000e-10, exponent=+2.0, seed=1, probes=10) | - |
  2365. 126.32 s > +------+-----------------+---------+--------+----------+-----------------------------------------------------------------------------------------------------------------------+-------+
  2366. 126.32 s > | se1l | target | - | pass | - | 2sigma | - |
  2367. 126.32 s > +------+-----------------+---------+--------+----------+-----------------------------------------------------------------------------------------------------------------------+-------+
  2368. 126.32 s > test se1l_uv ... FAILED
  2369. 126.32 s >
  2370. 126.32 s > failures:
  2371. 126.32 s >
  2372. 126.32 s > failures:
  2373. 126.32 s > se1l_uv
  2374. 126.32 s >
  2375. 126.32 s > test result: FAILED. 0 passed; 1 failed; 0 ignored; 0 measured; 24 filtered out; finished in 102.41s
  2376. 126.32 s > system-err
  2377. 126.32 s > [2026-08-28 10:43:41.288] @gammaloop_api::se... INFO : Running command run generate
  2378. 126.32 s > [2026-08-28 10:43:41.288] @gammaloop_api::se... INFO : Starting command block generate
  2379. 126.32 s > [2026-08-28 10:43:41.288] @gammaloop_api::se... INFO : Running command import model sm-default
  2380. 126.32 s > [2026-08-28 10:43:41.288] @import::model INFO : Loading built-in JSON model sm-default
  2381. 126.32 s > [2026-08-28 10:43:41.312] @gammalooprs::model INFO : The following 11 external parameters were forced to zero by the restriction card:
  2382. 126.32 s > lamWS, AWS, rhoWS, etaWS, ymc, yme, ymm, MC, Me, MM, WTau
  2383. 126.32 s > [2026-08-28 10:43:41.312] @gammalooprs::model INFO : The following 34 vertex rules were removed by the restriction card:
  2384. 126.32 s > V_82 -> (c~, d, G+) | V_83 -> (t~, d, G+) | V_84 -> (c~, s, G+) | V_85 -> (t~, s, G+) | V_86 -> (u~, b, G+) | V_87 -> (c~, b, G+) | V_90 -> (c~, d, W+) | V_91 -> (t~, d, W+) | V_92 -> (u~, s, W+) | V_94 -> (t~, s, W+) | V_95 -> (u~, b, W+) | V_96 -> (c~, b, W+) | V_101 -> (e+, e-, G0) | V_102 -> (mu+, mu-, G0) | V_104 -> (e+, e-, H) | V_105 -> (mu+, mu-, H) | V_110 -> (ve~, e-, G+) | V_111 -> (vm~, mu-, G+) | V_116 -> (b~, u, G-) | V_117 -> (d~, c, G-) | V_118 -> (s~, c, G-) | V_119 -> (b~, c, G-) | V_120 -> (d~, t, G-) | V_121 -> (s~, t, G-) | V_124 -> (s~, u, W-) | V_125 -> (b~, u, W-) | V_126 -> (d~, c, W-) | V_128 -> (b~, c, W-) | V_129 -> (d~, t, W-) | V_130 -> (s~, t, W-) | V_138 -> (c~, c, G0) | V_140 -> (c~, c, H) | V_145 -> (e+, ve, G-) | V_146 -> (mu+, vm, G-)
  2385. 126.32 s > [2026-08-28 10:43:41.312] @gammalooprs::model INFO : The following 36 couplings were removed by the restriction card:
  2386. 126.32 s > GC_13, GC_14, GC_16, GC_17, GC_18, GC_19, GC_20, GC_22, GC_23, GC_24, GC_25, GC_26, GC_28, GC_29, GC_42, GC_43, GC_44, GC_46, GC_47, GC_48, GC_84, GC_85, GC_86, GC_87, GC_88, GC_89, GC_90, GC_91, GC_92, GC_93, GC_101, GC_102, GC_103, GC_105, GC_106, GC_107
  2387. 126.32 s > [2026-08-28 10:43:41.313] @gammaloop_api::se... INFO : Running command remove processes
  2388. 126.32 s > [2026-08-28 10:43:41.313] @gammaloop_api::se... INFO : Running command set global kv global.generation.uv.generate_integrated=true
  2389. 126.32 s > [2026-08-28 10:43:41.313] @gammaloop_api::se... INFO : Running command import graphs ./tests/resources/graphs/uv_tests/se1l.dot -p se1l -i se1l
  2390. 126.32 s > [2026-08-28 10:43:41.313] @commands::import INFO : Loading graphs from '/build/source/tests/resources/graphs/uv_tests/se1l.dot'
  2391. 126.32 s > [2026-08-28 10:43:41.316] @gammaloop_api::se... INFO : Running command generate existing -p se1l -i se1l
  2392. 126.32 s > [2026-08-28 10:43:42.260] @commands::generate INFO :
  2393. 126.32 s > Integrand generation summary
  2394. 126.32 s > peak RAM 88.97 MiB | cores 1
  2395. 126.32 s > ╭───────────┬───────┬─────────┬─────────────┬─────────────┬────────────────┬─────────────╮
  2396. 126.32 s > │ integrand │ graph │ # evals │ expr build │ spenso │ symbolica eval │ compile │
  2397. 126.32 s > ├───────────┼───────┼─────────┼─────────────┼─────────────┼────────────────┼─────────────┤
  2398. 126.32 s > │ se1l │ se1l │ 5 │ 794ms (88%) │ 35ms (3.9%) │ 74ms (8.3%) │ 0ms (0.00%) │
  2399. 126.32 s > ├───────────┼───────┼─────────┼─────────────┼─────────────┼────────────────┼─────────────┤
  2400. 126.32 s > │ Total │ │ 5 │ 794ms (88%) │ 35ms (3.9%) │ 74ms (8.3%) │ 0ms (0.00%) │
  2401. 126.32 s > ╰───────────┴───────┴─────────┴─────────────┴─────────────┴────────────────┴─────────────╯
  2402. 126.32 s > [2026-08-28 10:43:42.261] @gammaloop_api::se... INFO : Running command set process -p se1l -i se1l kv general.m_uv=0.2
  2403. 126.32 s > [2026-08-28 10:43:42.262] @gammaloop_api::se... INFO : Running command set process -p se1l -i se1l kv general.mu_r=0.2
  2404. 126.32 s > [2026-08-28 10:43:42.263] @gammaloop_api::se... INFO : Running command set process -p se1l -i se1l kv general.renormalization_localization_scale=0.2
  2405. 126.32 s > [2026-08-28 10:43:42.264] @gammaloop_api::se... INFO : Running command duplicate integrand -p se1l -i se1l --output_process_name se1l --output_integrand_name se1l_muv_shifted
  2406. 126.32 s > [2026-08-28 10:43:42.265] @gammaloop_api::se... INFO : Running command set process -p se1l -i se1l_muv_shifted kv general.m_uv=0.5
  2407. 126.32 s > [2026-08-28 10:43:42.266] @gammaloop_api::se... INFO : Running command duplicate integrand -p se1l -i se1l --output_process_name se1l --output_integrand_name se1l_rls_shifted
  2408. 126.32 s > [2026-08-28 10:43:42.267] @gammaloop_api::se... INFO : Running command set process -p se1l -i se1l_rls_shifted kv general.renormalization_localization_scale=1
  2409. 126.32 s > [2026-08-28 10:43:42.268] @gammaloop_api::se... INFO : Running command duplicate integrand -p se1l -i se1l --output_process_name se1l --output_integrand_name se1l_mur_shifted
  2410. 126.32 s > [2026-08-28 10:43:42.270] @gammaloop_api::se... INFO : Running command set process -p se1l -i se1l_mur_shifted kv general.mu_r=0.8
  2411. 126.32 s > [2026-08-28 10:43:42.275] @process::amplitude WARNING : External state 0 ('g', PDG 21, helicity +) is off shell: p^2 = +2.5e5, expected m^2 = +0e0 (|Δ| = +2.5e5). Fixed-helicity spinor/vector/tensor external states may be ill-defined at this kinematic point.
  2412. 126.32 s > field value
  2413. 126.32 s > span warm_up{integrand.name=se1l}
  2414. 126.32 s > [2026-08-28 10:43:42.275] @process::amplitude WARNING : External state 1 ('g', PDG 21, helicity -) is off shell: p^2 = +2.5e5, expected m^2 = +0e0 (|Δ| = +2.5e5). Fixed-helicity spinor/vector/tensor external states may be ill-defined at this kinematic point.
  2415. 126.32 s > field value
  2416. 126.32 s > span warm_up{integrand.name=se1l}
  2417. 126.32 s > [2026-08-28 10:43:42.275] @process::amplitude INFO : Input is above threshold: 1 existing threshold E-surfaces across 1/1 graph groups
  2418. 126.32 s > field value
  2419. 126.32 s > existing_esurfaces 1
  2420. 126.32 s > group_count 1
  2421. 126.32 s > groups_above_threshold 1
  2422. 126.32 s > integrand se1l
  2423. 126.32 s > span warm_up{integrand.name=se1l}
  2424. 126.32 s > threshold_status above threshold
  2425. 126.32 s > [2026-08-28 10:43:42.275] @process::amplitude INFO : overlap structure of group 0: [1: [0(2,3)]]
  2426. 126.32 s > field value
  2427. 126.32 s > span warm_up{integrand.name=se1l}
  2428. 126.32 s > [2026-08-28 10:43:42.434] @commands::profile INFO :
  2429. 126.32 s > ╭───────┬──────┬──────────┬───────┬─────┬──────────┬───────────╮
  2430. 126.32 s > │ fixed │ → ∞ │ slope │ r2 │ DOD │ bare DOD │ inspect │
  2431. 126.32 s > ├───────┼──────┼──────────┼───────┼─────┼──────────┼───────────┤
  2432. 126.32 s > │ {} │ {e3} │ 1.639236 │ 0.904 │ 2 │ 2 │ arb retry │
  2433. 126.32 s > │ {} │ {e2} │ 1.698834 │ 0.902 │ 2 │ 2 │ arb retry │
  2434. 126.32 s > ╰───────┴──────┴──────────┴───────┴─────┴──────────┴───────────╯
  2435. 126.32 s > [2026-08-28 10:43:42.434] @commands::profile INFO :
  2436. 126.32 s > ╭───────┬──────┬─────────────┬──────────┬───────┬─────┬──────────┬───────────╮
  2437. 126.32 s > │ fixed │ → ∞ │ orientation │ slope │ r2 │ DOD │ bare DOD │ inspect │
  2438. 126.32 s > ├───────┼──────┼─────────────┼──────────┼───────┼─────┼──────────┼───────────┤
  2439. 126.32 s > │ {} │ {e3} │ 00-+ │ 0.343429 │ 0.145 │ 0 │ 2 │ arb retry │
  2440. 126.32 s > │ {} │ {e3} │ 00+- │ 0.342577 │ 0.135 │ 0 │ 2 │ arb retry │
  2441. 126.32 s > │ {} │ {e2} │ 00-+ │ 0.385975 │ 0.161 │ 0 │ 2 │ arb retry │
  2442. 126.32 s > │ {} │ {e2} │ 00+- │ 0.384920 │ 0.192 │ 0 │ 2 │ arb retry │
  2443. 126.32 s > ╰───────┴──────┴─────────────┴──────────┴───────┴─────┴──────────┴───────────╯
  2444. 126.32 s > [2026-08-28 10:43:42.435] @gammaloop_api::se... INFO : Running command set process kv integrator.target_relative_accuracy=0.001 integrator.n_increase=0 integrator.n_start=50000 integrator.n_max=400000 integrator.seed=1337
  2445. 126.32 s > [2026-08-28 10:43:42.435] @commands::integrate INFO : Created workspace directory at /build/source/tests/artifacts/se1l/integration_workspace_se1l
  2446. 126.32 s > [2026-08-28 10:43:42.459] @commands::integrate INFO : No integration state found, starting new integration
  2447. 126.32 s > [2026-08-28 10:43:42.459] @commands::integrate INFO : Gammaloop now integrates se1l@se1l, se1l@se1l_muv_shifted, se1l@se1l_rls_shifted
  2448. 126.32 s > [2026-08-28 10:43:42.459] @process::amplitude WARNING : External state 0 ('g', PDG 21, helicity +) is off shell: p^2 = +2.5e5, expected m^2 = +0e0 (|Δ| = +2.5e5). Fixed-helicity spinor/vector/tensor external states may be ill-defined at this kinematic point.
  2449. 126.32 s > field value
  2450. 126.32 s > span warm_up{integrand.name=se1l}
  2451. 126.32 s > [2026-08-28 10:43:42.459] @process::amplitude WARNING : External state 1 ('g', PDG 21, helicity -) is off shell: p^2 = +2.5e5, expected m^2 = +0e0 (|Δ| = +2.5e5). Fixed-helicity spinor/vector/tensor external states may be ill-defined at this kinematic point.
  2452. 126.32 s > field value
  2453. 126.32 s > span warm_up{integrand.name=se1l}
  2454. 126.32 s > [2026-08-28 10:43:42.460] @process::amplitude INFO : Input is above threshold: 1 existing threshold E-surfaces across 1/1 graph groups
  2455. 126.32 s > field value
  2456. 126.32 s > existing_esurfaces 1
  2457. 126.32 s > group_count 1
  2458. 126.32 s > groups_above_threshold 1
  2459. 126.32 s > integrand se1l
  2460. 126.32 s > span warm_up{integrand.name=se1l}
  2461. 126.32 s > threshold_status above threshold
  2462. 126.32 s > [2026-08-28 10:43:42.460] @process::amplitude INFO : overlap structure of group 0: [1: [0(2,3)]]
  2463. 126.32 s > field value
  2464. 126.32 s > span warm_up{integrand.name=se1l}
  2465. 126.32 s > [2026-08-28 10:43:42.461] @process::amplitude WARNING : External state 0 ('g', PDG 21, helicity +) is off shell: p^2 = +2.5e5, expected m^2 = +0e0 (|Δ| = +2.5e5). Fixed-helicity spinor/vector/tensor external states may be ill-defined at this kinematic point.
  2466. 126.32 s > field value
  2467. 126.32 s > span warm_up{integrand.name=se1l_muv_shifted}
  2468. 126.32 s > [2026-08-28 10:43:42.461] @process::amplitude WARNING : External state 1 ('g', PDG 21, helicity -) is off shell: p^2 = +2.5e5, expected m^2 = +0e0 (|Δ| = +2.5e5). Fixed-helicity spinor/vector/tensor external states may be ill-defined at this kinematic point.
  2469. 126.32 s > field value
  2470. 126.32 s > span warm_up{integrand.name=se1l_muv_shifted}
  2471. 126.32 s > [2026-08-28 10:43:42.461] @process::amplitude INFO : Input is above threshold: 1 existing threshold E-surfaces across 1/1 graph groups
  2472. 126.32 s > field value
  2473. 126.32 s > existing_esurfaces 1
  2474. 126.32 s > group_count 1
  2475. 126.32 s > groups_above_threshold 1
  2476. 126.32 s > integrand se1l_muv_shifted
  2477. 126.32 s > span warm_up{integrand.name=se1l_muv_shifted}
  2478. 126.32 s > threshold_status above threshold
  2479. 126.32 s > [2026-08-28 10:43:42.461] @process::amplitude INFO : overlap structure of group 0: [1: [0(2,3)]]
  2480. 126.32 s > field value
  2481. 126.32 s > span warm_up{integrand.name=se1l_muv_shifted}
  2482. 126.32 s > [2026-08-28 10:43:42.463] @process::amplitude WARNING : External state 0 ('g', PDG 21, helicity +) is off shell: p^2 = +2.5e5, expected m^2 = +0e0 (|Δ| = +2.5e5). Fixed-helicity spinor/vector/tensor external states may be ill-defined at this kinematic point.
  2483. 126.32 s > field value
  2484. 126.32 s > span warm_up{integrand.name=se1l_rls_shifted}
  2485. 126.32 s > [2026-08-28 10:43:42.463] @process::amplitude WARNING : External state 1 ('g', PDG 21, helicity -) is off shell: p^2 = +2.5e5, expected m^2 = +0e0 (|Δ| = +2.5e5). Fixed-helicity spinor/vector/tensor external states may be ill-defined at this kinematic point.
  2486. 126.32 s > field value
  2487. 126.32 s > span warm_up{integrand.name=se1l_rls_shifted}
  2488. 126.32 s > [2026-08-28 10:43:42.463] @process::amplitude INFO : Input is above threshold: 1 existing threshold E-surfaces across 1/1 graph groups
  2489. 126.32 s > field value
  2490. 126.32 s > existing_esurfaces 1
  2491. 126.32 s > group_count 1
  2492. 126.32 s > groups_above_threshold 1
  2493. 126.32 s > integrand se1l_rls_shifted
  2494. 126.32 s > span warm_up{integrand.name=se1l_rls_shifted}
  2495. 126.32 s > threshold_status above threshold
  2496. 126.32 s > ... omitted 1410 more lines; see full nextest output above
  2497. 126.32 s > =========================================
  2498. 126.32 s For full logs, run:
  2499. 126.32 s nix log /nix/store/ifx25i75mrp4mx011vk3kpahjasmfqfi-gammaloop-nextest-integration.drv
  2500. 126.44 s [0 built (1 failed)]Run failed.