1. 0.20 s $ /nix/store/9ypz3flqsrl5xl495mm8h645gadjsxi1-coreutils-9.11/bin/timeout --kill-after=15s 7200s /nix/store/23zk8sgzamrbmj1fday15szf7f2279s8-nix-2.34.7/bin/nix --extra-experimental-features nix-command --extra-experimental-features flakes flake clone git+https://github.com/alphal00p/gammaloop --dest /tmp/nix-ci-worker/stable-pwd/repo/
  2. 0.25 s Cloning into '/tmp/nix-ci-worker/stable-pwd/repo'...
  3. 0.86 s remote: Enumerating objects: 64185, done.
  4. 0.97 s remote: Counting objects: 0% (1/9551) remote: Counting objects: 1% (96/9551) remote: Counting objects: 2% (192/9551) remote: Counting objects: 3% (287/9551) remote: Counting objects: 4% (383/9551) remote: Counting objects: 5% (478/9551) remote: Counting objects: 6% (574/9551) remote: Counting objects: 7% (669/9551) remote: Counting objects: 8% (765/9551) remote: Counting objects: 9% (860/9551) remote: Counting objects: 10% (956/9551) remote: Counting objects: 11% (1051/9551) remote: Counting objects: 12% (1147/9551) remote: Counting objects: 13% (1242/9551) remote: Counting objects: 14% (1338/9551) remote: Counting objects: 15% (1433/9551) remote: Counting objects: 16% (1529/9551) remote: Counting objects: 17% (1624/9551) remote: Counting objects: 18% (1720/9551) remote: Counting objects: 19% (1815/9551) remote: Counting objects: 20% (1911/9551) remote: Counting objects: 21% (2006/9551) remote: Counting objects: 22% (2102/9551) remote: Counting objects: 23% (2197/9551) remote: Counting objects: 24% (2293/9551) remote: Counting objects: 25% (2388/9551) remote: Counting objects: 26% (2484/9551) remote: Counting objects: 27% (2579/9551) remote: Counting objects: 28% (2675/9551) remote: Counting objects: 29% (2770/9551) remote: Counting objects: 30% (2866/9551) remote: Counting objects: 31% (2961/9551) remote: Counting objects: 32% (3057/9551) remote: Counting objects: 33% (3152/9551) remote: Counting objects: 34% (3248/9551) remote: Counting objects: 35% (3343/9551) remote: Counting objects: 36% (3439/9551) remote: Counting objects: 37% (3534/9551) remote: Counting objects: 38% (3630/9551) remote: Counting objects: 39% (3725/9551) remote: Counting objects: 40% (3821/9551) remote: Counting objects: 41% (3916/9551) remote: Counting objects: 42% (4012/9551) remote: Counting objects: 43% (4107/9551) remote: Counting objects: 44% (4203/9551) remote: Counting objects: 45% (4298/9551) remote: Counting objects: 46% (4394/9551) remote: Counting objects: 47% (4489/9551) remote: Counting objects: 48% (4585/9551) remote: Counting objects: 49% (4680/9551) remote: Counting objects: 50% (4776/9551) remote: Counting objects: 51% (4872/9551) remote: Counting objects: 52% (4967/9551) remote: Counting objects: 53% (5063/9551) remote: Counting objects: 54% (5158/9551) remote: Counting objects: 55% (5254/9551) remote: Counting objects: 56% (5349/9551) remote: Counting objects: 57% (5445/9551) remote: Counting objects: 58% (5540/9551) remote: Counting objects: 59% (5636/9551) remote: Counting objects: 60% (5731/9551) remote: Counting objects: 61% (5827/9551) remote: Counting objects: 62% (5922/9551) remote: Counting objects: 63% (6018/9551) remote: Counting objects: 64% (6113/9551) remote: Counting objects: 65% (6209/9551) remote: Counting objects: 66% (6304/9551) remote: Counting objects: 67% (6400/9551) remote: Counting objects: 68% (6495/9551) remote: Counting objects: 69% (6591/9551) remote: Counting objects: 70% (6686/9551) remote: Counting objects: 71% (6782/9551) remote: Counting objects: 72% (6877/9551) remote: Counting objects: 73% (6973/9551) remote: Counting objects: 74% (7068/9551) remote: Counting objects: 75% (7164/9551) remote: Counting objects: 76% (7259/9551) remote: Counting objects: 77% (7355/9551) remote: Counting objects: 78% (7450/9551) remote: Counting objects: 79% (7546/9551) remote: Counting objects: 80% (7641/9551) remote: Counting objects: 81% (7737/9551) remote: Counting objects: 82% (7832/9551) remote: Counting objects: 83% (7928/9551) remote: Counting objects: 84% (8023/9551) remote: Counting objects: 85% (8119/9551) remote: Counting objects: 86% (8214/9551) remote: Counting objects: 87% (8310/9551) remote: Counting objects: 88% (8405/9551) remote: Counting objects: 89% (8501/9551) remote: Counting objects: 90% (8596/9551) remote: Counting objects: 91% (8692/9551) remote: Counting objects: 92% (8787/9551) remote: Counting objects: 93% (8883/9551) remote: Counting objects: 94% (8978/9551) remote: Counting objects: 95% (9074/9551) remote: Counting objects: 96% (9169/9551) remote: Counting objects: 97% (9265/9551) remote: Counting objects: 98% (9360/9551) remote: Counting objects: 99% (9456/9551) remote: Counting objects: 100% (9551/9551) remote: Counting objects: 100% (9551/9551), done.
  5. 3.16 s remote: Compressing objects: 0% (1/2326) remote: Compressing objects: 1% (24/2326) remote: Compressing objects: 2% (47/2326) remote: Compressing objects: 3% (70/2326) remote: Compressing objects: 4% (94/2326) remote: Compressing objects: 5% (117/2326) remote: Compressing objects: 6% (140/2326) remote: Compressing objects: 7% (163/2326) remote: Compressing objects: 8% (187/2326) remote: Compressing objects: 9% (210/2326) remote: Compressing objects: 10% (233/2326) remote: Compressing objects: 11% (256/2326) remote: Compressing objects: 12% (280/2326) remote: Compressing objects: 13% (303/2326) remote: Compressing objects: 14% (326/2326) remote: Compressing objects: 15% (349/2326) remote: Compressing objects: 16% (373/2326) remote: Compressing objects: 17% (396/2326) remote: Compressing objects: 18% (419/2326) remote: Compressing objects: 19% (442/2326) remote: Compressing objects: 20% (466/2326) remote: Compressing objects: 21% (489/2326) remote: Compressing objects: 22% (512/2326) remote: Compressing objects: 23% (535/2326) remote: Compressing objects: 23% (553/2326) remote: Compressing objects: 24% (559/2326) remote: Compressing objects: 25% (582/2326) remote: Compressing objects: 26% (605/2326) remote: Compressing objects: 27% (629/2326) remote: Compressing objects: 28% (652/2326) remote: Compressing objects: 29% (675/2326) remote: Compressing objects: 30% (698/2326) remote: Compressing objects: 31% (722/2326) remote: Compressing objects: 32% (745/2326) remote: Compressing objects: 32% (762/2326) remote: Compressing objects: 33% (768/2326) remote: Compressing objects: 34% (791/2326) remote: Compressing objects: 35% (815/2326) remote: Compressing objects: 36% (838/2326) remote: Compressing objects: 37% (861/2326) remote: Compressing objects: 38% (884/2326) remote: Compressing objects: 39% (908/2326) remote: Compressing objects: 40% (931/2326) remote: Compressing objects: 41% (954/2326) remote: Compressing objects: 42% (977/2326) remote: Compressing objects: 43% (1001/2326) remote: Compressing objects: 44% (1024/2326) remote: Compressing objects: 45% (1047/2326) remote: Compressing objects: 46% (1070/2326) remote: Compressing objects: 47% (1094/2326) remote: Compressing objects: 48% (1117/2326) remote: Compressing objects: 49% (1140/2326) remote: Compressing objects: 50% (1163/2326) remote: Compressing objects: 51% (1187/2326) remote: Compressing objects: 52% (1210/2326) remote: Compressing objects: 53% (1233/2326) remote: Compressing objects: 54% (1257/2326) remote: Compressing objects: 55% (1280/2326) remote: Compressing objects: 56% (1303/2326) remote: Compressing objects: 57% (1326/2326) remote: Compressing objects: 58% (1350/2326) remote: Compressing objects: 59% (1373/2326) remote: Compressing objects: 60% (1396/2326) remote: Compressing objects: 61% (1419/2326) remote: Compressing objects: 62% (1443/2326) remote: Compressing objects: 63% (1466/2326) remote: Compressing objects: 64% (1489/2326) remote: Compressing objects: 65% (1512/2326) remote: Compressing objects: 66% (1536/2326) remote: Compressing objects: 67% (1559/2326) remote: Compressing objects: 68% (1582/2326) remote: Compressing objects: 69% (1605/2326) remote: Compressing objects: 70% (1629/2326) remote: Compressing objects: 71% (1652/2326) remote: Compressing objects: 72% (1675/2326) remote: Compressing objects: 73% (1698/2326) remote: Compressing objects: 74% (1722/2326) remote: Compressing objects: 75% (1745/2326) remote: Compressing objects: 76% (1768/2326) remote: Compressing objects: 77% (1792/2326) remote: Compressing objects: 78% (1815/2326) remote: Compressing objects: 79% (1838/2326) remote: Compressing objects: 80% (1861/2326) remote: Compressing objects: 81% (1885/2326) remote: Compressing objects: 82% (1908/2326) remote: Compressing objects: 83% (1931/2326) remote: Compressing objects: 84% (1954/2326) remote: Compressing objects: 85% (1978/2326) remote: Compressing objects: 86% (2001/2326) remote: Compressing objects: 87% (2024/2326) remote: Compressing objects: 88% (2047/2326) remote: Compressing objects: 89% (2071/2326) remote: Compressing objects: 90% (2094/2326) remote: Compressing objects: 91% (2117/2326) remote: Compressing objects: 92% (2140/2326) remote: Compressing objects: 93% (2164/2326) remote: Compressing objects: 94% (2187/2326) remote: Compressing objects: 95% (2210/2326) remote: Compressing objects: 96% (2233/2326) remote: Compressing objects: 97% (2257/2326) remote: Compressing objects: 98% (2280/2326) remote: Compressing objects: 99% (2303/2326) remote: Compressing objects: 100% (2326/2326) remote: Compressing objects: 100% (2326/2326), done.
  6. 6.60 s Receiving objects: 0% (1/64185) Receiving objects: 1% (642/64185) Receiving objects: 2% (1284/64185) Receiving objects: 3% (1926/64185) Receiving objects: 4% (2568/64185) Receiving objects: 5% (3210/64185) Receiving objects: 6% (3852/64185) Receiving objects: 7% (4493/64185) Receiving objects: 8% (5135/64185) Receiving objects: 9% (5777/64185) Receiving objects: 10% (6419/64185), 10.25 MiB | 20.49 MiB/s Receiving objects: 11% (7061/64185), 10.25 MiB | 20.49 MiB/s Receiving objects: 12% (7703/64185), 10.25 MiB | 20.49 MiB/s Receiving objects: 13% (8345/64185), 10.25 MiB | 20.49 MiB/s Receiving objects: 14% (8986/64185), 10.25 MiB | 20.49 MiB/s Receiving objects: 15% (9628/64185), 10.25 MiB | 20.49 MiB/s Receiving objects: 16% (10270/64185), 10.25 MiB | 20.49 MiB/s Receiving objects: 17% (10912/64185), 10.25 MiB | 20.49 MiB/s Receiving objects: 18% (11554/64185), 10.25 MiB | 20.49 MiB/s Receiving objects: 19% (12196/64185), 10.25 MiB | 20.49 MiB/s Receiving objects: 20% (12837/64185), 10.25 MiB | 20.49 MiB/s Receiving objects: 21% (13479/64185), 10.25 MiB | 20.49 MiB/s Receiving objects: 22% (14121/64185), 10.25 MiB | 20.49 MiB/s Receiving objects: 23% (14763/64185), 10.25 MiB | 20.49 MiB/s Receiving objects: 24% (15405/64185), 10.25 MiB | 20.49 MiB/s Receiving objects: 25% (16047/64185), 10.25 MiB | 20.49 MiB/s Receiving objects: 26% (16689/64185), 10.25 MiB | 20.49 MiB/s Receiving objects: 27% (17330/64185), 10.25 MiB | 20.49 MiB/s Receiving objects: 28% (17972/64185), 10.25 MiB | 20.49 MiB/s Receiving objects: 29% (18614/64185), 10.25 MiB | 20.49 MiB/s Receiving objects: 30% (19256/64185), 10.25 MiB | 20.49 MiB/s Receiving objects: 31% (19898/64185), 10.25 MiB | 20.49 MiB/s Receiving objects: 32% (20540/64185), 10.25 MiB | 20.49 MiB/s Receiving objects: 33% (21182/64185), 10.25 MiB | 20.49 MiB/s Receiving objects: 34% (21823/64185), 10.25 MiB | 20.49 MiB/s Receiving objects: 35% (22465/64185), 10.25 MiB | 20.49 MiB/s Receiving objects: 36% (23107/64185), 10.25 MiB | 20.49 MiB/s Receiving objects: 37% (23749/64185), 10.25 MiB | 20.49 MiB/s Receiving objects: 38% (24391/64185), 10.25 MiB | 20.49 MiB/s Receiving objects: 39% (25033/64185), 10.25 MiB | 20.49 MiB/s Receiving objects: 40% (25674/64185), 10.25 MiB | 20.49 MiB/s Receiving objects: 41% (26316/64185), 10.25 MiB | 20.49 MiB/s Receiving objects: 42% (26958/64185), 10.25 MiB | 20.49 MiB/s Receiving objects: 43% (27600/64185), 10.25 MiB | 20.49 MiB/s Receiving objects: 44% (28242/64185), 10.25 MiB | 20.49 MiB/s Receiving objects: 45% (28884/64185), 10.25 MiB | 20.49 MiB/s Receiving objects: 46% (29526/64185), 10.25 MiB | 20.49 MiB/s Receiving objects: 47% (30167/64185), 10.25 MiB | 20.49 MiB/s Receiving objects: 48% (30809/64185), 10.25 MiB | 20.49 MiB/s Receiving objects: 49% (31451/64185), 10.25 MiB | 20.49 MiB/s Receiving objects: 50% (32093/64185), 10.25 MiB | 20.49 MiB/s Receiving objects: 51% (32735/64185), 10.25 MiB | 20.49 MiB/s Receiving objects: 51% (32787/64185), 29.12 MiB | 29.15 MiB/s Receiving objects: 52% (33377/64185), 29.12 MiB | 29.15 MiB/s Receiving objects: 53% (34019/64185), 29.12 MiB | 29.15 MiB/s Receiving objects: 54% (34660/64185), 29.12 MiB | 29.15 MiB/s Receiving objects: 55% (35302/64185), 29.12 MiB | 29.15 MiB/s Receiving objects: 56% (35944/64185), 29.12 MiB | 29.15 MiB/s Receiving objects: 57% (36586/64185), 29.12 MiB | 29.15 MiB/s Receiving objects: 58% (37228/64185), 29.12 MiB | 29.15 MiB/s Receiving objects: 59% (37870/64185), 29.12 MiB | 29.15 MiB/s Receiving objects: 60% (38511/64185), 29.12 MiB | 29.15 MiB/s Receiving objects: 61% (39153/64185), 29.12 MiB | 29.15 MiB/s Receiving objects: 62% (39795/64185), 46.55 MiB | 31.01 MiB/s Receiving objects: 63% (40437/64185), 46.55 MiB | 31.01 MiB/s Receiving objects: 64% (41079/64185), 46.55 MiB | 31.01 MiB/s Receiving objects: 65% (41721/64185), 46.55 MiB | 31.01 MiB/s Receiving objects: 66% (42363/64185), 46.55 MiB | 31.01 MiB/s Receiving objects: 67% (43004/64185), 46.55 MiB | 31.01 MiB/s Receiving objects: 68% (43646/64185), 46.55 MiB | 31.01 MiB/s Receiving objects: 69% (44288/64185), 46.55 MiB | 31.01 MiB/s Receiving objects: 70% (44930/64185), 46.55 MiB | 31.01 MiB/s Receiving objects: 71% (45572/64185), 46.55 MiB | 31.01 MiB/s Receiving objects: 72% (46214/64185), 46.55 MiB | 31.01 MiB/s Receiving objects: 73% (46856/64185), 46.55 MiB | 31.01 MiB/s Receiving objects: 74% (47497/64185), 46.55 MiB | 31.01 MiB/s Receiving objects: 74% (47872/64185), 62.33 MiB | 31.15 MiB/s Receiving objects: 75% (48139/64185), 62.33 MiB | 31.15 MiB/s Receiving objects: 76% (48781/64185), 62.33 MiB | 31.15 MiB/s Receiving objects: 77% (49423/64185), 62.33 MiB | 31.15 MiB/s Receiving objects: 78% (50065/64185), 62.33 MiB | 31.15 MiB/s Receiving objects: 79% (50707/64185), 62.33 MiB | 31.15 MiB/s Receiving objects: 80% (51348/64185), 62.33 MiB | 31.15 MiB/s Receiving objects: 81% (51990/64185), 62.33 MiB | 31.15 MiB/s Receiving objects: 82% (52632/64185), 76.70 MiB | 30.68 MiB/s Receiving objects: 83% (53274/64185), 76.70 MiB | 30.68 MiB/s Receiving objects: 84% (53916/64185), 76.70 MiB | 30.68 MiB/s Receiving objects: 85% (54558/64185), 76.70 MiB | 30.68 MiB/s Receiving objects: 86% (55200/64185), 76.70 MiB | 30.68 MiB/s Receiving objects: 87% (55841/64185), 76.70 MiB | 30.68 MiB/s Receiving objects: 88% (56483/64185), 76.70 MiB | 30.68 MiB/s Receiving objects: 89% (57125/64185), 76.70 MiB | 30.68 MiB/s Receiving objects: 90% (57767/64185), 76.70 MiB | 30.68 MiB/s Receiving objects: 90% (57775/64185), 76.70 MiB | 30.68 MiB/s Receiving objects: 91% (58409/64185), 87.82 MiB | 29.27 MiB/s Receiving objects: 92% (59051/64185), 87.82 MiB | 29.27 MiB/s Receiving objects: 93% (59693/64185), 87.82 MiB | 29.27 MiB/s Receiving objects: 94% (60334/64185), 87.82 MiB | 29.27 MiB/s Receiving objects: 95% (60976/64185), 87.82 MiB | 29.27 MiB/s Receiving objects: 96% (61618/64185), 87.82 MiB | 29.27 MiB/s Receiving objects: 97% (62260/64185), 87.82 MiB | 29.27 MiB/s Receiving objects: 98% (62902/64185), 87.82 MiB | 29.27 MiB/s Receiving objects: 99% (63544/64185), 87.82 MiB | 29.27 MiB/s remote: Total 64185 (delta 7397), reused 7776 (delta 6680), pack-reused 54634 (from 3)
  7. 6.69 s Receiving objects: 100% (64185/64185), 87.82 MiB | 29.27 MiB/s Receiving objects: 100% (64185/64185), 97.84 MiB | 28.50 MiB/s, done.
  8. 7.29 s Resolving deltas: 0% (0/44316) Resolving deltas: 1% (444/44316) Resolving deltas: 2% (888/44316) Resolving deltas: 3% (1330/44316) Resolving deltas: 4% (1775/44316) Resolving deltas: 5% (2216/44316) Resolving deltas: 6% (2660/44316) Resolving deltas: 7% (3103/44316) Resolving deltas: 8% (3546/44316) Resolving deltas: 9% (3989/44316) Resolving deltas: 10% (4432/44316) Resolving deltas: 11% (4875/44316) Resolving deltas: 12% (5318/44316) Resolving deltas: 13% (5762/44316) Resolving deltas: 14% (6205/44316) Resolving deltas: 15% (6649/44316) Resolving deltas: 16% (7091/44316) Resolving deltas: 17% (7534/44316) Resolving deltas: 18% (7979/44316) Resolving deltas: 19% (8426/44316) Resolving deltas: 20% (8864/44316) Resolving deltas: 21% (9307/44316) Resolving deltas: 22% (9750/44316) Resolving deltas: 23% (10194/44316) Resolving deltas: 24% (10636/44316) Resolving deltas: 25% (11079/44316) Resolving deltas: 26% (11523/44316) Resolving deltas: 27% (11967/44316) Resolving deltas: 28% (12409/44316) Resolving deltas: 29% (12852/44316) Resolving deltas: 30% (13295/44316) Resolving deltas: 31% (13738/44316) Resolving deltas: 32% (14182/44316) Resolving deltas: 33% (14625/44316) Resolving deltas: 34% (15068/44316) Resolving deltas: 35% (15511/44316) Resolving deltas: 36% (15954/44316) Resolving deltas: 37% (16397/44316) Resolving deltas: 38% (16841/44316) Resolving deltas: 39% (17284/44316) Resolving deltas: 40% (17727/44316) Resolving deltas: 41% (18170/44316) Resolving deltas: 42% (18613/44316) Resolving deltas: 43% (19056/44316) Resolving deltas: 44% (19500/44316) Resolving deltas: 45% (19943/44316) Resolving deltas: 46% (20387/44316) Resolving deltas: 47% (20829/44316) Resolving deltas: 48% (21273/44316) Resolving deltas: 49% (21715/44316) Resolving deltas: 50% (22158/44316) Resolving deltas: 51% (22602/44316) Resolving deltas: 52% (23045/44316) Resolving deltas: 53% (23488/44316) Resolving deltas: 54% (23931/44316) Resolving deltas: 55% (24374/44316) Resolving deltas: 56% (24817/44316) Resolving deltas: 57% (25261/44316) Resolving deltas: 58% (25704/44316) Resolving deltas: 59% (26147/44316) Resolving deltas: 60% (26590/44316) Resolving deltas: 61% (27033/44316) Resolving deltas: 62% (27476/44316) Resolving deltas: 63% (27920/44316) Resolving deltas: 64% (28363/44316) Resolving deltas: 65% (28806/44316) Resolving deltas: 66% (29250/44316) Resolving deltas: 67% (29692/44316) Resolving deltas: 68% (30137/44316) Resolving deltas: 69% (30579/44316) Resolving deltas: 70% (31022/44316) Resolving deltas: 71% (31465/44316) Resolving deltas: 72% (31908/44316) Resolving deltas: 73% (32351/44316) Resolving deltas: 74% (32794/44316) Resolving deltas: 75% (33237/44316) Resolving deltas: 76% (33681/44316) Resolving deltas: 77% (34124/44316) Resolving deltas: 78% (34572/44316) Resolving deltas: 79% (35010/44316) Resolving deltas: 80% (35453/44316) Resolving deltas: 81% (35896/44316) Resolving deltas: 82% (36340/44316) Resolving deltas: 83% (36783/44316) Resolving deltas: 84% (37226/44316) Resolving deltas: 85% (37671/44316) Resolving deltas: 86% (38112/44316) Resolving deltas: 87% (38555/44316) Resolving deltas: 88% (38999/44316) Resolving deltas: 89% (39442/44316) Resolving deltas: 90% (39885/44316) Resolving deltas: 91% (40329/44316) Resolving deltas: 92% (40771/44316) Resolving deltas: 93% (41214/44316) Resolving deltas: 94% (41658/44316) Resolving deltas: 95% (42101/44316) Resolving deltas: 96% (42544/44316) Resolving deltas: 97% (42987/44316) Resolving deltas: 98% (43430/44316) Resolving deltas: 99% (43873/44316) Resolving deltas: 100% (44316/44316) Resolving deltas: 100% (44316/44316), done.
  9. 7.58 s Fetching commit e848309923f9136d533613bb15d1029beb045263 for push-vrpyqyylypmw ...
  10. 7.58 s $ /nix/store/bcnisk3ydfgv26v2gw3zlky24g00yww2-git-2.54.0/bin/git fetch origin e848309923f9136d533613bb15d1029beb045263
  11. 8.09 s From https://github.com/alphal00p/gammaloop
  12. 8.09 s * branch e848309923f9136d533613bb15d1029beb045263 -> FETCH_HEAD
  13. 8.10 s $ /nix/store/9ypz3flqsrl5xl495mm8h645gadjsxi1-coreutils-9.11/bin/timeout --kill-after=15s 7200s /nix/store/bcnisk3ydfgv26v2gw3zlky24g00yww2-git-2.54.0/bin/git -c advice.detachedHead=false checkout e848309923f9136d533613bb15d1029beb045263
  14. 8.25 s HEAD is now at e8483099 fix Python extension artifact builds
  15. 8.25 s $ /nix/store/9ypz3flqsrl5xl495mm8h645gadjsxi1-coreutils-9.11/bin/timeout --kill-after=15s 7200s /nix/store/23zk8sgzamrbmj1fday15szf7f2279s8-nix-2.34.7/bin/nix --extra-experimental-features nix-command --extra-experimental-features flakes --log-format internal-json run .#packages.x86_64-linux.nix-ci-check-gammaloop-doctest --print-build-logs
  16. 12.85 s
  17. 14.41 s Downloading cached xgcc-15.2.0-libgcc from https://cache.nix-ci.com
  18. 14.47 s Downloading cached busybox from https://cache.nix-ci.com
  19. 14.47 s Downloading cached cargo-git-https-github.com-symbolica-dev-symbolica from https://cache.nix-ci.com
  20. 14.47 s Downloading cached cargo-package-adler2 from https://cache.nix-ci.com
  21. 14.47 s Downloading cached cargo-package-addr2line from https://cache.nix-ci.com
  22. 14.47 s Downloading cached cargo-package-ahash from https://cache.nix-ci.com
  23. 14.47 s Downloading cached cargo-package-ahash from https://cache.nix-ci.com
  24. 14.47 s Downloading cached cargo-package-aho-corasick from https://cache.nix-ci.com
  25. 14.47 s Downloading cached cargo-package-alloc-no-stdlib from https://cache.nix-ci.com
  26. 14.47 s Downloading cached cargo-package-allocator-api2 from https://cache.nix-ci.com
  27. 14.47 s Downloading cached cargo-package-amd from https://cache.nix-ci.com
  28. 14.47 s Downloading cached cargo-package-alloc-stdlib from https://cache.nix-ci.com
  29. 14.47 s Downloading cached cargo-package-android_system_properties from https://cache.nix-ci.com
  30. 14.47 s Downloading cached cargo-package-anes from https://cache.nix-ci.com
  31. 14.47 s Downloading cached cargo-package-ansitok from https://cache.nix-ci.com
  32. 14.47 s Downloading cached cargo-package-ansi-str from https://cache.nix-ci.com
  33. 14.50 s Downloaded cached xgcc-15.2.0-libgcc (193 KiB) in 84ms
  34. 14.50 s Progress: 0 of 1 built, 1 of 675 downloaded from cache (15 downloading)
  35. 14.50 s Downloading cached cargo-package-anstream from https://cache.nix-ci.com
  36. 14.51 s Downloaded cached busybox (230 KiB) in 39ms
  37. 14.51 s Progress: 0 of 1 built, 2 of 675 downloaded from cache (15 downloading)
  38. 14.51 s Downloading cached cargo-package-anstyle from https://cache.nix-ci.com
  39. 14.62 s Downloaded cached cargo-package-ansi-str (111 KiB) in 150ms
  40. 14.62 s Progress: 0 of 1 built, 3 of 675 downloaded from cache (15 downloading)
  41. 14.62 s Downloading cached cargo-package-anstyle-parse from https://cache.nix-ci.com
  42. 14.62 s Downloaded cached cargo-package-ahash (181 KiB) in 154ms
  43. 14.62 s Progress: 0 of 1 built, 4 of 675 downloaded from cache (15 downloading)
  44. 14.62 s Downloading cached cargo-package-anstyle-query from https://cache.nix-ci.com
  45. 14.65 s Downloaded cached cargo-package-alloc-stdlib (37 KiB) in 185ms
  46. 14.65 s Progress: 0 of 1 built, 5 of 675 downloaded from cache (15 downloading)
  47. 14.65 s Downloaded cached cargo-package-adler2 (41 KiB) in 186ms
  48. 14.65 s Downloaded cached cargo-package-alloc-no-stdlib (56 KiB) in 186ms
  49. 14.65 s Downloading cached cargo-package-anstyle-wincon from https://cache.nix-ci.com
  50. 14.65 s Downloaded cached cargo-package-amd (100 KiB) in 187ms
  51. 14.66 s Downloaded cached cargo-package-aho-corasick (826 KiB) in 188ms
  52. 14.66 s Progress: 0 of 1 built, 6 of 675 downloaded from cache (15 downloading)
  53. 14.66 s Downloaded cached cargo-package-android_system_properties (16 KiB) in 188ms
  54. 14.66 s Progress: 0 of 1 built, 7 of 675 downloaded from cache (14 downloading)
  55. 14.66 s Progress: 0 of 1 built, 8 of 675 downloaded from cache (13 downloading)
  56. 14.66 s Progress: 0 of 1 built, 9 of 675 downloaded from cache (12 downloading)
  57. 14.66 s Downloaded cached cargo-package-allocator-api2 (292 KiB) in 189ms
  58. 14.66 s Downloading cached cargo-package-anyhow from https://cache.nix-ci.com
  59. 14.66 s Downloading cached cargo-package-append-only-vec from https://cache.nix-ci.com
  60. 14.66 s Downloading cached cargo-package-approx from https://cache.nix-ci.com
  61. 14.66 s Downloading cached cargo-package-approx from https://cache.nix-ci.com
  62. 14.66 s Downloaded cached cargo-package-anes (129 KiB) in 190ms
  63. 14.66 s Downloaded cached cargo-package-ansitok (83 KiB) in 190ms
  64. 14.66 s Progress: 0 of 1 built, 10 of 675 downloaded from cache (15 downloading)
  65. 14.66 s Progress: 0 of 1 built, 11 of 675 downloaded from cache (14 downloading)
  66. 14.66 s Progress: 0 of 1 built, 12 of 675 downloaded from cache (13 downloading)
  67. 14.66 s Progress: 0 of 1 built, 13 of 675 downloaded from cache (12 downloading)
  68. 14.66 s Downloaded cached cargo-package-anstyle (76 KiB) in 150ms
  69. 14.66 s Downloading cached cargo-package-arrayvec from https://cache.nix-ci.com
  70. 14.66 s Downloading cached cargo-package-arrayref from https://cache.nix-ci.com
  71. 14.66 s Downloading cached cargo-package-ascii from https://cache.nix-ci.com
  72. 14.66 s Downloading cached cargo-package-astro-float from https://cache.nix-ci.com
  73. 14.66 s Progress: 0 of 1 built, 14 of 675 downloaded from cache (15 downloading)
  74. 14.66 s Downloaded cached cargo-package-addr2line (174 KiB) in 192ms
  75. 14.66 s Downloading cached cargo-package-astro-float-macro from https://cache.nix-ci.com
  76. 14.66 s Downloaded cached cargo-package-anstream (124 KiB) in 162ms
  77. 14.66 s Progress: 0 of 1 built, 15 of 675 downloaded from cache (15 downloading)
  78. 14.66 s Downloaded cached cargo-package-ahash (168 KiB) in 193ms
  79. 14.66 s Progress: 0 of 1 built, 16 of 675 downloaded from cache (14 downloading)
  80. 14.66 s Downloading cached cargo-package-astro-float-num from https://cache.nix-ci.com
  81. 14.66 s Downloading cached cargo-package-atomic from https://cache.nix-ci.com
  82. 14.66 s Progress: 0 of 1 built, 17 of 675 downloaded from cache (15 downloading)
  83. 14.66 s Downloading cached cargo-package-autocfg from https://cache.nix-ci.com
  84. 14.66 s Downloaded cached cargo-package-anstyle-parse (105 KiB) in 44ms
  85. 14.67 s Progress: 0 of 1 built, 18 of 675 downloaded from cache (15 downloading)
  86. 14.67 s Downloading cached cargo-package-az from https://cache.nix-ci.com
  87. 14.67 s Downloaded cached cargo-package-anstyle-query (31 KiB) in 43ms
  88. 14.67 s Progress: 0 of 1 built, 19 of 675 downloaded from cache (15 downloading)
  89. 14.67 s Downloading cached cargo-package-backtrace from https://cache.nix-ci.com
  90. 14.67 s Downloaded cached cargo-git-https-github.com-symbolica-dev-symbolica (6.5 MiB) in 206ms
  91. 14.67 s Progress: 0 of 1 built, 20 of 675 downloaded from cache (15 downloading)
  92. 14.67 s Downloading cached cargo-package-base62 from https://cache.nix-ci.com
  93. 14.72 s Downloaded cached cargo-package-anstyle-wincon (46 KiB) in 64ms
  94. 14.72 s Progress: 0 of 1 built, 21 of 675 downloaded from cache (15 downloading)
  95. 14.72 s Downloading cached cargo-package-base64 from https://cache.nix-ci.com
  96. 14.73 s Downloaded cached cargo-package-append-only-vec (47 KiB) in 68ms
  97. 14.73 s Progress: 0 of 1 built, 22 of 675 downloaded from cache (15 downloading)
  98. 14.73 s Downloading cached cargo-package-base64 from https://cache.nix-ci.com
  99. 14.73 s Downloaded cached cargo-package-arrayref (32 KiB) in 69ms
  100. 14.73 s Progress: 0 of 1 built, 23 of 675 downloaded from cache (15 downloading)
  101. 14.73 s Downloading cached cargo-package-bincode from https://cache.nix-ci.com
  102. 14.73 s Downloaded cached cargo-package-astro-float (49 KiB) in 75ms
  103. 14.73 s Progress: 0 of 1 built, 24 of 675 downloaded from cache (15 downloading)
  104. 14.73 s Downloaded cached cargo-package-astro-float-macro (22 KiB) in 74ms
  105. 14.74 s Downloaded cached cargo-package-arrayvec (128 KiB) in 76ms
  106. 14.74 s Downloading cached cargo-package-bincode from https://cache.nix-ci.com
  107. 14.74 s Progress: 0 of 1 built, 25 of 675 downloaded from cache (15 downloading)
  108. 14.74 s Progress: 0 of 1 built, 26 of 675 downloaded from cache (14 downloading)
  109. 14.74 s Downloading cached cargo-package-bincode-trait-derive from https://cache.nix-ci.com
  110. 14.74 s Downloading cached cargo-package-bincode_derive from https://cache.nix-ci.com
  111. 14.74 s Downloaded cached cargo-package-approx (97 KiB) in 81ms
  112. 14.74 s Progress: 0 of 1 built, 27 of 675 downloaded from cache (15 downloading)
  113. 14.74 s Downloading cached cargo-package-bit-set from https://cache.nix-ci.com
  114. 14.74 s Downloaded cached cargo-package-atomic (68 KiB) in 79ms
  115. 14.74 s Progress: 0 of 1 built, 28 of 675 downloaded from cache (15 downloading)
  116. 14.74 s Downloading cached cargo-package-bit-set from https://cache.nix-ci.com
  117. 14.75 s Downloaded cached cargo-package-autocfg (65 KiB) in 83ms
  118. 14.75 s Progress: 0 of 1 built, 29 of 675 downloaded from cache (15 downloading)
  119. 14.75 s Downloaded cached cargo-package-approx (103 KiB) in 92ms
  120. 14.75 s Downloaded cached cargo-package-astro-float-num (833 KiB) in 88ms
  121. 14.75 s Downloading cached cargo-package-bit-vec from https://cache.nix-ci.com
  122. 14.75 s Progress: 0 of 1 built, 30 of 675 downloaded from cache (15 downloading)
  123. 14.75 s Progress: 0 of 1 built, 31 of 675 downloaded from cache (14 downloading)
  124. 14.75 s Downloaded cached cargo-package-az (220 KiB) in 84ms
  125. 14.75 s Downloading cached cargo-package-bit-vec from https://cache.nix-ci.com
  126. 14.75 s Downloading cached cargo-package-bitflags from https://cache.nix-ci.com
  127. 14.75 s Downloaded cached cargo-package-ascii (165 KiB) in 94ms
  128. 14.75 s Progress: 0 of 1 built, 32 of 675 downloaded from cache (15 downloading)
  129. 14.75 s Progress: 0 of 1 built, 33 of 675 downloaded from cache (14 downloading)
  130. 14.75 s Downloaded cached cargo-package-anyhow (239 KiB) in 97ms
  131. 14.76 s Downloading cached cargo-package-bitflags from https://cache.nix-ci.com
  132. 14.76 s Downloading cached cargo-package-bitvec from https://cache.nix-ci.com
  133. 14.76 s Progress: 0 of 1 built, 34 of 675 downloaded from cache (15 downloading)
  134. 14.76 s Downloaded cached cargo-package-backtrace (341 KiB) in 89ms
  135. 14.76 s Downloading cached cargo-package-blake3 from https://cache.nix-ci.com
  136. 14.76 s Progress: 0 of 1 built, 35 of 675 downloaded from cache (15 downloading)
  137. 14.76 s Downloading cached cargo-package-block-buffer from https://cache.nix-ci.com
  138. 14.76 s Downloaded cached cargo-package-base62 (79 KiB) in 88ms
  139. 14.76 s Progress: 0 of 1 built, 36 of 675 downloaded from cache (15 downloading)
  140. 14.77 s Downloading cached cargo-package-block2 from https://cache.nix-ci.com
  141. 14.78 s Downloaded cached cargo-package-base64 (349 KiB) in 53ms
  142. 14.78 s Progress: 0 of 1 built, 37 of 675 downloaded from cache (15 downloading)
  143. 14.78 s Downloading cached cargo-package-brotli from https://cache.nix-ci.com
  144. 14.78 s Downloaded cached cargo-package-bincode (156 KiB) in 48ms
  145. 14.78 s Progress: 0 of 1 built, 38 of 675 downloaded from cache (15 downloading)
  146. 14.78 s Downloaded cached cargo-package-base64 (343 KiB) in 53ms
  147. 14.78 s Downloading cached cargo-package-brotli from https://cache.nix-ci.com
  148. 14.78 s Progress: 0 of 1 built, 39 of 675 downloaded from cache (15 downloading)
  149. 14.79 s Downloading cached cargo-package-brotli-decompressor from https://cache.nix-ci.com
  150. 14.80 s Downloaded cached cargo-package-bincode_derive (47 KiB) in 58ms
  151. 14.80 s Progress: 0 of 1 built, 40 of 675 downloaded from cache (15 downloading)
  152. 14.80 s Downloaded cached cargo-package-bincode (395 KiB) in 62ms
  153. 14.80 s Downloaded cached cargo-package-bit-set (60 KiB) in 57ms
  154. 14.80 s Downloading cached cargo-package-brotli-decompressor from https://cache.nix-ci.com
  155. 14.80 s Progress: 0 of 1 built, 41 of 675 downloaded from cache (15 downloading)
  156. 14.80 s Progress: 0 of 1 built, 42 of 675 downloaded from cache (14 downloading)
  157. 14.80 s Downloading cached cargo-package-bstr from https://cache.nix-ci.com
  158. 14.80 s Downloading cached cargo-package-bumpalo from https://cache.nix-ci.com
  159. 14.80 s Downloaded cached cargo-package-bincode-trait-derive (29 KiB) in 64ms
  160. 14.80 s Progress: 0 of 1 built, 43 of 675 downloaded from cache (15 downloading)
  161. 14.80 s Downloading cached cargo-package-bytecheck from https://cache.nix-ci.com
  162. 14.82 s Downloaded cached cargo-package-bit-set (69 KiB) in 70ms
  163. 14.82 s Progress: 0 of 1 built, 44 of 675 downloaded from cache (15 downloading)
  164. 14.82 s Downloading cached cargo-package-bytecheck_derive from https://cache.nix-ci.com
  165. 14.82 s Downloaded cached cargo-package-bit-vec (124 KiB) in 68ms
  166. 14.82 s Progress: 0 of 1 built, 45 of 675 downloaded from cache (15 downloading)
  167. 14.82 s Downloading cached cargo-package-bytecount from https://cache.nix-ci.com
  168. 14.82 s Downloaded cached cargo-package-bitflags (103 KiB) in 71ms
  169. 14.82 s Progress: 0 of 1 built, 46 of 675 downloaded from cache (15 downloading)
  170. 14.83 s Downloading cached cargo-package-bytemuck from https://cache.nix-ci.com
  171. 14.83 s Downloaded cached cargo-package-bit-vec (99 KiB) in 77ms
  172. 14.83 s Progress: 0 of 1 built, 47 of 675 downloaded from cache (15 downloading)
  173. 14.83 s Downloading cached cargo-package-byteorder from https://cache.nix-ci.com
  174. 14.83 s Downloaded cached cargo-package-block-buffer (36 KiB) in 69ms
  175. 14.83 s Progress: 0 of 1 built, 48 of 675 downloaded from cache (15 downloading)
  176. 14.83 s Downloading cached cargo-package-bytes from https://cache.nix-ci.com
  177. 14.84 s Downloaded cached cargo-package-bitflags (237 KiB) in 83ms
  178. 14.84 s Progress: 0 of 1 built, 49 of 675 downloaded from cache (15 downloading)
  179. 14.84 s Downloaded cached cargo-package-blake3 (1.6 MiB) in 81ms
  180. 14.84 s Downloading cached cargo-package-cast from https://cache.nix-ci.com
  181. 14.84 s Progress: 0 of 1 built, 50 of 675 downloaded from cache (15 downloading)
  182. 14.84 s Downloaded cached cargo-package-block2 (130 KiB) in 77ms
  183. 14.84 s Downloading cached cargo-package-castaway from https://cache.nix-ci.com
  184. 14.84 s Progress: 0 of 1 built, 51 of 675 downloaded from cache (15 downloading)
  185. 14.85 s Downloading cached cargo-package-cc from https://cache.nix-ci.com
  186. 14.86 s Downloaded cached cargo-package-bitvec (1 MiB) in 99ms
  187. 14.86 s Progress: 0 of 1 built, 52 of 675 downloaded from cache (15 downloading)
  188. 14.86 s Downloading cached cargo-package-cfg-if from https://cache.nix-ci.com
  189. 14.88 s Downloaded cached cargo-package-brotli-decompressor (1.9 MiB) in 94ms
  190. 14.88 s Progress: 0 of 1 built, 53 of 675 downloaded from cache (15 downloading)
  191. 14.88 s Downloaded cached cargo-package-bytecheck (38 KiB) in 75ms
  192. 14.88 s Downloading cached cargo-package-cfg_aliases from https://cache.nix-ci.com
  193. 14.88 s Progress: 0 of 1 built, 54 of 675 downloaded from cache (15 downloading)
  194. 14.89 s Downloading cached cargo-package-cgmath from https://cache.nix-ci.com
  195. 14.89 s Downloaded cached cargo-package-brotli (4.3 MiB) in 107ms
  196. 14.89 s Progress: 0 of 1 built, 55 of 675 downloaded from cache (15 downloading)
  197. 14.89 s Downloaded cached cargo-package-bytecheck_derive (25 KiB) in 74ms
  198. 14.89 s Downloaded cached cargo-package-brotli-decompressor (1.9 MiB) in 92ms
  199. 14.89 s Downloaded cached cargo-package-bumpalo (416 KiB) in 90ms
  200. 14.89 s Downloaded cached cargo-package-bytecount (79 KiB) in 69ms
  201. 14.89 s Downloading cached cargo-package-chrono from https://cache.nix-ci.com
  202. 14.89 s Progress: 0 of 1 built, 56 of 675 downloaded from cache (15 downloading)
  203. 14.89 s Progress: 0 of 1 built, 57 of 675 downloaded from cache (14 downloading)
  204. 14.89 s Progress: 0 of 1 built, 58 of 675 downloaded from cache (13 downloading)
  205. 14.89 s Downloaded cached cargo-package-byteorder (184 KiB) in 64ms
  206. 14.89 s Progress: 0 of 1 built, 59 of 675 downloaded from cache (12 downloading)
  207. 14.89 s Downloaded cached cargo-package-bytemuck (231 KiB) in 68ms
  208. 14.90 s Downloaded cached cargo-package-bstr (1.6 MiB) in 93ms
  209. 14.90 s Downloading cached cargo-package-chunked_transfer from https://cache.nix-ci.com
  210. 14.90 s Downloading cached cargo-package-ciborium from https://cache.nix-ci.com
  211. 14.90 s Downloading cached cargo-package-ciborium-io from https://cache.nix-ci.com
  212. 14.90 s Downloading cached cargo-package-ciborium-ll from https://cache.nix-ci.com
  213. 14.90 s Progress: 0 of 1 built, 60 of 675 downloaded from cache (15 downloading)
  214. 14.90 s Progress: 0 of 1 built, 61 of 675 downloaded from cache (14 downloading)
  215. 14.90 s Progress: 0 of 1 built, 62 of 675 downloaded from cache (13 downloading)
  216. 14.90 s Downloading cached cargo-package-clap from https://cache.nix-ci.com
  217. 14.90 s Downloading cached cargo-package-clap_builder from https://cache.nix-ci.com
  218. 14.90 s Downloading cached cargo-package-clap_complete from https://cache.nix-ci.com
  219. 14.90 s Downloaded cached cargo-package-clap_builder in 0ms
  220. 14.90 s Progress: 0 of 1 built, 63 of 675 downloaded from cache (15 downloading)
  221. 14.90 s Downloaded cached cargo-package-bytes (416 KiB) in 70ms
  222. 14.90 s Downloading cached cargo-package-clap_complete_nushell from https://cache.nix-ci.com
  223. 14.90 s Progress: 0 of 1 built, 64 of 675 downloaded from cache (15 downloading)
  224. 14.90 s Downloaded cached cargo-package-cast (46 KiB) in 62ms
  225. 14.91 s Downloaded cached cargo-package-castaway (46 KiB) in 61ms
  226. 14.91 s Downloading cached cargo-package-clap_derive from https://cache.nix-ci.com
  227. 14.91 s Progress: 0 of 1 built, 65 of 675 downloaded from cache (15 downloading)
  228. 14.91 s Progress: 0 of 1 built, 66 of 675 downloaded from cache (14 downloading)
  229. 14.91 s Downloaded cached cargo-package-brotli (5.8 MiB) in 129ms
  230. 14.91 s Downloading cached cargo-package-clap_lex from https://cache.nix-ci.com
  231. 14.91 s Downloading cached cargo-package-clarabel from https://cache.nix-ci.com
  232. 14.91 s Progress: 0 of 1 built, 67 of 675 downloaded from cache (15 downloading)
  233. 14.91 s Downloading cached cargo-package-color-eyre from https://cache.nix-ci.com
  234. 14.92 s Downloaded cached cargo-package-cc (394 KiB) in 69ms
  235. 14.92 s Progress: 0 of 1 built, 68 of 675 downloaded from cache (15 downloading)
  236. 14.92 s Downloaded cached cargo-package-cfg-if (28 KiB) in 58ms
  237. 14.92 s Downloading cached cargo-package-color-spantrace from https://cache.nix-ci.com
  238. 14.92 s Progress: 0 of 1 built, 69 of 675 downloaded from cache (15 downloading)
  239. 14.92 s Downloading cached cargo-package-colorchoice from https://cache.nix-ci.com
  240. 14.93 s Downloaded cached cargo-package-cfg_aliases (24 KiB) in 45ms
  241. 14.93 s Progress: 0 of 1 built, 70 of 675 downloaded from cache (15 downloading)
  242. 14.93 s Downloading cached cargo-package-colored from https://cache.nix-ci.com
  243. 14.93 s Downloaded cached cargo-package-cgmath (377 KiB) in 47ms
  244. 14.93 s Progress: 0 of 1 built, 71 of 675 downloaded from cache (15 downloading)
  245. 14.94 s Downloading cached cargo-package-colored from https://cache.nix-ci.com
  246. 14.96 s Downloaded cached cargo-package-ciborium (196 KiB) in 69ms
  247. 14.97 s Progress: 0 of 1 built, 72 of 675 downloaded from cache (15 downloading)
  248. 14.97 s Downloading cached cargo-package-compact_str from https://cache.nix-ci.com
  249. 14.97 s Downloaded cached cargo-package-chrono (1.3 MiB) in 81ms
  250. 14.97 s Progress: 0 of 1 built, 73 of 675 downloaded from cache (15 downloading)
  251. 14.98 s Downloaded cached cargo-package-chunked_transfer (32 KiB) in 79ms
  252. 14.98 s Downloading cached cargo-package-console from https://cache.nix-ci.com
  253. 14.98 s Progress: 0 of 1 built, 74 of 675 downloaded from cache (15 downloading)
  254. 14.98 s Downloading cached cargo-package-console from https://cache.nix-ci.com
  255. 14.98 s Downloaded cached cargo-package-ciborium-ll (57 KiB) in 87ms
  256. 14.98 s Downloaded cached cargo-package-ciborium-io (22 KiB) in 87ms
  257. 14.98 s Progress: 0 of 1 built, 75 of 675 downloaded from cache (15 downloading)
  258. 14.98 s Progress: 0 of 1 built, 76 of 675 downloaded from cache (14 downloading)
  259. 14.99 s Downloading cached cargo-package-const-random from https://cache.nix-ci.com
  260. 14.99 s Downloading cached cargo-package-const-random-macro from https://cache.nix-ci.com
  261. 14.99 s Downloaded cached cargo-package-clap_complete (216 KiB) in 89ms
  262. 14.99 s Progress: 0 of 1 built, 77 of 675 downloaded from cache (15 downloading)
  263. 14.99 s Downloading cached cargo-package-constant_time_eq from https://cache.nix-ci.com
  264. 14.99 s Downloaded cached cargo-package-clap_complete_nushell (136 KiB) in 88ms
  265. 14.99 s Progress: 0 of 1 built, 78 of 675 downloaded from cache (15 downloading)
  266. 15.00 s Downloading cached cargo-package-constcat from https://cache.nix-ci.com
  267. 15.00 s Downloaded cached cargo-package-clap_derive (181 KiB) in 90ms
  268. 15.00 s Progress: 0 of 1 built, 79 of 675 downloaded from cache (15 downloading)
  269. 15.00 s Downloaded cached cargo-package-clap_lex (46 KiB) in 87ms
  270. 15.00 s Downloading cached cargo-package-convert_case from https://cache.nix-ci.com
  271. 15.00 s Progress: 0 of 1 built, 80 of 675 downloaded from cache (15 downloading)
  272. 15.00 s Downloading cached cargo-package-convert_case from https://cache.nix-ci.com
  273. 15.02 s Downloaded cached cargo-package-clap (285 KiB) in 125ms
  274. 15.02 s Downloaded cached cargo-package-clarabel (1.1 MiB) in 115ms
  275. 15.02 s Progress: 0 of 1 built, 81 of 675 downloaded from cache (15 downloading)
  276. 15.03 s Downloading cached cargo-package-core-foundation-sys from https://cache.nix-ci.com
  277. 15.03 s Progress: 0 of 1 built, 82 of 675 downloaded from cache (15 downloading)
  278. 15.03 s Downloaded cached cargo-package-colored (149 KiB) in 102ms
  279. 15.03 s Downloading cached cargo-package-cpufeatures from https://cache.nix-ci.com
  280. 15.03 s Downloaded cached cargo-package-cpufeatures in 0ms
  281. 15.03 s Progress: 0 of 1 built, 83 of 675 downloaded from cache (15 downloading)
  282. 15.03 s Downloaded cached cargo-package-color-spantrace (40 KiB) in 115ms
  283. 15.03 s Progress: 0 of 1 built, 84 of 675 downloaded from cache (14 downloading)
  284. 15.03 s Downloaded cached cargo-package-color-eyre (836 KiB) in 118ms
  285. 15.03 s Downloaded cached cargo-package-colorchoice (23 KiB) in 113ms
  286. 15.03 s Downloading cached cargo-package-cpufeatures from https://cache.nix-ci.com
  287. 15.03 s Downloading cached cargo-package-criterion from https://cache.nix-ci.com
  288. 15.04 s Progress: 0 of 1 built, 85 of 675 downloaded from cache (15 downloading)
  289. 15.04 s Progress: 0 of 1 built, 86 of 675 downloaded from cache (14 downloading)
  290. 15.04 s Progress: 0 of 1 built, 87 of 675 downloaded from cache (13 downloading)
  291. 15.04 s Downloading cached cargo-package-criterion-plot from https://cache.nix-ci.com
  292. 15.04 s Downloading cached cargo-package-crossbeam-channel from https://cache.nix-ci.com
  293. 15.04 s Downloading cached cargo-package-crossbeam-deque from https://cache.nix-ci.com
  294. 15.05 s Downloaded cached cargo-package-colored (151 KiB) in 110ms
  295. 15.05 s Progress: 0 of 1 built, 88 of 675 downloaded from cache (15 downloading)
  296. 15.05 s Downloading cached cargo-package-crossbeam-epoch from https://cache.nix-ci.com
  297. 15.05 s Downloaded cached cargo-package-console (142 KiB) in 73ms
  298. 15.05 s Progress: 0 of 1 built, 89 of 675 downloaded from cache (15 downloading)
  299. 15.05 s Downloading cached cargo-package-crossbeam-utils from https://cache.nix-ci.com
  300. 15.05 s Downloaded cached cargo-package-console (159 KiB) in 78ms
  301. 15.05 s Progress: 0 of 1 built, 90 of 675 downloaded from cache (15 downloading)
  302. 15.06 s Downloading cached cargo-package-crossterm from https://cache.nix-ci.com
  303. 15.06 s Downloaded cached cargo-package-compact_str (335 KiB) in 94ms
  304. 15.06 s Progress: 0 of 1 built, 91 of 675 downloaded from cache (15 downloading)
  305. 15.06 s Downloading cached cargo-package-crossterm from https://cache.nix-ci.com
  306. 15.07 s Downloaded cached cargo-package-const-random-macro (19 KiB) in 79ms
  307. 15.07 s Progress: 0 of 1 built, 92 of 675 downloaded from cache (15 downloading)
  308. 15.07 s Downloaded cached cargo-package-constcat (33 KiB) in 71ms
  309. 15.07 s Downloading cached cargo-package-crossterm_winapi from https://cache.nix-ci.com
  310. 15.07 s Progress: 0 of 1 built, 93 of 675 downloaded from cache (15 downloading)
  311. 15.07 s Downloaded cached cargo-package-convert_case (100 KiB) in 71ms
  312. 15.07 s Downloading cached cargo-package-crunchy from https://cache.nix-ci.com
  313. 15.07 s Progress: 0 of 1 built, 94 of 675 downloaded from cache (15 downloading)
  314. 15.07 s Downloaded cached cargo-package-const-random (20 KiB) in 85ms
  315. 15.07 s Downloading cached cargo-package-crypto-common from https://cache.nix-ci.com
  316. 15.07 s Progress: 0 of 1 built, 95 of 675 downloaded from cache (15 downloading)
  317. 15.07 s Downloading cached cargo-package-csscolorparser from https://cache.nix-ci.com
  318. 15.08 s Downloaded cached cargo-package-constant_time_eq (118 KiB) in 83ms
  319. 15.08 s Progress: 0 of 1 built, 96 of 675 downloaded from cache (15 downloading)
  320. 15.08 s Downloaded cached cargo-package-convert_case (34 KiB) in 75ms
  321. 15.08 s Downloading cached cargo-package-ctrlc from https://cache.nix-ci.com
  322. 15.08 s Progress: 0 of 1 built, 97 of 675 downloaded from cache (15 downloading)
  323. 15.08 s Downloading cached cargo-package-darling from https://cache.nix-ci.com
  324. 15.10 s Downloaded cached cargo-package-cpufeatures (49 KiB) in 65ms
  325. 15.10 s Progress: 0 of 1 built, 98 of 675 downloaded from cache (15 downloading)
  326. 15.10 s Downloading cached cargo-package-darling from https://cache.nix-ci.com
  327. 15.10 s Downloaded cached cargo-package-crossbeam-deque (129 KiB) in 66ms
  328. 15.10 s Progress: 0 of 1 built, 99 of 675 downloaded from cache (15 downloading)
  329. 15.10 s Downloaded cached cargo-package-core-foundation-sys (237 KiB) in 76ms
  330. 15.11 s Downloading cached cargo-package-darling_core from https://cache.nix-ci.com
  331. 15.11 s Progress: 0 of 1 built, 100 of 675 downloaded from cache (15 downloading)
  332. 15.11 s Downloading cached cargo-package-darling_core from https://cache.nix-ci.com
  333. 15.11 s Downloaded cached cargo-package-criterion-plot (98 KiB) in 70ms
  334. 15.11 s Progress: 0 of 1 built, 101 of 675 downloaded from cache (15 downloading)
  335. 15.11 s Downloaded cached cargo-package-crossbeam-channel (597 KiB) in 72ms
  336. 15.11 s Downloading cached cargo-package-darling_macro from https://cache.nix-ci.com
  337. 15.11 s Progress: 0 of 1 built, 102 of 675 downloaded from cache (15 downloading)
  338. 15.11 s Downloading cached cargo-package-darling_macro from https://cache.nix-ci.com
  339. 15.12 s Downloaded cached cargo-package-criterion (521 KiB) in 82ms
  340. 15.12 s Progress: 0 of 1 built, 103 of 675 downloaded from cache (15 downloading)
  341. 15.12 s Downloading cached cargo-package-delegate from https://cache.nix-ci.com
  342. 15.12 s Downloaded cached cargo-package-crossbeam-epoch (204 KiB) in 71ms
  343. 15.12 s Progress: 0 of 1 built, 104 of 675 downloaded from cache (15 downloading)
  344. 15.12 s Downloading cached cargo-package-delegate from https://cache.nix-ci.com
  345. 15.12 s Downloaded cached cargo-package-crossbeam-utils (192 KiB) in 70ms
  346. 15.12 s Progress: 0 of 1 built, 105 of 675 downloaded from cache (15 downloading)
  347. 15.13 s Downloading cached cargo-package-deltae from https://cache.nix-ci.com
  348. 15.13 s Downloaded cached cargo-package-crossterm_winapi (65 KiB) in 64ms
  349. 15.13 s Progress: 0 of 1 built, 106 of 675 downloaded from cache (15 downloading)
  350. 15.13 s Downloaded cached cargo-package-crossterm (516 KiB) in 78ms
  351. 15.14 s Downloading cached cargo-package-deprecate-until from https://cache.nix-ci.com
  352. 15.14 s Progress: 0 of 1 built, 107 of 675 downloaded from cache (15 downloading)
  353. 15.14 s Downloaded cached cargo-package-crunchy (13 KiB) in 68ms
  354. 15.14 s Downloading cached cargo-package-deranged from https://cache.nix-ci.com
  355. 15.14 s Progress: 0 of 1 built, 108 of 675 downloaded from cache (15 downloading)
  356. 15.14 s Downloading cached cargo-package-derive_builder from https://cache.nix-ci.com
  357. 15.14 s Downloaded cached cargo-package-csscolorparser (70 KiB) in 68ms
  358. 15.14 s Progress: 0 of 1 built, 109 of 675 downloaded from cache (15 downloading)
  359. 15.14 s Downloading cached cargo-package-derive_builder_core from https://cache.nix-ci.com
  360. 15.15 s Downloaded cached cargo-package-crossterm (542 KiB) in 81ms
  361. 15.15 s Progress: 0 of 1 built, 110 of 675 downloaded from cache (15 downloading)
  362. 15.15 s Downloading cached cargo-package-derive_builder_macro from https://cache.nix-ci.com
  363. 15.15 s Downloaded cached cargo-package-darling (96 KiB) in 69ms
  364. 15.15 s Downloaded cached cargo-package-crypto-common (30 KiB) in 76ms
  365. 15.15 s Progress: 0 of 1 built, 111 of 675 downloaded from cache (15 downloading)
  366. 15.15 s Downloading cached cargo-package-derive_more from https://cache.nix-ci.com
  367. 15.15 s Progress: 0 of 1 built, 112 of 675 downloaded from cache (15 downloading)
  368. 15.15 s Downloading cached cargo-package-derive_more from https://cache.nix-ci.com
  369. 15.15 s Downloaded cached cargo-package-ctrlc (52 KiB) in 75ms
  370. 15.15 s Progress: 0 of 1 built, 113 of 675 downloaded from cache (15 downloading)
  371. 15.15 s Downloading cached cargo-package-derive_more-impl from https://cache.nix-ci.com
  372. 15.17 s Downloaded cached cargo-package-darling (179 KiB) in 62ms
  373. 15.17 s Progress: 0 of 1 built, 114 of 675 downloaded from cache (15 downloading)
  374. 15.17 s Downloading cached cargo-package-digest from https://cache.nix-ci.com
  375. 15.17 s Downloaded cached cargo-package-darling_macro (5696 B) in 59ms
  376. 15.17 s Progress: 0 of 1 built, 115 of 675 downloaded from cache (15 downloading)
  377. 15.17 s Downloading cached cargo-package-dirs from https://cache.nix-ci.com
  378. 15.17 s Downloaded cached cargo-package-darling_macro (7608 B) in 59ms
  379. 15.17 s Progress: 0 of 1 built, 116 of 675 downloaded from cache (15 downloading)
  380. 15.17 s Downloading cached cargo-package-dirs-sys from https://cache.nix-ci.com
  381. 15.19 s Downloaded cached cargo-package-delegate (55 KiB) in 67ms
  382. 15.19 s Progress: 0 of 1 built, 117 of 675 downloaded from cache (15 downloading)
  383. 15.19 s Downloaded cached cargo-package-darling_core (349 KiB) in 78ms
  384. 15.19 s Downloaded cached cargo-package-darling_core (274 KiB) in 80ms
  385. 15.19 s Downloading cached cargo-package-dispatch2 from https://cache.nix-ci.com
  386. 15.19 s Downloaded cached cargo-package-delegate (84 KiB) in 67ms
  387. 15.19 s Progress: 0 of 1 built, 118 of 675 downloaded from cache (15 downloading)
  388. 15.19 s Progress: 0 of 1 built, 119 of 675 downloaded from cache (14 downloading)
  389. 15.19 s Progress: 0 of 1 built, 120 of 675 downloaded from cache (13 downloading)
  390. 15.19 s Downloading cached cargo-package-document-features from https://cache.nix-ci.com
  391. 15.19 s Downloading cached cargo-package-dot-parser from https://cache.nix-ci.com
  392. 15.19 s Downloading cached cargo-package-duplicate from https://cache.nix-ci.com
  393. 15.20 s Downloaded cached cargo-package-deranged (148 KiB) in 62ms
  394. 15.20 s Progress: 0 of 1 built, 121 of 675 downloaded from cache (15 downloading)
  395. 15.20 s Downloading cached cargo-package-duplicate from https://cache.nix-ci.com
  396. 15.21 s Downloaded cached cargo-package-derive_builder (140 KiB) in 73ms
  397. 15.22 s Progress: 0 of 1 built, 122 of 675 downloaded from cache (15 downloading)
  398. 15.22 s Downloading cached cargo-package-dyn-clone from https://cache.nix-ci.com
  399. 15.22 s Downloaded cached cargo-package-deprecate-until (37 KiB) in 83ms
  400. 15.22 s Progress: 0 of 1 built, 123 of 675 downloaded from cache (15 downloading)
  401. 15.22 s Downloading cached cargo-package-either from https://cache.nix-ci.com
  402. 15.23 s Downloaded cached cargo-package-derive_more (313 KiB) in 76ms
  403. 15.23 s Progress: 0 of 1 built, 124 of 675 downloaded from cache (15 downloading)
  404. 15.23 s Downloading cached cargo-package-encode_unicode from https://cache.nix-ci.com
  405. 15.23 s Downloaded cached cargo-package-derive_more-impl (543 KiB) in 79ms
  406. 15.23 s Progress: 0 of 1 built, 125 of 675 downloaded from cache (15 downloading)
  407. 15.24 s Downloading cached cargo-package-enum-try-as-inner from https://cache.nix-ci.com
  408. 15.24 s Downloaded cached cargo-package-derive_builder_macro (18 KiB) in 88ms
  409. 15.24 s Progress: 0 of 1 built, 126 of 675 downloaded from cache (15 downloading)
  410. 15.24 s Downloading cached cargo-package-enum_dispatch from https://cache.nix-ci.com
  411. 15.24 s Downloaded cached cargo-package-derive_builder_core (137 KiB) in 93ms
  412. 15.24 s Progress: 0 of 1 built, 127 of 675 downloaded from cache (15 downloading)
  413. 15.24 s Downloading cached cargo-package-env_filter from https://cache.nix-ci.com
  414. 15.24 s Downloaded cached cargo-package-derive_more (818 KiB) in 89ms
  415. 15.24 s Progress: 0 of 1 built, 128 of 675 downloaded from cache (15 downloading)
  416. 15.24 s Downloading cached cargo-package-env_logger from https://cache.nix-ci.com
  417. 15.25 s Downloaded cached cargo-package-digest (90 KiB) in 79ms
  418. 15.25 s Progress: 0 of 1 built, 129 of 675 downloaded from cache (15 downloading)
  419. 15.25 s Downloaded cached cargo-package-deltae (2.6 MiB) in 120ms
  420. 15.25 s Downloading cached cargo-package-equivalent from https://cache.nix-ci.com
  421. 15.25 s Progress: 0 of 1 built, 130 of 675 downloaded from cache (15 downloading)
  422. 15.25 s Downloading cached cargo-package-errno from https://cache.nix-ci.com
  423. 15.25 s Downloaded cached cargo-package-dirs-sys (33 KiB) in 80ms
  424. 15.25 s Progress: 0 of 1 built, 131 of 675 downloaded from cache (15 downloading)
  425. 15.25 s Downloaded cached cargo-package-dirs (58 KiB) in 83ms
  426. 15.26 s Downloading cached cargo-package-euclid from https://cache.nix-ci.com
  427. 15.26 s Progress: 0 of 1 built, 132 of 675 downloaded from cache (15 downloading)
  428. 15.26 s Downloading cached cargo-package-eyre from https://cache.nix-ci.com
  429. 15.26 s Downloaded cached cargo-package-dot-parser (100 KiB) in 67ms
  430. 15.26 s Progress: 0 of 1 built, 133 of 675 downloaded from cache (15 downloading)
  431. 15.26 s Downloading cached cargo-package-fancy-regex from https://cache.nix-ci.com
  432. 15.27 s Downloaded cached cargo-package-document-features (52 KiB) in 76ms
  433. 15.27 s Progress: 0 of 1 built, 134 of 675 downloaded from cache (15 downloading)
  434. 15.27 s Downloaded cached cargo-package-dispatch2 (290 KiB) in 80ms
  435. 15.27 s Downloading cached cargo-package-fastrand from https://cache.nix-ci.com
  436. 15.27 s Progress: 0 of 1 built, 135 of 675 downloaded from cache (15 downloading)
  437. 15.27 s Downloading cached cargo-package-fd-lock from https://cache.nix-ci.com
  438. 15.27 s Downloaded cached cargo-package-duplicate (178 KiB) in 82ms
  439. 15.27 s Progress: 0 of 1 built, 136 of 675 downloaded from cache (15 downloading)
  440. 15.28 s Downloading cached cargo-package-features from https://cache.nix-ci.com
  441. 15.28 s Downloaded cached cargo-package-duplicate (205 KiB) in 77ms
  442. 15.28 s Progress: 0 of 1 built, 137 of 675 downloaded from cache (15 downloading)
  443. 15.28 s Downloaded cached cargo-package-dyn-clone (48 KiB) in 65ms
  444. 15.28 s Downloading cached cargo-package-figment from https://cache.nix-ci.com
  445. 15.28 s Progress: 0 of 1 built, 138 of 675 downloaded from cache (15 downloading)
  446. 15.29 s Downloading cached cargo-package-filedescriptor from https://cache.nix-ci.com
  447. 15.29 s Downloaded cached cargo-package-either (84 KiB) in 65ms
  448. 15.29 s Progress: 0 of 1 built, 139 of 675 downloaded from cache (15 downloading)
  449. 15.29 s Downloading cached cargo-package-find-msvc-tools from https://cache.nix-ci.com
  450. 15.29 s Downloaded cached cargo-package-encode_unicode (233 KiB) in 60ms
  451. 15.29 s Progress: 0 of 1 built, 140 of 675 downloaded from cache (15 downloading)
  452. 15.29 s Downloading cached cargo-package-finl_unicode from https://cache.nix-ci.com
  453. 15.31 s Downloaded cached cargo-package-env_logger (133 KiB) in 63ms
  454. 15.31 s Progress: 0 of 1 built, 141 of 675 downloaded from cache (15 downloading)
  455. 15.31 s Downloading cached cargo-package-fixedbitset from https://cache.nix-ci.com
  456. 15.31 s Downloaded cached cargo-package-env_filter (66 KiB) in 70ms
  457. 15.31 s Progress: 0 of 1 built, 142 of 675 downloaded from cache (15 downloading)
  458. 15.31 s Downloaded cached cargo-package-enum-try-as-inner (68 KiB) in 75ms
  459. 15.31 s Downloading cached cargo-package-fnv from https://cache.nix-ci.com
  460. 15.31 s Progress: 0 of 1 built, 143 of 675 downloaded from cache (15 downloading)
  461. 15.31 s Downloading cached cargo-package-foldhash from https://cache.nix-ci.com
  462. 15.32 s Downloaded cached cargo-package-enum_dispatch (121 KiB) in 79ms
  463. 15.32 s Progress: 0 of 1 built, 144 of 675 downloaded from cache (15 downloading)
  464. 15.32 s Downloading cached cargo-package-foldhash from https://cache.nix-ci.com
  465. 15.33 s Downloaded cached cargo-package-equivalent (21 KiB) in 82ms
  466. 15.33 s Progress: 0 of 1 built, 145 of 675 downloaded from cache (15 downloading)
  467. 15.33 s Downloading cached cargo-package-fsevent-sys from https://cache.nix-ci.com
  468. 15.33 s Downloaded cached cargo-package-eyre (178 KiB) in 74ms
  469. 15.33 s Progress: 0 of 1 built, 146 of 675 downloaded from cache (15 downloading)
  470. 15.33 s Downloaded cached cargo-package-errno (41 KiB) in 81ms
  471. 15.33 s Downloading cached cargo-package-funty from https://cache.nix-ci.com
  472. 15.33 s Progress: 0 of 1 built, 147 of 675 downloaded from cache (15 downloading)
  473. 15.33 s Downloading cached cargo-package-futures-core from https://cache.nix-ci.com
  474. 15.34 s Downloaded cached cargo-package-euclid (553 KiB) in 85ms
  475. 15.34 s Progress: 0 of 1 built, 148 of 675 downloaded from cache (15 downloading)
  476. 15.34 s Downloading cached cargo-package-futures-executor from https://cache.nix-ci.com
  477. 15.36 s Downloaded cached cargo-package-fancy-regex (361 KiB) in 97ms
  478. 15.36 s Progress: 0 of 1 built, 149 of 675 downloaded from cache (15 downloading)
  479. 15.36 s Downloading cached cargo-package-futures-task from https://cache.nix-ci.com
  480. 15.36 s Downloaded cached cargo-package-fd-lock (58 KiB) in 91ms
  481. 15.36 s Progress: 0 of 1 built, 150 of 675 downloaded from cache (15 downloading)
  482. 15.37 s Downloading cached cargo-package-futures-util from https://cache.nix-ci.com
  483. 15.39 s Downloaded cached cargo-package-fastrand (75 KiB) in 115ms
  484. 15.39 s Progress: 0 of 1 built, 151 of 675 downloaded from cache (15 downloading)
  485. 15.39 s Downloaded cached cargo-package-finl_unicode (1.3 MiB) in 92ms
  486. 15.39 s Downloading cached cargo-package-gat-lending-iterator from https://cache.nix-ci.com
  487. 15.39 s Progress: 0 of 1 built, 152 of 675 downloaded from cache (15 downloading)
  488. 15.39 s Downloading cached cargo-package-generic-array from https://cache.nix-ci.com
  489. 15.39 s Downloaded cached cargo-package-filedescriptor (58 KiB) in 103ms
  490. 15.39 s Progress: 0 of 1 built, 153 of 675 downloaded from cache (15 downloading)
  491. 15.39 s Downloading cached cargo-package-getopts from https://cache.nix-ci.com
  492. 15.39 s Downloaded cached cargo-package-find-msvc-tools (117 KiB) in 104ms
  493. 15.39 s Progress: 0 of 1 built, 154 of 675 downloaded from cache (15 downloading)
  494. 15.39 s Downloaded cached cargo-package-fixedbitset (69 KiB) in 84ms
  495. 15.39 s Downloading cached cargo-package-getrandom from https://cache.nix-ci.com
  496. 15.39 s Progress: 0 of 1 built, 155 of 675 downloaded from cache (15 downloading)
  497. 15.39 s Downloading cached cargo-package-getrandom from https://cache.nix-ci.com
  498. 15.41 s Downloaded cached cargo-package-fnv (36 KiB) in 97ms
  499. 15.41 s Progress: 0 of 1 built, 156 of 675 downloaded from cache (15 downloading)
  500. 15.41 s Downloading cached cargo-package-getrandom from https://cache.nix-ci.com
  501. 15.41 s Downloaded cached cargo-package-features (29 KiB) in 135ms
  502. 15.41 s Progress: 0 of 1 built, 157 of 675 downloaded from cache (15 downloading)
  503. 15.41 s Downloading cached cargo-package-gimli from https://cache.nix-ci.com
  504. 15.41 s Downloaded cached cargo-package-foldhash (81 KiB) in 99ms
  505. 15.41 s Progress: 0 of 1 built, 158 of 675 downloaded from cache (15 downloading)
  506. 15.41 s Downloaded cached cargo-package-foldhash (85 KiB) in 96ms
  507. 15.42 s Downloading cached cargo-package-glob from https://cache.nix-ci.com
  508. 15.42 s Progress: 0 of 1 built, 159 of 675 downloaded from cache (15 downloading)
  509. 15.42 s Downloaded cached cargo-package-fsevent-sys (18 KiB) in 84ms
  510. 15.42 s Downloading cached cargo-package-globset from https://cache.nix-ci.com
  511. 15.42 s Progress: 0 of 1 built, 160 of 675 downloaded from cache (15 downloading)
  512. 15.42 s Downloading cached cargo-package-gmp-mpfr-sys from https://cache.nix-ci.com
  513. 15.42 s Downloaded cached cargo-package-funty (57 KiB) in 87ms
  514. 15.42 s Progress: 0 of 1 built, 161 of 675 downloaded from cache (15 downloading)
  515. 15.42 s Downloaded cached cargo-package-futures-core (49 KiB) in 86ms
  516. 15.42 s Downloading cached cargo-package-gungraun from https://cache.nix-ci.com
  517. 15.42 s Progress: 0 of 1 built, 162 of 675 downloaded from cache (15 downloading)
  518. 15.42 s Downloaded cached cargo-package-futures-executor (69 KiB) in 79ms
  519. 15.42 s Downloading cached cargo-package-gungraun-macros from https://cache.nix-ci.com
  520. 15.42 s Progress: 0 of 1 built, 163 of 675 downloaded from cache (15 downloading)
  521. 15.43 s Downloading cached cargo-package-gungraun-runner from https://cache.nix-ci.com
  522. 15.43 s Downloaded cached cargo-package-futures-task (42 KiB) in 75ms
  523. 15.43 s Progress: 0 of 1 built, 164 of 675 downloaded from cache (15 downloading)
  524. 15.44 s Downloading cached cargo-package-half from https://cache.nix-ci.com
  525. 15.44 s Downloaded cached cargo-package-futures-util (895 KiB) in 79ms
  526. 15.44 s Progress: 0 of 1 built, 165 of 675 downloaded from cache (15 downloading)
  527. 15.45 s Downloaded cached cargo-package-gat-lending-iterator (113 KiB) in 58ms
  528. 15.45 s Downloading cached cargo-package-hashbrown from https://cache.nix-ci.com
  529. 15.45 s Progress: 0 of 1 built, 166 of 675 downloaded from cache (15 downloading)
  530. 15.45 s Downloaded cached cargo-package-generic-array (69 KiB) in 57ms
  531. 15.45 s Downloading cached cargo-package-hashbrown from https://cache.nix-ci.com
  532. 15.45 s Progress: 0 of 1 built, 167 of 675 downloaded from cache (15 downloading)
  533. 15.45 s Downloaded cached cargo-package-getopts (100 KiB) in 57ms
  534. 15.45 s Downloading cached cargo-package-hashbrown from https://cache.nix-ci.com
  535. 15.45 s Progress: 0 of 1 built, 168 of 675 downloaded from cache (15 downloading)
  536. 15.45 s Downloading cached cargo-package-hashbrown from https://cache.nix-ci.com
  537. 15.46 s Downloaded cached cargo-package-getrandom (181 KiB) in 61ms
  538. 15.46 s Progress: 0 of 1 built, 169 of 675 downloaded from cache (15 downloading)
  539. 15.46 s Downloading cached cargo-package-heck from https://cache.nix-ci.com
  540. 15.46 s Downloaded cached cargo-package-getrandom (134 KiB) in 64ms
  541. 15.46 s Progress: 0 of 1 built, 170 of 675 downloaded from cache (15 downloading)
  542. 15.46 s Downloading cached cargo-package-heck from https://cache.nix-ci.com
  543. 15.47 s Downloaded cached cargo-package-figment (324 KiB) in 181ms
  544. 15.47 s Progress: 0 of 1 built, 171 of 675 downloaded from cache (15 downloading)
  545. 15.47 s Downloading cached cargo-package-hermit-abi from https://cache.nix-ci.com
  546. 15.48 s Downloaded cached cargo-package-glob (95 KiB) in 66ms
  547. 15.48 s Progress: 0 of 1 built, 172 of 675 downloaded from cache (15 downloading)
  548. 15.48 s Downloaded cached cargo-package-getrandom (196 KiB) in 70ms
  549. 15.48 s Downloading cached cargo-package-hex from https://cache.nix-ci.com
  550. 15.49 s Progress: 0 of 1 built, 173 of 675 downloaded from cache (15 downloading)
  551. 15.49 s Downloaded cached cargo-package-gimli (1.8 MiB) in 72ms
  552. 15.49 s Downloaded cached cargo-package-globset (122 KiB) in 68ms
  553. 15.49 s Downloading cached cargo-package-httpdate from https://cache.nix-ci.com
  554. 15.49 s Progress: 0 of 1 built, 174 of 675 downloaded from cache (15 downloading)
  555. 15.49 s Progress: 0 of 1 built, 175 of 675 downloaded from cache (14 downloading)
  556. 15.49 s Downloading cached cargo-package-hugepage-rs from https://cache.nix-ci.com
  557. 15.49 s Downloading cached cargo-package-iai-callgrind from https://cache.nix-ci.com
  558. 15.50 s Downloaded cached cargo-package-gungraun-macros (147 KiB) in 72ms
  559. 15.50 s Progress: 0 of 1 built, 176 of 675 downloaded from cache (15 downloading)
  560. 15.50 s Downloading cached cargo-package-iai-callgrind-macros from https://cache.nix-ci.com
  561. 15.50 s Downloaded cached cargo-package-gungraun (570 KiB) in 78ms
  562. 15.50 s Progress: 0 of 1 built, 177 of 675 downloaded from cache (15 downloading)
  563. 15.50 s Downloading cached cargo-package-iai-callgrind-runner from https://cache.nix-ci.com
  564. 15.53 s Downloaded cached cargo-package-gungraun-runner (1.1 MiB) in 100ms
  565. 15.53 s Progress: 0 of 1 built, 178 of 675 downloaded from cache (15 downloading)
  566. 15.53 s Downloading cached cargo-package-iana-time-zone from https://cache.nix-ci.com
  567. 15.53 s Downloaded cached cargo-package-half (340 KiB) in 92ms
  568. 15.53 s Progress: 0 of 1 built, 179 of 675 downloaded from cache (15 downloading)
  569. 15.53 s Downloading cached cargo-package-iana-time-zone-haiku from https://cache.nix-ci.com
  570. 15.53 s Downloaded cached cargo-package-hashbrown (810 KiB) in 82ms
  571. 15.53 s Progress: 0 of 1 built, 180 of 675 downloaded from cache (15 downloading)
  572. 15.53 s Downloading cached cargo-package-id-arena from https://cache.nix-ci.com
  573. 15.53 s Downloaded cached cargo-package-hashbrown (584 KiB) in 88ms
  574. 15.53 s Progress: 0 of 1 built, 181 of 675 downloaded from cache (15 downloading)
  575. 15.54 s Downloaded cached cargo-package-heck (45 KiB) in 77ms
  576. 15.54 s Downloading cached cargo-package-ident_case from https://cache.nix-ci.com
  577. 15.54 s Progress: 0 of 1 built, 182 of 675 downloaded from cache (15 downloading)
  578. 15.54 s Downloading cached cargo-package-include_dir from https://cache.nix-ci.com
  579. 15.55 s Downloaded cached cargo-package-heck (46 KiB) in 89ms
  580. 15.55 s Progress: 0 of 1 built, 183 of 675 downloaded from cache (15 downloading)
  581. 15.55 s Downloading cached cargo-package-include_dir_macros from https://cache.nix-ci.com
  582. 15.55 s Downloaded cached cargo-package-hermit-abi (57 KiB) in 82ms
  583. 15.55 s Progress: 0 of 1 built, 184 of 675 downloaded from cache (15 downloading)
  584. 15.55 s Downloading cached cargo-package-indenter from https://cache.nix-ci.com
  585. 15.55 s Downloaded cached cargo-package-hashbrown (876 KiB) in 101ms
  586. 15.55 s Progress: 0 of 1 built, 185 of 675 downloaded from cache (15 downloading)
  587. 15.55 s Downloading cached cargo-package-indexmap from https://cache.nix-ci.com
  588. 15.55 s Downloaded cached cargo-package-hashbrown (853 KiB) in 104ms
  589. 15.55 s Progress: 0 of 1 built, 186 of 675 downloaded from cache (15 downloading)
  590. 15.56 s Downloading cached cargo-package-indicatif from https://cache.nix-ci.com
  591. 15.56 s Downloaded cached cargo-package-hex (45 KiB) in 79ms
  592. 15.56 s Progress: 0 of 1 built, 187 of 675 downloaded from cache (15 downloading)
  593. 15.56 s Downloading cached cargo-package-indoc from https://cache.nix-ci.com
  594. 15.57 s Downloaded cached cargo-package-httpdate (35 KiB) in 78ms
  595. 15.57 s Progress: 0 of 1 built, 188 of 675 downloaded from cache (15 downloading)
  596. 15.57 s Downloading cached cargo-package-inotify from https://cache.nix-ci.com
  597. 15.58 s Downloaded cached cargo-package-hugepage-rs (13 KiB) in 93ms
  598. 15.58 s Progress: 0 of 1 built, 189 of 675 downloaded from cache (15 downloading)
  599. 15.58 s Downloading cached cargo-package-inotify-sys from https://cache.nix-ci.com
  600. 15.59 s Downloaded cached cargo-package-iai-callgrind-macros (120 KiB) in 89ms
  601. 15.59 s Progress: 0 of 1 built, 190 of 675 downloaded from cache (15 downloading)
  602. 15.59 s Downloading cached cargo-package-insta from https://cache.nix-ci.com
  603. 15.59 s Downloaded cached cargo-package-iai-callgrind (536 KiB) in 102ms
  604. 15.59 s Progress: 0 of 1 built, 191 of 675 downloaded from cache (15 downloading)
  605. 15.59 s Downloading cached cargo-package-instability from https://cache.nix-ci.com
  606. 15.60 s Downloaded cached cargo-package-iana-time-zone-haiku (20 KiB) in 66ms
  607. 15.60 s Progress: 0 of 1 built, 192 of 675 downloaded from cache (15 downloading)
  608. 15.60 s Downloading cached cargo-package-integer-sqrt from https://cache.nix-ci.com
  609. 15.61 s Downloaded cached cargo-package-iai-callgrind-runner (5.3 MiB) in 100ms
  610. 15.61 s Progress: 0 of 1 built, 193 of 675 downloaded from cache (15 downloading)
  611. 15.61 s Downloading cached cargo-package-inventory from https://cache.nix-ci.com
  612. 15.61 s Downloaded cached cargo-package-iana-time-zone (184 KiB) in 82ms
  613. 15.61 s Progress: 0 of 1 built, 194 of 675 downloaded from cache (15 downloading)
  614. 15.61 s Downloading cached cargo-package-is-macro from https://cache.nix-ci.com
  615. 15.61 s Downloaded cached cargo-package-id-arena (48 KiB) in 81ms
  616. 15.61 s Progress: 0 of 1 built, 195 of 675 downloaded from cache (15 downloading)
  617. 15.62 s Downloading cached cargo-package-is-terminal from https://cache.nix-ci.com
  618. 15.62 s Downloaded cached cargo-package-ident_case (11 KiB) in 81ms
  619. 15.62 s Progress: 0 of 1 built, 196 of 675 downloaded from cache (15 downloading)
  620. 15.62 s Downloaded cached cargo-package-indenter (38 KiB) in 67ms
  621. 15.62 s Downloading cached cargo-package-is_terminal_polyfill from https://cache.nix-ci.com
  622. 15.62 s Progress: 0 of 1 built, 197 of 675 downloaded from cache (15 downloading)
  623. 15.62 s Downloading cached cargo-package-itertools from https://cache.nix-ci.com
  624. 15.63 s Downloaded cached cargo-package-include_dir (21 KiB) in 83ms
  625. 15.63 s Progress: 0 of 1 built, 198 of 675 downloaded from cache (15 downloading)
  626. 15.63 s Downloading cached cargo-package-itertools from https://cache.nix-ci.com
  627. 15.63 s Downloaded cached cargo-package-include_dir_macros (13 KiB) in 77ms
  628. 15.63 s Downloaded cached cargo-package-indexmap (530 KiB) in 73ms
  629. 15.63 s Progress: 0 of 1 built, 199 of 675 downloaded from cache (15 downloading)
  630. 15.63 s Downloading cached cargo-package-itertools from https://cache.nix-ci.com
  631. 15.63 s Progress: 0 of 1 built, 200 of 675 downloaded from cache (15 downloading)
  632. 15.63 s Downloading cached cargo-package-itertools from https://cache.nix-ci.com
  633. 15.64 s Downloaded cached cargo-package-indicatif (341 KiB) in 82ms
  634. 15.64 s Progress: 0 of 1 built, 201 of 675 downloaded from cache (15 downloading)
  635. 15.64 s Downloading cached cargo-package-itertools from https://cache.nix-ci.com
  636. 15.64 s Downloaded cached cargo-package-indoc (67 KiB) in 75ms
  637. 15.64 s Progress: 0 of 1 built, 202 of 675 downloaded from cache (15 downloading)
  638. 15.64 s Downloading cached cargo-package-itoa from https://cache.nix-ci.com
  639. 15.64 s Downloaded cached cargo-package-inotify (119 KiB) in 75ms
  640. 15.64 s Progress: 0 of 1 built, 203 of 675 downloaded from cache (15 downloading)
  641. 15.64 s Downloading cached cargo-package-jiff from https://cache.nix-ci.com
  642. 15.66 s Downloaded cached cargo-package-inotify-sys (39 KiB) in 74ms
  643. 15.66 s Progress: 0 of 1 built, 204 of 675 downloaded from cache (15 downloading)
  644. 15.66 s Downloading cached cargo-package-jiff-static from https://cache.nix-ci.com
  645. 15.66 s Downloaded cached cargo-package-insta (554 KiB) in 72ms
  646. 15.66 s Progress: 0 of 1 built, 205 of 675 downloaded from cache (15 downloading)
  647. 15.66 s Downloading cached cargo-package-joinery from https://cache.nix-ci.com
  648. 15.67 s Downloaded cached cargo-package-instability (68 KiB) in 74ms
  649. 15.67 s Progress: 0 of 1 built, 206 of 675 downloaded from cache (15 downloading)
  650. 15.67 s Downloaded cached cargo-package-integer-sqrt (8088 B) in 70ms
  651. 15.67 s Downloading cached cargo-package-js-sys from https://cache.nix-ci.com
  652. 15.67 s Progress: 0 of 1 built, 207 of 675 downloaded from cache (15 downloading)
  653. 15.67 s Downloading cached cargo-package-json5 from https://cache.nix-ci.com
  654. 15.67 s Downloaded cached cargo-package-inventory (55 KiB) in 64ms
  655. 15.67 s Progress: 0 of 1 built, 208 of 675 downloaded from cache (15 downloading)
  656. 15.67 s Downloading cached cargo-package-kasuari from https://cache.nix-ci.com
  657. 15.69 s Downloaded cached cargo-package-is-macro (31 KiB) in 77ms
  658. 15.69 s Progress: 0 of 1 built, 209 of 675 downloaded from cache (15 downloading)
  659. 15.69 s Downloading cached cargo-package-kqueue from https://cache.nix-ci.com
  660. 15.69 s Downloaded cached cargo-package-is_terminal_polyfill (23 KiB) in 71ms
  661. 15.69 s Downloaded cached cargo-package-is-terminal (25 KiB) in 75ms
  662. 15.69 s Progress: 0 of 1 built, 210 of 675 downloaded from cache (15 downloading)
  663. 15.69 s Downloading cached cargo-package-kqueue-sys from https://cache.nix-ci.com
  664. 15.69 s Progress: 0 of 1 built, 211 of 675 downloaded from cache (15 downloading)
  665. 15.69 s Downloading cached cargo-package-kurbo from https://cache.nix-ci.com
  666. 15.70 s Downloaded cached cargo-package-itertools (602 KiB) in 74ms
  667. 15.70 s Progress: 0 of 1 built, 212 of 675 downloaded from cache (15 downloading)
  668. 15.70 s Downloading cached cargo-package-lab from https://cache.nix-ci.com
  669. 15.71 s Downloaded cached cargo-package-itertools (559 KiB) in 89ms
  670. 15.71 s Progress: 0 of 1 built, 213 of 675 downloaded from cache (15 downloading)
  671. 15.71 s Downloading cached cargo-package-lalrpop-util from https://cache.nix-ci.com
  672. 15.71 s Downloaded cached cargo-package-itoa (53 KiB) in 72ms
  673. 15.71 s Progress: 0 of 1 built, 214 of 675 downloaded from cache (15 downloading)
  674. 15.72 s Downloading cached cargo-package-lazy_static from https://cache.nix-ci.com
  675. 15.72 s Downloaded cached cargo-package-itertools (745 KiB) in 79ms
  676. 15.72 s Progress: 0 of 1 built, 215 of 675 downloaded from cache (15 downloading)
  677. 15.72 s Downloading cached cargo-package-leb128fmt from https://cache.nix-ci.com
  678. 15.73 s Downloaded cached cargo-package-itertools (675 KiB) in 99ms
  679. 15.73 s Progress: 0 of 1 built, 216 of 675 downloaded from cache (15 downloading)
  680. 15.73 s Downloading cached cargo-package-libc from https://cache.nix-ci.com
  681. 15.74 s Downloaded cached cargo-package-itertools (710 KiB) in 107ms
  682. 15.74 s Progress: 0 of 1 built, 217 of 675 downloaded from cache (15 downloading)
  683. 15.74 s Downloading cached cargo-package-libloading from https://cache.nix-ci.com
  684. 15.75 s Downloaded cached cargo-package-jiff (3.7 MiB) in 105ms
  685. 15.75 s Progress: 0 of 1 built, 218 of 675 downloaded from cache (15 downloading)
  686. 15.75 s Downloading cached cargo-package-libm from https://cache.nix-ci.com
  687. 15.76 s Downloaded cached cargo-package-joinery (52 KiB) in 92ms
  688. 15.76 s Progress: 0 of 1 built, 219 of 675 downloaded from cache (15 downloading)
  689. 15.76 s Downloading cached cargo-package-libredox from https://cache.nix-ci.com
  690. 15.76 s Downloaded cached cargo-package-jiff-static (328 KiB) in 104ms
  691. 15.76 s Progress: 0 of 1 built, 220 of 675 downloaded from cache (15 downloading)
  692. 15.76 s Downloading cached cargo-package-line-clipping from https://cache.nix-ci.com
  693. 15.77 s Downloaded cached cargo-package-js-sys (824 KiB) in 97ms
  694. 15.77 s Progress: 0 of 1 built, 221 of 675 downloaded from cache (15 downloading)
  695. 15.77 s Downloading cached cargo-package-linux-raw-sys from https://cache.nix-ci.com
  696. 15.77 s Downloaded cached cargo-package-json5 (82 KiB) in 101ms
  697. 15.77 s Progress: 0 of 1 built, 222 of 675 downloaded from cache (15 downloading)
  698. 15.77 s Downloading cached cargo-package-linux-raw-sys from https://cache.nix-ci.com
  699. 15.78 s Downloaded cached cargo-package-kasuari (143 KiB) in 105ms
  700. 15.78 s Progress: 0 of 1 built, 223 of 675 downloaded from cache (15 downloading)
  701. 15.78 s Downloading cached cargo-package-litrs from https://cache.nix-ci.com
  702. 15.80 s Downloaded cached cargo-package-lab (67 KiB) in 98ms
  703. 15.80 s Progress: 0 of 1 built, 224 of 675 downloaded from cache (15 downloading)
  704. 15.80 s Downloading cached cargo-package-lock_api from https://cache.nix-ci.com
  705. 15.81 s Downloaded cached cargo-package-kqueue-sys (40 KiB) in 120ms
  706. 15.81 s Progress: 0 of 1 built, 225 of 675 downloaded from cache (15 downloading)
  707. 15.81 s Downloaded cached cargo-package-lalrpop-util (51 KiB) in 100ms
  708. 15.81 s Downloading cached cargo-package-log from https://cache.nix-ci.com
  709. 15.81 s Downloaded cached cargo-package-gmp-mpfr-sys (27.6 MiB) in 396ms
  710. 15.82 s Progress: 0 of 1 built, 226 of 675 downloaded from cache (15 downloading)
  711. 15.82 s Progress: 0 of 1 built, 227 of 675 downloaded from cache (14 downloading)
  712. 15.82 s Downloaded cached cargo-package-kqueue (133 KiB) in 126ms
  713. 15.82 s Downloaded cached cargo-package-kurbo (635 KiB) in 122ms
  714. 15.82 s Downloading cached cargo-package-lru from https://cache.nix-ci.com
  715. 15.82 s Downloading cached cargo-package-mac_address from https://cache.nix-ci.com
  716. 15.82 s Progress: 0 of 1 built, 228 of 675 downloaded from cache (15 downloading)
  717. 15.82 s Progress: 0 of 1 built, 229 of 675 downloaded from cache (14 downloading)
  718. 15.82 s Downloading cached cargo-package-mach2 from https://cache.nix-ci.com
  719. 15.82 s Downloading cached cargo-package-malachite-base from https://cache.nix-ci.com
  720. 15.85 s Downloaded cached cargo-package-lazy_static (47 KiB) in 130ms
  721. 15.85 s Progress: 0 of 1 built, 230 of 675 downloaded from cache (15 downloading)
  722. 15.85 s Downloading cached cargo-package-malachite-nz from https://cache.nix-ci.com
  723. 15.85 s Downloaded cached cargo-package-libloading (146 KiB) in 109ms
  724. 15.85 s Progress: 0 of 1 built, 231 of 675 downloaded from cache (15 downloading)
  725. 15.85 s Downloading cached cargo-package-malachite-q from https://cache.nix-ci.com
  726. 15.86 s Downloaded cached cargo-package-leb128fmt (74 KiB) in 134ms
  727. 15.86 s Progress: 0 of 1 built, 232 of 675 downloaded from cache (15 downloading)
  728. 15.86 s Downloading cached cargo-package-maplit from https://cache.nix-ci.com
  729. 15.87 s Downloaded cached cargo-package-line-clipping (55 KiB) in 103ms
  730. 15.87 s Progress: 0 of 1 built, 233 of 675 downloaded from cache (15 downloading)
  731. 15.87 s Downloading cached cargo-package-matchers from https://cache.nix-ci.com
  732. 15.89 s Downloaded cached cargo-package-libm (683 KiB) in 141ms
  733. 15.89 s Progress: 0 of 1 built, 234 of 675 downloaded from cache (15 downloading)
  734. 15.89 s Downloaded cached cargo-package-libc (4.3 MiB) in 161ms
  735. 15.89 s Downloading cached cargo-package-matrixmultiply from https://cache.nix-ci.com
  736. 15.89 s Progress: 0 of 1 built, 235 of 675 downloaded from cache (15 downloading)
  737. 15.89 s Downloading cached cargo-package-memchr from https://cache.nix-ci.com
  738. 15.90 s Downloaded cached cargo-package-libredox (39 KiB) in 137ms
  739. 15.90 s Progress: 0 of 1 built, 236 of 675 downloaded from cache (15 downloading)
  740. 15.90 s Downloading cached cargo-package-memmem from https://cache.nix-ci.com
  741. 15.91 s Downloaded cached cargo-package-litrs (210 KiB) in 123ms
  742. 15.91 s Progress: 0 of 1 built, 237 of 675 downloaded from cache (15 downloading)
  743. 15.91 s Downloading cached cargo-package-memoffset from https://cache.nix-ci.com
  744. 15.92 s Downloaded cached cargo-package-mac_address (45 KiB) in 104ms
  745. 15.92 s Progress: 0 of 1 built, 238 of 675 downloaded from cache (15 downloading)
  746. 15.92 s Downloaded cached cargo-package-lru (115 KiB) in 104ms
  747. 15.92 s Downloaded cached cargo-package-linux-raw-sys (16.2 MiB) in 154ms
  748. 15.92 s Downloading cached cargo-package-minimal-lexical from https://cache.nix-ci.com
  749. 15.92 s Progress: 0 of 1 built, 239 of 675 downloaded from cache (15 downloading)
  750. 15.92 s Progress: 0 of 1 built, 240 of 675 downloaded from cache (14 downloading)
  751. 15.92 s Downloaded cached cargo-package-mach2 (108 KiB) in 106ms
  752. 15.93 s Downloading cached cargo-package-miniz_oxide from https://cache.nix-ci.com
  753. 15.93 s Downloading cached cargo-package-mio from https://cache.nix-ci.com
  754. 15.93 s Progress: 0 of 1 built, 241 of 675 downloaded from cache (15 downloading)
  755. 15.93 s Downloading cached cargo-package-momtrop from https://cache.nix-ci.com
  756. 15.94 s Downloaded cached cargo-package-lock_api (205 KiB) in 133ms
  757. 15.94 s Progress: 0 of 1 built, 242 of 675 downloaded from cache (15 downloading)
  758. 15.94 s Downloading cached cargo-package-nalgebra from https://cache.nix-ci.com
  759. 15.94 s Downloaded cached cargo-package-log (241 KiB) in 127ms
  760. 15.94 s Progress: 0 of 1 built, 243 of 675 downloaded from cache (15 downloading)
  761. 15.94 s Downloading cached cargo-package-nalgebra-macros from https://cache.nix-ci.com
  762. 15.95 s Downloaded cached cargo-package-linux-raw-sys (11.4 MiB) in 175ms
  763. 15.95 s Progress: 0 of 1 built, 244 of 675 downloaded from cache (15 downloading)
  764. 15.95 s Downloading cached cargo-package-ndarray from https://cache.nix-ci.com
  765. 15.99 s Downloaded cached cargo-package-malachite-q (2 MiB) in 138ms
  766. 15.99 s Progress: 0 of 1 built, 245 of 675 downloaded from cache (15 downloading)
  767. 15.99 s Downloading cached cargo-package-nix from https://cache.nix-ci.com
  768. 15.99 s Downloaded cached cargo-package-maplit (28 KiB) in 134ms
  769. 15.99 s Progress: 0 of 1 built, 246 of 675 downloaded from cache (15 downloading)
  770. 15.99 s Downloading cached cargo-package-nix from https://cache.nix-ci.com
  771. 16.01 s Downloaded cached cargo-package-matchers (29 KiB) in 139ms
  772. 16.01 s Progress: 0 of 1 built, 247 of 675 downloaded from cache (15 downloading)
  773. 16.01 s Downloading cached cargo-package-nom from https://cache.nix-ci.com
  774. 16.02 s Downloaded cached cargo-package-malachite-base (7.5 MiB) in 197ms
  775. 16.02 s Progress: 0 of 1 built, 248 of 675 downloaded from cache (15 downloading)
  776. 16.02 s Downloading cached cargo-package-notify from https://cache.nix-ci.com
  777. 16.04 s Downloaded cached cargo-package-matrixmultiply (252 KiB) in 142ms
  778. 16.04 s Progress: 0 of 1 built, 249 of 675 downloaded from cache (15 downloading)
  779. 16.04 s Downloading cached cargo-package-notify-types from https://cache.nix-ci.com
  780. 16.05 s Downloaded cached cargo-package-minimal-lexical (335 KiB) in 127ms
  781. 16.05 s Progress: 0 of 1 built, 250 of 675 downloaded from cache (15 downloading)
  782. 16.05 s Downloading cached cargo-package-ntapi from https://cache.nix-ci.com
  783. 16.06 s Downloaded cached cargo-package-mio (484 KiB) in 139ms
  784. 16.07 s Progress: 0 of 1 built, 251 of 675 downloaded from cache (15 downloading)
  785. 16.07 s Downloading cached cargo-package-nu-ansi-term from https://cache.nix-ci.com
  786. 16.07 s Downloaded cached cargo-package-memmem (31 KiB) in 171ms
  787. 16.07 s Progress: 0 of 1 built, 252 of 675 downloaded from cache (15 downloading)
  788. 16.07 s Downloaded cached cargo-package-memchr (585 KiB) in 175ms
  789. 16.07 s Downloading cached cargo-package-num from https://cache.nix-ci.com
  790. 16.07 s Progress: 0 of 1 built, 253 of 675 downloaded from cache (15 downloading)
  791. 16.07 s Downloading cached cargo-package-num-bigint from https://cache.nix-ci.com
  792. 16.07 s Downloaded cached cargo-package-momtrop (160 KiB) in 144ms
  793. 16.07 s Progress: 0 of 1 built, 254 of 675 downloaded from cache (15 downloading)
  794. 16.07 s Downloading cached cargo-package-num-complex from https://cache.nix-ci.com
  795. 16.07 s Downloaded cached cargo-package-memoffset (41 KiB) in 167ms
  796. 16.07 s Progress: 0 of 1 built, 255 of 675 downloaded from cache (15 downloading)
  797. 16.08 s Downloading cached cargo-package-num-conv from https://cache.nix-ci.com
  798. 16.08 s Downloaded cached cargo-package-nalgebra-macros (27 KiB) in 133ms
  799. 16.08 s Progress: 0 of 1 built, 256 of 675 downloaded from cache (15 downloading)
  800. 16.08 s Downloading cached cargo-package-num-derive from https://cache.nix-ci.com
  801. 16.10 s Downloaded cached cargo-package-miniz_oxide (282 KiB) in 179ms
  802. 16.11 s Progress: 0 of 1 built, 257 of 675 downloaded from cache (15 downloading)
  803. 16.11 s Downloading cached cargo-package-num-integer from https://cache.nix-ci.com
  804. 16.13 s Downloaded cached cargo-package-ndarray (1.1 MiB) in 182ms
  805. 16.13 s Progress: 0 of 1 built, 258 of 675 downloaded from cache (15 downloading)
  806. 16.14 s Downloading cached cargo-package-num-iter from https://cache.nix-ci.com
  807. 16.14 s Downloaded cached cargo-package-nix (1.5 MiB) in 153ms
  808. 16.14 s Progress: 0 of 1 built, 259 of 675 downloaded from cache (15 downloading)
  809. 16.14 s Downloaded cached cargo-package-nalgebra (2.1 MiB) in 207ms
  810. 16.15 s Downloading cached cargo-package-num-rational from https://cache.nix-ci.com
  811. 16.15 s Progress: 0 of 1 built, 260 of 675 downloaded from cache (15 downloading)
  812. 16.15 s Downloading cached cargo-package-num-traits from https://cache.nix-ci.com
  813. 16.16 s Downloaded cached cargo-package-nix (1.7 MiB) in 171ms
  814. 16.16 s Progress: 0 of 1 built, 261 of 675 downloaded from cache (15 downloading)
  815. 16.17 s Downloading cached cargo-package-num_threads from https://cache.nix-ci.com
  816. 16.17 s Downloaded cached cargo-package-nom (655 KiB) in 160ms
  817. 16.17 s Progress: 0 of 1 built, 262 of 675 downloaded from cache (15 downloading)
  818. 16.17 s Downloading cached cargo-package-numpy from https://cache.nix-ci.com
  819. 16.18 s Downloaded cached cargo-package-malachite-nz (17.9 MiB) in 329ms
  820. 16.18 s Progress: 0 of 1 built, 263 of 675 downloaded from cache (15 downloading)
  821. 16.18 s Downloading cached cargo-package-objc2 from https://cache.nix-ci.com
  822. 16.23 s Downloaded cached cargo-package-notify (161 KiB) in 217ms
  823. 16.23 s Progress: 0 of 1 built, 264 of 675 downloaded from cache (15 downloading)
  824. 16.24 s Downloading cached cargo-package-objc2-encode from https://cache.nix-ci.com
  825. 16.24 s Downloaded cached cargo-package-notify-types (97 KiB) in 200ms
  826. 16.24 s Progress: 0 of 1 built, 265 of 675 downloaded from cache (15 downloading)
  827. 16.24 s Downloading cached cargo-package-object from https://cache.nix-ci.com
  828. 16.25 s Downloaded cached cargo-package-num (30 KiB) in 181ms
  829. 16.25 s Downloaded cached cargo-package-num-conv (24 KiB) in 177ms
  830. 16.25 s Progress: 0 of 1 built, 266 of 675 downloaded from cache (15 downloading)
  831. 16.25 s Downloading cached cargo-package-once_cell from https://cache.nix-ci.com
  832. 16.25 s Progress: 0 of 1 built, 267 of 675 downloaded from cache (15 downloading)
  833. 16.26 s Downloaded cached cargo-package-num-complex (142 KiB) in 180ms
  834. 16.26 s Downloading cached cargo-package-once_cell_polyfill from https://cache.nix-ci.com
  835. 16.26 s Progress: 0 of 1 built, 268 of 675 downloaded from cache (15 downloading)
  836. 16.26 s Downloaded cached cargo-package-num-iter (40 KiB) in 122ms
  837. 16.26 s Downloaded cached cargo-package-num-derive (66 KiB) in 179ms
  838. 16.26 s Downloading cached cargo-package-oorandom from https://cache.nix-ci.com
  839. 16.26 s Downloaded cached cargo-package-num-integer (111 KiB) in 151ms
  840. 16.26 s Downloaded cached cargo-package-num-rational (131 KiB) in 113ms
  841. 16.26 s Progress: 0 of 1 built, 269 of 675 downloaded from cache (15 downloading)
  842. 16.26 s Progress: 0 of 1 built, 270 of 675 downloaded from cache (14 downloading)
  843. 16.26 s Progress: 0 of 1 built, 271 of 675 downloaded from cache (13 downloading)
  844. 16.26 s Downloaded cached cargo-package-num-bigint (494 KiB) in 186ms
  845. 16.26 s Downloaded cached cargo-package-nu-ansi-term (129 KiB) in 192ms
  846. 16.26 s Downloading cached cargo-package-option-ext from https://cache.nix-ci.com
  847. 16.26 s Downloading cached cargo-package-ordered-float from https://cache.nix-ci.com
  848. 16.26 s Downloading cached cargo-package-owo-colors from https://cache.nix-ci.com
  849. 16.26 s Progress: 0 of 1 built, 272 of 675 downloaded from cache (15 downloading)
  850. 16.26 s Progress: 0 of 1 built, 273 of 675 downloaded from cache (14 downloading)
  851. 16.26 s Progress: 0 of 1 built, 274 of 675 downloaded from cache (13 downloading)
  852. 16.26 s Downloading cached cargo-package-papergrid from https://cache.nix-ci.com
  853. 16.26 s Downloading cached cargo-package-parking_lot from https://cache.nix-ci.com
  854. 16.26 s Downloaded cached cargo-package-ntapi (703 KiB) in 210ms
  855. 16.26 s Downloading cached cargo-package-parking_lot_core from https://cache.nix-ci.com
  856. 16.26 s Progress: 0 of 1 built, 275 of 675 downloaded from cache (15 downloading)
  857. 16.26 s Downloading cached cargo-package-paste from https://cache.nix-ci.com
  858. 16.27 s Downloaded cached cargo-package-num-traits (273 KiB) in 119ms
  859. 16.27 s Progress: 0 of 1 built, 276 of 675 downloaded from cache (15 downloading)
  860. 16.27 s Downloaded cached cargo-package-numpy (385 KiB) in 95ms
  861. 16.27 s Downloading cached cargo-package-pathdiff from https://cache.nix-ci.com
  862. 16.27 s Progress: 0 of 1 built, 277 of 675 downloaded from cache (15 downloading)
  863. 16.27 s Downloading cached cargo-package-pathfinding from https://cache.nix-ci.com
  864. 16.36 s Downloaded cached cargo-package-objc2 (1.1 MiB) in 186ms
  865. 16.36 s Progress: 0 of 1 built, 278 of 675 downloaded from cache (15 downloading)
  866. 16.37 s Downloaded cached cargo-package-num_threads (21 KiB) in 199ms
  867. 16.37 s Downloading cached cargo-package-percent-encoding from https://cache.nix-ci.com
  868. 16.37 s Progress: 0 of 1 built, 279 of 675 downloaded from cache (15 downloading)
  869. 16.37 s Downloading cached cargo-package-pest from https://cache.nix-ci.com
  870. 16.39 s Downloaded cached cargo-package-objc2-encode (94 KiB) in 152ms
  871. 16.39 s Progress: 0 of 1 built, 280 of 675 downloaded from cache (15 downloading)
  872. 16.39 s Downloading cached cargo-package-pest_derive from https://cache.nix-ci.com
  873. 16.40 s Downloaded cached cargo-package-once_cell_polyfill (23 KiB) in 139ms
  874. 16.40 s Progress: 0 of 1 built, 281 of 675 downloaded from cache (15 downloading)
  875. 16.40 s Downloading cached cargo-package-pest_generator from https://cache.nix-ci.com
  876. 16.40 s Downloaded cached cargo-package-option-ext (24 KiB) in 138ms
  877. 16.40 s Downloaded cached cargo-package-oorandom (122 KiB) in 140ms
  878. 16.40 s Progress: 0 of 1 built, 282 of 675 downloaded from cache (15 downloading)
  879. 16.40 s Downloaded cached cargo-package-papergrid (489 KiB) in 137ms
  880. 16.40 s Downloading cached cargo-package-pest_meta from https://cache.nix-ci.com
  881. 16.40 s Downloaded cached cargo-package-parking_lot (216 KiB) in 137ms
  882. 16.40 s Downloaded cached cargo-package-object (1.9 MiB) in 159ms
  883. 16.40 s Downloaded cached cargo-package-once_cell (154 KiB) in 144ms
  884. 16.40 s Downloaded cached cargo-package-paste (78 KiB) in 137ms
  885. 16.40 s Downloaded cached cargo-package-parking_lot_core (146 KiB) in 138ms
  886. 16.40 s Downloaded cached cargo-package-owo-colors (162 KiB) in 140ms
  887. 16.40 s Downloaded cached cargo-package-pathdiff (25 KiB) in 131ms
  888. 16.40 s Downloaded cached cargo-package-ordered-float (131 KiB) in 140ms
  889. 16.40 s Progress: 0 of 1 built, 283 of 675 downloaded from cache (15 downloading)
  890. 16.40 s Progress: 0 of 1 built, 284 of 675 downloaded from cache (14 downloading)
  891. 16.40 s Progress: 0 of 1 built, 285 of 675 downloaded from cache (13 downloading)
  892. 16.40 s Progress: 0 of 1 built, 286 of 675 downloaded from cache (12 downloading)
  893. 16.40 s Progress: 0 of 1 built, 287 of 675 downloaded from cache (11 downloading)
  894. 16.40 s Progress: 0 of 1 built, 288 of 675 downloaded from cache (10 downloading)
  895. 16.40 s Progress: 0 of 1 built, 289 of 675 downloaded from cache (9 downloading)
  896. 16.40 s Progress: 0 of 1 built, 290 of 675 downloaded from cache (8 downloading)
  897. 16.40 s Downloading cached cargo-package-phf from https://cache.nix-ci.com
  898. 16.40 s Downloading cached cargo-package-phf from https://cache.nix-ci.com
  899. 16.40 s Downloading cached cargo-package-phf_codegen from https://cache.nix-ci.com
  900. 16.40 s Downloading cached cargo-package-phf_generator from https://cache.nix-ci.com
  901. 16.40 s Downloading cached cargo-package-phf_generator from https://cache.nix-ci.com
  902. 16.40 s Downloading cached cargo-package-phf_macros from https://cache.nix-ci.com
  903. 16.40 s Downloading cached cargo-package-phf_shared from https://cache.nix-ci.com
  904. 16.40 s Progress: 0 of 1 built, 291 of 675 downloaded from cache (15 downloading)
  905. 16.40 s Progress: 0 of 1 built, 292 of 675 downloaded from cache (14 downloading)
  906. 16.40 s Downloading cached cargo-package-phf_macros from https://cache.nix-ci.com
  907. 16.40 s Downloading cached cargo-package-phf_shared from https://cache.nix-ci.com
  908. 16.40 s Downloading cached cargo-package-pin-project-lite from https://cache.nix-ci.com
  909. 16.41 s Downloaded cached cargo-package-pathfinding (730 KiB) in 140ms
  910. 16.41 s Progress: 0 of 1 built, 293 of 675 downloaded from cache (15 downloading)
  911. 16.41 s Downloading cached cargo-package-plotters from https://cache.nix-ci.com
  912. 16.41 s Downloaded cached cargo-package-plotters in 0ms
  913. 16.41 s Progress: 0 of 1 built, 294 of 675 downloaded from cache (15 downloading)
  914. 16.41 s Downloading cached cargo-package-plotters-backend from https://cache.nix-ci.com
  915. 16.43 s Downloaded cached cargo-package-percent-encoding (36 KiB) in 66ms
  916. 16.43 s Progress: 0 of 1 built, 295 of 675 downloaded from cache (15 downloading)
  917. 16.43 s Downloading cached cargo-package-plotters-svg from https://cache.nix-ci.com
  918. 16.44 s Downloaded cached cargo-package-pest (1.4 MiB) in 70ms
  919. 16.44 s Progress: 0 of 1 built, 296 of 675 downloaded from cache (15 downloading)
  920. 16.44 s Downloading cached cargo-package-portable-atomic from https://cache.nix-ci.com
  921. 16.46 s Downloaded cached cargo-package-pest_derive (176 KiB) in 71ms
  922. 16.46 s Progress: 0 of 1 built, 297 of 675 downloaded from cache (15 downloading)
  923. 16.46 s Downloading cached cargo-package-portable-atomic-util from https://cache.nix-ci.com
  924. 16.48 s Downloaded cached cargo-package-pest_meta (375 KiB) in 80ms
  925. 16.48 s Progress: 0 of 1 built, 298 of 675 downloaded from cache (15 downloading)
  926. 16.48 s Downloading cached cargo-package-powerfmt from https://cache.nix-ci.com
  927. 16.48 s Downloaded cached cargo-package-pest_generator (179 KiB) in 82ms
  928. 16.48 s Progress: 0 of 1 built, 299 of 675 downloaded from cache (15 downloading)
  929. 16.48 s Downloading cached cargo-package-ppv-lite86 from https://cache.nix-ci.com
  930. 16.49 s Downloaded cached cargo-package-phf_generator (50 KiB) in 82ms
  931. 16.49 s Progress: 0 of 1 built, 300 of 675 downloaded from cache (15 downloading)
  932. 16.49 s Downloaded cached cargo-package-phf_codegen (46 KiB) in 85ms
  933. 16.49 s Downloading cached cargo-package-prettyplease from https://cache.nix-ci.com
  934. 16.49 s Progress: 0 of 1 built, 301 of 675 downloaded from cache (15 downloading)
  935. 16.49 s Downloading cached cargo-package-proc-macro-error from https://cache.nix-ci.com
  936. 16.49 s Downloaded cached cargo-package-phf_shared (47 KiB) in 86ms
  937. 16.49 s Downloaded cached cargo-package-phf_shared (51 KiB) in 85ms
  938. 16.49 s Progress: 0 of 1 built, 302 of 675 downloaded from cache (15 downloading)
  939. 16.49 s Progress: 0 of 1 built, 303 of 675 downloaded from cache (14 downloading)
  940. 16.49 s Downloaded cached cargo-package-phf (92 KiB) in 86ms
  941. 16.49 s Downloading cached cargo-package-proc-macro-error-attr from https://cache.nix-ci.com
  942. 16.49 s Downloading cached cargo-package-proc-macro-error-attr2 from https://cache.nix-ci.com
  943. 16.49 s Progress: 0 of 1 built, 304 of 675 downloaded from cache (15 downloading)
  944. 16.49 s Downloading cached cargo-package-proc-macro-error2 from https://cache.nix-ci.com
  945. 16.49 s Downloaded cached cargo-package-phf_generator (51 KiB) in 88ms
  946. 16.49 s Progress: 0 of 1 built, 305 of 675 downloaded from cache (15 downloading)
  947. 16.49 s Downloaded cached cargo-package-phf_macros (74 KiB) in 88ms
  948. 16.49 s Downloaded cached cargo-package-phf_macros (59 KiB) in 89ms
  949. 16.49 s Downloading cached cargo-package-proc-macro2 from https://cache.nix-ci.com
  950. 16.49 s Progress: 0 of 1 built, 306 of 675 downloaded from cache (15 downloading)
  951. 16.49 s Progress: 0 of 1 built, 307 of 675 downloaded from cache (14 downloading)
  952. 16.49 s Downloading cached cargo-package-proc-macro2-diagnostics from https://cache.nix-ci.com
  953. 16.49 s Downloading cached cargo-package-proptest from https://cache.nix-ci.com
  954. 16.50 s Downloaded cached cargo-package-plotters-backend (55 KiB) in 85ms
  955. 16.50 s Progress: 0 of 1 built, 308 of 675 downloaded from cache (15 downloading)
  956. 16.50 s Downloaded cached cargo-package-pin-project-lite (251 KiB) in 94ms
  957. 16.50 s Downloading cached cargo-package-ptr_meta from https://cache.nix-ci.com
  958. 16.50 s Progress: 0 of 1 built, 309 of 675 downloaded from cache (15 downloading)
  959. 16.50 s Downloading cached cargo-package-ptr_meta_derive from https://cache.nix-ci.com
  960. 16.53 s Downloaded cached cargo-package-plotters-svg (28 KiB) in 93ms
  961. 16.53 s Progress: 0 of 1 built, 310 of 675 downloaded from cache (15 downloading)
  962. 16.53 s Downloading cached cargo-package-pyo3 from https://cache.nix-ci.com
  963. 16.53 s Downloaded cached cargo-package-portable-atomic (1.2 MiB) in 92ms
  964. 16.53 s Progress: 0 of 1 built, 311 of 675 downloaded from cache (15 downloading)
  965. 16.53 s Downloaded cached cargo-package-portable-atomic-util (212 KiB) in 68ms
  966. 16.53 s Downloading cached cargo-package-pyo3-build-config from https://cache.nix-ci.com
  967. 16.53 s Progress: 0 of 1 built, 312 of 675 downloaded from cache (15 downloading)
  968. 16.54 s Downloading cached cargo-package-pyo3-ffi from https://cache.nix-ci.com
  969. 16.56 s Downloaded cached cargo-package-powerfmt (58 KiB) in 77ms
  970. 16.56 s Progress: 0 of 1 built, 313 of 675 downloaded from cache (15 downloading)
  971. 16.56 s Downloading cached cargo-package-pyo3-macros from https://cache.nix-ci.com
  972. 16.57 s Downloaded cached cargo-package-ppv-lite86 (132 KiB) in 82ms
  973. 16.57 s Progress: 0 of 1 built, 314 of 675 downloaded from cache (15 downloading)
  974. 16.57 s Downloading cached cargo-package-pyo3-macros-backend from https://cache.nix-ci.com
  975. 16.57 s Downloaded cached cargo-package-prettyplease (416 KiB) in 79ms
  976. 16.57 s Progress: 0 of 1 built, 315 of 675 downloaded from cache (15 downloading)
  977. 16.57 s Downloading cached cargo-package-pyo3-stub-gen from https://cache.nix-ci.com
  978. 16.58 s Downloaded cached cargo-package-proc-macro-error-attr (23 KiB) in 94ms
  979. 16.58 s Progress: 0 of 1 built, 316 of 675 downloaded from cache (15 downloading)
  980. 16.58 s Downloading cached cargo-package-pyo3-stub-gen-derive from https://cache.nix-ci.com
  981. 16.59 s Downloaded cached cargo-package-proc-macro2 (271 KiB) in 95ms
  982. 16.59 s Progress: 0 of 1 built, 317 of 675 downloaded from cache (15 downloading)
  983. 16.59 s Downloading cached cargo-package-quick-error from https://cache.nix-ci.com
  984. 16.59 s Downloaded cached cargo-package-proc-macro-error-attr2 (23 KiB) in 99ms
  985. 16.59 s Progress: 0 of 1 built, 318 of 675 downloaded from cache (15 downloading)
  986. 16.59 s Downloading cached cargo-package-quote from https://cache.nix-ci.com
  987. 16.59 s Downloaded cached cargo-package-proc-macro-error (95 KiB) in 104ms
  988. 16.59 s Progress: 0 of 1 built, 319 of 675 downloaded from cache (15 downloading)
  989. 16.59 s Downloaded cached cargo-package-proc-macro2-diagnostics (46 KiB) in 100ms
  990. 16.59 s Downloading cached cargo-package-r-efi from https://cache.nix-ci.com
  991. 16.59 s Progress: 0 of 1 built, 320 of 675 downloaded from cache (15 downloading)
  992. 16.59 s Downloading cached cargo-package-r-efi from https://cache.nix-ci.com
  993. 16.60 s Downloaded cached cargo-package-ptr_meta_derive (6920 B) in 99ms
  994. 16.60 s Progress: 0 of 1 built, 321 of 675 downloaded from cache (15 downloading)
  995. 16.60 s Downloading cached cargo-package-radium from https://cache.nix-ci.com
  996. 16.61 s Downloaded cached cargo-package-phf (87 KiB) in 204ms
  997. 16.61 s Downloaded cached cargo-package-proptest (914 KiB) in 113ms
  998. 16.61 s Progress: 0 of 1 built, 322 of 675 downloaded from cache (15 downloading)
  999. 16.61 s Downloading cached cargo-package-rand from https://cache.nix-ci.com
  1000. 16.61 s Progress: 0 of 1 built, 323 of 675 downloaded from cache (15 downloading)
  1001. 16.61 s Downloading cached cargo-package-rand from https://cache.nix-ci.com
  1002. 16.61 s Downloaded cached cargo-package-proc-macro-error2 (94 KiB) in 123ms
  1003. 16.61 s Progress: 0 of 1 built, 324 of 675 downloaded from cache (15 downloading)
  1004. 16.62 s Downloading cached cargo-package-rand_chacha from https://cache.nix-ci.com
  1005. 16.62 s Downloaded cached cargo-package-ptr_meta (19 KiB) in 125ms
  1006. 16.62 s Progress: 0 of 1 built, 325 of 675 downloaded from cache (15 downloading)
  1007. 16.63 s Downloading cached cargo-package-rand_chacha from https://cache.nix-ci.com
  1008. 16.64 s Downloaded cached cargo-package-pyo3-build-config (160 KiB) in 106ms
  1009. 16.64 s Progress: 0 of 1 built, 326 of 675 downloaded from cache (15 downloading)
  1010. 16.64 s Downloading cached cargo-package-rand_core from https://cache.nix-ci.com
  1011. 16.71 s Downloaded cached cargo-package-pyo3-macros (28 KiB) in 156ms
  1012. 16.72 s Progress: 0 of 1 built, 327 of 675 downloaded from cache (15 downloading)
  1013. 16.72 s Downloaded cached cargo-package-pyo3-stub-gen (190 KiB) in 146ms
  1014. 16.72 s Downloading cached cargo-package-rand_core from https://cache.nix-ci.com
  1015. 16.72 s Progress: 0 of 1 built, 328 of 675 downloaded from cache (15 downloading)
  1016. 16.72 s Downloading cached cargo-package-rand_distr from https://cache.nix-ci.com
  1017. 16.72 s Downloaded cached cargo-package-rand_chacha (53 KiB) in 102ms
  1018. 16.72 s Progress: 0 of 1 built, 329 of 675 downloaded from cache (15 downloading)
  1019. 16.72 s Downloaded cached cargo-package-r-efi (296 KiB) in 123ms
  1020. 16.72 s Downloaded cached cargo-package-pyo3-ffi (423 KiB) in 183ms
  1021. 16.72 s Downloaded cached cargo-package-quick-error (64 KiB) in 129ms
  1022. 16.72 s Downloading cached cargo-package-rand_xorshift from https://cache.nix-ci.com
  1023. 16.72 s Downloaded cached cargo-package-quote (142 KiB) in 128ms
  1024. 16.72 s Progress: 0 of 1 built, 330 of 675 downloaded from cache (15 downloading)
  1025. 16.72 s Progress: 0 of 1 built, 331 of 675 downloaded from cache (14 downloading)
  1026. 16.72 s Progress: 0 of 1 built, 332 of 675 downloaded from cache (13 downloading)
  1027. 16.72 s Progress: 0 of 1 built, 333 of 675 downloaded from cache (12 downloading)
  1028. 16.72 s Downloaded cached cargo-package-pyo3-macros-backend (451 KiB) in 153ms
  1029. 16.72 s Downloading cached cargo-package-ratatui-core from https://cache.nix-ci.com
  1030. 16.72 s Downloading cached cargo-package-ratatui from https://cache.nix-ci.com
  1031. 16.72 s Downloading cached cargo-package-ratatui-crossterm from https://cache.nix-ci.com
  1032. 16.72 s Downloading cached cargo-package-rand_xoshiro from https://cache.nix-ci.com
  1033. 16.72 s Progress: 0 of 1 built, 334 of 675 downloaded from cache (15 downloading)
  1034. 16.72 s Downloaded cached cargo-package-r-efi (301 KiB) in 126ms
  1035. 16.72 s Downloading cached cargo-package-ratatui-macros from https://cache.nix-ci.com
  1036. 16.72 s Progress: 0 of 1 built, 335 of 675 downloaded from cache (15 downloading)
  1037. 16.72 s Downloading cached cargo-package-ratatui-termwiz from https://cache.nix-ci.com
  1038. 16.72 s Downloaded cached cargo-package-pyo3-stub-gen-derive (275 KiB) in 139ms
  1039. 16.72 s Progress: 0 of 1 built, 336 of 675 downloaded from cache (15 downloading)
  1040. 16.73 s Downloading cached cargo-package-ratatui-widgets from https://cache.nix-ci.com
  1041. 16.73 s Downloaded cached cargo-package-radium (51 KiB) in 126ms
  1042. 16.73 s Progress: 0 of 1 built, 337 of 675 downloaded from cache (15 downloading)
  1043. 16.73 s Downloading cached cargo-package-rawpointer from https://cache.nix-ci.com
  1044. 16.73 s Downloaded cached cargo-package-rand (331 KiB) in 124ms
  1045. 16.73 s Progress: 0 of 1 built, 338 of 675 downloaded from cache (15 downloading)
  1046. 16.73 s Downloaded cached cargo-package-rand (409 KiB) in 123ms
  1047. 16.73 s Downloading cached cargo-package-rayon from https://cache.nix-ci.com
  1048. 16.73 s Progress: 0 of 1 built, 339 of 675 downloaded from cache (15 downloading)
  1049. 16.73 s Downloading cached cargo-package-rayon-core from https://cache.nix-ci.com
  1050. 16.75 s Downloaded cached cargo-package-rand_chacha (63 KiB) in 122ms
  1051. 16.75 s Progress: 0 of 1 built, 340 of 675 downloaded from cache (15 downloading)
  1052. 16.75 s Downloaded cached cargo-package-rand_core (79 KiB) in 106ms
  1053. 16.75 s Downloading cached cargo-package-redox_syscall from https://cache.nix-ci.com
  1054. 16.75 s Progress: 0 of 1 built, 341 of 675 downloaded from cache (15 downloading)
  1055. 16.75 s Downloading cached cargo-package-redox_users from https://cache.nix-ci.com
  1056. 16.76 s Downloaded cached cargo-package-pyo3 (3.8 MiB) in 226ms
  1057. 16.76 s Progress: 0 of 1 built, 342 of 675 downloaded from cache (15 downloading)
  1058. 16.76 s Downloading cached cargo-package-reedline from https://cache.nix-ci.com
  1059. 16.80 s Downloaded cached cargo-package-rand_core (84 KiB) in 79ms
  1060. 16.80 s Progress: 0 of 1 built, 343 of 675 downloaded from cache (15 downloading)
  1061. 16.80 s Downloading cached cargo-package-ref-cast from https://cache.nix-ci.com
  1062. 16.81 s Downloaded cached cargo-package-ratatui-crossterm (70 KiB) in 90ms
  1063. 16.81 s Progress: 0 of 1 built, 344 of 675 downloaded from cache (15 downloading)
  1064. 16.81 s Downloading cached cargo-package-ref-cast-impl from https://cache.nix-ci.com
  1065. 16.81 s Downloaded cached cargo-package-ratatui-macros (71 KiB) in 92ms
  1066. 16.81 s Progress: 0 of 1 built, 345 of 675 downloaded from cache (15 downloading)
  1067. 16.81 s Downloading cached cargo-package-ref-ops from https://cache.nix-ci.com
  1068. 16.82 s Downloaded cached cargo-package-ratatui (347 KiB) in 99ms
  1069. 16.82 s Progress: 0 of 1 built, 346 of 675 downloaded from cache (15 downloading)
  1070. 16.82 s Downloaded cached cargo-package-rand_distr (226 KiB) in 102ms
  1071. 16.82 s Downloaded cached cargo-package-rand_xorshift (30 KiB) in 101ms
  1072. 16.82 s Downloading cached cargo-package-regex from https://cache.nix-ci.com
  1073. 16.82 s Progress: 0 of 1 built, 347 of 675 downloaded from cache (15 downloading)
  1074. 16.82 s Progress: 0 of 1 built, 348 of 675 downloaded from cache (14 downloading)
  1075. 16.82 s Downloading cached cargo-package-regex-automata from https://cache.nix-ci.com
  1076. 16.82 s Downloading cached cargo-package-regex-syntax from https://cache.nix-ci.com
  1077. 16.83 s Downloaded cached cargo-package-ratatui-core (863 KiB) in 110ms
  1078. 16.83 s Progress: 0 of 1 built, 349 of 675 downloaded from cache (15 downloading)
  1079. 16.83 s Downloading cached cargo-package-region from https://cache.nix-ci.com
  1080. 16.84 s Downloaded cached cargo-package-ratatui-termwiz (70 KiB) in 115ms
  1081. 16.84 s Progress: 0 of 1 built, 350 of 675 downloaded from cache (15 downloading)
  1082. 16.84 s Downloading cached cargo-package-rend from https://cache.nix-ci.com
  1083. 16.85 s Downloaded cached cargo-package-rand_xoshiro (97 KiB) in 128ms
  1084. 16.85 s Progress: 0 of 1 built, 351 of 675 downloaded from cache (15 downloading)
  1085. 16.85 s Downloading cached cargo-package-ringbuffer from https://cache.nix-ci.com
  1086. 16.85 s Downloaded cached cargo-package-rawpointer (22 KiB) in 121ms
  1087. 16.85 s Progress: 0 of 1 built, 352 of 675 downloaded from cache (15 downloading)
  1088. 16.85 s Downloading cached cargo-package-rkyv from https://cache.nix-ci.com
  1089. 16.87 s Downloaded cached cargo-package-rayon-core (289 KiB) in 131ms
  1090. 16.87 s Progress: 0 of 1 built, 353 of 675 downloaded from cache (15 downloading)
  1091. 16.87 s Downloading cached cargo-package-rkyv_derive from https://cache.nix-ci.com
  1092. 16.87 s Downloaded cached cargo-package-redox_syscall (159 KiB) in 122ms
  1093. 16.87 s Progress: 0 of 1 built, 354 of 675 downloaded from cache (15 downloading)
  1094. 16.87 s Downloading cached cargo-package-ron from https://cache.nix-ci.com
  1095. 16.87 s Downloaded cached cargo-package-redox_users (65 KiB) in 121ms
  1096. 16.87 s Progress: 0 of 1 built, 355 of 675 downloaded from cache (15 downloading)
  1097. 16.87 s Downloading cached cargo-package-ron from https://cache.nix-ci.com
  1098. 16.87 s Downloaded cached cargo-package-rayon (920 KiB) in 140ms
  1099. 16.87 s Progress: 0 of 1 built, 356 of 675 downloaded from cache (15 downloading)
  1100. 16.87 s Downloading cached cargo-package-rug from https://cache.nix-ci.com
  1101. 16.88 s Downloaded cached cargo-package-ratatui-widgets (1.1 MiB) in 150ms
  1102. 16.88 s Progress: 0 of 1 built, 357 of 675 downloaded from cache (15 downloading)
  1103. 16.88 s Downloading cached cargo-package-rust-embed from https://cache.nix-ci.com
  1104. 16.90 s Downloaded cached cargo-package-reedline (778 KiB) in 146ms
  1105. 16.90 s Progress: 0 of 1 built, 358 of 675 downloaded from cache (15 downloading)
  1106. 16.91 s Downloading cached cargo-package-rust-embed-impl from https://cache.nix-ci.com
  1107. 16.93 s Downloaded cached cargo-package-ref-cast (57 KiB) in 130ms
  1108. 16.93 s Progress: 0 of 1 built, 359 of 675 downloaded from cache (15 downloading)
  1109. 16.93 s Downloading cached cargo-package-rust-embed-utils from https://cache.nix-ci.com
  1110. 16.95 s Downloaded cached cargo-package-ref-cast-impl (33 KiB) in 133ms
  1111. 16.95 s Progress: 0 of 1 built, 360 of 675 downloaded from cache (15 downloading)
  1112. 16.95 s Downloading cached cargo-package-rust_lisp from https://cache.nix-ci.com
  1113. 16.95 s Downloaded cached cargo-package-ref-ops (47 KiB) in 132ms
  1114. 16.95 s Progress: 0 of 1 built, 361 of 675 downloaded from cache (15 downloading)
  1115. 16.95 s Downloading cached cargo-package-rustc-demangle from https://cache.nix-ci.com
  1116. 16.96 s Downloaded cached cargo-package-rend (51 KiB) in 119ms
  1117. 16.96 s Progress: 0 of 1 built, 362 of 675 downloaded from cache (15 downloading)
  1118. 16.96 s Downloaded cached cargo-package-regex (713 KiB) in 137ms
  1119. 16.96 s Downloading cached cargo-package-rustc-hash from https://cache.nix-ci.com
  1120. 16.96 s Progress: 0 of 1 built, 363 of 675 downloaded from cache (15 downloading)
  1121. 16.96 s Downloading cached cargo-package-rustc-hash from https://cache.nix-ci.com
  1122. 16.97 s Downloaded cached cargo-package-regex-syntax (1.6 MiB) in 145ms
  1123. 16.97 s Progress: 0 of 1 built, 364 of 675 downloaded from cache (15 downloading)
  1124. 16.97 s Downloading cached cargo-package-rustc_version from https://cache.nix-ci.com
  1125. 16.98 s Downloaded cached cargo-package-ringbuffer (184 KiB) in 125ms
  1126. 16.98 s Progress: 0 of 1 built, 365 of 675 downloaded from cache (15 downloading)
  1127. 16.98 s Downloading cached cargo-package-rustix from https://cache.nix-ci.com
  1128. 16.98 s Downloaded cached cargo-package-rkyv_derive (128 KiB) in 111ms
  1129. 16.98 s Progress: 0 of 1 built, 366 of 675 downloaded from cache (15 downloading)
  1130. 16.98 s Downloading cached cargo-package-rustix from https://cache.nix-ci.com
  1131. 16.98 s Downloaded cached cargo-package-region (92 KiB) in 146ms
  1132. 16.98 s Progress: 0 of 1 built, 367 of 675 downloaded from cache (15 downloading)
  1133. 16.98 s Downloading cached cargo-package-rustpython-ast from https://cache.nix-ci.com
  1134. 16.98 s Downloaded cached cargo-package-regex-automata (2.6 MiB) in 158ms
  1135. 16.98 s Progress: 0 of 1 built, 368 of 675 downloaded from cache (15 downloading)
  1136. 16.98 s Downloading cached cargo-package-rustpython-parser from https://cache.nix-ci.com
  1137. 16.98 s Downloaded cached cargo-package-rkyv (667 KiB) in 131ms
  1138. 16.98 s Progress: 0 of 1 built, 369 of 675 downloaded from cache (15 downloading)
  1139. 16.98 s Downloading cached cargo-package-rustpython-parser-core from https://cache.nix-ci.com
  1140. 16.99 s Downloaded cached cargo-package-ron (719 KiB) in 119ms
  1141. 16.99 s Progress: 0 of 1 built, 370 of 675 downloaded from cache (15 downloading)
  1142. 16.99 s Downloading cached cargo-package-rustpython-parser-vendored from https://cache.nix-ci.com
  1143. 17.17 s Downloaded cached cargo-package-ron (320 KiB) in 295ms
  1144. 17.17 s Progress: 0 of 1 built, 371 of 675 downloaded from cache (15 downloading)
  1145. 17.17 s Downloading cached cargo-package-rustversion from https://cache.nix-ci.com
  1146. 17.21 s Downloaded cached cargo-package-rustpython-parser-core (17 KiB) in 224ms
  1147. 17.21 s Progress: 0 of 1 built, 372 of 675 downloaded from cache (15 downloading)
  1148. 17.21 s Downloading cached cargo-package-rusty-fork from https://cache.nix-ci.com
  1149. 17.22 s Downloaded cached cargo-package-rustpython-parser (3.1 MiB) in 233ms
  1150. 17.22 s Progress: 0 of 1 built, 373 of 675 downloaded from cache (15 downloading)
  1151. 17.22 s Downloading cached cargo-package-ryu from https://cache.nix-ci.com
  1152. 17.25 s Downloaded cached cargo-package-rustpython-parser-vendored (72 KiB) in 253ms
  1153. 17.25 s Progress: 0 of 1 built, 374 of 675 downloaded from cache (15 downloading)
  1154. 17.25 s Downloading cached cargo-package-safe_arch from https://cache.nix-ci.com
  1155. 17.29 s Downloaded cached cargo-package-rug (2.3 MiB) in 415ms
  1156. 17.29 s Progress: 0 of 1 built, 375 of 675 downloaded from cache (15 downloading)
  1157. 17.29 s Downloading cached cargo-package-safe_arch from https://cache.nix-ci.com
  1158. 17.33 s Downloaded cached cargo-package-rust-embed-utils (17 KiB) in 400ms
  1159. 17.33 s Downloaded cached cargo-package-rust-embed-impl (30 KiB) in 424ms
  1160. 17.33 s Progress: 0 of 1 built, 376 of 675 downloaded from cache (15 downloading)
  1161. 17.33 s Downloading cached cargo-package-safe_arch from https://cache.nix-ci.com
  1162. 17.33 s Progress: 0 of 1 built, 377 of 675 downloaded from cache (15 downloading)
  1163. 17.33 s Downloading cached cargo-package-same-file from https://cache.nix-ci.com
  1164. 17.33 s Downloaded cached cargo-package-rustc-hash (25 KiB) in 372ms
  1165. 17.33 s Downloaded cached cargo-package-rustc-hash (46 KiB) in 370ms
  1166. 17.33 s Progress: 0 of 1 built, 378 of 675 downloaded from cache (15 downloading)
  1167. 17.33 s Downloaded cached cargo-package-rust_lisp (101 KiB) in 384ms
  1168. 17.33 s Downloading cached cargo-package-scc from https://cache.nix-ci.com
  1169. 17.33 s Progress: 0 of 1 built, 379 of 675 downloaded from cache (15 downloading)
  1170. 17.33 s Progress: 0 of 1 built, 380 of 675 downloaded from cache (14 downloading)
  1171. 17.33 s Downloaded cached cargo-package-rustc-demangle (156 KiB) in 384ms
  1172. 17.33 s Downloading cached cargo-package-schemars from https://cache.nix-ci.com
  1173. 17.33 s Downloading cached cargo-package-schemars_derive from https://cache.nix-ci.com
  1174. 17.33 s Progress: 0 of 1 built, 381 of 675 downloaded from cache (15 downloading)
  1175. 17.33 s Downloading cached cargo-package-scopeguard from https://cache.nix-ci.com
  1176. 17.34 s Downloaded cached cargo-package-rustc_version (46 KiB) in 367ms
  1177. 17.34 s Progress: 0 of 1 built, 382 of 675 downloaded from cache (15 downloading)
  1178. 17.34 s Downloading cached cargo-package-sdd from https://cache.nix-ci.com
  1179. 17.34 s Downloaded cached cargo-package-rust-embed (1014 KiB) in 465ms
  1180. 17.34 s Progress: 0 of 1 built, 383 of 675 downloaded from cache (15 downloading)
  1181. 17.34 s Downloading cached cargo-package-seahash from https://cache.nix-ci.com
  1182. 17.37 s Downloaded cached cargo-package-rusty-fork (70 KiB) in 162ms
  1183. 17.37 s Progress: 0 of 1 built, 384 of 675 downloaded from cache (15 downloading)
  1184. 17.37 s Downloaded cached cargo-package-rustversion (81 KiB) in 203ms
  1185. 17.37 s Downloading cached cargo-package-self_cell from https://cache.nix-ci.com
  1186. 17.37 s Downloaded cached cargo-package-rustpython-ast (405 KiB) in 392ms
  1187. 17.37 s Progress: 0 of 1 built, 385 of 675 downloaded from cache (15 downloading)
  1188. 17.37 s Progress: 0 of 1 built, 386 of 675 downloaded from cache (14 downloading)
  1189. 17.37 s Downloaded cached cargo-package-rustix (2.1 MiB) in 396ms
  1190. 17.37 s Downloading cached cargo-package-semver from https://cache.nix-ci.com
  1191. 17.37 s Downloading cached cargo-package-serde from https://cache.nix-ci.com
  1192. 17.37 s Progress: 0 of 1 built, 387 of 675 downloaded from cache (15 downloading)
  1193. 17.37 s Downloading cached cargo-package-serde-big-array from https://cache.nix-ci.com
  1194. 17.37 s Downloaded cached cargo-package-ryu (187 KiB) in 158ms
  1195. 17.37 s Progress: 0 of 1 built, 388 of 675 downloaded from cache (15 downloading)
  1196. 17.38 s Downloading cached cargo-package-serde_core from https://cache.nix-ci.com
  1197. 17.38 s Downloaded cached cargo-package-safe_arch (555 KiB) in 132ms
  1198. 17.38 s Progress: 0 of 1 built, 389 of 675 downloaded from cache (15 downloading)
  1199. 17.38 s Downloading cached cargo-package-serde_derive from https://cache.nix-ci.com
  1200. 17.38 s Downloaded cached cargo-package-safe_arch (713 KiB) in 91ms
  1201. 17.38 s Progress: 0 of 1 built, 390 of 675 downloaded from cache (15 downloading)
  1202. 17.38 s Downloading cached cargo-package-serde_derive_internals from https://cache.nix-ci.com
  1203. 17.40 s Downloaded cached cargo-package-rustix (2.3 MiB) in 416ms
  1204. 17.40 s Progress: 0 of 1 built, 391 of 675 downloaded from cache (15 downloading)
  1205. 17.40 s Downloading cached cargo-package-serde_json from https://cache.nix-ci.com
  1206. 17.40 s Downloaded cached cargo-package-same-file (37 KiB) in 73ms
  1207. 17.40 s Progress: 0 of 1 built, 392 of 675 downloaded from cache (15 downloading)
  1208. 17.40 s Downloading cached cargo-package-serde_repr from https://cache.nix-ci.com
  1209. 17.41 s Downloaded cached cargo-package-safe_arch (714 KiB) in 79ms
  1210. 17.41 s Progress: 0 of 1 built, 393 of 675 downloaded from cache (15 downloading)
  1211. 17.41 s Downloading cached cargo-package-serde_spanned from https://cache.nix-ci.com
  1212. 17.41 s Downloaded cached cargo-package-schemars_derive (140 KiB) in 77ms
  1213. 17.41 s Progress: 0 of 1 built, 394 of 675 downloaded from cache (15 downloading)
  1214. 17.41 s Downloaded cached cargo-package-scopeguard (37 KiB) in 77ms
  1215. 17.41 s Downloading cached cargo-package-serde_spanned from https://cache.nix-ci.com
  1216. 17.41 s Progress: 0 of 1 built, 395 of 675 downloaded from cache (15 downloading)
  1217. 17.41 s Downloading cached cargo-package-serde_yaml from https://cache.nix-ci.com
  1218. 17.41 s Downloaded cached cargo-package-scc (933 KiB) in 81ms
  1219. 17.41 s Progress: 0 of 1 built, 396 of 675 downloaded from cache (15 downloading)
  1220. 17.41 s Downloading cached cargo-package-serial_test from https://cache.nix-ci.com
  1221. 17.42 s Downloaded cached cargo-package-sdd (158 KiB) in 76ms
  1222. 17.42 s Progress: 0 of 1 built, 397 of 675 downloaded from cache (15 downloading)
  1223. 17.42 s Downloading cached cargo-package-serial_test_derive from https://cache.nix-ci.com
  1224. 17.42 s Downloaded cached cargo-package-schemars (586 KiB) in 88ms
  1225. 17.42 s Progress: 0 of 1 built, 398 of 675 downloaded from cache (15 downloading)
  1226. 17.42 s Downloading cached cargo-package-sha2 from https://cache.nix-ci.com
  1227. 17.43 s Downloaded cached cargo-package-seahash (69 KiB) in 84ms
  1228. 17.43 s Progress: 0 of 1 built, 399 of 675 downloaded from cache (15 downloading)
  1229. 17.43 s Downloading cached cargo-package-sharded-slab from https://cache.nix-ci.com
  1230. 17.47 s Downloaded cached cargo-package-serde_derive (333 KiB) in 94ms
  1231. 17.47 s Progress: 0 of 1 built, 400 of 675 downloaded from cache (15 downloading)
  1232. 17.48 s Downloading cached cargo-package-shellexpand from https://cache.nix-ci.com
  1233. 17.49 s Downloaded cached cargo-package-serde-big-array (25 KiB) in 113ms
  1234. 17.49 s Progress: 0 of 1 built, 401 of 675 downloaded from cache (15 downloading)
  1235. 17.49 s Downloading cached cargo-package-shlex from https://cache.nix-ci.com
  1236. 17.49 s Downloaded cached cargo-package-serde_core (389 KiB) in 114ms
  1237. 17.49 s Progress: 0 of 1 built, 402 of 675 downloaded from cache (15 downloading)
  1238. 17.49 s Downloading cached cargo-package-signal-hook from https://cache.nix-ci.com
  1239. 17.49 s Downloaded cached cargo-package-serde (555 KiB) in 117ms
  1240. 17.49 s Progress: 0 of 1 built, 403 of 675 downloaded from cache (15 downloading)
  1241. 17.49 s Downloading cached cargo-package-signal-hook-mio from https://cache.nix-ci.com
  1242. 17.49 s Downloaded cached cargo-package-semver (134 KiB) in 118ms
  1243. 17.49 s Progress: 0 of 1 built, 404 of 675 downloaded from cache (15 downloading)
  1244. 17.49 s Downloading cached cargo-package-signal-hook-registry from https://cache.nix-ci.com
  1245. 17.50 s Downloaded cached cargo-package-self_cell (81 KiB) in 126ms
  1246. 17.50 s Progress: 0 of 1 built, 405 of 675 downloaded from cache (15 downloading)
  1247. 17.50 s Downloading cached cargo-package-simba from https://cache.nix-ci.com
  1248. 17.51 s Downloaded cached cargo-package-serde_derive_internals (130 KiB) in 129ms
  1249. 17.51 s Progress: 0 of 1 built, 406 of 675 downloaded from cache (15 downloading)
  1250. 17.51 s Downloading cached cargo-package-simba from https://cache.nix-ci.com
  1251. 17.51 s Downloaded cached cargo-package-serde_json (748 KiB) in 117ms
  1252. 17.51 s Progress: 0 of 1 built, 407 of 675 downloaded from cache (15 downloading)
  1253. 17.51 s Downloading cached cargo-package-simdutf8 from https://cache.nix-ci.com
  1254. 17.52 s Downloaded cached cargo-package-serde_repr (45 KiB) in 110ms
  1255. 17.52 s Progress: 0 of 1 built, 408 of 675 downloaded from cache (15 downloading)
  1256. 17.52 s Downloading cached cargo-package-similar from https://cache.nix-ci.com
  1257. 17.52 s Downloaded cached cargo-package-serde_spanned (31 KiB) in 106ms
  1258. 17.52 s Progress: 0 of 1 built, 409 of 675 downloaded from cache (15 downloading)
  1259. 17.52 s Downloading cached cargo-package-similar-asserts from https://cache.nix-ci.com
  1260. 17.52 s Downloaded cached cargo-package-serde_spanned (35 KiB) in 107ms
  1261. 17.52 s Progress: 0 of 1 built, 410 of 675 downloaded from cache (15 downloading)
  1262. 17.52 s Downloading cached cargo-package-siphasher from https://cache.nix-ci.com
  1263. 17.52 s Downloaded cached cargo-package-serde_yaml (400 KiB) in 109ms
  1264. 17.52 s Progress: 0 of 1 built, 411 of 675 downloaded from cache (15 downloading)
  1265. 17.52 s Downloaded cached cargo-package-serial_test (62 KiB) in 107ms
  1266. 17.52 s Downloading cached cargo-package-slab from https://cache.nix-ci.com
  1267. 17.52 s Progress: 0 of 1 built, 412 of 675 downloaded from cache (15 downloading)
  1268. 17.52 s Downloading cached cargo-package-slotmap from https://cache.nix-ci.com
  1269. 17.53 s Downloaded cached cargo-package-serial_test_derive (52 KiB) in 110ms
  1270. 17.53 s Progress: 0 of 1 built, 413 of 675 downloaded from cache (15 downloading)
  1271. 17.53 s Downloading cached cargo-package-smallvec from https://cache.nix-ci.com
  1272. 17.54 s Downloaded cached cargo-package-sha2 (118 KiB) in 116ms
  1273. 17.54 s Progress: 0 of 1 built, 414 of 675 downloaded from cache (15 downloading)
  1274. 17.54 s Downloading cached cargo-package-smartstring from https://cache.nix-ci.com
  1275. 17.54 s Downloaded cached cargo-package-sharded-slab (272 KiB) in 113ms
  1276. 17.54 s Progress: 0 of 1 built, 415 of 675 downloaded from cache (15 downloading)
  1277. 17.54 s Downloading cached cargo-package-spec_math from https://cache.nix-ci.com
  1278. 17.57 s Downloaded cached cargo-package-signal-hook-registry (69 KiB) in 81ms
  1279. 17.57 s Progress: 0 of 1 built, 416 of 675 downloaded from cache (15 downloading)
  1280. 17.58 s Downloading cached cargo-package-static_assertions from https://cache.nix-ci.com
  1281. 17.58 s Downloaded cached cargo-package-shellexpand (98 KiB) in 101ms
  1282. 17.58 s Progress: 0 of 1 built, 417 of 675 downloaded from cache (15 downloading)
  1283. 17.58 s Downloading cached cargo-package-statrs from https://cache.nix-ci.com
  1284. 17.58 s Downloaded cached cargo-package-shlex (60 KiB) in 93ms
  1285. 17.58 s Progress: 0 of 1 built, 418 of 675 downloaded from cache (15 downloading)
  1286. 17.58 s Downloading cached cargo-package-string-template-plus from https://cache.nix-ci.com
  1287. 17.59 s Downloaded cached cargo-package-simba (294 KiB) in 85ms
  1288. 17.59 s Progress: 0 of 1 built, 419 of 675 downloaded from cache (15 downloading)
  1289. 17.59 s Downloading cached cargo-package-strip-ansi-escapes from https://cache.nix-ci.com
  1290. 17.59 s Downloaded cached cargo-package-signal-hook (168 KiB) in 102ms
  1291. 17.59 s Progress: 0 of 1 built, 420 of 675 downloaded from cache (15 downloading)
  1292. 17.59 s Downloading cached cargo-package-strsim from https://cache.nix-ci.com
  1293. 17.60 s Downloaded cached cargo-package-signal-hook-mio (64 KiB) in 106ms
  1294. 17.60 s Progress: 0 of 1 built, 421 of 675 downloaded from cache (15 downloading)
  1295. 17.60 s Downloading cached cargo-package-strsim from https://cache.nix-ci.com
  1296. 17.60 s Downloaded cached cargo-package-simdutf8 (133 KiB) in 88ms
  1297. 17.60 s Progress: 0 of 1 built, 422 of 675 downloaded from cache (15 downloading)
  1298. 17.60 s Downloading cached cargo-package-strum from https://cache.nix-ci.com
  1299. 17.60 s Downloaded cached cargo-package-simba (334 KiB) in 91ms
  1300. 17.60 s Progress: 0 of 1 built, 423 of 675 downloaded from cache (15 downloading)
  1301. 17.61 s Downloading cached cargo-package-strum from https://cache.nix-ci.com
  1302. 17.61 s Downloaded cached cargo-package-slab (81 KiB) in 90ms
  1303. 17.61 s Progress: 0 of 1 built, 424 of 675 downloaded from cache (15 downloading)
  1304. 17.61 s Downloading cached cargo-package-strum_macros from https://cache.nix-ci.com
  1305. 17.61 s Downloaded cached cargo-package-similar-asserts (63 KiB) in 96ms
  1306. 17.61 s Progress: 0 of 1 built, 425 of 675 downloaded from cache (15 downloading)
  1307. 17.61 s Downloaded cached cargo-package-siphasher (60 KiB) in 94ms
  1308. 17.61 s Downloaded cached cargo-package-similar (256 KiB) in 98ms
  1309. 17.62 s Downloading cached cargo-package-strum_macros from https://cache.nix-ci.com
  1310. 17.62 s Progress: 0 of 1 built, 426 of 675 downloaded from cache (15 downloading)
  1311. 17.62 s Progress: 0 of 1 built, 427 of 675 downloaded from cache (14 downloading)
  1312. 17.62 s Downloaded cached cargo-package-slotmap (298 KiB) in 93ms
  1313. 17.62 s Downloading cached cargo-package-subprocess from https://cache.nix-ci.com
  1314. 17.62 s Downloading cached cargo-package-symjit from https://cache.nix-ci.com
  1315. 17.62 s Progress: 0 of 1 built, 428 of 675 downloaded from cache (15 downloading)
  1316. 17.62 s Downloading cached cargo-package-symlink from https://cache.nix-ci.com
  1317. 17.62 s Downloaded cached cargo-package-smallvec (160 KiB) in 91ms
  1318. 17.62 s Progress: 0 of 1 built, 429 of 675 downloaded from cache (15 downloading)
  1319. 17.62 s Downloading cached cargo-package-syn from https://cache.nix-ci.com
  1320. 17.64 s Downloaded cached cargo-package-smartstring (124 KiB) in 104ms
  1321. 17.64 s Progress: 0 of 1 built, 430 of 675 downloaded from cache (15 downloading)
  1322. 17.64 s Downloading cached cargo-package-syn from https://cache.nix-ci.com
  1323. 17.65 s Downloaded cached cargo-package-spec_math (1.6 MiB) in 111ms
  1324. 17.65 s Progress: 0 of 1 built, 431 of 675 downloaded from cache (15 downloading)
  1325. 17.65 s Downloading cached cargo-package-sysinfo from https://cache.nix-ci.com
  1326. 17.66 s Downloaded cached cargo-package-strip-ansi-escapes (26 KiB) in 76ms
  1327. 17.66 s Progress: 0 of 1 built, 432 of 675 downloaded from cache (15 downloading)
  1328. 17.66 s Downloading cached cargo-package-tabled from https://cache.nix-ci.com
  1329. 17.67 s Downloaded cached cargo-package-string-template-plus (125 KiB) in 82ms
  1330. 17.67 s Progress: 0 of 1 built, 433 of 675 downloaded from cache (15 downloading)
  1331. 17.67 s Downloading cached cargo-package-tabled_derive from https://cache.nix-ci.com
  1332. 17.67 s Downloaded cached cargo-package-static_assertions (66 KiB) in 96ms
  1333. 17.67 s Progress: 0 of 1 built, 434 of 675 downloaded from cache (15 downloading)
  1334. 17.67 s Downloading cached cargo-package-tap from https://cache.nix-ci.com
  1335. 17.67 s Downloaded cached cargo-package-strsim (48 KiB) in 79ms
  1336. 17.67 s Progress: 0 of 1 built, 435 of 675 downloaded from cache (15 downloading)
  1337. 17.67 s Downloading cached cargo-package-target-lexicon from https://cache.nix-ci.com
  1338. 17.69 s Downloaded cached cargo-package-statrs (699 KiB) in 110ms
  1339. 17.69 s Progress: 0 of 1 built, 436 of 675 downloaded from cache (15 downloading)
  1340. 17.69 s Downloading cached cargo-package-target-triple from https://cache.nix-ci.com
  1341. 17.69 s Downloaded cached cargo-package-strum (25 KiB) in 87ms
  1342. 17.69 s Progress: 0 of 1 built, 437 of 675 downloaded from cache (15 downloading)
  1343. 17.69 s Downloading cached cargo-package-tempfile from https://cache.nix-ci.com
  1344. 17.71 s Downloaded cached cargo-package-strum_macros (136 KiB) in 95ms
  1345. 17.71 s Progress: 0 of 1 built, 438 of 675 downloaded from cache (15 downloading)
  1346. 17.71 s Downloaded cached cargo-package-strum_macros (151 KiB) in 93ms
  1347. 17.71 s Downloading cached cargo-package-termcolor from https://cache.nix-ci.com
  1348. 17.71 s Progress: 0 of 1 built, 439 of 675 downloaded from cache (15 downloading)
  1349. 17.71 s Downloading cached cargo-package-terminal_size from https://cache.nix-ci.com
  1350. 17.71 s Downloaded cached cargo-package-strsim (56 KiB) in 111ms
  1351. 17.71 s Progress: 0 of 1 built, 440 of 675 downloaded from cache (15 downloading)
  1352. 17.71 s Downloading cached cargo-package-terminfo from https://cache.nix-ci.com
  1353. 17.71 s Downloaded cached cargo-package-symlink (38 KiB) in 96ms
  1354. 17.71 s Progress: 0 of 1 built, 441 of 675 downloaded from cache (15 downloading)
  1355. 17.71 s Downloaded cached cargo-package-strum (21 KiB) in 110ms
  1356. 17.71 s Downloading cached cargo-package-termios from https://cache.nix-ci.com
  1357. 17.71 s Progress: 0 of 1 built, 442 of 675 downloaded from cache (15 downloading)
  1358. 17.71 s Downloading cached cargo-package-termwiz from https://cache.nix-ci.com
  1359. 17.72 s Downloaded cached cargo-package-subprocess (253 KiB) in 100ms
  1360. 17.72 s Progress: 0 of 1 built, 443 of 675 downloaded from cache (15 downloading)
  1361. 17.72 s Downloading cached cargo-package-test-log from https://cache.nix-ci.com
  1362. 17.72 s Downloaded cached cargo-package-symjit (831 KiB) in 102ms
  1363. 17.72 s Progress: 0 of 1 built, 444 of 675 downloaded from cache (15 downloading)
  1364. 17.72 s Downloading cached cargo-package-test-log-core from https://cache.nix-ci.com
  1365. 17.76 s Downloaded cached cargo-package-syn (1.8 MiB) in 134ms
  1366. 17.76 s Progress: 0 of 1 built, 445 of 675 downloaded from cache (15 downloading)
  1367. 17.76 s Downloading cached cargo-package-test-log-macros from https://cache.nix-ci.com
  1368. 17.77 s Downloaded cached cargo-package-syn (2.2 MiB) in 121ms
  1369. 17.77 s Progress: 0 of 1 built, 446 of 675 downloaded from cache (15 downloading)
  1370. 17.77 s Downloading cached cargo-package-testing_table from https://cache.nix-ci.com
  1371. 17.77 s Downloaded cached cargo-package-tabled_derive (54 KiB) in 107ms
  1372. 17.77 s Progress: 0 of 1 built, 447 of 675 downloaded from cache (15 downloading)
  1373. 17.78 s Downloading cached cargo-package-thiserror from https://cache.nix-ci.com
  1374. 17.78 s Downloaded cached cargo-package-sysinfo (905 KiB) in 121ms
  1375. 17.78 s Progress: 0 of 1 built, 448 of 675 downloaded from cache (15 downloading)
  1376. 17.78 s Downloading cached cargo-package-thiserror from https://cache.nix-ci.com
  1377. 17.78 s Downloaded cached cargo-package-target-triple (22 KiB) in 89ms
  1378. 17.78 s Progress: 0 of 1 built, 449 of 675 downloaded from cache (15 downloading)
  1379. 17.78 s Downloading cached cargo-package-thiserror-impl from https://cache.nix-ci.com
  1380. 17.79 s Downloaded cached cargo-package-tap (40 KiB) in 118ms
  1381. 17.79 s Progress: 0 of 1 built, 450 of 675 downloaded from cache (15 downloading)
  1382. 17.79 s Downloaded cached cargo-package-target-lexicon (123 KiB) in 117ms
  1383. 17.79 s Downloading cached cargo-package-thiserror-impl from https://cache.nix-ci.com
  1384. 17.79 s Progress: 0 of 1 built, 451 of 675 downloaded from cache (15 downloading)
  1385. 17.79 s Downloaded cached cargo-package-tempfile (189 KiB) in 96ms
  1386. 17.79 s Downloading cached cargo-package-thread_local from https://cache.nix-ci.com
  1387. 17.79 s Progress: 0 of 1 built, 452 of 675 downloaded from cache (15 downloading)
  1388. 17.79 s Downloading cached cargo-package-time from https://cache.nix-ci.com
  1389. 17.80 s Downloaded cached cargo-package-tabled (1.6 MiB) in 135ms
  1390. 17.80 s Progress: 0 of 1 built, 453 of 675 downloaded from cache (15 downloading)
  1391. 17.80 s Downloading cached cargo-package-time-core from https://cache.nix-ci.com
  1392. 17.81 s Downloaded cached cargo-package-terminfo (180 KiB) in 98ms
  1393. 17.81 s Downloaded cached cargo-package-termios (94 KiB) in 96ms
  1394. 17.81 s Progress: 0 of 1 built, 454 of 675 downloaded from cache (15 downloading)
  1395. 17.81 s Downloading cached cargo-package-time-macros from https://cache.nix-ci.com
  1396. 17.81 s Progress: 0 of 1 built, 455 of 675 downloaded from cache (15 downloading)
  1397. 17.81 s Downloading cached cargo-package-tiny-keccak from https://cache.nix-ci.com
  1398. 17.82 s Downloaded cached cargo-package-test-log (46 KiB) in 100ms
  1399. 17.82 s Progress: 0 of 1 built, 456 of 675 downloaded from cache (15 downloading)
  1400. 17.82 s Downloading cached cargo-package-tiny_http from https://cache.nix-ci.com
  1401. 17.82 s Downloaded cached cargo-package-termcolor (92 KiB) in 110ms
  1402. 17.82 s Progress: 0 of 1 built, 457 of 675 downloaded from cache (15 downloading)
  1403. 17.82 s Downloading cached cargo-package-tinyjson from https://cache.nix-ci.com
  1404. 17.82 s Downloaded cached cargo-package-test-log-core (36 KiB) in 100ms
  1405. 17.82 s Progress: 0 of 1 built, 458 of 675 downloaded from cache (15 downloading)
  1406. 17.82 s Downloading cached cargo-package-tinytemplate from https://cache.nix-ci.com
  1407. 17.82 s Downloaded cached cargo-package-terminal_size (32 KiB) in 114ms
  1408. 17.83 s Progress: 0 of 1 built, 459 of 675 downloaded from cache (15 downloading)
  1409. 17.83 s Downloading cached cargo-package-tinyvec from https://cache.nix-ci.com
  1410. 17.83 s Downloaded cached cargo-package-termwiz (3.5 MiB) in 114ms
  1411. 17.83 s Progress: 0 of 1 built, 460 of 675 downloaded from cache (15 downloading)
  1412. 17.83 s Downloading cached cargo-package-tinyvec_macros from https://cache.nix-ci.com
  1413. 17.84 s Downloaded cached cargo-package-test-log-macros (18 KiB) in 86ms
  1414. 17.84 s Progress: 0 of 1 built, 461 of 675 downloaded from cache (15 downloading)
  1415. 17.84 s Downloading cached cargo-package-titlecase from https://cache.nix-ci.com
  1416. 17.86 s Downloaded cached cargo-package-testing_table (11 KiB) in 95ms
  1417. 17.86 s Progress: 0 of 1 built, 462 of 675 downloaded from cache (15 downloading)
  1418. 17.86 s Downloading cached cargo-package-toml from https://cache.nix-ci.com
  1419. 17.86 s Downloaded cached cargo-package-thiserror-impl (83 KiB) in 84ms
  1420. 17.86 s Progress: 0 of 1 built, 463 of 675 downloaded from cache (15 downloading)
  1421. 17.87 s Downloading cached cargo-package-toml-0.9.12+spec from https://cache.nix-ci.com
  1422. 17.87 s Downloaded cached cargo-package-thiserror (109 KiB) in 97ms
  1423. 17.87 s Downloaded cached cargo-package-thread_local (71 KiB) in 81ms
  1424. 17.87 s Progress: 0 of 1 built, 464 of 675 downloaded from cache (15 downloading)
  1425. 17.87 s Downloading cached cargo-package-toml-1.1.2+spec from https://cache.nix-ci.com
  1426. 17.87 s Progress: 0 of 1 built, 465 of 675 downloaded from cache (15 downloading)
  1427. 17.87 s Downloaded cached cargo-package-thiserror (136 KiB) in 98ms
  1428. 17.87 s Downloading cached cargo-package-toml_datetime from https://cache.nix-ci.com
  1429. 17.87 s Progress: 0 of 1 built, 466 of 675 downloaded from cache (15 downloading)
  1430. 17.87 s Downloading cached cargo-package-toml_datetime-0.7.5+spec from https://cache.nix-ci.com
  1431. 17.88 s Downloaded cached cargo-package-thiserror-impl (97 KiB) in 89ms
  1432. 17.88 s Progress: 0 of 1 built, 467 of 675 downloaded from cache (15 downloading)
  1433. 17.88 s Downloading cached cargo-package-toml_datetime-1.1.1+spec from https://cache.nix-ci.com
  1434. 17.89 s Downloaded cached cargo-package-time-core (31 KiB) in 85ms
  1435. 17.89 s Progress: 0 of 1 built, 468 of 675 downloaded from cache (15 downloading)
  1436. 17.89 s Downloading cached cargo-package-toml_edit from https://cache.nix-ci.com
  1437. 17.89 s Downloaded cached cargo-package-time (1.5 MiB) in 94ms
  1438. 17.89 s Progress: 0 of 1 built, 469 of 675 downloaded from cache (15 downloading)
  1439. 17.89 s Downloading cached cargo-package-toml_edit-0.25.11+spec from https://cache.nix-ci.com
  1440. 17.90 s Downloaded cached cargo-package-tiny-keccak (97 KiB) in 88ms
  1441. 17.90 s Progress: 0 of 1 built, 470 of 675 downloaded from cache (15 downloading)
  1442. 17.90 s Downloading cached cargo-package-toml_parser-1.1.2+spec from https://cache.nix-ci.com
  1443. 17.91 s Downloaded cached cargo-package-tiny_http (197 KiB) in 88ms
  1444. 17.91 s Progress: 0 of 1 built, 471 of 675 downloaded from cache (15 downloading)
  1445. 17.91 s Downloading cached cargo-package-toml_write from https://cache.nix-ci.com
  1446. 17.91 s Downloaded cached cargo-package-time-macros (113 KiB) in 97ms
  1447. 17.91 s Progress: 0 of 1 built, 472 of 675 downloaded from cache (15 downloading)
  1448. 17.91 s Downloading cached cargo-package-toml_writer-1.1.1+spec from https://cache.nix-ci.com
  1449. 17.91 s Downloaded cached cargo-package-tinytemplate (114 KiB) in 89ms
  1450. 17.91 s Progress: 0 of 1 built, 473 of 675 downloaded from cache (15 downloading)
  1451. 17.91 s Downloading cached cargo-package-tracing from https://cache.nix-ci.com
  1452. 17.93 s Downloaded cached cargo-package-tinyjson (61 KiB) in 107ms
  1453. 17.93 s Progress: 0 of 1 built, 474 of 675 downloaded from cache (15 downloading)
  1454. 17.93 s Downloading cached cargo-package-tracing-appender from https://cache.nix-ci.com
  1455. 17.93 s Downloaded cached cargo-package-tinyvec_macros (16 KiB) in 102ms
  1456. 17.93 s Progress: 0 of 1 built, 475 of 675 downloaded from cache (15 downloading)
  1457. 17.93 s Downloading cached cargo-package-tracing-attributes from https://cache.nix-ci.com
  1458. 17.93 s Downloaded cached cargo-package-tinyvec (237 KiB) in 109ms
  1459. 17.93 s Progress: 0 of 1 built, 476 of 675 downloaded from cache (15 downloading)
  1460. 17.94 s Downloading cached cargo-package-tracing-core from https://cache.nix-ci.com
  1461. 17.95 s Downloaded cached cargo-package-titlecase (23 KiB) in 103ms
  1462. 17.95 s Progress: 0 of 1 built, 477 of 675 downloaded from cache (15 downloading)
  1463. 17.95 s Downloading cached cargo-package-tracing-error from https://cache.nix-ci.com
  1464. 17.96 s Downloaded cached cargo-package-toml-0.9.12+spec (322 KiB) in 91ms
  1465. 17.96 s Progress: 0 of 1 built, 478 of 675 downloaded from cache (15 downloading)
  1466. 17.96 s Downloading cached cargo-package-tracing-indicatif from https://cache.nix-ci.com
  1467. 17.96 s Downloaded cached cargo-package-toml-1.1.2+spec (325 KiB) in 90ms
  1468. 17.96 s Progress: 0 of 1 built, 479 of 675 downloaded from cache (15 downloading)
  1469. 17.96 s Downloading cached cargo-package-tracing-log from https://cache.nix-ci.com
  1470. 17.97 s Downloaded cached cargo-package-toml_datetime-1.1.1+spec (71 KiB) in 89ms
  1471. 17.97 s Progress: 0 of 1 built, 480 of 675 downloaded from cache (15 downloading)
  1472. 17.97 s Downloading cached cargo-package-tracing-serde from https://cache.nix-ci.com
  1473. 17.97 s Downloaded cached cargo-package-toml (185 KiB) in 111ms
  1474. 17.97 s Progress: 0 of 1 built, 481 of 675 downloaded from cache (15 downloading)
  1475. 17.98 s Downloading cached cargo-package-tracing-subscriber from https://cache.nix-ci.com
  1476. 17.98 s Downloaded cached cargo-package-toml_datetime-0.7.5+spec (71 KiB) in 102ms
  1477. 17.98 s Progress: 0 of 1 built, 482 of 675 downloaded from cache (15 downloading)
  1478. 17.98 s Downloaded cached cargo-package-toml_datetime (59 KiB) in 102ms
  1479. 17.98 s Downloading cached cargo-package-trybuild from https://cache.nix-ci.com
  1480. 17.98 s Progress: 0 of 1 built, 483 of 675 downloaded from cache (15 downloading)
  1481. 17.98 s Downloading cached cargo-package-typed-index-collections from https://cache.nix-ci.com
  1482. 17.98 s Downloaded cached cargo-package-toml_edit-0.25.11+spec (359 KiB) in 97ms
  1483. 17.98 s Progress: 0 of 1 built, 484 of 675 downloaded from cache (15 downloading)
  1484. 17.98 s Downloading cached cargo-package-typeid from https://cache.nix-ci.com
  1485. 18.01 s Downloaded cached cargo-package-toml_edit (396 KiB) in 120ms
  1486. 18.01 s Progress: 0 of 1 built, 485 of 675 downloaded from cache (15 downloading)
  1487. 18.01 s Downloading cached cargo-package-typenum from https://cache.nix-ci.com
  1488. 18.01 s Downloaded cached cargo-package-toml_writer-1.1.1+spec (74 KiB) in 101ms
  1489. 18.01 s Progress: 0 of 1 built, 486 of 675 downloaded from cache (15 downloading)
  1490. 18.01 s Downloaded cached cargo-package-toml_parser-1.1.2+spec (239 KiB) in 109ms
  1491. 18.01 s Downloading cached cargo-package-ucd-trie from https://cache.nix-ci.com
  1492. 18.01 s Progress: 0 of 1 built, 487 of 675 downloaded from cache (15 downloading)
  1493. 18.01 s Downloading cached cargo-package-unarray from https://cache.nix-ci.com
  1494. 18.02 s Downloaded cached cargo-package-toml_write (59 KiB) in 111ms
  1495. 18.02 s Progress: 0 of 1 built, 488 of 675 downloaded from cache (15 downloading)
  1496. 18.02 s Downloading cached cargo-package-uncased from https://cache.nix-ci.com
  1497. 18.03 s Downloaded cached cargo-package-tracing-appender (131 KiB) in 103ms
  1498. 18.03 s Progress: 0 of 1 built, 489 of 675 downloaded from cache (15 downloading)
  1499. 18.03 s Downloading cached cargo-package-unic-char-property from https://cache.nix-ci.com
  1500. 18.03 s Downloaded cached cargo-package-tracing (9.4 MiB) in 122ms
  1501. 18.03 s Progress: 0 of 1 built, 490 of 675 downloaded from cache (15 downloading)
  1502. 18.03 s Downloading cached cargo-package-unic-char-range from https://cache.nix-ci.com
  1503. 18.04 s Downloaded cached cargo-package-tracing-attributes (184 KiB) in 111ms
  1504. 18.04 s Progress: 0 of 1 built, 491 of 675 downloaded from cache (15 downloading)
  1505. 18.05 s Downloading cached cargo-package-unic-common from https://cache.nix-ci.com
  1506. 18.05 s Downloaded cached cargo-package-tracing-core (255 KiB) in 117ms
  1507. 18.05 s Progress: 0 of 1 built, 492 of 675 downloaded from cache (15 downloading)
  1508. 18.05 s Downloaded cached cargo-package-tracing-error (47 KiB) in 105ms
  1509. 18.05 s Downloading cached cargo-package-unic-emoji-char from https://cache.nix-ci.com
  1510. 18.05 s Progress: 0 of 1 built, 493 of 675 downloaded from cache (15 downloading)
  1511. 18.05 s Downloading cached cargo-package-unic-ucd-ident from https://cache.nix-ci.com
  1512. 18.07 s Downloaded cached cargo-package-typed-index-collections (280 KiB) in 91ms
  1513. 18.07 s Progress: 0 of 1 built, 494 of 675 downloaded from cache (15 downloading)
  1514. 18.07 s Downloading cached cargo-package-unic-ucd-version from https://cache.nix-ci.com
  1515. 18.07 s Downloaded cached cargo-package-tracing-indicatif (138 KiB) in 115ms
  1516. 18.07 s Progress: 0 of 1 built, 495 of 675 downloaded from cache (15 downloading)
  1517. 18.07 s Downloading cached cargo-package-unicase from https://cache.nix-ci.com
  1518. 18.08 s Downloaded cached cargo-package-typeid (29 KiB) in 93ms
  1519. 18.08 s Progress: 0 of 1 built, 496 of 675 downloaded from cache (15 downloading)
  1520. 18.08 s Downloading cached cargo-package-unicode-ident from https://cache.nix-ci.com
  1521. 18.08 s Downloaded cached cargo-package-tracing-serde (31 KiB) in 109ms
  1522. 18.08 s Progress: 0 of 1 built, 497 of 675 downloaded from cache (15 downloading)
  1523. 18.08 s Downloaded cached cargo-package-tracing-log (68 KiB) in 116ms
  1524. 18.08 s Downloading cached cargo-package-unicode-segmentation from https://cache.nix-ci.com
  1525. 18.08 s Progress: 0 of 1 built, 498 of 675 downloaded from cache (15 downloading)
  1526. 18.08 s Downloading cached cargo-package-unicode-truncate from https://cache.nix-ci.com
  1527. 18.08 s Downloaded cached cargo-package-tracing-subscriber (1.1 MiB) in 108ms
  1528. 18.08 s Progress: 0 of 1 built, 499 of 675 downloaded from cache (15 downloading)
  1529. 18.08 s Downloading cached cargo-package-unicode-width from https://cache.nix-ci.com
  1530. 18.10 s Downloaded cached cargo-package-trybuild (191 KiB) in 116ms
  1531. 18.10 s Progress: 0 of 1 built, 500 of 675 downloaded from cache (15 downloading)
  1532. 18.10 s Downloading cached cargo-package-unicode-xid from https://cache.nix-ci.com
  1533. 18.10 s Downloaded cached cargo-package-unarray (45 KiB) in 89ms
  1534. 18.10 s Progress: 0 of 1 built, 501 of 675 downloaded from cache (15 downloading)
  1535. 18.10 s Downloading cached cargo-package-unicode_names2 from https://cache.nix-ci.com
  1536. 18.11 s Downloaded cached cargo-package-uncased (42 KiB) in 88ms
  1537. 18.11 s Progress: 0 of 1 built, 502 of 675 downloaded from cache (15 downloading)
  1538. 18.11 s Downloading cached cargo-package-unicode_names2_generator from https://cache.nix-ci.com
  1539. 18.12 s Downloaded cached cargo-package-typenum (1.2 MiB) in 114ms
  1540. 18.12 s Progress: 0 of 1 built, 503 of 675 downloaded from cache (15 downloading)
  1541. 18.12 s Downloading cached cargo-package-unit-prefix from https://cache.nix-ci.com
  1542. 18.12 s Downloaded cached cargo-package-ucd-trie (160 KiB) in 110ms
  1543. 18.12 s Progress: 0 of 1 built, 504 of 675 downloaded from cache (15 downloading)
  1544. 18.12 s Downloading cached cargo-package-unsafe-libyaml from https://cache.nix-ci.com
  1545. 18.14 s Downloaded cached cargo-package-unic-char-range (30 KiB) in 106ms
  1546. 18.14 s Progress: 0 of 1 built, 505 of 675 downloaded from cache (15 downloading)
  1547. 18.14 s Downloading cached cargo-package-unty from https://cache.nix-ci.com
  1548. 18.14 s Downloaded cached cargo-package-unic-char-property (31 KiB) in 111ms
  1549. 18.14 s Progress: 0 of 1 built, 506 of 675 downloaded from cache (15 downloading)
  1550. 18.14 s Downloading cached cargo-package-utf8parse from https://cache.nix-ci.com
  1551. 18.15 s Downloaded cached cargo-package-unic-ucd-ident (151 KiB) in 97ms
  1552. 18.15 s Progress: 0 of 1 built, 507 of 675 downloaded from cache (15 downloading)
  1553. 18.15 s Downloading cached cargo-package-uuid from https://cache.nix-ci.com
  1554. 18.15 s Downloaded cached cargo-package-unic-common (8240 B) in 107ms
  1555. 18.15 s Progress: 0 of 1 built, 508 of 675 downloaded from cache (15 downloading)
  1556. 18.15 s Downloading cached cargo-package-valuable from https://cache.nix-ci.com
  1557. 18.16 s Downloaded cached cargo-package-unic-emoji-char (44 KiB) in 111ms
  1558. 18.16 s Progress: 0 of 1 built, 509 of 675 downloaded from cache (15 downloading)
  1559. 18.16 s Downloading cached cargo-package-vectorize from https://cache.nix-ci.com
  1560. 18.18 s Downloaded cached cargo-package-unicode-truncate (67 KiB) in 95ms
  1561. 18.18 s Progress: 0 of 1 built, 510 of 675 downloaded from cache (15 downloading)
  1562. 18.18 s Downloading cached cargo-package-venial from https://cache.nix-ci.com
  1563. 18.18 s Downloaded cached cargo-package-unicode-ident (335 KiB) in 100ms
  1564. 18.18 s Progress: 0 of 1 built, 511 of 675 downloaded from cache (15 downloading)
  1565. 18.18 s Downloading cached cargo-package-version-compare from https://cache.nix-ci.com
  1566. 18.18 s Downloaded cached cargo-package-unic-ucd-version (8360 B) in 112ms
  1567. 18.19 s Progress: 0 of 1 built, 512 of 675 downloaded from cache (15 downloading)
  1568. 18.19 s Downloading cached cargo-package-version_check from https://cache.nix-ci.com
  1569. 18.19 s Downloaded cached cargo-package-unicode-width (2.3 MiB) in 105ms
  1570. 18.19 s Progress: 0 of 1 built, 513 of 675 downloaded from cache (15 downloading)
  1571. 18.19 s Downloading cached cargo-package-virtue from https://cache.nix-ci.com
  1572. 18.19 s Downloaded cached cargo-package-unicase (113 KiB) in 120ms
  1573. 18.19 s Progress: 0 of 1 built, 514 of 675 downloaded from cache (15 downloading)
  1574. 18.19 s Downloading cached cargo-package-vt100 from https://cache.nix-ci.com
  1575. 18.20 s Downloaded cached cargo-package-unicode-segmentation (659 KiB) in 121ms
  1576. 18.20 s Progress: 0 of 1 built, 515 of 675 downloaded from cache (15 downloading)
  1577. 18.20 s Downloading cached cargo-package-vte from https://cache.nix-ci.com
  1578. 18.22 s Downloaded cached cargo-package-unicode-xid (78 KiB) in 120ms
  1579. 18.22 s Progress: 0 of 1 built, 516 of 675 downloaded from cache (15 downloading)
  1580. 18.22 s Downloading cached cargo-package-vte from https://cache.nix-ci.com
  1581. 18.23 s Downloaded cached cargo-package-unicode_names2_generator (42 KiB) in 116ms
  1582. 18.23 s Progress: 0 of 1 built, 517 of 675 downloaded from cache (15 downloading)
  1583. 18.23 s Downloading cached cargo-package-vtparse from https://cache.nix-ci.com
  1584. 18.23 s Downloaded cached cargo-package-unit-prefix (30 KiB) in 105ms
  1585. 18.23 s Progress: 0 of 1 built, 518 of 675 downloaded from cache (15 downloading)
  1586. 18.23 s Downloading cached cargo-package-wait-timeout from https://cache.nix-ci.com
  1587. 18.23 s Downloaded cached cargo-package-unicode_names2 (2.2 MiB) in 128ms
  1588. 18.23 s Progress: 0 of 1 built, 519 of 675 downloaded from cache (15 downloading)
  1589. 18.23 s Downloading cached cargo-package-walkdir from https://cache.nix-ci.com
  1590. 18.24 s Downloaded cached cargo-package-unsafe-libyaml (457 KiB) in 117ms
  1591. 18.24 s Progress: 0 of 1 built, 520 of 675 downloaded from cache (15 downloading)
  1592. 18.24 s Downloading cached cargo-package-wasi-0.11.1+wasi-snapshot-preview1 from https://cache.nix-ci.com
  1593. 18.25 s Downloaded cached cargo-package-valuable (156 KiB) in 94ms
  1594. 18.25 s Progress: 0 of 1 built, 521 of 675 downloaded from cache (15 downloading)
  1595. 18.25 s Downloaded cached cargo-package-unty (21 KiB) in 107ms
  1596. 18.25 s Downloading cached cargo-package-wasip2-1.0.3+wasi from https://cache.nix-ci.com
  1597. 18.25 s Progress: 0 of 1 built, 522 of 675 downloaded from cache (15 downloading)
  1598. 18.25 s Downloading cached cargo-package-wasip3-0.4.0+wasi-0.3.0-rc-2026-01 from https://cache.nix-ci.com
  1599. 18.25 s Downloaded cached cargo-package-utf8parse (36 KiB) in 108ms
  1600. 18.25 s Progress: 0 of 1 built, 523 of 675 downloaded from cache (15 downloading)
  1601. 18.25 s Downloading cached cargo-package-wasm-bindgen from https://cache.nix-ci.com
  1602. 18.26 s Downloaded cached cargo-package-vectorize (6368 B) in 94ms
  1603. 18.26 s Progress: 0 of 1 built, 524 of 675 downloaded from cache (15 downloading)
  1604. 18.26 s Downloading cached cargo-package-wasm-bindgen-macro from https://cache.nix-ci.com
  1605. 18.26 s Downloaded cached cargo-package-uuid (316 KiB) in 108ms
  1606. 18.26 s Progress: 0 of 1 built, 525 of 675 downloaded from cache (15 downloading)
  1607. 18.26 s Downloading cached cargo-package-wasm-bindgen-macro-support from https://cache.nix-ci.com
  1608. 18.27 s Downloaded cached cargo-package-vt100 (160 KiB) in 80ms
  1609. 18.27 s Progress: 0 of 1 built, 526 of 675 downloaded from cache (15 downloading)
  1610. 18.28 s Downloading cached cargo-package-wasm-bindgen-shared from https://cache.nix-ci.com
  1611. 18.28 s Downloaded cached cargo-package-venial (170 KiB) in 98ms
  1612. 18.28 s Progress: 0 of 1 built, 527 of 675 downloaded from cache (15 downloading)
  1613. 18.28 s Downloading cached cargo-package-wasm-encoder from https://cache.nix-ci.com
  1614. 18.28 s Downloaded cached cargo-package-version-compare (65 KiB) in 98ms
  1615. 18.28 s Progress: 0 of 1 built, 528 of 675 downloaded from cache (15 downloading)
  1616. 18.28 s Downloading cached cargo-package-wasm-metadata from https://cache.nix-ci.com
  1617. 18.28 s Downloaded cached cargo-package-virtue (199 KiB) in 90ms
  1618. 18.28 s Progress: 0 of 1 built, 529 of 675 downloaded from cache (15 downloading)
  1619. 18.28 s Downloading cached cargo-package-wasm-minimal-protocol from https://cache.nix-ci.com
  1620. 18.28 s Downloaded cached cargo-package-version_check (62 KiB) in 97ms
  1621. 18.28 s Progress: 0 of 1 built, 530 of 675 downloaded from cache (15 downloading)
  1622. 18.28 s Downloading cached cargo-package-wasmparser from https://cache.nix-ci.com
  1623. 18.28 s Downloaded cached cargo-package-vte (319 KiB) in 81ms
  1624. 18.28 s Progress: 0 of 1 built, 531 of 675 downloaded from cache (15 downloading)
  1625. 18.28 s Downloading cached cargo-package-wasmtime-jit-icache-coherence from https://cache.nix-ci.com
  1626. 18.31 s Downloaded cached cargo-package-wait-timeout (35 KiB) in 83ms
  1627. 18.31 s Progress: 0 of 1 built, 532 of 675 downloaded from cache (15 downloading)
  1628. 18.31 s Downloading cached cargo-package-web-sys from https://cache.nix-ci.com
  1629. 18.31 s Downloaded cached cargo-package-walkdir (114 KiB) in 80ms
  1630. 18.31 s Progress: 0 of 1 built, 533 of 675 downloaded from cache (15 downloading)
  1631. 18.31 s Downloading cached cargo-package-web-time from https://cache.nix-ci.com
  1632. 18.31 s Downloaded cached cargo-package-vte (320 KiB) in 95ms
  1633. 18.31 s Progress: 0 of 1 built, 534 of 675 downloaded from cache (15 downloading)
  1634. 18.31 s Downloading cached cargo-package-web-time from https://cache.nix-ci.com
  1635. 18.31 s Downloaded cached cargo-package-vtparse (53 KiB) in 87ms
  1636. 18.31 s Progress: 0 of 1 built, 535 of 675 downloaded from cache (15 downloading)
  1637. 18.31 s Downloading cached cargo-package-wezterm-bidi from https://cache.nix-ci.com
  1638. 18.34 s Downloaded cached cargo-package-wasm-bindgen (265 KiB) in 82ms
  1639. 18.34 s Progress: 0 of 1 built, 536 of 675 downloaded from cache (15 downloading)
  1640. 18.34 s Downloading cached cargo-package-wezterm-blob-leases from https://cache.nix-ci.com
  1641. 18.34 s Downloaded cached cargo-package-wasi-0.11.1+wasi-snapshot-preview1 (132 KiB) in 98ms
  1642. 18.34 s Progress: 0 of 1 built, 537 of 675 downloaded from cache (15 downloading)
  1643. 18.34 s Downloading cached cargo-package-wezterm-color-types from https://cache.nix-ci.com
  1644. 18.34 s Downloaded cached cargo-package-wasm-bindgen-macro (27 KiB) in 79ms
  1645. 18.34 s Progress: 0 of 1 built, 538 of 675 downloaded from cache (15 downloading)
  1646. 18.34 s Downloaded cached cargo-package-wasip3-0.4.0+wasi-0.3.0-rc-2026-01 (1.1 MiB) in 92ms
  1647. 18.34 s Progress: 0 of 1 built, 539 of 675 downloaded from cache (15 downloading)
  1648. 18.34 s Downloading cached cargo-package-wezterm-dynamic-derive from https://cache.nix-ci.com
  1649. 18.34 s Downloading cached cargo-package-wezterm-dynamic from https://cache.nix-ci.com
  1650. 18.34 s Downloaded cached cargo-package-wasip2-1.0.3+wasi (1.2 MiB) in 93ms
  1651. 18.34 s Progress: 0 of 1 built, 540 of 675 downloaded from cache (15 downloading)
  1652. 18.34 s Downloading cached cargo-package-wezterm-input-types from https://cache.nix-ci.com
  1653. 18.34 s Downloaded cached cargo-package-wasm-bindgen-macro-support (319 KiB) in 83ms
  1654. 18.34 s Progress: 0 of 1 built, 541 of 675 downloaded from cache (15 downloading)
  1655. 18.34 s Downloading cached cargo-package-which from https://cache.nix-ci.com
  1656. 18.37 s Downloaded cached cargo-package-wasmtime-jit-icache-coherence (21 KiB) in 85ms
  1657. 18.37 s Progress: 0 of 1 built, 542 of 675 downloaded from cache (15 downloading)
  1658. 18.37 s Downloading cached cargo-package-wide from https://cache.nix-ci.com
  1659. 18.37 s Downloaded cached cargo-package-wide in 0ms
  1660. 18.37 s Progress: 0 of 1 built, 543 of 675 downloaded from cache (15 downloading)
  1661. 18.37 s Downloaded cached cargo-package-wasm-minimal-protocol (35 KiB) in 87ms
  1662. 18.37 s Downloading cached cargo-package-wide from https://cache.nix-ci.com
  1663. 18.37 s Progress: 0 of 1 built, 544 of 675 downloaded from cache (15 downloading)
  1664. 18.37 s Downloading cached cargo-package-wide from https://cache.nix-ci.com
  1665. 18.37 s Downloaded cached cargo-package-wasm-metadata (122 KiB) in 95ms
  1666. 18.37 s Progress: 0 of 1 built, 545 of 675 downloaded from cache (15 downloading)
  1667. 18.37 s Downloading cached cargo-package-winapi from https://cache.nix-ci.com
  1668. 18.37 s Downloaded cached cargo-package-wasm-bindgen-shared (32 KiB) in 98ms
  1669. 18.37 s Progress: 0 of 1 built, 546 of 675 downloaded from cache (15 downloading)
  1670. 18.37 s Downloading cached cargo-package-winapi-i686-pc-windows-gnu from https://cache.nix-ci.com
  1671. 18.38 s Downloaded cached cargo-package-wasmparser (1.4 MiB) in 91ms
  1672. 18.38 s Progress: 0 of 1 built, 547 of 675 downloaded from cache (15 downloading)
  1673. 18.38 s Downloading cached cargo-package-winapi-util from https://cache.nix-ci.com
  1674. 18.38 s Downloaded cached cargo-package-wasm-encoder (580 KiB) in 99ms
  1675. 18.38 s Progress: 0 of 1 built, 548 of 675 downloaded from cache (15 downloading)
  1676. 18.38 s Downloading cached cargo-package-winapi-x86_64-pc-windows-gnu from https://cache.nix-ci.com
  1677. 18.39 s Downloaded cached cargo-package-web-time (67 KiB) in 75ms
  1678. 18.39 s Progress: 0 of 1 built, 549 of 675 downloaded from cache (15 downloading)
  1679. 18.39 s Downloading cached cargo-package-windows from https://cache.nix-ci.com
  1680. 18.39 s Downloaded cached cargo-package-wezterm-bidi (362 KiB) in 77ms
  1681. 18.39 s Progress: 0 of 1 built, 550 of 675 downloaded from cache (15 downloading)
  1682. 18.39 s Downloading cached cargo-package-windows-core from https://cache.nix-ci.com
  1683. 18.39 s Downloaded cached cargo-package-web-time (59 KiB) in 79ms
  1684. 18.39 s Progress: 0 of 1 built, 551 of 675 downloaded from cache (15 downloading)
  1685. 18.39 s Downloading cached cargo-package-windows-implement from https://cache.nix-ci.com
  1686. 18.42 s Downloaded cached cargo-package-wezterm-dynamic-derive (40 KiB) in 77ms
  1687. 18.42 s Progress: 0 of 1 built, 552 of 675 downloaded from cache (15 downloading)
  1688. 18.42 s Downloading cached cargo-package-windows-interface from https://cache.nix-ci.com
  1689. 18.42 s Downloaded cached cargo-package-wezterm-dynamic (56 KiB) in 78ms
  1690. 18.42 s Progress: 0 of 1 built, 553 of 675 downloaded from cache (15 downloading)
  1691. 18.42 s Downloading cached cargo-package-windows-link from https://cache.nix-ci.com
  1692. 18.42 s Downloaded cached cargo-package-wezterm-input-types (99 KiB) in 78ms
  1693. 18.42 s Progress: 0 of 1 built, 554 of 675 downloaded from cache (15 downloading)
  1694. 18.42 s Downloading cached cargo-package-windows-result from https://cache.nix-ci.com
  1695. 18.42 s Downloaded cached cargo-package-wezterm-color-types (51 KiB) in 82ms
  1696. 18.42 s Progress: 0 of 1 built, 555 of 675 downloaded from cache (15 downloading)
  1697. 18.42 s Downloading cached cargo-package-windows-sys from https://cache.nix-ci.com
  1698. 18.43 s Downloaded cached cargo-package-wezterm-blob-leases (32 KiB) in 93ms
  1699. 18.43 s Progress: 0 of 1 built, 556 of 675 downloaded from cache (15 downloading)
  1700. 18.43 s Downloading cached cargo-package-windows-sys from https://cache.nix-ci.com
  1701. 18.43 s Downloaded cached cargo-package-which (117 KiB) in 85ms
  1702. 18.43 s Progress: 0 of 1 built, 557 of 675 downloaded from cache (15 downloading)
  1703. 18.43 s Downloading cached cargo-package-windows-sys from https://cache.nix-ci.com
  1704. 18.45 s Downloaded cached cargo-package-wide (1.1 MiB) in 79ms
  1705. 18.45 s Progress: 0 of 1 built, 558 of 675 downloaded from cache (15 downloading)
  1706. 18.45 s Downloading cached cargo-package-windows-sys from https://cache.nix-ci.com
  1707. 18.46 s Downloaded cached cargo-package-wide (1 MiB) in 85ms
  1708. 18.46 s Progress: 0 of 1 built, 559 of 675 downloaded from cache (15 downloading)
  1709. 18.46 s Downloading cached cargo-package-windows-targets from https://cache.nix-ci.com
  1710. 18.48 s Downloaded cached cargo-package-windows-implement (37 KiB) in 89ms
  1711. 18.48 s Progress: 0 of 1 built, 560 of 675 downloaded from cache (15 downloading)
  1712. 18.48 s Downloading cached cargo-package-windows-targets from https://cache.nix-ci.com
  1713. 18.48 s Downloaded cached cargo-package-winapi-util (48 KiB) in 108ms
  1714. 18.48 s Progress: 0 of 1 built, 561 of 675 downloaded from cache (15 downloading)
  1715. 18.48 s Downloading cached cargo-package-windows_aarch64_gnullvm from https://cache.nix-ci.com
  1716. 18.49 s Downloaded cached cargo-package-windows-core (300 KiB) in 95ms
  1717. 18.49 s Progress: 0 of 1 built, 562 of 675 downloaded from cache (15 downloading)
  1718. 18.49 s Downloading cached cargo-package-windows_aarch64_gnullvm from https://cache.nix-ci.com
  1719. 18.52 s Downloaded cached cargo-package-winapi (6.7 MiB) in 148ms
  1720. 18.52 s Progress: 0 of 1 built, 563 of 675 downloaded from cache (15 downloading)
  1721. 18.52 s Downloading cached cargo-package-windows_aarch64_msvc from https://cache.nix-ci.com
  1722. 18.52 s Downloaded cached cargo-package-web-sys (10.9 MiB) in 212ms
  1723. 18.52 s Progress: 0 of 1 built, 564 of 675 downloaded from cache (15 downloading)
  1724. 18.52 s Downloading cached cargo-package-windows_aarch64_msvc from https://cache.nix-ci.com
  1725. 18.54 s Downloaded cached cargo-package-windows-link (17 KiB) in 116ms
  1726. 18.54 s Progress: 0 of 1 built, 565 of 675 downloaded from cache (15 downloading)
  1727. 18.54 s Downloaded cached cargo-package-windows-result (35 KiB) in 115ms
  1728. 18.54 s Downloading cached cargo-package-windows_i686_gnu from https://cache.nix-ci.com
  1729. 18.54 s Progress: 0 of 1 built, 566 of 675 downloaded from cache (15 downloading)
  1730. 18.54 s Downloading cached cargo-package-windows_i686_gnu from https://cache.nix-ci.com
  1731. 18.55 s Downloaded cached cargo-package-windows-interface (40 KiB) in 136ms
  1732. 18.55 s Progress: 0 of 1 built, 567 of 675 downloaded from cache (15 downloading)
  1733. 18.56 s Downloading cached cargo-package-windows_i686_gnullvm from https://cache.nix-ci.com
  1734. 18.59 s Downloaded cached cargo-package-windows-targets (20 KiB) in 134ms
  1735. 18.59 s Progress: 0 of 1 built, 568 of 675 downloaded from cache (15 downloading)
  1736. 18.59 s Downloading cached cargo-package-windows_i686_gnullvm from https://cache.nix-ci.com
  1737. 18.65 s Downloaded cached cargo-package-windows_aarch64_gnullvm (3.7 MiB) in 167ms
  1738. 18.65 s Progress: 0 of 1 built, 569 of 675 downloaded from cache (15 downloading)
  1739. 18.65 s Downloading cached cargo-package-windows_i686_msvc from https://cache.nix-ci.com
  1740. 18.66 s Downloaded cached cargo-package-windows-targets (22 KiB) in 173ms
  1741. 18.66 s Progress: 0 of 1 built, 570 of 675 downloaded from cache (15 downloading)
  1742. 18.66 s Downloading cached cargo-package-windows_i686_msvc from https://cache.nix-ci.com
  1743. 18.70 s Downloaded cached cargo-package-windows_aarch64_gnullvm (4.9 MiB) in 217ms
  1744. 18.70 s Progress: 0 of 1 built, 571 of 675 downloaded from cache (15 downloading)
  1745. 18.71 s Downloading cached cargo-package-windows_x86_64_gnu from https://cache.nix-ci.com
  1746. 18.73 s Downloaded cached cargo-package-windows_aarch64_msvc (5 MiB) in 204ms
  1747. 18.73 s Progress: 0 of 1 built, 572 of 675 downloaded from cache (15 downloading)
  1748. 18.73 s Downloading cached cargo-package-windows_x86_64_gnu from https://cache.nix-ci.com
  1749. 18.75 s Downloaded cached cargo-package-windows-sys (16.4 MiB) in 317ms
  1750. 18.75 s Progress: 0 of 1 built, 573 of 675 downloaded from cache (15 downloading)
  1751. 18.75 s Downloading cached cargo-package-windows_x86_64_gnullvm from https://cache.nix-ci.com
  1752. 18.76 s Downloaded cached cargo-package-windows_aarch64_msvc (5 MiB) in 235ms
  1753. 18.76 s Progress: 0 of 1 built, 574 of 675 downloaded from cache (15 downloading)
  1754. 18.76 s Downloading cached cargo-package-windows_x86_64_gnullvm from https://cache.nix-ci.com
  1755. 18.77 s Downloaded cached cargo-package-windows-sys (17.5 MiB) in 339ms
  1756. 18.77 s Progress: 0 of 1 built, 575 of 675 downloaded from cache (15 downloading)
  1757. 18.77 s Downloading cached cargo-package-windows_x86_64_msvc from https://cache.nix-ci.com
  1758. 18.77 s Downloaded cached cargo-package-windows-sys (20.6 MiB) in 348ms
  1759. 18.77 s Progress: 0 of 1 built, 576 of 675 downloaded from cache (15 downloading)
  1760. 18.77 s Downloading cached cargo-package-windows_x86_64_msvc from https://cache.nix-ci.com
  1761. 18.78 s Downloaded cached cargo-package-windows_i686_gnullvm (3.9 MiB) in 219ms
  1762. 18.78 s Progress: 0 of 1 built, 577 of 675 downloaded from cache (15 downloading)
  1763. 18.78 s Downloading cached cargo-package-winnow from https://cache.nix-ci.com
  1764. 18.78 s Downloaded cached cargo-package-windows_i686_gnu (12.6 MiB) in 248ms
  1765. 18.78 s Progress: 0 of 1 built, 578 of 675 downloaded from cache (15 downloading)
  1766. 18.79 s Downloading cached cargo-package-winnow from https://cache.nix-ci.com
  1767. 18.80 s Downloaded cached cargo-package-windows_i686_gnu (12.6 MiB) in 259ms
  1768. 18.80 s Progress: 0 of 1 built, 579 of 675 downloaded from cache (15 downloading)
  1769. 18.80 s Downloading cached cargo-package-wit-bindgen from https://cache.nix-ci.com
  1770. 18.80 s Downloaded cached cargo-package-windows_i686_gnullvm (5.2 MiB) in 205ms
  1771. 18.80 s Progress: 0 of 1 built, 580 of 675 downloaded from cache (15 downloading)
  1772. 18.80 s Downloading cached cargo-package-wit-bindgen from https://cache.nix-ci.com
  1773. 18.81 s Downloaded cached cargo-package-windows-sys (17.4 MiB) in 361ms
  1774. 18.81 s Progress: 0 of 1 built, 581 of 675 downloaded from cache (15 downloading)
  1775. 18.81 s Downloading cached cargo-package-wit-bindgen-core from https://cache.nix-ci.com
  1776. 18.81 s Downloaded cached cargo-package-winapi-i686-pc-windows-gnu (48.9 MiB) in 440ms
  1777. 18.81 s Progress: 0 of 1 built, 582 of 675 downloaded from cache (15 downloading)
  1778. 18.81 s Downloading cached cargo-package-wit-bindgen-rust from https://cache.nix-ci.com
  1779. 18.85 s Downloaded cached cargo-package-winapi-x86_64-pc-windows-gnu (51 MiB) in 469ms
  1780. 18.85 s Progress: 0 of 1 built, 583 of 675 downloaded from cache (15 downloading)
  1781. 18.85 s Downloading cached cargo-package-wit-bindgen-rust-macro from https://cache.nix-ci.com
  1782. 18.86 s Downloaded cached cargo-package-windows_i686_msvc (5.3 MiB) in 203ms
  1783. 18.86 s Progress: 0 of 1 built, 584 of 675 downloaded from cache (15 downloading)
  1784. 18.86 s Downloading cached cargo-package-wit-component from https://cache.nix-ci.com
  1785. 18.86 s Downloaded cached cargo-package-windows_i686_msvc (5.3 MiB) in 201ms
  1786. 18.86 s Progress: 0 of 1 built, 585 of 675 downloaded from cache (15 downloading)
  1787. 18.86 s Downloading cached cargo-package-wit-parser from https://cache.nix-ci.com
  1788. 18.90 s Downloaded cached cargo-package-windows_x86_64_gnullvm (3.7 MiB) in 153ms
  1789. 18.90 s Progress: 0 of 1 built, 586 of 675 downloaded from cache (15 downloading)
  1790. 18.90 s Downloading cached cargo-package-wyz from https://cache.nix-ci.com
  1791. 18.92 s Downloaded cached cargo-package-windows_x86_64_msvc (5 MiB) in 147ms
  1792. 18.92 s Progress: 0 of 1 built, 587 of 675 downloaded from cache (15 downloading)
  1793. 18.92 s Downloading cached cargo-package-xpct from https://cache.nix-ci.com
  1794. 18.92 s Downloaded cached cargo-package-windows_x86_64_gnu (12.1 MiB) in 216ms
  1795. 18.92 s Progress: 0 of 1 built, 588 of 675 downloaded from cache (15 downloading)
  1796. 18.92 s Downloading cached cargo-package-xprec from https://cache.nix-ci.com
  1797. 18.92 s Downloaded cached cargo-package-windows_x86_64_gnu (12.1 MiB) in 195ms
  1798. 18.92 s Progress: 0 of 1 built, 589 of 675 downloaded from cache (15 downloading)
  1799. 18.92 s Downloading cached cargo-package-zerocopy from https://cache.nix-ci.com
  1800. 18.93 s Downloaded cached cargo-package-winnow (1.3 MiB) in 153ms
  1801. 18.93 s Progress: 0 of 1 built, 590 of 675 downloaded from cache (15 downloading)
  1802. 18.93 s Downloading cached cargo-package-zerocopy-derive from https://cache.nix-ci.com
  1803. 18.93 s Downloaded cached cargo-package-winnow (1.3 MiB) in 147ms
  1804. 18.93 s Progress: 0 of 1 built, 591 of 675 downloaded from cache (15 downloading)
  1805. 18.93 s Downloading cached cargo-package-zmij from https://cache.nix-ci.com
  1806. 18.95 s Downloaded cached cargo-package-wit-bindgen (285 KiB) in 148ms
  1807. 18.95 s Progress: 0 of 1 built, 592 of 675 downloaded from cache (15 downloading)
  1808. 18.95 s Downloading cached gcc-15.2.0-libgcc from https://cache.nix-ci.com
  1809. 18.95 s Downloaded cached gcc-15.2.0-libgcc in 0ms
  1810. 18.95 s Progress: 0 of 1 built, 593 of 675 downloaded from cache (15 downloading)
  1811. 18.95 s Downloading cached libunistring from https://cache.nix-ci.com
  1812. 18.95 s Downloaded cached libunistring in 0ms
  1813. 18.95 s Progress: 0 of 1 built, 594 of 675 downloaded from cache (15 downloading)
  1814. 18.95 s Downloading cached linkLockedDeps from https://cache.nix-ci.com
  1815. 18.95 s Downloaded cached cargo-package-windows_x86_64_msvc (5 MiB) in 178ms
  1816. 18.95 s Progress: 0 of 1 built, 595 of 675 downloaded from cache (15 downloading)
  1817. 18.95 s Downloading cached libidn2 from https://cache.nix-ci.com
  1818. 18.95 s Downloaded cached libidn2 in 0ms
  1819. 18.95 s Progress: 0 of 1 built, 596 of 675 downloaded from cache (15 downloading)
  1820. 18.95 s Downloading cached publicsuffix-list-0-unstable-2026-05 from https://cache.nix-ci.com
  1821. 18.95 s Downloaded cached publicsuffix-list-0-unstable-2026-05 in 0ms
  1822. 18.95 s Progress: 0 of 1 built, 597 of 675 downloaded from cache (15 downloading)
  1823. 18.95 s Downloading cached glibc-2.42 from https://cache.nix-ci.com
  1824. 18.95 s Downloaded cached glibc-2.42 in 0ms
  1825. 18.95 s Progress: 0 of 1 built, 598 of 675 downloaded from cache (15 downloading)
  1826. 18.95 s Downloading cached attr from https://cache.nix-ci.com
  1827. 18.95 s Downloaded cached attr in 0ms
  1828. 18.95 s Progress: 0 of 1 built, 599 of 675 downloaded from cache (15 downloading)
  1829. 18.95 s Downloading cached aws-c-common from https://cache.nix-ci.com
  1830. 18.95 s Downloaded cached aws-c-common in 0ms
  1831. 18.95 s Progress: 0 of 1 built, 600 of 675 downloaded from cache (15 downloading)
  1832. 18.95 s Downloading cached acl from https://cache.nix-ci.com
  1833. 18.95 s Downloaded cached acl in 0ms
  1834. 18.95 s Progress: 0 of 1 built, 601 of 675 downloaded from cache (15 downloading)
  1835. 18.95 s Downloading cached aws-c-compression from https://cache.nix-ci.com
  1836. 18.95 s Downloaded cached aws-c-compression in 0ms
  1837. 18.95 s Progress: 0 of 1 built, 602 of 675 downloaded from cache (15 downloading)
  1838. 18.95 s Downloading cached aws-c-sdkutils from https://cache.nix-ci.com
  1839. 18.95 s Downloaded cached aws-c-sdkutils in 0ms
  1840. 18.95 s Progress: 0 of 1 built, 603 of 675 downloaded from cache (15 downloading)
  1841. 18.95 s Downloading cached aws-checksums from https://cache.nix-ci.com
  1842. 18.95 s Downloaded cached aws-checksums in 0ms
  1843. 18.95 s Progress: 0 of 1 built, 604 of 675 downloaded from cache (15 downloading)
  1844. 18.95 s Downloading cached bash from https://cache.nix-ci.com
  1845. 18.95 s Downloaded cached bash in 0ms
  1846. 18.95 s Progress: 0 of 1 built, 605 of 675 downloaded from cache (15 downloading)
  1847. 18.95 s Downloading cached brotli-1.2.0-lib from https://cache.nix-ci.com
  1848. 18.95 s Downloaded cached brotli-1.2.0-lib in 0ms
  1849. 18.95 s Progress: 0 of 1 built, 606 of 675 downloaded from cache (15 downloading)
  1850. 18.95 s Downloading cached bzip2 from https://cache.nix-ci.com
  1851. 18.95 s Downloaded cached bzip2 in 0ms
  1852. 18.95 s Progress: 0 of 1 built, 607 of 675 downloaded from cache (15 downloading)
  1853. 18.95 s Downloading cached editline-1.17.1-unstable-2025-05 from https://cache.nix-ci.com
  1854. 18.95 s Downloaded cached editline-1.17.1-unstable-2025-05 in 0ms
  1855. 18.95 s Progress: 0 of 1 built, 608 of 675 downloaded from cache (15 downloading)
  1856. 18.95 s Downloading cached gcc-15.2.0-lib from https://cache.nix-ci.com
  1857. 18.95 s Downloaded cached gcc-15.2.0-lib in 0ms
  1858. 18.95 s Progress: 0 of 1 built, 609 of 675 downloaded from cache (15 downloading)
  1859. 18.95 s Downloading cached hwloc-2.14.0-lib from https://cache.nix-ci.com
  1860. 18.95 s Downloaded cached hwloc-2.14.0-lib in 0ms
  1861. 18.95 s Progress: 0 of 1 built, 610 of 675 downloaded from cache (15 downloading)
  1862. 18.95 s Downloading cached boehm-gc from https://cache.nix-ci.com
  1863. 18.95 s Downloaded cached boehm-gc in 0ms
  1864. 18.95 s Progress: 0 of 1 built, 611 of 675 downloaded from cache (15 downloading)
  1865. 18.95 s Downloading cached icu4c from https://cache.nix-ci.com
  1866. 18.95 s Downloaded cached icu4c in 0ms
  1867. 18.95 s Progress: 0 of 1 built, 612 of 675 downloaded from cache (15 downloading)
  1868. 18.95 s Downloading cached keyutils-1.6.3-lib from https://cache.nix-ci.com
  1869. 18.95 s Downloaded cached keyutils-1.6.3-lib in 0ms
  1870. 18.95 s Progress: 0 of 1 built, 613 of 675 downloaded from cache (15 downloading)
  1871. 18.95 s Downloaded cached cargo-package-windows_x86_64_gnullvm (4.9 MiB) in 195ms
  1872. 18.95 s Downloading cached libcpuid from https://cache.nix-ci.com
  1873. 18.95 s Progress: 0 of 1 built, 614 of 675 downloaded from cache (15 downloading)
  1874. 18.95 s Downloaded cached libcpuid in 0ms
  1875. 18.95 s Downloading cached libpsl from https://cache.nix-ci.com
  1876. 18.95 s Progress: 0 of 1 built, 615 of 675 downloaded from cache (15 downloading)
  1877. 18.95 s Downloaded cached libpsl in 0ms
  1878. 18.95 s Downloading cached libseccomp-2.6.0-lib from https://cache.nix-ci.com
  1879. 18.95 s Downloaded cached libseccomp-2.6.0-lib in 0ms
  1880. 18.95 s Progress: 0 of 1 built, 616 of 675 downloaded from cache (15 downloading)
  1881. 18.95 s Progress: 0 of 1 built, 617 of 675 downloaded from cache (15 downloading)
  1882. 18.95 s Downloading cached libsodium-1.0.22-unstable-2026-04 from https://cache.nix-ci.com
  1883. 18.95 s Downloaded cached libsodium-1.0.22-unstable-2026-04 in 0ms
  1884. 18.95 s Downloading cached libxml2 from https://cache.nix-ci.com
  1885. 18.95 s Progress: 0 of 1 built, 618 of 675 downloaded from cache (15 downloading)
  1886. 18.95 s Downloaded cached libxml2 in 0ms
  1887. 18.95 s Downloading cached llhttp from https://cache.nix-ci.com
  1888. 18.95 s Progress: 0 of 1 built, 619 of 675 downloaded from cache (15 downloading)
  1889. 18.95 s Downloaded cached llhttp in 0ms
  1890. 18.95 s Downloading cached lowdown-3.0.1-lib from https://cache.nix-ci.com
  1891. 18.95 s Downloaded cached lowdown-3.0.1-lib in 0ms
  1892. 18.95 s Progress: 0 of 1 built, 620 of 675 downloaded from cache (15 downloading)
  1893. 18.95 s Progress: 0 of 1 built, 621 of 675 downloaded from cache (14 downloading)
  1894. 18.95 s Downloading cached nghttp2-1.69.0-lib from https://cache.nix-ci.com
  1895. 18.95 s Downloaded cached nghttp2-1.69.0-lib in 0ms
  1896. 18.95 s Downloading cached nghttp3 from https://cache.nix-ci.com
  1897. 18.95 s Progress: 0 of 1 built, 622 of 675 downloaded from cache (15 downloading)
  1898. 18.95 s Downloaded cached nghttp3 in 0ms
  1899. 18.95 s Downloading cached onetbb from https://cache.nix-ci.com
  1900. 18.95 s Progress: 0 of 1 built, 623 of 675 downloaded from cache (15 downloading)
  1901. 18.95 s Downloaded cached onetbb in 0ms
  1902. 18.95 s Downloading cached openssl from https://cache.nix-ci.com
  1903. 18.95 s Progress: 0 of 1 built, 624 of 675 downloaded from cache (15 downloading)
  1904. 18.95 s Downloaded cached openssl in 0ms
  1905. 18.95 s Downloading cached pcre2 from https://cache.nix-ci.com
  1906. 18.95 s Progress: 0 of 1 built, 625 of 675 downloaded from cache (15 downloading)
  1907. 18.95 s Downloaded cached pcre2 in 0ms
  1908. 18.95 s Downloading cached libblake3 from https://cache.nix-ci.com
  1909. 18.96 s Downloaded cached libblake3 in 0ms
  1910. 18.96 s Progress: 0 of 1 built, 626 of 675 downloaded from cache (15 downloading)
  1911. 18.96 s Downloading cached aws-c-cal from https://cache.nix-ci.com
  1912. 18.96 s Progress: 0 of 1 built, 627 of 675 downloaded from cache (15 downloading)
  1913. 18.96 s Downloaded cached aws-c-cal in 0ms
  1914. 18.96 s Progress: 0 of 1 built, 628 of 675 downloaded from cache (15 downloading)
  1915. 18.96 s Downloading cached krb5-1.22.2-lib from https://cache.nix-ci.com
  1916. 18.96 s Downloaded cached krb5-1.22.2-lib in 0ms
  1917. 18.96 s Downloading cached ngtcp2 from https://cache.nix-ci.com
  1918. 18.96 s Progress: 0 of 1 built, 629 of 675 downloaded from cache (15 downloading)
  1919. 18.96 s Downloaded cached ngtcp2 in 0ms
  1920. 18.96 s Progress: 0 of 1 built, 630 of 675 downloaded from cache (15 downloading)
  1921. 18.96 s Downloading cached s2n-tls from https://cache.nix-ci.com
  1922. 18.96 s Downloaded cached s2n-tls in 0ms
  1923. 18.96 s Progress: 0 of 1 built, 631 of 675 downloaded from cache (15 downloading)
  1924. 18.96 s Downloading cached xz from https://cache.nix-ci.com
  1925. 18.96 s Downloaded cached xz in 0ms
  1926. 18.96 s Progress: 0 of 1 built, 632 of 675 downloaded from cache (15 downloading)
  1927. 18.96 s Downloading cached zlib from https://cache.nix-ci.com
  1928. 18.96 s Downloaded cached zlib in 0ms
  1929. 18.96 s Progress: 0 of 1 built, 633 of 675 downloaded from cache (15 downloading)
  1930. 18.96 s Downloading cached aws-c-io from https://cache.nix-ci.com
  1931. 18.96 s Downloaded cached aws-c-io in 0ms
  1932. 18.96 s Downloading cached zstd from https://cache.nix-ci.com
  1933. 18.96 s Progress: 0 of 1 built, 634 of 675 downloaded from cache (15 downloading)
  1934. 18.96 s Downloaded cached zstd in 0ms
  1935. 18.96 s Downloading cached libssh2 from https://cache.nix-ci.com
  1936. 18.96 s Progress: 0 of 1 built, 635 of 675 downloaded from cache (15 downloading)
  1937. 18.96 s Downloaded cached libssh2 in 0ms
  1938. 18.96 s Downloading cached aws-c-event-stream from https://cache.nix-ci.com
  1939. 18.96 s Downloaded cached aws-c-event-stream in 0ms
  1940. 18.96 s Progress: 0 of 1 built, 636 of 675 downloaded from cache (15 downloading)
  1941. 18.96 s Progress: 0 of 1 built, 637 of 675 downloaded from cache (14 downloading)
  1942. 18.96 s Downloading cached aws-c-http from https://cache.nix-ci.com
  1943. 18.96 s Downloaded cached aws-c-http in 0ms
  1944. 18.96 s Downloading cached boost from https://cache.nix-ci.com
  1945. 18.96 s Downloaded cached boost in 0ms
  1946. 18.96 s Progress: 0 of 1 built, 638 of 675 downloaded from cache (15 downloading)
  1947. 18.96 s Progress: 0 of 1 built, 639 of 675 downloaded from cache (14 downloading)
  1948. 18.96 s Downloading cached curl from https://cache.nix-ci.com
  1949. 18.96 s Downloaded cached curl in 0ms
  1950. 18.96 s Downloading cached libarchive-3.8.8-lib from https://cache.nix-ci.com
  1951. 18.96 s Downloaded cached libarchive-3.8.8-lib in 0ms
  1952. 18.96 s Progress: 0 of 1 built, 640 of 675 downloaded from cache (15 downloading)
  1953. 18.96 s Progress: 0 of 1 built, 641 of 675 downloaded from cache (15 downloading)
  1954. 18.96 s Downloading cached aws-c-auth from https://cache.nix-ci.com
  1955. 18.96 s Downloaded cached aws-c-auth in 0ms
  1956. 18.96 s Downloading cached aws-c-mqtt from https://cache.nix-ci.com
  1957. 18.96 s Downloaded cached aws-c-mqtt in 0ms
  1958. 18.96 s Progress: 0 of 1 built, 642 of 675 downloaded from cache (15 downloading)
  1959. 18.96 s Downloading cached libgit2-1.9.4-lib from https://cache.nix-ci.com
  1960. 18.96 s Downloaded cached libgit2-1.9.4-lib in 0ms
  1961. 18.96 s Progress: 0 of 1 built, 643 of 675 downloaded from cache (15 downloading)
  1962. 18.96 s Progress: 0 of 1 built, 644 of 675 downloaded from cache (15 downloading)
  1963. 18.96 s Downloading cached aws-c-s3 from https://cache.nix-ci.com
  1964. 18.96 s Downloaded cached aws-c-s3 in 0ms
  1965. 18.96 s Downloading cached nix-util from https://cache.nix-ci.com
  1966. 18.96 s Progress: 0 of 1 built, 645 of 675 downloaded from cache (15 downloading)
  1967. 18.96 s Downloaded cached nix-util in 0ms
  1968. 18.96 s Downloading cached sqlite from https://cache.nix-ci.com
  1969. 18.96 s Progress: 0 of 1 built, 646 of 675 downloaded from cache (15 downloading)
  1970. 18.96 s Downloaded cached sqlite in 0ms
  1971. 18.96 s Downloading cached aws-crt-cpp from https://cache.nix-ci.com
  1972. 18.96 s Downloaded cached aws-crt-cpp in 0ms
  1973. 18.96 s Progress: 0 of 1 built, 647 of 675 downloaded from cache (15 downloading)
  1974. 18.96 s Downloading cached nix-nswrapper from https://cache.nix-ci.com
  1975. 18.96 s Downloaded cached nix-nswrapper in 0ms
  1976. 18.96 s Progress: 0 of 1 built, 648 of 675 downloaded from cache (15 downloading)
  1977. 18.96 s Downloading cached nix-store from https://cache.nix-ci.com
  1978. 18.96 s Downloaded cached nix-store in 0ms
  1979. 18.96 s Progress: 0 of 1 built, 649 of 675 downloaded from cache (15 downloading)
  1980. 18.96 s Progress: 0 of 1 built, 650 of 675 downloaded from cache (14 downloading)
  1981. 18.96 s Downloading cached nix-fetchers from https://cache.nix-ci.com
  1982. 18.96 s Downloaded cached nix-fetchers in 0ms
  1983. 18.96 s Downloading cached nix-main from https://cache.nix-ci.com
  1984. 18.96 s Downloaded cached nix-main in 0ms
  1985. 18.96 s Progress: 0 of 1 built, 651 of 675 downloaded from cache (15 downloading)
  1986. 18.96 s Progress: 0 of 1 built, 652 of 675 downloaded from cache (15 downloading)
  1987. 18.96 s Downloading cached nix-expr from https://cache.nix-ci.com
  1988. 18.96 s Downloaded cached nix-expr in 0ms
  1989. 18.96 s Progress: 0 of 1 built, 653 of 675 downloaded from cache (14 downloading)
  1990. 18.96 s Downloading cached nix-flake from https://cache.nix-ci.com
  1991. 18.98 s Downloaded cached cargo-package-wit-bindgen (274 KiB) in 187ms
  1992. 18.98 s Progress: 0 of 1 built, 654 of 675 downloaded from cache (14 downloading)
  1993. 18.99 s Downloaded cached cargo-package-wit-bindgen-rust (265 KiB) in 172ms
  1994. 18.99 s Progress: 0 of 1 built, 655 of 675 downloaded from cache (13 downloading)
  1995. 18.99 s Downloaded cached cargo-package-wit-bindgen-core (167 KiB) in 178ms
  1996. 18.99 s Progress: 0 of 1 built, 656 of 675 downloaded from cache (12 downloading)
  1997. 19.04 s Downloaded cached cargo-package-wit-bindgen-rust-macro (59 KiB) in 193ms
  1998. 19.04 s Progress: 0 of 1 built, 657 of 675 downloaded from cache (11 downloading)
  1999. 19.05 s Downloaded cached cargo-package-wyz (63 KiB) in 143ms
  2000. 19.05 s Progress: 0 of 1 built, 658 of 675 downloaded from cache (10 downloading)
  2001. 19.07 s Downloaded cached cargo-package-xprec (141 KiB) in 148ms
  2002. 19.07 s Progress: 0 of 1 built, 659 of 675 downloaded from cache (9 downloading)
  2003. 19.08 s Downloaded cached cargo-package-wit-parser (948 KiB) in 220ms
  2004. 19.08 s Progress: 0 of 1 built, 660 of 675 downloaded from cache (8 downloading)
  2005. 19.08 s Downloaded cached cargo-package-zmij (95 KiB) in 151ms
  2006. 19.08 s Progress: 0 of 1 built, 661 of 675 downloaded from cache (7 downloading)
  2007. 19.09 s Downloaded cached cargo-package-zerocopy (1.7 MiB) in 168ms
  2008. 19.09 s Progress: 0 of 1 built, 662 of 675 downloaded from cache (6 downloading)
  2009. 19.10 s Downloaded cached cargo-package-wit-component (1.6 MiB) in 243ms
  2010. 19.10 s Progress: 0 of 1 built, 663 of 675 downloaded from cache (5 downloading)
  2011. 19.10 s Downloaded cached cargo-package-xpct (654 KiB) in 183ms
  2012. 19.10 s Progress: 0 of 1 built, 664 of 675 downloaded from cache (4 downloading)
  2013. 19.12 s Downloaded cached linkLockedDeps (1128 B) in 172ms
  2014. 19.12 s Progress: 0 of 1 built, 665 of 675 downloaded from cache (3 downloading)
  2015. 19.12 s Downloaded cached cargo-package-zerocopy-derive (973 KiB) in 191ms
  2016. 19.12 s Progress: 0 of 1 built, 666 of 675 downloaded from cache (2 downloading)
  2017. 19.14 s Downloaded cached cargo-package-windows (117.3 MiB) in 748ms
  2018. 19.14 s Progress: 0 of 1 built, 667 of 675 downloaded from cache (1 downloading)
  2019. 19.14 s Downloading cached vendor-registry from https://cache.nix-ci.com
  2020. 19.15 s Downloaded cached nix-flake (956 KiB) in 194ms
  2021. 19.15 s Progress: 0 of 1 built, 668 of 675 downloaded from cache (1 downloading)
  2022. 19.15 s Downloading cached nix-cmd from https://cache.nix-ci.com
  2023. 19.22 s Downloaded cached vendor-registry (162 KiB) in 81ms
  2024. 19.22 s Progress: 0 of 1 built, 669 of 675 downloaded from cache (1 downloading)
  2025. 19.22 s Downloading cached vendor-cargo-deps from https://cache.nix-ci.com
  2026. 19.27 s Downloaded cached vendor-cargo-deps (1752 B) in 43ms
  2027. 19.27 s Progress: 0 of 1 built, 670 of 675 downloaded from cache (1 downloading)
  2028. 19.27 s Downloading cached gammaloop-workspace-deps-deps from https://cache.nix-ci.com
  2029. 19.34 s Downloaded cached nix-cmd (1 MiB) in 183ms
  2030. 19.34 s Progress: 0 of 1 built, 671 of 675 downloaded from cache (1 downloading)
  2031. 19.34 s Downloading cached nix from https://cache.nix-ci.com
  2032. 19.73 s Downloaded cached nix (3.9 MiB) in 394ms
  2033. 19.73 s Progress: 0 of 1 built, 672 of 675 downloaded from cache (1 downloading)
  2034. 20.10 s Downloading cached nix from https://cache.nix-ci.com
  2035. 20.13 s Downloaded cached nix (8848 B) in 27ms
  2036. 20.13 s Progress: 0 of 1 built, 673 of 675 downloaded from cache (1 downloading)
  2037. 34.78 s Downloaded cached gammaloop-workspace-deps-deps (354.2 MiB) in 15.5s
  2038. 34.83 s Progress: 0 of 1 built, 674 of 675 downloaded from cache
  2039. 34.83 s Downloading cached nix-ci-check-gammaloop-doctest from https://cache.nix-ci.com
  2040. 34.83 s Downloaded cached nix-ci-check-gammaloop-doctest (1000 B) in 0ms
  2041. 34.83 s Progress: 0 of 1 built, 675 of 675 downloaded from cache
  2042. 46.35 s evaluating derivation 'g copying '/nix/store/lvky evaluating derivation 'g querying gammaloop-works querying info about miss querying gammaloop-works [0/8 built, 3/0/4 copied [0/7 built, 2/1/4 copied
  2043. 57.77 s [0/6 built, 1/2/4 copied
  2044. 69.79 s [0/2 built, 4 copied (59 [1/0/1 built, 4 copied (gammaloop-workspace-doctest> Running phase: unpackPhase
  2045. 69.83 s gammaloop-workspace-doctest> unpacking source archive /nix/store/n62xwv096bc248rr6y7qpggfdbwshkw9-source
  2046. 69.93 s gammaloop-workspace-doctest> source root is source
  2047. 69.95 s gammaloop-workspace-doctest> Running phase: patchPhase
  2048. 69.95 s gammaloop-workspace-doctest> Executing configureCargoCommonVars
  2049. 69.96 s gammaloop-workspace-doctest> decompressing cargo artifacts from /nix/store/kbgwngi7xvi54jsr0kp8rhj1b9mfja7d-gammaloop-workspace-deps-deps-0.1.0/target.tar.zst to target
  2050. 71.96 s gammaloop-workspace-doctest> Running phase: updateAutotoolsGnuConfigScriptsPhase
  2051. 72.01 s gammaloop-workspace-doctest> Running phase: configurePhase
  2052. 72.01 s gammaloop-workspace-doctest> will append /build/source/.cargo-home/config.toml with contents of /nix/store/xdy1vvhll2bijdplvl9fcc2b9plkxhaa-vendor-cargo-deps/config.toml
  2053. 72.02 s gammaloop-workspace-doctest> default configurePhase, nothing to do
  2054. 72.02 s gammaloop-workspace-doctest> Running phase: buildPhase
  2055. 72.08 s gammaloop-workspace-doctest> +++ command cargo --version
  2056. 72.08 s gammaloop-workspace-doctest> cargo 1.97.0 (c980f4866 2026-06-30)
  2057. 72.12 s gammaloop-workspace-doctest> +++ command cargo test --profile ci-optim --doc --locked --workspace --features gammaloop-api/cli,gammaloop-tracing-filter/clap,gammaloop-tracing-filter/symbolica,idenso/bincode,idenso/reference-cases,linnet/bincode,linnet/drawing,linnet/nodestore-vec,linnet/rkyv,linnet/serde,linnet/symbolica,spenso-macros/shadowing,spenso/shadowing,symbolica/tracing_max_level_info
  2058. 73.56 s gammaloop-workspace-doctest> Compiling target-lexicon v0.13.5
  2059. 73.58 s gammaloop-workspace-doctest> Compiling symbolica v2.2.0 (https://github.com/symbolica-dev/symbolica?branch=dev#0441bd7a)
  2060. 73.58 s gammaloop-workspace-doctest> Compiling maplit v1.0.2
  2061. 73.60 s gammaloop-workspace-doctest> Compiling gammaloop-tracing-filter-macros v0.1.0 (/build/source/crates/gammaloop-tracing-filter-macros)
  2062. 73.60 s gammaloop-workspace-doctest> Compiling vakint v0.1.2 (/build/source/crates/vakint)
  2063. 73.60 s gammaloop-workspace-doctest> Compiling gammalooprs v0.3.4 (/build/source/crates/gammalooprs)
  2064. 73.60 s gammaloop-workspace-doctest> Compiling alphal00p-docs-macros v0.1.0 (/build/source/crates/alphal00p-docs-macros)
  2065. 73.61 s gammaloop-workspace-doctest> Compiling alphal00p-docs-schema v0.1.0 (/build/source/crates/alphal00p-docs-schema)
  2066. 73.61 s gammaloop-workspace-doctest> Compiling rustc_version v0.4.1
  2067. 73.61 s gammaloop-workspace-doctest> Compiling bincode v1.3.3
  2068. 73.61 s gammaloop-workspace-doctest> Compiling iai-callgrind-runner v0.14.2
  2069. 73.61 s gammaloop-workspace-doctest> Compiling target-triple v1.0.1
  2070. 73.61 s gammaloop-workspace-doctest> Compiling gungraun-runner v0.18.2
  2071. 73.61 s gammaloop-workspace-doctest> Compiling clinnet v0.1.8 (/build/source/crates/clinnet)
  2072. 73.64 s gammaloop-workspace-doctest> Compiling gammaloop-integration-tests v0.1.0 (/build/source/tests)
  2073. 74.10 s gammaloop-workspace-doctest> Compiling test-log-core v0.2.20
  2074. 74.13 s gammaloop-workspace-doctest> Compiling wait-timeout v0.2.1
  2075. 74.16 s gammaloop-workspace-doctest> Compiling iai-callgrind v0.14.2
  2076. 74.16 s gammaloop-workspace-doctest> Compiling bit-vec v0.8.0
  2077. 74.18 s gammaloop-workspace-doctest> Compiling quick-error v1.2.3
  2078. 74.31 s gammaloop-workspace-doctest> Compiling rusty-fork v0.3.1
  2079. 74.51 s gammaloop-workspace-doctest> Compiling bit-set v0.8.0
  2080. 74.52 s gammaloop-workspace-doctest> Compiling iai-callgrind-macros v0.5.1
  2081. 74.62 s gammaloop-workspace-doctest> Compiling rand_xorshift v0.4.0
  2082. 74.71 s gammaloop-workspace-doctest> Compiling gungraun-macros v0.8.0
  2083. 74.73 s gammaloop-workspace-doctest> Compiling console v0.15.11
  2084. 74.73 s gammaloop-workspace-doctest> Compiling base64 v0.21.7
  2085. 75.26 s gammaloop-workspace-doctest> Compiling glob v0.3.4
  2086. 75.59 s gammaloop-workspace-doctest> Compiling termcolor v1.4.1
  2087. 75.60 s gammaloop-workspace-doctest> Compiling unarray v0.1.4
  2088. 75.70 s gammaloop-workspace-doctest> Compiling proptest v1.11.0
  2089. 75.70 s gammaloop-workspace-doctest> Compiling alphal00p-docs-builder v0.1.0 (/build/source/crates/alphal00p-docs-builder)
  2090. 75.71 s gammaloop-workspace-doctest> Compiling alphal00p-docs-catalogs v0.1.0 (/build/source/crates/alphal00p-docs-catalogs)
  2091. 75.87 s gammaloop-workspace-doctest> Compiling pyo3-build-config v0.28.3
  2092. 76.02 s gammaloop-workspace-doctest> Compiling trybuild v1.0.120
  2093. 76.21 s gammaloop-workspace-doctest> Compiling similar-asserts v1.7.0
  2094. 76.24 s gammaloop-workspace-doctest> Compiling ron v0.8.1
  2095. 76.39 s gammaloop-workspace-doctest> Compiling kurvst v0.1.0 (/build/source/crates/kurvst)
  2096. 76.73 s gammaloop-workspace-doctest> Compiling test-log-macros v0.2.20
  2097. 79.30 s gammaloop-workspace-doctest> Compiling test-log v0.2.20
  2098. 80.80 s gammaloop-workspace-doctest> Compiling alphal00p-docs-examples v0.1.0 (/build/source/crates/alphal00p-docs-examples)
  2099. 83.02 s gammaloop-workspace-doctest> Compiling pyo3-macros-backend v0.28.3
  2100. 83.04 s gammaloop-workspace-doctest> Compiling pyo3-ffi v0.28.3
  2101. 83.30 s gammaloop-workspace-doctest> Compiling pyo3 v0.28.3
  2102. 83.54 s gammaloop-workspace-doctest> Compiling numpy v0.28.0
  2103. 83.59 s gammaloop-workspace-doctest> Compiling gammaloop-api v0.1.0 (/build/source/crates/gammaloop-api)
  2104. 83.87 s gammaloop-workspace-doctest> Compiling gungraun v0.18.2
  2105. 89.09 s gammaloop-workspace-doctest> Compiling pyo3-macros v0.28.3
  2106. 93.95 s gammaloop-workspace-doctest> Compiling pyo3-stub-gen v0.17.2
  2107. 94.74 s gammaloop-workspace-doctest> Compiling numerica v2.2.0 (https://github.com/symbolica-dev/symbolica?branch=dev#0441bd7a)
  2108. 97.50 s gammaloop-workspace-doctest> Compiling graphica v2.1.0 (https://github.com/symbolica-dev/symbolica?branch=dev#0441bd7a)
  2109. 99.83 s gammaloop-workspace-doctest> Compiling symbolica-utils v0.1.0 (/build/source/crates/symbolica-utils)
  2110. 244.45 s gammaloop-workspace-doctest> Compiling gammaloop-workspace-hack v0.1.0 (/build/source/crates/gammaloop-workspace-hack)
  2111. 244.50 s gammaloop-workspace-doctest> Compiling spenso-macros v0.3.2 (/build/source/crates/spenso-macros)
  2112. 244.59 s gammaloop-workspace-doctest> Compiling linnet v0.17.0 (/build/source/crates/linnet)
  2113. 247.39 s gammaloop-workspace-doctest> Compiling spenso v0.6.0 (/build/source/crates/spenso)
  2114. 253.87 s gammaloop-workspace-doctest> Compiling idenso v0.3.0 (/build/source/crates/idenso)
  2115. 253.92 s gammaloop-workspace-doctest> Compiling gammaloop-tracing-filter v0.1.0 (/build/source/crates/gammaloop-tracing-filter)
  2116. 257.01 s gammaloop-workspace-doctest> Compiling spenso-hep-lib v0.1.7 (/build/source/crates/spenso-hep-lib)
  2117. 257.21 s gammaloop-workspace-doctest> Compiling spynso3 v0.1.2 (/build/source/crates/spynso3)
  2118. 296.14 s gammaloop-workspace-doctest> Compiling linnest v0.1.0 (/build/source/crates/linnest)
  2119. 297.74 s gammaloop-workspace-doctest> Compiling linnet-py v0.1.0 (/build/source/crates/linnet-py)
  2120. 391.81 s gammaloop-workspace-doctest> Finished `ci-optim` profile [optimized] target(s) in 5m 19s
  2121. 391.92 s gammaloop-workspace-doctest> warning: the following packages contain code that will be rejected by a future version of Rust: proc-macro-error2 v2.0.1
  2122. 391.92 s gammaloop-workspace-doctest> note: to see what the problems were, use the option `--future-incompat-report`, or run `cargo report future-incompatibilities --id 1`
  2123. 391.94 s gammaloop-workspace-doctest> Doc-tests alphal00p_docs_builder
  2124. 392.07 s gammaloop-workspace-doctest>
  2125. 392.07 s gammaloop-workspace-doctest> running 0 tests
  2126. 392.07 s gammaloop-workspace-doctest>
  2127. 392.07 s gammaloop-workspace-doctest> test result: ok. 0 passed; 0 failed; 0 ignored; 0 measured; 0 filtered out; finished in 0.00s
  2128. 392.07 s gammaloop-workspace-doctest>
  2129. 392.07 s gammaloop-workspace-doctest> Doc-tests alphal00p_docs_catalogs
  2130. 393.15 s gammaloop-workspace-doctest>
  2131. 393.15 s gammaloop-workspace-doctest> running 0 tests
  2132. 393.15 s gammaloop-workspace-doctest>
  2133. 393.15 s gammaloop-workspace-doctest> test result: ok. 0 passed; 0 failed; 0 ignored; 0 measured; 0 filtered out; finished in 0.00s
  2134. 393.15 s gammaloop-workspace-doctest>
  2135. 393.15 s gammaloop-workspace-doctest> Doc-tests alphal00p_docs_examples
  2136. 393.16 s gammaloop-workspace-doctest>
  2137. 393.16 s gammaloop-workspace-doctest> running 0 tests
  2138. 393.16 s gammaloop-workspace-doctest>
  2139. 393.16 s gammaloop-workspace-doctest> test result: ok. 0 passed; 0 failed; 0 ignored; 0 measured; 0 filtered out; finished in 0.00s
  2140. 393.16 s gammaloop-workspace-doctest>
  2141. 393.16 s gammaloop-workspace-doctest> Doc-tests alphal00p_docs
  2142. 393.21 s gammaloop-workspace-doctest>
  2143. 393.21 s gammaloop-workspace-doctest> running 0 tests
  2144. 393.21 s gammaloop-workspace-doctest>
  2145. 393.21 s gammaloop-workspace-doctest> test result: ok. 0 passed; 0 failed; 0 ignored; 0 measured; 0 filtered out; finished in 0.00s
  2146. 393.21 s gammaloop-workspace-doctest>
  2147. 393.21 s gammaloop-workspace-doctest> Doc-tests alphal00p_docs_schema
  2148. 393.28 s gammaloop-workspace-doctest>
  2149. 393.28 s gammaloop-workspace-doctest> running 0 tests
  2150. 393.28 s gammaloop-workspace-doctest>
  2151. 393.28 s gammaloop-workspace-doctest> test result: ok. 0 passed; 0 failed; 0 ignored; 0 measured; 0 filtered out; finished in 0.00s
  2152. 393.28 s gammaloop-workspace-doctest>
  2153. 393.28 s gammaloop-workspace-doctest> Doc-tests clinnet
  2154. 393.32 s gammaloop-workspace-doctest>
  2155. 393.32 s gammaloop-workspace-doctest> running 0 tests
  2156. 393.32 s gammaloop-workspace-doctest>
  2157. 393.32 s gammaloop-workspace-doctest> test result: ok. 0 passed; 0 failed; 0 ignored; 0 measured; 0 filtered out; finished in 0.00s
  2158. 393.32 s gammaloop-workspace-doctest>
  2159. 393.32 s gammaloop-workspace-doctest> Doc-tests gammaloop_api
  2160. 394.18 s gammaloop-workspace-doctest>
  2161. 394.18 s gammaloop-workspace-doctest> running 13 tests
  2162. 394.19 s gammaloop-workspace-doctest> test crates/gammaloop-api/src/python.rs - python::GammaLoopAPI::get_active_command_blocks (line 3652) ... FAILED
  2163. 394.19 s gammaloop-workspace-doctest> test crates/gammaloop-api/src/python.rs - python::GammaLoopAPI::get_default_runtime_settings (line 3688) ... FAILED
  2164. 394.19 s gammaloop-workspace-doctest> test crates/gammaloop-api/src/python.rs - python::GammaLoopAPI::evaluate_sample (line 2926) ... FAILED
  2165. 394.19 s gammaloop-workspace-doctest> test crates/gammaloop-api/src/python.rs - python::GammaLoopAPI::get_integrand_info (line 3496) ... FAILED
  2166. 394.19 s gammaloop-workspace-doctest> test crates/gammaloop-api/src/python.rs - python::GammaLoopAPI::evaluate_samples (line 3040) ... FAILED
  2167. 394.19 s gammaloop-workspace-doctest> test crates/gammaloop-api/src/python.rs - python::GammaLoopAPI::get_integrand_settings (line 3539) ... FAILED
  2168. 394.28 s gammaloop-workspace-doctest> test crates/gammaloop-api/src/python.rs - python::GammaLoopAPI::run_command (line 3793) ... FAILED
  2169. 394.28 s gammaloop-workspace-doctest> test crates/gammaloop-api/src/python.rs - python::GammaLoopAPI::get_run_history (line 3603) ... FAILED
  2170. 394.28 s gammaloop-workspace-doctest> test crates/gammaloop-api/src/python.rs - python::GammaLoopAPI::get_global_settings (line 3631) ... FAILED
  2171. 394.29 s gammaloop-workspace-doctest> test crates/gammaloop-api/src/python.rs - python::evaluate_graph_overall_factor (line 95) ... FAILED
  2172. 394.29 s gammaloop-workspace-doctest> test crates/gammaloop-api/src/python.rs - python::atom_to_dots (line 157) ... FAILED
  2173. 394.29 s gammaloop-workspace-doctest> test crates/gammaloop-api/src/python.rs - python::atom_to_canonical_string (line 128) ... FAILED
  2174. 394.30 s gammaloop-workspace-doctest> test crates/gammaloop-api/src/python.rs - python::GammaLoopAPI::new_python (line 2804) ... FAILED
  2175. 394.30 s gammaloop-workspace-doctest>
  2176. 394.30 s gammaloop-workspace-doctest> failures:
  2177. 394.30 s gammaloop-workspace-doctest>
  2178. 394.30 s gammaloop-workspace-doctest> ---- crates/gammaloop-api/src/python.rs - python::GammaLoopAPI::get_active_command_blocks (line 3652) stdout ----
  2179. 394.30 s gammaloop-workspace-doctest> error: expected item, found keyword `for`
  2180. 394.30 s gammaloop-workspace-doctest> --> crates/gammaloop-api/src/python.rs:3653:1
  2181. 394.30 s gammaloop-workspace-doctest> |
  2182. 394.30 s gammaloop-workspace-doctest> 3653 | for name, commands in api.get_active_command_blocks().items():
  2183. 394.30 s gammaloop-workspace-doctest> | ^^^ expected item
  2184. 394.30 s gammaloop-workspace-doctest> |
  2185. 394.30 s gammaloop-workspace-doctest> = note: for a full list of items that can appear in modules, see <https://doc.rust-lang.org/reference/items.html>
  2186. 394.30 s gammaloop-workspace-doctest>
  2187. 394.30 s gammaloop-workspace-doctest> error: aborting due to 1 previous error
  2188. 394.30 s gammaloop-workspace-doctest>
  2189. 394.30 s gammaloop-workspace-doctest> Couldn't compile the test.
  2190. 394.30 s gammaloop-workspace-doctest> ---- crates/gammaloop-api/src/python.rs - python::GammaLoopAPI::get_default_runtime_settings (line 3688) stdout ----
  2191. 394.30 s gammaloop-workspace-doctest> error: expected one of `!` or `::`, found `=`
  2192. 394.30 s gammaloop-workspace-doctest> --> crates/gammaloop-api/src/python.rs:3689:9
  2193. 394.30 s gammaloop-workspace-doctest> |
  2194. 394.30 s gammaloop-workspace-doctest> 3689 | runtime = api.get_default_runtime_settings()
  2195. 394.30 s gammaloop-workspace-doctest> | ^ expected one of `!` or `::`
  2196. 394.30 s gammaloop-workspace-doctest>
  2197. 394.30 s gammaloop-workspace-doctest> error: aborting due to 1 previous error
  2198. 394.30 s gammaloop-workspace-doctest>
  2199. 394.30 s gammaloop-workspace-doctest> Couldn't compile the test.
  2200. 394.30 s gammaloop-workspace-doctest> ---- crates/gammaloop-api/src/python.rs - python::GammaLoopAPI::evaluate_sample (line 2926) stdout ----
  2201. 394.30 s gammaloop-workspace-doctest> error: expected one of `!` or `::`, found `=`
  2202. 394.30 s gammaloop-workspace-doctest> --> crates/gammaloop-api/src/python.rs:2927:8
  2203. 394.30 s gammaloop-workspace-doctest> |
  2204. 394.30 s gammaloop-workspace-doctest> 2927 | result = api.evaluate_sample(point, process_id=0, minimal_output=True)
  2205. 394.30 s gammaloop-workspace-doctest> | ^ expected one of `!` or `::`
  2206. 394.30 s gammaloop-workspace-doctest>
  2207. 394.30 s gammaloop-workspace-doctest> error: aborting due to 1 previous error
  2208. 394.30 s gammaloop-workspace-doctest>
  2209. 394.30 s gammaloop-workspace-doctest> Couldn't compile the test.
  2210. 394.30 s gammaloop-workspace-doctest> ---- crates/gammaloop-api/src/python.rs - python::GammaLoopAPI::get_integrand_info (line 3496) stdout ----
  2211. 394.30 s gammaloop-workspace-doctest> error: expected one of `!` or `::`, found `=`
  2212. 394.30 s gammaloop-workspace-doctest> --> crates/gammaloop-api/src/python.rs:3497:6
  2213. 394.30 s gammaloop-workspace-doctest> |
  2214. 394.30 s gammaloop-workspace-doctest> 3497 | info = api.get_integrand_info(process_id=0)
  2215. 394.30 s gammaloop-workspace-doctest> | ^ expected one of `!` or `::`
  2216. 394.30 s gammaloop-workspace-doctest>
  2217. 394.30 s gammaloop-workspace-doctest> error: aborting due to 1 previous error
  2218. 394.30 s gammaloop-workspace-doctest>
  2219. 394.30 s gammaloop-workspace-doctest> Couldn't compile the test.
  2220. 394.30 s gammaloop-workspace-doctest> ---- crates/gammaloop-api/src/python.rs - python::GammaLoopAPI::evaluate_samples (line 3040) stdout ----
  2221. 394.30 s gammaloop-workspace-doctest> error: expected one of `!` or `::`, found `=`
  2222. 394.30 s gammaloop-workspace-doctest> --> crates/gammaloop-api/src/python.rs:3041:8
  2223. 394.30 s gammaloop-workspace-doctest> |
  2224. 394.30 s gammaloop-workspace-doctest> 3041 | points = numpy.asarray(points, dtype=numpy.float64)
  2225. 394.30 s gammaloop-workspace-doctest> | ^ expected one of `!` or `::`
  2226. 394.30 s gammaloop-workspace-doctest>
  2227. 394.30 s gammaloop-workspace-doctest> error: aborting due to 1 previous error
  2228. 394.30 s gammaloop-workspace-doctest>
  2229. 394.30 s gammaloop-workspace-doctest> Couldn't compile the test.
  2230. 394.30 s gammaloop-workspace-doctest> ---- crates/gammaloop-api/src/python.rs - python::GammaLoopAPI::get_integrand_settings (line 3539) stdout ----
  2231. 394.30 s gammaloop-workspace-doctest> error: expected one of `!` or `::`, found `=`
  2232. 394.30 s gammaloop-workspace-doctest> --> crates/gammaloop-api/src/python.rs:3540:10
  2233. 394.30 s gammaloop-workspace-doctest> |
  2234. 394.30 s gammaloop-workspace-doctest> 3540 | settings = api.get_integrand_settings(process_id=0)
  2235. 394.30 s gammaloop-workspace-doctest> | ^ expected one of `!` or `::`
  2236. 394.30 s gammaloop-workspace-doctest>
  2237. 394.30 s gammaloop-workspace-doctest> error: aborting due to 1 previous error
  2238. 394.30 s gammaloop-workspace-doctest>
  2239. 394.30 s gammaloop-workspace-doctest> Couldn't compile the test.
  2240. 394.30 s gammaloop-workspace-doctest> ---- crates/gammaloop-api/src/python.rs - python::GammaLoopAPI::run_command (line 3793) stdout ----
  2241. 394.30 s gammaloop-workspace-doctest> error[E0425]: cannot find value `api` in this scope
  2242. 394.30 s gammaloop-workspace-doctest> --> crates/gammaloop-api/src/python.rs:3794:1
  2243. 394.30 s gammaloop-workspace-doctest> |
  2244. 394.30 s gammaloop-workspace-doctest> 3794 | api.run("display processes")
  2245. 394.30 s gammaloop-workspace-doctest> | ^^^ not found in this scope
  2246. 394.30 s gammaloop-workspace-doctest>
  2247. 394.30 s gammaloop-workspace-doctest> error: aborting due to 1 previous error
  2248. 394.30 s gammaloop-workspace-doctest>
  2249. 394.30 s gammaloop-workspace-doctest> For more information about this error, try `rustc --explain E0425`.
  2250. 394.30 s gammaloop-workspace-doctest> Couldn't compile the test.
  2251. 394.30 s gammaloop-workspace-doctest> ---- crates/gammaloop-api/src/python.rs - python::GammaLoopAPI::get_run_history (line 3603) stdout ----
  2252. 394.30 s gammaloop-workspace-doctest> error[E0425]: cannot find value `run_card_toml` in this scope
  2253. 394.30 s gammaloop-workspace-doctest> --> crates/gammaloop-api/src/python.rs:3604:1
  2254. 394.30 s gammaloop-workspace-doctest> |
  2255. 394.30 s gammaloop-workspace-doctest> 3604 | run_card_toml = api.get_run_history()
  2256. 394.30 s gammaloop-workspace-doctest> | ^^^^^^^^^^^^^
  2257. 394.30 s gammaloop-workspace-doctest> |
  2258. 394.30 s gammaloop-workspace-doctest> help: you might have meant to introduce a new binding
  2259. 394.30 s gammaloop-workspace-doctest> |
  2260. 394.30 s gammaloop-workspace-doctest> 3604 | let run_card_toml = api.get_run_history()
  2261. 394.30 s gammaloop-workspace-doctest> | +++
  2262. 394.30 s gammaloop-workspace-doctest>
  2263. 394.30 s gammaloop-workspace-doctest> error[E0425]: cannot find value `api` in this scope
  2264. 394.30 s gammaloop-workspace-doctest> --> crates/gammaloop-api/src/python.rs:3604:17
  2265. 394.30 s gammaloop-workspace-doctest> |
  2266. 394.30 s gammaloop-workspace-doctest> 3604 | run_card_toml = api.get_run_history()
  2267. 394.30 s gammaloop-workspace-doctest> | ^^^ not found in this scope
  2268. 394.30 s gammaloop-workspace-doctest>
  2269. 394.30 s gammaloop-workspace-doctest> error: aborting due to 2 previous errors
  2270. 394.30 s gammaloop-workspace-doctest>
  2271. 394.30 s gammaloop-workspace-doctest> For more information about this error, try `rustc --explain E0425`.
  2272. 394.30 s gammaloop-workspace-doctest> Couldn't compile the test.
  2273. 394.30 s gammaloop-workspace-doctest> ---- crates/gammaloop-api/src/python.rs - python::GammaLoopAPI::get_global_settings (line 3631) stdout ----
  2274. 394.30 s gammaloop-workspace-doctest> error[E0425]: cannot find value `settings_toml` in this scope
  2275. 394.30 s gammaloop-workspace-doctest> --> crates/gammaloop-api/src/python.rs:3632:1
  2276. 394.30 s gammaloop-workspace-doctest> |
  2277. 394.30 s gammaloop-workspace-doctest> 3632 | settings_toml = api.get_global_settings()
  2278. 394.30 s gammaloop-workspace-doctest> | ^^^^^^^^^^^^^
  2279. 394.30 s gammaloop-workspace-doctest> |
  2280. 394.30 s gammaloop-workspace-doctest> help: you might have meant to introduce a new binding
  2281. 394.30 s gammaloop-workspace-doctest> |
  2282. 394.30 s gammaloop-workspace-doctest> 3632 | let settings_toml = api.get_global_settings()
  2283. 394.30 s gammaloop-workspace-doctest> | +++
  2284. 394.30 s gammaloop-workspace-doctest>
  2285. 394.30 s gammaloop-workspace-doctest> error[E0425]: cannot find value `api` in this scope
  2286. 394.30 s gammaloop-workspace-doctest> --> crates/gammaloop-api/src/python.rs:3632:17
  2287. 394.30 s gammaloop-workspace-doctest> |
  2288. 394.30 s gammaloop-workspace-doctest> 3632 | settings_toml = api.get_global_settings()
  2289. 394.30 s gammaloop-workspace-doctest> | ^^^ not found in this scope
  2290. 394.30 s gammaloop-workspace-doctest>
  2291. 394.30 s gammaloop-workspace-doctest> error: aborting due to 2 previous errors
  2292. 394.30 s gammaloop-workspace-doctest>
  2293. 394.30 s gammaloop-workspace-doctest> For more information about this error, try `rustc --explain E0425`.
  2294. 394.30 s gammaloop-workspace-doctest> Couldn't compile the test.
  2295. 394.30 s gammaloop-workspace-doctest> ---- crates/gammaloop-api/src/python.rs - python::evaluate_graph_overall_factor (line 95) stdout ----
  2296. 394.30 s gammaloop-workspace-doctest> error[E0425]: cannot find function `evaluate_graph_overall_factor` in this scope
  2297. 394.30 s gammaloop-workspace-doctest> --> crates/gammaloop-api/src/python.rs:96:1
  2298. 394.30 s gammaloop-workspace-doctest> |
  2299. 394.30 s gammaloop-workspace-doctest> 96 | evaluate_graph_overall_factor(
  2300. 394.30 s gammaloop-workspace-doctest> | ^^^^^^^^^^^^^^^^^^^^^^^^^^^^^ not found in this scope
  2301. 394.30 s gammaloop-workspace-doctest>
  2302. 394.30 s gammaloop-workspace-doctest> error: aborting due to 1 previous error
  2303. 394.30 s gammaloop-workspace-doctest>
  2304. 394.30 s gammaloop-workspace-doctest> For more information about this error, try `rustc --explain E0425`.
  2305. 394.30 s gammaloop-workspace-doctest> Couldn't compile the test.
  2306. 394.30 s gammaloop-workspace-doctest> ---- crates/gammaloop-api/src/python.rs - python::atom_to_dots (line 157) stdout ----
  2307. 394.30 s gammaloop-workspace-doctest> error[E0425]: cannot find function `to_dots` in this scope
  2308. 394.30 s gammaloop-workspace-doctest> --> crates/gammaloop-api/src/python.rs:158:1
  2309. 394.30 s gammaloop-workspace-doctest> |
  2310. 394.30 s gammaloop-workspace-doctest> 158 | to_dots("p(mu) * q(mu)")
  2311. 394.30 s gammaloop-workspace-doctest> | ^^^^^^^ not found in this scope
  2312. 394.30 s gammaloop-workspace-doctest>
  2313. 394.30 s gammaloop-workspace-doctest> error: aborting due to 1 previous error
  2314. 394.30 s gammaloop-workspace-doctest>
  2315. 394.30 s gammaloop-workspace-doctest> For more information about this error, try `rustc --explain E0425`.
  2316. 394.30 s gammaloop-workspace-doctest> Couldn't compile the test.
  2317. 394.30 s gammaloop-workspace-doctest> ---- crates/gammaloop-api/src/python.rs - python::atom_to_canonical_string (line 128) stdout ----
  2318. 394.30 s gammaloop-workspace-doctest> error[E0425]: cannot find function `atom_to_canonical_string` in this scope
  2319. 394.30 s gammaloop-workspace-doctest> --> crates/gammaloop-api/src/python.rs:129:1
  2320. 394.30 s gammaloop-workspace-doctest> |
  2321. 394.30 s gammaloop-workspace-doctest> 129 | atom_to_canonical_string("x + x")
  2322. 394.30 s gammaloop-workspace-doctest> | ^^^^^^^^^^^^^^^^^^^^^^^^ not found in this scope
  2323. 394.30 s gammaloop-workspace-doctest>
  2324. 394.30 s gammaloop-workspace-doctest> error: aborting due to 1 previous error
  2325. 394.30 s gammaloop-workspace-doctest>
  2326. 394.30 s gammaloop-workspace-doctest> For more information about this error, try `rustc --explain E0425`.
  2327. 394.30 s gammaloop-workspace-doctest> Couldn't compile the test.
  2328. 394.30 s gammaloop-workspace-doctest> ---- crates/gammaloop-api/src/python.rs - python::GammaLoopAPI::new_python (line 2804) stdout ----
  2329. 394.30 s gammaloop-workspace-doctest> error[E0425]: cannot find value `api` in this scope
  2330. 394.30 s gammaloop-workspace-doctest> --> crates/gammaloop-api/src/python.rs:2805:1
  2331. 394.30 s gammaloop-workspace-doctest> |
  2332. 394.30 s gammaloop-workspace-doctest> 2805 | api = GammaLoopAPI(state_folder="./state", read_only_state=True)
  2333. 394.30 s gammaloop-workspace-doctest> | ^^^
  2334. 394.30 s gammaloop-workspace-doctest> |
  2335. 394.30 s gammaloop-workspace-doctest> help: you might have meant to introduce a new binding
  2336. 394.30 s gammaloop-workspace-doctest> |
  2337. 394.30 s gammaloop-workspace-doctest> 2805 | let api = GammaLoopAPI(state_folder="./state", read_only_state=True)
  2338. 394.30 s gammaloop-workspace-doctest> | +++
  2339. 394.30 s gammaloop-workspace-doctest>
  2340. 394.30 s gammaloop-workspace-doctest> error[E0425]: cannot find value `state_folder` in this scope
  2341. 394.30 s gammaloop-workspace-doctest> --> crates/gammaloop-api/src/python.rs:2805:20
  2342. 394.30 s gammaloop-workspace-doctest> |
  2343. 394.30 s gammaloop-workspace-doctest> 2805 | api = GammaLoopAPI(state_folder="./state", read_only_state=True)
  2344. 394.30 s gammaloop-workspace-doctest> | ^^^^^^^^^^^^ not found in this scope
  2345. 394.30 s gammaloop-workspace-doctest>
  2346. 394.30 s gammaloop-workspace-doctest> error[E0425]: cannot find value `read_only_state` in this scope
  2347. 394.30 s gammaloop-workspace-doctest> --> crates/gammaloop-api/src/python.rs:2805:44
  2348. 394.30 s gammaloop-workspace-doctest> |
  2349. 394.30 s gammaloop-workspace-doctest> 2805 | api = GammaLoopAPI(state_folder="./state", read_only_state=True)
  2350. 394.30 s gammaloop-workspace-doctest> | ^^^^^^^^^^^^^^^ not found in this scope
  2351. 394.30 s gammaloop-workspace-doctest>
  2352. 394.30 s gammaloop-workspace-doctest> error[E0425]: cannot find value `True` in this scope
  2353. 394.30 s gammaloop-workspace-doctest> --> crates/gammaloop-api/src/python.rs:2805:60
  2354. 394.30 s gammaloop-workspace-doctest> |
  2355. 394.30 s gammaloop-workspace-doctest> 2805 | api = GammaLoopAPI(state_folder="./state", read_only_state=True)
  2356. 394.30 s gammaloop-workspace-doctest> | ^^^^ not found in this scope
  2357. 394.30 s gammaloop-workspace-doctest> |
  2358. 394.30 s gammaloop-workspace-doctest> help: you may want to use a bool value instead
  2359. 394.30 s gammaloop-workspace-doctest> |
  2360. 394.30 s gammaloop-workspace-doctest> 2805 - api = GammaLoopAPI(state_folder="./state", read_only_state=True)
  2361. 394.30 s gammaloop-workspace-doctest> 2805 + api = GammaLoopAPI(state_folder="./state", read_only_state=true)
  2362. 394.30 s gammaloop-workspace-doctest> |
  2363. 394.30 s gammaloop-workspace-doctest>
  2364. 394.30 s gammaloop-workspace-doctest> error[E0425]: cannot find function, tuple struct or tuple variant `GammaLoopAPI` in this scope
  2365. 394.30 s gammaloop-workspace-doctest> --> crates/gammaloop-api/src/python.rs:2805:7
  2366. 394.30 s gammaloop-workspace-doctest> |
  2367. 394.30 s gammaloop-workspace-doctest> 2805 | api = GammaLoopAPI(state_folder="./state", read_only_state=True)
  2368. 394.30 s gammaloop-workspace-doctest> | ^^^^^^^^^^^^ not found in this scope
  2369. 394.30 s gammaloop-workspace-doctest>
  2370. 394.30 s gammaloop-workspace-doctest> error: aborting due to 5 previous errors
  2371. 394.30 s gammaloop-workspace-doctest>
  2372. 394.30 s gammaloop-workspace-doctest> For more information about this error, try `rustc --explain E0425`.
  2373. 394.30 s gammaloop-workspace-doctest> Couldn't compile the test.
  2374. 394.30 s gammaloop-workspace-doctest>
  2375. 394.30 s gammaloop-workspace-doctest> failures:
  2376. 394.30 s gammaloop-workspace-doctest> crates/gammaloop-api/src/python.rs - python::GammaLoopAPI::evaluate_sample (line 2926)
  2377. 394.30 s gammaloop-workspace-doctest> crates/gammaloop-api/src/python.rs - python::GammaLoopAPI::evaluate_samples (line 3040)
  2378. 394.30 s gammaloop-workspace-doctest> crates/gammaloop-api/src/python.rs - python::GammaLoopAPI::get_active_command_blocks (line 3652)
  2379. 394.30 s gammaloop-workspace-doctest> crates/gammaloop-api/src/python.rs - python::GammaLoopAPI::get_default_runtime_settings (line 3688)
  2380. 394.30 s gammaloop-workspace-doctest> crates/gammaloop-api/src/python.rs - python::GammaLoopAPI::get_global_settings (line 3631)
  2381. 394.30 s gammaloop-workspace-doctest> crates/gammaloop-api/src/python.rs - python::GammaLoopAPI::get_integrand_info (line 3496)
  2382. 394.30 s gammaloop-workspace-doctest> crates/gammaloop-api/src/python.rs - python::GammaLoopAPI::get_integrand_settings (line 3539)
  2383. 394.30 s gammaloop-workspace-doctest> crates/gammaloop-api/src/python.rs - python::GammaLoopAPI::get_run_history (line 3603)
  2384. 394.30 s gammaloop-workspace-doctest> crates/gammaloop-api/src/python.rs - python::GammaLoopAPI::new_python (line 2804)
  2385. 394.30 s gammaloop-workspace-doctest> crates/gammaloop-api/src/python.rs - python::GammaLoopAPI::run_command (line 3793)
  2386. 394.30 s gammaloop-workspace-doctest> crates/gammaloop-api/src/python.rs - python::atom_to_canonical_string (line 128)
  2387. 394.30 s gammaloop-workspace-doctest> crates/gammaloop-api/src/python.rs - python::atom_to_dots (line 157)
  2388. 394.30 s gammaloop-workspace-doctest> crates/gammaloop-api/src/python.rs - python::evaluate_graph_overall_factor (line 95)
  2389. 394.30 s gammaloop-workspace-doctest>
  2390. 394.30 s gammaloop-workspace-doctest> test result: FAILED. 0 passed; 13 failed; 0 ignored; 0 measured; 0 filtered out; finished in 0.12s
  2391. 394.30 s gammaloop-workspace-doctest>
  2392. 394.30 s gammaloop-workspace-doctest> error: doctest failed, to rerun pass `-p gammaloop-api --doc`
  2393. 394.75 s error: Cannot build '/nix/store/d7n0kzr0ab2qmzp3m3y3jhx03bbngjym-gammaloop-workspace-doctest-0.1.0.drv'.
  2394. 394.75 s Reason: builder failed with exit code 101.
  2395. 394.75 s Output paths:
  2396. 394.75 s /nix/store/m1rbsc5idl2jxvknq7bvqysz3ysaha7l-gammaloop-workspace-doctest-0.1.0
  2397. 394.75 s Last 349 log lines:
  2398. 394.75 s > Running phase: unpackPhase
  2399. 394.75 s > unpacking source archive /nix/store/n62xwv096bc248rr6y7qpggfdbwshkw9-source
  2400. 394.75 s > source root is source
  2401. 394.75 s > Running phase: patchPhase
  2402. 394.75 s > Executing configureCargoCommonVars
  2403. 394.75 s > decompressing cargo artifacts from /nix/store/kbgwngi7xvi54jsr0kp8rhj1b9mfja7d-gammaloop-workspace-deps-deps-0.1.0/target.tar.zst to target
  2404. 394.75 s > Running phase: updateAutotoolsGnuConfigScriptsPhase
  2405. 394.75 s > Running phase: configurePhase
  2406. 394.75 s > will append /build/source/.cargo-home/config.toml with contents of /nix/store/xdy1vvhll2bijdplvl9fcc2b9plkxhaa-vendor-cargo-deps/config.toml
  2407. 394.75 s > default configurePhase, nothing to do
  2408. 394.75 s > Running phase: buildPhase
  2409. 394.75 s > +++ command cargo --version
  2410. 394.75 s > cargo 1.97.0 (c980f4866 2026-06-30)
  2411. 394.75 s > +++ command cargo test --profile ci-optim --doc --locked --workspace --features gammaloop-api/cli,gammaloop-tracing-filter/clap,gammaloop-tracing-filter/symbolica,idenso/bincode,idenso/reference-cases,linnet/bincode,linnet/drawing,linnet/nodestore-vec,linnet/rkyv,linnet/serde,linnet/symbolica,spenso-macros/shadowing,spenso/shadowing,symbolica/tracing_max_level_info
  2412. 394.75 s > Compiling target-lexicon v0.13.5
  2413. 394.75 s > Compiling symbolica v2.2.0 (https://github.com/symbolica-dev/symbolica?branch=dev#0441bd7a)
  2414. 394.75 s > Compiling maplit v1.0.2
  2415. 394.75 s > Compiling gammaloop-tracing-filter-macros v0.1.0 (/build/source/crates/gammaloop-tracing-filter-macros)
  2416. 394.75 s > Compiling vakint v0.1.2 (/build/source/crates/vakint)
  2417. 394.75 s > Compiling gammalooprs v0.3.4 (/build/source/crates/gammalooprs)
  2418. 394.75 s > Compiling alphal00p-docs-macros v0.1.0 (/build/source/crates/alphal00p-docs-macros)
  2419. 394.75 s > Compiling alphal00p-docs-schema v0.1.0 (/build/source/crates/alphal00p-docs-schema)
  2420. 394.75 s > Compiling rustc_version v0.4.1
  2421. 394.75 s > Compiling bincode v1.3.3
  2422. 394.75 s > Compiling iai-callgrind-runner v0.14.2
  2423. 394.75 s > Compiling target-triple v1.0.1
  2424. 394.75 s > Compiling gungraun-runner v0.18.2
  2425. 394.75 s > Compiling clinnet v0.1.8 (/build/source/crates/clinnet)
  2426. 394.75 s > Compiling gammaloop-integration-tests v0.1.0 (/build/source/tests)
  2427. 394.75 s > Compiling test-log-core v0.2.20
  2428. 394.75 s > Compiling wait-timeout v0.2.1
  2429. 394.75 s > Compiling iai-callgrind v0.14.2
  2430. 394.75 s > Compiling bit-vec v0.8.0
  2431. 394.75 s > Compiling quick-error v1.2.3
  2432. 394.75 s > Compiling rusty-fork v0.3.1
  2433. 394.75 s > Compiling bit-set v0.8.0
  2434. 394.75 s > Compiling iai-callgrind-macros v0.5.1
  2435. 394.75 s > Compiling rand_xorshift v0.4.0
  2436. 394.75 s > Compiling gungraun-macros v0.8.0
  2437. 394.75 s > Compiling console v0.15.11
  2438. 394.75 s > Compiling base64 v0.21.7
  2439. 394.75 s > Compiling glob v0.3.4
  2440. 394.75 s > Compiling termcolor v1.4.1
  2441. 394.75 s > Compiling unarray v0.1.4
  2442. 394.75 s > Compiling proptest v1.11.0
  2443. 394.75 s > Compiling alphal00p-docs-builder v0.1.0 (/build/source/crates/alphal00p-docs-builder)
  2444. 394.75 s > Compiling alphal00p-docs-catalogs v0.1.0 (/build/source/crates/alphal00p-docs-catalogs)
  2445. 394.75 s > Compiling pyo3-build-config v0.28.3
  2446. 394.75 s > Compiling trybuild v1.0.120
  2447. 394.75 s > Compiling similar-asserts v1.7.0
  2448. 394.75 s > Compiling ron v0.8.1
  2449. 394.75 s > Compiling kurvst v0.1.0 (/build/source/crates/kurvst)
  2450. 394.75 s > Compiling test-log-macros v0.2.20
  2451. 394.75 s > Compiling test-log v0.2.20
  2452. 394.75 s > Compiling alphal00p-docs-examples v0.1.0 (/build/source/crates/alphal00p-docs-examples)
  2453. 394.75 s > Compiling pyo3-macros-backend v0.28.3
  2454. 394.75 s > Compiling pyo3-ffi v0.28.3
  2455. 394.75 s > Compiling pyo3 v0.28.3
  2456. 394.75 s > Compiling numpy v0.28.0
  2457. 394.75 s > Compiling gammaloop-api v0.1.0 (/build/source/crates/gammaloop-api)
  2458. 394.75 s > Compiling gungraun v0.18.2
  2459. 394.75 s > Compiling pyo3-macros v0.28.3
  2460. 394.75 s > Compiling pyo3-stub-gen v0.17.2
  2461. 394.75 s > Compiling numerica v2.2.0 (https://github.com/symbolica-dev/symbolica?branch=dev#0441bd7a)
  2462. 394.75 s > Compiling graphica v2.1.0 (https://github.com/symbolica-dev/symbolica?branch=dev#0441bd7a)
  2463. 394.75 s > Compiling symbolica-utils v0.1.0 (/build/source/crates/symbolica-utils)
  2464. 394.75 s > Compiling gammaloop-workspace-hack v0.1.0 (/build/source/crates/gammaloop-workspace-hack)
  2465. 394.75 s > Compiling spenso-macros v0.3.2 (/build/source/crates/spenso-macros)
  2466. 394.75 s > Compiling linnet v0.17.0 (/build/source/crates/linnet)
  2467. 394.75 s > Compiling spenso v0.6.0 (/build/source/crates/spenso)
  2468. 394.75 s > Compiling idenso v0.3.0 (/build/source/crates/idenso)
  2469. 394.75 s > Compiling gammaloop-tracing-filter v0.1.0 (/build/source/crates/gammaloop-tracing-filter)
  2470. 394.75 s > Compiling spenso-hep-lib v0.1.7 (/build/source/crates/spenso-hep-lib)
  2471. 394.75 s > Compiling spynso3 v0.1.2 (/build/source/crates/spynso3)
  2472. 394.75 s > Compiling linnest v0.1.0 (/build/source/crates/linnest)
  2473. 394.75 s > Compiling linnet-py v0.1.0 (/build/source/crates/linnet-py)
  2474. 394.75 s > Finished `ci-optim` profile [optimized] target(s) in 5m 19s
  2475. 394.75 s > warning: the following packages contain code that will be rejected by a future version of Rust: proc-macro-error2 v2.0.1
  2476. 394.75 s > note: to see what the problems were, use the option `--future-incompat-report`, or run `cargo report future-incompatibilities --id 1`
  2477. 394.75 s > Doc-tests alphal00p_docs_builder
  2478. 394.75 s >
  2479. 394.75 s > running 0 tests
  2480. 394.75 s >
  2481. 394.75 s > test result: ok. 0 passed; 0 failed; 0 ignored; 0 measured; 0 filtered out; finished in 0.00s
  2482. 394.75 s >
  2483. 394.75 s > Doc-tests alphal00p_docs_catalogs
  2484. 394.75 s >
  2485. 394.75 s > running 0 tests
  2486. 394.75 s >
  2487. 394.75 s > test result: ok. 0 passed; 0 failed; 0 ignored; 0 measured; 0 filtered out; finished in 0.00s
  2488. 394.75 s >
  2489. 394.75 s > Doc-tests alphal00p_docs_examples
  2490. 394.75 s >
  2491. 394.75 s > running 0 tests
  2492. 394.75 s >
  2493. 394.75 s > test result: ok. 0 passed; 0 failed; 0 ignored; 0 measured; 0 filtered out; finished in 0.00s
  2494. 394.75 s >
  2495. 394.75 s > Doc-tests alphal00p_docs
  2496. 394.75 s >
  2497. 394.75 s > running 0 tests
  2498. 394.75 s >
  2499. 394.75 s > test result: ok. 0 passed; 0 failed; 0 ignored; 0 measured; 0 filtered out; finished in 0.00s
  2500. 394.75 s >
  2501. 394.75 s > Doc-tests alphal00p_docs_schema
  2502. 394.75 s >
  2503. 394.75 s > running 0 tests
  2504. 394.75 s >
  2505. 394.75 s > test result: ok. 0 passed; 0 failed; 0 ignored; 0 measured; 0 filtered out; finished in 0.00s
  2506. 394.75 s >
  2507. 394.75 s > Doc-tests clinnet
  2508. 394.75 s >
  2509. 394.75 s > running 0 tests
  2510. 394.75 s >
  2511. 394.75 s > test result: ok. 0 passed; 0 failed; 0 ignored; 0 measured; 0 filtered out; finished in 0.00s
  2512. 394.75 s >
  2513. 394.75 s > Doc-tests gammaloop_api
  2514. 394.75 s >
  2515. 394.75 s > running 13 tests
  2516. 394.75 s > test crates/gammaloop-api/src/python.rs - python::GammaLoopAPI::get_active_command_blocks (line 3652) ... FAILED
  2517. 394.75 s > test crates/gammaloop-api/src/python.rs - python::GammaLoopAPI::get_default_runtime_settings (line 3688) ... FAILED
  2518. 394.75 s > test crates/gammaloop-api/src/python.rs - python::GammaLoopAPI::evaluate_sample (line 2926) ... FAILED
  2519. 394.75 s > test crates/gammaloop-api/src/python.rs - python::GammaLoopAPI::get_integrand_info (line 3496) ... FAILED
  2520. 394.75 s > test crates/gammaloop-api/src/python.rs - python::GammaLoopAPI::evaluate_samples (line 3040) ... FAILED
  2521. 394.75 s > test crates/gammaloop-api/src/python.rs - python::GammaLoopAPI::get_integrand_settings (line 3539) ... FAILED
  2522. 394.75 s > test crates/gammaloop-api/src/python.rs - python::GammaLoopAPI::run_command (line 3793) ... FAILED
  2523. 394.75 s > test crates/gammaloop-api/src/python.rs - python::GammaLoopAPI::get_run_history (line 3603) ... FAILED
  2524. 394.75 s > test crates/gammaloop-api/src/python.rs - python::GammaLoopAPI::get_global_settings (line 3631) ... FAILED
  2525. 394.75 s > test crates/gammaloop-api/src/python.rs - python::evaluate_graph_overall_factor (line 95) ... FAILED
  2526. 394.75 s > test crates/gammaloop-api/src/python.rs - python::atom_to_dots (line 157) ... FAILED
  2527. 394.75 s > test crates/gammaloop-api/src/python.rs - python::atom_to_canonical_string (line 128) ... FAILED
  2528. 394.75 s > test crates/gammaloop-api/src/python.rs - python::GammaLoopAPI::new_python (line 2804) ... FAILED
  2529. 394.75 s >
  2530. 394.75 s > failures:
  2531. 394.75 s >
  2532. 394.75 s > ---- crates/gammaloop-api/src/python.rs - python::GammaLoopAPI::get_active_command_blocks (line 3652) stdout ----
  2533. 394.75 s > error: expected item, found keyword `for`
  2534. 394.75 s > --> crates/gammaloop-api/src/python.rs:3653:1
  2535. 394.75 s > |
  2536. 394.75 s > 3653 | for name, commands in api.get_active_command_blocks().items():
  2537. 394.75 s > | ^^^ expected item
  2538. 394.75 s > |
  2539. 394.75 s > = note: for a full list of items that can appear in modules, see <https://doc.rust-lang.org/reference/items.html>
  2540. 394.75 s >
  2541. 394.75 s > error: aborting due to 1 previous error
  2542. 394.75 s >
  2543. 394.75 s > Couldn't compile the test.
  2544. 394.75 s > ---- crates/gammaloop-api/src/python.rs - python::GammaLoopAPI::get_default_runtime_settings (line 3688) stdout ----
  2545. 394.75 s > error: expected one of `!` or `::`, found `=`
  2546. 394.75 s > --> crates/gammaloop-api/src/python.rs:3689:9
  2547. 394.75 s > |
  2548. 394.75 s > 3689 | runtime = api.get_default_runtime_settings()
  2549. 394.75 s > | ^ expected one of `!` or `::`
  2550. 394.75 s >
  2551. 394.75 s > error: aborting due to 1 previous error
  2552. 394.75 s >
  2553. 394.75 s > Couldn't compile the test.
  2554. 394.75 s > ---- crates/gammaloop-api/src/python.rs - python::GammaLoopAPI::evaluate_sample (line 2926) stdout ----
  2555. 394.75 s > error: expected one of `!` or `::`, found `=`
  2556. 394.75 s > --> crates/gammaloop-api/src/python.rs:2927:8
  2557. 394.75 s > |
  2558. 394.75 s > 2927 | result = api.evaluate_sample(point, process_id=0, minimal_output=True)
  2559. 394.75 s > | ^ expected one of `!` or `::`
  2560. 394.75 s >
  2561. 394.75 s > error: aborting due to 1 previous error
  2562. 394.75 s >
  2563. 394.75 s > Couldn't compile the test.
  2564. 394.75 s > ---- crates/gammaloop-api/src/python.rs - python::GammaLoopAPI::get_integrand_info (line 3496) stdout ----
  2565. 394.75 s > error: expected one of `!` or `::`, found `=`
  2566. 394.75 s > --> crates/gammaloop-api/src/python.rs:3497:6
  2567. 394.75 s > |
  2568. 394.75 s > 3497 | info = api.get_integrand_info(process_id=0)
  2569. 394.75 s > | ^ expected one of `!` or `::`
  2570. 394.75 s >
  2571. 394.75 s > error: aborting due to 1 previous error
  2572. 394.75 s >
  2573. 394.75 s > Couldn't compile the test.
  2574. 394.75 s > ---- crates/gammaloop-api/src/python.rs - python::GammaLoopAPI::evaluate_samples (line 3040) stdout ----
  2575. 394.75 s > error: expected one of `!` or `::`, found `=`
  2576. 394.75 s > --> crates/gammaloop-api/src/python.rs:3041:8
  2577. 394.75 s > |
  2578. 394.75 s > 3041 | points = numpy.asarray(points, dtype=numpy.float64)
  2579. 394.75 s > | ^ expected one of `!` or `::`
  2580. 394.75 s >
  2581. 394.75 s > error: aborting due to 1 previous error
  2582. 394.75 s >
  2583. 394.75 s > Couldn't compile the test.
  2584. 394.75 s > ---- crates/gammaloop-api/src/python.rs - python::GammaLoopAPI::get_integrand_settings (line 3539) stdout ----
  2585. 394.75 s > error: expected one of `!` or `::`, found `=`
  2586. 394.75 s > --> crates/gammaloop-api/src/python.rs:3540:10
  2587. 394.75 s > |
  2588. 394.75 s > 3540 | settings = api.get_integrand_settings(process_id=0)
  2589. 394.75 s > | ^ expected one of `!` or `::`
  2590. 394.75 s >
  2591. 394.75 s > error: aborting due to 1 previous error
  2592. 394.75 s >
  2593. 394.75 s > Couldn't compile the test.
  2594. 394.75 s > ---- crates/gammaloop-api/src/python.rs - python::GammaLoopAPI::run_command (line 3793) stdout ----
  2595. 394.75 s > error[E0425]: cannot find value `api` in this scope
  2596. 394.75 s > --> crates/gammaloop-api/src/python.rs:3794:1
  2597. 394.75 s > |
  2598. 394.75 s > 3794 | api.run("display processes")
  2599. 394.75 s > | ^^^ not found in this scope
  2600. 394.75 s >
  2601. 394.75 s > error: aborting due to 1 previous error
  2602. 394.75 s >
  2603. 394.75 s > For more information about this error, try `rustc --explain E0425`.
  2604. 394.75 s > Couldn't compile the test.
  2605. 394.75 s > ---- crates/gammaloop-api/src/python.rs - python::GammaLoopAPI::get_run_history (line 3603) stdout ----
  2606. 394.75 s > error[E0425]: cannot find value `run_card_toml` in this scope
  2607. 394.75 s > --> crates/gammaloop-api/src/python.rs:3604:1
  2608. 394.75 s > |
  2609. 394.75 s > 3604 | run_card_toml = api.get_run_history()
  2610. 394.75 s > | ^^^^^^^^^^^^^
  2611. 394.75 s > |
  2612. 394.75 s > help: you might have meant to introduce a new binding
  2613. 394.75 s > |
  2614. 394.75 s > 3604 | let run_card_toml = api.get_run_history()
  2615. 394.75 s > | +++
  2616. 394.75 s >
  2617. 394.75 s > error[E0425]: cannot find value `api` in this scope
  2618. 394.75 s > --> crates/gammaloop-api/src/python.rs:3604:17
  2619. 394.75 s > |
  2620. 394.75 s > 3604 | run_card_toml = api.get_run_history()
  2621. 394.75 s > | ^^^ not found in this scope
  2622. 394.75 s >
  2623. 394.75 s > error: aborting due to 2 previous errors
  2624. 394.75 s >
  2625. 394.75 s > For more information about this error, try `rustc --explain E0425`.
  2626. 394.75 s > Couldn't compile the test.
  2627. 394.75 s > ---- crates/gammaloop-api/src/python.rs - python::GammaLoopAPI::get_global_settings (line 3631) stdout ----
  2628. 394.75 s > error[E0425]: cannot find value `settings_toml` in this scope
  2629. 394.75 s > --> crates/gammaloop-api/src/python.rs:3632:1
  2630. 394.75 s > |
  2631. 394.75 s > 3632 | settings_toml = api.get_global_settings()
  2632. 394.75 s > | ^^^^^^^^^^^^^
  2633. 394.75 s > |
  2634. 394.75 s > help: you might have meant to introduce a new binding
  2635. 394.75 s > |
  2636. 394.75 s > 3632 | let settings_toml = api.get_global_settings()
  2637. 394.75 s > | +++
  2638. 394.75 s >
  2639. 394.75 s > error[E0425]: cannot find value `api` in this scope
  2640. 394.75 s > --> crates/gammaloop-api/src/python.rs:3632:17
  2641. 394.75 s > |
  2642. 394.75 s > 3632 | settings_toml = api.get_global_settings()
  2643. 394.75 s > | ^^^ not found in this scope
  2644. 394.75 s >
  2645. 394.75 s > error: aborting due to 2 previous errors
  2646. 394.75 s >
  2647. 394.75 s > For more information about this error, try `rustc --explain E0425`.
  2648. 394.75 s > Couldn't compile the test.
  2649. 394.75 s > ---- crates/gammaloop-api/src/python.rs - python::evaluate_graph_overall_factor (line 95) stdout ----
  2650. 394.75 s > error[E0425]: cannot find function `evaluate_graph_overall_factor` in this scope
  2651. 394.75 s > --> crates/gammaloop-api/src/python.rs:96:1
  2652. 394.75 s > |
  2653. 394.75 s > 96 | evaluate_graph_overall_factor(
  2654. 394.75 s > | ^^^^^^^^^^^^^^^^^^^^^^^^^^^^^ not found in this scope
  2655. 394.75 s >
  2656. 394.75 s > error: aborting due to 1 previous error
  2657. 394.75 s >
  2658. 394.75 s > For more information about this error, try `rustc --explain E0425`.
  2659. 394.75 s > Couldn't compile the test.
  2660. 394.75 s > ---- crates/gammaloop-api/src/python.rs - python::atom_to_dots (line 157) stdout ----
  2661. 394.75 s > error[E0425]: cannot find function `to_dots` in this scope
  2662. 394.75 s > --> crates/gammaloop-api/src/python.rs:158:1
  2663. 394.75 s > |
  2664. 394.75 s > 158 | to_dots("p(mu) * q(mu)")
  2665. 394.75 s > | ^^^^^^^ not found in this scope
  2666. 394.75 s >
  2667. 394.75 s > error: aborting due to 1 previous error
  2668. 394.75 s >
  2669. 394.75 s > For more information about this error, try `rustc --explain E0425`.
  2670. 394.75 s > Couldn't compile the test.
  2671. 394.75 s > ---- crates/gammaloop-api/src/python.rs - python::atom_to_canonical_string (line 128) stdout ----
  2672. 394.75 s > error[E0425]: cannot find function `atom_to_canonical_string` in this scope
  2673. 394.75 s > --> crates/gammaloop-api/src/python.rs:129:1
  2674. 394.75 s > |
  2675. 394.75 s > 129 | atom_to_canonical_string("x + x")
  2676. 394.75 s > | ^^^^^^^^^^^^^^^^^^^^^^^^ not found in this scope
  2677. 394.75 s >
  2678. 394.75 s > error: aborting due to 1 previous error
  2679. 394.75 s >
  2680. 394.75 s > For more information about this error, try `rustc --explain E0425`.
  2681. 394.75 s > Couldn't compile the test.
  2682. 394.75 s > ---- crates/gammaloop-api/src/python.rs - python::GammaLoopAPI::new_python (line 2804) stdout ----
  2683. 394.75 s > error[E0425]: cannot find value `api` in this scope
  2684. 394.75 s > --> crates/gammaloop-api/src/python.rs:2805:1
  2685. 394.75 s > |
  2686. 394.75 s > 2805 | api = GammaLoopAPI(state_folder="./state", read_only_state=True)
  2687. 394.75 s > | ^^^
  2688. 394.75 s > |
  2689. 394.75 s > help: you might have meant to introduce a new binding
  2690. 394.75 s > |
  2691. 394.75 s > 2805 | let api = GammaLoopAPI(state_folder="./state", read_only_state=True)
  2692. 394.75 s > | +++
  2693. 394.75 s >
  2694. 394.75 s > error[E0425]: cannot find value `state_folder` in this scope
  2695. 394.75 s > --> crates/gammaloop-api/src/python.rs:2805:20
  2696. 394.75 s > |
  2697. 394.75 s > 2805 | api = GammaLoopAPI(state_folder="./state", read_only_state=True)
  2698. 394.75 s > | ^^^^^^^^^^^^ not found in this scope
  2699. 394.75 s >
  2700. 394.75 s > error[E0425]: cannot find value `read_only_state` in this scope
  2701. 394.75 s > --> crates/gammaloop-api/src/python.rs:2805:44
  2702. 394.75 s > |
  2703. 394.75 s > 2805 | api = GammaLoopAPI(state_folder="./state", read_only_state=True)
  2704. 394.75 s > | ^^^^^^^^^^^^^^^ not found in this scope
  2705. 394.75 s >
  2706. 394.75 s > error[E0425]: cannot find value `True` in this scope
  2707. 394.75 s > --> crates/gammaloop-api/src/python.rs:2805:60
  2708. 394.75 s > |
  2709. 394.75 s > 2805 | api = GammaLoopAPI(state_folder="./state", read_only_state=True)
  2710. 394.75 s > | ^^^^ not found in this scope
  2711. 394.75 s > |
  2712. 394.75 s > help: you may want to use a bool value instead
  2713. 394.75 s > |
  2714. 394.75 s > 2805 - api = GammaLoopAPI(state_folder="./state", read_only_state=True)
  2715. 394.75 s > 2805 + api = GammaLoopAPI(state_folder="./state", read_only_state=true)
  2716. 394.75 s > |
  2717. 394.75 s >
  2718. 394.75 s > error[E0425]: cannot find function, tuple struct or tuple variant `GammaLoopAPI` in this scope
  2719. 394.75 s > --> crates/gammaloop-api/src/python.rs:2805:7
  2720. 394.75 s > |
  2721. 394.75 s > 2805 | api = GammaLoopAPI(state_folder="./state", read_only_state=True)
  2722. 394.75 s > | ^^^^^^^^^^^^ not found in this scope
  2723. 394.75 s >
  2724. 394.75 s > error: aborting due to 5 previous errors
  2725. 394.75 s >
  2726. 394.75 s > For more information about this error, try `rustc --explain E0425`.
  2727. 394.75 s > Couldn't compile the test.
  2728. 394.75 s >
  2729. 394.75 s > failures:
  2730. 394.75 s > crates/gammaloop-api/src/python.rs - python::GammaLoopAPI::evaluate_sample (line 2926)
  2731. 394.75 s > crates/gammaloop-api/src/python.rs - python::GammaLoopAPI::evaluate_samples (line 3040)
  2732. 394.75 s > crates/gammaloop-api/src/python.rs - python::GammaLoopAPI::get_active_command_blocks (line 3652)
  2733. 394.75 s > crates/gammaloop-api/src/python.rs - python::GammaLoopAPI::get_default_runtime_settings (line 3688)
  2734. 394.75 s > crates/gammaloop-api/src/python.rs - python::GammaLoopAPI::get_global_settings (line 3631)
  2735. 394.75 s > crates/gammaloop-api/src/python.rs - python::GammaLoopAPI::get_integrand_info (line 3496)
  2736. 394.75 s > crates/gammaloop-api/src/python.rs - python::GammaLoopAPI::get_integrand_settings (line 3539)
  2737. 394.75 s > crates/gammaloop-api/src/python.rs - python::GammaLoopAPI::get_run_history (line 3603)
  2738. 394.75 s > crates/gammaloop-api/src/python.rs - python::GammaLoopAPI::new_python (line 2804)
  2739. 394.75 s > crates/gammaloop-api/src/python.rs - python::GammaLoopAPI::run_command (line 3793)
  2740. 394.75 s > crates/gammaloop-api/src/python.rs - python::atom_to_canonical_string (line 128)
  2741. 394.75 s > crates/gammaloop-api/src/python.rs - python::atom_to_dots (line 157)
  2742. 394.75 s > crates/gammaloop-api/src/python.rs - python::evaluate_graph_overall_factor (line 95)
  2743. 394.75 s >
  2744. 394.75 s > test result: FAILED. 0 passed; 13 failed; 0 ignored; 0 measured; 0 filtered out; finished in 0.12s
  2745. 394.75 s >
  2746. 394.75 s > error: doctest failed, to rerun pass `-p gammaloop-api --doc`
  2747. 394.75 s For full logs, run:
  2748. 394.75 s nix log /nix/store/d7n0kzr0ab2qmzp3m3y3jhx03bbngjym-gammaloop-workspace-doctest-0.1.0.drv
  2749. 394.82 s [0 built (1 failed), 4 cRun failed.