test packages.x86_64-linux.nix-ci-check-gammaloop-doctest
14.97 s
Progress: 0 of 1 built, 73 of 675 downloaded from cache (15 downloading)
14.98 s
Downloaded cached cargo-package-chunked_transfer (32 KiB) in 79ms
14.98 s
Downloading cached cargo-package-console from https://cache.nix-ci.com
14.98 s
Progress: 0 of 1 built, 74 of 675 downloaded from cache (15 downloading)
14.98 s
Downloading cached cargo-package-console from https://cache.nix-ci.com
14.98 s
Downloaded cached cargo-package-ciborium-ll (57 KiB) in 87ms
14.98 s
Downloaded cached cargo-package-ciborium-io (22 KiB) in 87ms
14.98 s
Progress: 0 of 1 built, 75 of 675 downloaded from cache (15 downloading)
14.98 s
Progress: 0 of 1 built, 76 of 675 downloaded from cache (14 downloading)
14.99 s
Downloading cached cargo-package-const-random from https://cache.nix-ci.com
14.99 s
Downloading cached cargo-package-const-random-macro from https://cache.nix-ci.com
14.99 s
Downloaded cached cargo-package-clap_complete (216 KiB) in 89ms
14.99 s
Progress: 0 of 1 built, 77 of 675 downloaded from cache (15 downloading)
14.99 s
Downloading cached cargo-package-constant_time_eq from https://cache.nix-ci.com
14.99 s
Downloaded cached cargo-package-clap_complete_nushell (136 KiB) in 88ms
14.99 s
Progress: 0 of 1 built, 78 of 675 downloaded from cache (15 downloading)
15.00 s
Downloading cached cargo-package-constcat from https://cache.nix-ci.com
15.00 s
Downloaded cached cargo-package-clap_derive (181 KiB) in 90ms
15.00 s
Progress: 0 of 1 built, 79 of 675 downloaded from cache (15 downloading)
15.00 s
Downloaded cached cargo-package-clap_lex (46 KiB) in 87ms
15.00 s
Downloading cached cargo-package-convert_case from https://cache.nix-ci.com
15.00 s
Progress: 0 of 1 built, 80 of 675 downloaded from cache (15 downloading)
15.00 s
Downloading cached cargo-package-convert_case from https://cache.nix-ci.com
15.02 s
Downloaded cached cargo-package-clap (285 KiB) in 125ms
15.02 s
Downloaded cached cargo-package-clarabel (1.1 MiB) in 115ms
15.02 s
Progress: 0 of 1 built, 81 of 675 downloaded from cache (15 downloading)
15.03 s
Downloading cached cargo-package-core-foundation-sys from https://cache.nix-ci.com
15.03 s
Progress: 0 of 1 built, 82 of 675 downloaded from cache (15 downloading)
15.03 s
Downloaded cached cargo-package-colored (149 KiB) in 102ms
15.03 s
Downloading cached cargo-package-cpufeatures from https://cache.nix-ci.com
15.03 s
Downloaded cached cargo-package-cpufeatures in 0ms
15.03 s
Progress: 0 of 1 built, 83 of 675 downloaded from cache (15 downloading)
15.03 s
Downloaded cached cargo-package-color-spantrace (40 KiB) in 115ms
15.03 s
Progress: 0 of 1 built, 84 of 675 downloaded from cache (14 downloading)
15.03 s
Downloaded cached cargo-package-color-eyre (836 KiB) in 118ms
15.03 s
Downloaded cached cargo-package-colorchoice (23 KiB) in 113ms
15.03 s
Downloading cached cargo-package-cpufeatures from https://cache.nix-ci.com
15.03 s
Downloading cached cargo-package-criterion from https://cache.nix-ci.com
15.04 s
Progress: 0 of 1 built, 85 of 675 downloaded from cache (15 downloading)
15.04 s
Progress: 0 of 1 built, 86 of 675 downloaded from cache (14 downloading)
15.04 s
Progress: 0 of 1 built, 87 of 675 downloaded from cache (13 downloading)
15.04 s
Downloading cached cargo-package-criterion-plot from https://cache.nix-ci.com
15.04 s
Downloading cached cargo-package-crossbeam-channel from https://cache.nix-ci.com
15.04 s
Downloading cached cargo-package-crossbeam-deque from https://cache.nix-ci.com
15.05 s
Downloaded cached cargo-package-colored (151 KiB) in 110ms
15.05 s
Progress: 0 of 1 built, 88 of 675 downloaded from cache (15 downloading)
15.05 s
Downloading cached cargo-package-crossbeam-epoch from https://cache.nix-ci.com
15.05 s
Downloaded cached cargo-package-console (142 KiB) in 73ms
15.05 s
Progress: 0 of 1 built, 89 of 675 downloaded from cache (15 downloading)
15.05 s
Downloading cached cargo-package-crossbeam-utils from https://cache.nix-ci.com
15.05 s
Downloaded cached cargo-package-console (159 KiB) in 78ms
15.05 s
Progress: 0 of 1 built, 90 of 675 downloaded from cache (15 downloading)
15.06 s
Downloading cached cargo-package-crossterm from https://cache.nix-ci.com
15.06 s
Downloaded cached cargo-package-compact_str (335 KiB) in 94ms
15.06 s
Progress: 0 of 1 built, 91 of 675 downloaded from cache (15 downloading)
15.06 s
Downloading cached cargo-package-crossterm from https://cache.nix-ci.com
15.07 s
Downloaded cached cargo-package-const-random-macro (19 KiB) in 79ms
15.07 s
Progress: 0 of 1 built, 92 of 675 downloaded from cache (15 downloading)
15.07 s
Downloaded cached cargo-package-constcat (33 KiB) in 71ms
15.07 s
Downloading cached cargo-package-crossterm_winapi from https://cache.nix-ci.com
15.07 s
Progress: 0 of 1 built, 93 of 675 downloaded from cache (15 downloading)
15.07 s
Downloaded cached cargo-package-convert_case (100 KiB) in 71ms
15.07 s
Downloading cached cargo-package-crunchy from https://cache.nix-ci.com
15.07 s
Progress: 0 of 1 built, 94 of 675 downloaded from cache (15 downloading)
15.07 s
Downloaded cached cargo-package-const-random (20 KiB) in 85ms
15.07 s
Downloading cached cargo-package-crypto-common from https://cache.nix-ci.com
15.07 s
Progress: 0 of 1 built, 95 of 675 downloaded from cache (15 downloading)
15.07 s
Downloading cached cargo-package-csscolorparser from https://cache.nix-ci.com
15.08 s
Downloaded cached cargo-package-constant_time_eq (118 KiB) in 83ms
15.08 s
Progress: 0 of 1 built, 96 of 675 downloaded from cache (15 downloading)
15.08 s
Downloaded cached cargo-package-convert_case (34 KiB) in 75ms
15.08 s
Downloading cached cargo-package-ctrlc from https://cache.nix-ci.com
15.08 s
Progress: 0 of 1 built, 97 of 675 downloaded from cache (15 downloading)
15.08 s
Downloading cached cargo-package-darling from https://cache.nix-ci.com
15.10 s
Downloaded cached cargo-package-cpufeatures (49 KiB) in 65ms
15.10 s
Progress: 0 of 1 built, 98 of 675 downloaded from cache (15 downloading)
15.10 s
Downloading cached cargo-package-darling from https://cache.nix-ci.com
15.10 s
Downloaded cached cargo-package-crossbeam-deque (129 KiB) in 66ms
15.10 s
Progress: 0 of 1 built, 99 of 675 downloaded from cache (15 downloading)
15.10 s
Downloaded cached cargo-package-core-foundation-sys (237 KiB) in 76ms
15.11 s
Downloading cached cargo-package-darling_core from https://cache.nix-ci.com
15.11 s
Progress: 0 of 1 built, 100 of 675 downloaded from cache (15 downloading)
15.11 s
Downloading cached cargo-package-darling_core from https://cache.nix-ci.com
15.11 s
Downloaded cached cargo-package-criterion-plot (98 KiB) in 70ms
15.11 s
Progress: 0 of 1 built, 101 of 675 downloaded from cache (15 downloading)
15.11 s
Downloaded cached cargo-package-crossbeam-channel (597 KiB) in 72ms
15.11 s
Downloading cached cargo-package-darling_macro from https://cache.nix-ci.com
15.11 s
Progress: 0 of 1 built, 102 of 675 downloaded from cache (15 downloading)
15.11 s
Downloading cached cargo-package-darling_macro from https://cache.nix-ci.com
15.12 s
Downloaded cached cargo-package-criterion (521 KiB) in 82ms
15.12 s
Progress: 0 of 1 built, 103 of 675 downloaded from cache (15 downloading)
15.12 s
Downloading cached cargo-package-delegate from https://cache.nix-ci.com
15.12 s
Downloaded cached cargo-package-crossbeam-epoch (204 KiB) in 71ms
15.12 s
Progress: 0 of 1 built, 104 of 675 downloaded from cache (15 downloading)
15.12 s
Downloading cached cargo-package-delegate from https://cache.nix-ci.com
15.12 s
Downloaded cached cargo-package-crossbeam-utils (192 KiB) in 70ms
15.12 s
Progress: 0 of 1 built, 105 of 675 downloaded from cache (15 downloading)
15.13 s
Downloading cached cargo-package-deltae from https://cache.nix-ci.com
15.13 s
Downloaded cached cargo-package-crossterm_winapi (65 KiB) in 64ms
15.13 s
Progress: 0 of 1 built, 106 of 675 downloaded from cache (15 downloading)
15.13 s
Downloaded cached cargo-package-crossterm (516 KiB) in 78ms
15.14 s
Downloading cached cargo-package-deprecate-until from https://cache.nix-ci.com
15.14 s
Progress: 0 of 1 built, 107 of 675 downloaded from cache (15 downloading)
15.14 s
Downloaded cached cargo-package-crunchy (13 KiB) in 68ms
15.14 s
Downloading cached cargo-package-deranged from https://cache.nix-ci.com
15.14 s
Progress: 0 of 1 built, 108 of 675 downloaded from cache (15 downloading)
15.14 s
Downloading cached cargo-package-derive_builder from https://cache.nix-ci.com
15.14 s
Downloaded cached cargo-package-csscolorparser (70 KiB) in 68ms
15.14 s
Progress: 0 of 1 built, 109 of 675 downloaded from cache (15 downloading)
15.14 s
Downloading cached cargo-package-derive_builder_core from https://cache.nix-ci.com
15.15 s
Downloaded cached cargo-package-crossterm (542 KiB) in 81ms
15.15 s
Progress: 0 of 1 built, 110 of 675 downloaded from cache (15 downloading)
15.15 s
Downloading cached cargo-package-derive_builder_macro from https://cache.nix-ci.com
15.15 s
Downloaded cached cargo-package-darling (96 KiB) in 69ms
15.15 s
Downloaded cached cargo-package-crypto-common (30 KiB) in 76ms
15.15 s
Progress: 0 of 1 built, 111 of 675 downloaded from cache (15 downloading)
15.15 s
Downloading cached cargo-package-derive_more from https://cache.nix-ci.com
15.15 s
Progress: 0 of 1 built, 112 of 675 downloaded from cache (15 downloading)
15.15 s
Downloading cached cargo-package-derive_more from https://cache.nix-ci.com
15.15 s
Downloaded cached cargo-package-ctrlc (52 KiB) in 75ms
15.15 s
Progress: 0 of 1 built, 113 of 675 downloaded from cache (15 downloading)
15.15 s
Downloading cached cargo-package-derive_more-impl from https://cache.nix-ci.com
15.17 s
Downloaded cached cargo-package-darling (179 KiB) in 62ms
15.17 s
Progress: 0 of 1 built, 114 of 675 downloaded from cache (15 downloading)
15.17 s
Downloading cached cargo-package-digest from https://cache.nix-ci.com
15.17 s
Downloaded cached cargo-package-darling_macro (5696 B) in 59ms
15.17 s
Progress: 0 of 1 built, 115 of 675 downloaded from cache (15 downloading)
15.17 s
Downloading cached cargo-package-dirs from https://cache.nix-ci.com
15.17 s
Downloaded cached cargo-package-darling_macro (7608 B) in 59ms
15.17 s
Progress: 0 of 1 built, 116 of 675 downloaded from cache (15 downloading)
15.17 s
Downloading cached cargo-package-dirs-sys from https://cache.nix-ci.com
15.19 s
Downloaded cached cargo-package-delegate (55 KiB) in 67ms
15.19 s
Progress: 0 of 1 built, 117 of 675 downloaded from cache (15 downloading)
15.19 s
Downloaded cached cargo-package-darling_core (349 KiB) in 78ms
15.19 s
Downloaded cached cargo-package-darling_core (274 KiB) in 80ms
15.19 s
Downloading cached cargo-package-dispatch2 from https://cache.nix-ci.com
15.19 s
Downloaded cached cargo-package-delegate (84 KiB) in 67ms
15.19 s
Progress: 0 of 1 built, 118 of 675 downloaded from cache (15 downloading)
15.19 s
Progress: 0 of 1 built, 119 of 675 downloaded from cache (14 downloading)
15.19 s
Progress: 0 of 1 built, 120 of 675 downloaded from cache (13 downloading)
15.19 s
Downloading cached cargo-package-document-features from https://cache.nix-ci.com
15.19 s
Downloading cached cargo-package-dot-parser from https://cache.nix-ci.com
15.19 s
Downloading cached cargo-package-duplicate from https://cache.nix-ci.com
15.20 s
Downloaded cached cargo-package-deranged (148 KiB) in 62ms
15.20 s
Progress: 0 of 1 built, 121 of 675 downloaded from cache (15 downloading)
15.20 s
Downloading cached cargo-package-duplicate from https://cache.nix-ci.com
15.21 s
Downloaded cached cargo-package-derive_builder (140 KiB) in 73ms
15.22 s
Progress: 0 of 1 built, 122 of 675 downloaded from cache (15 downloading)
15.22 s
Downloading cached cargo-package-dyn-clone from https://cache.nix-ci.com
15.22 s
Downloaded cached cargo-package-deprecate-until (37 KiB) in 83ms
15.22 s
Progress: 0 of 1 built, 123 of 675 downloaded from cache (15 downloading)
15.22 s
Downloading cached cargo-package-either from https://cache.nix-ci.com
15.23 s
Downloaded cached cargo-package-derive_more (313 KiB) in 76ms
15.23 s
Progress: 0 of 1 built, 124 of 675 downloaded from cache (15 downloading)
15.23 s
Downloading cached cargo-package-encode_unicode from https://cache.nix-ci.com
15.23 s
Downloaded cached cargo-package-derive_more-impl (543 KiB) in 79ms
15.23 s
Progress: 0 of 1 built, 125 of 675 downloaded from cache (15 downloading)
15.24 s
Downloading cached cargo-package-enum-try-as-inner from https://cache.nix-ci.com
15.24 s
Downloaded cached cargo-package-derive_builder_macro (18 KiB) in 88ms
15.24 s
Progress: 0 of 1 built, 126 of 675 downloaded from cache (15 downloading)
15.24 s
Downloading cached cargo-package-enum_dispatch from https://cache.nix-ci.com
15.24 s
Downloaded cached cargo-package-derive_builder_core (137 KiB) in 93ms
15.24 s
Progress: 0 of 1 built, 127 of 675 downloaded from cache (15 downloading)
15.24 s
Downloading cached cargo-package-env_filter from https://cache.nix-ci.com
15.24 s
Downloaded cached cargo-package-derive_more (818 KiB) in 89ms
15.24 s
Progress: 0 of 1 built, 128 of 675 downloaded from cache (15 downloading)
15.24 s
Downloading cached cargo-package-env_logger from https://cache.nix-ci.com
15.25 s
Downloaded cached cargo-package-digest (90 KiB) in 79ms
15.25 s
Progress: 0 of 1 built, 129 of 675 downloaded from cache (15 downloading)
15.25 s
Downloaded cached cargo-package-deltae (2.6 MiB) in 120ms
15.25 s
Downloading cached cargo-package-equivalent from https://cache.nix-ci.com
15.25 s
Progress: 0 of 1 built, 130 of 675 downloaded from cache (15 downloading)
15.25 s
Downloading cached cargo-package-errno from https://cache.nix-ci.com
15.25 s
Downloaded cached cargo-package-dirs-sys (33 KiB) in 80ms
15.25 s
Progress: 0 of 1 built, 131 of 675 downloaded from cache (15 downloading)
15.25 s
Downloaded cached cargo-package-dirs (58 KiB) in 83ms
15.26 s
Downloading cached cargo-package-euclid from https://cache.nix-ci.com
15.26 s
Progress: 0 of 1 built, 132 of 675 downloaded from cache (15 downloading)
15.26 s
Downloading cached cargo-package-eyre from https://cache.nix-ci.com
15.26 s
Downloaded cached cargo-package-dot-parser (100 KiB) in 67ms
15.26 s
Progress: 0 of 1 built, 133 of 675 downloaded from cache (15 downloading)
15.26 s
Downloading cached cargo-package-fancy-regex from https://cache.nix-ci.com
15.27 s
Downloaded cached cargo-package-document-features (52 KiB) in 76ms
15.27 s
Progress: 0 of 1 built, 134 of 675 downloaded from cache (15 downloading)
15.27 s
Downloaded cached cargo-package-dispatch2 (290 KiB) in 80ms
15.27 s
Downloading cached cargo-package-fastrand from https://cache.nix-ci.com
15.27 s
Progress: 0 of 1 built, 135 of 675 downloaded from cache (15 downloading)
15.27 s
Downloading cached cargo-package-fd-lock from https://cache.nix-ci.com
15.27 s
Downloaded cached cargo-package-duplicate (178 KiB) in 82ms
15.27 s
Progress: 0 of 1 built, 136 of 675 downloaded from cache (15 downloading)
15.28 s
Downloading cached cargo-package-features from https://cache.nix-ci.com
15.28 s
Downloaded cached cargo-package-duplicate (205 KiB) in 77ms
15.28 s
Progress: 0 of 1 built, 137 of 675 downloaded from cache (15 downloading)
15.28 s
Downloaded cached cargo-package-dyn-clone (48 KiB) in 65ms
15.28 s
Downloading cached cargo-package-figment from https://cache.nix-ci.com
15.28 s
Progress: 0 of 1 built, 138 of 675 downloaded from cache (15 downloading)
15.29 s
Downloading cached cargo-package-filedescriptor from https://cache.nix-ci.com
15.29 s
Downloaded cached cargo-package-either (84 KiB) in 65ms
15.29 s
Progress: 0 of 1 built, 139 of 675 downloaded from cache (15 downloading)
15.29 s
Downloading cached cargo-package-find-msvc-tools from https://cache.nix-ci.com
15.29 s
Downloaded cached cargo-package-encode_unicode (233 KiB) in 60ms
15.29 s
Progress: 0 of 1 built, 140 of 675 downloaded from cache (15 downloading)
15.29 s
Downloading cached cargo-package-finl_unicode from https://cache.nix-ci.com
15.31 s
Downloaded cached cargo-package-env_logger (133 KiB) in 63ms
15.31 s
Progress: 0 of 1 built, 141 of 675 downloaded from cache (15 downloading)
15.31 s
Downloading cached cargo-package-fixedbitset from https://cache.nix-ci.com
15.31 s
Downloaded cached cargo-package-env_filter (66 KiB) in 70ms
15.31 s
Progress: 0 of 1 built, 142 of 675 downloaded from cache (15 downloading)
15.31 s
Downloaded cached cargo-package-enum-try-as-inner (68 KiB) in 75ms
15.31 s
Downloading cached cargo-package-fnv from https://cache.nix-ci.com
15.31 s
Progress: 0 of 1 built, 143 of 675 downloaded from cache (15 downloading)
15.31 s
Downloading cached cargo-package-foldhash from https://cache.nix-ci.com
15.32 s
Downloaded cached cargo-package-enum_dispatch (121 KiB) in 79ms
15.32 s
Progress: 0 of 1 built, 144 of 675 downloaded from cache (15 downloading)
15.32 s
Downloading cached cargo-package-foldhash from https://cache.nix-ci.com
15.33 s
Downloaded cached cargo-package-equivalent (21 KiB) in 82ms
15.33 s
Progress: 0 of 1 built, 145 of 675 downloaded from cache (15 downloading)
15.33 s
Downloading cached cargo-package-fsevent-sys from https://cache.nix-ci.com
15.33 s
Downloaded cached cargo-package-eyre (178 KiB) in 74ms
15.33 s
Progress: 0 of 1 built, 146 of 675 downloaded from cache (15 downloading)
15.33 s
Downloaded cached cargo-package-errno (41 KiB) in 81ms
15.33 s
Downloading cached cargo-package-funty from https://cache.nix-ci.com
15.33 s
Progress: 0 of 1 built, 147 of 675 downloaded from cache (15 downloading)
15.33 s
Downloading cached cargo-package-futures-core from https://cache.nix-ci.com
15.34 s
Downloaded cached cargo-package-euclid (553 KiB) in 85ms
15.34 s
Progress: 0 of 1 built, 148 of 675 downloaded from cache (15 downloading)
15.34 s
Downloading cached cargo-package-futures-executor from https://cache.nix-ci.com
15.36 s
Downloaded cached cargo-package-fancy-regex (361 KiB) in 97ms
15.36 s
Progress: 0 of 1 built, 149 of 675 downloaded from cache (15 downloading)
15.36 s
Downloading cached cargo-package-futures-task from https://cache.nix-ci.com
15.36 s
Downloaded cached cargo-package-fd-lock (58 KiB) in 91ms
15.36 s
Progress: 0 of 1 built, 150 of 675 downloaded from cache (15 downloading)
15.37 s
Downloading cached cargo-package-futures-util from https://cache.nix-ci.com
15.39 s
Downloaded cached cargo-package-fastrand (75 KiB) in 115ms
15.39 s
Progress: 0 of 1 built, 151 of 675 downloaded from cache (15 downloading)
15.39 s
Downloaded cached cargo-package-finl_unicode (1.3 MiB) in 92ms
15.39 s
Downloading cached cargo-package-gat-lending-iterator from https://cache.nix-ci.com
15.39 s
Progress: 0 of 1 built, 152 of 675 downloaded from cache (15 downloading)
15.39 s
Downloading cached cargo-package-generic-array from https://cache.nix-ci.com
15.39 s
Downloaded cached cargo-package-filedescriptor (58 KiB) in 103ms
15.39 s
Progress: 0 of 1 built, 153 of 675 downloaded from cache (15 downloading)
15.39 s
Downloading cached cargo-package-getopts from https://cache.nix-ci.com
15.39 s
Downloaded cached cargo-package-find-msvc-tools (117 KiB) in 104ms
15.39 s
Progress: 0 of 1 built, 154 of 675 downloaded from cache (15 downloading)
15.39 s
Downloaded cached cargo-package-fixedbitset (69 KiB) in 84ms
15.39 s
Downloading cached cargo-package-getrandom from https://cache.nix-ci.com
15.39 s
Progress: 0 of 1 built, 155 of 675 downloaded from cache (15 downloading)
15.39 s
Downloading cached cargo-package-getrandom from https://cache.nix-ci.com
15.41 s
Downloaded cached cargo-package-fnv (36 KiB) in 97ms
15.41 s
Progress: 0 of 1 built, 156 of 675 downloaded from cache (15 downloading)
15.41 s
Downloading cached cargo-package-getrandom from https://cache.nix-ci.com
15.41 s
Downloaded cached cargo-package-features (29 KiB) in 135ms
15.41 s
Progress: 0 of 1 built, 157 of 675 downloaded from cache (15 downloading)
15.41 s
Downloading cached cargo-package-gimli from https://cache.nix-ci.com
15.41 s
Downloaded cached cargo-package-foldhash (81 KiB) in 99ms
15.41 s
Progress: 0 of 1 built, 158 of 675 downloaded from cache (15 downloading)
15.41 s
Downloaded cached cargo-package-foldhash (85 KiB) in 96ms
15.42 s
Downloading cached cargo-package-glob from https://cache.nix-ci.com
15.42 s
Progress: 0 of 1 built, 159 of 675 downloaded from cache (15 downloading)
15.42 s
Downloaded cached cargo-package-fsevent-sys (18 KiB) in 84ms
15.42 s
Downloading cached cargo-package-globset from https://cache.nix-ci.com
15.42 s
Progress: 0 of 1 built, 160 of 675 downloaded from cache (15 downloading)
15.42 s
Downloading cached cargo-package-gmp-mpfr-sys from https://cache.nix-ci.com
15.42 s
Downloaded cached cargo-package-funty (57 KiB) in 87ms
15.42 s
Progress: 0 of 1 built, 161 of 675 downloaded from cache (15 downloading)
15.42 s
Downloaded cached cargo-package-futures-core (49 KiB) in 86ms
15.42 s
Downloading cached cargo-package-gungraun from https://cache.nix-ci.com
15.42 s
Progress: 0 of 1 built, 162 of 675 downloaded from cache (15 downloading)
15.42 s
Downloaded cached cargo-package-futures-executor (69 KiB) in 79ms
15.42 s
Downloading cached cargo-package-gungraun-macros from https://cache.nix-ci.com
15.42 s
Progress: 0 of 1 built, 163 of 675 downloaded from cache (15 downloading)
15.43 s
Downloading cached cargo-package-gungraun-runner from https://cache.nix-ci.com
15.43 s
Downloaded cached cargo-package-futures-task (42 KiB) in 75ms
15.43 s
Progress: 0 of 1 built, 164 of 675 downloaded from cache (15 downloading)
15.44 s
Downloading cached cargo-package-half from https://cache.nix-ci.com
15.44 s
Downloaded cached cargo-package-futures-util (895 KiB) in 79ms
15.44 s
Progress: 0 of 1 built, 165 of 675 downloaded from cache (15 downloading)
15.45 s
Downloaded cached cargo-package-gat-lending-iterator (113 KiB) in 58ms
15.45 s
Downloading cached cargo-package-hashbrown from https://cache.nix-ci.com
15.45 s
Progress: 0 of 1 built, 166 of 675 downloaded from cache (15 downloading)
15.45 s
Downloaded cached cargo-package-generic-array (69 KiB) in 57ms
15.45 s
Downloading cached cargo-package-hashbrown from https://cache.nix-ci.com
15.45 s
Progress: 0 of 1 built, 167 of 675 downloaded from cache (15 downloading)
15.45 s
Downloaded cached cargo-package-getopts (100 KiB) in 57ms
15.45 s
Downloading cached cargo-package-hashbrown from https://cache.nix-ci.com
15.45 s
Progress: 0 of 1 built, 168 of 675 downloaded from cache (15 downloading)
15.45 s
Downloading cached cargo-package-hashbrown from https://cache.nix-ci.com
15.46 s
Downloaded cached cargo-package-getrandom (181 KiB) in 61ms
15.46 s
Progress: 0 of 1 built, 169 of 675 downloaded from cache (15 downloading)
15.46 s
Downloading cached cargo-package-heck from https://cache.nix-ci.com
15.46 s
Downloaded cached cargo-package-getrandom (134 KiB) in 64ms
15.46 s
Progress: 0 of 1 built, 170 of 675 downloaded from cache (15 downloading)
15.46 s
Downloading cached cargo-package-heck from https://cache.nix-ci.com
15.47 s
Downloaded cached cargo-package-figment (324 KiB) in 181ms
15.47 s
Progress: 0 of 1 built, 171 of 675 downloaded from cache (15 downloading)
15.47 s
Downloading cached cargo-package-hermit-abi from https://cache.nix-ci.com
15.48 s
Downloaded cached cargo-package-glob (95 KiB) in 66ms
15.48 s
Progress: 0 of 1 built, 172 of 675 downloaded from cache (15 downloading)
15.48 s
Downloaded cached cargo-package-getrandom (196 KiB) in 70ms
15.48 s
Downloading cached cargo-package-hex from https://cache.nix-ci.com
15.49 s
Progress: 0 of 1 built, 173 of 675 downloaded from cache (15 downloading)
15.49 s
Downloaded cached cargo-package-gimli (1.8 MiB) in 72ms
15.49 s
Downloaded cached cargo-package-globset (122 KiB) in 68ms
15.49 s
Downloading cached cargo-package-httpdate from https://cache.nix-ci.com
15.49 s
Progress: 0 of 1 built, 174 of 675 downloaded from cache (15 downloading)
15.49 s
Progress: 0 of 1 built, 175 of 675 downloaded from cache (14 downloading)
15.49 s
Downloading cached cargo-package-hugepage-rs from https://cache.nix-ci.com
15.49 s
Downloading cached cargo-package-iai-callgrind from https://cache.nix-ci.com
15.50 s
Downloaded cached cargo-package-gungraun-macros (147 KiB) in 72ms
15.50 s
Progress: 0 of 1 built, 176 of 675 downloaded from cache (15 downloading)
15.50 s
Downloading cached cargo-package-iai-callgrind-macros from https://cache.nix-ci.com
15.50 s
Downloaded cached cargo-package-gungraun (570 KiB) in 78ms
15.50 s
Progress: 0 of 1 built, 177 of 675 downloaded from cache (15 downloading)
15.50 s
Downloading cached cargo-package-iai-callgrind-runner from https://cache.nix-ci.com
15.53 s
Downloaded cached cargo-package-gungraun-runner (1.1 MiB) in 100ms
15.53 s
Progress: 0 of 1 built, 178 of 675 downloaded from cache (15 downloading)
15.53 s
Downloading cached cargo-package-iana-time-zone from https://cache.nix-ci.com
15.53 s
Downloaded cached cargo-package-half (340 KiB) in 92ms
15.53 s
Progress: 0 of 1 built, 179 of 675 downloaded from cache (15 downloading)
15.53 s
Downloading cached cargo-package-iana-time-zone-haiku from https://cache.nix-ci.com
15.53 s
Downloaded cached cargo-package-hashbrown (810 KiB) in 82ms
15.53 s
Progress: 0 of 1 built, 180 of 675 downloaded from cache (15 downloading)
15.53 s
Downloading cached cargo-package-id-arena from https://cache.nix-ci.com
15.53 s
Downloaded cached cargo-package-hashbrown (584 KiB) in 88ms
15.53 s
Progress: 0 of 1 built, 181 of 675 downloaded from cache (15 downloading)
15.54 s
Downloaded cached cargo-package-heck (45 KiB) in 77ms
15.54 s
Downloading cached cargo-package-ident_case from https://cache.nix-ci.com
15.54 s
Progress: 0 of 1 built, 182 of 675 downloaded from cache (15 downloading)
15.54 s
Downloading cached cargo-package-include_dir from https://cache.nix-ci.com
15.55 s
Downloaded cached cargo-package-heck (46 KiB) in 89ms
15.55 s
Progress: 0 of 1 built, 183 of 675 downloaded from cache (15 downloading)
15.55 s
Downloading cached cargo-package-include_dir_macros from https://cache.nix-ci.com
15.55 s
Downloaded cached cargo-package-hermit-abi (57 KiB) in 82ms
15.55 s
Progress: 0 of 1 built, 184 of 675 downloaded from cache (15 downloading)
15.55 s
Downloading cached cargo-package-indenter from https://cache.nix-ci.com
15.55 s
Downloaded cached cargo-package-hashbrown (876 KiB) in 101ms
15.55 s
Progress: 0 of 1 built, 185 of 675 downloaded from cache (15 downloading)
15.55 s
Downloading cached cargo-package-indexmap from https://cache.nix-ci.com
15.55 s
Downloaded cached cargo-package-hashbrown (853 KiB) in 104ms
15.55 s
Progress: 0 of 1 built, 186 of 675 downloaded from cache (15 downloading)
15.56 s
Downloading cached cargo-package-indicatif from https://cache.nix-ci.com
15.56 s
Downloaded cached cargo-package-hex (45 KiB) in 79ms
15.56 s
Progress: 0 of 1 built, 187 of 675 downloaded from cache (15 downloading)
15.56 s
Downloading cached cargo-package-indoc from https://cache.nix-ci.com
15.57 s
Downloaded cached cargo-package-httpdate (35 KiB) in 78ms
15.57 s
Progress: 0 of 1 built, 188 of 675 downloaded from cache (15 downloading)
15.57 s
Downloading cached cargo-package-inotify from https://cache.nix-ci.com
15.58 s
Downloaded cached cargo-package-hugepage-rs (13 KiB) in 93ms
15.58 s
Progress: 0 of 1 built, 189 of 675 downloaded from cache (15 downloading)
15.58 s
Downloading cached cargo-package-inotify-sys from https://cache.nix-ci.com
15.59 s
Downloaded cached cargo-package-iai-callgrind-macros (120 KiB) in 89ms
15.59 s
Progress: 0 of 1 built, 190 of 675 downloaded from cache (15 downloading)
15.59 s
Downloading cached cargo-package-insta from https://cache.nix-ci.com
15.59 s
Downloaded cached cargo-package-iai-callgrind (536 KiB) in 102ms
15.59 s
Progress: 0 of 1 built, 191 of 675 downloaded from cache (15 downloading)
15.59 s
Downloading cached cargo-package-instability from https://cache.nix-ci.com
15.60 s
Downloaded cached cargo-package-iana-time-zone-haiku (20 KiB) in 66ms
15.60 s
Progress: 0 of 1 built, 192 of 675 downloaded from cache (15 downloading)
15.60 s
Downloading cached cargo-package-integer-sqrt from https://cache.nix-ci.com
15.61 s
Downloaded cached cargo-package-iai-callgrind-runner (5.3 MiB) in 100ms
15.61 s
Progress: 0 of 1 built, 193 of 675 downloaded from cache (15 downloading)
15.61 s
Downloading cached cargo-package-inventory from https://cache.nix-ci.com
15.61 s
Downloaded cached cargo-package-iana-time-zone (184 KiB) in 82ms
15.61 s
Progress: 0 of 1 built, 194 of 675 downloaded from cache (15 downloading)
15.61 s
Downloading cached cargo-package-is-macro from https://cache.nix-ci.com
15.61 s
Downloaded cached cargo-package-id-arena (48 KiB) in 81ms
15.61 s
Progress: 0 of 1 built, 195 of 675 downloaded from cache (15 downloading)
15.62 s
Downloading cached cargo-package-is-terminal from https://cache.nix-ci.com
15.62 s
Downloaded cached cargo-package-ident_case (11 KiB) in 81ms
15.62 s
Progress: 0 of 1 built, 196 of 675 downloaded from cache (15 downloading)
15.62 s
Downloaded cached cargo-package-indenter (38 KiB) in 67ms
15.62 s
Downloading cached cargo-package-is_terminal_polyfill from https://cache.nix-ci.com
15.62 s
Progress: 0 of 1 built, 197 of 675 downloaded from cache (15 downloading)
15.62 s
Downloading cached cargo-package-itertools from https://cache.nix-ci.com
15.63 s
Downloaded cached cargo-package-include_dir (21 KiB) in 83ms
15.63 s
Progress: 0 of 1 built, 198 of 675 downloaded from cache (15 downloading)
15.63 s
Downloading cached cargo-package-itertools from https://cache.nix-ci.com
15.63 s
Downloaded cached cargo-package-include_dir_macros (13 KiB) in 77ms
15.63 s
Downloaded cached cargo-package-indexmap (530 KiB) in 73ms
15.63 s
Progress: 0 of 1 built, 199 of 675 downloaded from cache (15 downloading)
15.63 s
Downloading cached cargo-package-itertools from https://cache.nix-ci.com
15.63 s
Progress: 0 of 1 built, 200 of 675 downloaded from cache (15 downloading)
15.63 s
Downloading cached cargo-package-itertools from https://cache.nix-ci.com
15.64 s
Downloaded cached cargo-package-indicatif (341 KiB) in 82ms
15.64 s
Progress: 0 of 1 built, 201 of 675 downloaded from cache (15 downloading)
15.64 s
Downloading cached cargo-package-itertools from https://cache.nix-ci.com
15.64 s
Downloaded cached cargo-package-indoc (67 KiB) in 75ms
15.64 s
Progress: 0 of 1 built, 202 of 675 downloaded from cache (15 downloading)
15.64 s
Downloading cached cargo-package-itoa from https://cache.nix-ci.com
15.64 s
Downloaded cached cargo-package-inotify (119 KiB) in 75ms
15.64 s
Progress: 0 of 1 built, 203 of 675 downloaded from cache (15 downloading)
15.64 s
Downloading cached cargo-package-jiff from https://cache.nix-ci.com
15.66 s
Downloaded cached cargo-package-inotify-sys (39 KiB) in 74ms
15.66 s
Progress: 0 of 1 built, 204 of 675 downloaded from cache (15 downloading)
15.66 s
Downloading cached cargo-package-jiff-static from https://cache.nix-ci.com
15.66 s
Downloaded cached cargo-package-insta (554 KiB) in 72ms
15.66 s
Progress: 0 of 1 built, 205 of 675 downloaded from cache (15 downloading)
15.66 s
Downloading cached cargo-package-joinery from https://cache.nix-ci.com
15.67 s
Downloaded cached cargo-package-instability (68 KiB) in 74ms
15.67 s
Progress: 0 of 1 built, 206 of 675 downloaded from cache (15 downloading)
15.67 s
Downloaded cached cargo-package-integer-sqrt (8088 B) in 70ms
15.67 s
Downloading cached cargo-package-js-sys from https://cache.nix-ci.com
15.67 s
Progress: 0 of 1 built, 207 of 675 downloaded from cache (15 downloading)
15.67 s
Downloading cached cargo-package-json5 from https://cache.nix-ci.com
15.67 s
Downloaded cached cargo-package-inventory (55 KiB) in 64ms
15.67 s
Progress: 0 of 1 built, 208 of 675 downloaded from cache (15 downloading)
15.67 s
Downloading cached cargo-package-kasuari from https://cache.nix-ci.com
15.69 s
Downloaded cached cargo-package-is-macro (31 KiB) in 77ms
15.69 s
Progress: 0 of 1 built, 209 of 675 downloaded from cache (15 downloading)
15.69 s
Downloading cached cargo-package-kqueue from https://cache.nix-ci.com
15.69 s
Downloaded cached cargo-package-is_terminal_polyfill (23 KiB) in 71ms
15.69 s
Downloaded cached cargo-package-is-terminal (25 KiB) in 75ms
15.69 s
Progress: 0 of 1 built, 210 of 675 downloaded from cache (15 downloading)
15.69 s
Downloading cached cargo-package-kqueue-sys from https://cache.nix-ci.com
15.69 s
Progress: 0 of 1 built, 211 of 675 downloaded from cache (15 downloading)
15.69 s
Downloading cached cargo-package-kurbo from https://cache.nix-ci.com
15.70 s
Downloaded cached cargo-package-itertools (602 KiB) in 74ms
15.70 s
Progress: 0 of 1 built, 212 of 675 downloaded from cache (15 downloading)
15.70 s
Downloading cached cargo-package-lab from https://cache.nix-ci.com
15.71 s
Downloaded cached cargo-package-itertools (559 KiB) in 89ms
15.71 s
Progress: 0 of 1 built, 213 of 675 downloaded from cache (15 downloading)
15.71 s
Downloading cached cargo-package-lalrpop-util from https://cache.nix-ci.com
15.71 s
Downloaded cached cargo-package-itoa (53 KiB) in 72ms
15.71 s
Progress: 0 of 1 built, 214 of 675 downloaded from cache (15 downloading)
15.72 s
Downloading cached cargo-package-lazy_static from https://cache.nix-ci.com
15.72 s
Downloaded cached cargo-package-itertools (745 KiB) in 79ms
15.72 s
Progress: 0 of 1 built, 215 of 675 downloaded from cache (15 downloading)
15.72 s
Downloading cached cargo-package-leb128fmt from https://cache.nix-ci.com
15.73 s
Downloaded cached cargo-package-itertools (675 KiB) in 99ms
15.73 s
Progress: 0 of 1 built, 216 of 675 downloaded from cache (15 downloading)
15.73 s
Downloading cached cargo-package-libc from https://cache.nix-ci.com
15.74 s
Downloaded cached cargo-package-itertools (710 KiB) in 107ms
15.74 s
Progress: 0 of 1 built, 217 of 675 downloaded from cache (15 downloading)
15.74 s
Downloading cached cargo-package-libloading from https://cache.nix-ci.com
15.75 s
Downloaded cached cargo-package-jiff (3.7 MiB) in 105ms
15.75 s
Progress: 0 of 1 built, 218 of 675 downloaded from cache (15 downloading)
15.75 s
Downloading cached cargo-package-libm from https://cache.nix-ci.com
15.76 s
Downloaded cached cargo-package-joinery (52 KiB) in 92ms
15.76 s
Progress: 0 of 1 built, 219 of 675 downloaded from cache (15 downloading)
15.76 s
Downloading cached cargo-package-libredox from https://cache.nix-ci.com
15.76 s
Downloaded cached cargo-package-jiff-static (328 KiB) in 104ms
15.76 s
Progress: 0 of 1 built, 220 of 675 downloaded from cache (15 downloading)
15.76 s
Downloading cached cargo-package-line-clipping from https://cache.nix-ci.com
15.77 s
Downloaded cached cargo-package-js-sys (824 KiB) in 97ms
15.77 s
Progress: 0 of 1 built, 221 of 675 downloaded from cache (15 downloading)
15.77 s
Downloading cached cargo-package-linux-raw-sys from https://cache.nix-ci.com
15.77 s
Downloaded cached cargo-package-json5 (82 KiB) in 101ms
15.77 s
Progress: 0 of 1 built, 222 of 675 downloaded from cache (15 downloading)
15.77 s
Downloading cached cargo-package-linux-raw-sys from https://cache.nix-ci.com
15.78 s
Downloaded cached cargo-package-kasuari (143 KiB) in 105ms
15.78 s
Progress: 0 of 1 built, 223 of 675 downloaded from cache (15 downloading)
15.78 s
Downloading cached cargo-package-litrs from https://cache.nix-ci.com
15.80 s
Downloaded cached cargo-package-lab (67 KiB) in 98ms
15.80 s
Progress: 0 of 1 built, 224 of 675 downloaded from cache (15 downloading)
15.80 s
Downloading cached cargo-package-lock_api from https://cache.nix-ci.com
15.81 s
Downloaded cached cargo-package-kqueue-sys (40 KiB) in 120ms
15.81 s
Progress: 0 of 1 built, 225 of 675 downloaded from cache (15 downloading)
15.81 s
Downloaded cached cargo-package-lalrpop-util (51 KiB) in 100ms
15.81 s
Downloading cached cargo-package-log from https://cache.nix-ci.com
15.81 s
Downloaded cached cargo-package-gmp-mpfr-sys (27.6 MiB) in 396ms
15.82 s
Progress: 0 of 1 built, 226 of 675 downloaded from cache (15 downloading)
15.82 s
Progress: 0 of 1 built, 227 of 675 downloaded from cache (14 downloading)
15.82 s
Downloaded cached cargo-package-kqueue (133 KiB) in 126ms
15.82 s
Downloaded cached cargo-package-kurbo (635 KiB) in 122ms
15.82 s
Downloading cached cargo-package-lru from https://cache.nix-ci.com
15.82 s
Downloading cached cargo-package-mac_address from https://cache.nix-ci.com
15.82 s
Progress: 0 of 1 built, 228 of 675 downloaded from cache (15 downloading)
15.82 s
Progress: 0 of 1 built, 229 of 675 downloaded from cache (14 downloading)
15.82 s
Downloading cached cargo-package-mach2 from https://cache.nix-ci.com
15.82 s
Downloading cached cargo-package-malachite-base from https://cache.nix-ci.com
15.85 s
Downloaded cached cargo-package-lazy_static (47 KiB) in 130ms
15.85 s
Progress: 0 of 1 built, 230 of 675 downloaded from cache (15 downloading)
15.85 s
Downloading cached cargo-package-malachite-nz from https://cache.nix-ci.com
15.85 s
Downloaded cached cargo-package-libloading (146 KiB) in 109ms
15.85 s
Progress: 0 of 1 built, 231 of 675 downloaded from cache (15 downloading)
15.85 s
Downloading cached cargo-package-malachite-q from https://cache.nix-ci.com
15.86 s
Downloaded cached cargo-package-leb128fmt (74 KiB) in 134ms
15.86 s
Progress: 0 of 1 built, 232 of 675 downloaded from cache (15 downloading)
15.86 s
Downloading cached cargo-package-maplit from https://cache.nix-ci.com
15.87 s
Downloaded cached cargo-package-line-clipping (55 KiB) in 103ms
15.87 s
Progress: 0 of 1 built, 233 of 675 downloaded from cache (15 downloading)
15.87 s
Downloading cached cargo-package-matchers from https://cache.nix-ci.com
15.89 s
Downloaded cached cargo-package-libm (683 KiB) in 141ms
15.89 s
Progress: 0 of 1 built, 234 of 675 downloaded from cache (15 downloading)
15.89 s
Downloaded cached cargo-package-libc (4.3 MiB) in 161ms
15.89 s
Downloading cached cargo-package-matrixmultiply from https://cache.nix-ci.com
15.89 s
Progress: 0 of 1 built, 235 of 675 downloaded from cache (15 downloading)
15.89 s
Downloading cached cargo-package-memchr from https://cache.nix-ci.com
15.90 s
Downloaded cached cargo-package-libredox (39 KiB) in 137ms
15.90 s
Progress: 0 of 1 built, 236 of 675 downloaded from cache (15 downloading)
15.90 s
Downloading cached cargo-package-memmem from https://cache.nix-ci.com
15.91 s
Downloaded cached cargo-package-litrs (210 KiB) in 123ms
15.91 s
Progress: 0 of 1 built, 237 of 675 downloaded from cache (15 downloading)
15.91 s
Downloading cached cargo-package-memoffset from https://cache.nix-ci.com
15.92 s
Downloaded cached cargo-package-mac_address (45 KiB) in 104ms
15.92 s
Progress: 0 of 1 built, 238 of 675 downloaded from cache (15 downloading)
15.92 s
Downloaded cached cargo-package-lru (115 KiB) in 104ms
15.92 s
Downloaded cached cargo-package-linux-raw-sys (16.2 MiB) in 154ms
15.92 s
Downloading cached cargo-package-minimal-lexical from https://cache.nix-ci.com
15.92 s
Progress: 0 of 1 built, 239 of 675 downloaded from cache (15 downloading)
15.92 s
Progress: 0 of 1 built, 240 of 675 downloaded from cache (14 downloading)
15.92 s
Downloaded cached cargo-package-mach2 (108 KiB) in 106ms
15.93 s
Downloading cached cargo-package-miniz_oxide from https://cache.nix-ci.com
15.93 s
Downloading cached cargo-package-mio from https://cache.nix-ci.com
15.93 s
Progress: 0 of 1 built, 241 of 675 downloaded from cache (15 downloading)
15.93 s
Downloading cached cargo-package-momtrop from https://cache.nix-ci.com
15.94 s
Downloaded cached cargo-package-lock_api (205 KiB) in 133ms
15.94 s
Progress: 0 of 1 built, 242 of 675 downloaded from cache (15 downloading)
15.94 s
Downloading cached cargo-package-nalgebra from https://cache.nix-ci.com
15.94 s
Downloaded cached cargo-package-log (241 KiB) in 127ms
15.94 s
Progress: 0 of 1 built, 243 of 675 downloaded from cache (15 downloading)
15.94 s
Downloading cached cargo-package-nalgebra-macros from https://cache.nix-ci.com
15.95 s
Downloaded cached cargo-package-linux-raw-sys (11.4 MiB) in 175ms
15.95 s
Progress: 0 of 1 built, 244 of 675 downloaded from cache (15 downloading)
15.95 s
Downloading cached cargo-package-ndarray from https://cache.nix-ci.com
15.99 s
Downloaded cached cargo-package-malachite-q (2 MiB) in 138ms
15.99 s
Progress: 0 of 1 built, 245 of 675 downloaded from cache (15 downloading)
15.99 s
Downloading cached cargo-package-nix from https://cache.nix-ci.com
15.99 s
Downloaded cached cargo-package-maplit (28 KiB) in 134ms
15.99 s
Progress: 0 of 1 built, 246 of 675 downloaded from cache (15 downloading)
15.99 s
Downloading cached cargo-package-nix from https://cache.nix-ci.com
16.01 s
Downloaded cached cargo-package-matchers (29 KiB) in 139ms
16.01 s
Progress: 0 of 1 built, 247 of 675 downloaded from cache (15 downloading)
16.01 s
Downloading cached cargo-package-nom from https://cache.nix-ci.com
16.02 s
Downloaded cached cargo-package-malachite-base (7.5 MiB) in 197ms
16.02 s
Progress: 0 of 1 built, 248 of 675 downloaded from cache (15 downloading)
16.02 s
Downloading cached cargo-package-notify from https://cache.nix-ci.com
16.04 s
Downloaded cached cargo-package-matrixmultiply (252 KiB) in 142ms
16.04 s
Progress: 0 of 1 built, 249 of 675 downloaded from cache (15 downloading)
16.04 s
Downloading cached cargo-package-notify-types from https://cache.nix-ci.com
16.05 s
Downloaded cached cargo-package-minimal-lexical (335 KiB) in 127ms
16.05 s
Progress: 0 of 1 built, 250 of 675 downloaded from cache (15 downloading)
16.05 s
Downloading cached cargo-package-ntapi from https://cache.nix-ci.com
16.06 s
Downloaded cached cargo-package-mio (484 KiB) in 139ms
16.07 s
Progress: 0 of 1 built, 251 of 675 downloaded from cache (15 downloading)
16.07 s
Downloading cached cargo-package-nu-ansi-term from https://cache.nix-ci.com
16.07 s
Downloaded cached cargo-package-memmem (31 KiB) in 171ms
16.07 s
Progress: 0 of 1 built, 252 of 675 downloaded from cache (15 downloading)
16.07 s
Downloaded cached cargo-package-memchr (585 KiB) in 175ms
16.07 s
Downloading cached cargo-package-num from https://cache.nix-ci.com
16.07 s
Progress: 0 of 1 built, 253 of 675 downloaded from cache (15 downloading)
16.07 s
Downloading cached cargo-package-num-bigint from https://cache.nix-ci.com
16.07 s
Downloaded cached cargo-package-momtrop (160 KiB) in 144ms
16.07 s
Progress: 0 of 1 built, 254 of 675 downloaded from cache (15 downloading)
16.07 s
Downloading cached cargo-package-num-complex from https://cache.nix-ci.com
16.07 s
Downloaded cached cargo-package-memoffset (41 KiB) in 167ms
16.07 s
Progress: 0 of 1 built, 255 of 675 downloaded from cache (15 downloading)
16.08 s
Downloading cached cargo-package-num-conv from https://cache.nix-ci.com
16.08 s
Downloaded cached cargo-package-nalgebra-macros (27 KiB) in 133ms
16.08 s
Progress: 0 of 1 built, 256 of 675 downloaded from cache (15 downloading)
16.08 s
Downloading cached cargo-package-num-derive from https://cache.nix-ci.com
16.10 s
Downloaded cached cargo-package-miniz_oxide (282 KiB) in 179ms
16.11 s
Progress: 0 of 1 built, 257 of 675 downloaded from cache (15 downloading)
16.11 s
Downloading cached cargo-package-num-integer from https://cache.nix-ci.com
16.13 s
Downloaded cached cargo-package-ndarray (1.1 MiB) in 182ms
16.13 s
Progress: 0 of 1 built, 258 of 675 downloaded from cache (15 downloading)
16.14 s
Downloading cached cargo-package-num-iter from https://cache.nix-ci.com
16.14 s
Downloaded cached cargo-package-nix (1.5 MiB) in 153ms
16.14 s
Progress: 0 of 1 built, 259 of 675 downloaded from cache (15 downloading)
16.14 s
Downloaded cached cargo-package-nalgebra (2.1 MiB) in 207ms
16.15 s
Downloading cached cargo-package-num-rational from https://cache.nix-ci.com
16.15 s
Progress: 0 of 1 built, 260 of 675 downloaded from cache (15 downloading)
16.15 s
Downloading cached cargo-package-num-traits from https://cache.nix-ci.com
16.16 s
Downloaded cached cargo-package-nix (1.7 MiB) in 171ms
16.16 s
Progress: 0 of 1 built, 261 of 675 downloaded from cache (15 downloading)
16.17 s
Downloading cached cargo-package-num_threads from https://cache.nix-ci.com
16.17 s
Downloaded cached cargo-package-nom (655 KiB) in 160ms
16.17 s
Progress: 0 of 1 built, 262 of 675 downloaded from cache (15 downloading)
16.17 s
Downloading cached cargo-package-numpy from https://cache.nix-ci.com
16.18 s
Downloaded cached cargo-package-malachite-nz (17.9 MiB) in 329ms
16.18 s
Progress: 0 of 1 built, 263 of 675 downloaded from cache (15 downloading)
16.18 s
Downloading cached cargo-package-objc2 from https://cache.nix-ci.com
16.23 s
Downloaded cached cargo-package-notify (161 KiB) in 217ms
16.23 s
Progress: 0 of 1 built, 264 of 675 downloaded from cache (15 downloading)
16.24 s
Downloading cached cargo-package-objc2-encode from https://cache.nix-ci.com
16.24 s
Downloaded cached cargo-package-notify-types (97 KiB) in 200ms
16.24 s
Progress: 0 of 1 built, 265 of 675 downloaded from cache (15 downloading)
16.24 s
Downloading cached cargo-package-object from https://cache.nix-ci.com
16.25 s
Downloaded cached cargo-package-num (30 KiB) in 181ms
16.25 s
Downloaded cached cargo-package-num-conv (24 KiB) in 177ms
16.25 s
Progress: 0 of 1 built, 266 of 675 downloaded from cache (15 downloading)
16.25 s
Downloading cached cargo-package-once_cell from https://cache.nix-ci.com
16.25 s
Progress: 0 of 1 built, 267 of 675 downloaded from cache (15 downloading)
16.26 s
Downloaded cached cargo-package-num-complex (142 KiB) in 180ms
16.26 s
Downloading cached cargo-package-once_cell_polyfill from https://cache.nix-ci.com
16.26 s
Progress: 0 of 1 built, 268 of 675 downloaded from cache (15 downloading)
16.26 s
Downloaded cached cargo-package-num-iter (40 KiB) in 122ms
16.26 s
Downloaded cached cargo-package-num-derive (66 KiB) in 179ms
16.26 s
Downloading cached cargo-package-oorandom from https://cache.nix-ci.com
16.26 s
Downloaded cached cargo-package-num-integer (111 KiB) in 151ms
16.26 s
Downloaded cached cargo-package-num-rational (131 KiB) in 113ms
16.26 s
Progress: 0 of 1 built, 269 of 675 downloaded from cache (15 downloading)
16.26 s
Progress: 0 of 1 built, 270 of 675 downloaded from cache (14 downloading)
16.26 s
Progress: 0 of 1 built, 271 of 675 downloaded from cache (13 downloading)
16.26 s
Downloaded cached cargo-package-num-bigint (494 KiB) in 186ms
16.26 s
Downloaded cached cargo-package-nu-ansi-term (129 KiB) in 192ms
16.26 s
Downloading cached cargo-package-option-ext from https://cache.nix-ci.com
16.26 s
Downloading cached cargo-package-ordered-float from https://cache.nix-ci.com
16.26 s
Downloading cached cargo-package-owo-colors from https://cache.nix-ci.com
16.26 s
Progress: 0 of 1 built, 272 of 675 downloaded from cache (15 downloading)
16.26 s
Progress: 0 of 1 built, 273 of 675 downloaded from cache (14 downloading)
16.26 s
Progress: 0 of 1 built, 274 of 675 downloaded from cache (13 downloading)
16.26 s
Downloading cached cargo-package-papergrid from https://cache.nix-ci.com
16.26 s
Downloading cached cargo-package-parking_lot from https://cache.nix-ci.com
16.26 s
Downloaded cached cargo-package-ntapi (703 KiB) in 210ms
16.26 s
Downloading cached cargo-package-parking_lot_core from https://cache.nix-ci.com
16.26 s
Progress: 0 of 1 built, 275 of 675 downloaded from cache (15 downloading)
16.26 s
Downloading cached cargo-package-paste from https://cache.nix-ci.com
16.27 s
Downloaded cached cargo-package-num-traits (273 KiB) in 119ms
16.27 s
Progress: 0 of 1 built, 276 of 675 downloaded from cache (15 downloading)
16.27 s
Downloaded cached cargo-package-numpy (385 KiB) in 95ms
16.27 s
Downloading cached cargo-package-pathdiff from https://cache.nix-ci.com
16.27 s
Progress: 0 of 1 built, 277 of 675 downloaded from cache (15 downloading)
16.27 s
Downloading cached cargo-package-pathfinding from https://cache.nix-ci.com
16.36 s
Downloaded cached cargo-package-objc2 (1.1 MiB) in 186ms
16.36 s
Progress: 0 of 1 built, 278 of 675 downloaded from cache (15 downloading)
16.37 s
Downloaded cached cargo-package-num_threads (21 KiB) in 199ms
16.37 s
Downloading cached cargo-package-percent-encoding from https://cache.nix-ci.com
16.37 s
Progress: 0 of 1 built, 279 of 675 downloaded from cache (15 downloading)
16.37 s
Downloading cached cargo-package-pest from https://cache.nix-ci.com
16.39 s
Downloaded cached cargo-package-objc2-encode (94 KiB) in 152ms
16.39 s
Progress: 0 of 1 built, 280 of 675 downloaded from cache (15 downloading)
16.39 s
Downloading cached cargo-package-pest_derive from https://cache.nix-ci.com
16.40 s
Downloaded cached cargo-package-once_cell_polyfill (23 KiB) in 139ms
16.40 s
Progress: 0 of 1 built, 281 of 675 downloaded from cache (15 downloading)
16.40 s
Downloading cached cargo-package-pest_generator from https://cache.nix-ci.com
16.40 s
Downloaded cached cargo-package-option-ext (24 KiB) in 138ms
16.40 s
Downloaded cached cargo-package-oorandom (122 KiB) in 140ms
16.40 s
Progress: 0 of 1 built, 282 of 675 downloaded from cache (15 downloading)
16.40 s
Downloaded cached cargo-package-papergrid (489 KiB) in 137ms
16.40 s
Downloading cached cargo-package-pest_meta from https://cache.nix-ci.com
16.40 s
Downloaded cached cargo-package-parking_lot (216 KiB) in 137ms
16.40 s
Downloaded cached cargo-package-object (1.9 MiB) in 159ms
16.40 s
Downloaded cached cargo-package-once_cell (154 KiB) in 144ms
16.40 s
Downloaded cached cargo-package-paste (78 KiB) in 137ms
16.40 s
Downloaded cached cargo-package-parking_lot_core (146 KiB) in 138ms
16.40 s
Downloaded cached cargo-package-owo-colors (162 KiB) in 140ms
16.40 s
Downloaded cached cargo-package-pathdiff (25 KiB) in 131ms
16.40 s
Downloaded cached cargo-package-ordered-float (131 KiB) in 140ms
16.40 s
Progress: 0 of 1 built, 283 of 675 downloaded from cache (15 downloading)
16.40 s
Progress: 0 of 1 built, 284 of 675 downloaded from cache (14 downloading)
16.40 s
Progress: 0 of 1 built, 285 of 675 downloaded from cache (13 downloading)
16.40 s
Progress: 0 of 1 built, 286 of 675 downloaded from cache (12 downloading)
16.40 s
Progress: 0 of 1 built, 287 of 675 downloaded from cache (11 downloading)
16.40 s
Progress: 0 of 1 built, 288 of 675 downloaded from cache (10 downloading)
16.40 s
Progress: 0 of 1 built, 289 of 675 downloaded from cache (9 downloading)
16.40 s
Progress: 0 of 1 built, 290 of 675 downloaded from cache (8 downloading)
16.40 s
Downloading cached cargo-package-phf from https://cache.nix-ci.com
16.40 s
Downloading cached cargo-package-phf from https://cache.nix-ci.com
16.40 s
Downloading cached cargo-package-phf_codegen from https://cache.nix-ci.com
16.40 s
Downloading cached cargo-package-phf_generator from https://cache.nix-ci.com
16.40 s
Downloading cached cargo-package-phf_generator from https://cache.nix-ci.com
16.40 s
Downloading cached cargo-package-phf_macros from https://cache.nix-ci.com
16.40 s
Downloading cached cargo-package-phf_shared from https://cache.nix-ci.com
16.40 s
Progress: 0 of 1 built, 291 of 675 downloaded from cache (15 downloading)
16.40 s
Progress: 0 of 1 built, 292 of 675 downloaded from cache (14 downloading)
16.40 s
Downloading cached cargo-package-phf_macros from https://cache.nix-ci.com
16.40 s
Downloading cached cargo-package-phf_shared from https://cache.nix-ci.com
16.40 s
Downloading cached cargo-package-pin-project-lite from https://cache.nix-ci.com
16.41 s
Downloaded cached cargo-package-pathfinding (730 KiB) in 140ms
16.41 s
Progress: 0 of 1 built, 293 of 675 downloaded from cache (15 downloading)
16.41 s
Downloading cached cargo-package-plotters from https://cache.nix-ci.com
16.41 s
Downloaded cached cargo-package-plotters in 0ms
16.41 s
Progress: 0 of 1 built, 294 of 675 downloaded from cache (15 downloading)
16.41 s
Downloading cached cargo-package-plotters-backend from https://cache.nix-ci.com
16.43 s
Downloaded cached cargo-package-percent-encoding (36 KiB) in 66ms
16.43 s
Progress: 0 of 1 built, 295 of 675 downloaded from cache (15 downloading)
16.43 s
Downloading cached cargo-package-plotters-svg from https://cache.nix-ci.com
16.44 s
Downloaded cached cargo-package-pest (1.4 MiB) in 70ms
16.44 s
Progress: 0 of 1 built, 296 of 675 downloaded from cache (15 downloading)
16.44 s
Downloading cached cargo-package-portable-atomic from https://cache.nix-ci.com
16.46 s
Downloaded cached cargo-package-pest_derive (176 KiB) in 71ms
16.46 s
Progress: 0 of 1 built, 297 of 675 downloaded from cache (15 downloading)
16.46 s
Downloading cached cargo-package-portable-atomic-util from https://cache.nix-ci.com
16.48 s
Downloaded cached cargo-package-pest_meta (375 KiB) in 80ms
16.48 s
Progress: 0 of 1 built, 298 of 675 downloaded from cache (15 downloading)
16.48 s
Downloading cached cargo-package-powerfmt from https://cache.nix-ci.com
16.48 s
Downloaded cached cargo-package-pest_generator (179 KiB) in 82ms
16.48 s
Progress: 0 of 1 built, 299 of 675 downloaded from cache (15 downloading)
16.48 s
Downloading cached cargo-package-ppv-lite86 from https://cache.nix-ci.com
16.49 s
Downloaded cached cargo-package-phf_generator (50 KiB) in 82ms
16.49 s
Progress: 0 of 1 built, 300 of 675 downloaded from cache (15 downloading)
16.49 s
Downloaded cached cargo-package-phf_codegen (46 KiB) in 85ms
16.49 s
Downloading cached cargo-package-prettyplease from https://cache.nix-ci.com
16.49 s
Progress: 0 of 1 built, 301 of 675 downloaded from cache (15 downloading)
16.49 s
Downloading cached cargo-package-proc-macro-error from https://cache.nix-ci.com
16.49 s
Downloaded cached cargo-package-phf_shared (47 KiB) in 86ms
16.49 s
Downloaded cached cargo-package-phf_shared (51 KiB) in 85ms
16.49 s
Progress: 0 of 1 built, 302 of 675 downloaded from cache (15 downloading)
16.49 s
Progress: 0 of 1 built, 303 of 675 downloaded from cache (14 downloading)
16.49 s
Downloaded cached cargo-package-phf (92 KiB) in 86ms
16.49 s
Downloading cached cargo-package-proc-macro-error-attr from https://cache.nix-ci.com
16.49 s
Downloading cached cargo-package-proc-macro-error-attr2 from https://cache.nix-ci.com
16.49 s
Progress: 0 of 1 built, 304 of 675 downloaded from cache (15 downloading)
16.49 s
Downloading cached cargo-package-proc-macro-error2 from https://cache.nix-ci.com
16.49 s
Downloaded cached cargo-package-phf_generator (51 KiB) in 88ms
16.49 s
Progress: 0 of 1 built, 305 of 675 downloaded from cache (15 downloading)
16.49 s
Downloaded cached cargo-package-phf_macros (74 KiB) in 88ms
16.49 s
Downloaded cached cargo-package-phf_macros (59 KiB) in 89ms
16.49 s
Downloading cached cargo-package-proc-macro2 from https://cache.nix-ci.com
16.49 s
Progress: 0 of 1 built, 306 of 675 downloaded from cache (15 downloading)
16.49 s
Progress: 0 of 1 built, 307 of 675 downloaded from cache (14 downloading)
16.49 s
Downloading cached cargo-package-proc-macro2-diagnostics from https://cache.nix-ci.com
16.49 s
Downloading cached cargo-package-proptest from https://cache.nix-ci.com
16.50 s
Downloaded cached cargo-package-plotters-backend (55 KiB) in 85ms
16.50 s
Progress: 0 of 1 built, 308 of 675 downloaded from cache (15 downloading)
16.50 s
Downloaded cached cargo-package-pin-project-lite (251 KiB) in 94ms
16.50 s
Downloading cached cargo-package-ptr_meta from https://cache.nix-ci.com
16.50 s
Progress: 0 of 1 built, 309 of 675 downloaded from cache (15 downloading)
16.50 s
Downloading cached cargo-package-ptr_meta_derive from https://cache.nix-ci.com
16.53 s
Downloaded cached cargo-package-plotters-svg (28 KiB) in 93ms
16.53 s
Progress: 0 of 1 built, 310 of 675 downloaded from cache (15 downloading)
16.53 s
Downloading cached cargo-package-pyo3 from https://cache.nix-ci.com
16.53 s
Downloaded cached cargo-package-portable-atomic (1.2 MiB) in 92ms
16.53 s
Progress: 0 of 1 built, 311 of 675 downloaded from cache (15 downloading)
16.53 s
Downloaded cached cargo-package-portable-atomic-util (212 KiB) in 68ms
16.53 s
Downloading cached cargo-package-pyo3-build-config from https://cache.nix-ci.com
16.53 s
Progress: 0 of 1 built, 312 of 675 downloaded from cache (15 downloading)
16.54 s
Downloading cached cargo-package-pyo3-ffi from https://cache.nix-ci.com
16.56 s
Downloaded cached cargo-package-powerfmt (58 KiB) in 77ms
16.56 s
Progress: 0 of 1 built, 313 of 675 downloaded from cache (15 downloading)
16.56 s
Downloading cached cargo-package-pyo3-macros from https://cache.nix-ci.com
16.57 s
Downloaded cached cargo-package-ppv-lite86 (132 KiB) in 82ms
16.57 s
Progress: 0 of 1 built, 314 of 675 downloaded from cache (15 downloading)
16.57 s
Downloading cached cargo-package-pyo3-macros-backend from https://cache.nix-ci.com
16.57 s
Downloaded cached cargo-package-prettyplease (416 KiB) in 79ms
16.57 s
Progress: 0 of 1 built, 315 of 675 downloaded from cache (15 downloading)
16.57 s
Downloading cached cargo-package-pyo3-stub-gen from https://cache.nix-ci.com
16.58 s
Downloaded cached cargo-package-proc-macro-error-attr (23 KiB) in 94ms
16.58 s
Progress: 0 of 1 built, 316 of 675 downloaded from cache (15 downloading)
16.58 s
Downloading cached cargo-package-pyo3-stub-gen-derive from https://cache.nix-ci.com
16.59 s
Downloaded cached cargo-package-proc-macro2 (271 KiB) in 95ms
16.59 s
Progress: 0 of 1 built, 317 of 675 downloaded from cache (15 downloading)
16.59 s
Downloading cached cargo-package-quick-error from https://cache.nix-ci.com
16.59 s
Downloaded cached cargo-package-proc-macro-error-attr2 (23 KiB) in 99ms
16.59 s
Progress: 0 of 1 built, 318 of 675 downloaded from cache (15 downloading)
16.59 s
Downloading cached cargo-package-quote from https://cache.nix-ci.com
16.59 s
Downloaded cached cargo-package-proc-macro-error (95 KiB) in 104ms
16.59 s
Progress: 0 of 1 built, 319 of 675 downloaded from cache (15 downloading)
16.59 s
Downloaded cached cargo-package-proc-macro2-diagnostics (46 KiB) in 100ms
16.59 s
Downloading cached cargo-package-r-efi from https://cache.nix-ci.com
16.59 s
Progress: 0 of 1 built, 320 of 675 downloaded from cache (15 downloading)
16.59 s
Downloading cached cargo-package-r-efi from https://cache.nix-ci.com
16.60 s
Downloaded cached cargo-package-ptr_meta_derive (6920 B) in 99ms
16.60 s
Progress: 0 of 1 built, 321 of 675 downloaded from cache (15 downloading)
16.60 s
Downloading cached cargo-package-radium from https://cache.nix-ci.com
16.61 s
Downloaded cached cargo-package-phf (87 KiB) in 204ms
16.61 s
Downloaded cached cargo-package-proptest (914 KiB) in 113ms
16.61 s
Progress: 0 of 1 built, 322 of 675 downloaded from cache (15 downloading)
16.61 s
Downloading cached cargo-package-rand from https://cache.nix-ci.com
16.61 s
Progress: 0 of 1 built, 323 of 675 downloaded from cache (15 downloading)
16.61 s
Downloading cached cargo-package-rand from https://cache.nix-ci.com
16.61 s
Downloaded cached cargo-package-proc-macro-error2 (94 KiB) in 123ms
16.61 s
Progress: 0 of 1 built, 324 of 675 downloaded from cache (15 downloading)
16.62 s
Downloading cached cargo-package-rand_chacha from https://cache.nix-ci.com
16.62 s
Downloaded cached cargo-package-ptr_meta (19 KiB) in 125ms
16.62 s
Progress: 0 of 1 built, 325 of 675 downloaded from cache (15 downloading)
16.63 s
Downloading cached cargo-package-rand_chacha from https://cache.nix-ci.com
16.64 s
Downloaded cached cargo-package-pyo3-build-config (160 KiB) in 106ms
16.64 s
Progress: 0 of 1 built, 326 of 675 downloaded from cache (15 downloading)
16.64 s
Downloading cached cargo-package-rand_core from https://cache.nix-ci.com
16.71 s
Downloaded cached cargo-package-pyo3-macros (28 KiB) in 156ms
16.72 s
Progress: 0 of 1 built, 327 of 675 downloaded from cache (15 downloading)
16.72 s
Downloaded cached cargo-package-pyo3-stub-gen (190 KiB) in 146ms
16.72 s
Downloading cached cargo-package-rand_core from https://cache.nix-ci.com
16.72 s
Progress: 0 of 1 built, 328 of 675 downloaded from cache (15 downloading)
16.72 s
Downloading cached cargo-package-rand_distr from https://cache.nix-ci.com
16.72 s
Downloaded cached cargo-package-rand_chacha (53 KiB) in 102ms
16.72 s
Progress: 0 of 1 built, 329 of 675 downloaded from cache (15 downloading)
16.72 s
Downloaded cached cargo-package-r-efi (296 KiB) in 123ms
16.72 s
Downloaded cached cargo-package-pyo3-ffi (423 KiB) in 183ms
16.72 s
Downloaded cached cargo-package-quick-error (64 KiB) in 129ms
16.72 s
Downloading cached cargo-package-rand_xorshift from https://cache.nix-ci.com
16.72 s
Downloaded cached cargo-package-quote (142 KiB) in 128ms
16.72 s
Progress: 0 of 1 built, 330 of 675 downloaded from cache (15 downloading)
16.72 s
Progress: 0 of 1 built, 331 of 675 downloaded from cache (14 downloading)
16.72 s
Progress: 0 of 1 built, 332 of 675 downloaded from cache (13 downloading)
16.72 s
Progress: 0 of 1 built, 333 of 675 downloaded from cache (12 downloading)
16.72 s
Downloaded cached cargo-package-pyo3-macros-backend (451 KiB) in 153ms
16.72 s
Downloading cached cargo-package-ratatui-core from https://cache.nix-ci.com
16.72 s
Downloading cached cargo-package-ratatui from https://cache.nix-ci.com
16.72 s
Downloading cached cargo-package-ratatui-crossterm from https://cache.nix-ci.com
16.72 s
Downloading cached cargo-package-rand_xoshiro from https://cache.nix-ci.com
16.72 s
Progress: 0 of 1 built, 334 of 675 downloaded from cache (15 downloading)
16.72 s
Downloaded cached cargo-package-r-efi (301 KiB) in 126ms
16.72 s
Downloading cached cargo-package-ratatui-macros from https://cache.nix-ci.com
16.72 s
Progress: 0 of 1 built, 335 of 675 downloaded from cache (15 downloading)
16.72 s
Downloading cached cargo-package-ratatui-termwiz from https://cache.nix-ci.com
16.72 s
Downloaded cached cargo-package-pyo3-stub-gen-derive (275 KiB) in 139ms
16.72 s
Progress: 0 of 1 built, 336 of 675 downloaded from cache (15 downloading)
16.73 s
Downloading cached cargo-package-ratatui-widgets from https://cache.nix-ci.com
16.73 s
Downloaded cached cargo-package-radium (51 KiB) in 126ms
16.73 s
Progress: 0 of 1 built, 337 of 675 downloaded from cache (15 downloading)
16.73 s
Downloading cached cargo-package-rawpointer from https://cache.nix-ci.com
16.73 s
Downloaded cached cargo-package-rand (331 KiB) in 124ms
16.73 s
Progress: 0 of 1 built, 338 of 675 downloaded from cache (15 downloading)
16.73 s
Downloaded cached cargo-package-rand (409 KiB) in 123ms
16.73 s
Downloading cached cargo-package-rayon from https://cache.nix-ci.com
16.73 s
Progress: 0 of 1 built, 339 of 675 downloaded from cache (15 downloading)
16.73 s
Downloading cached cargo-package-rayon-core from https://cache.nix-ci.com
16.75 s
Downloaded cached cargo-package-rand_chacha (63 KiB) in 122ms
16.75 s
Progress: 0 of 1 built, 340 of 675 downloaded from cache (15 downloading)
16.75 s
Downloaded cached cargo-package-rand_core (79 KiB) in 106ms
16.75 s
Downloading cached cargo-package-redox_syscall from https://cache.nix-ci.com
16.75 s
Progress: 0 of 1 built, 341 of 675 downloaded from cache (15 downloading)
16.75 s
Downloading cached cargo-package-redox_users from https://cache.nix-ci.com
16.76 s
Downloaded cached cargo-package-pyo3 (3.8 MiB) in 226ms
16.76 s
Progress: 0 of 1 built, 342 of 675 downloaded from cache (15 downloading)
16.76 s
Downloading cached cargo-package-reedline from https://cache.nix-ci.com
16.80 s
Downloaded cached cargo-package-rand_core (84 KiB) in 79ms
16.80 s
Progress: 0 of 1 built, 343 of 675 downloaded from cache (15 downloading)
16.80 s
Downloading cached cargo-package-ref-cast from https://cache.nix-ci.com
16.81 s
Downloaded cached cargo-package-ratatui-crossterm (70 KiB) in 90ms
16.81 s
Progress: 0 of 1 built, 344 of 675 downloaded from cache (15 downloading)
16.81 s
Downloading cached cargo-package-ref-cast-impl from https://cache.nix-ci.com
16.81 s
Downloaded cached cargo-package-ratatui-macros (71 KiB) in 92ms
16.81 s
Progress: 0 of 1 built, 345 of 675 downloaded from cache (15 downloading)
16.81 s
Downloading cached cargo-package-ref-ops from https://cache.nix-ci.com
16.82 s
Downloaded cached cargo-package-ratatui (347 KiB) in 99ms
16.82 s
Progress: 0 of 1 built, 346 of 675 downloaded from cache (15 downloading)
16.82 s
Downloaded cached cargo-package-rand_distr (226 KiB) in 102ms
16.82 s
Downloaded cached cargo-package-rand_xorshift (30 KiB) in 101ms
16.82 s
Downloading cached cargo-package-regex from https://cache.nix-ci.com
16.82 s
Progress: 0 of 1 built, 347 of 675 downloaded from cache (15 downloading)
16.82 s
Progress: 0 of 1 built, 348 of 675 downloaded from cache (14 downloading)
16.82 s
Downloading cached cargo-package-regex-automata from https://cache.nix-ci.com
16.82 s
Downloading cached cargo-package-regex-syntax from https://cache.nix-ci.com
16.83 s
Downloaded cached cargo-package-ratatui-core (863 KiB) in 110ms
16.83 s
Progress: 0 of 1 built, 349 of 675 downloaded from cache (15 downloading)
16.83 s
Downloading cached cargo-package-region from https://cache.nix-ci.com
16.84 s
Downloaded cached cargo-package-ratatui-termwiz (70 KiB) in 115ms
16.84 s
Progress: 0 of 1 built, 350 of 675 downloaded from cache (15 downloading)
16.84 s
Downloading cached cargo-package-rend from https://cache.nix-ci.com
16.85 s
Downloaded cached cargo-package-rand_xoshiro (97 KiB) in 128ms
16.85 s
Progress: 0 of 1 built, 351 of 675 downloaded from cache (15 downloading)
16.85 s
Downloading cached cargo-package-ringbuffer from https://cache.nix-ci.com
16.85 s
Downloaded cached cargo-package-rawpointer (22 KiB) in 121ms
16.85 s
Progress: 0 of 1 built, 352 of 675 downloaded from cache (15 downloading)
16.85 s
Downloading cached cargo-package-rkyv from https://cache.nix-ci.com
16.87 s
Downloaded cached cargo-package-rayon-core (289 KiB) in 131ms
16.87 s
Progress: 0 of 1 built, 353 of 675 downloaded from cache (15 downloading)
16.87 s
Downloading cached cargo-package-rkyv_derive from https://cache.nix-ci.com
16.87 s
Downloaded cached cargo-package-redox_syscall (159 KiB) in 122ms
16.87 s
Progress: 0 of 1 built, 354 of 675 downloaded from cache (15 downloading)
16.87 s
Downloading cached cargo-package-ron from https://cache.nix-ci.com
16.87 s
Downloaded cached cargo-package-redox_users (65 KiB) in 121ms
16.87 s
Progress: 0 of 1 built, 355 of 675 downloaded from cache (15 downloading)
16.87 s
Downloading cached cargo-package-ron from https://cache.nix-ci.com
16.87 s
Downloaded cached cargo-package-rayon (920 KiB) in 140ms
16.87 s
Progress: 0 of 1 built, 356 of 675 downloaded from cache (15 downloading)
16.87 s
Downloading cached cargo-package-rug from https://cache.nix-ci.com
16.88 s
Downloaded cached cargo-package-ratatui-widgets (1.1 MiB) in 150ms
16.88 s
Progress: 0 of 1 built, 357 of 675 downloaded from cache (15 downloading)
16.88 s
Downloading cached cargo-package-rust-embed from https://cache.nix-ci.com
16.90 s
Downloaded cached cargo-package-reedline (778 KiB) in 146ms
16.90 s
Progress: 0 of 1 built, 358 of 675 downloaded from cache (15 downloading)
16.91 s
Downloading cached cargo-package-rust-embed-impl from https://cache.nix-ci.com
16.93 s
Downloaded cached cargo-package-ref-cast (57 KiB) in 130ms
16.93 s
Progress: 0 of 1 built, 359 of 675 downloaded from cache (15 downloading)
16.93 s
Downloading cached cargo-package-rust-embed-utils from https://cache.nix-ci.com
16.95 s
Downloaded cached cargo-package-ref-cast-impl (33 KiB) in 133ms
16.95 s
Progress: 0 of 1 built, 360 of 675 downloaded from cache (15 downloading)
16.95 s
Downloading cached cargo-package-rust_lisp from https://cache.nix-ci.com
16.95 s
Downloaded cached cargo-package-ref-ops (47 KiB) in 132ms
16.95 s
Progress: 0 of 1 built, 361 of 675 downloaded from cache (15 downloading)
16.95 s
Downloading cached cargo-package-rustc-demangle from https://cache.nix-ci.com
16.96 s
Downloaded cached cargo-package-rend (51 KiB) in 119ms
16.96 s
Progress: 0 of 1 built, 362 of 675 downloaded from cache (15 downloading)
16.96 s
Downloaded cached cargo-package-regex (713 KiB) in 137ms
16.96 s
Downloading cached cargo-package-rustc-hash from https://cache.nix-ci.com
16.96 s
Progress: 0 of 1 built, 363 of 675 downloaded from cache (15 downloading)
16.96 s
Downloading cached cargo-package-rustc-hash from https://cache.nix-ci.com
16.97 s
Downloaded cached cargo-package-regex-syntax (1.6 MiB) in 145ms
16.97 s
Progress: 0 of 1 built, 364 of 675 downloaded from cache (15 downloading)
16.97 s
Downloading cached cargo-package-rustc_version from https://cache.nix-ci.com
16.98 s
Downloaded cached cargo-package-ringbuffer (184 KiB) in 125ms
16.98 s
Progress: 0 of 1 built, 365 of 675 downloaded from cache (15 downloading)
16.98 s
Downloading cached cargo-package-rustix from https://cache.nix-ci.com
16.98 s
Downloaded cached cargo-package-rkyv_derive (128 KiB) in 111ms
16.98 s
Progress: 0 of 1 built, 366 of 675 downloaded from cache (15 downloading)
16.98 s
Downloading cached cargo-package-rustix from https://cache.nix-ci.com
16.98 s
Downloaded cached cargo-package-region (92 KiB) in 146ms
16.98 s
Progress: 0 of 1 built, 367 of 675 downloaded from cache (15 downloading)
16.98 s
Downloading cached cargo-package-rustpython-ast from https://cache.nix-ci.com
16.98 s
Downloaded cached cargo-package-regex-automata (2.6 MiB) in 158ms
16.98 s
Progress: 0 of 1 built, 368 of 675 downloaded from cache (15 downloading)
16.98 s
Downloading cached cargo-package-rustpython-parser from https://cache.nix-ci.com
16.98 s
Downloaded cached cargo-package-rkyv (667 KiB) in 131ms
16.98 s
Progress: 0 of 1 built, 369 of 675 downloaded from cache (15 downloading)
16.98 s
Downloading cached cargo-package-rustpython-parser-core from https://cache.nix-ci.com
16.99 s
Downloaded cached cargo-package-ron (719 KiB) in 119ms
16.99 s
Progress: 0 of 1 built, 370 of 675 downloaded from cache (15 downloading)
16.99 s
Downloading cached cargo-package-rustpython-parser-vendored from https://cache.nix-ci.com
17.17 s
Downloaded cached cargo-package-ron (320 KiB) in 295ms
17.17 s
Progress: 0 of 1 built, 371 of 675 downloaded from cache (15 downloading)
17.17 s
Downloading cached cargo-package-rustversion from https://cache.nix-ci.com
17.21 s
Downloaded cached cargo-package-rustpython-parser-core (17 KiB) in 224ms
17.21 s
Progress: 0 of 1 built, 372 of 675 downloaded from cache (15 downloading)
17.21 s
Downloading cached cargo-package-rusty-fork from https://cache.nix-ci.com
17.22 s
Downloaded cached cargo-package-rustpython-parser (3.1 MiB) in 233ms
17.22 s
Progress: 0 of 1 built, 373 of 675 downloaded from cache (15 downloading)
17.22 s
Downloading cached cargo-package-ryu from https://cache.nix-ci.com
17.25 s
Downloaded cached cargo-package-rustpython-parser-vendored (72 KiB) in 253ms
17.25 s
Progress: 0 of 1 built, 374 of 675 downloaded from cache (15 downloading)
17.25 s
Downloading cached cargo-package-safe_arch from https://cache.nix-ci.com
17.29 s
Downloaded cached cargo-package-rug (2.3 MiB) in 415ms
17.29 s
Progress: 0 of 1 built, 375 of 675 downloaded from cache (15 downloading)
17.29 s
Downloading cached cargo-package-safe_arch from https://cache.nix-ci.com
17.33 s
Downloaded cached cargo-package-rust-embed-utils (17 KiB) in 400ms
17.33 s
Downloaded cached cargo-package-rust-embed-impl (30 KiB) in 424ms
17.33 s
Progress: 0 of 1 built, 376 of 675 downloaded from cache (15 downloading)
17.33 s
Downloading cached cargo-package-safe_arch from https://cache.nix-ci.com
17.33 s
Progress: 0 of 1 built, 377 of 675 downloaded from cache (15 downloading)
17.33 s
Downloading cached cargo-package-same-file from https://cache.nix-ci.com
17.33 s
Downloaded cached cargo-package-rustc-hash (25 KiB) in 372ms
17.33 s
Downloaded cached cargo-package-rustc-hash (46 KiB) in 370ms
17.33 s
Progress: 0 of 1 built, 378 of 675 downloaded from cache (15 downloading)
17.33 s
Downloaded cached cargo-package-rust_lisp (101 KiB) in 384ms
17.33 s
Downloading cached cargo-package-scc from https://cache.nix-ci.com
17.33 s
Progress: 0 of 1 built, 379 of 675 downloaded from cache (15 downloading)
17.33 s
Progress: 0 of 1 built, 380 of 675 downloaded from cache (14 downloading)
17.33 s
Downloaded cached cargo-package-rustc-demangle (156 KiB) in 384ms
17.33 s
Downloading cached cargo-package-schemars from https://cache.nix-ci.com
17.33 s
Downloading cached cargo-package-schemars_derive from https://cache.nix-ci.com
17.33 s
Progress: 0 of 1 built, 381 of 675 downloaded from cache (15 downloading)
17.33 s
Downloading cached cargo-package-scopeguard from https://cache.nix-ci.com
17.34 s
Downloaded cached cargo-package-rustc_version (46 KiB) in 367ms
17.34 s
Progress: 0 of 1 built, 382 of 675 downloaded from cache (15 downloading)
17.34 s
Downloading cached cargo-package-sdd from https://cache.nix-ci.com
17.34 s
Downloaded cached cargo-package-rust-embed (1014 KiB) in 465ms
17.34 s
Progress: 0 of 1 built, 383 of 675 downloaded from cache (15 downloading)
17.34 s
Downloading cached cargo-package-seahash from https://cache.nix-ci.com
17.37 s
Downloaded cached cargo-package-rusty-fork (70 KiB) in 162ms
17.37 s
Progress: 0 of 1 built, 384 of 675 downloaded from cache (15 downloading)
17.37 s
Downloaded cached cargo-package-rustversion (81 KiB) in 203ms
17.37 s
Downloading cached cargo-package-self_cell from https://cache.nix-ci.com
17.37 s
Downloaded cached cargo-package-rustpython-ast (405 KiB) in 392ms
17.37 s
Progress: 0 of 1 built, 385 of 675 downloaded from cache (15 downloading)
17.37 s
Progress: 0 of 1 built, 386 of 675 downloaded from cache (14 downloading)
17.37 s
Downloaded cached cargo-package-rustix (2.1 MiB) in 396ms
17.37 s
Downloading cached cargo-package-semver from https://cache.nix-ci.com
17.37 s
Downloading cached cargo-package-serde from https://cache.nix-ci.com
17.37 s
Progress: 0 of 1 built, 387 of 675 downloaded from cache (15 downloading)
17.37 s
Downloading cached cargo-package-serde-big-array from https://cache.nix-ci.com
17.37 s
Downloaded cached cargo-package-ryu (187 KiB) in 158ms
17.37 s
Progress: 0 of 1 built, 388 of 675 downloaded from cache (15 downloading)
17.38 s
Downloading cached cargo-package-serde_core from https://cache.nix-ci.com
17.38 s
Downloaded cached cargo-package-safe_arch (555 KiB) in 132ms
17.38 s
Progress: 0 of 1 built, 389 of 675 downloaded from cache (15 downloading)
17.38 s
Downloading cached cargo-package-serde_derive from https://cache.nix-ci.com
17.38 s
Downloaded cached cargo-package-safe_arch (713 KiB) in 91ms
17.38 s
Progress: 0 of 1 built, 390 of 675 downloaded from cache (15 downloading)
17.38 s
Downloading cached cargo-package-serde_derive_internals from https://cache.nix-ci.com
17.40 s
Downloaded cached cargo-package-rustix (2.3 MiB) in 416ms
17.40 s
Progress: 0 of 1 built, 391 of 675 downloaded from cache (15 downloading)
17.40 s
Downloading cached cargo-package-serde_json from https://cache.nix-ci.com
17.40 s
Downloaded cached cargo-package-same-file (37 KiB) in 73ms
17.40 s
Progress: 0 of 1 built, 392 of 675 downloaded from cache (15 downloading)
17.40 s
Downloading cached cargo-package-serde_repr from https://cache.nix-ci.com
17.41 s
Downloaded cached cargo-package-safe_arch (714 KiB) in 79ms
17.41 s
Progress: 0 of 1 built, 393 of 675 downloaded from cache (15 downloading)
17.41 s
Downloading cached cargo-package-serde_spanned from https://cache.nix-ci.com
17.41 s
Downloaded cached cargo-package-schemars_derive (140 KiB) in 77ms
17.41 s
Progress: 0 of 1 built, 394 of 675 downloaded from cache (15 downloading)
17.41 s
Downloaded cached cargo-package-scopeguard (37 KiB) in 77ms
17.41 s
Downloading cached cargo-package-serde_spanned from https://cache.nix-ci.com
17.41 s
Progress: 0 of 1 built, 395 of 675 downloaded from cache (15 downloading)
17.41 s
Downloading cached cargo-package-serde_yaml from https://cache.nix-ci.com
17.41 s
Downloaded cached cargo-package-scc (933 KiB) in 81ms
17.41 s
Progress: 0 of 1 built, 396 of 675 downloaded from cache (15 downloading)
17.41 s
Downloading cached cargo-package-serial_test from https://cache.nix-ci.com
17.42 s
Downloaded cached cargo-package-sdd (158 KiB) in 76ms
17.42 s
Progress: 0 of 1 built, 397 of 675 downloaded from cache (15 downloading)
17.42 s
Downloading cached cargo-package-serial_test_derive from https://cache.nix-ci.com
17.42 s
Downloaded cached cargo-package-schemars (586 KiB) in 88ms
17.42 s
Progress: 0 of 1 built, 398 of 675 downloaded from cache (15 downloading)
17.42 s
Downloading cached cargo-package-sha2 from https://cache.nix-ci.com
17.43 s
Downloaded cached cargo-package-seahash (69 KiB) in 84ms
17.43 s
Progress: 0 of 1 built, 399 of 675 downloaded from cache (15 downloading)
17.43 s
Downloading cached cargo-package-sharded-slab from https://cache.nix-ci.com
17.47 s
Downloaded cached cargo-package-serde_derive (333 KiB) in 94ms
17.47 s
Progress: 0 of 1 built, 400 of 675 downloaded from cache (15 downloading)
17.48 s
Downloading cached cargo-package-shellexpand from https://cache.nix-ci.com
17.49 s
Downloaded cached cargo-package-serde-big-array (25 KiB) in 113ms
17.49 s
Progress: 0 of 1 built, 401 of 675 downloaded from cache (15 downloading)
17.49 s
Downloading cached cargo-package-shlex from https://cache.nix-ci.com
17.49 s
Downloaded cached cargo-package-serde_core (389 KiB) in 114ms
17.49 s
Progress: 0 of 1 built, 402 of 675 downloaded from cache (15 downloading)
17.49 s
Downloading cached cargo-package-signal-hook from https://cache.nix-ci.com
17.49 s
Downloaded cached cargo-package-serde (555 KiB) in 117ms
17.49 s
Progress: 0 of 1 built, 403 of 675 downloaded from cache (15 downloading)
17.49 s
Downloading cached cargo-package-signal-hook-mio from https://cache.nix-ci.com
17.49 s
Downloaded cached cargo-package-semver (134 KiB) in 118ms
17.49 s
Progress: 0 of 1 built, 404 of 675 downloaded from cache (15 downloading)
17.49 s
Downloading cached cargo-package-signal-hook-registry from https://cache.nix-ci.com
17.50 s
Downloaded cached cargo-package-self_cell (81 KiB) in 126ms
17.50 s
Progress: 0 of 1 built, 405 of 675 downloaded from cache (15 downloading)
17.50 s
Downloading cached cargo-package-simba from https://cache.nix-ci.com
17.51 s
Downloaded cached cargo-package-serde_derive_internals (130 KiB) in 129ms
17.51 s
Progress: 0 of 1 built, 406 of 675 downloaded from cache (15 downloading)
17.51 s
Downloading cached cargo-package-simba from https://cache.nix-ci.com
17.51 s
Downloaded cached cargo-package-serde_json (748 KiB) in 117ms
17.51 s
Progress: 0 of 1 built, 407 of 675 downloaded from cache (15 downloading)
17.51 s
Downloading cached cargo-package-simdutf8 from https://cache.nix-ci.com
17.52 s
Downloaded cached cargo-package-serde_repr (45 KiB) in 110ms
17.52 s
Progress: 0 of 1 built, 408 of 675 downloaded from cache (15 downloading)
17.52 s
Downloading cached cargo-package-similar from https://cache.nix-ci.com
17.52 s
Downloaded cached cargo-package-serde_spanned (31 KiB) in 106ms
17.52 s
Progress: 0 of 1 built, 409 of 675 downloaded from cache (15 downloading)
17.52 s
Downloading cached cargo-package-similar-asserts from https://cache.nix-ci.com
17.52 s
Downloaded cached cargo-package-serde_spanned (35 KiB) in 107ms
17.52 s
Progress: 0 of 1 built, 410 of 675 downloaded from cache (15 downloading)
17.52 s
Downloading cached cargo-package-siphasher from https://cache.nix-ci.com
17.52 s
Downloaded cached cargo-package-serde_yaml (400 KiB) in 109ms
17.52 s
Progress: 0 of 1 built, 411 of 675 downloaded from cache (15 downloading)
17.52 s
Downloaded cached cargo-package-serial_test (62 KiB) in 107ms
17.52 s
Downloading cached cargo-package-slab from https://cache.nix-ci.com
17.52 s
Progress: 0 of 1 built, 412 of 675 downloaded from cache (15 downloading)
17.52 s
Downloading cached cargo-package-slotmap from https://cache.nix-ci.com
17.53 s
Downloaded cached cargo-package-serial_test_derive (52 KiB) in 110ms
17.53 s
Progress: 0 of 1 built, 413 of 675 downloaded from cache (15 downloading)
17.53 s
Downloading cached cargo-package-smallvec from https://cache.nix-ci.com
17.54 s
Downloaded cached cargo-package-sha2 (118 KiB) in 116ms
17.54 s
Progress: 0 of 1 built, 414 of 675 downloaded from cache (15 downloading)
17.54 s
Downloading cached cargo-package-smartstring from https://cache.nix-ci.com
17.54 s
Downloaded cached cargo-package-sharded-slab (272 KiB) in 113ms
17.54 s
Progress: 0 of 1 built, 415 of 675 downloaded from cache (15 downloading)
17.54 s
Downloading cached cargo-package-spec_math from https://cache.nix-ci.com
17.57 s
Downloaded cached cargo-package-signal-hook-registry (69 KiB) in 81ms
17.57 s
Progress: 0 of 1 built, 416 of 675 downloaded from cache (15 downloading)
17.58 s
Downloading cached cargo-package-static_assertions from https://cache.nix-ci.com
17.58 s
Downloaded cached cargo-package-shellexpand (98 KiB) in 101ms
17.58 s
Progress: 0 of 1 built, 417 of 675 downloaded from cache (15 downloading)
17.58 s
Downloading cached cargo-package-statrs from https://cache.nix-ci.com
17.58 s
Downloaded cached cargo-package-shlex (60 KiB) in 93ms
17.58 s
Progress: 0 of 1 built, 418 of 675 downloaded from cache (15 downloading)
17.58 s
Downloading cached cargo-package-string-template-plus from https://cache.nix-ci.com
17.59 s
Downloaded cached cargo-package-simba (294 KiB) in 85ms
17.59 s
Progress: 0 of 1 built, 419 of 675 downloaded from cache (15 downloading)
17.59 s
Downloading cached cargo-package-strip-ansi-escapes from https://cache.nix-ci.com
17.59 s
Downloaded cached cargo-package-signal-hook (168 KiB) in 102ms
17.59 s
Progress: 0 of 1 built, 420 of 675 downloaded from cache (15 downloading)
17.59 s
Downloading cached cargo-package-strsim from https://cache.nix-ci.com
17.60 s
Downloaded cached cargo-package-signal-hook-mio (64 KiB) in 106ms
17.60 s
Progress: 0 of 1 built, 421 of 675 downloaded from cache (15 downloading)
17.60 s
Downloading cached cargo-package-strsim from https://cache.nix-ci.com
17.60 s
Downloaded cached cargo-package-simdutf8 (133 KiB) in 88ms
17.60 s
Progress: 0 of 1 built, 422 of 675 downloaded from cache (15 downloading)
17.60 s
Downloading cached cargo-package-strum from https://cache.nix-ci.com
17.60 s
Downloaded cached cargo-package-simba (334 KiB) in 91ms
17.60 s
Progress: 0 of 1 built, 423 of 675 downloaded from cache (15 downloading)
17.61 s
Downloading cached cargo-package-strum from https://cache.nix-ci.com
17.61 s
Downloaded cached cargo-package-slab (81 KiB) in 90ms
17.61 s
Progress: 0 of 1 built, 424 of 675 downloaded from cache (15 downloading)
17.61 s
Downloading cached cargo-package-strum_macros from https://cache.nix-ci.com
17.61 s
Downloaded cached cargo-package-similar-asserts (63 KiB) in 96ms
17.61 s
Progress: 0 of 1 built, 425 of 675 downloaded from cache (15 downloading)
17.61 s
Downloaded cached cargo-package-siphasher (60 KiB) in 94ms
17.61 s
Downloaded cached cargo-package-similar (256 KiB) in 98ms
17.62 s
Downloading cached cargo-package-strum_macros from https://cache.nix-ci.com
17.62 s
Progress: 0 of 1 built, 426 of 675 downloaded from cache (15 downloading)
17.62 s
Progress: 0 of 1 built, 427 of 675 downloaded from cache (14 downloading)
17.62 s
Downloaded cached cargo-package-slotmap (298 KiB) in 93ms
17.62 s
Downloading cached cargo-package-subprocess from https://cache.nix-ci.com
17.62 s
Downloading cached cargo-package-symjit from https://cache.nix-ci.com
17.62 s
Progress: 0 of 1 built, 428 of 675 downloaded from cache (15 downloading)
17.62 s
Downloading cached cargo-package-symlink from https://cache.nix-ci.com
17.62 s
Downloaded cached cargo-package-smallvec (160 KiB) in 91ms
17.62 s
Progress: 0 of 1 built, 429 of 675 downloaded from cache (15 downloading)
17.62 s
Downloading cached cargo-package-syn from https://cache.nix-ci.com
17.64 s
Downloaded cached cargo-package-smartstring (124 KiB) in 104ms
17.64 s
Progress: 0 of 1 built, 430 of 675 downloaded from cache (15 downloading)
17.64 s
Downloading cached cargo-package-syn from https://cache.nix-ci.com
17.65 s
Downloaded cached cargo-package-spec_math (1.6 MiB) in 111ms
17.65 s
Progress: 0 of 1 built, 431 of 675 downloaded from cache (15 downloading)
17.65 s
Downloading cached cargo-package-sysinfo from https://cache.nix-ci.com
17.66 s
Downloaded cached cargo-package-strip-ansi-escapes (26 KiB) in 76ms
17.66 s
Progress: 0 of 1 built, 432 of 675 downloaded from cache (15 downloading)
17.66 s
Downloading cached cargo-package-tabled from https://cache.nix-ci.com
17.67 s
Downloaded cached cargo-package-string-template-plus (125 KiB) in 82ms
17.67 s
Progress: 0 of 1 built, 433 of 675 downloaded from cache (15 downloading)
17.67 s
Downloading cached cargo-package-tabled_derive from https://cache.nix-ci.com
17.67 s
Downloaded cached cargo-package-static_assertions (66 KiB) in 96ms
17.67 s
Progress: 0 of 1 built, 434 of 675 downloaded from cache (15 downloading)
17.67 s
Downloading cached cargo-package-tap from https://cache.nix-ci.com
17.67 s
Downloaded cached cargo-package-strsim (48 KiB) in 79ms
17.67 s
Progress: 0 of 1 built, 435 of 675 downloaded from cache (15 downloading)
17.67 s
Downloading cached cargo-package-target-lexicon from https://cache.nix-ci.com
17.69 s
Downloaded cached cargo-package-statrs (699 KiB) in 110ms
17.69 s
Progress: 0 of 1 built, 436 of 675 downloaded from cache (15 downloading)
17.69 s
Downloading cached cargo-package-target-triple from https://cache.nix-ci.com
17.69 s
Downloaded cached cargo-package-strum (25 KiB) in 87ms
17.69 s
Progress: 0 of 1 built, 437 of 675 downloaded from cache (15 downloading)
17.69 s
Downloading cached cargo-package-tempfile from https://cache.nix-ci.com
17.71 s
Downloaded cached cargo-package-strum_macros (136 KiB) in 95ms
17.71 s
Progress: 0 of 1 built, 438 of 675 downloaded from cache (15 downloading)
17.71 s
Downloaded cached cargo-package-strum_macros (151 KiB) in 93ms
17.71 s
Downloading cached cargo-package-termcolor from https://cache.nix-ci.com
17.71 s
Progress: 0 of 1 built, 439 of 675 downloaded from cache (15 downloading)
17.71 s
Downloading cached cargo-package-terminal_size from https://cache.nix-ci.com
17.71 s
Downloaded cached cargo-package-strsim (56 KiB) in 111ms
17.71 s
Progress: 0 of 1 built, 440 of 675 downloaded from cache (15 downloading)
17.71 s
Downloading cached cargo-package-terminfo from https://cache.nix-ci.com
17.71 s
Downloaded cached cargo-package-symlink (38 KiB) in 96ms
17.71 s
Progress: 0 of 1 built, 441 of 675 downloaded from cache (15 downloading)
17.71 s
Downloaded cached cargo-package-strum (21 KiB) in 110ms
17.71 s
Downloading cached cargo-package-termios from https://cache.nix-ci.com
17.71 s
Progress: 0 of 1 built, 442 of 675 downloaded from cache (15 downloading)
17.71 s
Downloading cached cargo-package-termwiz from https://cache.nix-ci.com
17.72 s
Downloaded cached cargo-package-subprocess (253 KiB) in 100ms
17.72 s
Progress: 0 of 1 built, 443 of 675 downloaded from cache (15 downloading)
17.72 s
Downloading cached cargo-package-test-log from https://cache.nix-ci.com
17.72 s
Downloaded cached cargo-package-symjit (831 KiB) in 102ms
17.72 s
Progress: 0 of 1 built, 444 of 675 downloaded from cache (15 downloading)
17.72 s
Downloading cached cargo-package-test-log-core from https://cache.nix-ci.com
17.76 s
Downloaded cached cargo-package-syn (1.8 MiB) in 134ms
17.76 s
Progress: 0 of 1 built, 445 of 675 downloaded from cache (15 downloading)
17.76 s
Downloading cached cargo-package-test-log-macros from https://cache.nix-ci.com
17.77 s
Downloaded cached cargo-package-syn (2.2 MiB) in 121ms
17.77 s
Progress: 0 of 1 built, 446 of 675 downloaded from cache (15 downloading)
17.77 s
Downloading cached cargo-package-testing_table from https://cache.nix-ci.com
17.77 s
Downloaded cached cargo-package-tabled_derive (54 KiB) in 107ms
17.77 s
Progress: 0 of 1 built, 447 of 675 downloaded from cache (15 downloading)
17.78 s
Downloading cached cargo-package-thiserror from https://cache.nix-ci.com
17.78 s
Downloaded cached cargo-package-sysinfo (905 KiB) in 121ms
17.78 s
Progress: 0 of 1 built, 448 of 675 downloaded from cache (15 downloading)
17.78 s
Downloading cached cargo-package-thiserror from https://cache.nix-ci.com
17.78 s
Downloaded cached cargo-package-target-triple (22 KiB) in 89ms
17.78 s
Progress: 0 of 1 built, 449 of 675 downloaded from cache (15 downloading)
17.78 s
Downloading cached cargo-package-thiserror-impl from https://cache.nix-ci.com
17.79 s
Downloaded cached cargo-package-tap (40 KiB) in 118ms
17.79 s
Progress: 0 of 1 built, 450 of 675 downloaded from cache (15 downloading)
17.79 s
Downloaded cached cargo-package-target-lexicon (123 KiB) in 117ms
17.79 s
Downloading cached cargo-package-thiserror-impl from https://cache.nix-ci.com
17.79 s
Progress: 0 of 1 built, 451 of 675 downloaded from cache (15 downloading)
17.79 s
Downloaded cached cargo-package-tempfile (189 KiB) in 96ms
17.79 s
Downloading cached cargo-package-thread_local from https://cache.nix-ci.com
17.79 s
Progress: 0 of 1 built, 452 of 675 downloaded from cache (15 downloading)
17.79 s
Downloading cached cargo-package-time from https://cache.nix-ci.com
17.80 s
Downloaded cached cargo-package-tabled (1.6 MiB) in 135ms
17.80 s
Progress: 0 of 1 built, 453 of 675 downloaded from cache (15 downloading)
17.80 s
Downloading cached cargo-package-time-core from https://cache.nix-ci.com
17.81 s
Downloaded cached cargo-package-terminfo (180 KiB) in 98ms
17.81 s
Downloaded cached cargo-package-termios (94 KiB) in 96ms
17.81 s
Progress: 0 of 1 built, 454 of 675 downloaded from cache (15 downloading)
17.81 s
Downloading cached cargo-package-time-macros from https://cache.nix-ci.com
17.81 s
Progress: 0 of 1 built, 455 of 675 downloaded from cache (15 downloading)
17.81 s
Downloading cached cargo-package-tiny-keccak from https://cache.nix-ci.com
17.82 s
Downloaded cached cargo-package-test-log (46 KiB) in 100ms
17.82 s
Progress: 0 of 1 built, 456 of 675 downloaded from cache (15 downloading)
17.82 s
Downloading cached cargo-package-tiny_http from https://cache.nix-ci.com
17.82 s
Downloaded cached cargo-package-termcolor (92 KiB) in 110ms
17.82 s
Progress: 0 of 1 built, 457 of 675 downloaded from cache (15 downloading)
17.82 s
Downloading cached cargo-package-tinyjson from https://cache.nix-ci.com
17.82 s
Downloaded cached cargo-package-test-log-core (36 KiB) in 100ms
17.82 s
Progress: 0 of 1 built, 458 of 675 downloaded from cache (15 downloading)
17.82 s
Downloading cached cargo-package-tinytemplate from https://cache.nix-ci.com
17.82 s
Downloaded cached cargo-package-terminal_size (32 KiB) in 114ms
17.83 s
Progress: 0 of 1 built, 459 of 675 downloaded from cache (15 downloading)
17.83 s
Downloading cached cargo-package-tinyvec from https://cache.nix-ci.com
17.83 s
Downloaded cached cargo-package-termwiz (3.5 MiB) in 114ms
17.83 s
Progress: 0 of 1 built, 460 of 675 downloaded from cache (15 downloading)
17.83 s
Downloading cached cargo-package-tinyvec_macros from https://cache.nix-ci.com
17.84 s
Downloaded cached cargo-package-test-log-macros (18 KiB) in 86ms
17.84 s
Progress: 0 of 1 built, 461 of 675 downloaded from cache (15 downloading)
17.84 s
Downloading cached cargo-package-titlecase from https://cache.nix-ci.com
17.86 s
Downloaded cached cargo-package-testing_table (11 KiB) in 95ms
17.86 s
Progress: 0 of 1 built, 462 of 675 downloaded from cache (15 downloading)
17.86 s
Downloading cached cargo-package-toml from https://cache.nix-ci.com
17.86 s
Downloaded cached cargo-package-thiserror-impl (83 KiB) in 84ms
17.86 s
Progress: 0 of 1 built, 463 of 675 downloaded from cache (15 downloading)
17.87 s
Downloading cached cargo-package-toml-0.9.12+spec from https://cache.nix-ci.com
17.87 s
Downloaded cached cargo-package-thiserror (109 KiB) in 97ms
17.87 s
Downloaded cached cargo-package-thread_local (71 KiB) in 81ms
17.87 s
Progress: 0 of 1 built, 464 of 675 downloaded from cache (15 downloading)
17.87 s
Downloading cached cargo-package-toml-1.1.2+spec from https://cache.nix-ci.com
17.87 s
Progress: 0 of 1 built, 465 of 675 downloaded from cache (15 downloading)
17.87 s
Downloaded cached cargo-package-thiserror (136 KiB) in 98ms
17.87 s
Downloading cached cargo-package-toml_datetime from https://cache.nix-ci.com
17.87 s
Progress: 0 of 1 built, 466 of 675 downloaded from cache (15 downloading)
17.87 s
Downloading cached cargo-package-toml_datetime-0.7.5+spec from https://cache.nix-ci.com
17.88 s
Downloaded cached cargo-package-thiserror-impl (97 KiB) in 89ms
17.88 s
Progress: 0 of 1 built, 467 of 675 downloaded from cache (15 downloading)
17.88 s
Downloading cached cargo-package-toml_datetime-1.1.1+spec from https://cache.nix-ci.com
17.89 s
Downloaded cached cargo-package-time-core (31 KiB) in 85ms
17.89 s
Progress: 0 of 1 built, 468 of 675 downloaded from cache (15 downloading)
17.89 s
Downloading cached cargo-package-toml_edit from https://cache.nix-ci.com
17.89 s
Downloaded cached cargo-package-time (1.5 MiB) in 94ms
17.89 s
Progress: 0 of 1 built, 469 of 675 downloaded from cache (15 downloading)
17.89 s
Downloading cached cargo-package-toml_edit-0.25.11+spec from https://cache.nix-ci.com
17.90 s
Downloaded cached cargo-package-tiny-keccak (97 KiB) in 88ms
17.90 s
Progress: 0 of 1 built, 470 of 675 downloaded from cache (15 downloading)
17.90 s
Downloading cached cargo-package-toml_parser-1.1.2+spec from https://cache.nix-ci.com
17.91 s
Downloaded cached cargo-package-tiny_http (197 KiB) in 88ms
17.91 s
Progress: 0 of 1 built, 471 of 675 downloaded from cache (15 downloading)
17.91 s
Downloading cached cargo-package-toml_write from https://cache.nix-ci.com
17.91 s
Downloaded cached cargo-package-time-macros (113 KiB) in 97ms
17.91 s
Progress: 0 of 1 built, 472 of 675 downloaded from cache (15 downloading)
17.91 s
Downloading cached cargo-package-toml_writer-1.1.1+spec from https://cache.nix-ci.com
17.91 s
Downloaded cached cargo-package-tinytemplate (114 KiB) in 89ms
17.91 s
Progress: 0 of 1 built, 473 of 675 downloaded from cache (15 downloading)
17.91 s
Downloading cached cargo-package-tracing from https://cache.nix-ci.com
17.93 s
Downloaded cached cargo-package-tinyjson (61 KiB) in 107ms
17.93 s
Progress: 0 of 1 built, 474 of 675 downloaded from cache (15 downloading)
17.93 s
Downloading cached cargo-package-tracing-appender from https://cache.nix-ci.com
17.93 s
Downloaded cached cargo-package-tinyvec_macros (16 KiB) in 102ms
17.93 s
Progress: 0 of 1 built, 475 of 675 downloaded from cache (15 downloading)
17.93 s
Downloading cached cargo-package-tracing-attributes from https://cache.nix-ci.com
17.93 s
Downloaded cached cargo-package-tinyvec (237 KiB) in 109ms
17.93 s
Progress: 0 of 1 built, 476 of 675 downloaded from cache (15 downloading)
17.94 s
Downloading cached cargo-package-tracing-core from https://cache.nix-ci.com
17.95 s
Downloaded cached cargo-package-titlecase (23 KiB) in 103ms
17.95 s
Progress: 0 of 1 built, 477 of 675 downloaded from cache (15 downloading)
17.95 s
Downloading cached cargo-package-tracing-error from https://cache.nix-ci.com
17.96 s
Downloaded cached cargo-package-toml-0.9.12+spec (322 KiB) in 91ms
17.96 s
Progress: 0 of 1 built, 478 of 675 downloaded from cache (15 downloading)
17.96 s
Downloading cached cargo-package-tracing-indicatif from https://cache.nix-ci.com
17.96 s
Downloaded cached cargo-package-toml-1.1.2+spec (325 KiB) in 90ms
17.96 s
Progress: 0 of 1 built, 479 of 675 downloaded from cache (15 downloading)
17.96 s
Downloading cached cargo-package-tracing-log from https://cache.nix-ci.com
17.97 s
Downloaded cached cargo-package-toml_datetime-1.1.1+spec (71 KiB) in 89ms
17.97 s
Progress: 0 of 1 built, 480 of 675 downloaded from cache (15 downloading)
17.97 s
Downloading cached cargo-package-tracing-serde from https://cache.nix-ci.com
17.97 s
Downloaded cached cargo-package-toml (185 KiB) in 111ms
17.97 s
Progress: 0 of 1 built, 481 of 675 downloaded from cache (15 downloading)
17.98 s
Downloading cached cargo-package-tracing-subscriber from https://cache.nix-ci.com
17.98 s
Downloaded cached cargo-package-toml_datetime-0.7.5+spec (71 KiB) in 102ms
17.98 s
Progress: 0 of 1 built, 482 of 675 downloaded from cache (15 downloading)
17.98 s
Downloaded cached cargo-package-toml_datetime (59 KiB) in 102ms
17.98 s
Downloading cached cargo-package-trybuild from https://cache.nix-ci.com
17.98 s
Progress: 0 of 1 built, 483 of 675 downloaded from cache (15 downloading)
17.98 s
Downloading cached cargo-package-typed-index-collections from https://cache.nix-ci.com
17.98 s
Downloaded cached cargo-package-toml_edit-0.25.11+spec (359 KiB) in 97ms
17.98 s
Progress: 0 of 1 built, 484 of 675 downloaded from cache (15 downloading)
17.98 s
Downloading cached cargo-package-typeid from https://cache.nix-ci.com
18.01 s
Downloaded cached cargo-package-toml_edit (396 KiB) in 120ms
18.01 s
Progress: 0 of 1 built, 485 of 675 downloaded from cache (15 downloading)
18.01 s
Downloading cached cargo-package-typenum from https://cache.nix-ci.com
18.01 s
Downloaded cached cargo-package-toml_writer-1.1.1+spec (74 KiB) in 101ms
18.01 s
Progress: 0 of 1 built, 486 of 675 downloaded from cache (15 downloading)
18.01 s
Downloaded cached cargo-package-toml_parser-1.1.2+spec (239 KiB) in 109ms
18.01 s
Downloading cached cargo-package-ucd-trie from https://cache.nix-ci.com
18.01 s
Progress: 0 of 1 built, 487 of 675 downloaded from cache (15 downloading)
18.01 s
Downloading cached cargo-package-unarray from https://cache.nix-ci.com
18.02 s
Downloaded cached cargo-package-toml_write (59 KiB) in 111ms
18.02 s
Progress: 0 of 1 built, 488 of 675 downloaded from cache (15 downloading)
18.02 s
Downloading cached cargo-package-uncased from https://cache.nix-ci.com
18.03 s
Downloaded cached cargo-package-tracing-appender (131 KiB) in 103ms
18.03 s
Progress: 0 of 1 built, 489 of 675 downloaded from cache (15 downloading)
18.03 s
Downloading cached cargo-package-unic-char-property from https://cache.nix-ci.com
18.03 s
Downloaded cached cargo-package-tracing (9.4 MiB) in 122ms
18.03 s
Progress: 0 of 1 built, 490 of 675 downloaded from cache (15 downloading)
18.03 s
Downloading cached cargo-package-unic-char-range from https://cache.nix-ci.com
18.04 s
Downloaded cached cargo-package-tracing-attributes (184 KiB) in 111ms
18.04 s
Progress: 0 of 1 built, 491 of 675 downloaded from cache (15 downloading)
18.05 s
Downloading cached cargo-package-unic-common from https://cache.nix-ci.com
18.05 s
Downloaded cached cargo-package-tracing-core (255 KiB) in 117ms
18.05 s
Progress: 0 of 1 built, 492 of 675 downloaded from cache (15 downloading)
18.05 s
Downloaded cached cargo-package-tracing-error (47 KiB) in 105ms
18.05 s
Downloading cached cargo-package-unic-emoji-char from https://cache.nix-ci.com
18.05 s
Progress: 0 of 1 built, 493 of 675 downloaded from cache (15 downloading)
18.05 s
Downloading cached cargo-package-unic-ucd-ident from https://cache.nix-ci.com
18.07 s
Downloaded cached cargo-package-typed-index-collections (280 KiB) in 91ms
18.07 s
Progress: 0 of 1 built, 494 of 675 downloaded from cache (15 downloading)
18.07 s
Downloading cached cargo-package-unic-ucd-version from https://cache.nix-ci.com
18.07 s
Downloaded cached cargo-package-tracing-indicatif (138 KiB) in 115ms
18.07 s
Progress: 0 of 1 built, 495 of 675 downloaded from cache (15 downloading)
18.07 s
Downloading cached cargo-package-unicase from https://cache.nix-ci.com
18.08 s
Downloaded cached cargo-package-typeid (29 KiB) in 93ms
18.08 s
Progress: 0 of 1 built, 496 of 675 downloaded from cache (15 downloading)
18.08 s
Downloading cached cargo-package-unicode-ident from https://cache.nix-ci.com
18.08 s
Downloaded cached cargo-package-tracing-serde (31 KiB) in 109ms
18.08 s
Progress: 0 of 1 built, 497 of 675 downloaded from cache (15 downloading)
18.08 s
Downloaded cached cargo-package-tracing-log (68 KiB) in 116ms
18.08 s
Downloading cached cargo-package-unicode-segmentation from https://cache.nix-ci.com
18.08 s
Progress: 0 of 1 built, 498 of 675 downloaded from cache (15 downloading)
18.08 s
Downloading cached cargo-package-unicode-truncate from https://cache.nix-ci.com
18.08 s
Downloaded cached cargo-package-tracing-subscriber (1.1 MiB) in 108ms
18.08 s
Progress: 0 of 1 built, 499 of 675 downloaded from cache (15 downloading)
18.08 s
Downloading cached cargo-package-unicode-width from https://cache.nix-ci.com
18.10 s
Downloaded cached cargo-package-trybuild (191 KiB) in 116ms
18.10 s
Progress: 0 of 1 built, 500 of 675 downloaded from cache (15 downloading)
18.10 s
Downloading cached cargo-package-unicode-xid from https://cache.nix-ci.com
18.10 s
Downloaded cached cargo-package-unarray (45 KiB) in 89ms
18.10 s
Progress: 0 of 1 built, 501 of 675 downloaded from cache (15 downloading)
18.10 s
Downloading cached cargo-package-unicode_names2 from https://cache.nix-ci.com
18.11 s
Downloaded cached cargo-package-uncased (42 KiB) in 88ms
18.11 s
Progress: 0 of 1 built, 502 of 675 downloaded from cache (15 downloading)
18.11 s
Downloading cached cargo-package-unicode_names2_generator from https://cache.nix-ci.com
18.12 s
Downloaded cached cargo-package-typenum (1.2 MiB) in 114ms
18.12 s
Progress: 0 of 1 built, 503 of 675 downloaded from cache (15 downloading)
18.12 s
Downloading cached cargo-package-unit-prefix from https://cache.nix-ci.com
18.12 s
Downloaded cached cargo-package-ucd-trie (160 KiB) in 110ms
18.12 s
Progress: 0 of 1 built, 504 of 675 downloaded from cache (15 downloading)
18.12 s
Downloading cached cargo-package-unsafe-libyaml from https://cache.nix-ci.com
18.14 s
Downloaded cached cargo-package-unic-char-range (30 KiB) in 106ms
18.14 s
Progress: 0 of 1 built, 505 of 675 downloaded from cache (15 downloading)
18.14 s
Downloading cached cargo-package-unty from https://cache.nix-ci.com
18.14 s
Downloaded cached cargo-package-unic-char-property (31 KiB) in 111ms
18.14 s
Progress: 0 of 1 built, 506 of 675 downloaded from cache (15 downloading)
18.14 s
Downloading cached cargo-package-utf8parse from https://cache.nix-ci.com
18.15 s
Downloaded cached cargo-package-unic-ucd-ident (151 KiB) in 97ms
18.15 s
Progress: 0 of 1 built, 507 of 675 downloaded from cache (15 downloading)
18.15 s
Downloading cached cargo-package-uuid from https://cache.nix-ci.com
18.15 s
Downloaded cached cargo-package-unic-common (8240 B) in 107ms
18.15 s
Progress: 0 of 1 built, 508 of 675 downloaded from cache (15 downloading)
18.15 s
Downloading cached cargo-package-valuable from https://cache.nix-ci.com
18.16 s
Downloaded cached cargo-package-unic-emoji-char (44 KiB) in 111ms
18.16 s
Progress: 0 of 1 built, 509 of 675 downloaded from cache (15 downloading)
18.16 s
Downloading cached cargo-package-vectorize from https://cache.nix-ci.com
18.18 s
Downloaded cached cargo-package-unicode-truncate (67 KiB) in 95ms
18.18 s
Progress: 0 of 1 built, 510 of 675 downloaded from cache (15 downloading)
18.18 s
Downloading cached cargo-package-venial from https://cache.nix-ci.com
18.18 s
Downloaded cached cargo-package-unicode-ident (335 KiB) in 100ms
18.18 s
Progress: 0 of 1 built, 511 of 675 downloaded from cache (15 downloading)
18.18 s
Downloading cached cargo-package-version-compare from https://cache.nix-ci.com
18.18 s
Downloaded cached cargo-package-unic-ucd-version (8360 B) in 112ms
18.19 s
Progress: 0 of 1 built, 512 of 675 downloaded from cache (15 downloading)
18.19 s
Downloading cached cargo-package-version_check from https://cache.nix-ci.com
18.19 s
Downloaded cached cargo-package-unicode-width (2.3 MiB) in 105ms
18.19 s
Progress: 0 of 1 built, 513 of 675 downloaded from cache (15 downloading)
18.19 s
Downloading cached cargo-package-virtue from https://cache.nix-ci.com
18.19 s
Downloaded cached cargo-package-unicase (113 KiB) in 120ms
18.19 s
Progress: 0 of 1 built, 514 of 675 downloaded from cache (15 downloading)
18.19 s
Downloading cached cargo-package-vt100 from https://cache.nix-ci.com
18.20 s
Downloaded cached cargo-package-unicode-segmentation (659 KiB) in 121ms
18.20 s
Progress: 0 of 1 built, 515 of 675 downloaded from cache (15 downloading)
18.20 s
Downloading cached cargo-package-vte from https://cache.nix-ci.com
18.22 s
Downloaded cached cargo-package-unicode-xid (78 KiB) in 120ms
18.22 s
Progress: 0 of 1 built, 516 of 675 downloaded from cache (15 downloading)
18.22 s
Downloading cached cargo-package-vte from https://cache.nix-ci.com
18.23 s
Downloaded cached cargo-package-unicode_names2_generator (42 KiB) in 116ms
18.23 s
Progress: 0 of 1 built, 517 of 675 downloaded from cache (15 downloading)
18.23 s
Downloading cached cargo-package-vtparse from https://cache.nix-ci.com
18.23 s
Downloaded cached cargo-package-unit-prefix (30 KiB) in 105ms
18.23 s
Progress: 0 of 1 built, 518 of 675 downloaded from cache (15 downloading)
18.23 s
Downloading cached cargo-package-wait-timeout from https://cache.nix-ci.com
18.23 s
Downloaded cached cargo-package-unicode_names2 (2.2 MiB) in 128ms
18.23 s
Progress: 0 of 1 built, 519 of 675 downloaded from cache (15 downloading)
18.23 s
Downloading cached cargo-package-walkdir from https://cache.nix-ci.com
18.24 s
Downloaded cached cargo-package-unsafe-libyaml (457 KiB) in 117ms
18.24 s
Progress: 0 of 1 built, 520 of 675 downloaded from cache (15 downloading)
18.24 s
Downloading cached cargo-package-wasi-0.11.1+wasi-snapshot-preview1 from https://cache.nix-ci.com
18.25 s
Downloaded cached cargo-package-valuable (156 KiB) in 94ms
18.25 s
Progress: 0 of 1 built, 521 of 675 downloaded from cache (15 downloading)
18.25 s
Downloaded cached cargo-package-unty (21 KiB) in 107ms
18.25 s
Downloading cached cargo-package-wasip2-1.0.3+wasi from https://cache.nix-ci.com
18.25 s
Progress: 0 of 1 built, 522 of 675 downloaded from cache (15 downloading)
18.25 s
Downloading cached cargo-package-wasip3-0.4.0+wasi-0.3.0-rc-2026-01 from https://cache.nix-ci.com
18.25 s
Downloaded cached cargo-package-utf8parse (36 KiB) in 108ms
18.25 s
Progress: 0 of 1 built, 523 of 675 downloaded from cache (15 downloading)
18.25 s
Downloading cached cargo-package-wasm-bindgen from https://cache.nix-ci.com
18.26 s
Downloaded cached cargo-package-vectorize (6368 B) in 94ms
18.26 s
Progress: 0 of 1 built, 524 of 675 downloaded from cache (15 downloading)
18.26 s
Downloading cached cargo-package-wasm-bindgen-macro from https://cache.nix-ci.com
18.26 s
Downloaded cached cargo-package-uuid (316 KiB) in 108ms
18.26 s
Progress: 0 of 1 built, 525 of 675 downloaded from cache (15 downloading)
18.26 s
Downloading cached cargo-package-wasm-bindgen-macro-support from https://cache.nix-ci.com
18.27 s
Downloaded cached cargo-package-vt100 (160 KiB) in 80ms
18.27 s
Progress: 0 of 1 built, 526 of 675 downloaded from cache (15 downloading)
18.28 s
Downloading cached cargo-package-wasm-bindgen-shared from https://cache.nix-ci.com
18.28 s
Downloaded cached cargo-package-venial (170 KiB) in 98ms
18.28 s
Progress: 0 of 1 built, 527 of 675 downloaded from cache (15 downloading)
18.28 s
Downloading cached cargo-package-wasm-encoder from https://cache.nix-ci.com
18.28 s
Downloaded cached cargo-package-version-compare (65 KiB) in 98ms
18.28 s
Progress: 0 of 1 built, 528 of 675 downloaded from cache (15 downloading)
18.28 s
Downloading cached cargo-package-wasm-metadata from https://cache.nix-ci.com
18.28 s
Downloaded cached cargo-package-virtue (199 KiB) in 90ms
18.28 s
Progress: 0 of 1 built, 529 of 675 downloaded from cache (15 downloading)
18.28 s
Downloading cached cargo-package-wasm-minimal-protocol from https://cache.nix-ci.com
18.28 s
Downloaded cached cargo-package-version_check (62 KiB) in 97ms
18.28 s
Progress: 0 of 1 built, 530 of 675 downloaded from cache (15 downloading)
18.28 s
Downloading cached cargo-package-wasmparser from https://cache.nix-ci.com
18.28 s
Downloaded cached cargo-package-vte (319 KiB) in 81ms
18.28 s
Progress: 0 of 1 built, 531 of 675 downloaded from cache (15 downloading)
18.28 s
Downloading cached cargo-package-wasmtime-jit-icache-coherence from https://cache.nix-ci.com
18.31 s
Downloaded cached cargo-package-wait-timeout (35 KiB) in 83ms
18.31 s
Progress: 0 of 1 built, 532 of 675 downloaded from cache (15 downloading)
18.31 s
Downloading cached cargo-package-web-sys from https://cache.nix-ci.com
18.31 s
Downloaded cached cargo-package-walkdir (114 KiB) in 80ms
18.31 s
Progress: 0 of 1 built, 533 of 675 downloaded from cache (15 downloading)
18.31 s
Downloading cached cargo-package-web-time from https://cache.nix-ci.com
18.31 s
Downloaded cached cargo-package-vte (320 KiB) in 95ms
18.31 s
Progress: 0 of 1 built, 534 of 675 downloaded from cache (15 downloading)
18.31 s
Downloading cached cargo-package-web-time from https://cache.nix-ci.com
18.31 s
Downloaded cached cargo-package-vtparse (53 KiB) in 87ms
18.31 s
Progress: 0 of 1 built, 535 of 675 downloaded from cache (15 downloading)
18.31 s
Downloading cached cargo-package-wezterm-bidi from https://cache.nix-ci.com
18.34 s
Downloaded cached cargo-package-wasm-bindgen (265 KiB) in 82ms
18.34 s
Progress: 0 of 1 built, 536 of 675 downloaded from cache (15 downloading)
18.34 s
Downloading cached cargo-package-wezterm-blob-leases from https://cache.nix-ci.com
18.34 s
Downloaded cached cargo-package-wasi-0.11.1+wasi-snapshot-preview1 (132 KiB) in 98ms
18.34 s
Progress: 0 of 1 built, 537 of 675 downloaded from cache (15 downloading)
18.34 s
Downloading cached cargo-package-wezterm-color-types from https://cache.nix-ci.com
18.34 s
Downloaded cached cargo-package-wasm-bindgen-macro (27 KiB) in 79ms
18.34 s
Progress: 0 of 1 built, 538 of 675 downloaded from cache (15 downloading)
18.34 s
Downloaded cached cargo-package-wasip3-0.4.0+wasi-0.3.0-rc-2026-01 (1.1 MiB) in 92ms
18.34 s
Progress: 0 of 1 built, 539 of 675 downloaded from cache (15 downloading)
18.34 s
Downloading cached cargo-package-wezterm-dynamic-derive from https://cache.nix-ci.com
18.34 s
Downloading cached cargo-package-wezterm-dynamic from https://cache.nix-ci.com
18.34 s
Downloaded cached cargo-package-wasip2-1.0.3+wasi (1.2 MiB) in 93ms
18.34 s
Progress: 0 of 1 built, 540 of 675 downloaded from cache (15 downloading)
18.34 s
Downloading cached cargo-package-wezterm-input-types from https://cache.nix-ci.com
18.34 s
Downloaded cached cargo-package-wasm-bindgen-macro-support (319 KiB) in 83ms
18.34 s
Progress: 0 of 1 built, 541 of 675 downloaded from cache (15 downloading)
18.34 s
Downloading cached cargo-package-which from https://cache.nix-ci.com
18.37 s
Downloaded cached cargo-package-wasmtime-jit-icache-coherence (21 KiB) in 85ms
18.37 s
Progress: 0 of 1 built, 542 of 675 downloaded from cache (15 downloading)
18.37 s
Downloading cached cargo-package-wide from https://cache.nix-ci.com
18.37 s
Downloaded cached cargo-package-wide in 0ms
18.37 s
Progress: 0 of 1 built, 543 of 675 downloaded from cache (15 downloading)
18.37 s
Downloaded cached cargo-package-wasm-minimal-protocol (35 KiB) in 87ms
18.37 s
Downloading cached cargo-package-wide from https://cache.nix-ci.com
18.37 s
Progress: 0 of 1 built, 544 of 675 downloaded from cache (15 downloading)
18.37 s
Downloading cached cargo-package-wide from https://cache.nix-ci.com
18.37 s
Downloaded cached cargo-package-wasm-metadata (122 KiB) in 95ms
18.37 s
Progress: 0 of 1 built, 545 of 675 downloaded from cache (15 downloading)
18.37 s
Downloading cached cargo-package-winapi from https://cache.nix-ci.com
18.37 s
Downloaded cached cargo-package-wasm-bindgen-shared (32 KiB) in 98ms
18.37 s
Progress: 0 of 1 built, 546 of 675 downloaded from cache (15 downloading)
18.37 s
Downloading cached cargo-package-winapi-i686-pc-windows-gnu from https://cache.nix-ci.com
18.38 s
Downloaded cached cargo-package-wasmparser (1.4 MiB) in 91ms
18.38 s
Progress: 0 of 1 built, 547 of 675 downloaded from cache (15 downloading)
18.38 s
Downloading cached cargo-package-winapi-util from https://cache.nix-ci.com
18.38 s
Downloaded cached cargo-package-wasm-encoder (580 KiB) in 99ms
18.38 s
Progress: 0 of 1 built, 548 of 675 downloaded from cache (15 downloading)
18.38 s
Downloading cached cargo-package-winapi-x86_64-pc-windows-gnu from https://cache.nix-ci.com
18.39 s
Downloaded cached cargo-package-web-time (67 KiB) in 75ms
18.39 s
Progress: 0 of 1 built, 549 of 675 downloaded from cache (15 downloading)
18.39 s
Downloading cached cargo-package-windows from https://cache.nix-ci.com
18.39 s
Downloaded cached cargo-package-wezterm-bidi (362 KiB) in 77ms
18.39 s
Progress: 0 of 1 built, 550 of 675 downloaded from cache (15 downloading)
18.39 s
Downloading cached cargo-package-windows-core from https://cache.nix-ci.com
18.39 s
Downloaded cached cargo-package-web-time (59 KiB) in 79ms
18.39 s
Progress: 0 of 1 built, 551 of 675 downloaded from cache (15 downloading)
18.39 s
Downloading cached cargo-package-windows-implement from https://cache.nix-ci.com
18.42 s
Downloaded cached cargo-package-wezterm-dynamic-derive (40 KiB) in 77ms
18.42 s
Progress: 0 of 1 built, 552 of 675 downloaded from cache (15 downloading)
18.42 s
Downloading cached cargo-package-windows-interface from https://cache.nix-ci.com
18.42 s
Downloaded cached cargo-package-wezterm-dynamic (56 KiB) in 78ms
18.42 s
Progress: 0 of 1 built, 553 of 675 downloaded from cache (15 downloading)
18.42 s
Downloading cached cargo-package-windows-link from https://cache.nix-ci.com
18.42 s
Downloaded cached cargo-package-wezterm-input-types (99 KiB) in 78ms
18.42 s
Progress: 0 of 1 built, 554 of 675 downloaded from cache (15 downloading)
18.42 s
Downloading cached cargo-package-windows-result from https://cache.nix-ci.com
18.42 s
Downloaded cached cargo-package-wezterm-color-types (51 KiB) in 82ms
18.42 s
Progress: 0 of 1 built, 555 of 675 downloaded from cache (15 downloading)
18.42 s
Downloading cached cargo-package-windows-sys from https://cache.nix-ci.com
18.43 s
Downloaded cached cargo-package-wezterm-blob-leases (32 KiB) in 93ms
18.43 s
Progress: 0 of 1 built, 556 of 675 downloaded from cache (15 downloading)
18.43 s
Downloading cached cargo-package-windows-sys from https://cache.nix-ci.com
18.43 s
Downloaded cached cargo-package-which (117 KiB) in 85ms
18.43 s
Progress: 0 of 1 built, 557 of 675 downloaded from cache (15 downloading)
18.43 s
Downloading cached cargo-package-windows-sys from https://cache.nix-ci.com
18.45 s
Downloaded cached cargo-package-wide (1.1 MiB) in 79ms
18.45 s
Progress: 0 of 1 built, 558 of 675 downloaded from cache (15 downloading)
18.45 s
Downloading cached cargo-package-windows-sys from https://cache.nix-ci.com
18.46 s
Downloaded cached cargo-package-wide (1 MiB) in 85ms
18.46 s
Progress: 0 of 1 built, 559 of 675 downloaded from cache (15 downloading)
18.46 s
Downloading cached cargo-package-windows-targets from https://cache.nix-ci.com
18.48 s
Downloaded cached cargo-package-windows-implement (37 KiB) in 89ms
18.48 s
Progress: 0 of 1 built, 560 of 675 downloaded from cache (15 downloading)
18.48 s
Downloading cached cargo-package-windows-targets from https://cache.nix-ci.com
18.48 s
Downloaded cached cargo-package-winapi-util (48 KiB) in 108ms
18.48 s
Progress: 0 of 1 built, 561 of 675 downloaded from cache (15 downloading)
18.48 s
Downloading cached cargo-package-windows_aarch64_gnullvm from https://cache.nix-ci.com
18.49 s
Downloaded cached cargo-package-windows-core (300 KiB) in 95ms
18.49 s
Progress: 0 of 1 built, 562 of 675 downloaded from cache (15 downloading)
18.49 s
Downloading cached cargo-package-windows_aarch64_gnullvm from https://cache.nix-ci.com
18.52 s
Downloaded cached cargo-package-winapi (6.7 MiB) in 148ms
18.52 s
Progress: 0 of 1 built, 563 of 675 downloaded from cache (15 downloading)
18.52 s
Downloading cached cargo-package-windows_aarch64_msvc from https://cache.nix-ci.com
18.52 s
Downloaded cached cargo-package-web-sys (10.9 MiB) in 212ms
18.52 s
Progress: 0 of 1 built, 564 of 675 downloaded from cache (15 downloading)
18.52 s
Downloading cached cargo-package-windows_aarch64_msvc from https://cache.nix-ci.com
18.54 s
Downloaded cached cargo-package-windows-link (17 KiB) in 116ms
18.54 s
Progress: 0 of 1 built, 565 of 675 downloaded from cache (15 downloading)
18.54 s
Downloaded cached cargo-package-windows-result (35 KiB) in 115ms
18.54 s
Downloading cached cargo-package-windows_i686_gnu from https://cache.nix-ci.com
18.54 s
Progress: 0 of 1 built, 566 of 675 downloaded from cache (15 downloading)
18.54 s
Downloading cached cargo-package-windows_i686_gnu from https://cache.nix-ci.com
18.55 s
Downloaded cached cargo-package-windows-interface (40 KiB) in 136ms
18.55 s
Progress: 0 of 1 built, 567 of 675 downloaded from cache (15 downloading)
18.56 s
Downloading cached cargo-package-windows_i686_gnullvm from https://cache.nix-ci.com
18.59 s
Downloaded cached cargo-package-windows-targets (20 KiB) in 134ms
18.59 s
Progress: 0 of 1 built, 568 of 675 downloaded from cache (15 downloading)
18.59 s
Downloading cached cargo-package-windows_i686_gnullvm from https://cache.nix-ci.com
18.65 s
Downloaded cached cargo-package-windows_aarch64_gnullvm (3.7 MiB) in 167ms
18.65 s
Progress: 0 of 1 built, 569 of 675 downloaded from cache (15 downloading)
18.65 s
Downloading cached cargo-package-windows_i686_msvc from https://cache.nix-ci.com
18.66 s
Downloaded cached cargo-package-windows-targets (22 KiB) in 173ms
18.66 s
Progress: 0 of 1 built, 570 of 675 downloaded from cache (15 downloading)
18.66 s
Downloading cached cargo-package-windows_i686_msvc from https://cache.nix-ci.com
18.70 s
Downloaded cached cargo-package-windows_aarch64_gnullvm (4.9 MiB) in 217ms
18.70 s
Progress: 0 of 1 built, 571 of 675 downloaded from cache (15 downloading)
18.71 s
Downloading cached cargo-package-windows_x86_64_gnu from https://cache.nix-ci.com
18.73 s
Downloaded cached cargo-package-windows_aarch64_msvc (5 MiB) in 204ms
18.73 s
Progress: 0 of 1 built, 572 of 675 downloaded from cache (15 downloading)
18.73 s
Downloading cached cargo-package-windows_x86_64_gnu from https://cache.nix-ci.com
18.75 s
Downloaded cached cargo-package-windows-sys (16.4 MiB) in 317ms
18.75 s
Progress: 0 of 1 built, 573 of 675 downloaded from cache (15 downloading)
18.75 s
Downloading cached cargo-package-windows_x86_64_gnullvm from https://cache.nix-ci.com
18.76 s
Downloaded cached cargo-package-windows_aarch64_msvc (5 MiB) in 235ms
18.76 s
Progress: 0 of 1 built, 574 of 675 downloaded from cache (15 downloading)
18.76 s
Downloading cached cargo-package-windows_x86_64_gnullvm from https://cache.nix-ci.com
18.77 s
Downloaded cached cargo-package-windows-sys (17.5 MiB) in 339ms
18.77 s
Progress: 0 of 1 built, 575 of 675 downloaded from cache (15 downloading)
18.77 s
Downloading cached cargo-package-windows_x86_64_msvc from https://cache.nix-ci.com
18.77 s
Downloaded cached cargo-package-windows-sys (20.6 MiB) in 348ms
18.77 s
Progress: 0 of 1 built, 576 of 675 downloaded from cache (15 downloading)
18.77 s
Downloading cached cargo-package-windows_x86_64_msvc from https://cache.nix-ci.com
18.78 s
Downloaded cached cargo-package-windows_i686_gnullvm (3.9 MiB) in 219ms
18.78 s
Progress: 0 of 1 built, 577 of 675 downloaded from cache (15 downloading)
18.78 s
Downloading cached cargo-package-winnow from https://cache.nix-ci.com
18.78 s
Downloaded cached cargo-package-windows_i686_gnu (12.6 MiB) in 248ms
18.78 s
Progress: 0 of 1 built, 578 of 675 downloaded from cache (15 downloading)
18.79 s
Downloading cached cargo-package-winnow from https://cache.nix-ci.com
18.80 s
Downloaded cached cargo-package-windows_i686_gnu (12.6 MiB) in 259ms
18.80 s
Progress: 0 of 1 built, 579 of 675 downloaded from cache (15 downloading)
18.80 s
Downloading cached cargo-package-wit-bindgen from https://cache.nix-ci.com
18.80 s
Downloaded cached cargo-package-windows_i686_gnullvm (5.2 MiB) in 205ms
18.80 s
Progress: 0 of 1 built, 580 of 675 downloaded from cache (15 downloading)
18.80 s
Downloading cached cargo-package-wit-bindgen from https://cache.nix-ci.com
18.81 s
Downloaded cached cargo-package-windows-sys (17.4 MiB) in 361ms
18.81 s
Progress: 0 of 1 built, 581 of 675 downloaded from cache (15 downloading)
18.81 s
Downloading cached cargo-package-wit-bindgen-core from https://cache.nix-ci.com
18.81 s
Downloaded cached cargo-package-winapi-i686-pc-windows-gnu (48.9 MiB) in 440ms
18.81 s
Progress: 0 of 1 built, 582 of 675 downloaded from cache (15 downloading)
18.81 s
Downloading cached cargo-package-wit-bindgen-rust from https://cache.nix-ci.com
18.85 s
Downloaded cached cargo-package-winapi-x86_64-pc-windows-gnu (51 MiB) in 469ms
18.85 s
Progress: 0 of 1 built, 583 of 675 downloaded from cache (15 downloading)
18.85 s
Downloading cached cargo-package-wit-bindgen-rust-macro from https://cache.nix-ci.com
18.86 s
Downloaded cached cargo-package-windows_i686_msvc (5.3 MiB) in 203ms
18.86 s
Progress: 0 of 1 built, 584 of 675 downloaded from cache (15 downloading)
18.86 s
Downloading cached cargo-package-wit-component from https://cache.nix-ci.com
18.86 s
Downloaded cached cargo-package-windows_i686_msvc (5.3 MiB) in 201ms
18.86 s
Progress: 0 of 1 built, 585 of 675 downloaded from cache (15 downloading)
18.86 s
Downloading cached cargo-package-wit-parser from https://cache.nix-ci.com
18.90 s
Downloaded cached cargo-package-windows_x86_64_gnullvm (3.7 MiB) in 153ms
18.90 s
Progress: 0 of 1 built, 586 of 675 downloaded from cache (15 downloading)
18.90 s
Downloading cached cargo-package-wyz from https://cache.nix-ci.com
18.92 s
Downloaded cached cargo-package-windows_x86_64_msvc (5 MiB) in 147ms
18.92 s
Progress: 0 of 1 built, 587 of 675 downloaded from cache (15 downloading)
18.92 s
Downloading cached cargo-package-xpct from https://cache.nix-ci.com
18.92 s
Downloaded cached cargo-package-windows_x86_64_gnu (12.1 MiB) in 216ms
18.92 s
Progress: 0 of 1 built, 588 of 675 downloaded from cache (15 downloading)
18.92 s
Downloading cached cargo-package-xprec from https://cache.nix-ci.com
18.92 s
Downloaded cached cargo-package-windows_x86_64_gnu (12.1 MiB) in 195ms
18.92 s
Progress: 0 of 1 built, 589 of 675 downloaded from cache (15 downloading)
18.92 s
Downloading cached cargo-package-zerocopy from https://cache.nix-ci.com
18.93 s
Downloaded cached cargo-package-winnow (1.3 MiB) in 153ms
18.93 s
Progress: 0 of 1 built, 590 of 675 downloaded from cache (15 downloading)
18.93 s
Downloading cached cargo-package-zerocopy-derive from https://cache.nix-ci.com
18.93 s
Downloaded cached cargo-package-winnow (1.3 MiB) in 147ms
18.93 s
Progress: 0 of 1 built, 591 of 675 downloaded from cache (15 downloading)
18.93 s
Downloading cached cargo-package-zmij from https://cache.nix-ci.com
18.95 s
Downloaded cached cargo-package-wit-bindgen (285 KiB) in 148ms
18.95 s
Progress: 0 of 1 built, 592 of 675 downloaded from cache (15 downloading)
18.95 s
Downloading cached gcc-15.2.0-libgcc from https://cache.nix-ci.com
18.95 s
Downloaded cached gcc-15.2.0-libgcc in 0ms
18.95 s
Progress: 0 of 1 built, 593 of 675 downloaded from cache (15 downloading)
18.95 s
Downloading cached libunistring from https://cache.nix-ci.com
18.95 s
Downloaded cached libunistring in 0ms
18.95 s
Progress: 0 of 1 built, 594 of 675 downloaded from cache (15 downloading)
18.95 s
Downloading cached linkLockedDeps from https://cache.nix-ci.com
18.95 s
Downloaded cached cargo-package-windows_x86_64_msvc (5 MiB) in 178ms
18.95 s
Progress: 0 of 1 built, 595 of 675 downloaded from cache (15 downloading)
18.95 s
Downloading cached libidn2 from https://cache.nix-ci.com
18.95 s
Downloaded cached libidn2 in 0ms
18.95 s
Progress: 0 of 1 built, 596 of 675 downloaded from cache (15 downloading)
18.95 s
Downloading cached publicsuffix-list-0-unstable-2026-05 from https://cache.nix-ci.com
18.95 s
Downloaded cached publicsuffix-list-0-unstable-2026-05 in 0ms
18.95 s
Progress: 0 of 1 built, 597 of 675 downloaded from cache (15 downloading)
18.95 s
Downloading cached glibc-2.42 from https://cache.nix-ci.com
18.95 s
Downloaded cached glibc-2.42 in 0ms
18.95 s
Progress: 0 of 1 built, 598 of 675 downloaded from cache (15 downloading)
18.95 s
Downloading cached attr from https://cache.nix-ci.com
18.95 s
Downloaded cached attr in 0ms
18.95 s
Progress: 0 of 1 built, 599 of 675 downloaded from cache (15 downloading)
18.95 s
Downloading cached aws-c-common from https://cache.nix-ci.com
18.95 s
Downloaded cached aws-c-common in 0ms
18.95 s
Progress: 0 of 1 built, 600 of 675 downloaded from cache (15 downloading)
18.95 s
Downloading cached acl from https://cache.nix-ci.com
18.95 s
Downloaded cached acl in 0ms
18.95 s
Progress: 0 of 1 built, 601 of 675 downloaded from cache (15 downloading)
18.95 s
Downloading cached aws-c-compression from https://cache.nix-ci.com
18.95 s
Downloaded cached aws-c-compression in 0ms
18.95 s
Progress: 0 of 1 built, 602 of 675 downloaded from cache (15 downloading)
18.95 s
Downloading cached aws-c-sdkutils from https://cache.nix-ci.com
18.95 s
Downloaded cached aws-c-sdkutils in 0ms
18.95 s
Progress: 0 of 1 built, 603 of 675 downloaded from cache (15 downloading)
18.95 s
Downloading cached aws-checksums from https://cache.nix-ci.com
18.95 s
Downloaded cached aws-checksums in 0ms
18.95 s
Progress: 0 of 1 built, 604 of 675 downloaded from cache (15 downloading)
18.95 s
Downloading cached bash from https://cache.nix-ci.com
18.95 s
Downloaded cached bash in 0ms
18.95 s
Progress: 0 of 1 built, 605 of 675 downloaded from cache (15 downloading)
18.95 s
Downloading cached brotli-1.2.0-lib from https://cache.nix-ci.com
18.95 s
Downloaded cached brotli-1.2.0-lib in 0ms
18.95 s
Progress: 0 of 1 built, 606 of 675 downloaded from cache (15 downloading)
18.95 s
Downloading cached bzip2 from https://cache.nix-ci.com
18.95 s
Downloaded cached bzip2 in 0ms
18.95 s
Progress: 0 of 1 built, 607 of 675 downloaded from cache (15 downloading)
18.95 s
Downloading cached editline-1.17.1-unstable-2025-05 from https://cache.nix-ci.com
18.95 s
Downloaded cached editline-1.17.1-unstable-2025-05 in 0ms
18.95 s
Progress: 0 of 1 built, 608 of 675 downloaded from cache (15 downloading)
18.95 s
Downloading cached gcc-15.2.0-lib from https://cache.nix-ci.com
18.95 s
Downloaded cached gcc-15.2.0-lib in 0ms
18.95 s
Progress: 0 of 1 built, 609 of 675 downloaded from cache (15 downloading)
18.95 s
Downloading cached hwloc-2.14.0-lib from https://cache.nix-ci.com
18.95 s
Downloaded cached hwloc-2.14.0-lib in 0ms
18.95 s
Progress: 0 of 1 built, 610 of 675 downloaded from cache (15 downloading)
18.95 s
Downloading cached boehm-gc from https://cache.nix-ci.com
18.95 s
Downloaded cached boehm-gc in 0ms
18.95 s
Progress: 0 of 1 built, 611 of 675 downloaded from cache (15 downloading)
18.95 s
Downloading cached icu4c from https://cache.nix-ci.com
18.95 s
Downloaded cached icu4c in 0ms
18.95 s
Progress: 0 of 1 built, 612 of 675 downloaded from cache (15 downloading)
18.95 s
Downloading cached keyutils-1.6.3-lib from https://cache.nix-ci.com
18.95 s
Downloaded cached keyutils-1.6.3-lib in 0ms
18.95 s
Progress: 0 of 1 built, 613 of 675 downloaded from cache (15 downloading)
18.95 s
Downloaded cached cargo-package-windows_x86_64_gnullvm (4.9 MiB) in 195ms
18.95 s
Downloading cached libcpuid from https://cache.nix-ci.com
18.95 s
Progress: 0 of 1 built, 614 of 675 downloaded from cache (15 downloading)
18.95 s
Downloaded cached libcpuid in 0ms
18.95 s
Downloading cached libpsl from https://cache.nix-ci.com
18.95 s
Progress: 0 of 1 built, 615 of 675 downloaded from cache (15 downloading)
18.95 s
Downloaded cached libpsl in 0ms
18.95 s
Downloading cached libseccomp-2.6.0-lib from https://cache.nix-ci.com
18.95 s
Downloaded cached libseccomp-2.6.0-lib in 0ms
18.95 s
Progress: 0 of 1 built, 616 of 675 downloaded from cache (15 downloading)
18.95 s
Progress: 0 of 1 built, 617 of 675 downloaded from cache (15 downloading)
18.95 s
Downloading cached libsodium-1.0.22-unstable-2026-04 from https://cache.nix-ci.com
18.95 s
Downloaded cached libsodium-1.0.22-unstable-2026-04 in 0ms
18.95 s
Downloading cached libxml2 from https://cache.nix-ci.com
18.95 s
Progress: 0 of 1 built, 618 of 675 downloaded from cache (15 downloading)
18.95 s
Downloaded cached libxml2 in 0ms
18.95 s
Downloading cached llhttp from https://cache.nix-ci.com
18.95 s
Progress: 0 of 1 built, 619 of 675 downloaded from cache (15 downloading)
18.95 s
Downloaded cached llhttp in 0ms
18.95 s
Downloading cached lowdown-3.0.1-lib from https://cache.nix-ci.com
18.95 s
Downloaded cached lowdown-3.0.1-lib in 0ms
18.95 s
Progress: 0 of 1 built, 620 of 675 downloaded from cache (15 downloading)
18.95 s
Progress: 0 of 1 built, 621 of 675 downloaded from cache (14 downloading)
18.95 s
Downloading cached nghttp2-1.69.0-lib from https://cache.nix-ci.com
18.95 s
Downloaded cached nghttp2-1.69.0-lib in 0ms
18.95 s
Downloading cached nghttp3 from https://cache.nix-ci.com
18.95 s
Progress: 0 of 1 built, 622 of 675 downloaded from cache (15 downloading)
18.95 s
Downloaded cached nghttp3 in 0ms
18.95 s
Downloading cached onetbb from https://cache.nix-ci.com
18.95 s
Progress: 0 of 1 built, 623 of 675 downloaded from cache (15 downloading)
18.95 s
Downloaded cached onetbb in 0ms
18.95 s
Downloading cached openssl from https://cache.nix-ci.com
18.95 s
Progress: 0 of 1 built, 624 of 675 downloaded from cache (15 downloading)
18.95 s
Downloaded cached openssl in 0ms
18.95 s
Downloading cached pcre2 from https://cache.nix-ci.com
18.95 s
Progress: 0 of 1 built, 625 of 675 downloaded from cache (15 downloading)
18.95 s
Downloaded cached pcre2 in 0ms
18.95 s
Downloading cached libblake3 from https://cache.nix-ci.com
18.96 s
Downloaded cached libblake3 in 0ms
18.96 s
Progress: 0 of 1 built, 626 of 675 downloaded from cache (15 downloading)
18.96 s
Downloading cached aws-c-cal from https://cache.nix-ci.com
18.96 s
Progress: 0 of 1 built, 627 of 675 downloaded from cache (15 downloading)
18.96 s
Downloaded cached aws-c-cal in 0ms
18.96 s
Progress: 0 of 1 built, 628 of 675 downloaded from cache (15 downloading)
18.96 s
Downloading cached krb5-1.22.2-lib from https://cache.nix-ci.com
18.96 s
Downloaded cached krb5-1.22.2-lib in 0ms
18.96 s
Downloading cached ngtcp2 from https://cache.nix-ci.com
18.96 s
Progress: 0 of 1 built, 629 of 675 downloaded from cache (15 downloading)
18.96 s
Downloaded cached ngtcp2 in 0ms
18.96 s
Progress: 0 of 1 built, 630 of 675 downloaded from cache (15 downloading)
18.96 s
Downloading cached s2n-tls from https://cache.nix-ci.com
18.96 s
Downloaded cached s2n-tls in 0ms
18.96 s
Progress: 0 of 1 built, 631 of 675 downloaded from cache (15 downloading)
18.96 s
Downloading cached xz from https://cache.nix-ci.com
18.96 s
Downloaded cached xz in 0ms
18.96 s
Progress: 0 of 1 built, 632 of 675 downloaded from cache (15 downloading)
18.96 s
Downloading cached zlib from https://cache.nix-ci.com
18.96 s
Downloaded cached zlib in 0ms
18.96 s
Progress: 0 of 1 built, 633 of 675 downloaded from cache (15 downloading)
18.96 s
Downloading cached aws-c-io from https://cache.nix-ci.com
18.96 s
Downloaded cached aws-c-io in 0ms
18.96 s
Downloading cached zstd from https://cache.nix-ci.com
18.96 s
Progress: 0 of 1 built, 634 of 675 downloaded from cache (15 downloading)
18.96 s
Downloaded cached zstd in 0ms
18.96 s
Downloading cached libssh2 from https://cache.nix-ci.com
18.96 s
Progress: 0 of 1 built, 635 of 675 downloaded from cache (15 downloading)
18.96 s
Downloaded cached libssh2 in 0ms
18.96 s
Downloading cached aws-c-event-stream from https://cache.nix-ci.com
18.96 s
Downloaded cached aws-c-event-stream in 0ms
18.96 s
Progress: 0 of 1 built, 636 of 675 downloaded from cache (15 downloading)
18.96 s
Progress: 0 of 1 built, 637 of 675 downloaded from cache (14 downloading)
18.96 s
Downloading cached aws-c-http from https://cache.nix-ci.com
18.96 s
Downloaded cached aws-c-http in 0ms
18.96 s
Downloading cached boost from https://cache.nix-ci.com
18.96 s
Downloaded cached boost in 0ms
18.96 s
Progress: 0 of 1 built, 638 of 675 downloaded from cache (15 downloading)
18.96 s
Progress: 0 of 1 built, 639 of 675 downloaded from cache (14 downloading)
18.96 s
Downloading cached curl from https://cache.nix-ci.com
18.96 s
Downloaded cached curl in 0ms
18.96 s
Downloading cached libarchive-3.8.8-lib from https://cache.nix-ci.com
18.96 s
Downloaded cached libarchive-3.8.8-lib in 0ms
18.96 s
Progress: 0 of 1 built, 640 of 675 downloaded from cache (15 downloading)
18.96 s
Progress: 0 of 1 built, 641 of 675 downloaded from cache (15 downloading)
18.96 s
Downloading cached aws-c-auth from https://cache.nix-ci.com
18.96 s
Downloaded cached aws-c-auth in 0ms
18.96 s
Downloading cached aws-c-mqtt from https://cache.nix-ci.com
18.96 s
Downloaded cached aws-c-mqtt in 0ms
18.96 s
Progress: 0 of 1 built, 642 of 675 downloaded from cache (15 downloading)
18.96 s
Downloading cached libgit2-1.9.4-lib from https://cache.nix-ci.com
18.96 s
Downloaded cached libgit2-1.9.4-lib in 0ms
18.96 s
Progress: 0 of 1 built, 643 of 675 downloaded from cache (15 downloading)
18.96 s
Progress: 0 of 1 built, 644 of 675 downloaded from cache (15 downloading)
18.96 s
Downloading cached aws-c-s3 from https://cache.nix-ci.com
18.96 s
Downloaded cached aws-c-s3 in 0ms
18.96 s
Downloading cached nix-util from https://cache.nix-ci.com
18.96 s
Progress: 0 of 1 built, 645 of 675 downloaded from cache (15 downloading)
18.96 s
Downloaded cached nix-util in 0ms
18.96 s
Downloading cached sqlite from https://cache.nix-ci.com
18.96 s
Progress: 0 of 1 built, 646 of 675 downloaded from cache (15 downloading)
18.96 s
Downloaded cached sqlite in 0ms
18.96 s
Downloading cached aws-crt-cpp from https://cache.nix-ci.com
18.96 s
Downloaded cached aws-crt-cpp in 0ms
18.96 s
Progress: 0 of 1 built, 647 of 675 downloaded from cache (15 downloading)
18.96 s
Downloading cached nix-nswrapper from https://cache.nix-ci.com
18.96 s
Downloaded cached nix-nswrapper in 0ms
18.96 s
Progress: 0 of 1 built, 648 of 675 downloaded from cache (15 downloading)
18.96 s
Downloading cached nix-store from https://cache.nix-ci.com
18.96 s
Downloaded cached nix-store in 0ms
18.96 s
Progress: 0 of 1 built, 649 of 675 downloaded from cache (15 downloading)
18.96 s
Progress: 0 of 1 built, 650 of 675 downloaded from cache (14 downloading)
18.96 s
Downloading cached nix-fetchers from https://cache.nix-ci.com
18.96 s
Downloaded cached nix-fetchers in 0ms
18.96 s
Downloading cached nix-main from https://cache.nix-ci.com
18.96 s
Downloaded cached nix-main in 0ms
18.96 s
Progress: 0 of 1 built, 651 of 675 downloaded from cache (15 downloading)
18.96 s
Progress: 0 of 1 built, 652 of 675 downloaded from cache (15 downloading)
18.96 s
Downloading cached nix-expr from https://cache.nix-ci.com
18.96 s
Downloaded cached nix-expr in 0ms
18.96 s
Progress: 0 of 1 built, 653 of 675 downloaded from cache (14 downloading)
18.96 s
Downloading cached nix-flake from https://cache.nix-ci.com
18.98 s
Downloaded cached cargo-package-wit-bindgen (274 KiB) in 187ms
18.98 s
Progress: 0 of 1 built, 654 of 675 downloaded from cache (14 downloading)
18.99 s
Downloaded cached cargo-package-wit-bindgen-rust (265 KiB) in 172ms
18.99 s
Progress: 0 of 1 built, 655 of 675 downloaded from cache (13 downloading)
18.99 s
Downloaded cached cargo-package-wit-bindgen-core (167 KiB) in 178ms
18.99 s
Progress: 0 of 1 built, 656 of 675 downloaded from cache (12 downloading)
19.04 s
Downloaded cached cargo-package-wit-bindgen-rust-macro (59 KiB) in 193ms
19.04 s
Progress: 0 of 1 built, 657 of 675 downloaded from cache (11 downloading)
19.05 s
Downloaded cached cargo-package-wyz (63 KiB) in 143ms
19.05 s
Progress: 0 of 1 built, 658 of 675 downloaded from cache (10 downloading)
19.07 s
Downloaded cached cargo-package-xprec (141 KiB) in 148ms
19.07 s
Progress: 0 of 1 built, 659 of 675 downloaded from cache (9 downloading)
19.08 s
Downloaded cached cargo-package-wit-parser (948 KiB) in 220ms
19.08 s
Progress: 0 of 1 built, 660 of 675 downloaded from cache (8 downloading)
19.08 s
Downloaded cached cargo-package-zmij (95 KiB) in 151ms
19.08 s
Progress: 0 of 1 built, 661 of 675 downloaded from cache (7 downloading)
19.09 s
Downloaded cached cargo-package-zerocopy (1.7 MiB) in 168ms
19.09 s
Progress: 0 of 1 built, 662 of 675 downloaded from cache (6 downloading)
19.10 s
Downloaded cached cargo-package-wit-component (1.6 MiB) in 243ms
19.10 s
Progress: 0 of 1 built, 663 of 675 downloaded from cache (5 downloading)
19.10 s
Downloaded cached cargo-package-xpct (654 KiB) in 183ms
19.10 s
Progress: 0 of 1 built, 664 of 675 downloaded from cache (4 downloading)
19.12 s
Downloaded cached linkLockedDeps (1128 B) in 172ms
19.12 s
Progress: 0 of 1 built, 665 of 675 downloaded from cache (3 downloading)
19.12 s
Downloaded cached cargo-package-zerocopy-derive (973 KiB) in 191ms
19.12 s
Progress: 0 of 1 built, 666 of 675 downloaded from cache (2 downloading)
19.14 s
Downloaded cached cargo-package-windows (117.3 MiB) in 748ms
19.14 s
Progress: 0 of 1 built, 667 of 675 downloaded from cache (1 downloading)
19.14 s
Downloading cached vendor-registry from https://cache.nix-ci.com
19.15 s
Downloaded cached nix-flake (956 KiB) in 194ms
19.15 s
Progress: 0 of 1 built, 668 of 675 downloaded from cache (1 downloading)
19.15 s
Downloading cached nix-cmd from https://cache.nix-ci.com
19.22 s
Downloaded cached vendor-registry (162 KiB) in 81ms
19.22 s
Progress: 0 of 1 built, 669 of 675 downloaded from cache (1 downloading)
19.22 s
Downloading cached vendor-cargo-deps from https://cache.nix-ci.com
19.27 s
Downloaded cached vendor-cargo-deps (1752 B) in 43ms
19.27 s
Progress: 0 of 1 built, 670 of 675 downloaded from cache (1 downloading)
19.27 s
Downloading cached gammaloop-workspace-deps-deps from https://cache.nix-ci.com
19.34 s
Downloaded cached nix-cmd (1 MiB) in 183ms
19.34 s
Progress: 0 of 1 built, 671 of 675 downloaded from cache (1 downloading)
19.34 s
Downloading cached nix from https://cache.nix-ci.com
19.73 s
Downloaded cached nix (3.9 MiB) in 394ms
19.73 s
Progress: 0 of 1 built, 672 of 675 downloaded from cache (1 downloading)
20.10 s
Downloading cached nix from https://cache.nix-ci.com
20.13 s
Downloaded cached nix (8848 B) in 27ms
20.13 s
Progress: 0 of 1 built, 673 of 675 downloaded from cache (1 downloading)
34.78 s
Downloaded cached gammaloop-workspace-deps-deps (354.2 MiB) in 15.5s
34.83 s
Progress: 0 of 1 built, 674 of 675 downloaded from cache
34.83 s
Downloading cached nix-ci-check-gammaloop-doctest from https://cache.nix-ci.com
34.83 s
Downloaded cached nix-ci-check-gammaloop-doctest (1000 B) in 0ms
34.83 s
Progress: 0 of 1 built, 675 of 675 downloaded from cache
46.35 s
evaluating derivation 'g
copying '/nix/store/lvky
evaluating derivation 'g
querying gammaloop-works
querying info about miss
querying gammaloop-works
[0 /8 built, 3 /0 /4 copied
[0 /7 built, 2 /1 /4 copied
57.77 s
[0 /6 built, 1 /2 /4 copied
69.79 s
[0 /2 built, 4 copied (59
[1 /0 /1 built, 4 copied (gammaloop-workspace-doctest> Running phase: unpackPhase
69.83 s
gammaloop-workspace-doctest> unpacking source archive /nix/store/n62xwv096bc248rr6y7qpggfdbwshkw9-source
69.93 s
gammaloop-workspace-doctest> source root is source
69.95 s
gammaloop-workspace-doctest> Running phase: patchPhase
69.95 s
gammaloop-workspace-doctest> Executing configureCargoCommonVars
69.96 s
gammaloop-workspace-doctest> decompressing cargo artifacts from /nix/store/kbgwngi7xvi54jsr0kp8rhj1b9mfja7d-gammaloop-workspace-deps-deps-0.1.0/target.tar.zst to target
71.96 s
gammaloop-workspace-doctest> Running phase: updateAutotoolsGnuConfigScriptsPhase
72.01 s
gammaloop-workspace-doctest> Running phase: configurePhase
72.01 s
gammaloop-workspace-doctest> will append /build/source/.cargo-home/config.toml with contents of /nix/store/xdy1vvhll2bijdplvl9fcc2b9plkxhaa-vendor-cargo-deps/config.toml
72.02 s
gammaloop-workspace-doctest> default configurePhase, nothing to do
72.02 s
gammaloop-workspace-doctest> Running phase: buildPhase
72.08 s
gammaloop-workspace-doctest> +++ command cargo --version
72.08 s
gammaloop-workspace-doctest> cargo 1.97.0 (c980f4866 2026-06-30)
72.12 s
gammaloop-workspace-doctest> +++ command cargo test --profile ci-optim --doc --locked --workspace --features gammaloop-api/cli,gammaloop-tracing-filter/clap,gammaloop-tracing-filter/symbolica,idenso/bincode,idenso/reference-cases,linnet/bincode,linnet/drawing,linnet/nodestore-vec,linnet/rkyv,linnet/serde,linnet/symbolica,spenso-macros/shadowing,spenso/shadowing,symbolica/tracing_max_level_info
73.56 s
gammaloop-workspace-doctest> Compiling target-lexicon v0.13.5
73.58 s
gammaloop-workspace-doctest> Compiling symbolica v2.2.0 (https://github.com/symbolica-dev/symbolica?branch=dev#0441bd7a)
73.58 s
gammaloop-workspace-doctest> Compiling maplit v1.0.2
73.60 s
gammaloop-workspace-doctest> Compiling gammaloop-tracing-filter-macros v0.1.0 (/build/source/crates/gammaloop-tracing-filter-macros)
73.60 s
gammaloop-workspace-doctest> Compiling vakint v0.1.2 (/build/source/crates/vakint)
73.60 s
gammaloop-workspace-doctest> Compiling gammalooprs v0.3.4 (/build/source/crates/gammalooprs)
73.60 s
gammaloop-workspace-doctest> Compiling alphal00p-docs-macros v0.1.0 (/build/source/crates/alphal00p-docs-macros)
73.61 s
gammaloop-workspace-doctest> Compiling alphal00p-docs-schema v0.1.0 (/build/source/crates/alphal00p-docs-schema)
73.61 s
gammaloop-workspace-doctest> Compiling rustc_version v0.4.1
73.61 s
gammaloop-workspace-doctest> Compiling bincode v1.3.3
73.61 s
gammaloop-workspace-doctest> Compiling iai-callgrind-runner v0.14.2
73.61 s
gammaloop-workspace-doctest> Compiling target-triple v1.0.1
73.61 s
gammaloop-workspace-doctest> Compiling gungraun-runner v0.18.2
73.61 s
gammaloop-workspace-doctest> Compiling clinnet v0.1.8 (/build/source/crates/clinnet)
73.64 s
gammaloop-workspace-doctest> Compiling gammaloop-integration-tests v0.1.0 (/build/source/tests)
74.10 s
gammaloop-workspace-doctest> Compiling test-log-core v0.2.20
74.13 s
gammaloop-workspace-doctest> Compiling wait-timeout v0.2.1
74.16 s
gammaloop-workspace-doctest> Compiling iai-callgrind v0.14.2
74.16 s
gammaloop-workspace-doctest> Compiling bit-vec v0.8.0
74.18 s
gammaloop-workspace-doctest> Compiling quick-error v1.2.3
74.31 s
gammaloop-workspace-doctest> Compiling rusty-fork v0.3.1
74.51 s
gammaloop-workspace-doctest> Compiling bit-set v0.8.0
74.52 s
gammaloop-workspace-doctest> Compiling iai-callgrind-macros v0.5.1
74.62 s
gammaloop-workspace-doctest> Compiling rand_xorshift v0.4.0
74.71 s
gammaloop-workspace-doctest> Compiling gungraun-macros v0.8.0
74.73 s
gammaloop-workspace-doctest> Compiling console v0.15.11
74.73 s
gammaloop-workspace-doctest> Compiling base64 v0.21.7
75.26 s
gammaloop-workspace-doctest> Compiling glob v0.3.4
75.59 s
gammaloop-workspace-doctest> Compiling termcolor v1.4.1
75.60 s
gammaloop-workspace-doctest> Compiling unarray v0.1.4
75.70 s
gammaloop-workspace-doctest> Compiling proptest v1.11.0
75.70 s
gammaloop-workspace-doctest> Compiling alphal00p-docs-builder v0.1.0 (/build/source/crates/alphal00p-docs-builder)
75.71 s
gammaloop-workspace-doctest> Compiling alphal00p-docs-catalogs v0.1.0 (/build/source/crates/alphal00p-docs-catalogs)
75.87 s
gammaloop-workspace-doctest> Compiling pyo3-build-config v0.28.3
76.02 s
gammaloop-workspace-doctest> Compiling trybuild v1.0.120
76.21 s
gammaloop-workspace-doctest> Compiling similar-asserts v1.7.0
76.24 s
gammaloop-workspace-doctest> Compiling ron v0.8.1
76.39 s
gammaloop-workspace-doctest> Compiling kurvst v0.1.0 (/build/source/crates/kurvst)
76.73 s
gammaloop-workspace-doctest> Compiling test-log-macros v0.2.20
79.30 s
gammaloop-workspace-doctest> Compiling test-log v0.2.20
80.80 s
gammaloop-workspace-doctest> Compiling alphal00p-docs-examples v0.1.0 (/build/source/crates/alphal00p-docs-examples)
83.02 s
gammaloop-workspace-doctest> Compiling pyo3-macros-backend v0.28.3
83.04 s
gammaloop-workspace-doctest> Compiling pyo3-ffi v0.28.3
83.30 s
gammaloop-workspace-doctest> Compiling pyo3 v0.28.3
83.54 s
gammaloop-workspace-doctest> Compiling numpy v0.28.0
83.59 s
gammaloop-workspace-doctest> Compiling gammaloop-api v0.1.0 (/build/source/crates/gammaloop-api)
83.87 s
gammaloop-workspace-doctest> Compiling gungraun v0.18.2
89.09 s
gammaloop-workspace-doctest> Compiling pyo3-macros v0.28.3
93.95 s
gammaloop-workspace-doctest> Compiling pyo3-stub-gen v0.17.2
94.74 s
gammaloop-workspace-doctest> Compiling numerica v2.2.0 (https://github.com/symbolica-dev/symbolica?branch=dev#0441bd7a)
97.50 s
gammaloop-workspace-doctest> Compiling graphica v2.1.0 (https://github.com/symbolica-dev/symbolica?branch=dev#0441bd7a)
99.83 s
gammaloop-workspace-doctest> Compiling symbolica-utils v0.1.0 (/build/source/crates/symbolica-utils)
244.45 s
gammaloop-workspace-doctest> Compiling gammaloop-workspace-hack v0.1.0 (/build/source/crates/gammaloop-workspace-hack)
244.50 s
gammaloop-workspace-doctest> Compiling spenso-macros v0.3.2 (/build/source/crates/spenso-macros)
244.59 s
gammaloop-workspace-doctest> Compiling linnet v0.17.0 (/build/source/crates/linnet)
247.39 s
gammaloop-workspace-doctest> Compiling spenso v0.6.0 (/build/source/crates/spenso)
253.87 s
gammaloop-workspace-doctest> Compiling idenso v0.3.0 (/build/source/crates/idenso)
253.92 s
gammaloop-workspace-doctest> Compiling gammaloop-tracing-filter v0.1.0 (/build/source/crates/gammaloop-tracing-filter)
257.01 s
gammaloop-workspace-doctest> Compiling spenso-hep-lib v0.1.7 (/build/source/crates/spenso-hep-lib)
257.21 s
gammaloop-workspace-doctest> Compiling spynso3 v0.1.2 (/build/source/crates/spynso3)
296.14 s
gammaloop-workspace-doctest> Compiling linnest v0.1.0 (/build/source/crates/linnest)
297.74 s
gammaloop-workspace-doctest> Compiling linnet-py v0.1.0 (/build/source/crates/linnet-py)
391.81 s
gammaloop-workspace-doctest> Finished `ci-optim` profile [optimized] target(s) in 5m 19s
391.92 s
gammaloop-workspace-doctest> warning : the following packages contain code that will be rejected by a future version of Rust: proc-macro-error2 v2.0.1
391.92 s
gammaloop-workspace-doctest> note : to see what the problems were, use the option `--future-incompat-report`, or run `cargo report future-incompatibilities --id 1`
391.94 s
gammaloop-workspace-doctest> Doc-tests alphal00p_docs_builder
392.07 s
gammaloop-workspace-doctest>
392.07 s
gammaloop-workspace-doctest> running 0 tests
392.07 s
gammaloop-workspace-doctest>
392.07 s
gammaloop-workspace-doctest> test result: ok. 0 passed; 0 failed; 0 ignored; 0 measured; 0 filtered out; finished in 0.00s
392.07 s
gammaloop-workspace-doctest>
392.07 s
gammaloop-workspace-doctest> Doc-tests alphal00p_docs_catalogs
393.15 s
gammaloop-workspace-doctest>
393.15 s
gammaloop-workspace-doctest> running 0 tests
393.15 s
gammaloop-workspace-doctest>
393.15 s
gammaloop-workspace-doctest> test result: ok. 0 passed; 0 failed; 0 ignored; 0 measured; 0 filtered out; finished in 0.00s
393.15 s
gammaloop-workspace-doctest>
393.15 s
gammaloop-workspace-doctest> Doc-tests alphal00p_docs_examples
393.16 s
gammaloop-workspace-doctest>
393.16 s
gammaloop-workspace-doctest> running 0 tests
393.16 s
gammaloop-workspace-doctest>
393.16 s
gammaloop-workspace-doctest> test result: ok. 0 passed; 0 failed; 0 ignored; 0 measured; 0 filtered out; finished in 0.00s
393.16 s
gammaloop-workspace-doctest>
393.16 s
gammaloop-workspace-doctest> Doc-tests alphal00p_docs
393.21 s
gammaloop-workspace-doctest>
393.21 s
gammaloop-workspace-doctest> running 0 tests
393.21 s
gammaloop-workspace-doctest>
393.21 s
gammaloop-workspace-doctest> test result: ok. 0 passed; 0 failed; 0 ignored; 0 measured; 0 filtered out; finished in 0.00s
393.21 s
gammaloop-workspace-doctest>
393.21 s
gammaloop-workspace-doctest> Doc-tests alphal00p_docs_schema
393.28 s
gammaloop-workspace-doctest>
393.28 s
gammaloop-workspace-doctest> running 0 tests
393.28 s
gammaloop-workspace-doctest>
393.28 s
gammaloop-workspace-doctest> test result: ok. 0 passed; 0 failed; 0 ignored; 0 measured; 0 filtered out; finished in 0.00s
393.28 s
gammaloop-workspace-doctest>
393.28 s
gammaloop-workspace-doctest> Doc-tests clinnet
393.32 s
gammaloop-workspace-doctest>
393.32 s
gammaloop-workspace-doctest> running 0 tests
393.32 s
gammaloop-workspace-doctest>
393.32 s
gammaloop-workspace-doctest> test result: ok. 0 passed; 0 failed; 0 ignored; 0 measured; 0 filtered out; finished in 0.00s
393.32 s
gammaloop-workspace-doctest>
393.32 s
gammaloop-workspace-doctest> Doc-tests gammaloop_api
394.18 s
gammaloop-workspace-doctest>
394.18 s
gammaloop-workspace-doctest> running 13 tests
394.19 s
gammaloop-workspace-doctest> test crates/gammaloop-api/src/python.rs - python::GammaLoopAPI::get_active_command_blocks (line 3652) ... FAILED
394.19 s
gammaloop-workspace-doctest> test crates/gammaloop-api/src/python.rs - python::GammaLoopAPI::get_default_runtime_settings (line 3688) ... FAILED
394.19 s
gammaloop-workspace-doctest> test crates/gammaloop-api/src/python.rs - python::GammaLoopAPI::evaluate_sample (line 2926) ... FAILED
394.19 s
gammaloop-workspace-doctest> test crates/gammaloop-api/src/python.rs - python::GammaLoopAPI::get_integrand_info (line 3496) ... FAILED
394.19 s
gammaloop-workspace-doctest> test crates/gammaloop-api/src/python.rs - python::GammaLoopAPI::evaluate_samples (line 3040) ... FAILED
394.19 s
gammaloop-workspace-doctest> test crates/gammaloop-api/src/python.rs - python::GammaLoopAPI::get_integrand_settings (line 3539) ... FAILED
394.28 s
gammaloop-workspace-doctest> test crates/gammaloop-api/src/python.rs - python::GammaLoopAPI::run_command (line 3793) ... FAILED
394.28 s
gammaloop-workspace-doctest> test crates/gammaloop-api/src/python.rs - python::GammaLoopAPI::get_run_history (line 3603) ... FAILED
394.28 s
gammaloop-workspace-doctest> test crates/gammaloop-api/src/python.rs - python::GammaLoopAPI::get_global_settings (line 3631) ... FAILED
394.29 s
gammaloop-workspace-doctest> test crates/gammaloop-api/src/python.rs - python::evaluate_graph_overall_factor (line 95) ... FAILED
394.29 s
gammaloop-workspace-doctest> test crates/gammaloop-api/src/python.rs - python::atom_to_dots (line 157) ... FAILED
394.29 s
gammaloop-workspace-doctest> test crates/gammaloop-api/src/python.rs - python::atom_to_canonical_string (line 128) ... FAILED
394.30 s
gammaloop-workspace-doctest> test crates/gammaloop-api/src/python.rs - python::GammaLoopAPI::new_python (line 2804) ... FAILED
394.30 s
gammaloop-workspace-doctest>
394.30 s
gammaloop-workspace-doctest> failures:
394.30 s
gammaloop-workspace-doctest>
394.30 s
gammaloop-workspace-doctest> ---- crates/gammaloop-api/src/python.rs - python::GammaLoopAPI::get_active_command_blocks (line 3652) stdout ----
394.30 s
gammaloop-workspace-doctest> error: expected item, found keyword `for`
394.30 s
gammaloop-workspace-doctest> --> crates/gammaloop-api/src/python.rs:3653:1
394.30 s
gammaloop-workspace-doctest> |
394.30 s
gammaloop-workspace-doctest> 3653 | for name, commands in api.get_active_command_blocks().items():
394.30 s
gammaloop-workspace-doctest> | ^^^ expected item
394.30 s
gammaloop-workspace-doctest> |
394.30 s
gammaloop-workspace-doctest> = note: for a full list of items that can appear in modules, see <https://doc.rust-lang.org/reference/items.html>
394.30 s
gammaloop-workspace-doctest>
394.30 s
gammaloop-workspace-doctest> error: aborting due to 1 previous error
394.30 s
gammaloop-workspace-doctest>
394.30 s
gammaloop-workspace-doctest> Couldn't compile the test.
394.30 s
gammaloop-workspace-doctest> ---- crates/gammaloop-api/src/python.rs - python::GammaLoopAPI::get_default_runtime_settings (line 3688) stdout ----
394.30 s
gammaloop-workspace-doctest> error: expected one of `!` or `::`, found `=`
394.30 s
gammaloop-workspace-doctest> --> crates/gammaloop-api/src/python.rs:3689:9
394.30 s
gammaloop-workspace-doctest> |
394.30 s
gammaloop-workspace-doctest> 3689 | runtime = api.get_default_runtime_settings()
394.30 s
gammaloop-workspace-doctest> | ^ expected one of `!` or `::`
394.30 s
gammaloop-workspace-doctest>
394.30 s
gammaloop-workspace-doctest> error: aborting due to 1 previous error
394.30 s
gammaloop-workspace-doctest>
394.30 s
gammaloop-workspace-doctest> Couldn't compile the test.
394.30 s
gammaloop-workspace-doctest> ---- crates/gammaloop-api/src/python.rs - python::GammaLoopAPI::evaluate_sample (line 2926) stdout ----
394.30 s
gammaloop-workspace-doctest> error: expected one of `!` or `::`, found `=`
394.30 s
gammaloop-workspace-doctest> --> crates/gammaloop-api/src/python.rs:2927:8
394.30 s
gammaloop-workspace-doctest> |
394.30 s
gammaloop-workspace-doctest> 2927 | result = api.evaluate_sample(point, process_id=0, minimal_output=True)
394.30 s
gammaloop-workspace-doctest> | ^ expected one of `!` or `::`
394.30 s
gammaloop-workspace-doctest>
394.30 s
gammaloop-workspace-doctest> error: aborting due to 1 previous error
394.30 s
gammaloop-workspace-doctest>
394.30 s
gammaloop-workspace-doctest> Couldn't compile the test.
394.30 s
gammaloop-workspace-doctest> ---- crates/gammaloop-api/src/python.rs - python::GammaLoopAPI::get_integrand_info (line 3496) stdout ----
394.30 s
gammaloop-workspace-doctest> error: expected one of `!` or `::`, found `=`
394.30 s
gammaloop-workspace-doctest> --> crates/gammaloop-api/src/python.rs:3497:6
394.30 s
gammaloop-workspace-doctest> |
394.30 s
gammaloop-workspace-doctest> 3497 | info = api.get_integrand_info(process_id=0)
394.30 s
gammaloop-workspace-doctest> | ^ expected one of `!` or `::`
394.30 s
gammaloop-workspace-doctest>
394.30 s
gammaloop-workspace-doctest> error: aborting due to 1 previous error
394.30 s
gammaloop-workspace-doctest>
394.30 s
gammaloop-workspace-doctest> Couldn't compile the test.
394.30 s
gammaloop-workspace-doctest> ---- crates/gammaloop-api/src/python.rs - python::GammaLoopAPI::evaluate_samples (line 3040) stdout ----
394.30 s
gammaloop-workspace-doctest> error: expected one of `!` or `::`, found `=`
394.30 s
gammaloop-workspace-doctest> --> crates/gammaloop-api/src/python.rs:3041:8
394.30 s
gammaloop-workspace-doctest> |
394.30 s
gammaloop-workspace-doctest> 3041 | points = numpy.asarray(points, dtype=numpy.float64)
394.30 s
gammaloop-workspace-doctest> | ^ expected one of `!` or `::`
394.30 s
gammaloop-workspace-doctest>
394.30 s
gammaloop-workspace-doctest> error: aborting due to 1 previous error
394.30 s
gammaloop-workspace-doctest>
394.30 s
gammaloop-workspace-doctest> Couldn't compile the test.
394.30 s
gammaloop-workspace-doctest> ---- crates/gammaloop-api/src/python.rs - python::GammaLoopAPI::get_integrand_settings (line 3539) stdout ----
394.30 s
gammaloop-workspace-doctest> error: expected one of `!` or `::`, found `=`
394.30 s
gammaloop-workspace-doctest> --> crates/gammaloop-api/src/python.rs:3540:10
394.30 s
gammaloop-workspace-doctest> |
394.30 s
gammaloop-workspace-doctest> 3540 | settings = api.get_integrand_settings(process_id=0)
394.30 s
gammaloop-workspace-doctest> | ^ expected one of `!` or `::`
394.30 s
gammaloop-workspace-doctest>
394.30 s
gammaloop-workspace-doctest> error: aborting due to 1 previous error
394.30 s
gammaloop-workspace-doctest>
394.30 s
gammaloop-workspace-doctest> Couldn't compile the test.
394.30 s
gammaloop-workspace-doctest> ---- crates/gammaloop-api/src/python.rs - python::GammaLoopAPI::run_command (line 3793) stdout ----
394.30 s
gammaloop-workspace-doctest> error[E0425] : cannot find value `api` in this scope
394.30 s
gammaloop-workspace-doctest> --> crates/gammaloop-api/src/python.rs:3794:1
394.30 s
gammaloop-workspace-doctest> |
394.30 s
gammaloop-workspace-doctest> 3794 | api.run("display processes")
394.30 s
gammaloop-workspace-doctest> | ^^^ not found in this scope
394.30 s
gammaloop-workspace-doctest>
394.30 s
gammaloop-workspace-doctest> error : aborting due to 1 previous error
394.30 s
gammaloop-workspace-doctest>
394.30 s
gammaloop-workspace-doctest> For more information about this error, try `rustc --explain E0425`.
394.30 s
gammaloop-workspace-doctest> Couldn't compile the test.
394.30 s
gammaloop-workspace-doctest> ---- crates/gammaloop-api/src/python.rs - python::GammaLoopAPI::get_run_history (line 3603) stdout ----
394.30 s
gammaloop-workspace-doctest> error[E0425] : cannot find value `run_card_toml` in this scope
394.30 s
gammaloop-workspace-doctest> --> crates/gammaloop-api/src/python.rs:3604:1
394.30 s
gammaloop-workspace-doctest> |
394.30 s
gammaloop-workspace-doctest> 3604 | run_card_toml = api.get_run_history()
394.30 s
gammaloop-workspace-doctest> | ^^^^^^^^^^^^^
394.30 s
gammaloop-workspace-doctest> |
394.30 s
gammaloop-workspace-doctest> help : you might have meant to introduce a new binding
394.30 s
gammaloop-workspace-doctest> |
394.30 s
gammaloop-workspace-doctest> 3604 | let run_card_toml = api.get_run_history()
394.30 s
gammaloop-workspace-doctest> | +++
394.30 s
gammaloop-workspace-doctest>
394.30 s
gammaloop-workspace-doctest> error[E0425] : cannot find value `api` in this scope
394.30 s
gammaloop-workspace-doctest> --> crates/gammaloop-api/src/python.rs:3604:17
394.30 s
gammaloop-workspace-doctest> |
394.30 s
gammaloop-workspace-doctest> 3604 | run_card_toml = api.get_run_history()
394.30 s
gammaloop-workspace-doctest> | ^^^ not found in this scope
394.30 s
gammaloop-workspace-doctest>
394.30 s
gammaloop-workspace-doctest> error : aborting due to 2 previous errors
394.30 s
gammaloop-workspace-doctest>
394.30 s
gammaloop-workspace-doctest> For more information about this error, try `rustc --explain E0425`.
394.30 s
gammaloop-workspace-doctest> Couldn't compile the test.
394.30 s
gammaloop-workspace-doctest> ---- crates/gammaloop-api/src/python.rs - python::GammaLoopAPI::get_global_settings (line 3631) stdout ----
394.30 s
gammaloop-workspace-doctest> error[E0425] : cannot find value `settings_toml` in this scope
394.30 s
gammaloop-workspace-doctest> --> crates/gammaloop-api/src/python.rs:3632:1
394.30 s
gammaloop-workspace-doctest> |
394.30 s
gammaloop-workspace-doctest> 3632 | settings_toml = api.get_global_settings()
394.30 s
gammaloop-workspace-doctest> | ^^^^^^^^^^^^^
394.30 s
gammaloop-workspace-doctest> |
394.30 s
gammaloop-workspace-doctest> help : you might have meant to introduce a new binding
394.30 s
gammaloop-workspace-doctest> |
394.30 s
gammaloop-workspace-doctest> 3632 | let settings_toml = api.get_global_settings()
394.30 s
gammaloop-workspace-doctest> | +++
394.30 s
gammaloop-workspace-doctest>
394.30 s
gammaloop-workspace-doctest> error[E0425] : cannot find value `api` in this scope
394.30 s
gammaloop-workspace-doctest> --> crates/gammaloop-api/src/python.rs:3632:17
394.30 s
gammaloop-workspace-doctest> |
394.30 s
gammaloop-workspace-doctest> 3632 | settings_toml = api.get_global_settings()
394.30 s
gammaloop-workspace-doctest> | ^^^ not found in this scope
394.30 s
gammaloop-workspace-doctest>
394.30 s
gammaloop-workspace-doctest> error : aborting due to 2 previous errors
394.30 s
gammaloop-workspace-doctest>
394.30 s
gammaloop-workspace-doctest> For more information about this error, try `rustc --explain E0425`.
394.30 s
gammaloop-workspace-doctest> Couldn't compile the test.
394.30 s
gammaloop-workspace-doctest> ---- crates/gammaloop-api/src/python.rs - python::evaluate_graph_overall_factor (line 95) stdout ----
394.30 s
gammaloop-workspace-doctest> error[E0425] : cannot find function `evaluate_graph_overall_factor` in this scope
394.30 s
gammaloop-workspace-doctest> --> crates/gammaloop-api/src/python.rs:96:1
394.30 s
gammaloop-workspace-doctest> |
394.30 s
gammaloop-workspace-doctest> 96 | evaluate_graph_overall_factor(
394.30 s
gammaloop-workspace-doctest> | ^^^^^^^^^^^^^^^^^^^^^^^^^^^^^ not found in this scope
394.30 s
gammaloop-workspace-doctest>
394.30 s
gammaloop-workspace-doctest> error : aborting due to 1 previous error
394.30 s
gammaloop-workspace-doctest>
394.30 s
gammaloop-workspace-doctest> For more information about this error, try `rustc --explain E0425`.
394.30 s
gammaloop-workspace-doctest> Couldn't compile the test.
394.30 s
gammaloop-workspace-doctest> ---- crates/gammaloop-api/src/python.rs - python::atom_to_dots (line 157) stdout ----
394.30 s
gammaloop-workspace-doctest> error[E0425] : cannot find function `to_dots` in this scope
394.30 s
gammaloop-workspace-doctest> --> crates/gammaloop-api/src/python.rs:158:1
394.30 s
gammaloop-workspace-doctest> |
394.30 s
gammaloop-workspace-doctest> 158 | to_dots("p(mu) * q(mu)")
394.30 s
gammaloop-workspace-doctest> | ^^^^^^^ not found in this scope
394.30 s
gammaloop-workspace-doctest>
394.30 s
gammaloop-workspace-doctest> error : aborting due to 1 previous error
394.30 s
gammaloop-workspace-doctest>
394.30 s
gammaloop-workspace-doctest> For more information about this error, try `rustc --explain E0425`.
394.30 s
gammaloop-workspace-doctest> Couldn't compile the test.
394.30 s
gammaloop-workspace-doctest> ---- crates/gammaloop-api/src/python.rs - python::atom_to_canonical_string (line 128) stdout ----
394.30 s
gammaloop-workspace-doctest> error[E0425] : cannot find function `atom_to_canonical_string` in this scope
394.30 s
gammaloop-workspace-doctest> --> crates/gammaloop-api/src/python.rs:129:1
394.30 s
gammaloop-workspace-doctest> |
394.30 s
gammaloop-workspace-doctest> 129 | atom_to_canonical_string("x + x")
394.30 s
gammaloop-workspace-doctest> | ^^^^^^^^^^^^^^^^^^^^^^^^ not found in this scope
394.30 s
gammaloop-workspace-doctest>
394.30 s
gammaloop-workspace-doctest> error : aborting due to 1 previous error
394.30 s
gammaloop-workspace-doctest>
394.30 s
gammaloop-workspace-doctest> For more information about this error, try `rustc --explain E0425`.
394.30 s
gammaloop-workspace-doctest> Couldn't compile the test.
394.30 s
gammaloop-workspace-doctest> ---- crates/gammaloop-api/src/python.rs - python::GammaLoopAPI::new_python (line 2804) stdout ----
394.30 s
gammaloop-workspace-doctest> error[E0425] : cannot find value `api` in this scope
394.30 s
gammaloop-workspace-doctest> --> crates/gammaloop-api/src/python.rs:2805:1
394.30 s
gammaloop-workspace-doctest> |
394.30 s
gammaloop-workspace-doctest> 2805 | api = GammaLoopAPI(state_folder="./state", read_only_state=True)
394.30 s
gammaloop-workspace-doctest> | ^^^
394.30 s
gammaloop-workspace-doctest> |
394.30 s
gammaloop-workspace-doctest> help : you might have meant to introduce a new binding
394.30 s
gammaloop-workspace-doctest> |
394.30 s
gammaloop-workspace-doctest> 2805 | let api = GammaLoopAPI(state_folder="./state", read_only_state=True)
394.30 s
gammaloop-workspace-doctest> | +++
394.30 s
gammaloop-workspace-doctest>
394.30 s
gammaloop-workspace-doctest> error[E0425] : cannot find value `state_folder` in this scope
394.30 s
gammaloop-workspace-doctest> --> crates/gammaloop-api/src/python.rs:2805:20
394.30 s
gammaloop-workspace-doctest> |
394.30 s
gammaloop-workspace-doctest> 2805 | api = GammaLoopAPI(state_folder="./state", read_only_state=True)
394.30 s
gammaloop-workspace-doctest> | ^^^^^^^^^^^^ not found in this scope
394.30 s
gammaloop-workspace-doctest>
394.30 s
gammaloop-workspace-doctest> error[E0425] : cannot find value `read_only_state` in this scope
394.30 s
gammaloop-workspace-doctest> --> crates/gammaloop-api/src/python.rs:2805:44
394.30 s
gammaloop-workspace-doctest> |
394.30 s
gammaloop-workspace-doctest> 2805 | api = GammaLoopAPI(state_folder="./state", read_only_state=True)
394.30 s
gammaloop-workspace-doctest> | ^^^^^^^^^^^^^^^ not found in this scope
394.30 s
gammaloop-workspace-doctest>
394.30 s
gammaloop-workspace-doctest> error[E0425] : cannot find value `True` in this scope
394.30 s
gammaloop-workspace-doctest> --> crates/gammaloop-api/src/python.rs:2805:60
394.30 s
gammaloop-workspace-doctest> |
394.30 s
gammaloop-workspace-doctest> 2805 | api = GammaLoopAPI(state_folder="./state", read_only_state=True)
394.30 s
gammaloop-workspace-doctest> | ^^^^ not found in this scope
394.30 s
gammaloop-workspace-doctest> |
394.30 s
gammaloop-workspace-doctest> help : you may want to use a bool value instead
394.30 s
gammaloop-workspace-doctest> |
394.30 s
gammaloop-workspace-doctest> 2805 - api = GammaLoopAPI(state_folder="./state", read_only_state=True )
394.30 s
gammaloop-workspace-doctest> 2805 + api = GammaLoopAPI(state_folder="./state", read_only_state=true )
394.30 s
gammaloop-workspace-doctest> |
394.30 s
gammaloop-workspace-doctest>
394.30 s
gammaloop-workspace-doctest> error[E0425] : cannot find function, tuple struct or tuple variant `GammaLoopAPI` in this scope
394.30 s
gammaloop-workspace-doctest> --> crates/gammaloop-api/src/python.rs:2805:7
394.30 s
gammaloop-workspace-doctest> |
394.30 s
gammaloop-workspace-doctest> 2805 | api = GammaLoopAPI(state_folder="./state", read_only_state=True)
394.30 s
gammaloop-workspace-doctest> | ^^^^^^^^^^^^ not found in this scope
394.30 s
gammaloop-workspace-doctest>
394.30 s
gammaloop-workspace-doctest> error : aborting due to 5 previous errors
394.30 s
gammaloop-workspace-doctest>
394.30 s
gammaloop-workspace-doctest> For more information about this error, try `rustc --explain E0425`.
394.30 s
gammaloop-workspace-doctest> Couldn't compile the test.
394.30 s
gammaloop-workspace-doctest>
394.30 s
gammaloop-workspace-doctest> failures:
394.30 s
gammaloop-workspace-doctest> crates/gammaloop-api/src/python.rs - python::GammaLoopAPI::evaluate_sample (line 2926)
394.30 s
gammaloop-workspace-doctest> crates/gammaloop-api/src/python.rs - python::GammaLoopAPI::evaluate_samples (line 3040)
394.30 s
gammaloop-workspace-doctest> crates/gammaloop-api/src/python.rs - python::GammaLoopAPI::get_active_command_blocks (line 3652)
394.30 s
gammaloop-workspace-doctest> crates/gammaloop-api/src/python.rs - python::GammaLoopAPI::get_default_runtime_settings (line 3688)
394.30 s
gammaloop-workspace-doctest> crates/gammaloop-api/src/python.rs - python::GammaLoopAPI::get_global_settings (line 3631)
394.30 s
gammaloop-workspace-doctest> crates/gammaloop-api/src/python.rs - python::GammaLoopAPI::get_integrand_info (line 3496)
394.30 s
gammaloop-workspace-doctest> crates/gammaloop-api/src/python.rs - python::GammaLoopAPI::get_integrand_settings (line 3539)
394.30 s
gammaloop-workspace-doctest> crates/gammaloop-api/src/python.rs - python::GammaLoopAPI::get_run_history (line 3603)
394.30 s
gammaloop-workspace-doctest> crates/gammaloop-api/src/python.rs - python::GammaLoopAPI::new_python (line 2804)
394.30 s
gammaloop-workspace-doctest> crates/gammaloop-api/src/python.rs - python::GammaLoopAPI::run_command (line 3793)
394.30 s
gammaloop-workspace-doctest> crates/gammaloop-api/src/python.rs - python::atom_to_canonical_string (line 128)
394.30 s
gammaloop-workspace-doctest> crates/gammaloop-api/src/python.rs - python::atom_to_dots (line 157)
394.30 s
gammaloop-workspace-doctest> crates/gammaloop-api/src/python.rs - python::evaluate_graph_overall_factor (line 95)
394.30 s
gammaloop-workspace-doctest>
394.30 s
gammaloop-workspace-doctest> test result: FAILED. 0 passed; 13 failed; 0 ignored; 0 measured; 0 filtered out; finished in 0.12s
394.30 s
gammaloop-workspace-doctest>
394.30 s
gammaloop-workspace-doctest> error : doctest failed, to rerun pass `-p gammaloop-api --doc`
394.75 s
error: Cannot build '/nix/store/d7n0kzr0ab2qmzp3m3y3jhx03bbngjym-gammaloop-workspace-doctest-0.1.0.drv '.
394.75 s
Reason: builder failed with exit code 101 .
394.75 s
Output paths:
394.75 s
/nix/store/m1rbsc5idl2jxvknq7bvqysz3ysaha7l-gammaloop-workspace-doctest-0.1.0
394.75 s
Last 349 log lines:
394.75 s
> Running phase: unpackPhase
394.75 s
> unpacking source archive /nix/store/n62xwv096bc248rr6y7qpggfdbwshkw9-source
394.75 s
> source root is source
394.75 s
> Running phase: patchPhase
394.75 s
> Executing configureCargoCommonVars
394.75 s
> decompressing cargo artifacts from /nix/store/kbgwngi7xvi54jsr0kp8rhj1b9mfja7d-gammaloop-workspace-deps-deps-0.1.0/target.tar.zst to target
394.75 s
> Running phase: updateAutotoolsGnuConfigScriptsPhase
394.75 s
> Running phase: configurePhase
394.75 s
> will append /build/source/.cargo-home/config.toml with contents of /nix/store/xdy1vvhll2bijdplvl9fcc2b9plkxhaa-vendor-cargo-deps/config.toml
394.75 s
> default configurePhase, nothing to do
394.75 s
> Running phase: buildPhase
394.75 s
> +++ command cargo --version
394.75 s
> cargo 1.97.0 (c980f4866 2026-06-30)
394.75 s
> +++ command cargo test --profile ci-optim --doc --locked --workspace --features gammaloop-api/cli,gammaloop-tracing-filter/clap,gammaloop-tracing-filter/symbolica,idenso/bincode,idenso/reference-cases,linnet/bincode,linnet/drawing,linnet/nodestore-vec,linnet/rkyv,linnet/serde,linnet/symbolica,spenso-macros/shadowing,spenso/shadowing,symbolica/tracing_max_level_info
394.75 s
> Compiling target-lexicon v0.13.5
394.75 s
> Compiling symbolica v2.2.0 (https://github.com/symbolica-dev/symbolica?branch=dev#0441bd7a)
394.75 s
> Compiling maplit v1.0.2
394.75 s
> Compiling gammaloop-tracing-filter-macros v0.1.0 (/build/source/crates/gammaloop-tracing-filter-macros)
394.75 s
> Compiling vakint v0.1.2 (/build/source/crates/vakint)
394.75 s
> Compiling gammalooprs v0.3.4 (/build/source/crates/gammalooprs)
394.75 s
> Compiling alphal00p-docs-macros v0.1.0 (/build/source/crates/alphal00p-docs-macros)
394.75 s
> Compiling alphal00p-docs-schema v0.1.0 (/build/source/crates/alphal00p-docs-schema)
394.75 s
> Compiling rustc_version v0.4.1
394.75 s
> Compiling bincode v1.3.3
394.75 s
> Compiling iai-callgrind-runner v0.14.2
394.75 s
> Compiling target-triple v1.0.1
394.75 s
> Compiling gungraun-runner v0.18.2
394.75 s
> Compiling clinnet v0.1.8 (/build/source/crates/clinnet)
394.75 s
> Compiling gammaloop-integration-tests v0.1.0 (/build/source/tests)
394.75 s
> Compiling test-log-core v0.2.20
394.75 s
> Compiling wait-timeout v0.2.1
394.75 s
> Compiling iai-callgrind v0.14.2
394.75 s
> Compiling bit-vec v0.8.0
394.75 s
> Compiling quick-error v1.2.3
394.75 s
> Compiling rusty-fork v0.3.1
394.75 s
> Compiling bit-set v0.8.0
394.75 s
> Compiling iai-callgrind-macros v0.5.1
394.75 s
> Compiling rand_xorshift v0.4.0
394.75 s
> Compiling gungraun-macros v0.8.0
394.75 s
> Compiling console v0.15.11
394.75 s
> Compiling base64 v0.21.7
394.75 s
> Compiling glob v0.3.4
394.75 s
> Compiling termcolor v1.4.1
394.75 s
> Compiling unarray v0.1.4
394.75 s
> Compiling proptest v1.11.0
394.75 s
> Compiling alphal00p-docs-builder v0.1.0 (/build/source/crates/alphal00p-docs-builder)
394.75 s
> Compiling alphal00p-docs-catalogs v0.1.0 (/build/source/crates/alphal00p-docs-catalogs)
394.75 s
> Compiling pyo3-build-config v0.28.3
394.75 s
> Compiling trybuild v1.0.120
394.75 s
> Compiling similar-asserts v1.7.0
394.75 s
> Compiling ron v0.8.1
394.75 s
> Compiling kurvst v0.1.0 (/build/source/crates/kurvst)
394.75 s
> Compiling test-log-macros v0.2.20
394.75 s
> Compiling test-log v0.2.20
394.75 s
> Compiling alphal00p-docs-examples v0.1.0 (/build/source/crates/alphal00p-docs-examples)
394.75 s
> Compiling pyo3-macros-backend v0.28.3
394.75 s
> Compiling pyo3-ffi v0.28.3
394.75 s
> Compiling pyo3 v0.28.3
394.75 s
> Compiling numpy v0.28.0
394.75 s
> Compiling gammaloop-api v0.1.0 (/build/source/crates/gammaloop-api)
394.75 s
> Compiling gungraun v0.18.2
394.75 s
> Compiling pyo3-macros v0.28.3
394.75 s
> Compiling pyo3-stub-gen v0.17.2
394.75 s
> Compiling numerica v2.2.0 (https://github.com/symbolica-dev/symbolica?branch=dev#0441bd7a)
394.75 s
> Compiling graphica v2.1.0 (https://github.com/symbolica-dev/symbolica?branch=dev#0441bd7a)
394.75 s
> Compiling symbolica-utils v0.1.0 (/build/source/crates/symbolica-utils)
394.75 s
> Compiling gammaloop-workspace-hack v0.1.0 (/build/source/crates/gammaloop-workspace-hack)
394.75 s
> Compiling spenso-macros v0.3.2 (/build/source/crates/spenso-macros)
394.75 s
> Compiling linnet v0.17.0 (/build/source/crates/linnet)
394.75 s
> Compiling spenso v0.6.0 (/build/source/crates/spenso)
394.75 s
> Compiling idenso v0.3.0 (/build/source/crates/idenso)
394.75 s
> Compiling gammaloop-tracing-filter v0.1.0 (/build/source/crates/gammaloop-tracing-filter)
394.75 s
> Compiling spenso-hep-lib v0.1.7 (/build/source/crates/spenso-hep-lib)
394.75 s
> Compiling spynso3 v0.1.2 (/build/source/crates/spynso3)
394.75 s
> Compiling linnest v0.1.0 (/build/source/crates/linnest)
394.75 s
> Compiling linnet-py v0.1.0 (/build/source/crates/linnet-py)
394.75 s
> Finished `ci-optim` profile [optimized] target(s) in 5m 19s
394.75 s
> warning : the following packages contain code that will be rejected by a future version of Rust: proc-macro-error2 v2.0.1
394.75 s
> note : to see what the problems were, use the option `--future-incompat-report`, or run `cargo report future-incompatibilities --id 1`
394.75 s
> Doc-tests alphal00p_docs_builder
394.75 s
>
394.75 s
> running 0 tests
394.75 s
>
394.75 s
> test result: ok. 0 passed; 0 failed; 0 ignored; 0 measured; 0 filtered out; finished in 0.00s
394.75 s
>
394.75 s
> Doc-tests alphal00p_docs_catalogs
394.75 s
>
394.75 s
> running 0 tests
394.75 s
>
394.75 s
> test result: ok. 0 passed; 0 failed; 0 ignored; 0 measured; 0 filtered out; finished in 0.00s
394.75 s
>
394.75 s
> Doc-tests alphal00p_docs_examples
394.75 s
>
394.75 s
> running 0 tests
394.75 s
>
394.75 s
> test result: ok. 0 passed; 0 failed; 0 ignored; 0 measured; 0 filtered out; finished in 0.00s
394.75 s
>
394.75 s
> Doc-tests alphal00p_docs
394.75 s
>
394.75 s
> running 0 tests
394.75 s
>
394.75 s
> test result: ok. 0 passed; 0 failed; 0 ignored; 0 measured; 0 filtered out; finished in 0.00s
394.75 s
>
394.75 s
> Doc-tests alphal00p_docs_schema
394.75 s
>
394.75 s
> running 0 tests
394.75 s
>
394.75 s
> test result: ok. 0 passed; 0 failed; 0 ignored; 0 measured; 0 filtered out; finished in 0.00s
394.75 s
>
394.75 s
> Doc-tests clinnet
394.75 s
>
394.75 s
> running 0 tests
394.75 s
>
394.75 s
> test result: ok. 0 passed; 0 failed; 0 ignored; 0 measured; 0 filtered out; finished in 0.00s
394.75 s
>
394.75 s
> Doc-tests gammaloop_api
394.75 s
>
394.75 s
> running 13 tests
394.75 s
> test crates/gammaloop-api/src/python.rs - python::GammaLoopAPI::get_active_command_blocks (line 3652) ... FAILED
394.75 s
> test crates/gammaloop-api/src/python.rs - python::GammaLoopAPI::get_default_runtime_settings (line 3688) ... FAILED
394.75 s
> test crates/gammaloop-api/src/python.rs - python::GammaLoopAPI::evaluate_sample (line 2926) ... FAILED
394.75 s
> test crates/gammaloop-api/src/python.rs - python::GammaLoopAPI::get_integrand_info (line 3496) ... FAILED
394.75 s
> test crates/gammaloop-api/src/python.rs - python::GammaLoopAPI::evaluate_samples (line 3040) ... FAILED
394.75 s
> test crates/gammaloop-api/src/python.rs - python::GammaLoopAPI::get_integrand_settings (line 3539) ... FAILED
394.75 s
> test crates/gammaloop-api/src/python.rs - python::GammaLoopAPI::run_command (line 3793) ... FAILED
394.75 s
> test crates/gammaloop-api/src/python.rs - python::GammaLoopAPI::get_run_history (line 3603) ... FAILED
394.75 s
> test crates/gammaloop-api/src/python.rs - python::GammaLoopAPI::get_global_settings (line 3631) ... FAILED
394.75 s
> test crates/gammaloop-api/src/python.rs - python::evaluate_graph_overall_factor (line 95) ... FAILED
394.75 s
> test crates/gammaloop-api/src/python.rs - python::atom_to_dots (line 157) ... FAILED
394.75 s
> test crates/gammaloop-api/src/python.rs - python::atom_to_canonical_string (line 128) ... FAILED
394.75 s
> test crates/gammaloop-api/src/python.rs - python::GammaLoopAPI::new_python (line 2804) ... FAILED
394.75 s
>
394.75 s
> failures:
394.75 s
>
394.75 s
> ---- crates/gammaloop-api/src/python.rs - python::GammaLoopAPI::get_active_command_blocks (line 3652) stdout ----
394.75 s
> error: expected item, found keyword `for`
394.75 s
> --> crates/gammaloop-api/src/python.rs:3653:1
394.75 s
> |
394.75 s
> 3653 | for name, commands in api.get_active_command_blocks().items():
394.75 s
> | ^^^ expected item
394.75 s
> |
394.75 s
> = note: for a full list of items that can appear in modules, see <https://doc.rust-lang.org/reference/items.html>
394.75 s
>
394.75 s
> error: aborting due to 1 previous error
394.75 s
>
394.75 s
> Couldn't compile the test.
394.75 s
> ---- crates/gammaloop-api/src/python.rs - python::GammaLoopAPI::get_default_runtime_settings (line 3688) stdout ----
394.75 s
> error: expected one of `!` or `::`, found `=`
394.75 s
> --> crates/gammaloop-api/src/python.rs:3689:9
394.75 s
> |
394.75 s
> 3689 | runtime = api.get_default_runtime_settings()
394.75 s
> | ^ expected one of `!` or `::`
394.75 s
>
394.75 s
> error: aborting due to 1 previous error
394.75 s
>
394.75 s
> Couldn't compile the test.
394.75 s
> ---- crates/gammaloop-api/src/python.rs - python::GammaLoopAPI::evaluate_sample (line 2926) stdout ----
394.75 s
> error: expected one of `!` or `::`, found `=`
394.75 s
> --> crates/gammaloop-api/src/python.rs:2927:8
394.75 s
> |
394.75 s
> 2927 | result = api.evaluate_sample(point, process_id=0, minimal_output=True)
394.75 s
> | ^ expected one of `!` or `::`
394.75 s
>
394.75 s
> error: aborting due to 1 previous error
394.75 s
>
394.75 s
> Couldn't compile the test.
394.75 s
> ---- crates/gammaloop-api/src/python.rs - python::GammaLoopAPI::get_integrand_info (line 3496) stdout ----
394.75 s
> error: expected one of `!` or `::`, found `=`
394.75 s
> --> crates/gammaloop-api/src/python.rs:3497:6
394.75 s
> |
394.75 s
> 3497 | info = api.get_integrand_info(process_id=0)
394.75 s
> | ^ expected one of `!` or `::`
394.75 s
>
394.75 s
> error: aborting due to 1 previous error
394.75 s
>
394.75 s
> Couldn't compile the test.
394.75 s
> ---- crates/gammaloop-api/src/python.rs - python::GammaLoopAPI::evaluate_samples (line 3040) stdout ----
394.75 s
> error: expected one of `!` or `::`, found `=`
394.75 s
> --> crates/gammaloop-api/src/python.rs:3041:8
394.75 s
> |
394.75 s
> 3041 | points = numpy.asarray(points, dtype=numpy.float64)
394.75 s
> | ^ expected one of `!` or `::`
394.75 s
>
394.75 s
> error: aborting due to 1 previous error
394.75 s
>
394.75 s
> Couldn't compile the test.
394.75 s
> ---- crates/gammaloop-api/src/python.rs - python::GammaLoopAPI::get_integrand_settings (line 3539) stdout ----
394.75 s
> error: expected one of `!` or `::`, found `=`
394.75 s
> --> crates/gammaloop-api/src/python.rs:3540:10
394.75 s
> |
394.75 s
> 3540 | settings = api.get_integrand_settings(process_id=0)
394.75 s
> | ^ expected one of `!` or `::`
394.75 s
>
394.75 s
> error: aborting due to 1 previous error
394.75 s
>
394.75 s
> Couldn't compile the test.
394.75 s
> ---- crates/gammaloop-api/src/python.rs - python::GammaLoopAPI::run_command (line 3793) stdout ----
394.75 s
> error[E0425] : cannot find value `api` in this scope
394.75 s
> --> crates/gammaloop-api/src/python.rs:3794:1
394.75 s
> |
394.75 s
> 3794 | api.run("display processes")
394.75 s
> | ^^^ not found in this scope
394.75 s
>
394.75 s
> error : aborting due to 1 previous error
394.75 s
>
394.75 s
> For more information about this error, try `rustc --explain E0425`.
394.75 s
> Couldn't compile the test.
394.75 s
> ---- crates/gammaloop-api/src/python.rs - python::GammaLoopAPI::get_run_history (line 3603) stdout ----
394.75 s
> error[E0425] : cannot find value `run_card_toml` in this scope
394.75 s
> --> crates/gammaloop-api/src/python.rs:3604:1
394.75 s
> |
394.75 s
> 3604 | run_card_toml = api.get_run_history()
394.75 s
> | ^^^^^^^^^^^^^
394.75 s
> |
394.75 s
> help : you might have meant to introduce a new binding
394.75 s
> |
394.75 s
> 3604 | let run_card_toml = api.get_run_history()
394.75 s
> | +++
394.75 s
>
394.75 s
> error[E0425] : cannot find value `api` in this scope
394.75 s
> --> crates/gammaloop-api/src/python.rs:3604:17
394.75 s
> |
394.75 s
> 3604 | run_card_toml = api.get_run_history()
394.75 s
> | ^^^ not found in this scope
394.75 s
>
394.75 s
> error : aborting due to 2 previous errors
394.75 s
>
394.75 s
> For more information about this error, try `rustc --explain E0425`.
394.75 s
> Couldn't compile the test.
394.75 s
> ---- crates/gammaloop-api/src/python.rs - python::GammaLoopAPI::get_global_settings (line 3631) stdout ----
394.75 s
> error[E0425] : cannot find value `settings_toml` in this scope
394.75 s
> --> crates/gammaloop-api/src/python.rs:3632:1
394.75 s
> |
394.75 s
> 3632 | settings_toml = api.get_global_settings()
394.75 s
> | ^^^^^^^^^^^^^
394.75 s
> |
394.75 s
> help : you might have meant to introduce a new binding
394.75 s
> |
394.75 s
> 3632 | let settings_toml = api.get_global_settings()
394.75 s
> | +++
394.75 s
>
394.75 s
> error[E0425] : cannot find value `api` in this scope
394.75 s
> --> crates/gammaloop-api/src/python.rs:3632:17
394.75 s
> |
394.75 s
> 3632 | settings_toml = api.get_global_settings()
394.75 s
> | ^^^ not found in this scope
394.75 s
>
394.75 s
> error : aborting due to 2 previous errors
394.75 s
>
394.75 s
> For more information about this error, try `rustc --explain E0425`.
394.75 s
> Couldn't compile the test.
394.75 s
> ---- crates/gammaloop-api/src/python.rs - python::evaluate_graph_overall_factor (line 95) stdout ----
394.75 s
> error[E0425] : cannot find function `evaluate_graph_overall_factor` in this scope
394.75 s
> --> crates/gammaloop-api/src/python.rs:96:1
394.75 s
> |
394.75 s
> 96 | evaluate_graph_overall_factor(
394.75 s
> | ^^^^^^^^^^^^^^^^^^^^^^^^^^^^^ not found in this scope
394.75 s
>
394.75 s
> error : aborting due to 1 previous error
394.75 s
>
394.75 s
> For more information about this error, try `rustc --explain E0425`.
394.75 s
> Couldn't compile the test.
394.75 s
> ---- crates/gammaloop-api/src/python.rs - python::atom_to_dots (line 157) stdout ----
394.75 s
> error[E0425] : cannot find function `to_dots` in this scope
394.75 s
> --> crates/gammaloop-api/src/python.rs:158:1
394.75 s
> |
394.75 s
> 158 | to_dots("p(mu) * q(mu)")
394.75 s
> | ^^^^^^^ not found in this scope
394.75 s
>
394.75 s
> error : aborting due to 1 previous error
394.75 s
>
394.75 s
> For more information about this error, try `rustc --explain E0425`.
394.75 s
> Couldn't compile the test.
394.75 s
> ---- crates/gammaloop-api/src/python.rs - python::atom_to_canonical_string (line 128) stdout ----
394.75 s
> error[E0425] : cannot find function `atom_to_canonical_string` in this scope
394.75 s
> --> crates/gammaloop-api/src/python.rs:129:1
394.75 s
> |
394.75 s
> 129 | atom_to_canonical_string("x + x")
394.75 s
> | ^^^^^^^^^^^^^^^^^^^^^^^^ not found in this scope
394.75 s
>
394.75 s
> error : aborting due to 1 previous error
394.75 s
>
394.75 s
> For more information about this error, try `rustc --explain E0425`.
394.75 s
> Couldn't compile the test.
394.75 s
> ---- crates/gammaloop-api/src/python.rs - python::GammaLoopAPI::new_python (line 2804) stdout ----
394.75 s
> error[E0425] : cannot find value `api` in this scope
394.75 s
> --> crates/gammaloop-api/src/python.rs:2805:1
394.75 s
> |
394.75 s
> 2805 | api = GammaLoopAPI(state_folder="./state", read_only_state=True)
394.75 s
> | ^^^
394.75 s
> |
394.75 s
> help : you might have meant to introduce a new binding
394.75 s
> |
394.75 s
> 2805 | let api = GammaLoopAPI(state_folder="./state", read_only_state=True)
394.75 s
> | +++
394.75 s
>
394.75 s
> error[E0425] : cannot find value `state_folder` in this scope
394.75 s
> --> crates/gammaloop-api/src/python.rs:2805:20
394.75 s
> |
394.75 s
> 2805 | api = GammaLoopAPI(state_folder="./state", read_only_state=True)
394.75 s
> | ^^^^^^^^^^^^ not found in this scope
394.75 s
>
394.75 s
> error[E0425] : cannot find value `read_only_state` in this scope
394.75 s
> --> crates/gammaloop-api/src/python.rs:2805:44
394.75 s
> |
394.75 s
> 2805 | api = GammaLoopAPI(state_folder="./state", read_only_state=True)
394.75 s
> | ^^^^^^^^^^^^^^^ not found in this scope
394.75 s
>
394.75 s
> error[E0425] : cannot find value `True` in this scope
394.75 s
> --> crates/gammaloop-api/src/python.rs:2805:60
394.75 s
> |
394.75 s
> 2805 | api = GammaLoopAPI(state_folder="./state", read_only_state=True)
394.75 s
> | ^^^^ not found in this scope
394.75 s
> |
394.75 s
> help : you may want to use a bool value instead
394.75 s
> |
394.75 s
> 2805 - api = GammaLoopAPI(state_folder="./state", read_only_state=True )
394.75 s
> 2805 + api = GammaLoopAPI(state_folder="./state", read_only_state=true )
394.75 s
> |
394.75 s
>
394.75 s
> error[E0425] : cannot find function, tuple struct or tuple variant `GammaLoopAPI` in this scope
394.75 s
> --> crates/gammaloop-api/src/python.rs:2805:7
394.75 s
> |
394.75 s
> 2805 | api = GammaLoopAPI(state_folder="./state", read_only_state=True)
394.75 s
> | ^^^^^^^^^^^^ not found in this scope
394.75 s
>
394.75 s
> error : aborting due to 5 previous errors
394.75 s
>
394.75 s
> For more information about this error, try `rustc --explain E0425`.
394.75 s
> Couldn't compile the test.
394.75 s
>
394.75 s
> failures:
394.75 s
> crates/gammaloop-api/src/python.rs - python::GammaLoopAPI::evaluate_sample (line 2926)
394.75 s
> crates/gammaloop-api/src/python.rs - python::GammaLoopAPI::evaluate_samples (line 3040)
394.75 s
> crates/gammaloop-api/src/python.rs - python::GammaLoopAPI::get_active_command_blocks (line 3652)
394.75 s
> crates/gammaloop-api/src/python.rs - python::GammaLoopAPI::get_default_runtime_settings (line 3688)
394.75 s
> crates/gammaloop-api/src/python.rs - python::GammaLoopAPI::get_global_settings (line 3631)
394.75 s
> crates/gammaloop-api/src/python.rs - python::GammaLoopAPI::get_integrand_info (line 3496)
394.75 s
> crates/gammaloop-api/src/python.rs - python::GammaLoopAPI::get_integrand_settings (line 3539)
394.75 s
> crates/gammaloop-api/src/python.rs - python::GammaLoopAPI::get_run_history (line 3603)
394.75 s
> crates/gammaloop-api/src/python.rs - python::GammaLoopAPI::new_python (line 2804)
394.75 s
> crates/gammaloop-api/src/python.rs - python::GammaLoopAPI::run_command (line 3793)
394.75 s
> crates/gammaloop-api/src/python.rs - python::atom_to_canonical_string (line 128)
394.75 s
> crates/gammaloop-api/src/python.rs - python::atom_to_dots (line 157)
394.75 s
> crates/gammaloop-api/src/python.rs - python::evaluate_graph_overall_factor (line 95)
394.75 s
>
394.75 s
> test result: FAILED. 0 passed; 13 failed; 0 ignored; 0 measured; 0 filtered out; finished in 0.12s
394.75 s
>
394.75 s
> error : doctest failed, to rerun pass `-p gammaloop-api --doc`
394.75 s
For full logs, run:
394.75 s
nix log /nix/store/d7n0kzr0ab2qmzp3m3y3jhx03bbngjym-gammaloop-workspace-doctest-0.1.0.drv
394.82 s
[0 built (1 failed ), 4 cRun failed.