0.18 s
$ /nix/store/9ypz3flqsrl5xl495mm8h645gadjsxi1-coreutils-9.11/bin/timeout --kill-after=15s 7200s /nix/store/23zk8sgzamrbmj1fday15szf7f2279s8-nix-2.34.7/bin/nix --extra-experimental-features nix-command --extra-experimental-features flakes flake clone git+https://github.com/alphal00p/gammaloop --dest /tmp/nix-ci-worker/stable-pwd/repo/
0.23 s
Cloning into '/tmp/nix-ci-worker/stable-pwd/repo'...
0.83 s
remote: Enumerating objects: 64185, done.
0.94 s
remote: Counting objects: 0% (1/9551)
remote: Counting objects: 1% (96/9551)
remote: Counting objects: 2% (192/9551)
remote: Counting objects: 3% (287/9551)
remote: Counting objects: 4% (383/9551)
remote: Counting objects: 5% (478/9551)
remote: Counting objects: 6% (574/9551)
remote: Counting objects: 7% (669/9551)
remote: Counting objects: 8% (765/9551)
remote: Counting objects: 9% (860/9551)
remote: Counting objects: 10% (956/9551)
remote: Counting objects: 11% (1051/9551)
remote: Counting objects: 12% (1147/9551)
remote: Counting objects: 13% (1242/9551)
remote: Counting objects: 14% (1338/9551)
remote: Counting objects: 15% (1433/9551)
remote: Counting objects: 16% (1529/9551)
remote: Counting objects: 17% (1624/9551)
remote: Counting objects: 18% (1720/9551)
remote: Counting objects: 19% (1815/9551)
remote: Counting objects: 20% (1911/9551)
remote: Counting objects: 21% (2006/9551)
remote: Counting objects: 22% (2102/9551)
remote: Counting objects: 23% (2197/9551)
remote: Counting objects: 24% (2293/9551)
remote: Counting objects: 25% (2388/9551)
remote: Counting objects: 26% (2484/9551)
remote: Counting objects: 27% (2579/9551)
remote: Counting objects: 28% (2675/9551)
remote: Counting objects: 29% (2770/9551)
remote: Counting objects: 30% (2866/9551)
remote: Counting objects: 31% (2961/9551)
remote: Counting objects: 32% (3057/9551)
remote: Counting objects: 33% (3152/9551)
remote: Counting objects: 34% (3248/9551)
remote: Counting objects: 35% (3343/9551)
remote: Counting objects: 36% (3439/9551)
remote: Counting objects: 37% (3534/9551)
remote: Counting objects: 38% (3630/9551)
remote: Counting objects: 39% (3725/9551)
remote: Counting objects: 40% (3821/9551)
remote: Counting objects: 41% (3916/9551)
remote: Counting objects: 42% (4012/9551)
remote: Counting objects: 43% (4107/9551)
remote: Counting objects: 44% (4203/9551)
remote: Counting objects: 45% (4298/9551)
remote: Counting objects: 46% (4394/9551)
remote: Counting objects: 47% (4489/9551)
remote: Counting objects: 48% (4585/9551)
remote: Counting objects: 49% (4680/9551)
remote: Counting objects: 50% (4776/9551)
remote: Counting objects: 51% (4872/9551)
remote: Counting objects: 52% (4967/9551)
remote: Counting objects: 53% (5063/9551)
remote: Counting objects: 54% (5158/9551)
remote: Counting objects: 55% (5254/9551)
remote: Counting objects: 56% (5349/9551)
remote: Counting objects: 57% (5445/9551)
remote: Counting objects: 58% (5540/9551)
remote: Counting objects: 59% (5636/9551)
remote: Counting objects: 60% (5731/9551)
remote: Counting objects: 61% (5827/9551)
remote: Counting objects: 62% (5922/9551)
remote: Counting objects: 63% (6018/9551)
remote: Counting objects: 64% (6113/9551)
remote: Counting objects: 65% (6209/9551)
remote: Counting objects: 66% (6304/9551)
remote: Counting objects: 67% (6400/9551)
remote: Counting objects: 68% (6495/9551)
remote: Counting objects: 69% (6591/9551)
remote: Counting objects: 70% (6686/9551)
remote: Counting objects: 71% (6782/9551)
remote: Counting objects: 72% (6877/9551)
remote: Counting objects: 73% (6973/9551)
remote: Counting objects: 74% (7068/9551)
remote: Counting objects: 75% (7164/9551)
remote: Counting objects: 76% (7259/9551)
remote: Counting objects: 77% (7355/9551)
remote: Counting objects: 78% (7450/9551)
remote: Counting objects: 79% (7546/9551)
remote: Counting objects: 80% (7641/9551)
remote: Counting objects: 81% (7737/9551)
remote: Counting objects: 82% (7832/9551)
remote: Counting objects: 83% (7928/9551)
remote: Counting objects: 84% (8023/9551)
remote: Counting objects: 85% (8119/9551)
remote: Counting objects: 86% (8214/9551)
remote: Counting objects: 87% (8310/9551)
remote: Counting objects: 88% (8405/9551)
remote: Counting objects: 89% (8501/9551)
remote: Counting objects: 90% (8596/9551)
remote: Counting objects: 91% (8692/9551)
remote: Counting objects: 92% (8787/9551)
remote: Counting objects: 93% (8883/9551)
remote: Counting objects: 94% (8978/9551)
remote: Counting objects: 95% (9074/9551)
remote: Counting objects: 96% (9169/9551)
remote: Counting objects: 97% (9265/9551)
remote: Counting objects: 98% (9360/9551)
remote: Counting objects: 99% (9456/9551)
remote: Counting objects: 100% (9551/9551)
remote: Counting objects: 100% (9551/9551), done.
3.12 s
remote: Compressing objects: 0% (1/2326)
remote: Compressing objects: 1% (24/2326)
remote: Compressing objects: 2% (47/2326)
remote: Compressing objects: 3% (70/2326)
remote: Compressing objects: 4% (94/2326)
remote: Compressing objects: 5% (117/2326)
remote: Compressing objects: 6% (140/2326)
remote: Compressing objects: 7% (163/2326)
remote: Compressing objects: 8% (187/2326)
remote: Compressing objects: 9% (210/2326)
remote: Compressing objects: 10% (233/2326)
remote: Compressing objects: 11% (256/2326)
remote: Compressing objects: 12% (280/2326)
remote: Compressing objects: 13% (303/2326)
remote: Compressing objects: 14% (326/2326)
remote: Compressing objects: 15% (349/2326)
remote: Compressing objects: 16% (373/2326)
remote: Compressing objects: 17% (396/2326)
remote: Compressing objects: 18% (419/2326)
remote: Compressing objects: 19% (442/2326)
remote: Compressing objects: 20% (466/2326)
remote: Compressing objects: 21% (489/2326)
remote: Compressing objects: 22% (512/2326)
remote: Compressing objects: 23% (535/2326)
remote: Compressing objects: 23% (553/2326)
remote: Compressing objects: 24% (559/2326)
remote: Compressing objects: 25% (582/2326)
remote: Compressing objects: 26% (605/2326)
remote: Compressing objects: 27% (629/2326)
remote: Compressing objects: 28% (652/2326)
remote: Compressing objects: 29% (675/2326)
remote: Compressing objects: 30% (698/2326)
remote: Compressing objects: 31% (722/2326)
remote: Compressing objects: 32% (745/2326)
remote: Compressing objects: 33% (768/2326)
remote: Compressing objects: 33% (769/2326)
remote: Compressing objects: 34% (791/2326)
remote: Compressing objects: 35% (815/2326)
remote: Compressing objects: 36% (838/2326)
remote: Compressing objects: 37% (861/2326)
remote: Compressing objects: 38% (884/2326)
remote: Compressing objects: 39% (908/2326)
remote: Compressing objects: 40% (931/2326)
remote: Compressing objects: 41% (954/2326)
remote: Compressing objects: 42% (977/2326)
remote: Compressing objects: 43% (1001/2326)
remote: Compressing objects: 44% (1024/2326)
remote: Compressing objects: 45% (1047/2326)
remote: Compressing objects: 46% (1070/2326)
remote: Compressing objects: 47% (1094/2326)
remote: Compressing objects: 48% (1117/2326)
remote: Compressing objects: 49% (1140/2326)
remote: Compressing objects: 50% (1163/2326)
remote: Compressing objects: 51% (1187/2326)
remote: Compressing objects: 52% (1210/2326)
remote: Compressing objects: 53% (1233/2326)
remote: Compressing objects: 54% (1257/2326)
remote: Compressing objects: 55% (1280/2326)
remote: Compressing objects: 56% (1303/2326)
remote: Compressing objects: 57% (1326/2326)
remote: Compressing objects: 58% (1350/2326)
remote: Compressing objects: 59% (1373/2326)
remote: Compressing objects: 60% (1396/2326)
remote: Compressing objects: 61% (1419/2326)
remote: Compressing objects: 62% (1443/2326)
remote: Compressing objects: 63% (1466/2326)
remote: Compressing objects: 64% (1489/2326)
remote: Compressing objects: 65% (1512/2326)
remote: Compressing objects: 66% (1536/2326)
remote: Compressing objects: 67% (1559/2326)
remote: Compressing objects: 68% (1582/2326)
remote: Compressing objects: 69% (1605/2326)
remote: Compressing objects: 70% (1629/2326)
remote: Compressing objects: 71% (1652/2326)
remote: Compressing objects: 72% (1675/2326)
remote: Compressing objects: 73% (1698/2326)
remote: Compressing objects: 74% (1722/2326)
remote: Compressing objects: 75% (1745/2326)
remote: Compressing objects: 76% (1768/2326)
remote: Compressing objects: 77% (1792/2326)
remote: Compressing objects: 78% (1815/2326)
remote: Compressing objects: 79% (1838/2326)
remote: Compressing objects: 80% (1861/2326)
remote: Compressing objects: 81% (1885/2326)
remote: Compressing objects: 82% (1908/2326)
remote: Compressing objects: 83% (1931/2326)
remote: Compressing objects: 84% (1954/2326)
remote: Compressing objects: 85% (1978/2326)
remote: Compressing objects: 86% (2001/2326)
remote: Compressing objects: 87% (2024/2326)
remote: Compressing objects: 88% (2047/2326)
remote: Compressing objects: 89% (2071/2326)
remote: Compressing objects: 90% (2094/2326)
remote: Compressing objects: 91% (2117/2326)
remote: Compressing objects: 92% (2140/2326)
remote: Compressing objects: 93% (2164/2326)
remote: Compressing objects: 94% (2187/2326)
remote: Compressing objects: 95% (2210/2326)
remote: Compressing objects: 96% (2233/2326)
remote: Compressing objects: 97% (2257/2326)
remote: Compressing objects: 98% (2280/2326)
remote: Compressing objects: 99% (2303/2326)
remote: Compressing objects: 100% (2326/2326)
remote: Compressing objects: 100% (2326/2326), done.
9.12 s
Receiving objects: 0% (1/64185)
Receiving objects: 1% (642/64185)
Receiving objects: 2% (1284/64185)
Receiving objects: 3% (1926/64185)
Receiving objects: 4% (2568/64185)
Receiving objects: 5% (3210/64185)
Receiving objects: 6% (3852/64185)
Receiving objects: 7% (4493/64185)
Receiving objects: 8% (5135/64185)
Receiving objects: 9% (5777/64185)
Receiving objects: 10% (6419/64185), 10.45 MiB | 20.88 MiB/s
Receiving objects: 11% (7061/64185), 10.45 MiB | 20.88 MiB/s
Receiving objects: 12% (7703/64185), 10.45 MiB | 20.88 MiB/s
Receiving objects: 13% (8345/64185), 10.45 MiB | 20.88 MiB/s
Receiving objects: 14% (8986/64185), 10.45 MiB | 20.88 MiB/s
Receiving objects: 15% (9628/64185), 10.45 MiB | 20.88 MiB/s
Receiving objects: 16% (10270/64185), 10.45 MiB | 20.88 MiB/s
Receiving objects: 17% (10912/64185), 10.45 MiB | 20.88 MiB/s
Receiving objects: 18% (11554/64185), 10.45 MiB | 20.88 MiB/s
Receiving objects: 19% (12196/64185), 10.45 MiB | 20.88 MiB/s
Receiving objects: 20% (12837/64185), 10.45 MiB | 20.88 MiB/s
Receiving objects: 21% (13479/64185), 10.45 MiB | 20.88 MiB/s
Receiving objects: 22% (14121/64185), 10.45 MiB | 20.88 MiB/s
Receiving objects: 23% (14763/64185), 10.45 MiB | 20.88 MiB/s
Receiving objects: 24% (15405/64185), 10.45 MiB | 20.88 MiB/s
Receiving objects: 25% (16047/64185), 10.45 MiB | 20.88 MiB/s
Receiving objects: 26% (16689/64185), 10.45 MiB | 20.88 MiB/s
Receiving objects: 27% (17330/64185), 10.45 MiB | 20.88 MiB/s
Receiving objects: 28% (17972/64185), 10.45 MiB | 20.88 MiB/s
Receiving objects: 29% (18614/64185), 10.45 MiB | 20.88 MiB/s
Receiving objects: 30% (19256/64185), 10.45 MiB | 20.88 MiB/s
Receiving objects: 31% (19898/64185), 10.45 MiB | 20.88 MiB/s
Receiving objects: 32% (20540/64185), 10.45 MiB | 20.88 MiB/s
Receiving objects: 33% (21182/64185), 10.45 MiB | 20.88 MiB/s
Receiving objects: 34% (21823/64185), 10.45 MiB | 20.88 MiB/s
Receiving objects: 35% (22465/64185), 10.45 MiB | 20.88 MiB/s
Receiving objects: 36% (23107/64185), 10.45 MiB | 20.88 MiB/s
Receiving objects: 37% (23749/64185), 10.45 MiB | 20.88 MiB/s
Receiving objects: 38% (24391/64185), 10.45 MiB | 20.88 MiB/s
Receiving objects: 39% (25033/64185), 10.45 MiB | 20.88 MiB/s
Receiving objects: 40% (25674/64185), 10.45 MiB | 20.88 MiB/s
Receiving objects: 41% (26316/64185), 10.45 MiB | 20.88 MiB/s
Receiving objects: 42% (26958/64185), 10.45 MiB | 20.88 MiB/s
Receiving objects: 43% (27600/64185), 10.45 MiB | 20.88 MiB/s
Receiving objects: 44% (28242/64185), 10.45 MiB | 20.88 MiB/s
Receiving objects: 45% (28884/64185), 10.45 MiB | 20.88 MiB/s
Receiving objects: 46% (29526/64185), 10.45 MiB | 20.88 MiB/s
Receiving objects: 47% (30167/64185), 10.45 MiB | 20.88 MiB/s
Receiving objects: 48% (30809/64185), 10.45 MiB | 20.88 MiB/s
Receiving objects: 49% (31451/64185), 10.45 MiB | 20.88 MiB/s
Receiving objects: 50% (32093/64185), 10.45 MiB | 20.88 MiB/s
Receiving objects: 50% (32266/64185), 10.45 MiB | 20.88 MiB/s
Receiving objects: 51% (32735/64185), 27.62 MiB | 27.62 MiB/s
Receiving objects: 52% (33377/64185), 27.62 MiB | 27.62 MiB/s
Receiving objects: 53% (34019/64185), 27.62 MiB | 27.62 MiB/s
Receiving objects: 54% (34660/64185), 27.62 MiB | 27.62 MiB/s
Receiving objects: 55% (35302/64185), 27.62 MiB | 27.62 MiB/s
Receiving objects: 56% (35944/64185), 27.62 MiB | 27.62 MiB/s
Receiving objects: 57% (36586/64185), 27.62 MiB | 27.62 MiB/s
Receiving objects: 58% (37228/64185), 27.62 MiB | 27.62 MiB/s
Receiving objects: 59% (37870/64185), 27.62 MiB | 27.62 MiB/s
Receiving objects: 60% (38511/64185), 42.91 MiB | 28.60 MiB/s
Receiving objects: 61% (39153/64185), 42.91 MiB | 28.60 MiB/s
Receiving objects: 62% (39795/64185), 42.91 MiB | 28.60 MiB/s
Receiving objects: 63% (40437/64185), 42.91 MiB | 28.60 MiB/s
Receiving objects: 64% (41079/64185), 42.91 MiB | 28.60 MiB/s
Receiving objects: 65% (41721/64185), 42.91 MiB | 28.60 MiB/s
Receiving objects: 66% (42363/64185), 42.91 MiB | 28.60 MiB/s
Receiving objects: 67% (43004/64185), 42.91 MiB | 28.60 MiB/s
Receiving objects: 68% (43646/64185), 42.91 MiB | 28.60 MiB/s
Receiving objects: 69% (44288/64185), 42.91 MiB | 28.60 MiB/s
Receiving objects: 70% (44930/64185), 42.91 MiB | 28.60 MiB/s
Receiving objects: 71% (45572/64185), 42.91 MiB | 28.60 MiB/s
Receiving objects: 71% (45819/64185), 57.87 MiB | 28.62 MiB/s
Receiving objects: 72% (46214/64185), 57.87 MiB | 28.62 MiB/s
Receiving objects: 73% (46856/64185), 57.87 MiB | 28.62 MiB/s
Receiving objects: 74% (47497/64185), 57.87 MiB | 28.62 MiB/s
Receiving objects: 75% (48139/64185), 57.87 MiB | 28.62 MiB/s
Receiving objects: 76% (48781/64185), 68.49 MiB | 27.16 MiB/s
Receiving objects: 77% (49423/64185), 68.49 MiB | 27.16 MiB/s
Receiving objects: 78% (50065/64185), 68.49 MiB | 27.16 MiB/s
Receiving objects: 78% (50404/64185), 68.49 MiB | 27.16 MiB/s
Receiving objects: 79% (50707/64185), 73.96 MiB | 24.45 MiB/s
Receiving objects: 80% (51348/64185), 73.96 MiB | 24.45 MiB/s
Receiving objects: 81% (51990/64185), 73.96 MiB | 24.45 MiB/s
Receiving objects: 82% (52632/64185), 73.96 MiB | 24.45 MiB/s
Receiving objects: 83% (53274/64185), 79.80 MiB | 22.64 MiB/s
Receiving objects: 83% (53292/64185), 84.21 MiB | 20.92 MiB/s
Receiving objects: 84% (53916/64185), 84.21 MiB | 20.92 MiB/s
Receiving objects: 85% (54558/64185), 84.21 MiB | 20.92 MiB/s
Receiving objects: 86% (55200/64185), 84.21 MiB | 20.92 MiB/s
Receiving objects: 87% (55841/64185), 84.21 MiB | 20.92 MiB/s
Receiving objects: 88% (56483/64185), 84.21 MiB | 20.92 MiB/s
Receiving objects: 89% (57125/64185), 84.21 MiB | 20.92 MiB/s
Receiving objects: 90% (57767/64185), 84.21 MiB | 20.92 MiB/s
Receiving objects: 91% (58409/64185), 87.89 MiB | 19.41 MiB/s
Receiving objects: 92% (59051/64185), 87.89 MiB | 19.41 MiB/s
Receiving objects: 93% (59693/64185), 87.89 MiB | 19.41 MiB/s
Receiving objects: 94% (60334/64185), 87.89 MiB | 19.41 MiB/s
Receiving objects: 95% (60976/64185), 87.89 MiB | 19.41 MiB/s
Receiving objects: 96% (61618/64185), 87.89 MiB | 19.41 MiB/s
Receiving objects: 96% (61829/64185), 87.89 MiB | 19.41 MiB/s
Receiving objects: 97% (62260/64185), 91.23 MiB | 17.80 MiB/s
Receiving objects: 98% (62902/64185), 94.73 MiB | 14.79 MiB/s
Receiving objects: 99% (63544/64185), 94.73 MiB | 14.79 MiB/s
remote: Total 64185 (delta 7397), reused 7776 (delta 6680), pack-reused 54634 (from 3)
9.21 s
Receiving objects: 100% (64185/64185), 94.73 MiB | 14.79 MiB/s
Receiving objects: 100% (64185/64185), 97.84 MiB | 16.39 MiB/s, done.
9.81 s
Resolving deltas: 0% (0/44316)
Resolving deltas: 1% (444/44316)
Resolving deltas: 2% (887/44316)
Resolving deltas: 3% (1330/44316)
Resolving deltas: 4% (1773/44316)
Resolving deltas: 5% (2216/44316)
Resolving deltas: 6% (2659/44316)
Resolving deltas: 7% (3103/44316)
Resolving deltas: 8% (3546/44316)
Resolving deltas: 9% (3989/44316)
Resolving deltas: 10% (4432/44316)
Resolving deltas: 11% (4875/44316)
Resolving deltas: 12% (5318/44316)
Resolving deltas: 13% (5763/44316)
Resolving deltas: 14% (6206/44316)
Resolving deltas: 15% (6648/44316)
Resolving deltas: 16% (7091/44316)
Resolving deltas: 17% (7534/44316)
Resolving deltas: 18% (7977/44316)
Resolving deltas: 19% (8421/44316)
Resolving deltas: 20% (8864/44316)
Resolving deltas: 21% (9309/44316)
Resolving deltas: 22% (9750/44316)
Resolving deltas: 23% (10193/44316)
Resolving deltas: 24% (10636/44316)
Resolving deltas: 25% (11082/44316)
Resolving deltas: 26% (11523/44316)
Resolving deltas: 27% (11966/44316)
Resolving deltas: 28% (12409/44316)
Resolving deltas: 29% (12855/44316)
Resolving deltas: 30% (13295/44316)
Resolving deltas: 31% (13738/44316)
Resolving deltas: 32% (14185/44316)
Resolving deltas: 33% (14626/44316)
Resolving deltas: 34% (15068/44316)
Resolving deltas: 35% (15512/44316)
Resolving deltas: 36% (15954/44316)
Resolving deltas: 37% (16397/44316)
Resolving deltas: 38% (16841/44316)
Resolving deltas: 39% (17284/44316)
Resolving deltas: 40% (17727/44316)
Resolving deltas: 41% (18170/44316)
Resolving deltas: 42% (18613/44316)
Resolving deltas: 43% (19056/44316)
Resolving deltas: 44% (19502/44316)
Resolving deltas: 45% (19943/44316)
Resolving deltas: 46% (20387/44316)
Resolving deltas: 47% (20830/44316)
Resolving deltas: 48% (21272/44316)
Resolving deltas: 49% (21715/44316)
Resolving deltas: 50% (22161/44316)
Resolving deltas: 51% (22602/44316)
Resolving deltas: 52% (23045/44316)
Resolving deltas: 53% (23488/44316)
Resolving deltas: 54% (23934/44316)
Resolving deltas: 55% (24375/44316)
Resolving deltas: 56% (24818/44316)
Resolving deltas: 57% (25262/44316)
Resolving deltas: 58% (25704/44316)
Resolving deltas: 59% (26147/44316)
Resolving deltas: 60% (26590/44316)
Resolving deltas: 61% (27033/44316)
Resolving deltas: 62% (27476/44316)
Resolving deltas: 63% (27920/44316)
Resolving deltas: 64% (28363/44316)
Resolving deltas: 65% (28806/44316)
Resolving deltas: 66% (29250/44316)
Resolving deltas: 67% (29692/44316)
Resolving deltas: 68% (30135/44316)
Resolving deltas: 69% (30579/44316)
Resolving deltas: 70% (31022/44316)
Resolving deltas: 71% (31465/44316)
Resolving deltas: 72% (31908/44316)
Resolving deltas: 73% (32351/44316)
Resolving deltas: 74% (32794/44316)
Resolving deltas: 75% (33237/44316)
Resolving deltas: 76% (33681/44316)
Resolving deltas: 77% (34124/44316)
Resolving deltas: 78% (34567/44316)
Resolving deltas: 79% (35012/44316)
Resolving deltas: 80% (35453/44316)
Resolving deltas: 81% (35897/44316)
Resolving deltas: 82% (36340/44316)
Resolving deltas: 83% (36783/44316)
Resolving deltas: 84% (37226/44316)
Resolving deltas: 85% (37670/44316)
Resolving deltas: 86% (38112/44316)
Resolving deltas: 87% (38555/44316)
Resolving deltas: 88% (38999/44316)
Resolving deltas: 89% (39442/44316)
Resolving deltas: 90% (39885/44316)
Resolving deltas: 91% (40329/44316)
Resolving deltas: 92% (40773/44316)
Resolving deltas: 93% (41214/44316)
Resolving deltas: 94% (41659/44316)
Resolving deltas: 95% (42101/44316)
Resolving deltas: 96% (42544/44316)
Resolving deltas: 97% (42987/44316)
Resolving deltas: 98% (43430/44316)
Resolving deltas: 99% (43873/44316)
Resolving deltas: 100% (44316/44316)
Resolving deltas: 100% (44316/44316), done.
10.10 s
Fetching commit e848309923f9136d533613bb15d1029beb045263 for push-vrpyqyylypmw ...
10.10 s
$ /nix/store/bcnisk3ydfgv26v2gw3zlky24g00yww2-git-2.54.0/bin/git fetch origin e848309923f9136d533613bb15d1029beb045263
10.60 s
From https://github.com/alphal00p/gammaloop
10.60 s
* branch e848309923f9136d533613bb15d1029beb045263 -> FETCH_HEAD
10.62 s
$ /nix/store/9ypz3flqsrl5xl495mm8h645gadjsxi1-coreutils-9.11/bin/timeout --kill-after=15s 7200s /nix/store/bcnisk3ydfgv26v2gw3zlky24g00yww2-git-2.54.0/bin/git -c advice.detachedHead=false checkout e848309923f9136d533613bb15d1029beb045263
10.81 s
HEAD is now at e8483099 fix Python extension artifact builds
10.83 s
$ /nix/store/9ypz3flqsrl5xl495mm8h645gadjsxi1-coreutils-9.11/bin/timeout --kill-after=15s 7200s /nix/store/23zk8sgzamrbmj1fday15szf7f2279s8-nix-2.34.7/bin/nix --extra-experimental-features nix-command --extra-experimental-features flakes --log-format internal-json run .#packages.x86_64-linux.nix-ci-check-gammaloop-nextest-core --print-build-logs
10.93 s
error (ignored): SQLite database '/var/cache/nix-ci-worker/eval-cache-v6/639d820d3aefaf84d2031f68b4d767476d59bba71ff868bb2c310db0263ad60e.sqlite ' is busy
17.26 s
17.45 s
Downloading cached gammaloop-nextest-binaries-core-gammaloop-api from https://cache.nix-ci.com
17.51 s
Downloading cached gammaloop-nextest-binaries-core-gammaloop-tracing-filter from https://cache.nix-ci.com
17.51 s
Downloading cached gammaloop-nextest-binaries-core-gammaloop-tracing-filter-macros from https://cache.nix-ci.com
17.51 s
Downloading cached gammaloop-nextest-binaries-core-gammalooprs from https://cache.nix-ci.com
17.51 s
Downloading cached libunistring from https://cache.nix-ci.com
17.51 s
Downloading cached publicsuffix-list-0-unstable-2026-05 from https://cache.nix-ci.com
17.56 s
Downloaded cached publicsuffix-list-0-unstable-2026-05 (329 KiB) in 54ms
17.56 s
Progress: 0 of 1 built, 1 of 68 downloaded from cache (5 downloading)
17.58 s
Downloaded cached libunistring (2 MiB) in 76ms
17.58 s
Progress: 0 of 1 built, 2 of 68 downloaded from cache (4 downloading)
17.58 s
Downloading cached libidn2 from https://cache.nix-ci.com
17.82 s
Downloaded cached gammaloop-nextest-binaries-core-gammaloop-tracing-filter-macros (1.7 MiB) in 313ms
17.82 s
Progress: 0 of 1 built, 3 of 68 downloaded from cache (4 downloading)
17.84 s
Downloaded cached libidn2 (359 KiB) in 253ms
17.84 s
Progress: 0 of 1 built, 4 of 68 downloaded from cache (3 downloading)
17.84 s
Downloading cached glibc-2.42 from https://cache.nix-ci.com
18.20 s
Downloaded cached gammaloop-nextest-binaries-core-gammaloop-tracing-filter (8.1 MiB) in 694ms
18.20 s
Progress: 0 of 1 built, 5 of 68 downloaded from cache (3 downloading)
18.30 s
Downloaded cached glibc-2.42 (33.5 MiB) in 463ms
18.30 s
Progress: 0 of 1 built, 6 of 68 downloaded from cache (2 downloading)
18.30 s
Downloading cached attr from https://cache.nix-ci.com
18.30 s
Downloading cached aws-c-common from https://cache.nix-ci.com
18.30 s
Downloading cached bash from https://cache.nix-ci.com
18.30 s
Downloading cached brotli-1.2.0-lib from https://cache.nix-ci.com
18.30 s
Downloading cached bzip2 from https://cache.nix-ci.com
18.30 s
Downloading cached gcc-15.2.0-lib from https://cache.nix-ci.com
18.30 s
Downloading cached editline-1.17.1-unstable-2025-05 from https://cache.nix-ci.com
18.30 s
Downloading cached hwloc-2.14.0-lib from https://cache.nix-ci.com
18.30 s
Downloading cached keyutils-1.6.3-lib from https://cache.nix-ci.com
18.30 s
Downloading cached libcpuid from https://cache.nix-ci.com
18.30 s
Downloading cached libpsl from https://cache.nix-ci.com
18.30 s
Downloading cached libseccomp-2.6.0-lib from https://cache.nix-ci.com
18.30 s
Downloading cached libsodium-1.0.22-unstable-2026-04 from https://cache.nix-ci.com
18.30 s
Downloading cached libxml2 from https://cache.nix-ci.com
18.42 s
Downloaded cached bzip2 (86 KiB) in 119ms
18.42 s
Progress: 0 of 1 built, 7 of 68 downloaded from cache (15 downloading)
18.42 s
Downloading cached llhttp from https://cache.nix-ci.com
18.44 s
Downloaded cached aws-c-common (1.1 MiB) in 139ms
18.44 s
Progress: 0 of 1 built, 8 of 68 downloaded from cache (15 downloading)
18.44 s
Downloading cached lowdown-3.0.1-lib from https://cache.nix-ci.com
18.45 s
Downloaded cached bash (1.8 MiB) in 149ms
18.45 s
Progress: 0 of 1 built, 9 of 68 downloaded from cache (15 downloading)
18.45 s
Downloading cached aws-c-compression from https://cache.nix-ci.com
18.47 s
Downloaded cached brotli-1.2.0-lib (961 KiB) in 172ms
18.47 s
Progress: 0 of 1 built, 10 of 68 downloaded from cache (15 downloading)
18.47 s
Downloading cached aws-c-sdkutils from https://cache.nix-ci.com
18.51 s
Downloaded cached keyutils-1.6.3-lib (41 KiB) in 207ms
18.51 s
Progress: 0 of 1 built, 11 of 68 downloaded from cache (15 downloading)
18.51 s
Downloading cached aws-checksums from https://cache.nix-ci.com
18.51 s
Downloaded cached libpsl (114 KiB) in 208ms
18.51 s
Progress: 0 of 1 built, 12 of 68 downloaded from cache (15 downloading)
18.51 s
Downloading cached nghttp2-1.69.0-lib from https://cache.nix-ci.com
18.51 s
Downloaded cached attr (90 KiB) in 211ms
18.51 s
Progress: 0 of 1 built, 13 of 68 downloaded from cache (15 downloading)
18.51 s
Downloading cached nghttp3 from https://cache.nix-ci.com
18.52 s
Downloaded cached libcpuid (326 KiB) in 219ms
18.52 s
Progress: 0 of 1 built, 14 of 68 downloaded from cache (15 downloading)
18.52 s
Downloading cached acl from https://cache.nix-ci.com
18.52 s
Downloaded cached editline-1.17.1-unstable-2025-05 (58 KiB) in 221ms
18.52 s
Progress: 0 of 1 built, 15 of 68 downloaded from cache (15 downloading)
18.52 s
Downloading cached openssl from https://cache.nix-ci.com
18.53 s
Downloaded cached hwloc-2.14.0-lib (459 KiB) in 230ms
18.53 s
Progress: 0 of 1 built, 16 of 68 downloaded from cache (15 downloading)
18.53 s
Downloading cached pcre2 from https://cache.nix-ci.com
18.54 s
Downloaded cached libseccomp-2.6.0-lib (193 KiB) in 240ms
18.54 s
Progress: 0 of 1 built, 17 of 68 downloaded from cache (15 downloading)
18.54 s
Downloading cached xz from https://cache.nix-ci.com
18.54 s
Downloaded cached libsodium-1.0.22-unstable-2026-04 (666 KiB) in 241ms
18.54 s
Downloaded cached libxml2 (1.4 MiB) in 241ms
18.54 s
Progress: 0 of 1 built, 18 of 68 downloaded from cache (15 downloading)
18.54 s
Downloaded cached gcc-15.2.0-lib (9.8 MiB) in 242ms
18.54 s
Progress: 0 of 1 built, 19 of 68 downloaded from cache (14 downloading)
18.55 s
Progress: 0 of 1 built, 20 of 68 downloaded from cache (14 downloading)
18.55 s
Downloading cached zlib from https://cache.nix-ci.com
18.55 s
Downloading cached boehm-gc from https://cache.nix-ci.com
18.55 s
Downloading cached icu4c from https://cache.nix-ci.com
18.55 s
Downloaded cached aws-c-compression (31 KiB) in 98ms
18.55 s
Progress: 0 of 1 built, 21 of 68 downloaded from cache (15 downloading)
18.55 s
Downloading cached onetbb from https://cache.nix-ci.com
18.55 s
Downloaded cached llhttp (89 KiB) in 130ms
18.55 s
Progress: 0 of 1 built, 22 of 68 downloaded from cache (15 downloading)
18.55 s
Downloading cached zstd from https://cache.nix-ci.com
18.55 s
Downloaded cached lowdown-3.0.1-lib (341 KiB) in 112ms
18.55 s
Progress: 0 of 1 built, 23 of 68 downloaded from cache (15 downloading)
18.60 s
Downloaded cached aws-c-sdkutils (155 KiB) in 128ms
18.60 s
Progress: 0 of 1 built, 24 of 68 downloaded from cache (14 downloading)
18.63 s
Downloaded cached aws-checksums (86 KiB) in 120ms
18.63 s
Progress: 0 of 1 built, 25 of 68 downloaded from cache (13 downloading)
18.63 s
Downloaded cached nghttp2-1.69.0-lib (225 KiB) in 123ms
18.63 s
Progress: 0 of 1 built, 26 of 68 downloaded from cache (12 downloading)
18.63 s
Downloaded cached nghttp3 (228 KiB) in 120ms
18.63 s
Progress: 0 of 1 built, 27 of 68 downloaded from cache (11 downloading)
18.67 s
Downloaded cached acl (125 KiB) in 151ms
18.67 s
Progress: 0 of 1 built, 28 of 68 downloaded from cache (10 downloading)
18.69 s
Downloaded cached xz (837 KiB) in 142ms
18.69 s
Progress: 0 of 1 built, 29 of 68 downloaded from cache (9 downloading)
18.70 s
Downloaded cached pcre2 (2 MiB) in 165ms
18.70 s
Progress: 0 of 1 built, 30 of 68 downloaded from cache (8 downloading)
18.79 s
Downloaded cached zlib (129 KiB) in 243ms
18.79 s
Progress: 0 of 1 built, 31 of 68 downloaded from cache (7 downloading)
18.79 s
Downloading cached sqlite from https://cache.nix-ci.com
18.79 s
Downloaded cached openssl (8.9 MiB) in 270ms
18.79 s
Progress: 0 of 1 built, 32 of 68 downloaded from cache (7 downloading)
18.79 s
Downloading cached aws-c-cal from https://cache.nix-ci.com
18.79 s
Downloading cached krb5-1.22.2-lib from https://cache.nix-ci.com
18.79 s
Downloading cached libssh2 from https://cache.nix-ci.com
18.79 s
Downloading cached ngtcp2 from https://cache.nix-ci.com
18.79 s
Downloading cached s2n-tls from https://cache.nix-ci.com
18.80 s
Downloaded cached boehm-gc (312 KiB) in 256ms
18.80 s
Progress: 0 of 1 built, 33 of 68 downloaded from cache (11 downloading)
18.81 s
Downloaded cached onetbb (626 KiB) in 258ms
18.81 s
Progress: 0 of 1 built, 34 of 68 downloaded from cache (10 downloading)
18.81 s
Downloading cached libblake3 from https://cache.nix-ci.com
18.82 s
Downloaded cached zstd (1.1 MiB) in 268ms
18.82 s
Progress: 0 of 1 built, 35 of 68 downloaded from cache (10 downloading)
18.82 s
Downloading cached libarchive-3.8.8-lib from https://cache.nix-ci.com
19.00 s
Downloaded cached aws-c-cal (158 KiB) in 207ms
19.00 s
Progress: 0 of 1 built, 36 of 68 downloaded from cache (10 downloading)
19.01 s
Downloaded cached libssh2 (330 KiB) in 219ms
19.01 s
Progress: 0 of 1 built, 37 of 68 downloaded from cache (9 downloading)
19.01 s
Downloading cached libgit2-1.9.4-lib from https://cache.nix-ci.com
19.03 s
Downloaded cached ngtcp2 (515 KiB) in 234ms
19.03 s
Progress: 0 of 1 built, 38 of 68 downloaded from cache (9 downloading)
19.04 s
Downloaded cached libblake3 (117 KiB) in 227ms
19.04 s
Progress: 0 of 1 built, 39 of 68 downloaded from cache (8 downloading)
19.05 s
Downloaded cached s2n-tls (1.3 MiB) in 255ms
19.05 s
Progress: 0 of 1 built, 40 of 68 downloaded from cache (7 downloading)
19.05 s
Downloading cached aws-c-io from https://cache.nix-ci.com
19.09 s
Downloaded cached libarchive-3.8.8-lib (953 KiB) in 267ms
19.09 s
Progress: 0 of 1 built, 41 of 68 downloaded from cache (7 downloading)
19.11 s
Downloaded cached krb5-1.22.2-lib (2.7 MiB) in 310ms
19.11 s
Progress: 0 of 1 built, 42 of 68 downloaded from cache (6 downloading)
19.11 s
Downloading cached curl from https://cache.nix-ci.com
19.19 s
Downloaded cached sqlite (5.7 MiB) in 402ms
19.19 s
Progress: 0 of 1 built, 43 of 68 downloaded from cache (6 downloading)
19.25 s
Downloaded cached aws-c-io (648 KiB) in 204ms
19.26 s
Progress: 0 of 1 built, 44 of 68 downloaded from cache (5 downloading)
19.26 s
Downloading cached aws-c-event-stream from https://cache.nix-ci.com
19.26 s
Downloading cached aws-c-http from https://cache.nix-ci.com
19.28 s
Downloaded cached libgit2-1.9.4-lib (1.6 MiB) in 266ms
19.28 s
Progress: 0 of 1 built, 45 of 68 downloaded from cache (6 downloading)
19.31 s
Downloaded cached curl (1.2 MiB) in 205ms
19.31 s
Progress: 0 of 1 built, 46 of 68 downloaded from cache (5 downloading)
19.35 s
Downloaded cached icu4c (38.2 MiB) in 803ms
19.35 s
Progress: 0 of 1 built, 47 of 68 downloaded from cache (4 downloading)
19.35 s
Downloading cached boost from https://cache.nix-ci.com
19.43 s
Downloaded cached aws-c-event-stream (176 KiB) in 171ms
19.43 s
Progress: 0 of 1 built, 48 of 68 downloaded from cache (4 downloading)
19.43 s
Downloaded cached aws-c-http (641 KiB) in 174ms
19.43 s
Progress: 0 of 1 built, 49 of 68 downloaded from cache (3 downloading)
19.43 s
Downloading cached aws-c-auth from https://cache.nix-ci.com
19.43 s
Downloading cached aws-c-mqtt from https://cache.nix-ci.com
19.62 s
Downloaded cached boost (14.5 MiB) in 268ms
19.62 s
Progress: 0 of 1 built, 50 of 68 downloaded from cache (4 downloading)
19.62 s
Downloading cached nix-util from https://cache.nix-ci.com
19.63 s
Downloaded cached aws-c-auth (387 KiB) in 195ms
19.63 s
Progress: 0 of 1 built, 51 of 68 downloaded from cache (4 downloading)
19.63 s
Downloading cached aws-c-s3 from https://cache.nix-ci.com
19.63 s
Downloaded cached aws-c-mqtt (557 KiB) in 196ms
19.63 s
Progress: 0 of 1 built, 52 of 68 downloaded from cache (4 downloading)
19.78 s
Downloaded cached nix-util (2.4 MiB) in 163ms
19.78 s
Progress: 0 of 1 built, 53 of 68 downloaded from cache (3 downloading)
19.78 s
Downloading cached nix-nswrapper from https://cache.nix-ci.com
19.81 s
Downloaded cached aws-c-s3 (384 KiB) in 187ms
19.81 s
Progress: 0 of 1 built, 54 of 68 downloaded from cache (3 downloading)
19.81 s
Downloading cached aws-crt-cpp from https://cache.nix-ci.com
19.95 s
Downloaded cached nix-nswrapper (131 KiB) in 170ms
19.95 s
Progress: 0 of 1 built, 55 of 68 downloaded from cache (3 downloading)
20.00 s
Downloaded cached aws-crt-cpp (979 KiB) in 186ms
20.00 s
Progress: 0 of 1 built, 56 of 68 downloaded from cache (2 downloading)
20.00 s
Downloading cached nix-store from https://cache.nix-ci.com
20.19 s
Downloaded cached nix-store (5.8 MiB) in 185ms
20.19 s
Progress: 0 of 1 built, 57 of 68 downloaded from cache (2 downloading)
20.19 s
Downloading cached nix-fetchers from https://cache.nix-ci.com
20.19 s
Downloading cached nix-main from https://cache.nix-ci.com
20.33 s
Downloaded cached nix-main (393 KiB) in 148ms
20.33 s
Progress: 0 of 1 built, 58 of 68 downloaded from cache (3 downloading)
20.35 s
Downloaded cached nix-fetchers (1.5 MiB) in 160ms
20.35 s
Progress: 0 of 1 built, 59 of 68 downloaded from cache (2 downloading)
20.35 s
Downloading cached nix-expr from https://cache.nix-ci.com
20.63 s
Downloaded cached nix-expr (3.3 MiB) in 279ms
20.63 s
Progress: 0 of 1 built, 60 of 68 downloaded from cache (2 downloading)
20.63 s
Downloading cached nix-flake from https://cache.nix-ci.com
20.89 s
Downloaded cached nix-flake (956 KiB) in 262ms
20.89 s
Progress: 0 of 1 built, 61 of 68 downloaded from cache (2 downloading)
20.89 s
Downloading cached nix-cmd from https://cache.nix-ci.com
21.07 s
Downloaded cached nix-cmd (1 MiB) in 181ms
21.07 s
Progress: 0 of 1 built, 62 of 68 downloaded from cache (2 downloading)
21.07 s
Downloading cached nix from https://cache.nix-ci.com
21.38 s
Downloaded cached nix (3.9 MiB) in 312ms
21.38 s
Progress: 0 of 1 built, 63 of 68 downloaded from cache (2 downloading)
21.38 s
Downloading cached nix from https://cache.nix-ci.com
21.62 s
Downloaded cached nix (8848 B) in 240ms
21.62 s
Progress: 0 of 1 built, 64 of 68 downloaded from cache (2 downloading)
22.32 s
Downloaded cached gammaloop-nextest-binaries-core-gammalooprs (79.4 MiB) in 4.8s
22.32 s
Progress: 0 of 1 built, 65 of 68 downloaded from cache (1 downloading)
29.21 s
Downloaded cached gammaloop-nextest-binaries-core-gammaloop-api (68.4 MiB) in 11.7s
29.33 s
Progress: 0 of 1 built, 66 of 68 downloaded from cache
29.33 s
Downloading cached gammaloop-nextest-binaries-core from https://cache.nix-ci.com
29.33 s
Downloaded cached gammaloop-nextest-binaries-core (1640 B) in 0ms
29.33 s
Progress: 0 of 1 built, 67 of 68 downloaded from cache
29.33 s
Downloading cached nix-ci-check-gammaloop-nextest-core from https://cache.nix-ci.com
29.33 s
Downloaded cached nix-ci-check-gammaloop-nextest-core (1016 B) in 0ms
29.33 s
Progress: 0 of 1 built, 68 of 68 downloaded from cache
34.29 s
evaluating derivation 'g
copying '/nix/store/lvky
evaluating derivation 'g
copying '/nix/store/lvky
evaluating derivation 'g
copying '/nix/store/lvky
evaluating derivation 'g
copying '/nix/store/lvky
evaluating derivation 'g
copying '/nix/store/lvky
evaluating derivation 'g
querying gammaloop-nexte
[0.6 KiB DL] querying ca
[2.2 KiB DL] querying fl
[3.2 KiB DL] querying nt
[4.8 KiB DL] querying gf
[6.2 KiB DL] querying gf
[1 /0 /13 built, 7 /0 /13 co
[2 /0 /12 built, 6 /3 /13 cocrane-dummy-cargo-target.rs (post)> Uploading to the NixCI cache: /nix/store/hd50hqi25fymr09a2w4xdiy5jmb2cfl5-crane-dummy-cargo-target.rs
34.34 s
crane-dummy-cargo-target.rs (post)> warning: 'warn-short-path-literals' is deprecated, use 'lint-short-path-literals = ignore' instead
34.47 s
crane-dummy-cargo-target.rs (post)> copying 0 paths...
34.52 s
crane-dummy-cargo-target.rs (post)> warning: 'warn-short-path-literals' is deprecated, use 'lint-short-path-literals = ignore' instead
34.66 s
crane-dummy-cargo-target.rs (post)> copying 0 paths...
34.69 s
[1 /1 /12 built, 3 /6 /13 cocrane-dummy-proc-macro-cargo-target.rs (post)> Uploading to the NixCI cache: /nix/store/z0b4s6pznqwlbyw5v4bbq7k1kp721g19-crane-dummy-proc-macro-cargo-target.rs
34.73 s
crane-dummy-proc-macro-cargo-target.rs (post)> warning: 'warn-short-path-literals' is deprecated, use 'lint-short-path-literals = ignore' instead
34.86 s
crane-dummy-proc-macro-cargo-target.rs (post)> copying 0 paths...
34.91 s
crane-dummy-proc-macro-cargo-target.rs (post)> warning: 'warn-short-path-literals' is deprecated, use 'lint-short-path-literals = ignore' instead
35.06 s
crane-dummy-proc-macro-cargo-target.rs (post)> copying 0 paths...
40.44 s
[2 /12 built, 4 /6 /13 copi
[2 /11 built, 4 /7 /13 copi
[2 /11 built, 4 /8 /13 copi
[2 /10 built, 3 /9 /13 copi
48.11 s
[2 /9 built, 2 /10 /13 copi
59.54 s
[2 /8 built, 1 /11 /13 copi
71.78 s
[2 /4 built, 13 copied (7
[1 /2 /3 built, 13 copied gammaloop-nextest-core> Extracting 3 binaries (including 1 non-test binary), 1 build script output directory, and 2 linked paths to /build/nextest-archive-rwBuRm
72.37 s
gammaloop-nextest-core> Extracted 18 files to /build/nextest-archive-rwBuRm in 0.59s
72.39 s
gammaloop-nextest-core> ------------
72.39 s
gammaloop-nextest-core> Nextest run ID 76bc058a-26a0-47a5-b110-6539d5013011 with nextest profile: ci_gammaloop
72.39 s
gammaloop-nextest-core> Starting 339 tests across 2 binaries
72.76 s
gammaloop-nextest-core> FAIL [ 0.031s] (243/339) gammaloop-api repl::tests :: completion_shows_type_hint_for_non_boolean_settings_leaf
72.76 s
gammaloop-nextest-core> stdout ---
72.76 s
gammaloop-nextest-core>
72.76 s
gammaloop-nextest-core> running 1 test
72.76 s
gammaloop-nextest-core> test repl::tests::completion_shows_type_hint_for_non_boolean_settings_leaf ... FAILED
72.76 s
gammaloop-nextest-core>
72.76 s
gammaloop-nextest-core> failures:
72.76 s
gammaloop-nextest-core>
72.76 s
gammaloop-nextest-core> failures:
72.76 s
gammaloop-nextest-core> repl::tests::completion_shows_type_hint_for_non_boolean_settings_leaf
72.76 s
gammaloop-nextest-core>
72.76 s
gammaloop-nextest-core> test result: FAILED. 0 passed; 1 failed; 0 ignored; 0 measured; 338 filtered out; finished in 0.01s
72.76 s
gammaloop-nextest-core>
72.76 s
gammaloop-nextest-core> stderr ---
72.76 s
gammaloop-nextest-core>
72.76 s
gammaloop-nextest-core> thread 'repl::tests::completion_shows_type_hint_for_non_boolean_settings_leaf' (775) panicked at crates/gammaloop-api/src/repl.rs:5778:9:
72.76 s
gammaloop-nextest-core> [Suggestion { value: "", description: Some("Number of samples in the first Monte Carlo iteration."), style: None, extra: None, span: Span { start: 42, end: 42 }, append_whitespace: false }]
72.76 s
gammaloop-nextest-core> stack backtrace:
72.76 s
gammaloop-nextest-core> 0: __rustc::rust_begin_unwind
72.76 s
gammaloop-nextest-core> 1: core::panicking::panic_fmt
72.76 s
gammaloop-nextest-core> 2: gammaloop_api::repl::tests::completion_shows_type_hint_for_non_boolean_settings_leaf
72.76 s
gammaloop-nextest-core> 3: <gammaloop_api::repl::tests::completion_shows_type_hint_for_non_boolean_settings_leaf::{closure#0} as core::ops::function::FnOnce<()>>::call_once
72.76 s
gammaloop-nextest-core> note: Some details are omitted, run with `RUST_BACKTRACE=full` for a verbose backtrace.
72.76 s
gammaloop-nextest-core>
72.90 s
gammaloop-nextest-core> FAIL [ 0.101s] (290/339) gammaloop-api templates::tests :: extract_templates_uses_canonical_package_layout
72.90 s
gammaloop-nextest-core> stdout ---
72.90 s
gammaloop-nextest-core>
72.90 s
gammaloop-nextest-core> running 1 test
72.90 s
gammaloop-nextest-core> test templates::tests::extract_templates_uses_canonical_package_layout ... FAILED
72.90 s
gammaloop-nextest-core>
72.90 s
gammaloop-nextest-core> failures:
72.90 s
gammaloop-nextest-core>
72.90 s
gammaloop-nextest-core> failures:
72.90 s
gammaloop-nextest-core> templates::tests::extract_templates_uses_canonical_package_layout
72.90 s
gammaloop-nextest-core>
72.90 s
gammaloop-nextest-core> test result: FAILED. 0 passed; 1 failed; 0 ignored; 0 measured; 338 filtered out; finished in 0.09s
72.90 s
gammaloop-nextest-core>
72.90 s
gammaloop-nextest-core> stderr ---
72.90 s
gammaloop-nextest-core>
72.90 s
gammaloop-nextest-core> thread 'templates::tests::extract_templates_uses_canonical_package_layout' (876) panicked at crates/gammaloop-api/src/templates.rs:99:9:
72.90 s
gammaloop-nextest-core> assertion failed: figure.contains("amplitude-mode")
72.90 s
gammaloop-nextest-core> stack backtrace:
72.90 s
gammaloop-nextest-core> 0: __rustc::rust_begin_unwind
72.90 s
gammaloop-nextest-core> 1: core::panicking::panic_fmt
72.90 s
gammaloop-nextest-core> 2: core::panicking::panic
72.90 s
gammaloop-nextest-core> 3: gammaloop_api::templates::tests::extract_templates_uses_canonical_package_layout
72.90 s
gammaloop-nextest-core> 4: <gammaloop_api::templates::tests::extract_templates_uses_canonical_package_layout::{closure#0} as core::ops::function::FnOnce<()>>::call_once
72.90 s
gammaloop-nextest-core> note: Some details are omitted, run with `RUST_BACKTRACE=full` for a verbose backtrace.
72.90 s
gammaloop-nextest-core>
73.03 s
gammaloop-nextest-core> ------------
73.03 s
gammaloop-nextest-core> Summary [ 0.644s] 339 tests run: 337 passed , 2 failed , 0 skipped
73.03 s
gammaloop-nextest-core> FAIL [ 0.031s] (243/339) gammaloop-api repl::tests :: completion_shows_type_hint_for_non_boolean_settings_leaf
73.03 s
gammaloop-nextest-core> stdout ---
73.03 s
gammaloop-nextest-core>
73.03 s
gammaloop-nextest-core> running 1 test
73.03 s
gammaloop-nextest-core> test repl::tests::completion_shows_type_hint_for_non_boolean_settings_leaf ... FAILED
73.03 s
gammaloop-nextest-core>
73.03 s
gammaloop-nextest-core> failures:
73.03 s
gammaloop-nextest-core>
73.03 s
gammaloop-nextest-core> failures:
73.03 s
gammaloop-nextest-core> repl::tests::completion_shows_type_hint_for_non_boolean_settings_leaf
73.03 s
gammaloop-nextest-core>
73.03 s
gammaloop-nextest-core> test result: FAILED. 0 passed; 1 failed; 0 ignored; 0 measured; 338 filtered out; finished in 0.01s
73.03 s
gammaloop-nextest-core>
73.03 s
gammaloop-nextest-core> stderr ---
73.03 s
gammaloop-nextest-core>
73.03 s
gammaloop-nextest-core> thread 'repl::tests::completion_shows_type_hint_for_non_boolean_settings_leaf' (775) panicked at crates/gammaloop-api/src/repl.rs:5778:9:
73.03 s
gammaloop-nextest-core> [Suggestion { value: "", description: Some("Number of samples in the first Monte Carlo iteration."), style: None, extra: None, span: Span { start: 42, end: 42 }, append_whitespace: false }]
73.03 s
gammaloop-nextest-core> stack backtrace:
73.03 s
gammaloop-nextest-core> 0: __rustc::rust_begin_unwind
73.03 s
gammaloop-nextest-core> 1: core::panicking::panic_fmt
73.03 s
gammaloop-nextest-core> 2: gammaloop_api::repl::tests::completion_shows_type_hint_for_non_boolean_settings_leaf
73.03 s
gammaloop-nextest-core> 3: <gammaloop_api::repl::tests::completion_shows_type_hint_for_non_boolean_settings_leaf::{closure#0} as core::ops::function::FnOnce<()>>::call_once
73.03 s
gammaloop-nextest-core> note: Some details are omitted, run with `RUST_BACKTRACE=full` for a verbose backtrace.
73.03 s
gammaloop-nextest-core>
73.03 s
gammaloop-nextest-core> FAIL [ 0.101s] (290/339) gammaloop-api templates::tests :: extract_templates_uses_canonical_package_layout
73.03 s
gammaloop-nextest-core> stdout ---
73.03 s
gammaloop-nextest-core>
73.03 s
gammaloop-nextest-core> running 1 test
73.03 s
gammaloop-nextest-core> test templates::tests::extract_templates_uses_canonical_package_layout ... FAILED
73.03 s
gammaloop-nextest-core>
73.03 s
gammaloop-nextest-core> failures:
73.03 s
gammaloop-nextest-core>
73.03 s
gammaloop-nextest-core> failures:
73.03 s
gammaloop-nextest-core> templates::tests::extract_templates_uses_canonical_package_layout
73.03 s
gammaloop-nextest-core>
73.03 s
gammaloop-nextest-core> test result: FAILED. 0 passed; 1 failed; 0 ignored; 0 measured; 338 filtered out; finished in 0.09s
73.03 s
gammaloop-nextest-core>
73.03 s
gammaloop-nextest-core> stderr ---
73.03 s
gammaloop-nextest-core>
73.03 s
gammaloop-nextest-core> thread 'templates::tests::extract_templates_uses_canonical_package_layout' (876) panicked at crates/gammaloop-api/src/templates.rs:99:9:
73.03 s
gammaloop-nextest-core> assertion failed: figure.contains("amplitude-mode")
73.03 s
gammaloop-nextest-core> stack backtrace:
73.03 s
gammaloop-nextest-core> 0: __rustc::rust_begin_unwind
73.03 s
gammaloop-nextest-core> 1: core::panicking::panic_fmt
73.03 s
gammaloop-nextest-core> 2: core::panicking::panic
73.03 s
gammaloop-nextest-core> 3: gammaloop_api::templates::tests::extract_templates_uses_canonical_package_layout
73.03 s
gammaloop-nextest-core> 4: <gammaloop_api::templates::tests::extract_templates_uses_canonical_package_layout::{closure#0} as core::ops::function::FnOnce<()>>::call_once
73.03 s
gammaloop-nextest-core> note: Some details are omitted, run with `RUST_BACKTRACE=full` for a verbose backtrace.
73.03 s
gammaloop-nextest-core>
73.09 s
gammaloop-nextest-core> error : test run failed
73.12 s
gammaloop-nextest-core>
73.12 s
gammaloop-nextest-core> ========== nextest test summary ==========
73.12 s
gammaloop-nextest-core> report: target/nextest/ci_gammaloop/junit.xml
73.12 s
gammaloop-nextest-core> tests: 339, failures: 2, errors: 0
73.12 s
gammaloop-nextest-core>
73.12 s
gammaloop-nextest-core> 1. gammaloop-api::repl::tests::completion_shows_type_hint_for_non_boolean_settings_leaf
73.12 s
gammaloop-nextest-core> failure: test failure with exit code 101
73.12 s
gammaloop-nextest-core> thread 'repl::tests::completion_shows_type_hint_for_non_boolean_settings_leaf' (775) panicked at crates/gammaloop-api/src/repl.rs:5778:9:
73.12 s
gammaloop-nextest-core> [Suggestion { value: "", description: Some("Number of samples in the first Monte Carlo iteration."), style: None, extra: None, span: Span { start: 42, end: 42 }, append_whitespace: false }]
73.12 s
gammaloop-nextest-core> stack backtrace:
73.12 s
gammaloop-nextest-core> 0: __rustc::rust_begin_unwind
73.12 s
gammaloop-nextest-core> 1: core::panicking::panic_fmt
73.12 s
gammaloop-nextest-core> 2: gammaloop_api::repl::tests::completion_shows_type_hint_for_non_boolean_settings_leaf
73.12 s
gammaloop-nextest-core> 3: <gammaloop_api::repl::tests::completion_shows_type_hint_for_non_boolean_settings_leaf::{closure#0} as core::ops::function::FnOnce<()>>::call_once
73.12 s
gammaloop-nextest-core> note: Some details are omitted, run with `RUST_BACKTRACE=full` for a verbose backtrace.
73.12 s
gammaloop-nextest-core> system-out
73.12 s
gammaloop-nextest-core> running 1 test
73.12 s
gammaloop-nextest-core> test repl::tests::completion_shows_type_hint_for_non_boolean_settings_leaf ... FAILED
73.12 s
gammaloop-nextest-core>
73.12 s
gammaloop-nextest-core> failures:
73.12 s
gammaloop-nextest-core>
73.12 s
gammaloop-nextest-core> failures:
73.12 s
gammaloop-nextest-core> repl::tests::completion_shows_type_hint_for_non_boolean_settings_leaf
73.12 s
gammaloop-nextest-core>
73.12 s
gammaloop-nextest-core> test result: FAILED. 0 passed; 1 failed; 0 ignored; 0 measured; 338 filtered out; finished in 0.01s
73.12 s
gammaloop-nextest-core> system-err
73.12 s
gammaloop-nextest-core> thread 'repl::tests::completion_shows_type_hint_for_non_boolean_settings_leaf' (775) panicked at crates/gammaloop-api/src/repl.rs:5778:9:
73.12 s
gammaloop-nextest-core> [Suggestion { value: "", description: Some("Number of samples in the first Monte Carlo iteration."), style: None, extra: None, span: Span { start: 42, end: 42 }, append_whitespace: false }]
73.12 s
gammaloop-nextest-core> stack backtrace:
73.12 s
gammaloop-nextest-core> 0: __rustc::rust_begin_unwind
73.12 s
gammaloop-nextest-core> 1: core::panicking::panic_fmt
73.12 s
gammaloop-nextest-core> 2: gammaloop_api::repl::tests::completion_shows_type_hint_for_non_boolean_settings_leaf
73.12 s
gammaloop-nextest-core> 3: <gammaloop_api::repl::tests::completion_shows_type_hint_for_non_boolean_settings_leaf::{closure#0} as core::ops::function::FnOnce<()>>::call_once
73.12 s
gammaloop-nextest-core> note: Some details are omitted, run with `RUST_BACKTRACE=full` for a verbose backtrace.
73.12 s
gammaloop-nextest-core>
73.12 s
gammaloop-nextest-core> 2. gammaloop-api::templates::tests::extract_templates_uses_canonical_package_layout
73.12 s
gammaloop-nextest-core> failure: test failure with exit code 101
73.12 s
gammaloop-nextest-core> thread 'templates::tests::extract_templates_uses_canonical_package_layout' (876) panicked at crates/gammaloop-api/src/templates.rs:99:9:
73.12 s
gammaloop-nextest-core> assertion failed: figure.contains("amplitude-mode")
73.12 s
gammaloop-nextest-core> stack backtrace:
73.12 s
gammaloop-nextest-core> 0: __rustc::rust_begin_unwind
73.12 s
gammaloop-nextest-core> 1: core::panicking::panic_fmt
73.12 s
gammaloop-nextest-core> 2: core::panicking::panic
73.12 s
gammaloop-nextest-core> 3: gammaloop_api::templates::tests::extract_templates_uses_canonical_package_layout
73.12 s
gammaloop-nextest-core> 4: <gammaloop_api::templates::tests::extract_templates_uses_canonical_package_layout::{closure#0} as core::ops::function::FnOnce<()>>::call_once
73.12 s
gammaloop-nextest-core> note: Some details are omitted, run with `RUST_BACKTRACE=full` for a verbose backtrace.
73.12 s
gammaloop-nextest-core> system-out
73.12 s
gammaloop-nextest-core> running 1 test
73.12 s
gammaloop-nextest-core> test templates::tests::extract_templates_uses_canonical_package_layout ... FAILED
73.12 s
gammaloop-nextest-core>
73.12 s
gammaloop-nextest-core> failures:
73.12 s
gammaloop-nextest-core>
73.12 s
gammaloop-nextest-core> failures:
73.12 s
gammaloop-nextest-core> templates::tests::extract_templates_uses_canonical_package_layout
73.12 s
gammaloop-nextest-core>
73.12 s
gammaloop-nextest-core> test result: FAILED. 0 passed; 1 failed; 0 ignored; 0 measured; 338 filtered out; finished in 0.09s
73.12 s
gammaloop-nextest-core> system-err
73.12 s
gammaloop-nextest-core> thread 'templates::tests::extract_templates_uses_canonical_package_layout' (876) panicked at crates/gammaloop-api/src/templates.rs:99:9:
73.12 s
gammaloop-nextest-core> assertion failed: figure.contains("amplitude-mode")
73.12 s
gammaloop-nextest-core> stack backtrace:
73.12 s
gammaloop-nextest-core> 0: __rustc::rust_begin_unwind
73.12 s
gammaloop-nextest-core> 1: core::panicking::panic_fmt
73.12 s
gammaloop-nextest-core> 2: core::panicking::panic
73.12 s
gammaloop-nextest-core> 3: gammaloop_api::templates::tests::extract_templates_uses_canonical_package_layout
73.12 s
gammaloop-nextest-core> 4: <gammaloop_api::templates::tests::extract_templates_uses_canonical_package_layout::{closure#0} as core::ops::function::FnOnce<()>>::call_once
73.12 s
gammaloop-nextest-core> note: Some details are omitted, run with `RUST_BACKTRACE=full` for a verbose backtrace.
73.12 s
gammaloop-nextest-core> =========================================
73.14 s
gammaloop-nextest-core> Extracting 1 binary and 1 linked path to /build/nextest-archive-RSHIKK
73.22 s
gammaloop-nextest-core> Extracted 7 files to /build/nextest-archive-RSHIKK in 0.08s
73.23 s
gammaloop-nextest-core> ------------
73.23 s
gammaloop-nextest-core> Nextest run ID 6dd8f6a6-bdef-4ca9-ab1d-6d73e4dc4d32 with nextest profile: ci_gammaloop
73.23 s
gammaloop-nextest-core> Starting 19 tests across 1 binary
73.25 s
gammaloop-nextest-core> ------------
73.25 s
gammaloop-nextest-core> Summary [ 0.017s] 19 tests run: 19 passed , 0 skipped
73.29 s
gammaloop-nextest-core>
73.29 s
gammaloop-nextest-core> ========== nextest test summary ==========
73.29 s
gammaloop-nextest-core> report: target/nextest/ci_gammaloop/junit.xml
73.29 s
gammaloop-nextest-core> tests: 19, failures: 0, errors: 0
73.29 s
gammaloop-nextest-core> No failing testcases found.
73.29 s
gammaloop-nextest-core> =========================================
73.30 s
gammaloop-nextest-core> Extracting 1 binary to /build/nextest-archive-pho77r
73.35 s
gammaloop-nextest-core> Extracted 4 files to /build/nextest-archive-pho77r in 0.05s
73.36 s
gammaloop-nextest-core> ------------
73.36 s
gammaloop-nextest-core> Nextest run ID 7f1b56d5-22c0-4cbd-a23a-8b0f6becbadb with nextest profile: ci_gammaloop
73.36 s
gammaloop-nextest-core> Starting 0 tests across 1 binary
73.36 s
gammaloop-nextest-core> ------------
73.36 s
gammaloop-nextest-core> Summary [ 0.000s] 0 tests run: 0 passed , 0 skipped
73.40 s
gammaloop-nextest-core>
73.40 s
gammaloop-nextest-core> ========== nextest test summary ==========
73.40 s
gammaloop-nextest-core> report: target/nextest/ci_gammaloop/junit.xml
73.40 s
gammaloop-nextest-core> tests: 0, failures: 0, errors: 0
73.40 s
gammaloop-nextest-core> No failing testcases found.
73.40 s
gammaloop-nextest-core> =========================================
73.41 s
gammaloop-nextest-core> Extracting 4 binaries, 1 build script output directory, and 2 linked paths to /build/nextest-archive-xB9eVc
73.98 s
gammaloop-nextest-core> Extracted 18 files to /build/nextest-archive-xB9eVc in 0.57s
73.99 s
gammaloop-nextest-core> ------------
73.99 s
gammaloop-nextest-core> Nextest run ID d307d8dd-1544-402f-a800-77372c7dd921 with nextest profile: ci_gammaloop
73.99 s
gammaloop-nextest-core> Starting 456 tests across 4 binaries (61 tests skipped , including 60 tests via profile.ci_gammaloop.default-filter )
74.37 s
gammaloop-nextest-core> FAIL [ 0.229s] (156/456) gammalooprs graph::parse::tests :: parse_lmbsetting_crossection
74.37 s
gammaloop-nextest-core> stdout ---
74.37 s
gammaloop-nextest-core>
74.37 s
gammaloop-nextest-core> running 1 test
74.37 s
gammaloop-nextest-core> ━━━━━━━━━━━━━━━━━━━━━━━━━━━━━━━ Snapshot Summary ━━━━━━━━━━━━━━━━━━━━━━━━━━━━━━━
74.37 s
gammaloop-nextest-core> Snapshot: parse_lmbsetting_crossection
74.37 s
gammaloop-nextest-core> Source: crates/gammalooprs/src/graph/parse/tests.rs:252
74.37 s
gammaloop-nextest-core> ────────────────────────────────────────────────────────────────────────────────
74.37 s
gammaloop-nextest-core> Expression: g.debug_dot()
74.37 s
gammaloop-nextest-core> ────────────────────────────────────────────────────────────────────────────────
74.37 s
gammaloop-nextest-core> -old snapshot
74.37 s
gammaloop-nextest-core> +new results
74.37 s
gammaloop-nextest-core> ────────────┬───────────────────────────────────────────────────────────────────
74.37 s
gammaloop-nextest-core> 1 │-digraph G{
74.37 s
gammaloop-nextest-core> 1 │+digraph G {
74.37 s
gammaloop-nextest-core> 2 2 │ num = "1/2";
74.37 s
gammaloop-nextest-core> 3 3 │ overall_factor = "2*x";
74.37 s
gammaloop-nextest-core> 4 4 │ overall_factor_evaluated = "2*x";
74.37 s
gammaloop-nextest-core> 5 5 │ projector = "spenso::t";
74.37 s
gammaloop-nextest-core> ────────────┴───────────────────────────────────────────────────────────────────
74.37 s
gammaloop-nextest-core> To update snapshots run `cargo insta review`
74.37 s
gammaloop-nextest-core> Stopped on the first failure. Run `cargo insta test` to run all snapshots.
74.37 s
gammaloop-nextest-core> test graph::parse::tests::parse_lmbsetting_crossection ... FAILED
74.37 s
gammaloop-nextest-core>
74.37 s
gammaloop-nextest-core> failures:
74.37 s
gammaloop-nextest-core>
74.37 s
gammaloop-nextest-core> failures:
74.37 s
gammaloop-nextest-core> graph::parse::tests::parse_lmbsetting_crossection
74.37 s
gammaloop-nextest-core>
74.37 s
gammaloop-nextest-core> test result: FAILED. 0 passed; 1 failed; 0 ignored; 0 measured; 508 filtered out; finished in 0.21s
74.37 s
gammaloop-nextest-core>
74.37 s
gammaloop-nextest-core> stderr ---
74.37 s
gammaloop-nextest-core> [21:19:02.939] @gammalooprs::graph::attribute_warnings WARNING : Unknown node attribute 'color_num' on graph 'G', node 'A'; did you mean 'num'?
74.37 s
gammaloop-nextest-core> at crates/gammalooprs/src/graph/attribute_warnings.rs:198
74.37 s
gammaloop-nextest-core> The application panicked (crashed).
74.37 s
gammaloop-nextest-core> Message: snapshot assertion for 'parse_lmbsetting_crossection' failed in line 252
74.37 s
gammaloop-nextest-core> Location: /nix/store/xdy1vvhll2bijdplvl9fcc2b9plkxhaa-vendor-cargo-deps/c19b7c6f923b580ac259164a89f2577984ad5ab09ee9d583b888f934adbbe8d0/insta-1.47.2/src/runtime.rs :719
74.37 s
gammaloop-nextest-core>
74.37 s
gammaloop-nextest-core> ━━━━━━━━━━━━━━━━━━━━━━━━━━━━━━━━━━ BACKTRACE ━━━━━━━━━━━━━━━━━━━━━━━━━━━━━━━━━━━
74.37 s
gammaloop-nextest-core> 1: <color_eyre[b0c9e66060e883b2]::config::PanicHook>::panic_report <unknown>
74.37 s
gammaloop-nextest-core> at <unknown source file> :<unknown line>
74.37 s
gammaloop-nextest-core> 2: <color_eyre[b0c9e66060e883b2]::config::PanicHook>::into_panic_hook::{closure#0} <unknown>
74.37 s
gammaloop-nextest-core> at <unknown source file> :<unknown line>
74.37 s
gammaloop-nextest-core> 3: std[bcb96dfbba0ab899]::panicking::panic_with_hook <unknown>
74.37 s
gammaloop-nextest-core> at <unknown source file> :<unknown line>
74.37 s
gammaloop-nextest-core> 4: std[bcb96dfbba0ab899]::panicking::panic_handler::{closure#0} <unknown>
74.37 s
gammaloop-nextest-core> at <unknown source file> :<unknown line>
74.37 s
gammaloop-nextest-core> 5: std[bcb96dfbba0ab899]::sys::backtrace::__rust_end_short_backtrace::<std[bcb96dfbba0ab899]::panicking::panic_handler::{closure#0}, !> <unknown>
74.37 s
gammaloop-nextest-core> at <unknown source file> :<unknown line>
74.37 s
gammaloop-nextest-core> 6: __rustc[6c289b9f9c454d21]::rust_begin_unwind <unknown>
74.37 s
gammaloop-nextest-core> at <unknown source file> :<unknown line>
74.37 s
gammaloop-nextest-core> 7: core[940e698046960fd5]::panicking::panic_fmt <unknown>
74.37 s
gammaloop-nextest-core> at <unknown source file> :<unknown line>
74.37 s
gammaloop-nextest-core> 8: insta[307a548ac79ef4d9]::runtime::assert_snapshot <unknown>
74.37 s
gammaloop-nextest-core> at <unknown source file> :<unknown line>
74.37 s
gammaloop-nextest-core> 9: gammalooprs[5490727360442cce]::graph::parse::tests::parse_lmbsetting_crossection <unknown>
74.37 s
gammaloop-nextest-core> at <unknown source file> :<unknown line>
74.37 s
gammaloop-nextest-core> 10: <gammalooprs[5490727360442cce]::graph::parse::tests::parse_lmbsetting_crossection::{closure#0} as core[940e698046960fd5]::ops::function::FnOnce<()>>::call_once <unknown>
74.37 s
gammaloop-nextest-core> at <unknown source file> :<unknown line>
74.37 s
gammaloop-nextest-core> 11: test[75d6903177b1d7e9]::__rust_begin_short_backtrace::<core[940e698046960fd5]::result::Result<(), alloc[2ea6bcb46fca0c42]::string::String>, fn() -> core[940e698046960fd5]::result::Result<(), alloc[2ea6bcb46fca0c42]::string::String>> <unknown>
74.37 s
gammaloop-nextest-core> at <unknown source file> :<unknown line>
74.37 s
gammaloop-nextest-core> 12: test[75d6903177b1d7e9]::run_test::{closure#0} <unknown>
74.37 s
gammaloop-nextest-core> at <unknown source file> :<unknown line>
74.37 s
gammaloop-nextest-core> 13: std[bcb96dfbba0ab899]::sys::backtrace::__rust_begin_short_backtrace::<test[75d6903177b1d7e9]::run_test::{closure#1}, ()> <unknown>
74.37 s
gammaloop-nextest-core> at <unknown source file> :<unknown line>
74.37 s
gammaloop-nextest-core> 14: <std[bcb96dfbba0ab899]::thread::lifecycle::spawn_unchecked<test[75d6903177b1d7e9]::run_test::{closure#1}, ()>::{closure#1} as core[940e698046960fd5]::ops::function::FnOnce<()>>::call_once::{shim:vtable#0} <unknown>
74.37 s
gammaloop-nextest-core> at <unknown source file> :<unknown line>
74.37 s
gammaloop-nextest-core> 15: <std[bcb96dfbba0ab899]::sys::thread::unix::Thread>::new::thread_start <unknown>
74.37 s
gammaloop-nextest-core> at <unknown source file> :<unknown line>
74.37 s
gammaloop-nextest-core> 16: start_thread <unknown>
74.37 s
gammaloop-nextest-core> at <unknown source file> :<unknown line>
74.37 s
gammaloop-nextest-core> 17: __clone3 <unknown>
74.37 s
gammaloop-nextest-core> at <unknown source file> :<unknown line>
74.37 s
gammaloop-nextest-core>
74.37 s
gammaloop-nextest-core> Run with COLORBT_SHOW_HIDDEN=1 environment variable to disable frame filtering.
74.37 s
gammaloop-nextest-core> Run with RUST_BACKTRACE=full to include source snippets.
74.37 s
gammaloop-nextest-core>
74.85 s
gammaloop-nextest-core> FAIL [ 0.083s] (407/456) gammalooprs uv::export::tests :: computed_node_full_numerator_is_a_spenso_aware_typst_fragment
74.85 s
gammaloop-nextest-core> stdout ---
74.85 s
gammaloop-nextest-core>
74.85 s
gammaloop-nextest-core> running 1 test
74.85 s
gammaloop-nextest-core> test uv::export::tests::computed_node_full_numerator_is_a_spenso_aware_typst_fragment ... FAILED
74.85 s
gammaloop-nextest-core>
74.85 s
gammaloop-nextest-core> failures:
74.85 s
gammaloop-nextest-core>
74.85 s
gammaloop-nextest-core> failures:
74.85 s
gammaloop-nextest-core> uv::export::tests::computed_node_full_numerator_is_a_spenso_aware_typst_fragment
74.85 s
gammaloop-nextest-core>
74.85 s
gammaloop-nextest-core> test result: FAILED. 0 passed; 1 failed; 0 ignored; 0 measured; 508 filtered out; finished in 0.07s
74.85 s
gammaloop-nextest-core>
74.85 s
gammaloop-nextest-core> stderr ---
74.85 s
gammaloop-nextest-core> The application panicked (crashed).
74.85 s
gammaloop-nextest-core> Message: assertion failed: exported.dot.contains(r#"full_num = "op(\"Tr\")(1)";"#)
74.85 s
gammaloop-nextest-core> Location: crates/gammalooprs/src/uv/export.rs :483
74.85 s
gammaloop-nextest-core>
74.85 s
gammaloop-nextest-core> ━━━━━━━━━━━━━━━━━━━━━━━━━━━━━━━━━━ BACKTRACE ━━━━━━━━━━━━━━━━━━━━━━━━━━━━━━━━━━━
74.85 s
gammaloop-nextest-core> 1: <color_eyre[b0c9e66060e883b2]::config::PanicHook>::panic_report <unknown>
74.85 s
gammaloop-nextest-core> at <unknown source file> :<unknown line>
74.85 s
gammaloop-nextest-core> 2: <color_eyre[b0c9e66060e883b2]::config::PanicHook>::into_panic_hook::{closure#0} <unknown>
74.85 s
gammaloop-nextest-core> at <unknown source file> :<unknown line>
74.85 s
gammaloop-nextest-core> 3: std[bcb96dfbba0ab899]::panicking::panic_with_hook <unknown>
74.85 s
gammaloop-nextest-core> at <unknown source file> :<unknown line>
74.85 s
gammaloop-nextest-core> 4: std[bcb96dfbba0ab899]::panicking::panic_handler::{closure#0} <unknown>
74.85 s
gammaloop-nextest-core> at <unknown source file> :<unknown line>
74.85 s
gammaloop-nextest-core> 5: std[bcb96dfbba0ab899]::sys::backtrace::__rust_end_short_backtrace::<std[bcb96dfbba0ab899]::panicking::panic_handler::{closure#0}, !> <unknown>
74.85 s
gammaloop-nextest-core> at <unknown source file> :<unknown line>
74.85 s
gammaloop-nextest-core> 6: __rustc[6c289b9f9c454d21]::rust_begin_unwind <unknown>
74.85 s
gammaloop-nextest-core> at <unknown source file> :<unknown line>
74.85 s
gammaloop-nextest-core> 7: core[940e698046960fd5]::panicking::panic_fmt <unknown>
74.85 s
gammaloop-nextest-core> at <unknown source file> :<unknown line>
74.85 s
gammaloop-nextest-core> 8: core[940e698046960fd5]::panicking::panic <unknown>
74.85 s
gammaloop-nextest-core> at <unknown source file> :<unknown line>
74.85 s
gammaloop-nextest-core> 9: gammalooprs[5490727360442cce]::uv::export::tests::computed_node_full_numerator_is_a_spenso_aware_typst_fragment <unknown>
74.85 s
gammaloop-nextest-core> at <unknown source file> :<unknown line>
74.85 s
gammaloop-nextest-core> 10: <gammalooprs[5490727360442cce]::uv::export::tests::computed_node_full_numerator_is_a_spenso_aware_typst_fragment::{closure#0} as core[940e698046960fd5]::ops::function::FnOnce<()>>::call_once <unknown>
74.85 s
gammaloop-nextest-core> at <unknown source file> :<unknown line>
74.85 s
gammaloop-nextest-core> 11: test[75d6903177b1d7e9]::__rust_begin_short_backtrace::<core[940e698046960fd5]::result::Result<(), alloc[2ea6bcb46fca0c42]::string::String>, fn() -> core[940e698046960fd5]::result::Result<(), alloc[2ea6bcb46fca0c42]::string::String>> <unknown>
74.85 s
gammaloop-nextest-core> at <unknown source file> :<unknown line>
74.85 s
gammaloop-nextest-core> 12: test[75d6903177b1d7e9]::run_test::{closure#0} <unknown>
74.85 s
gammaloop-nextest-core> at <unknown source file> :<unknown line>
74.85 s
gammaloop-nextest-core> 13: std[bcb96dfbba0ab899]::sys::backtrace::__rust_begin_short_backtrace::<test[75d6903177b1d7e9]::run_test::{closure#1}, ()> <unknown>
74.85 s
gammaloop-nextest-core> at <unknown source file> :<unknown line>
74.85 s
gammaloop-nextest-core> 14: <std[bcb96dfbba0ab899]::thread::lifecycle::spawn_unchecked<test[75d6903177b1d7e9]::run_test::{closure#1}, ()>::{closure#1} as core[940e698046960fd5]::ops::function::FnOnce<()>>::call_once::{shim:vtable#0} <unknown>
74.85 s
gammaloop-nextest-core> at <unknown source file> :<unknown line>
74.85 s
gammaloop-nextest-core> 15: <std[bcb96dfbba0ab899]::sys::thread::unix::Thread>::new::thread_start <unknown>
74.85 s
gammaloop-nextest-core> at <unknown source file> :<unknown line>
74.85 s
gammaloop-nextest-core> 16: start_thread <unknown>
74.85 s
gammaloop-nextest-core> at <unknown source file> :<unknown line>
74.85 s
gammaloop-nextest-core> 17: __clone3 <unknown>
74.85 s
gammaloop-nextest-core> at <unknown source file> :<unknown line>
74.85 s
gammaloop-nextest-core>
74.85 s
gammaloop-nextest-core> Run with COLORBT_SHOW_HIDDEN=1 environment variable to disable frame filtering.
74.85 s
gammaloop-nextest-core> Run with RUST_BACKTRACE=full to include source snippets.
74.85 s
gammaloop-nextest-core>
86.88 s
gammaloop-nextest-core> ------------
86.93 s
gammaloop-nextest-core> Summary [ 12.886s] 456 tests run: 454 passed , 2 failed , 61 skipped
86.93 s
gammaloop-nextest-core> FAIL [ 0.229s] (156/456) gammalooprs graph::parse::tests :: parse_lmbsetting_crossection
86.93 s
gammaloop-nextest-core> stdout ---
86.93 s
gammaloop-nextest-core>
86.93 s
gammaloop-nextest-core> running 1 test
86.93 s
gammaloop-nextest-core> ━━━━━━━━━━━━━━━━━━━━━━━━━━━━━━━ Snapshot Summary ━━━━━━━━━━━━━━━━━━━━━━━━━━━━━━━
86.93 s
gammaloop-nextest-core> Snapshot: parse_lmbsetting_crossection
86.93 s
gammaloop-nextest-core> Source: crates/gammalooprs/src/graph/parse/tests.rs:252
86.93 s
gammaloop-nextest-core> ────────────────────────────────────────────────────────────────────────────────
86.93 s
gammaloop-nextest-core> Expression: g.debug_dot()
86.93 s
gammaloop-nextest-core> ────────────────────────────────────────────────────────────────────────────────
86.93 s
gammaloop-nextest-core> -old snapshot
86.93 s
gammaloop-nextest-core> +new results
86.93 s
gammaloop-nextest-core> ────────────┬───────────────────────────────────────────────────────────────────
86.93 s
gammaloop-nextest-core> 1 │-digraph G{
86.93 s
gammaloop-nextest-core> 1 │+digraph G {
86.93 s
gammaloop-nextest-core> 2 2 │ num = "1/2";
86.93 s
gammaloop-nextest-core> 3 3 │ overall_factor = "2*x";
86.93 s
gammaloop-nextest-core> 4 4 │ overall_factor_evaluated = "2*x";
86.93 s
gammaloop-nextest-core> 5 5 │ projector = "spenso::t";
86.93 s
gammaloop-nextest-core> ────────────┴───────────────────────────────────────────────────────────────────
86.93 s
gammaloop-nextest-core> To update snapshots run `cargo insta review`
86.93 s
gammaloop-nextest-core> Stopped on the first failure. Run `cargo insta test` to run all snapshots.
86.93 s
gammaloop-nextest-core> test graph::parse::tests::parse_lmbsetting_crossection ... FAILED
86.93 s
gammaloop-nextest-core>
86.93 s
gammaloop-nextest-core> failures:
86.93 s
gammaloop-nextest-core>
86.93 s
gammaloop-nextest-core> failures:
86.93 s
gammaloop-nextest-core> graph::parse::tests::parse_lmbsetting_crossection
86.93 s
gammaloop-nextest-core>
86.93 s
gammaloop-nextest-core> test result: FAILED. 0 passed; 1 failed; 0 ignored; 0 measured; 508 filtered out; finished in 0.21s
86.93 s
gammaloop-nextest-core>
86.93 s
gammaloop-nextest-core> stderr ---
86.93 s
gammaloop-nextest-core> [21:19:02.939] @gammalooprs::graph::attribute_warnings WARNING : Unknown node attribute 'color_num' on graph 'G', node 'A'; did you mean 'num'?
86.93 s
gammaloop-nextest-core> at crates/gammalooprs/src/graph/attribute_warnings.rs:198
86.93 s
gammaloop-nextest-core> The application panicked (crashed).
86.93 s
gammaloop-nextest-core> Message: snapshot assertion for 'parse_lmbsetting_crossection' failed in line 252
86.93 s
gammaloop-nextest-core> Location: /nix/store/xdy1vvhll2bijdplvl9fcc2b9plkxhaa-vendor-cargo-deps/c19b7c6f923b580ac259164a89f2577984ad5ab09ee9d583b888f934adbbe8d0/insta-1.47.2/src/runtime.rs :719
86.93 s
gammaloop-nextest-core>
86.93 s
gammaloop-nextest-core> ━━━━━━━━━━━━━━━━━━━━━━━━━━━━━━━━━━ BACKTRACE ━━━━━━━━━━━━━━━━━━━━━━━━━━━━━━━━━━━
86.93 s
gammaloop-nextest-core> 1: <color_eyre[b0c9e66060e883b2]::config::PanicHook>::panic_report <unknown>
86.93 s
gammaloop-nextest-core> at <unknown source file> :<unknown line>
86.93 s
gammaloop-nextest-core> 2: <color_eyre[b0c9e66060e883b2]::config::PanicHook>::into_panic_hook::{closure#0} <unknown>
86.93 s
gammaloop-nextest-core> at <unknown source file> :<unknown line>
86.93 s
gammaloop-nextest-core> 3: std[bcb96dfbba0ab899]::panicking::panic_with_hook <unknown>
86.93 s
gammaloop-nextest-core> at <unknown source file> :<unknown line>
86.93 s
gammaloop-nextest-core> 4: std[bcb96dfbba0ab899]::panicking::panic_handler::{closure#0} <unknown>
86.93 s
gammaloop-nextest-core> at <unknown source file> :<unknown line>
86.93 s
gammaloop-nextest-core> 5: std[bcb96dfbba0ab899]::sys::backtrace::__rust_end_short_backtrace::<std[bcb96dfbba0ab899]::panicking::panic_handler::{closure#0}, !> <unknown>
86.93 s
gammaloop-nextest-core> at <unknown source file> :<unknown line>
86.93 s
gammaloop-nextest-core> 6: __rustc[6c289b9f9c454d21]::rust_begin_unwind <unknown>
86.93 s
gammaloop-nextest-core> at <unknown source file> :<unknown line>
86.93 s
gammaloop-nextest-core> 7: core[940e698046960fd5]::panicking::panic_fmt <unknown>
86.93 s
gammaloop-nextest-core> at <unknown source file> :<unknown line>
86.93 s
gammaloop-nextest-core> 8: insta[307a548ac79ef4d9]::runtime::assert_snapshot <unknown>
86.93 s
gammaloop-nextest-core> at <unknown source file> :<unknown line>
86.93 s
gammaloop-nextest-core> 9: gammalooprs[5490727360442cce]::graph::parse::tests::parse_lmbsetting_crossection <unknown>
86.93 s
gammaloop-nextest-core> at <unknown source file> :<unknown line>
86.93 s
gammaloop-nextest-core> 10: <gammalooprs[5490727360442cce]::graph::parse::tests::parse_lmbsetting_crossection::{closure#0} as core[940e698046960fd5]::ops::function::FnOnce<()>>::call_once <unknown>
86.93 s
gammaloop-nextest-core> at <unknown source file> :<unknown line>
86.93 s
gammaloop-nextest-core> 11: test[75d6903177b1d7e9]::__rust_begin_short_backtrace::<core[940e698046960fd5]::result::Result<(), alloc[2ea6bcb46fca0c42]::string::String>, fn() -> core[940e698046960fd5]::result::Result<(), alloc[2ea6bcb46fca0c42]::string::String>> <unknown>
86.93 s
gammaloop-nextest-core> at <unknown source file> :<unknown line>
86.93 s
gammaloop-nextest-core> 12: test[75d6903177b1d7e9]::run_test::{closure#0} <unknown>
86.93 s
gammaloop-nextest-core> at <unknown source file> :<unknown line>
86.93 s
gammaloop-nextest-core> 13: std[bcb96dfbba0ab899]::sys::backtrace::__rust_begin_short_backtrace::<test[75d6903177b1d7e9]::run_test::{closure#1}, ()> <unknown>
86.93 s
gammaloop-nextest-core> at <unknown source file> :<unknown line>
86.93 s
gammaloop-nextest-core> 14: <std[bcb96dfbba0ab899]::thread::lifecycle::spawn_unchecked<test[75d6903177b1d7e9]::run_test::{closure#1}, ()>::{closure#1} as core[940e698046960fd5]::ops::function::FnOnce<()>>::call_once::{shim:vtable#0} <unknown>
86.93 s
gammaloop-nextest-core> at <unknown source file> :<unknown line>
86.93 s
gammaloop-nextest-core> 15: <std[bcb96dfbba0ab899]::sys::thread::unix::Thread>::new::thread_start <unknown>
86.93 s
gammaloop-nextest-core> at <unknown source file> :<unknown line>
86.93 s
gammaloop-nextest-core> 16: start_thread <unknown>
86.93 s
gammaloop-nextest-core> at <unknown source file> :<unknown line>
86.93 s
gammaloop-nextest-core> 17: __clone3 <unknown>
86.93 s
gammaloop-nextest-core> at <unknown source file> :<unknown line>
86.93 s
gammaloop-nextest-core>
86.93 s
gammaloop-nextest-core> Run with COLORBT_SHOW_HIDDEN=1 environment variable to disable frame filtering.
86.93 s
gammaloop-nextest-core> Run with RUST_BACKTRACE=full to include source snippets.
86.93 s
gammaloop-nextest-core>
86.93 s
gammaloop-nextest-core> FAIL [ 0.083s] (407/456) gammalooprs uv::export::tests :: computed_node_full_numerator_is_a_spenso_aware_typst_fragment
86.93 s
gammaloop-nextest-core> stdout ---
86.93 s
gammaloop-nextest-core>
86.93 s
gammaloop-nextest-core> running 1 test
86.93 s
gammaloop-nextest-core> test uv::export::tests::computed_node_full_numerator_is_a_spenso_aware_typst_fragment ... FAILED
86.93 s
gammaloop-nextest-core>
86.93 s
gammaloop-nextest-core> failures:
86.93 s
gammaloop-nextest-core>
86.93 s
gammaloop-nextest-core> failures:
86.93 s
gammaloop-nextest-core> uv::export::tests::computed_node_full_numerator_is_a_spenso_aware_typst_fragment
86.93 s
gammaloop-nextest-core>
86.93 s
gammaloop-nextest-core> test result: FAILED. 0 passed; 1 failed; 0 ignored; 0 measured; 508 filtered out; finished in 0.07s
86.93 s
gammaloop-nextest-core>
86.93 s
gammaloop-nextest-core> stderr ---
86.93 s
gammaloop-nextest-core> The application panicked (crashed).
86.93 s
gammaloop-nextest-core> Message: assertion failed: exported.dot.contains(r#"full_num = "op(\"Tr\")(1)";"#)
86.93 s
gammaloop-nextest-core> Location: crates/gammalooprs/src/uv/export.rs :483
86.93 s
gammaloop-nextest-core>
86.93 s
gammaloop-nextest-core> ━━━━━━━━━━━━━━━━━━━━━━━━━━━━━━━━━━ BACKTRACE ━━━━━━━━━━━━━━━━━━━━━━━━━━━━━━━━━━━
86.93 s
gammaloop-nextest-core> 1: <color_eyre[b0c9e66060e883b2]::config::PanicHook>::panic_report <unknown>
86.93 s
gammaloop-nextest-core> at <unknown source file> :<unknown line>
86.93 s
gammaloop-nextest-core> 2: <color_eyre[b0c9e66060e883b2]::config::PanicHook>::into_panic_hook::{closure#0} <unknown>
86.93 s
gammaloop-nextest-core> at <unknown source file> :<unknown line>
86.93 s
gammaloop-nextest-core> 3: std[bcb96dfbba0ab899]::panicking::panic_with_hook <unknown>
86.93 s
gammaloop-nextest-core> at <unknown source file> :<unknown line>
86.93 s
gammaloop-nextest-core> 4: std[bcb96dfbba0ab899]::panicking::panic_handler::{closure#0} <unknown>
86.93 s
gammaloop-nextest-core> at <unknown source file> :<unknown line>
86.93 s
gammaloop-nextest-core> 5: std[bcb96dfbba0ab899]::sys::backtrace::__rust_end_short_backtrace::<std[bcb96dfbba0ab899]::panicking::panic_handler::{closure#0}, !> <unknown>
86.93 s
gammaloop-nextest-core> at <unknown source file> :<unknown line>
86.93 s
gammaloop-nextest-core> 6: __rustc[6c289b9f9c454d21]::rust_begin_unwind <unknown>
86.93 s
gammaloop-nextest-core> at <unknown source file> :<unknown line>
86.93 s
gammaloop-nextest-core> 7: core[940e698046960fd5]::panicking::panic_fmt <unknown>
86.93 s
gammaloop-nextest-core> at <unknown source file> :<unknown line>
86.93 s
gammaloop-nextest-core> 8: core[940e698046960fd5]::panicking::panic <unknown>
86.93 s
gammaloop-nextest-core> at <unknown source file> :<unknown line>
86.93 s
gammaloop-nextest-core> 9: gammalooprs[5490727360442cce]::uv::export::tests::computed_node_full_numerator_is_a_spenso_aware_typst_fragment <unknown>
86.93 s
gammaloop-nextest-core> at <unknown source file> :<unknown line>
86.93 s
gammaloop-nextest-core> 10: <gammalooprs[5490727360442cce]::uv::export::tests::computed_node_full_numerator_is_a_spenso_aware_typst_fragment::{closure#0} as core[940e698046960fd5]::ops::function::FnOnce<()>>::call_once <unknown>
86.93 s
gammaloop-nextest-core> at <unknown source file> :<unknown line>
86.93 s
gammaloop-nextest-core> 11: test[75d6903177b1d7e9]::__rust_begin_short_backtrace::<core[940e698046960fd5]::result::Result<(), alloc[2ea6bcb46fca0c42]::string::String>, fn() -> core[940e698046960fd5]::result::Result<(), alloc[2ea6bcb46fca0c42]::string::String>> <unknown>
86.93 s
gammaloop-nextest-core> at <unknown source file> :<unknown line>
86.93 s
gammaloop-nextest-core> 12: test[75d6903177b1d7e9]::run_test::{closure#0} <unknown>
86.93 s
gammaloop-nextest-core> at <unknown source file> :<unknown line>
86.93 s
gammaloop-nextest-core> 13: std[bcb96dfbba0ab899]::sys::backtrace::__rust_begin_short_backtrace::<test[75d6903177b1d7e9]::run_test::{closure#1}, ()> <unknown>
86.93 s
gammaloop-nextest-core> at <unknown source file> :<unknown line>
86.93 s
gammaloop-nextest-core> 14: <std[bcb96dfbba0ab899]::thread::lifecycle::spawn_unchecked<test[75d6903177b1d7e9]::run_test::{closure#1}, ()>::{closure#1} as core[940e698046960fd5]::ops::function::FnOnce<()>>::call_once::{shim:vtable#0} <unknown>
86.93 s
gammaloop-nextest-core> at <unknown source file> :<unknown line>
86.93 s
gammaloop-nextest-core> 15: <std[bcb96dfbba0ab899]::sys::thread::unix::Thread>::new::thread_start <unknown>
86.93 s
gammaloop-nextest-core> at <unknown source file> :<unknown line>
86.93 s
gammaloop-nextest-core> 16: start_thread <unknown>
86.93 s
gammaloop-nextest-core> at <unknown source file> :<unknown line>
86.93 s
gammaloop-nextest-core> 17: __clone3 <unknown>
86.93 s
gammaloop-nextest-core> at <unknown source file> :<unknown line>
86.93 s
gammaloop-nextest-core>
86.93 s
gammaloop-nextest-core> Run with COLORBT_SHOW_HIDDEN=1 environment variable to disable frame filtering.
86.93 s
gammaloop-nextest-core> Run with RUST_BACKTRACE=full to include source snippets.
86.93 s
gammaloop-nextest-core>
86.94 s
gammaloop-nextest-core> error : test run failed
86.97 s
gammaloop-nextest-core>
86.97 s
gammaloop-nextest-core> ========== nextest test summary ==========
86.97 s
gammaloop-nextest-core> report: target/nextest/ci_gammaloop/junit.xml
86.97 s
gammaloop-nextest-core> tests: 456, failures: 2, errors: 0
86.97 s
gammaloop-nextest-core>
86.97 s
gammaloop-nextest-core> 1. gammalooprs::graph::parse::tests::parse_lmbsetting_crossection
86.97 s
gammaloop-nextest-core> failure: test failure with exit code 101
86.97 s
gammaloop-nextest-core> system-out
86.97 s
gammaloop-nextest-core> running 1 test
86.97 s
gammaloop-nextest-core> ━━━━━━━━━━━━━━━━━━━━━━━━━━━━━━━ Snapshot Summary ━━━━━━━━━━━━━━━━━━━━━━━━━━━━━━━
86.97 s
gammaloop-nextest-core> Snapshot: parse_lmbsetting_crossection
86.97 s
gammaloop-nextest-core> Source: crates/gammalooprs/src/graph/parse/tests.rs:252
86.97 s
gammaloop-nextest-core> ────────────────────────────────────────────────────────────────────────────────
86.97 s
gammaloop-nextest-core> Expression: g.debug_dot()
86.97 s
gammaloop-nextest-core> ────────────────────────────────────────────────────────────────────────────────
86.97 s
gammaloop-nextest-core> -old snapshot
86.97 s
gammaloop-nextest-core> +new results
86.97 s
gammaloop-nextest-core> ────────────┬───────────────────────────────────────────────────────────────────
86.97 s
gammaloop-nextest-core> 1 │-digraph G{
86.97 s
gammaloop-nextest-core> 1 │+digraph G {
86.97 s
gammaloop-nextest-core> 2 2 │ num = "1/2";
86.97 s
gammaloop-nextest-core> 3 3 │ overall_factor = "2*x";
86.97 s
gammaloop-nextest-core> 4 4 │ overall_factor_evaluated = "2*x";
86.97 s
gammaloop-nextest-core> 5 5 │ projector = "spenso::t";
86.97 s
gammaloop-nextest-core> ────────────┴───────────────────────────────────────────────────────────────────
86.97 s
gammaloop-nextest-core> To update snapshots run `cargo insta review`
86.97 s
gammaloop-nextest-core> Stopped on the first failure. Run `cargo insta test` to run all snapshots.
86.97 s
gammaloop-nextest-core> test graph::parse::tests::parse_lmbsetting_crossection ... FAILED
86.97 s
gammaloop-nextest-core>
86.97 s
gammaloop-nextest-core> failures:
86.97 s
gammaloop-nextest-core>
86.97 s
gammaloop-nextest-core> failures:
86.97 s
gammaloop-nextest-core> graph::parse::tests::parse_lmbsetting_crossection
86.97 s
gammaloop-nextest-core>
86.97 s
gammaloop-nextest-core> test result: FAILED. 0 passed; 1 failed; 0 ignored; 0 measured; 508 filtered out; finished in 0.21s
86.97 s
gammaloop-nextest-core> system-err
86.97 s
gammaloop-nextest-core> [21:19:02.939] @gammalooprs::graph::attribute_warnings WARNING : Unknown node attribute 'color_num' on graph 'G', node 'A'; did you mean 'num'?
86.97 s
gammaloop-nextest-core> at crates/gammalooprs/src/graph/attribute_warnings.rs:198
86.97 s
gammaloop-nextest-core> The application panicked (crashed).
86.97 s
gammaloop-nextest-core> Message: snapshot assertion for 'parse_lmbsetting_crossection' failed in line 252
86.97 s
gammaloop-nextest-core> Location: /nix/store/xdy1vvhll2bijdplvl9fcc2b9plkxhaa-vendor-cargo-deps/c19b7c6f923b580ac259164a89f2577984ad5ab09ee9d583b888f934adbbe8d0/insta-1.47.2/src/runtime.rs:719
86.97 s
gammaloop-nextest-core>
86.97 s
gammaloop-nextest-core> ━━━━━━━━━━━━━━━━━━━━━━━━━━━━━━━━━━ BACKTRACE ━━━━━━━━━━━━━━━━━━━━━━━━━━━━━━━━━━━
86.97 s
gammaloop-nextest-core> 1: <color_eyre[b0c9e66060e883b2]::config::PanicHook>::panic_report<unknown>
86.97 s
gammaloop-nextest-core> at <unknown source file>:<unknown line>
86.97 s
gammaloop-nextest-core> 2: <color_eyre[b0c9e66060e883b2]::config::PanicHook>::into_panic_hook::{closure#0}<unknown>
86.97 s
gammaloop-nextest-core> at <unknown source file>:<unknown line>
86.97 s
gammaloop-nextest-core> 3: std[bcb96dfbba0ab899]::panicking::panic_with_hook<unknown>
86.97 s
gammaloop-nextest-core> at <unknown source file>:<unknown line>
86.97 s
gammaloop-nextest-core> 4: std[bcb96dfbba0ab899]::panicking::panic_handler::{closure#0}<unknown>
86.97 s
gammaloop-nextest-core> at <unknown source file>:<unknown line>
86.97 s
gammaloop-nextest-core> 5: std[bcb96dfbba0ab899]::sys::backtrace::__rust_end_short_backtrace::<std[bcb96dfbba0ab899]::panicking::panic_handler::{closure#0}, !><unknown>
86.97 s
gammaloop-nextest-core> at <unknown source file>:<unknown line>
86.97 s
gammaloop-nextest-core> 6: __rustc[6c289b9f9c454d21]::rust_begin_unwind<unknown>
86.97 s
gammaloop-nextest-core> at <unknown source file>:<unknown line>
86.97 s
gammaloop-nextest-core> 7: core[940e698046960fd5]::panicking::panic_fmt<unknown>
86.97 s
gammaloop-nextest-core> at <unknown source file>:<unknown line>
86.97 s
gammaloop-nextest-core> 8: insta[307a548ac79ef4d9]::runtime::assert_snapshot<unknown>
86.97 s
gammaloop-nextest-core> at <unknown source file>:<unknown line>
86.97 s
gammaloop-nextest-core> 9: gammalooprs[5490727360442cce]::graph::parse::tests::parse_lmbsetting_crossection<unknown>
86.97 s
gammaloop-nextest-core> at <unknown source file>:<unknown line>
86.97 s
gammaloop-nextest-core> 10: <gammalooprs[5490727360442cce]::graph::parse::tests::parse_lmbsetting_crossection::{closure#0} as core[940e698046960fd5]::ops::function::FnOnce<()>>::call_once<unknown>
86.97 s
gammaloop-nextest-core> at <unknown source file>:<unknown line>
86.97 s
gammaloop-nextest-core> 11: test[75d6903177b1d7e9]::__rust_begin_short_backtrace::<core[940e698046960fd5]::result::Result<(), alloc[2ea6bcb46fca0c42]::string::String>, fn() -> core[940e698046960fd5]::result::Result<(), alloc[2ea6bcb46fca0c42]::string::String>><unknown>
86.97 s
gammaloop-nextest-core> at <unknown source file>:<unknown line>
86.97 s
gammaloop-nextest-core> 12: test[75d6903177b1d7e9]::run_test::{closure#0}<unknown>
86.97 s
gammaloop-nextest-core> at <unknown source file>:<unknown line>
86.97 s
gammaloop-nextest-core> 13: std[bcb96dfbba0ab899]::sys::backtrace::__rust_begin_short_backtrace::<test[75d6903177b1d7e9]::run_test::{closure#1}, ()><unknown>
86.97 s
gammaloop-nextest-core> at <unknown source file>:<unknown line>
86.97 s
gammaloop-nextest-core> 14: <std[bcb96dfbba0ab899]::thread::lifecycle::spawn_unchecked<test[75d6903177b1d7e9]::run_test::{closure#1}, ()>::{closure#1} as core[940e698046960fd5]::ops::function::FnOnce<()>>::call_once::{shim:vtable#0}<unknown>
86.97 s
gammaloop-nextest-core> at <unknown source file>:<unknown line>
86.97 s
gammaloop-nextest-core> 15: <std[bcb96dfbba0ab899]::sys::thread::unix::Thread>::new::thread_start<unknown>
86.97 s
gammaloop-nextest-core> at <unknown source file>:<unknown line>
86.97 s
gammaloop-nextest-core> 16: start_thread<unknown>
86.97 s
gammaloop-nextest-core> at <unknown source file>:<unknown line>
86.97 s
gammaloop-nextest-core> 17: __clone3<unknown>
86.97 s
gammaloop-nextest-core> at <unknown source file>:<unknown line>
86.97 s
gammaloop-nextest-core>
86.97 s
gammaloop-nextest-core> Run with COLORBT_SHOW_HIDDEN=1 environment variable to disable frame filtering.
86.97 s
gammaloop-nextest-core> Run with RUST_BACKTRACE=full to include source snippets.
86.97 s
gammaloop-nextest-core>
86.97 s
gammaloop-nextest-core> 2. gammalooprs::uv::export::tests::computed_node_full_numerator_is_a_spenso_aware_typst_fragment
86.97 s
gammaloop-nextest-core> failure: test failure with exit code 101
86.97 s
gammaloop-nextest-core> system-out
86.97 s
gammaloop-nextest-core> running 1 test
86.97 s
gammaloop-nextest-core> test uv::export::tests::computed_node_full_numerator_is_a_spenso_aware_typst_fragment ... FAILED
86.97 s
gammaloop-nextest-core>
86.97 s
gammaloop-nextest-core> failures:
86.97 s
gammaloop-nextest-core>
86.97 s
gammaloop-nextest-core> failures:
86.97 s
gammaloop-nextest-core> uv::export::tests::computed_node_full_numerator_is_a_spenso_aware_typst_fragment
86.97 s
gammaloop-nextest-core>
86.97 s
gammaloop-nextest-core> test result: FAILED. 0 passed; 1 failed; 0 ignored; 0 measured; 508 filtered out; finished in 0.07s
86.97 s
gammaloop-nextest-core> system-err
86.97 s
gammaloop-nextest-core> The application panicked (crashed).
86.97 s
gammaloop-nextest-core> Message: assertion failed: exported.dot.contains(r#"full_num = "op(\"Tr\")(1)";"#)
86.97 s
gammaloop-nextest-core> Location: crates/gammalooprs/src/uv/export.rs:483
86.97 s
gammaloop-nextest-core>
86.97 s
gammaloop-nextest-core> ━━━━━━━━━━━━━━━━━━━━━━━━━━━━━━━━━━ BACKTRACE ━━━━━━━━━━━━━━━━━━━━━━━━━━━━━━━━━━━
86.97 s
gammaloop-nextest-core> 1: <color_eyre[b0c9e66060e883b2]::config::PanicHook>::panic_report<unknown>
86.97 s
gammaloop-nextest-core> at <unknown source file>:<unknown line>
86.97 s
gammaloop-nextest-core> 2: <color_eyre[b0c9e66060e883b2]::config::PanicHook>::into_panic_hook::{closure#0}<unknown>
86.97 s
gammaloop-nextest-core> at <unknown source file>:<unknown line>
86.97 s
gammaloop-nextest-core> 3: std[bcb96dfbba0ab899]::panicking::panic_with_hook<unknown>
86.97 s
gammaloop-nextest-core> at <unknown source file>:<unknown line>
86.97 s
gammaloop-nextest-core> 4: std[bcb96dfbba0ab899]::panicking::panic_handler::{closure#0}<unknown>
86.97 s
gammaloop-nextest-core> at <unknown source file>:<unknown line>
86.97 s
gammaloop-nextest-core> 5: std[bcb96dfbba0ab899]::sys::backtrace::__rust_end_short_backtrace::<std[bcb96dfbba0ab899]::panicking::panic_handler::{closure#0}, !><unknown>
86.97 s
gammaloop-nextest-core> at <unknown source file>:<unknown line>
86.97 s
gammaloop-nextest-core> 6: __rustc[6c289b9f9c454d21]::rust_begin_unwind<unknown>
86.97 s
gammaloop-nextest-core> at <unknown source file>:<unknown line>
86.97 s
gammaloop-nextest-core> 7: core[940e698046960fd5]::panicking::panic_fmt<unknown>
86.97 s
gammaloop-nextest-core> at <unknown source file>:<unknown line>
86.97 s
gammaloop-nextest-core> 8: core[940e698046960fd5]::panicking::panic<unknown>
86.97 s
gammaloop-nextest-core> at <unknown source file>:<unknown line>
86.97 s
gammaloop-nextest-core> 9: gammalooprs[5490727360442cce]::uv::export::tests::computed_node_full_numerator_is_a_spenso_aware_typst_fragment<unknown>
86.97 s
gammaloop-nextest-core> at <unknown source file>:<unknown line>
86.97 s
gammaloop-nextest-core> 10: <gammalooprs[5490727360442cce]::uv::export::tests::computed_node_full_numerator_is_a_spenso_aware_typst_fragment::{closure#0} as core[940e698046960fd5]::ops::function::FnOnce<()>>::call_once<unknown>
86.97 s
gammaloop-nextest-core> at <unknown source file>:<unknown line>
86.98 s
gammaloop-nextest-core> 11: test[75d6903177b1d7e9]::__rust_begin_short_backtrace::<core[940e698046960fd5]::result::Result<(), alloc[2ea6bcb46fca0c42]::string::String>, fn() -> core[940e698046960fd5]::result::Result<(), alloc[2ea6bcb46fca0c42]::string::String>><unknown>
86.98 s
gammaloop-nextest-core> at <unknown source file>:<unknown line>
86.98 s
gammaloop-nextest-core> 12: test[75d6903177b1d7e9]::run_test::{closure#0}<unknown>
86.98 s
gammaloop-nextest-core> at <unknown source file>:<unknown line>
86.98 s
gammaloop-nextest-core> 13: std[bcb96dfbba0ab899]::sys::backtrace::__rust_begin_short_backtrace::<test[75d6903177b1d7e9]::run_test::{closure#1}, ()><unknown>
86.98 s
gammaloop-nextest-core> at <unknown source file>:<unknown line>
86.98 s
gammaloop-nextest-core> 14: <std[bcb96dfbba0ab899]::thread::lifecycle::spawn_unchecked<test[75d6903177b1d7e9]::run_test::{closure#1}, ()>::{closure#1} as core[940e698046960fd5]::ops::function::FnOnce<()>>::call_once::{shim:vtable#0}<unknown>
86.98 s
gammaloop-nextest-core> at <unknown source file>:<unknown line>
86.98 s
gammaloop-nextest-core> 15: <std[bcb96dfbba0ab899]::sys::thread::unix::Thread>::new::thread_start<unknown>
86.98 s
gammaloop-nextest-core> at <unknown source file>:<unknown line>
86.98 s
gammaloop-nextest-core> 16: start_thread<unknown>
86.98 s
gammaloop-nextest-core> at <unknown source file>:<unknown line>
86.98 s
gammaloop-nextest-core> 17: __clone3<unknown>
86.98 s
gammaloop-nextest-core> at <unknown source file>:<unknown line>
86.98 s
gammaloop-nextest-core>
86.98 s
gammaloop-nextest-core> Run with COLORBT_SHOW_HIDDEN=1 environment variable to disable frame filtering.
86.98 s
gammaloop-nextest-core> Run with RUST_BACKTRACE=full to include source snippets.
86.98 s
gammaloop-nextest-core> =========================================
87.04 s
error: Cannot build '/nix/store/07lma8g6p1n7jxf8azmxf90ca6pqjydj-gammaloop-nextest-core.drv '.
87.04 s
Reason: builder failed with exit code 100 .
87.04 s
Output paths:
87.04 s
/nix/store/cb0qr129ypswd8fgpp9k932nrjfvk3s0-gammaloop-nextest-core
87.04 s
Last 612 log lines:
87.04 s
> Extracting 3 binaries (including 1 non-test binary), 1 build script output directory, and 2 linked paths to /build/nextest-archive-rwBuRm
87.04 s
> Extracted 18 files to /build/nextest-archive-rwBuRm in 0.59s
87.04 s
> ------------
87.04 s
> Nextest run ID 76bc058a-26a0-47a5-b110-6539d5013011 with nextest profile: ci_gammaloop
87.04 s
> Starting 339 tests across 2 binaries
87.04 s
> FAIL [ 0.031s] (243/339) gammaloop-api repl::tests :: completion_shows_type_hint_for_non_boolean_settings_leaf
87.04 s
> stdout ---
87.04 s
>
87.04 s
> running 1 test
87.04 s
> test repl::tests::completion_shows_type_hint_for_non_boolean_settings_leaf ... FAILED
87.04 s
>
87.04 s
> failures:
87.04 s
>
87.04 s
> failures:
87.04 s
> repl::tests::completion_shows_type_hint_for_non_boolean_settings_leaf
87.04 s
>
87.04 s
> test result: FAILED. 0 passed; 1 failed; 0 ignored; 0 measured; 338 filtered out; finished in 0.01s
87.04 s
>
87.04 s
> stderr ---
87.04 s
>
87.04 s
> thread 'repl::tests::completion_shows_type_hint_for_non_boolean_settings_leaf' (775) panicked at crates/gammaloop-api/src/repl.rs:5778:9:
87.04 s
> [Suggestion { value: "", description: Some("Number of samples in the first Monte Carlo iteration."), style: None, extra: None, span: Span { start: 42, end: 42 }, append_whitespace: false }]
87.04 s
> stack backtrace:
87.04 s
> 0: __rustc::rust_begin_unwind
87.04 s
> 1: core::panicking::panic_fmt
87.04 s
> 2: gammaloop_api::repl::tests::completion_shows_type_hint_for_non_boolean_settings_leaf
87.04 s
> 3: <gammaloop_api::repl::tests::completion_shows_type_hint_for_non_boolean_settings_leaf::{closure#0} as core::ops::function::FnOnce<()>>::call_once
87.04 s
> note: Some details are omitted, run with `RUST_BACKTRACE=full` for a verbose backtrace.
87.04 s
>
87.04 s
> FAIL [ 0.101s] (290/339) gammaloop-api templates::tests :: extract_templates_uses_canonical_package_layout
87.04 s
> stdout ---
87.04 s
>
87.04 s
> running 1 test
87.04 s
> test templates::tests::extract_templates_uses_canonical_package_layout ... FAILED
87.04 s
>
87.04 s
> failures:
87.04 s
>
87.04 s
> failures:
87.04 s
> templates::tests::extract_templates_uses_canonical_package_layout
87.04 s
>
87.04 s
> test result: FAILED. 0 passed; 1 failed; 0 ignored; 0 measured; 338 filtered out; finished in 0.09s
87.04 s
>
87.04 s
> stderr ---
87.04 s
>
87.04 s
> thread 'templates::tests::extract_templates_uses_canonical_package_layout' (876) panicked at crates/gammaloop-api/src/templates.rs:99:9:
87.04 s
> assertion failed: figure.contains("amplitude-mode")
87.04 s
> stack backtrace:
87.04 s
> 0: __rustc::rust_begin_unwind
87.04 s
> 1: core::panicking::panic_fmt
87.04 s
> 2: core::panicking::panic
87.04 s
> 3: gammaloop_api::templates::tests::extract_templates_uses_canonical_package_layout
87.04 s
> 4: <gammaloop_api::templates::tests::extract_templates_uses_canonical_package_layout::{closure#0} as core::ops::function::FnOnce<()>>::call_once
87.04 s
> note: Some details are omitted, run with `RUST_BACKTRACE=full` for a verbose backtrace.
87.04 s
>
87.04 s
> ------------
87.04 s
> Summary [ 0.644s] 339 tests run: 337 passed , 2 failed , 0 skipped
87.04 s
> FAIL [ 0.031s] (243/339) gammaloop-api repl::tests :: completion_shows_type_hint_for_non_boolean_settings_leaf
87.04 s
> stdout ---
87.04 s
>
87.04 s
> running 1 test
87.04 s
> test repl::tests::completion_shows_type_hint_for_non_boolean_settings_leaf ... FAILED
87.04 s
>
87.04 s
> failures:
87.04 s
>
87.04 s
> failures:
87.04 s
> repl::tests::completion_shows_type_hint_for_non_boolean_settings_leaf
87.04 s
>
87.04 s
> test result: FAILED. 0 passed; 1 failed; 0 ignored; 0 measured; 338 filtered out; finished in 0.01s
87.04 s
>
87.04 s
> stderr ---
87.04 s
>
87.04 s
> thread 'repl::tests::completion_shows_type_hint_for_non_boolean_settings_leaf' (775) panicked at crates/gammaloop-api/src/repl.rs:5778:9:
87.04 s
> [Suggestion { value: "", description: Some("Number of samples in the first Monte Carlo iteration."), style: None, extra: None, span: Span { start: 42, end: 42 }, append_whitespace: false }]
87.04 s
> stack backtrace:
87.04 s
> 0: __rustc::rust_begin_unwind
87.04 s
> 1: core::panicking::panic_fmt
87.04 s
> 2: gammaloop_api::repl::tests::completion_shows_type_hint_for_non_boolean_settings_leaf
87.04 s
> 3: <gammaloop_api::repl::tests::completion_shows_type_hint_for_non_boolean_settings_leaf::{closure#0} as core::ops::function::FnOnce<()>>::call_once
87.04 s
> note: Some details are omitted, run with `RUST_BACKTRACE=full` for a verbose backtrace.
87.04 s
>
87.04 s
> FAIL [ 0.101s] (290/339) gammaloop-api templates::tests :: extract_templates_uses_canonical_package_layout
87.04 s
> stdout ---
87.04 s
>
87.04 s
> running 1 test
87.04 s
> test templates::tests::extract_templates_uses_canonical_package_layout ... FAILED
87.04 s
>
87.04 s
> failures:
87.04 s
>
87.04 s
> failures:
87.04 s
> templates::tests::extract_templates_uses_canonical_package_layout
87.04 s
>
87.04 s
> test result: FAILED. 0 passed; 1 failed; 0 ignored; 0 measured; 338 filtered out; finished in 0.09s
87.04 s
>
87.04 s
> stderr ---
87.04 s
>
87.04 s
> thread 'templates::tests::extract_templates_uses_canonical_package_layout' (876) panicked at crates/gammaloop-api/src/templates.rs:99:9:
87.04 s
> assertion failed: figure.contains("amplitude-mode")
87.04 s
> stack backtrace:
87.04 s
> 0: __rustc::rust_begin_unwind
87.04 s
> 1: core::panicking::panic_fmt
87.04 s
> 2: core::panicking::panic
87.04 s
> 3: gammaloop_api::templates::tests::extract_templates_uses_canonical_package_layout
87.04 s
> 4: <gammaloop_api::templates::tests::extract_templates_uses_canonical_package_layout::{closure#0} as core::ops::function::FnOnce<()>>::call_once
87.04 s
> note: Some details are omitted, run with `RUST_BACKTRACE=full` for a verbose backtrace.
87.04 s
>
87.04 s
> error : test run failed
87.04 s
>
87.04 s
> ========== nextest test summary ==========
87.04 s
> report: target/nextest/ci_gammaloop/junit.xml
87.04 s
> tests: 339, failures: 2, errors: 0
87.04 s
>
87.04 s
> 1. gammaloop-api::repl::tests::completion_shows_type_hint_for_non_boolean_settings_leaf
87.04 s
> failure: test failure with exit code 101
87.04 s
> thread 'repl::tests::completion_shows_type_hint_for_non_boolean_settings_leaf' (775) panicked at crates/gammaloop-api/src/repl.rs:5778:9:
87.04 s
> [Suggestion { value: "", description: Some("Number of samples in the first Monte Carlo iteration."), style: None, extra: None, span: Span { start: 42, end: 42 }, append_whitespace: false }]
87.04 s
> stack backtrace:
87.04 s
> 0: __rustc::rust_begin_unwind
87.04 s
> 1: core::panicking::panic_fmt
87.04 s
> 2: gammaloop_api::repl::tests::completion_shows_type_hint_for_non_boolean_settings_leaf
87.04 s
> 3: <gammaloop_api::repl::tests::completion_shows_type_hint_for_non_boolean_settings_leaf::{closure#0} as core::ops::function::FnOnce<()>>::call_once
87.04 s
> note: Some details are omitted, run with `RUST_BACKTRACE=full` for a verbose backtrace.
87.04 s
> system-out
87.04 s
> running 1 test
87.04 s
> test repl::tests::completion_shows_type_hint_for_non_boolean_settings_leaf ... FAILED
87.04 s
>
87.04 s
> failures:
87.04 s
>
87.04 s
> failures:
87.04 s
> repl::tests::completion_shows_type_hint_for_non_boolean_settings_leaf
87.04 s
>
87.04 s
> test result: FAILED. 0 passed; 1 failed; 0 ignored; 0 measured; 338 filtered out; finished in 0.01s
87.04 s
> system-err
87.04 s
> thread 'repl::tests::completion_shows_type_hint_for_non_boolean_settings_leaf' (775) panicked at crates/gammaloop-api/src/repl.rs:5778:9:
87.04 s
> [Suggestion { value: "", description: Some("Number of samples in the first Monte Carlo iteration."), style: None, extra: None, span: Span { start: 42, end: 42 }, append_whitespace: false }]
87.04 s
> stack backtrace:
87.04 s
> 0: __rustc::rust_begin_unwind
87.04 s
> 1: core::panicking::panic_fmt
87.04 s
> 2: gammaloop_api::repl::tests::completion_shows_type_hint_for_non_boolean_settings_leaf
87.04 s
> 3: <gammaloop_api::repl::tests::completion_shows_type_hint_for_non_boolean_settings_leaf::{closure#0} as core::ops::function::FnOnce<()>>::call_once
87.04 s
> note: Some details are omitted, run with `RUST_BACKTRACE=full` for a verbose backtrace.
87.04 s
>
87.04 s
> 2. gammaloop-api::templates::tests::extract_templates_uses_canonical_package_layout
87.04 s
> failure: test failure with exit code 101
87.04 s
> thread 'templates::tests::extract_templates_uses_canonical_package_layout' (876) panicked at crates/gammaloop-api/src/templates.rs:99:9:
87.04 s
> assertion failed: figure.contains("amplitude-mode")
87.04 s
> stack backtrace:
87.04 s
> 0: __rustc::rust_begin_unwind
87.04 s
> 1: core::panicking::panic_fmt
87.04 s
> 2: core::panicking::panic
87.04 s
> 3: gammaloop_api::templates::tests::extract_templates_uses_canonical_package_layout
87.04 s
> 4: <gammaloop_api::templates::tests::extract_templates_uses_canonical_package_layout::{closure#0} as core::ops::function::FnOnce<()>>::call_once
87.04 s
> note: Some details are omitted, run with `RUST_BACKTRACE=full` for a verbose backtrace.
87.04 s
> system-out
87.04 s
> running 1 test
87.04 s
> test templates::tests::extract_templates_uses_canonical_package_layout ... FAILED
87.04 s
>
87.04 s
> failures:
87.04 s
>
87.04 s
> failures:
87.04 s
> templates::tests::extract_templates_uses_canonical_package_layout
87.04 s
>
87.04 s
> test result: FAILED. 0 passed; 1 failed; 0 ignored; 0 measured; 338 filtered out; finished in 0.09s
87.04 s
> system-err
87.04 s
> thread 'templates::tests::extract_templates_uses_canonical_package_layout' (876) panicked at crates/gammaloop-api/src/templates.rs:99:9:
87.04 s
> assertion failed: figure.contains("amplitude-mode")
87.04 s
> stack backtrace:
87.04 s
> 0: __rustc::rust_begin_unwind
87.04 s
> 1: core::panicking::panic_fmt
87.04 s
> 2: core::panicking::panic
87.04 s
> 3: gammaloop_api::templates::tests::extract_templates_uses_canonical_package_layout
87.04 s
> 4: <gammaloop_api::templates::tests::extract_templates_uses_canonical_package_layout::{closure#0} as core::ops::function::FnOnce<()>>::call_once
87.04 s
> note: Some details are omitted, run with `RUST_BACKTRACE=full` for a verbose backtrace.
87.04 s
> =========================================
87.04 s
> Extracting 1 binary and 1 linked path to /build/nextest-archive-RSHIKK
87.04 s
> Extracted 7 files to /build/nextest-archive-RSHIKK in 0.08s
87.04 s
> ------------
87.04 s
> Nextest run ID 6dd8f6a6-bdef-4ca9-ab1d-6d73e4dc4d32 with nextest profile: ci_gammaloop
87.04 s
> Starting 19 tests across 1 binary
87.04 s
> ------------
87.04 s
> Summary [ 0.017s] 19 tests run: 19 passed , 0 skipped
87.04 s
>
87.04 s
> ========== nextest test summary ==========
87.04 s
> report: target/nextest/ci_gammaloop/junit.xml
87.04 s
> tests: 19, failures: 0, errors: 0
87.04 s
> No failing testcases found.
87.04 s
> =========================================
87.04 s
> Extracting 1 binary to /build/nextest-archive-pho77r
87.04 s
> Extracted 4 files to /build/nextest-archive-pho77r in 0.05s
87.04 s
> ------------
87.04 s
> Nextest run ID 7f1b56d5-22c0-4cbd-a23a-8b0f6becbadb with nextest profile: ci_gammaloop
87.04 s
> Starting 0 tests across 1 binary
87.04 s
> ------------
87.04 s
> Summary [ 0.000s] 0 tests run: 0 passed , 0 skipped
87.04 s
>
87.04 s
> ========== nextest test summary ==========
87.04 s
> report: target/nextest/ci_gammaloop/junit.xml
87.04 s
> tests: 0, failures: 0, errors: 0
87.04 s
> No failing testcases found.
87.04 s
> =========================================
87.04 s
> Extracting 4 binaries, 1 build script output directory, and 2 linked paths to /build/nextest-archive-xB9eVc
87.04 s
> Extracted 18 files to /build/nextest-archive-xB9eVc in 0.57s
87.04 s
> ------------
87.04 s
> Nextest run ID d307d8dd-1544-402f-a800-77372c7dd921 with nextest profile: ci_gammaloop
87.04 s
> Starting 456 tests across 4 binaries (61 tests skipped , including 60 tests via profile.ci_gammaloop.default-filter )
87.04 s
> FAIL [ 0.229s] (156/456) gammalooprs graph::parse::tests :: parse_lmbsetting_crossection
87.04 s
> stdout ---
87.04 s
>
87.04 s
> running 1 test
87.04 s
> ━━━━━━━━━━━━━━━━━━━━━━━━━━━━━━━ Snapshot Summary ━━━━━━━━━━━━━━━━━━━━━━━━━━━━━━━
87.04 s
> Snapshot: parse_lmbsetting_crossection
87.04 s
> Source: crates/gammalooprs/src/graph/parse/tests.rs:252
87.04 s
> ────────────────────────────────────────────────────────────────────────────────
87.04 s
> Expression: g.debug_dot()
87.04 s
> ────────────────────────────────────────────────────────────────────────────────
87.04 s
> -old snapshot
87.04 s
> +new results
87.04 s
> ────────────┬───────────────────────────────────────────────────────────────────
87.04 s
> 1 │-digraph G{
87.04 s
> 1 │+digraph G {
87.04 s
> 2 2 │ num = "1/2";
87.04 s
> 3 3 │ overall_factor = "2*x";
87.04 s
> 4 4 │ overall_factor_evaluated = "2*x";
87.04 s
> 5 5 │ projector = "spenso::t";
87.04 s
> ────────────┴───────────────────────────────────────────────────────────────────
87.04 s
> To update snapshots run `cargo insta review`
87.04 s
> Stopped on the first failure. Run `cargo insta test` to run all snapshots.
87.04 s
> test graph::parse::tests::parse_lmbsetting_crossection ... FAILED
87.04 s
>
87.04 s
> failures:
87.04 s
>
87.04 s
> failures:
87.04 s
> graph::parse::tests::parse_lmbsetting_crossection
87.04 s
>
87.04 s
> test result: FAILED. 0 passed; 1 failed; 0 ignored; 0 measured; 508 filtered out; finished in 0.21s
87.04 s
>
87.04 s
> stderr ---
87.04 s
> [21:19:02.939] @gammalooprs::graph::attribute_warnings WARNING : Unknown node attribute 'color_num' on graph 'G', node 'A'; did you mean 'num'?
87.04 s
> at crates/gammalooprs/src/graph/attribute_warnings.rs:198
87.04 s
> The application panicked (crashed).
87.04 s
> Message: snapshot assertion for 'parse_lmbsetting_crossection' failed in line 252
87.04 s
> Location: /nix/store/xdy1vvhll2bijdplvl9fcc2b9plkxhaa-vendor-cargo-deps/c19b7c6f923b580ac259164a89f2577984ad5ab09ee9d583b888f934adbbe8d0/insta-1.47.2/src/runtime.rs :719
87.04 s
>
87.04 s
> ━━━━━━━━━━━━━━━━━━━━━━━━━━━━━━━━━━ BACKTRACE ━━━━━━━━━━━━━━━━━━━━━━━━━━━━━━━━━━━
87.04 s
> 1: <color_eyre[b0c9e66060e883b2]::config::PanicHook>::panic_report <unknown>
87.04 s
> at <unknown source file> :<unknown line>
87.04 s
> 2: <color_eyre[b0c9e66060e883b2]::config::PanicHook>::into_panic_hook::{closure#0} <unknown>
87.04 s
> at <unknown source file> :<unknown line>
87.04 s
> 3: std[bcb96dfbba0ab899]::panicking::panic_with_hook <unknown>
87.04 s
> at <unknown source file> :<unknown line>
87.04 s
> 4: std[bcb96dfbba0ab899]::panicking::panic_handler::{closure#0} <unknown>
87.04 s
> at <unknown source file> :<unknown line>
87.04 s
> 5: std[bcb96dfbba0ab899]::sys::backtrace::__rust_end_short_backtrace::<std[bcb96dfbba0ab899]::panicking::panic_handler::{closure#0}, !> <unknown>
87.04 s
> at <unknown source file> :<unknown line>
87.04 s
> 6: __rustc[6c289b9f9c454d21]::rust_begin_unwind <unknown>
87.04 s
> at <unknown source file> :<unknown line>
87.04 s
> 7: core[940e698046960fd5]::panicking::panic_fmt <unknown>
87.04 s
> at <unknown source file> :<unknown line>
87.04 s
> 8: insta[307a548ac79ef4d9]::runtime::assert_snapshot <unknown>
87.04 s
> at <unknown source file> :<unknown line>
87.04 s
> 9: gammalooprs[5490727360442cce]::graph::parse::tests::parse_lmbsetting_crossection <unknown>
87.04 s
> at <unknown source file> :<unknown line>
87.04 s
> 10: <gammalooprs[5490727360442cce]::graph::parse::tests::parse_lmbsetting_crossection::{closure#0} as core[940e698046960fd5]::ops::function::FnOnce<()>>::call_once <unknown>
87.04 s
> at <unknown source file> :<unknown line>
87.04 s
> 11: test[75d6903177b1d7e9]::__rust_begin_short_backtrace::<core[940e698046960fd5]::result::Result<(), alloc[2ea6bcb46fca0c42]::string::String>, fn() -> core[940e698046960fd5]::result::Result<(), alloc[2ea6bcb46fca0c42]::string::String>> <unknown>
87.04 s
> at <unknown source file> :<unknown line>
87.04 s
> 12: test[75d6903177b1d7e9]::run_test::{closure#0} <unknown>
87.04 s
> at <unknown source file> :<unknown line>
87.04 s
> 13: std[bcb96dfbba0ab899]::sys::backtrace::__rust_begin_short_backtrace::<test[75d6903177b1d7e9]::run_test::{closure#1}, ()> <unknown>
87.04 s
> at <unknown source file> :<unknown line>
87.04 s
> 14: <std[bcb96dfbba0ab899]::thread::lifecycle::spawn_unchecked<test[75d6903177b1d7e9]::run_test::{closure#1}, ()>::{closure#1} as core[940e698046960fd5]::ops::function::FnOnce<()>>::call_once::{shim:vtable#0} <unknown>
87.04 s
> at <unknown source file> :<unknown line>
87.04 s
> 15: <std[bcb96dfbba0ab899]::sys::thread::unix::Thread>::new::thread_start <unknown>
87.04 s
> at <unknown source file> :<unknown line>
87.04 s
> 16: start_thread <unknown>
87.04 s
> at <unknown source file> :<unknown line>
87.04 s
> 17: __clone3 <unknown>
87.04 s
> at <unknown source file> :<unknown line>
87.04 s
>
87.04 s
> Run with COLORBT_SHOW_HIDDEN=1 environment variable to disable frame filtering.
87.04 s
> Run with RUST_BACKTRACE=full to include source snippets.
87.04 s
>
87.04 s
> FAIL [ 0.083s] (407/456) gammalooprs uv::export::tests :: computed_node_full_numerator_is_a_spenso_aware_typst_fragment
87.04 s
> stdout ---
87.04 s
>
87.04 s
> running 1 test
87.04 s
> test uv::export::tests::computed_node_full_numerator_is_a_spenso_aware_typst_fragment ... FAILED
87.04 s
>
87.04 s
> failures:
87.04 s
>
87.04 s
> failures:
87.04 s
> uv::export::tests::computed_node_full_numerator_is_a_spenso_aware_typst_fragment
87.04 s
>
87.04 s
> test result: FAILED. 0 passed; 1 failed; 0 ignored; 0 measured; 508 filtered out; finished in 0.07s
87.04 s
>
87.04 s
> stderr ---
87.04 s
> The application panicked (crashed).
87.04 s
> Message: assertion failed: exported.dot.contains(r#"full_num = "op(\"Tr\")(1)";"#)
87.04 s
> Location: crates/gammalooprs/src/uv/export.rs :483
87.04 s
>
87.04 s
> ━━━━━━━━━━━━━━━━━━━━━━━━━━━━━━━━━━ BACKTRACE ━━━━━━━━━━━━━━━━━━━━━━━━━━━━━━━━━━━
87.04 s
> 1: <color_eyre[b0c9e66060e883b2]::config::PanicHook>::panic_report <unknown>
87.04 s
> at <unknown source file> :<unknown line>
87.04 s
> 2: <color_eyre[b0c9e66060e883b2]::config::PanicHook>::into_panic_hook::{closure#0} <unknown>
87.04 s
> at <unknown source file> :<unknown line>
87.04 s
> 3: std[bcb96dfbba0ab899]::panicking::panic_with_hook <unknown>
87.04 s
> at <unknown source file> :<unknown line>
87.04 s
> 4: std[bcb96dfbba0ab899]::panicking::panic_handler::{closure#0} <unknown>
87.04 s
> at <unknown source file> :<unknown line>
87.04 s
> 5: std[bcb96dfbba0ab899]::sys::backtrace::__rust_end_short_backtrace::<std[bcb96dfbba0ab899]::panicking::panic_handler::{closure#0}, !> <unknown>
87.04 s
> at <unknown source file> :<unknown line>
87.04 s
> 6: __rustc[6c289b9f9c454d21]::rust_begin_unwind <unknown>
87.04 s
> at <unknown source file> :<unknown line>
87.04 s
> 7: core[940e698046960fd5]::panicking::panic_fmt <unknown>
87.04 s
> at <unknown source file> :<unknown line>
87.04 s
> 8: core[940e698046960fd5]::panicking::panic <unknown>
87.04 s
> at <unknown source file> :<unknown line>
87.04 s
> 9: gammalooprs[5490727360442cce]::uv::export::tests::computed_node_full_numerator_is_a_spenso_aware_typst_fragment <unknown>
87.04 s
> at <unknown source file> :<unknown line>
87.04 s
> 10: <gammalooprs[5490727360442cce]::uv::export::tests::computed_node_full_numerator_is_a_spenso_aware_typst_fragment::{closure#0} as core[940e698046960fd5]::ops::function::FnOnce<()>>::call_once <unknown>
87.04 s
> at <unknown source file> :<unknown line>
87.04 s
> 11: test[75d6903177b1d7e9]::__rust_begin_short_backtrace::<core[940e698046960fd5]::result::Result<(), alloc[2ea6bcb46fca0c42]::string::String>, fn() -> core[940e698046960fd5]::result::Result<(), alloc[2ea6bcb46fca0c42]::string::String>> <unknown>
87.04 s
> at <unknown source file> :<unknown line>
87.04 s
> 12: test[75d6903177b1d7e9]::run_test::{closure#0} <unknown>
87.04 s
> at <unknown source file> :<unknown line>
87.04 s
> 13: std[bcb96dfbba0ab899]::sys::backtrace::__rust_begin_short_backtrace::<test[75d6903177b1d7e9]::run_test::{closure#1}, ()> <unknown>
87.04 s
> at <unknown source file> :<unknown line>
87.04 s
> 14: <std[bcb96dfbba0ab899]::thread::lifecycle::spawn_unchecked<test[75d6903177b1d7e9]::run_test::{closure#1}, ()>::{closure#1} as core[940e698046960fd5]::ops::function::FnOnce<()>>::call_once::{shim:vtable#0} <unknown>
87.04 s
> at <unknown source file> :<unknown line>
87.04 s
> 15: <std[bcb96dfbba0ab899]::sys::thread::unix::Thread>::new::thread_start <unknown>
87.04 s
> at <unknown source file> :<unknown line>
87.04 s
> 16: start_thread <unknown>
87.04 s
> at <unknown source file> :<unknown line>
87.04 s
> 17: __clone3 <unknown>
87.04 s
> at <unknown source file> :<unknown line>
87.04 s
>
87.04 s
> Run with COLORBT_SHOW_HIDDEN=1 environment variable to disable frame filtering.
87.04 s
> Run with RUST_BACKTRACE=full to include source snippets.
87.04 s
>
87.04 s
> ------------
87.04 s
> Summary [ 12.886s] 456 tests run: 454 passed , 2 failed , 61 skipped
87.04 s
> FAIL [ 0.229s] (156/456) gammalooprs graph::parse::tests :: parse_lmbsetting_crossection
87.04 s
> stdout ---
87.04 s
>
87.04 s
> running 1 test
87.04 s
> ━━━━━━━━━━━━━━━━━━━━━━━━━━━━━━━ Snapshot Summary ━━━━━━━━━━━━━━━━━━━━━━━━━━━━━━━
87.04 s
> Snapshot: parse_lmbsetting_crossection
87.04 s
> Source: crates/gammalooprs/src/graph/parse/tests.rs:252
87.04 s
> ────────────────────────────────────────────────────────────────────────────────
87.04 s
> Expression: g.debug_dot()
87.04 s
> ────────────────────────────────────────────────────────────────────────────────
87.04 s
> -old snapshot
87.04 s
> +new results
87.04 s
> ────────────┬───────────────────────────────────────────────────────────────────
87.04 s
> 1 │-digraph G{
87.04 s
> 1 │+digraph G {
87.04 s
> 2 2 │ num = "1/2";
87.04 s
> 3 3 │ overall_factor = "2*x";
87.04 s
> 4 4 │ overall_factor_evaluated = "2*x";
87.04 s
> 5 5 │ projector = "spenso::t";
87.04 s
> ────────────┴───────────────────────────────────────────────────────────────────
87.04 s
> To update snapshots run `cargo insta review`
87.04 s
> Stopped on the first failure. Run `cargo insta test` to run all snapshots.
87.04 s
> test graph::parse::tests::parse_lmbsetting_crossection ... FAILED
87.04 s
>
87.04 s
> failures:
87.04 s
>
87.04 s
> failures:
87.04 s
> graph::parse::tests::parse_lmbsetting_crossection
87.04 s
>
87.04 s
> test result: FAILED. 0 passed; 1 failed; 0 ignored; 0 measured; 508 filtered out; finished in 0.21s
87.04 s
>
87.04 s
> stderr ---
87.04 s
> [21:19:02.939] @gammalooprs::graph::attribute_warnings WARNING : Unknown node attribute 'color_num' on graph 'G', node 'A'; did you mean 'num'?
87.04 s
> at crates/gammalooprs/src/graph/attribute_warnings.rs:198
87.04 s
> The application panicked (crashed).
87.04 s
> Message: snapshot assertion for 'parse_lmbsetting_crossection' failed in line 252
87.04 s
> Location: /nix/store/xdy1vvhll2bijdplvl9fcc2b9plkxhaa-vendor-cargo-deps/c19b7c6f923b580ac259164a89f2577984ad5ab09ee9d583b888f934adbbe8d0/insta-1.47.2/src/runtime.rs :719
87.04 s
>
87.04 s
> ━━━━━━━━━━━━━━━━━━━━━━━━━━━━━━━━━━ BACKTRACE ━━━━━━━━━━━━━━━━━━━━━━━━━━━━━━━━━━━
87.04 s
> 1: <color_eyre[b0c9e66060e883b2]::config::PanicHook>::panic_report <unknown>
87.04 s
> at <unknown source file> :<unknown line>
87.04 s
> 2: <color_eyre[b0c9e66060e883b2]::config::PanicHook>::into_panic_hook::{closure#0} <unknown>
87.04 s
> at <unknown source file> :<unknown line>
87.04 s
> 3: std[bcb96dfbba0ab899]::panicking::panic_with_hook <unknown>
87.04 s
> at <unknown source file> :<unknown line>
87.05 s
> 4: std[bcb96dfbba0ab899]::panicking::panic_handler::{closure#0} <unknown>
87.05 s
> at <unknown source file> :<unknown line>
87.05 s
> 5: std[bcb96dfbba0ab899]::sys::backtrace::__rust_end_short_backtrace::<std[bcb96dfbba0ab899]::panicking::panic_handler::{closure#0}, !> <unknown>
87.05 s
> at <unknown source file> :<unknown line>
87.05 s
> 6: __rustc[6c289b9f9c454d21]::rust_begin_unwind <unknown>
87.05 s
> at <unknown source file> :<unknown line>
87.05 s
> 7: core[940e698046960fd5]::panicking::panic_fmt <unknown>
87.05 s
> at <unknown source file> :<unknown line>
87.05 s
> 8: insta[307a548ac79ef4d9]::runtime::assert_snapshot <unknown>
87.05 s
> at <unknown source file> :<unknown line>
87.05 s
> 9: gammalooprs[5490727360442cce]::graph::parse::tests::parse_lmbsetting_crossection <unknown>
87.05 s
> at <unknown source file> :<unknown line>
87.05 s
> 10: <gammalooprs[5490727360442cce]::graph::parse::tests::parse_lmbsetting_crossection::{closure#0} as core[940e698046960fd5]::ops::function::FnOnce<()>>::call_once <unknown>
87.05 s
> at <unknown source file> :<unknown line>
87.05 s
> 11: test[75d6903177b1d7e9]::__rust_begin_short_backtrace::<core[940e698046960fd5]::result::Result<(), alloc[2ea6bcb46fca0c42]::string::String>, fn() -> core[940e698046960fd5]::result::Result<(), alloc[2ea6bcb46fca0c42]::string::String>> <unknown>
87.05 s
> at <unknown source file> :<unknown line>
87.05 s
> 12: test[75d6903177b1d7e9]::run_test::{closure#0} <unknown>
87.05 s
> at <unknown source file> :<unknown line>
87.05 s
> 13: std[bcb96dfbba0ab899]::sys::backtrace::__rust_begin_short_backtrace::<test[75d6903177b1d7e9]::run_test::{closure#1}, ()> <unknown>
87.05 s
> at <unknown source file> :<unknown line>
87.05 s
> 14: <std[bcb96dfbba0ab899]::thread::lifecycle::spawn_unchecked<test[75d6903177b1d7e9]::run_test::{closure#1}, ()>::{closure#1} as core[940e698046960fd5]::ops::function::FnOnce<()>>::call_once::{shim:vtable#0} <unknown>
87.05 s
> at <unknown source file> :<unknown line>
87.05 s
> 15: <std[bcb96dfbba0ab899]::sys::thread::unix::Thread>::new::thread_start <unknown>
87.05 s
> at <unknown source file> :<unknown line>
87.05 s
> 16: start_thread <unknown>
87.05 s
> at <unknown source file> :<unknown line>
87.05 s
> 17: __clone3 <unknown>
87.05 s
> at <unknown source file> :<unknown line>
87.05 s
>
87.05 s
> Run with COLORBT_SHOW_HIDDEN=1 environment variable to disable frame filtering.
87.05 s
> Run with RUST_BACKTRACE=full to include source snippets.
87.05 s
>
87.05 s
> FAIL [ 0.083s] (407/456) gammalooprs uv::export::tests :: computed_node_full_numerator_is_a_spenso_aware_typst_fragment
87.05 s
> stdout ---
87.05 s
>
87.05 s
> running 1 test
87.05 s
> test uv::export::tests::computed_node_full_numerator_is_a_spenso_aware_typst_fragment ... FAILED
87.05 s
>
87.05 s
> failures:
87.05 s
>
87.05 s
> failures:
87.05 s
> uv::export::tests::computed_node_full_numerator_is_a_spenso_aware_typst_fragment
87.05 s
>
87.05 s
> test result: FAILED. 0 passed; 1 failed; 0 ignored; 0 measured; 508 filtered out; finished in 0.07s
87.05 s
>
87.05 s
> stderr ---
87.05 s
> The application panicked (crashed).
87.05 s
> Message: assertion failed: exported.dot.contains(r#"full_num = "op(\"Tr\")(1)";"#)
87.05 s
> Location: crates/gammalooprs/src/uv/export.rs :483
87.05 s
>
87.05 s
> ━━━━━━━━━━━━━━━━━━━━━━━━━━━━━━━━━━ BACKTRACE ━━━━━━━━━━━━━━━━━━━━━━━━━━━━━━━━━━━
87.05 s
> 1: <color_eyre[b0c9e66060e883b2]::config::PanicHook>::panic_report <unknown>
87.05 s
> at <unknown source file> :<unknown line>
87.05 s
> 2: <color_eyre[b0c9e66060e883b2]::config::PanicHook>::into_panic_hook::{closure#0} <unknown>
87.05 s
> at <unknown source file> :<unknown line>
87.05 s
> 3: std[bcb96dfbba0ab899]::panicking::panic_with_hook <unknown>
87.05 s
> at <unknown source file> :<unknown line>
87.05 s
> 4: std[bcb96dfbba0ab899]::panicking::panic_handler::{closure#0} <unknown>
87.05 s
> at <unknown source file> :<unknown line>
87.05 s
> 5: std[bcb96dfbba0ab899]::sys::backtrace::__rust_end_short_backtrace::<std[bcb96dfbba0ab899]::panicking::panic_handler::{closure#0}, !> <unknown>
87.05 s
> at <unknown source file> :<unknown line>
87.05 s
> 6: __rustc[6c289b9f9c454d21]::rust_begin_unwind <unknown>
87.05 s
> at <unknown source file> :<unknown line>
87.05 s
> 7: core[940e698046960fd5]::panicking::panic_fmt <unknown>
87.05 s
> at <unknown source file> :<unknown line>
87.05 s
> 8: core[940e698046960fd5]::panicking::panic <unknown>
87.05 s
> at <unknown source file> :<unknown line>
87.05 s
> 9: gammalooprs[5490727360442cce]::uv::export::tests::computed_node_full_numerator_is_a_spenso_aware_typst_fragment <unknown>
87.05 s
> at <unknown source file> :<unknown line>
87.05 s
> 10: <gammalooprs[5490727360442cce]::uv::export::tests::computed_node_full_numerator_is_a_spenso_aware_typst_fragment::{closure#0} as core[940e698046960fd5]::ops::function::FnOnce<()>>::call_once <unknown>
87.05 s
> at <unknown source file> :<unknown line>
87.05 s
> 11: test[75d6903177b1d7e9]::__rust_begin_short_backtrace::<core[940e698046960fd5]::result::Result<(), alloc[2ea6bcb46fca0c42]::string::String>, fn() -> core[940e698046960fd5]::result::Result<(), alloc[2ea6bcb46fca0c42]::string::String>> <unknown>
87.05 s
> at <unknown source file> :<unknown line>
87.05 s
> 12: test[75d6903177b1d7e9]::run_test::{closure#0} <unknown>
87.05 s
> at <unknown source file> :<unknown line>
87.05 s
> 13: std[bcb96dfbba0ab899]::sys::backtrace::__rust_begin_short_backtrace::<test[75d6903177b1d7e9]::run_test::{closure#1}, ()> <unknown>
87.05 s
> at <unknown source file> :<unknown line>
87.05 s
> 14: <std[bcb96dfbba0ab899]::thread::lifecycle::spawn_unchecked<test[75d6903177b1d7e9]::run_test::{closure#1}, ()>::{closure#1} as core[940e698046960fd5]::ops::function::FnOnce<()>>::call_once::{shim:vtable#0} <unknown>
87.05 s
> at <unknown source file> :<unknown line>
87.05 s
> 15: <std[bcb96dfbba0ab899]::sys::thread::unix::Thread>::new::thread_start <unknown>
87.05 s
> at <unknown source file> :<unknown line>
87.05 s
> 16: start_thread <unknown>
87.05 s
> at <unknown source file> :<unknown line>
87.05 s
> 17: __clone3 <unknown>
87.05 s
> at <unknown source file> :<unknown line>
87.05 s
>
87.05 s
> Run with COLORBT_SHOW_HIDDEN=1 environment variable to disable frame filtering.
87.05 s
> Run with RUST_BACKTRACE=full to include source snippets.
87.05 s
>
87.05 s
> error : test run failed
87.05 s
>
87.05 s
> ========== nextest test summary ==========
87.05 s
> report: target/nextest/ci_gammaloop/junit.xml
87.05 s
> tests: 456, failures: 2, errors: 0
87.05 s
>
87.05 s
> 1. gammalooprs::graph::parse::tests::parse_lmbsetting_crossection
87.05 s
> failure: test failure with exit code 101
87.05 s
> system-out
87.05 s
> running 1 test
87.05 s
> ━━━━━━━━━━━━━━━━━━━━━━━━━━━━━━━ Snapshot Summary ━━━━━━━━━━━━━━━━━━━━━━━━━━━━━━━
87.05 s
> Snapshot: parse_lmbsetting_crossection
87.05 s
> Source: crates/gammalooprs/src/graph/parse/tests.rs:252
87.05 s
> ────────────────────────────────────────────────────────────────────────────────
87.05 s
> Expression: g.debug_dot()
87.05 s
> ────────────────────────────────────────────────────────────────────────────────
87.05 s
> -old snapshot
87.05 s
> +new results
87.05 s
> ────────────┬───────────────────────────────────────────────────────────────────
87.05 s
> 1 │-digraph G{
87.05 s
> 1 │+digraph G {
87.05 s
> 2 2 │ num = "1/2";
87.05 s
> 3 3 │ overall_factor = "2*x";
87.05 s
> 4 4 │ overall_factor_evaluated = "2*x";
87.05 s
> 5 5 │ projector = "spenso::t";
87.05 s
> ────────────┴───────────────────────────────────────────────────────────────────
87.05 s
> To update snapshots run `cargo insta review`
87.05 s
> Stopped on the first failure. Run `cargo insta test` to run all snapshots.
87.05 s
> test graph::parse::tests::parse_lmbsetting_crossection ... FAILED
87.05 s
>
87.05 s
> failures:
87.05 s
>
87.05 s
> failures:
87.05 s
> graph::parse::tests::parse_lmbsetting_crossection
87.05 s
>
87.05 s
> test result: FAILED. 0 passed; 1 failed; 0 ignored; 0 measured; 508 filtered out; finished in 0.21s
87.05 s
> system-err
87.05 s
> [21:19:02.939] @gammalooprs::graph::attribute_warnings WARNING : Unknown node attribute 'color_num' on graph 'G', node 'A'; did you mean 'num'?
87.05 s
> at crates/gammalooprs/src/graph/attribute_warnings.rs:198
87.05 s
> The application panicked (crashed).
87.05 s
> Message: snapshot assertion for 'parse_lmbsetting_crossection' failed in line 252
87.05 s
> Location: /nix/store/xdy1vvhll2bijdplvl9fcc2b9plkxhaa-vendor-cargo-deps/c19b7c6f923b580ac259164a89f2577984ad5ab09ee9d583b888f934adbbe8d0/insta-1.47.2/src/runtime.rs:719
87.05 s
>
87.05 s
> ━━━━━━━━━━━━━━━━━━━━━━━━━━━━━━━━━━ BACKTRACE ━━━━━━━━━━━━━━━━━━━━━━━━━━━━━━━━━━━
87.05 s
> 1: <color_eyre[b0c9e66060e883b2]::config::PanicHook>::panic_report<unknown>
87.05 s
> at <unknown source file>:<unknown line>
87.05 s
> 2: <color_eyre[b0c9e66060e883b2]::config::PanicHook>::into_panic_hook::{closure#0}<unknown>
87.05 s
> at <unknown source file>:<unknown line>
87.05 s
> 3: std[bcb96dfbba0ab899]::panicking::panic_with_hook<unknown>
87.05 s
> at <unknown source file>:<unknown line>
87.05 s
> 4: std[bcb96dfbba0ab899]::panicking::panic_handler::{closure#0}<unknown>
87.05 s
> at <unknown source file>:<unknown line>
87.05 s
> 5: std[bcb96dfbba0ab899]::sys::backtrace::__rust_end_short_backtrace::<std[bcb96dfbba0ab899]::panicking::panic_handler::{closure#0}, !><unknown>
87.05 s
> at <unknown source file>:<unknown line>
87.05 s
> 6: __rustc[6c289b9f9c454d21]::rust_begin_unwind<unknown>
87.05 s
> at <unknown source file>:<unknown line>
87.05 s
> 7: core[940e698046960fd5]::panicking::panic_fmt<unknown>
87.05 s
> at <unknown source file>:<unknown line>
87.05 s
> 8: insta[307a548ac79ef4d9]::runtime::assert_snapshot<unknown>
87.05 s
> at <unknown source file>:<unknown line>
87.05 s
> 9: gammalooprs[5490727360442cce]::graph::parse::tests::parse_lmbsetting_crossection<unknown>
87.05 s
> at <unknown source file>:<unknown line>
87.05 s
> 10: <gammalooprs[5490727360442cce]::graph::parse::tests::parse_lmbsetting_crossection::{closure#0} as core[940e698046960fd5]::ops::function::FnOnce<()>>::call_once<unknown>
87.05 s
> at <unknown source file>:<unknown line>
87.05 s
> 11: test[75d6903177b1d7e9]::__rust_begin_short_backtrace::<core[940e698046960fd5]::result::Result<(), alloc[2ea6bcb46fca0c42]::string::String>, fn() -> core[940e698046960fd5]::result::Result<(), alloc[2ea6bcb46fca0c42]::string::String>><unknown>
87.05 s
> at <unknown source file>:<unknown line>
87.05 s
> 12: test[75d6903177b1d7e9]::run_test::{closure#0}<unknown>
87.05 s
> at <unknown source file>:<unknown line>
87.05 s
> 13: std[bcb96dfbba0ab899]::sys::backtrace::__rust_begin_short_backtrace::<test[75d6903177b1d7e9]::run_test::{closure#1}, ()><unknown>
87.05 s
> at <unknown source file>:<unknown line>
87.05 s
> 14: <std[bcb96dfbba0ab899]::thread::lifecycle::spawn_unchecked<test[75d6903177b1d7e9]::run_test::{closure#1}, ()>::{closure#1} as core[940e698046960fd5]::ops::function::FnOnce<()>>::call_once::{shim:vtable#0}<unknown>
87.05 s
> at <unknown source file>:<unknown line>
87.05 s
> 15: <std[bcb96dfbba0ab899]::sys::thread::unix::Thread>::new::thread_start<unknown>
87.05 s
> at <unknown source file>:<unknown line>
87.05 s
> 16: start_thread<unknown>
87.05 s
> at <unknown source file>:<unknown line>
87.05 s
> 17: __clone3<unknown>
87.05 s
> at <unknown source file>:<unknown line>
87.05 s
>
87.05 s
> Run with COLORBT_SHOW_HIDDEN=1 environment variable to disable frame filtering.
87.05 s
> Run with RUST_BACKTRACE=full to include source snippets.
87.05 s
>
87.05 s
> 2. gammalooprs::uv::export::tests::computed_node_full_numerator_is_a_spenso_aware_typst_fragment
87.05 s
> failure: test failure with exit code 101
87.05 s
> system-out
87.05 s
> running 1 test
87.05 s
> test uv::export::tests::computed_node_full_numerator_is_a_spenso_aware_typst_fragment ... FAILED
87.05 s
>
87.05 s
> failures:
87.05 s
>
87.05 s
> failures:
87.05 s
> uv::export::tests::computed_node_full_numerator_is_a_spenso_aware_typst_fragment
87.05 s
>
87.05 s
> test result: FAILED. 0 passed; 1 failed; 0 ignored; 0 measured; 508 filtered out; finished in 0.07s
87.05 s
> system-err
87.05 s
> The application panicked (crashed).
87.05 s
> Message: assertion failed: exported.dot.contains(r#"full_num = "op(\"Tr\")(1)";"#)
87.05 s
> Location: crates/gammalooprs/src/uv/export.rs:483
87.05 s
>
87.05 s
> ━━━━━━━━━━━━━━━━━━━━━━━━━━━━━━━━━━ BACKTRACE ━━━━━━━━━━━━━━━━━━━━━━━━━━━━━━━━━━━
87.05 s
> 1: <color_eyre[b0c9e66060e883b2]::config::PanicHook>::panic_report<unknown>
87.05 s
> at <unknown source file>:<unknown line>
87.05 s
> 2: <color_eyre[b0c9e66060e883b2]::config::PanicHook>::into_panic_hook::{closure#0}<unknown>
87.05 s
> at <unknown source file>:<unknown line>
87.05 s
> 3: std[bcb96dfbba0ab899]::panicking::panic_with_hook<unknown>
87.05 s
> at <unknown source file>:<unknown line>
87.05 s
> 4: std[bcb96dfbba0ab899]::panicking::panic_handler::{closure#0}<unknown>
87.05 s
> at <unknown source file>:<unknown line>
87.05 s
> 5: std[bcb96dfbba0ab899]::sys::backtrace::__rust_end_short_backtrace::<std[bcb96dfbba0ab899]::panicking::panic_handler::{closure#0}, !><unknown>
87.05 s
> at <unknown source file>:<unknown line>
87.05 s
> 6: __rustc[6c289b9f9c454d21]::rust_begin_unwind<unknown>
87.05 s
> at <unknown source file>:<unknown line>
87.05 s
> 7: core[940e698046960fd5]::panicking::panic_fmt<unknown>
87.05 s
> at <unknown source file>:<unknown line>
87.05 s
> 8: core[940e698046960fd5]::panicking::panic<unknown>
87.05 s
> at <unknown source file>:<unknown line>
87.05 s
> 9: gammalooprs[5490727360442cce]::uv::export::tests::computed_node_full_numerator_is_a_spenso_aware_typst_fragment<unknown>
87.05 s
> at <unknown source file>:<unknown line>
87.05 s
> 10: <gammalooprs[5490727360442cce]::uv::export::tests::computed_node_full_numerator_is_a_spenso_aware_typst_fragment::{closure#0} as core[940e698046960fd5]::ops::function::FnOnce<()>>::call_once<unknown>
87.05 s
> at <unknown source file>:<unknown line>
87.05 s
> 11: test[75d6903177b1d7e9]::__rust_begin_short_backtrace::<core[940e698046960fd5]::result::Result<(), alloc[2ea6bcb46fca0c42]::string::String>, fn() -> core[940e698046960fd5]::result::Result<(), alloc[2ea6bcb46fca0c42]::string::String>><unknown>
87.05 s
> at <unknown source file>:<unknown line>
87.05 s
> 12: test[75d6903177b1d7e9]::run_test::{closure#0}<unknown>
87.05 s
> at <unknown source file>:<unknown line>
87.05 s
> 13: std[bcb96dfbba0ab899]::sys::backtrace::__rust_begin_short_backtrace::<test[75d6903177b1d7e9]::run_test::{closure#1}, ()><unknown>
87.05 s
> at <unknown source file>:<unknown line>
87.05 s
> 14: <std[bcb96dfbba0ab899]::thread::lifecycle::spawn_unchecked<test[75d6903177b1d7e9]::run_test::{closure#1}, ()>::{closure#1} as core[940e698046960fd5]::ops::function::FnOnce<()>>::call_once::{shim:vtable#0}<unknown>
87.05 s
> at <unknown source file>:<unknown line>
87.05 s
> 15: <std[bcb96dfbba0ab899]::sys::thread::unix::Thread>::new::thread_start<unknown>
87.05 s
> at <unknown source file>:<unknown line>
87.05 s
> 16: start_thread<unknown>
87.05 s
> at <unknown source file>:<unknown line>
87.05 s
> 17: __clone3<unknown>
87.05 s
> at <unknown source file>:<unknown line>
87.05 s
>
87.05 s
> Run with COLORBT_SHOW_HIDDEN=1 environment variable to disable frame filtering.
87.05 s
> Run with RUST_BACKTRACE=full to include source snippets.
87.05 s
> =========================================
87.05 s
For full logs, run:
87.05 s
nix log /nix/store/07lma8g6p1n7jxf8azmxf90ca6pqjydj-gammaloop-nextest-core.drv
87.18 s
[2 built (1 failed ), 13 Run failed.