test packages.x86_64-linux.nix-ci-check-gammaloop-nextest-core

Reproduce this run
Original Run
  1. 0.18 s $ /nix/store/9ypz3flqsrl5xl495mm8h645gadjsxi1-coreutils-9.11/bin/timeout --kill-after=15s 7200s /nix/store/23zk8sgzamrbmj1fday15szf7f2279s8-nix-2.34.7/bin/nix --extra-experimental-features nix-command --extra-experimental-features flakes flake clone git+https://github.com/alphal00p/gammaloop --dest /tmp/nix-ci-worker/stable-pwd/repo/
  2. 0.23 s Cloning into '/tmp/nix-ci-worker/stable-pwd/repo'...
  3. 0.83 s remote: Enumerating objects: 64185, done.
  4. 0.94 s remote: Counting objects: 0% (1/9551) remote: Counting objects: 1% (96/9551) remote: Counting objects: 2% (192/9551) remote: Counting objects: 3% (287/9551) remote: Counting objects: 4% (383/9551) remote: Counting objects: 5% (478/9551) remote: Counting objects: 6% (574/9551) remote: Counting objects: 7% (669/9551) remote: Counting objects: 8% (765/9551) remote: Counting objects: 9% (860/9551) remote: Counting objects: 10% (956/9551) remote: Counting objects: 11% (1051/9551) remote: Counting objects: 12% (1147/9551) remote: Counting objects: 13% (1242/9551) remote: Counting objects: 14% (1338/9551) remote: Counting objects: 15% (1433/9551) remote: Counting objects: 16% (1529/9551) remote: Counting objects: 17% (1624/9551) remote: Counting objects: 18% (1720/9551) remote: Counting objects: 19% (1815/9551) remote: Counting objects: 20% (1911/9551) remote: Counting objects: 21% (2006/9551) remote: Counting objects: 22% (2102/9551) remote: Counting objects: 23% (2197/9551) remote: Counting objects: 24% (2293/9551) remote: Counting objects: 25% (2388/9551) remote: Counting objects: 26% (2484/9551) remote: Counting objects: 27% (2579/9551) remote: Counting objects: 28% (2675/9551) remote: Counting objects: 29% (2770/9551) remote: Counting objects: 30% (2866/9551) remote: Counting objects: 31% (2961/9551) remote: Counting objects: 32% (3057/9551) remote: Counting objects: 33% (3152/9551) remote: Counting objects: 34% (3248/9551) remote: Counting objects: 35% (3343/9551) remote: Counting objects: 36% (3439/9551) remote: Counting objects: 37% (3534/9551) remote: Counting objects: 38% (3630/9551) remote: Counting objects: 39% (3725/9551) remote: Counting objects: 40% (3821/9551) remote: Counting objects: 41% (3916/9551) remote: Counting objects: 42% (4012/9551) remote: Counting objects: 43% (4107/9551) remote: Counting objects: 44% (4203/9551) remote: Counting objects: 45% (4298/9551) remote: Counting objects: 46% (4394/9551) remote: Counting objects: 47% (4489/9551) remote: Counting objects: 48% (4585/9551) remote: Counting objects: 49% (4680/9551) remote: Counting objects: 50% (4776/9551) remote: Counting objects: 51% (4872/9551) remote: Counting objects: 52% (4967/9551) remote: Counting objects: 53% (5063/9551) remote: Counting objects: 54% (5158/9551) remote: Counting objects: 55% (5254/9551) remote: Counting objects: 56% (5349/9551) remote: Counting objects: 57% (5445/9551) remote: Counting objects: 58% (5540/9551) remote: Counting objects: 59% (5636/9551) remote: Counting objects: 60% (5731/9551) remote: Counting objects: 61% (5827/9551) remote: Counting objects: 62% (5922/9551) remote: Counting objects: 63% (6018/9551) remote: Counting objects: 64% (6113/9551) remote: Counting objects: 65% (6209/9551) remote: Counting objects: 66% (6304/9551) remote: Counting objects: 67% (6400/9551) remote: Counting objects: 68% (6495/9551) remote: Counting objects: 69% (6591/9551) remote: Counting objects: 70% (6686/9551) remote: Counting objects: 71% (6782/9551) remote: Counting objects: 72% (6877/9551) remote: Counting objects: 73% (6973/9551) remote: Counting objects: 74% (7068/9551) remote: Counting objects: 75% (7164/9551) remote: Counting objects: 76% (7259/9551) remote: Counting objects: 77% (7355/9551) remote: Counting objects: 78% (7450/9551) remote: Counting objects: 79% (7546/9551) remote: Counting objects: 80% (7641/9551) remote: Counting objects: 81% (7737/9551) remote: Counting objects: 82% (7832/9551) remote: Counting objects: 83% (7928/9551) remote: Counting objects: 84% (8023/9551) remote: Counting objects: 85% (8119/9551) remote: Counting objects: 86% (8214/9551) remote: Counting objects: 87% (8310/9551) remote: Counting objects: 88% (8405/9551) remote: Counting objects: 89% (8501/9551) remote: Counting objects: 90% (8596/9551) remote: Counting objects: 91% (8692/9551) remote: Counting objects: 92% (8787/9551) remote: Counting objects: 93% (8883/9551) remote: Counting objects: 94% (8978/9551) remote: Counting objects: 95% (9074/9551) remote: Counting objects: 96% (9169/9551) remote: Counting objects: 97% (9265/9551) remote: Counting objects: 98% (9360/9551) remote: Counting objects: 99% (9456/9551) remote: Counting objects: 100% (9551/9551) remote: Counting objects: 100% (9551/9551), done.
  5. 3.12 s remote: Compressing objects: 0% (1/2326) remote: Compressing objects: 1% (24/2326) remote: Compressing objects: 2% (47/2326) remote: Compressing objects: 3% (70/2326) remote: Compressing objects: 4% (94/2326) remote: Compressing objects: 5% (117/2326) remote: Compressing objects: 6% (140/2326) remote: Compressing objects: 7% (163/2326) remote: Compressing objects: 8% (187/2326) remote: Compressing objects: 9% (210/2326) remote: Compressing objects: 10% (233/2326) remote: Compressing objects: 11% (256/2326) remote: Compressing objects: 12% (280/2326) remote: Compressing objects: 13% (303/2326) remote: Compressing objects: 14% (326/2326) remote: Compressing objects: 15% (349/2326) remote: Compressing objects: 16% (373/2326) remote: Compressing objects: 17% (396/2326) remote: Compressing objects: 18% (419/2326) remote: Compressing objects: 19% (442/2326) remote: Compressing objects: 20% (466/2326) remote: Compressing objects: 21% (489/2326) remote: Compressing objects: 22% (512/2326) remote: Compressing objects: 23% (535/2326) remote: Compressing objects: 23% (553/2326) remote: Compressing objects: 24% (559/2326) remote: Compressing objects: 25% (582/2326) remote: Compressing objects: 26% (605/2326) remote: Compressing objects: 27% (629/2326) remote: Compressing objects: 28% (652/2326) remote: Compressing objects: 29% (675/2326) remote: Compressing objects: 30% (698/2326) remote: Compressing objects: 31% (722/2326) remote: Compressing objects: 32% (745/2326) remote: Compressing objects: 33% (768/2326) remote: Compressing objects: 33% (769/2326) remote: Compressing objects: 34% (791/2326) remote: Compressing objects: 35% (815/2326) remote: Compressing objects: 36% (838/2326) remote: Compressing objects: 37% (861/2326) remote: Compressing objects: 38% (884/2326) remote: Compressing objects: 39% (908/2326) remote: Compressing objects: 40% (931/2326) remote: Compressing objects: 41% (954/2326) remote: Compressing objects: 42% (977/2326) remote: Compressing objects: 43% (1001/2326) remote: Compressing objects: 44% (1024/2326) remote: Compressing objects: 45% (1047/2326) remote: Compressing objects: 46% (1070/2326) remote: Compressing objects: 47% (1094/2326) remote: Compressing objects: 48% (1117/2326) remote: Compressing objects: 49% (1140/2326) remote: Compressing objects: 50% (1163/2326) remote: Compressing objects: 51% (1187/2326) remote: Compressing objects: 52% (1210/2326) remote: Compressing objects: 53% (1233/2326) remote: Compressing objects: 54% (1257/2326) remote: Compressing objects: 55% (1280/2326) remote: Compressing objects: 56% (1303/2326) remote: Compressing objects: 57% (1326/2326) remote: Compressing objects: 58% (1350/2326) remote: Compressing objects: 59% (1373/2326) remote: Compressing objects: 60% (1396/2326) remote: Compressing objects: 61% (1419/2326) remote: Compressing objects: 62% (1443/2326) remote: Compressing objects: 63% (1466/2326) remote: Compressing objects: 64% (1489/2326) remote: Compressing objects: 65% (1512/2326) remote: Compressing objects: 66% (1536/2326) remote: Compressing objects: 67% (1559/2326) remote: Compressing objects: 68% (1582/2326) remote: Compressing objects: 69% (1605/2326) remote: Compressing objects: 70% (1629/2326) remote: Compressing objects: 71% (1652/2326) remote: Compressing objects: 72% (1675/2326) remote: Compressing objects: 73% (1698/2326) remote: Compressing objects: 74% (1722/2326) remote: Compressing objects: 75% (1745/2326) remote: Compressing objects: 76% (1768/2326) remote: Compressing objects: 77% (1792/2326) remote: Compressing objects: 78% (1815/2326) remote: Compressing objects: 79% (1838/2326) remote: Compressing objects: 80% (1861/2326) remote: Compressing objects: 81% (1885/2326) remote: Compressing objects: 82% (1908/2326) remote: Compressing objects: 83% (1931/2326) remote: Compressing objects: 84% (1954/2326) remote: Compressing objects: 85% (1978/2326) remote: Compressing objects: 86% (2001/2326) remote: Compressing objects: 87% (2024/2326) remote: Compressing objects: 88% (2047/2326) remote: Compressing objects: 89% (2071/2326) remote: Compressing objects: 90% (2094/2326) remote: Compressing objects: 91% (2117/2326) remote: Compressing objects: 92% (2140/2326) remote: Compressing objects: 93% (2164/2326) remote: Compressing objects: 94% (2187/2326) remote: Compressing objects: 95% (2210/2326) remote: Compressing objects: 96% (2233/2326) remote: Compressing objects: 97% (2257/2326) remote: Compressing objects: 98% (2280/2326) remote: Compressing objects: 99% (2303/2326) remote: Compressing objects: 100% (2326/2326) remote: Compressing objects: 100% (2326/2326), done.
  6. 9.12 s Receiving objects: 0% (1/64185) Receiving objects: 1% (642/64185) Receiving objects: 2% (1284/64185) Receiving objects: 3% (1926/64185) Receiving objects: 4% (2568/64185) Receiving objects: 5% (3210/64185) Receiving objects: 6% (3852/64185) Receiving objects: 7% (4493/64185) Receiving objects: 8% (5135/64185) Receiving objects: 9% (5777/64185) Receiving objects: 10% (6419/64185), 10.45 MiB | 20.88 MiB/s Receiving objects: 11% (7061/64185), 10.45 MiB | 20.88 MiB/s Receiving objects: 12% (7703/64185), 10.45 MiB | 20.88 MiB/s Receiving objects: 13% (8345/64185), 10.45 MiB | 20.88 MiB/s Receiving objects: 14% (8986/64185), 10.45 MiB | 20.88 MiB/s Receiving objects: 15% (9628/64185), 10.45 MiB | 20.88 MiB/s Receiving objects: 16% (10270/64185), 10.45 MiB | 20.88 MiB/s Receiving objects: 17% (10912/64185), 10.45 MiB | 20.88 MiB/s Receiving objects: 18% (11554/64185), 10.45 MiB | 20.88 MiB/s Receiving objects: 19% (12196/64185), 10.45 MiB | 20.88 MiB/s Receiving objects: 20% (12837/64185), 10.45 MiB | 20.88 MiB/s Receiving objects: 21% (13479/64185), 10.45 MiB | 20.88 MiB/s Receiving objects: 22% (14121/64185), 10.45 MiB | 20.88 MiB/s Receiving objects: 23% (14763/64185), 10.45 MiB | 20.88 MiB/s Receiving objects: 24% (15405/64185), 10.45 MiB | 20.88 MiB/s Receiving objects: 25% (16047/64185), 10.45 MiB | 20.88 MiB/s Receiving objects: 26% (16689/64185), 10.45 MiB | 20.88 MiB/s Receiving objects: 27% (17330/64185), 10.45 MiB | 20.88 MiB/s Receiving objects: 28% (17972/64185), 10.45 MiB | 20.88 MiB/s Receiving objects: 29% (18614/64185), 10.45 MiB | 20.88 MiB/s Receiving objects: 30% (19256/64185), 10.45 MiB | 20.88 MiB/s Receiving objects: 31% (19898/64185), 10.45 MiB | 20.88 MiB/s Receiving objects: 32% (20540/64185), 10.45 MiB | 20.88 MiB/s Receiving objects: 33% (21182/64185), 10.45 MiB | 20.88 MiB/s Receiving objects: 34% (21823/64185), 10.45 MiB | 20.88 MiB/s Receiving objects: 35% (22465/64185), 10.45 MiB | 20.88 MiB/s Receiving objects: 36% (23107/64185), 10.45 MiB | 20.88 MiB/s Receiving objects: 37% (23749/64185), 10.45 MiB | 20.88 MiB/s Receiving objects: 38% (24391/64185), 10.45 MiB | 20.88 MiB/s Receiving objects: 39% (25033/64185), 10.45 MiB | 20.88 MiB/s Receiving objects: 40% (25674/64185), 10.45 MiB | 20.88 MiB/s Receiving objects: 41% (26316/64185), 10.45 MiB | 20.88 MiB/s Receiving objects: 42% (26958/64185), 10.45 MiB | 20.88 MiB/s Receiving objects: 43% (27600/64185), 10.45 MiB | 20.88 MiB/s Receiving objects: 44% (28242/64185), 10.45 MiB | 20.88 MiB/s Receiving objects: 45% (28884/64185), 10.45 MiB | 20.88 MiB/s Receiving objects: 46% (29526/64185), 10.45 MiB | 20.88 MiB/s Receiving objects: 47% (30167/64185), 10.45 MiB | 20.88 MiB/s Receiving objects: 48% (30809/64185), 10.45 MiB | 20.88 MiB/s Receiving objects: 49% (31451/64185), 10.45 MiB | 20.88 MiB/s Receiving objects: 50% (32093/64185), 10.45 MiB | 20.88 MiB/s Receiving objects: 50% (32266/64185), 10.45 MiB | 20.88 MiB/s Receiving objects: 51% (32735/64185), 27.62 MiB | 27.62 MiB/s Receiving objects: 52% (33377/64185), 27.62 MiB | 27.62 MiB/s Receiving objects: 53% (34019/64185), 27.62 MiB | 27.62 MiB/s Receiving objects: 54% (34660/64185), 27.62 MiB | 27.62 MiB/s Receiving objects: 55% (35302/64185), 27.62 MiB | 27.62 MiB/s Receiving objects: 56% (35944/64185), 27.62 MiB | 27.62 MiB/s Receiving objects: 57% (36586/64185), 27.62 MiB | 27.62 MiB/s Receiving objects: 58% (37228/64185), 27.62 MiB | 27.62 MiB/s Receiving objects: 59% (37870/64185), 27.62 MiB | 27.62 MiB/s Receiving objects: 60% (38511/64185), 42.91 MiB | 28.60 MiB/s Receiving objects: 61% (39153/64185), 42.91 MiB | 28.60 MiB/s Receiving objects: 62% (39795/64185), 42.91 MiB | 28.60 MiB/s Receiving objects: 63% (40437/64185), 42.91 MiB | 28.60 MiB/s Receiving objects: 64% (41079/64185), 42.91 MiB | 28.60 MiB/s Receiving objects: 65% (41721/64185), 42.91 MiB | 28.60 MiB/s Receiving objects: 66% (42363/64185), 42.91 MiB | 28.60 MiB/s Receiving objects: 67% (43004/64185), 42.91 MiB | 28.60 MiB/s Receiving objects: 68% (43646/64185), 42.91 MiB | 28.60 MiB/s Receiving objects: 69% (44288/64185), 42.91 MiB | 28.60 MiB/s Receiving objects: 70% (44930/64185), 42.91 MiB | 28.60 MiB/s Receiving objects: 71% (45572/64185), 42.91 MiB | 28.60 MiB/s Receiving objects: 71% (45819/64185), 57.87 MiB | 28.62 MiB/s Receiving objects: 72% (46214/64185), 57.87 MiB | 28.62 MiB/s Receiving objects: 73% (46856/64185), 57.87 MiB | 28.62 MiB/s Receiving objects: 74% (47497/64185), 57.87 MiB | 28.62 MiB/s Receiving objects: 75% (48139/64185), 57.87 MiB | 28.62 MiB/s Receiving objects: 76% (48781/64185), 68.49 MiB | 27.16 MiB/s Receiving objects: 77% (49423/64185), 68.49 MiB | 27.16 MiB/s Receiving objects: 78% (50065/64185), 68.49 MiB | 27.16 MiB/s Receiving objects: 78% (50404/64185), 68.49 MiB | 27.16 MiB/s Receiving objects: 79% (50707/64185), 73.96 MiB | 24.45 MiB/s Receiving objects: 80% (51348/64185), 73.96 MiB | 24.45 MiB/s Receiving objects: 81% (51990/64185), 73.96 MiB | 24.45 MiB/s Receiving objects: 82% (52632/64185), 73.96 MiB | 24.45 MiB/s Receiving objects: 83% (53274/64185), 79.80 MiB | 22.64 MiB/s Receiving objects: 83% (53292/64185), 84.21 MiB | 20.92 MiB/s Receiving objects: 84% (53916/64185), 84.21 MiB | 20.92 MiB/s Receiving objects: 85% (54558/64185), 84.21 MiB | 20.92 MiB/s Receiving objects: 86% (55200/64185), 84.21 MiB | 20.92 MiB/s Receiving objects: 87% (55841/64185), 84.21 MiB | 20.92 MiB/s Receiving objects: 88% (56483/64185), 84.21 MiB | 20.92 MiB/s Receiving objects: 89% (57125/64185), 84.21 MiB | 20.92 MiB/s Receiving objects: 90% (57767/64185), 84.21 MiB | 20.92 MiB/s Receiving objects: 91% (58409/64185), 87.89 MiB | 19.41 MiB/s Receiving objects: 92% (59051/64185), 87.89 MiB | 19.41 MiB/s Receiving objects: 93% (59693/64185), 87.89 MiB | 19.41 MiB/s Receiving objects: 94% (60334/64185), 87.89 MiB | 19.41 MiB/s Receiving objects: 95% (60976/64185), 87.89 MiB | 19.41 MiB/s Receiving objects: 96% (61618/64185), 87.89 MiB | 19.41 MiB/s Receiving objects: 96% (61829/64185), 87.89 MiB | 19.41 MiB/s Receiving objects: 97% (62260/64185), 91.23 MiB | 17.80 MiB/s Receiving objects: 98% (62902/64185), 94.73 MiB | 14.79 MiB/s Receiving objects: 99% (63544/64185), 94.73 MiB | 14.79 MiB/s remote: Total 64185 (delta 7397), reused 7776 (delta 6680), pack-reused 54634 (from 3)
  7. 9.21 s Receiving objects: 100% (64185/64185), 94.73 MiB | 14.79 MiB/s Receiving objects: 100% (64185/64185), 97.84 MiB | 16.39 MiB/s, done.
  8. 9.81 s Resolving deltas: 0% (0/44316) Resolving deltas: 1% (444/44316) Resolving deltas: 2% (887/44316) Resolving deltas: 3% (1330/44316) Resolving deltas: 4% (1773/44316) Resolving deltas: 5% (2216/44316) Resolving deltas: 6% (2659/44316) Resolving deltas: 7% (3103/44316) Resolving deltas: 8% (3546/44316) Resolving deltas: 9% (3989/44316) Resolving deltas: 10% (4432/44316) Resolving deltas: 11% (4875/44316) Resolving deltas: 12% (5318/44316) Resolving deltas: 13% (5763/44316) Resolving deltas: 14% (6206/44316) Resolving deltas: 15% (6648/44316) Resolving deltas: 16% (7091/44316) Resolving deltas: 17% (7534/44316) Resolving deltas: 18% (7977/44316) Resolving deltas: 19% (8421/44316) Resolving deltas: 20% (8864/44316) Resolving deltas: 21% (9309/44316) Resolving deltas: 22% (9750/44316) Resolving deltas: 23% (10193/44316) Resolving deltas: 24% (10636/44316) Resolving deltas: 25% (11082/44316) Resolving deltas: 26% (11523/44316) Resolving deltas: 27% (11966/44316) Resolving deltas: 28% (12409/44316) Resolving deltas: 29% (12855/44316) Resolving deltas: 30% (13295/44316) Resolving deltas: 31% (13738/44316) Resolving deltas: 32% (14185/44316) Resolving deltas: 33% (14626/44316) Resolving deltas: 34% (15068/44316) Resolving deltas: 35% (15512/44316) Resolving deltas: 36% (15954/44316) Resolving deltas: 37% (16397/44316) Resolving deltas: 38% (16841/44316) Resolving deltas: 39% (17284/44316) Resolving deltas: 40% (17727/44316) Resolving deltas: 41% (18170/44316) Resolving deltas: 42% (18613/44316) Resolving deltas: 43% (19056/44316) Resolving deltas: 44% (19502/44316) Resolving deltas: 45% (19943/44316) Resolving deltas: 46% (20387/44316) Resolving deltas: 47% (20830/44316) Resolving deltas: 48% (21272/44316) Resolving deltas: 49% (21715/44316) Resolving deltas: 50% (22161/44316) Resolving deltas: 51% (22602/44316) Resolving deltas: 52% (23045/44316) Resolving deltas: 53% (23488/44316) Resolving deltas: 54% (23934/44316) Resolving deltas: 55% (24375/44316) Resolving deltas: 56% (24818/44316) Resolving deltas: 57% (25262/44316) Resolving deltas: 58% (25704/44316) Resolving deltas: 59% (26147/44316) Resolving deltas: 60% (26590/44316) Resolving deltas: 61% (27033/44316) Resolving deltas: 62% (27476/44316) Resolving deltas: 63% (27920/44316) Resolving deltas: 64% (28363/44316) Resolving deltas: 65% (28806/44316) Resolving deltas: 66% (29250/44316) Resolving deltas: 67% (29692/44316) Resolving deltas: 68% (30135/44316) Resolving deltas: 69% (30579/44316) Resolving deltas: 70% (31022/44316) Resolving deltas: 71% (31465/44316) Resolving deltas: 72% (31908/44316) Resolving deltas: 73% (32351/44316) Resolving deltas: 74% (32794/44316) Resolving deltas: 75% (33237/44316) Resolving deltas: 76% (33681/44316) Resolving deltas: 77% (34124/44316) Resolving deltas: 78% (34567/44316) Resolving deltas: 79% (35012/44316) Resolving deltas: 80% (35453/44316) Resolving deltas: 81% (35897/44316) Resolving deltas: 82% (36340/44316) Resolving deltas: 83% (36783/44316) Resolving deltas: 84% (37226/44316) Resolving deltas: 85% (37670/44316) Resolving deltas: 86% (38112/44316) Resolving deltas: 87% (38555/44316) Resolving deltas: 88% (38999/44316) Resolving deltas: 89% (39442/44316) Resolving deltas: 90% (39885/44316) Resolving deltas: 91% (40329/44316) Resolving deltas: 92% (40773/44316) Resolving deltas: 93% (41214/44316) Resolving deltas: 94% (41659/44316) Resolving deltas: 95% (42101/44316) Resolving deltas: 96% (42544/44316) Resolving deltas: 97% (42987/44316) Resolving deltas: 98% (43430/44316) Resolving deltas: 99% (43873/44316) Resolving deltas: 100% (44316/44316) Resolving deltas: 100% (44316/44316), done.
  9. 10.10 s Fetching commit e848309923f9136d533613bb15d1029beb045263 for push-vrpyqyylypmw ...
  10. 10.10 s $ /nix/store/bcnisk3ydfgv26v2gw3zlky24g00yww2-git-2.54.0/bin/git fetch origin e848309923f9136d533613bb15d1029beb045263
  11. 10.60 s From https://github.com/alphal00p/gammaloop
  12. 10.60 s * branch e848309923f9136d533613bb15d1029beb045263 -> FETCH_HEAD
  13. 10.62 s $ /nix/store/9ypz3flqsrl5xl495mm8h645gadjsxi1-coreutils-9.11/bin/timeout --kill-after=15s 7200s /nix/store/bcnisk3ydfgv26v2gw3zlky24g00yww2-git-2.54.0/bin/git -c advice.detachedHead=false checkout e848309923f9136d533613bb15d1029beb045263
  14. 10.81 s HEAD is now at e8483099 fix Python extension artifact builds
  15. 10.83 s $ /nix/store/9ypz3flqsrl5xl495mm8h645gadjsxi1-coreutils-9.11/bin/timeout --kill-after=15s 7200s /nix/store/23zk8sgzamrbmj1fday15szf7f2279s8-nix-2.34.7/bin/nix --extra-experimental-features nix-command --extra-experimental-features flakes --log-format internal-json run .#packages.x86_64-linux.nix-ci-check-gammaloop-nextest-core --print-build-logs
  16. 10.93 s error (ignored): SQLite database '/var/cache/nix-ci-worker/eval-cache-v6/639d820d3aefaf84d2031f68b4d767476d59bba71ff868bb2c310db0263ad60e.sqlite' is busy
  17. 17.26 s
  18. 17.45 s Downloading cached gammaloop-nextest-binaries-core-gammaloop-api from https://cache.nix-ci.com
  19. 17.51 s Downloading cached gammaloop-nextest-binaries-core-gammaloop-tracing-filter from https://cache.nix-ci.com
  20. 17.51 s Downloading cached gammaloop-nextest-binaries-core-gammaloop-tracing-filter-macros from https://cache.nix-ci.com
  21. 17.51 s Downloading cached gammaloop-nextest-binaries-core-gammalooprs from https://cache.nix-ci.com
  22. 17.51 s Downloading cached libunistring from https://cache.nix-ci.com
  23. 17.51 s Downloading cached publicsuffix-list-0-unstable-2026-05 from https://cache.nix-ci.com
  24. 17.56 s Downloaded cached publicsuffix-list-0-unstable-2026-05 (329 KiB) in 54ms
  25. 17.56 s Progress: 0 of 1 built, 1 of 68 downloaded from cache (5 downloading)
  26. 17.58 s Downloaded cached libunistring (2 MiB) in 76ms
  27. 17.58 s Progress: 0 of 1 built, 2 of 68 downloaded from cache (4 downloading)
  28. 17.58 s Downloading cached libidn2 from https://cache.nix-ci.com
  29. 17.82 s Downloaded cached gammaloop-nextest-binaries-core-gammaloop-tracing-filter-macros (1.7 MiB) in 313ms
  30. 17.82 s Progress: 0 of 1 built, 3 of 68 downloaded from cache (4 downloading)
  31. 17.84 s Downloaded cached libidn2 (359 KiB) in 253ms
  32. 17.84 s Progress: 0 of 1 built, 4 of 68 downloaded from cache (3 downloading)
  33. 17.84 s Downloading cached glibc-2.42 from https://cache.nix-ci.com
  34. 18.20 s Downloaded cached gammaloop-nextest-binaries-core-gammaloop-tracing-filter (8.1 MiB) in 694ms
  35. 18.20 s Progress: 0 of 1 built, 5 of 68 downloaded from cache (3 downloading)
  36. 18.30 s Downloaded cached glibc-2.42 (33.5 MiB) in 463ms
  37. 18.30 s Progress: 0 of 1 built, 6 of 68 downloaded from cache (2 downloading)
  38. 18.30 s Downloading cached attr from https://cache.nix-ci.com
  39. 18.30 s Downloading cached aws-c-common from https://cache.nix-ci.com
  40. 18.30 s Downloading cached bash from https://cache.nix-ci.com
  41. 18.30 s Downloading cached brotli-1.2.0-lib from https://cache.nix-ci.com
  42. 18.30 s Downloading cached bzip2 from https://cache.nix-ci.com
  43. 18.30 s Downloading cached gcc-15.2.0-lib from https://cache.nix-ci.com
  44. 18.30 s Downloading cached editline-1.17.1-unstable-2025-05 from https://cache.nix-ci.com
  45. 18.30 s Downloading cached hwloc-2.14.0-lib from https://cache.nix-ci.com
  46. 18.30 s Downloading cached keyutils-1.6.3-lib from https://cache.nix-ci.com
  47. 18.30 s Downloading cached libcpuid from https://cache.nix-ci.com
  48. 18.30 s Downloading cached libpsl from https://cache.nix-ci.com
  49. 18.30 s Downloading cached libseccomp-2.6.0-lib from https://cache.nix-ci.com
  50. 18.30 s Downloading cached libsodium-1.0.22-unstable-2026-04 from https://cache.nix-ci.com
  51. 18.30 s Downloading cached libxml2 from https://cache.nix-ci.com
  52. 18.42 s Downloaded cached bzip2 (86 KiB) in 119ms
  53. 18.42 s Progress: 0 of 1 built, 7 of 68 downloaded from cache (15 downloading)
  54. 18.42 s Downloading cached llhttp from https://cache.nix-ci.com
  55. 18.44 s Downloaded cached aws-c-common (1.1 MiB) in 139ms
  56. 18.44 s Progress: 0 of 1 built, 8 of 68 downloaded from cache (15 downloading)
  57. 18.44 s Downloading cached lowdown-3.0.1-lib from https://cache.nix-ci.com
  58. 18.45 s Downloaded cached bash (1.8 MiB) in 149ms
  59. 18.45 s Progress: 0 of 1 built, 9 of 68 downloaded from cache (15 downloading)
  60. 18.45 s Downloading cached aws-c-compression from https://cache.nix-ci.com
  61. 18.47 s Downloaded cached brotli-1.2.0-lib (961 KiB) in 172ms
  62. 18.47 s Progress: 0 of 1 built, 10 of 68 downloaded from cache (15 downloading)
  63. 18.47 s Downloading cached aws-c-sdkutils from https://cache.nix-ci.com
  64. 18.51 s Downloaded cached keyutils-1.6.3-lib (41 KiB) in 207ms
  65. 18.51 s Progress: 0 of 1 built, 11 of 68 downloaded from cache (15 downloading)
  66. 18.51 s Downloading cached aws-checksums from https://cache.nix-ci.com
  67. 18.51 s Downloaded cached libpsl (114 KiB) in 208ms
  68. 18.51 s Progress: 0 of 1 built, 12 of 68 downloaded from cache (15 downloading)
  69. 18.51 s Downloading cached nghttp2-1.69.0-lib from https://cache.nix-ci.com
  70. 18.51 s Downloaded cached attr (90 KiB) in 211ms
  71. 18.51 s Progress: 0 of 1 built, 13 of 68 downloaded from cache (15 downloading)
  72. 18.51 s Downloading cached nghttp3 from https://cache.nix-ci.com
  73. 18.52 s Downloaded cached libcpuid (326 KiB) in 219ms
  74. 18.52 s Progress: 0 of 1 built, 14 of 68 downloaded from cache (15 downloading)
  75. 18.52 s Downloading cached acl from https://cache.nix-ci.com
  76. 18.52 s Downloaded cached editline-1.17.1-unstable-2025-05 (58 KiB) in 221ms
  77. 18.52 s Progress: 0 of 1 built, 15 of 68 downloaded from cache (15 downloading)
  78. 18.52 s Downloading cached openssl from https://cache.nix-ci.com
  79. 18.53 s Downloaded cached hwloc-2.14.0-lib (459 KiB) in 230ms
  80. 18.53 s Progress: 0 of 1 built, 16 of 68 downloaded from cache (15 downloading)
  81. 18.53 s Downloading cached pcre2 from https://cache.nix-ci.com
  82. 18.54 s Downloaded cached libseccomp-2.6.0-lib (193 KiB) in 240ms
  83. 18.54 s Progress: 0 of 1 built, 17 of 68 downloaded from cache (15 downloading)
  84. 18.54 s Downloading cached xz from https://cache.nix-ci.com
  85. 18.54 s Downloaded cached libsodium-1.0.22-unstable-2026-04 (666 KiB) in 241ms
  86. 18.54 s Downloaded cached libxml2 (1.4 MiB) in 241ms
  87. 18.54 s Progress: 0 of 1 built, 18 of 68 downloaded from cache (15 downloading)
  88. 18.54 s Downloaded cached gcc-15.2.0-lib (9.8 MiB) in 242ms
  89. 18.54 s Progress: 0 of 1 built, 19 of 68 downloaded from cache (14 downloading)
  90. 18.55 s Progress: 0 of 1 built, 20 of 68 downloaded from cache (14 downloading)
  91. 18.55 s Downloading cached zlib from https://cache.nix-ci.com
  92. 18.55 s Downloading cached boehm-gc from https://cache.nix-ci.com
  93. 18.55 s Downloading cached icu4c from https://cache.nix-ci.com
  94. 18.55 s Downloaded cached aws-c-compression (31 KiB) in 98ms
  95. 18.55 s Progress: 0 of 1 built, 21 of 68 downloaded from cache (15 downloading)
  96. 18.55 s Downloading cached onetbb from https://cache.nix-ci.com
  97. 18.55 s Downloaded cached llhttp (89 KiB) in 130ms
  98. 18.55 s Progress: 0 of 1 built, 22 of 68 downloaded from cache (15 downloading)
  99. 18.55 s Downloading cached zstd from https://cache.nix-ci.com
  100. 18.55 s Downloaded cached lowdown-3.0.1-lib (341 KiB) in 112ms
  101. 18.55 s Progress: 0 of 1 built, 23 of 68 downloaded from cache (15 downloading)
  102. 18.60 s Downloaded cached aws-c-sdkutils (155 KiB) in 128ms
  103. 18.60 s Progress: 0 of 1 built, 24 of 68 downloaded from cache (14 downloading)
  104. 18.63 s Downloaded cached aws-checksums (86 KiB) in 120ms
  105. 18.63 s Progress: 0 of 1 built, 25 of 68 downloaded from cache (13 downloading)
  106. 18.63 s Downloaded cached nghttp2-1.69.0-lib (225 KiB) in 123ms
  107. 18.63 s Progress: 0 of 1 built, 26 of 68 downloaded from cache (12 downloading)
  108. 18.63 s Downloaded cached nghttp3 (228 KiB) in 120ms
  109. 18.63 s Progress: 0 of 1 built, 27 of 68 downloaded from cache (11 downloading)
  110. 18.67 s Downloaded cached acl (125 KiB) in 151ms
  111. 18.67 s Progress: 0 of 1 built, 28 of 68 downloaded from cache (10 downloading)
  112. 18.69 s Downloaded cached xz (837 KiB) in 142ms
  113. 18.69 s Progress: 0 of 1 built, 29 of 68 downloaded from cache (9 downloading)
  114. 18.70 s Downloaded cached pcre2 (2 MiB) in 165ms
  115. 18.70 s Progress: 0 of 1 built, 30 of 68 downloaded from cache (8 downloading)
  116. 18.79 s Downloaded cached zlib (129 KiB) in 243ms
  117. 18.79 s Progress: 0 of 1 built, 31 of 68 downloaded from cache (7 downloading)
  118. 18.79 s Downloading cached sqlite from https://cache.nix-ci.com
  119. 18.79 s Downloaded cached openssl (8.9 MiB) in 270ms
  120. 18.79 s Progress: 0 of 1 built, 32 of 68 downloaded from cache (7 downloading)
  121. 18.79 s Downloading cached aws-c-cal from https://cache.nix-ci.com
  122. 18.79 s Downloading cached krb5-1.22.2-lib from https://cache.nix-ci.com
  123. 18.79 s Downloading cached libssh2 from https://cache.nix-ci.com
  124. 18.79 s Downloading cached ngtcp2 from https://cache.nix-ci.com
  125. 18.79 s Downloading cached s2n-tls from https://cache.nix-ci.com
  126. 18.80 s Downloaded cached boehm-gc (312 KiB) in 256ms
  127. 18.80 s Progress: 0 of 1 built, 33 of 68 downloaded from cache (11 downloading)
  128. 18.81 s Downloaded cached onetbb (626 KiB) in 258ms
  129. 18.81 s Progress: 0 of 1 built, 34 of 68 downloaded from cache (10 downloading)
  130. 18.81 s Downloading cached libblake3 from https://cache.nix-ci.com
  131. 18.82 s Downloaded cached zstd (1.1 MiB) in 268ms
  132. 18.82 s Progress: 0 of 1 built, 35 of 68 downloaded from cache (10 downloading)
  133. 18.82 s Downloading cached libarchive-3.8.8-lib from https://cache.nix-ci.com
  134. 19.00 s Downloaded cached aws-c-cal (158 KiB) in 207ms
  135. 19.00 s Progress: 0 of 1 built, 36 of 68 downloaded from cache (10 downloading)
  136. 19.01 s Downloaded cached libssh2 (330 KiB) in 219ms
  137. 19.01 s Progress: 0 of 1 built, 37 of 68 downloaded from cache (9 downloading)
  138. 19.01 s Downloading cached libgit2-1.9.4-lib from https://cache.nix-ci.com
  139. 19.03 s Downloaded cached ngtcp2 (515 KiB) in 234ms
  140. 19.03 s Progress: 0 of 1 built, 38 of 68 downloaded from cache (9 downloading)
  141. 19.04 s Downloaded cached libblake3 (117 KiB) in 227ms
  142. 19.04 s Progress: 0 of 1 built, 39 of 68 downloaded from cache (8 downloading)
  143. 19.05 s Downloaded cached s2n-tls (1.3 MiB) in 255ms
  144. 19.05 s Progress: 0 of 1 built, 40 of 68 downloaded from cache (7 downloading)
  145. 19.05 s Downloading cached aws-c-io from https://cache.nix-ci.com
  146. 19.09 s Downloaded cached libarchive-3.8.8-lib (953 KiB) in 267ms
  147. 19.09 s Progress: 0 of 1 built, 41 of 68 downloaded from cache (7 downloading)
  148. 19.11 s Downloaded cached krb5-1.22.2-lib (2.7 MiB) in 310ms
  149. 19.11 s Progress: 0 of 1 built, 42 of 68 downloaded from cache (6 downloading)
  150. 19.11 s Downloading cached curl from https://cache.nix-ci.com
  151. 19.19 s Downloaded cached sqlite (5.7 MiB) in 402ms
  152. 19.19 s Progress: 0 of 1 built, 43 of 68 downloaded from cache (6 downloading)
  153. 19.25 s Downloaded cached aws-c-io (648 KiB) in 204ms
  154. 19.26 s Progress: 0 of 1 built, 44 of 68 downloaded from cache (5 downloading)
  155. 19.26 s Downloading cached aws-c-event-stream from https://cache.nix-ci.com
  156. 19.26 s Downloading cached aws-c-http from https://cache.nix-ci.com
  157. 19.28 s Downloaded cached libgit2-1.9.4-lib (1.6 MiB) in 266ms
  158. 19.28 s Progress: 0 of 1 built, 45 of 68 downloaded from cache (6 downloading)
  159. 19.31 s Downloaded cached curl (1.2 MiB) in 205ms
  160. 19.31 s Progress: 0 of 1 built, 46 of 68 downloaded from cache (5 downloading)
  161. 19.35 s Downloaded cached icu4c (38.2 MiB) in 803ms
  162. 19.35 s Progress: 0 of 1 built, 47 of 68 downloaded from cache (4 downloading)
  163. 19.35 s Downloading cached boost from https://cache.nix-ci.com
  164. 19.43 s Downloaded cached aws-c-event-stream (176 KiB) in 171ms
  165. 19.43 s Progress: 0 of 1 built, 48 of 68 downloaded from cache (4 downloading)
  166. 19.43 s Downloaded cached aws-c-http (641 KiB) in 174ms
  167. 19.43 s Progress: 0 of 1 built, 49 of 68 downloaded from cache (3 downloading)
  168. 19.43 s Downloading cached aws-c-auth from https://cache.nix-ci.com
  169. 19.43 s Downloading cached aws-c-mqtt from https://cache.nix-ci.com
  170. 19.62 s Downloaded cached boost (14.5 MiB) in 268ms
  171. 19.62 s Progress: 0 of 1 built, 50 of 68 downloaded from cache (4 downloading)
  172. 19.62 s Downloading cached nix-util from https://cache.nix-ci.com
  173. 19.63 s Downloaded cached aws-c-auth (387 KiB) in 195ms
  174. 19.63 s Progress: 0 of 1 built, 51 of 68 downloaded from cache (4 downloading)
  175. 19.63 s Downloading cached aws-c-s3 from https://cache.nix-ci.com
  176. 19.63 s Downloaded cached aws-c-mqtt (557 KiB) in 196ms
  177. 19.63 s Progress: 0 of 1 built, 52 of 68 downloaded from cache (4 downloading)
  178. 19.78 s Downloaded cached nix-util (2.4 MiB) in 163ms
  179. 19.78 s Progress: 0 of 1 built, 53 of 68 downloaded from cache (3 downloading)
  180. 19.78 s Downloading cached nix-nswrapper from https://cache.nix-ci.com
  181. 19.81 s Downloaded cached aws-c-s3 (384 KiB) in 187ms
  182. 19.81 s Progress: 0 of 1 built, 54 of 68 downloaded from cache (3 downloading)
  183. 19.81 s Downloading cached aws-crt-cpp from https://cache.nix-ci.com
  184. 19.95 s Downloaded cached nix-nswrapper (131 KiB) in 170ms
  185. 19.95 s Progress: 0 of 1 built, 55 of 68 downloaded from cache (3 downloading)
  186. 20.00 s Downloaded cached aws-crt-cpp (979 KiB) in 186ms
  187. 20.00 s Progress: 0 of 1 built, 56 of 68 downloaded from cache (2 downloading)
  188. 20.00 s Downloading cached nix-store from https://cache.nix-ci.com
  189. 20.19 s Downloaded cached nix-store (5.8 MiB) in 185ms
  190. 20.19 s Progress: 0 of 1 built, 57 of 68 downloaded from cache (2 downloading)
  191. 20.19 s Downloading cached nix-fetchers from https://cache.nix-ci.com
  192. 20.19 s Downloading cached nix-main from https://cache.nix-ci.com
  193. 20.33 s Downloaded cached nix-main (393 KiB) in 148ms
  194. 20.33 s Progress: 0 of 1 built, 58 of 68 downloaded from cache (3 downloading)
  195. 20.35 s Downloaded cached nix-fetchers (1.5 MiB) in 160ms
  196. 20.35 s Progress: 0 of 1 built, 59 of 68 downloaded from cache (2 downloading)
  197. 20.35 s Downloading cached nix-expr from https://cache.nix-ci.com
  198. 20.63 s Downloaded cached nix-expr (3.3 MiB) in 279ms
  199. 20.63 s Progress: 0 of 1 built, 60 of 68 downloaded from cache (2 downloading)
  200. 20.63 s Downloading cached nix-flake from https://cache.nix-ci.com
  201. 20.89 s Downloaded cached nix-flake (956 KiB) in 262ms
  202. 20.89 s Progress: 0 of 1 built, 61 of 68 downloaded from cache (2 downloading)
  203. 20.89 s Downloading cached nix-cmd from https://cache.nix-ci.com
  204. 21.07 s Downloaded cached nix-cmd (1 MiB) in 181ms
  205. 21.07 s Progress: 0 of 1 built, 62 of 68 downloaded from cache (2 downloading)
  206. 21.07 s Downloading cached nix from https://cache.nix-ci.com
  207. 21.38 s Downloaded cached nix (3.9 MiB) in 312ms
  208. 21.38 s Progress: 0 of 1 built, 63 of 68 downloaded from cache (2 downloading)
  209. 21.38 s Downloading cached nix from https://cache.nix-ci.com
  210. 21.62 s Downloaded cached nix (8848 B) in 240ms
  211. 21.62 s Progress: 0 of 1 built, 64 of 68 downloaded from cache (2 downloading)
  212. 22.32 s Downloaded cached gammaloop-nextest-binaries-core-gammalooprs (79.4 MiB) in 4.8s
  213. 22.32 s Progress: 0 of 1 built, 65 of 68 downloaded from cache (1 downloading)
  214. 29.21 s Downloaded cached gammaloop-nextest-binaries-core-gammaloop-api (68.4 MiB) in 11.7s
  215. 29.33 s Progress: 0 of 1 built, 66 of 68 downloaded from cache
  216. 29.33 s Downloading cached gammaloop-nextest-binaries-core from https://cache.nix-ci.com
  217. 29.33 s Downloaded cached gammaloop-nextest-binaries-core (1640 B) in 0ms
  218. 29.33 s Progress: 0 of 1 built, 67 of 68 downloaded from cache
  219. 29.33 s Downloading cached nix-ci-check-gammaloop-nextest-core from https://cache.nix-ci.com
  220. 29.33 s Downloaded cached nix-ci-check-gammaloop-nextest-core (1016 B) in 0ms
  221. 29.33 s Progress: 0 of 1 built, 68 of 68 downloaded from cache
  222. 34.29 s evaluating derivation 'g copying '/nix/store/lvky evaluating derivation 'g copying '/nix/store/lvky evaluating derivation 'g copying '/nix/store/lvky evaluating derivation 'g copying '/nix/store/lvky evaluating derivation 'g copying '/nix/store/lvky evaluating derivation 'g querying gammaloop-nexte [0.6 KiB DL] querying ca [2.2 KiB DL] querying fl [3.2 KiB DL] querying nt [4.8 KiB DL] querying gf [6.2 KiB DL] querying gf [1/0/13 built, 7/0/13 co [2/0/12 built, 6/3/13 cocrane-dummy-cargo-target.rs (post)> Uploading to the NixCI cache: /nix/store/hd50hqi25fymr09a2w4xdiy5jmb2cfl5-crane-dummy-cargo-target.rs
  223. 34.34 s crane-dummy-cargo-target.rs (post)> warning: 'warn-short-path-literals' is deprecated, use 'lint-short-path-literals = ignore' instead
  224. 34.47 s crane-dummy-cargo-target.rs (post)> copying 0 paths...
  225. 34.52 s crane-dummy-cargo-target.rs (post)> warning: 'warn-short-path-literals' is deprecated, use 'lint-short-path-literals = ignore' instead
  226. 34.66 s crane-dummy-cargo-target.rs (post)> copying 0 paths...
  227. 34.69 s [1/1/12 built, 3/6/13 cocrane-dummy-proc-macro-cargo-target.rs (post)> Uploading to the NixCI cache: /nix/store/z0b4s6pznqwlbyw5v4bbq7k1kp721g19-crane-dummy-proc-macro-cargo-target.rs
  228. 34.73 s crane-dummy-proc-macro-cargo-target.rs (post)> warning: 'warn-short-path-literals' is deprecated, use 'lint-short-path-literals = ignore' instead
  229. 34.86 s crane-dummy-proc-macro-cargo-target.rs (post)> copying 0 paths...
  230. 34.91 s crane-dummy-proc-macro-cargo-target.rs (post)> warning: 'warn-short-path-literals' is deprecated, use 'lint-short-path-literals = ignore' instead
  231. 35.06 s crane-dummy-proc-macro-cargo-target.rs (post)> copying 0 paths...
  232. 40.44 s [2/12 built, 4/6/13 copi [2/11 built, 4/7/13 copi [2/11 built, 4/8/13 copi [2/10 built, 3/9/13 copi
  233. 48.11 s [2/9 built, 2/10/13 copi
  234. 59.54 s [2/8 built, 1/11/13 copi
  235. 71.78 s [2/4 built, 13 copied (7 [1/2/3 built, 13 copied gammaloop-nextest-core> Extracting 3 binaries (including 1 non-test binary), 1 build script output directory, and 2 linked paths to /build/nextest-archive-rwBuRm
  236. 72.37 s gammaloop-nextest-core> Extracted 18 files to /build/nextest-archive-rwBuRm in 0.59s
  237. 72.39 s gammaloop-nextest-core> ------------
  238. 72.39 s gammaloop-nextest-core> Nextest run ID 76bc058a-26a0-47a5-b110-6539d5013011 with nextest profile: ci_gammaloop
  239. 72.39 s gammaloop-nextest-core> Starting 339 tests across 2 binaries
  240. 72.76 s gammaloop-nextest-core> FAIL [ 0.031s] (243/339) gammaloop-api repl::tests::completion_shows_type_hint_for_non_boolean_settings_leaf
  241. 72.76 s gammaloop-nextest-core> stdout ---
  242. 72.76 s gammaloop-nextest-core>
  243. 72.76 s gammaloop-nextest-core> running 1 test
  244. 72.76 s gammaloop-nextest-core> test repl::tests::completion_shows_type_hint_for_non_boolean_settings_leaf ... FAILED
  245. 72.76 s gammaloop-nextest-core>
  246. 72.76 s gammaloop-nextest-core> failures:
  247. 72.76 s gammaloop-nextest-core>
  248. 72.76 s gammaloop-nextest-core> failures:
  249. 72.76 s gammaloop-nextest-core> repl::tests::completion_shows_type_hint_for_non_boolean_settings_leaf
  250. 72.76 s gammaloop-nextest-core>
  251. 72.76 s gammaloop-nextest-core> test result: FAILED. 0 passed; 1 failed; 0 ignored; 0 measured; 338 filtered out; finished in 0.01s
  252. 72.76 s gammaloop-nextest-core>
  253. 72.76 s gammaloop-nextest-core> stderr ---
  254. 72.76 s gammaloop-nextest-core>
  255. 72.76 s gammaloop-nextest-core> thread 'repl::tests::completion_shows_type_hint_for_non_boolean_settings_leaf' (775) panicked at crates/gammaloop-api/src/repl.rs:5778:9:
  256. 72.76 s gammaloop-nextest-core> [Suggestion { value: "", description: Some("Number of samples in the first Monte Carlo iteration."), style: None, extra: None, span: Span { start: 42, end: 42 }, append_whitespace: false }]
  257. 72.76 s gammaloop-nextest-core> stack backtrace:
  258. 72.76 s gammaloop-nextest-core> 0: __rustc::rust_begin_unwind
  259. 72.76 s gammaloop-nextest-core> 1: core::panicking::panic_fmt
  260. 72.76 s gammaloop-nextest-core> 2: gammaloop_api::repl::tests::completion_shows_type_hint_for_non_boolean_settings_leaf
  261. 72.76 s gammaloop-nextest-core> 3: <gammaloop_api::repl::tests::completion_shows_type_hint_for_non_boolean_settings_leaf::{closure#0} as core::ops::function::FnOnce<()>>::call_once
  262. 72.76 s gammaloop-nextest-core> note: Some details are omitted, run with `RUST_BACKTRACE=full` for a verbose backtrace.
  263. 72.76 s gammaloop-nextest-core>
  264. 72.90 s gammaloop-nextest-core> FAIL [ 0.101s] (290/339) gammaloop-api templates::tests::extract_templates_uses_canonical_package_layout
  265. 72.90 s gammaloop-nextest-core> stdout ---
  266. 72.90 s gammaloop-nextest-core>
  267. 72.90 s gammaloop-nextest-core> running 1 test
  268. 72.90 s gammaloop-nextest-core> test templates::tests::extract_templates_uses_canonical_package_layout ... FAILED
  269. 72.90 s gammaloop-nextest-core>
  270. 72.90 s gammaloop-nextest-core> failures:
  271. 72.90 s gammaloop-nextest-core>
  272. 72.90 s gammaloop-nextest-core> failures:
  273. 72.90 s gammaloop-nextest-core> templates::tests::extract_templates_uses_canonical_package_layout
  274. 72.90 s gammaloop-nextest-core>
  275. 72.90 s gammaloop-nextest-core> test result: FAILED. 0 passed; 1 failed; 0 ignored; 0 measured; 338 filtered out; finished in 0.09s
  276. 72.90 s gammaloop-nextest-core>
  277. 72.90 s gammaloop-nextest-core> stderr ---
  278. 72.90 s gammaloop-nextest-core>
  279. 72.90 s gammaloop-nextest-core> thread 'templates::tests::extract_templates_uses_canonical_package_layout' (876) panicked at crates/gammaloop-api/src/templates.rs:99:9:
  280. 72.90 s gammaloop-nextest-core> assertion failed: figure.contains("amplitude-mode")
  281. 72.90 s gammaloop-nextest-core> stack backtrace:
  282. 72.90 s gammaloop-nextest-core> 0: __rustc::rust_begin_unwind
  283. 72.90 s gammaloop-nextest-core> 1: core::panicking::panic_fmt
  284. 72.90 s gammaloop-nextest-core> 2: core::panicking::panic
  285. 72.90 s gammaloop-nextest-core> 3: gammaloop_api::templates::tests::extract_templates_uses_canonical_package_layout
  286. 72.90 s gammaloop-nextest-core> 4: <gammaloop_api::templates::tests::extract_templates_uses_canonical_package_layout::{closure#0} as core::ops::function::FnOnce<()>>::call_once
  287. 72.90 s gammaloop-nextest-core> note: Some details are omitted, run with `RUST_BACKTRACE=full` for a verbose backtrace.
  288. 72.90 s gammaloop-nextest-core>
  289. 73.03 s gammaloop-nextest-core> ------------
  290. 73.03 s gammaloop-nextest-core> Summary [ 0.644s] 339 tests run: 337 passed, 2 failed, 0 skipped
  291. 73.03 s gammaloop-nextest-core> FAIL [ 0.031s] (243/339) gammaloop-api repl::tests::completion_shows_type_hint_for_non_boolean_settings_leaf
  292. 73.03 s gammaloop-nextest-core> stdout ---
  293. 73.03 s gammaloop-nextest-core>
  294. 73.03 s gammaloop-nextest-core> running 1 test
  295. 73.03 s gammaloop-nextest-core> test repl::tests::completion_shows_type_hint_for_non_boolean_settings_leaf ... FAILED
  296. 73.03 s gammaloop-nextest-core>
  297. 73.03 s gammaloop-nextest-core> failures:
  298. 73.03 s gammaloop-nextest-core>
  299. 73.03 s gammaloop-nextest-core> failures:
  300. 73.03 s gammaloop-nextest-core> repl::tests::completion_shows_type_hint_for_non_boolean_settings_leaf
  301. 73.03 s gammaloop-nextest-core>
  302. 73.03 s gammaloop-nextest-core> test result: FAILED. 0 passed; 1 failed; 0 ignored; 0 measured; 338 filtered out; finished in 0.01s
  303. 73.03 s gammaloop-nextest-core>
  304. 73.03 s gammaloop-nextest-core> stderr ---
  305. 73.03 s gammaloop-nextest-core>
  306. 73.03 s gammaloop-nextest-core> thread 'repl::tests::completion_shows_type_hint_for_non_boolean_settings_leaf' (775) panicked at crates/gammaloop-api/src/repl.rs:5778:9:
  307. 73.03 s gammaloop-nextest-core> [Suggestion { value: "", description: Some("Number of samples in the first Monte Carlo iteration."), style: None, extra: None, span: Span { start: 42, end: 42 }, append_whitespace: false }]
  308. 73.03 s gammaloop-nextest-core> stack backtrace:
  309. 73.03 s gammaloop-nextest-core> 0: __rustc::rust_begin_unwind
  310. 73.03 s gammaloop-nextest-core> 1: core::panicking::panic_fmt
  311. 73.03 s gammaloop-nextest-core> 2: gammaloop_api::repl::tests::completion_shows_type_hint_for_non_boolean_settings_leaf
  312. 73.03 s gammaloop-nextest-core> 3: <gammaloop_api::repl::tests::completion_shows_type_hint_for_non_boolean_settings_leaf::{closure#0} as core::ops::function::FnOnce<()>>::call_once
  313. 73.03 s gammaloop-nextest-core> note: Some details are omitted, run with `RUST_BACKTRACE=full` for a verbose backtrace.
  314. 73.03 s gammaloop-nextest-core>
  315. 73.03 s gammaloop-nextest-core> FAIL [ 0.101s] (290/339) gammaloop-api templates::tests::extract_templates_uses_canonical_package_layout
  316. 73.03 s gammaloop-nextest-core> stdout ---
  317. 73.03 s gammaloop-nextest-core>
  318. 73.03 s gammaloop-nextest-core> running 1 test
  319. 73.03 s gammaloop-nextest-core> test templates::tests::extract_templates_uses_canonical_package_layout ... FAILED
  320. 73.03 s gammaloop-nextest-core>
  321. 73.03 s gammaloop-nextest-core> failures:
  322. 73.03 s gammaloop-nextest-core>
  323. 73.03 s gammaloop-nextest-core> failures:
  324. 73.03 s gammaloop-nextest-core> templates::tests::extract_templates_uses_canonical_package_layout
  325. 73.03 s gammaloop-nextest-core>
  326. 73.03 s gammaloop-nextest-core> test result: FAILED. 0 passed; 1 failed; 0 ignored; 0 measured; 338 filtered out; finished in 0.09s
  327. 73.03 s gammaloop-nextest-core>
  328. 73.03 s gammaloop-nextest-core> stderr ---
  329. 73.03 s gammaloop-nextest-core>
  330. 73.03 s gammaloop-nextest-core> thread 'templates::tests::extract_templates_uses_canonical_package_layout' (876) panicked at crates/gammaloop-api/src/templates.rs:99:9:
  331. 73.03 s gammaloop-nextest-core> assertion failed: figure.contains("amplitude-mode")
  332. 73.03 s gammaloop-nextest-core> stack backtrace:
  333. 73.03 s gammaloop-nextest-core> 0: __rustc::rust_begin_unwind
  334. 73.03 s gammaloop-nextest-core> 1: core::panicking::panic_fmt
  335. 73.03 s gammaloop-nextest-core> 2: core::panicking::panic
  336. 73.03 s gammaloop-nextest-core> 3: gammaloop_api::templates::tests::extract_templates_uses_canonical_package_layout
  337. 73.03 s gammaloop-nextest-core> 4: <gammaloop_api::templates::tests::extract_templates_uses_canonical_package_layout::{closure#0} as core::ops::function::FnOnce<()>>::call_once
  338. 73.03 s gammaloop-nextest-core> note: Some details are omitted, run with `RUST_BACKTRACE=full` for a verbose backtrace.
  339. 73.03 s gammaloop-nextest-core>
  340. 73.09 s gammaloop-nextest-core> error: test run failed
  341. 73.12 s gammaloop-nextest-core>
  342. 73.12 s gammaloop-nextest-core> ========== nextest test summary ==========
  343. 73.12 s gammaloop-nextest-core> report: target/nextest/ci_gammaloop/junit.xml
  344. 73.12 s gammaloop-nextest-core> tests: 339, failures: 2, errors: 0
  345. 73.12 s gammaloop-nextest-core>
  346. 73.12 s gammaloop-nextest-core> 1. gammaloop-api::repl::tests::completion_shows_type_hint_for_non_boolean_settings_leaf
  347. 73.12 s gammaloop-nextest-core> failure: test failure with exit code 101
  348. 73.12 s gammaloop-nextest-core> thread 'repl::tests::completion_shows_type_hint_for_non_boolean_settings_leaf' (775) panicked at crates/gammaloop-api/src/repl.rs:5778:9:
  349. 73.12 s gammaloop-nextest-core> [Suggestion { value: "", description: Some("Number of samples in the first Monte Carlo iteration."), style: None, extra: None, span: Span { start: 42, end: 42 }, append_whitespace: false }]
  350. 73.12 s gammaloop-nextest-core> stack backtrace:
  351. 73.12 s gammaloop-nextest-core> 0: __rustc::rust_begin_unwind
  352. 73.12 s gammaloop-nextest-core> 1: core::panicking::panic_fmt
  353. 73.12 s gammaloop-nextest-core> 2: gammaloop_api::repl::tests::completion_shows_type_hint_for_non_boolean_settings_leaf
  354. 73.12 s gammaloop-nextest-core> 3: <gammaloop_api::repl::tests::completion_shows_type_hint_for_non_boolean_settings_leaf::{closure#0} as core::ops::function::FnOnce<()>>::call_once
  355. 73.12 s gammaloop-nextest-core> note: Some details are omitted, run with `RUST_BACKTRACE=full` for a verbose backtrace.
  356. 73.12 s gammaloop-nextest-core> system-out
  357. 73.12 s gammaloop-nextest-core> running 1 test
  358. 73.12 s gammaloop-nextest-core> test repl::tests::completion_shows_type_hint_for_non_boolean_settings_leaf ... FAILED
  359. 73.12 s gammaloop-nextest-core>
  360. 73.12 s gammaloop-nextest-core> failures:
  361. 73.12 s gammaloop-nextest-core>
  362. 73.12 s gammaloop-nextest-core> failures:
  363. 73.12 s gammaloop-nextest-core> repl::tests::completion_shows_type_hint_for_non_boolean_settings_leaf
  364. 73.12 s gammaloop-nextest-core>
  365. 73.12 s gammaloop-nextest-core> test result: FAILED. 0 passed; 1 failed; 0 ignored; 0 measured; 338 filtered out; finished in 0.01s
  366. 73.12 s gammaloop-nextest-core> system-err
  367. 73.12 s gammaloop-nextest-core> thread 'repl::tests::completion_shows_type_hint_for_non_boolean_settings_leaf' (775) panicked at crates/gammaloop-api/src/repl.rs:5778:9:
  368. 73.12 s gammaloop-nextest-core> [Suggestion { value: "", description: Some("Number of samples in the first Monte Carlo iteration."), style: None, extra: None, span: Span { start: 42, end: 42 }, append_whitespace: false }]
  369. 73.12 s gammaloop-nextest-core> stack backtrace:
  370. 73.12 s gammaloop-nextest-core> 0: __rustc::rust_begin_unwind
  371. 73.12 s gammaloop-nextest-core> 1: core::panicking::panic_fmt
  372. 73.12 s gammaloop-nextest-core> 2: gammaloop_api::repl::tests::completion_shows_type_hint_for_non_boolean_settings_leaf
  373. 73.12 s gammaloop-nextest-core> 3: <gammaloop_api::repl::tests::completion_shows_type_hint_for_non_boolean_settings_leaf::{closure#0} as core::ops::function::FnOnce<()>>::call_once
  374. 73.12 s gammaloop-nextest-core> note: Some details are omitted, run with `RUST_BACKTRACE=full` for a verbose backtrace.
  375. 73.12 s gammaloop-nextest-core>
  376. 73.12 s gammaloop-nextest-core> 2. gammaloop-api::templates::tests::extract_templates_uses_canonical_package_layout
  377. 73.12 s gammaloop-nextest-core> failure: test failure with exit code 101
  378. 73.12 s gammaloop-nextest-core> thread 'templates::tests::extract_templates_uses_canonical_package_layout' (876) panicked at crates/gammaloop-api/src/templates.rs:99:9:
  379. 73.12 s gammaloop-nextest-core> assertion failed: figure.contains("amplitude-mode")
  380. 73.12 s gammaloop-nextest-core> stack backtrace:
  381. 73.12 s gammaloop-nextest-core> 0: __rustc::rust_begin_unwind
  382. 73.12 s gammaloop-nextest-core> 1: core::panicking::panic_fmt
  383. 73.12 s gammaloop-nextest-core> 2: core::panicking::panic
  384. 73.12 s gammaloop-nextest-core> 3: gammaloop_api::templates::tests::extract_templates_uses_canonical_package_layout
  385. 73.12 s gammaloop-nextest-core> 4: <gammaloop_api::templates::tests::extract_templates_uses_canonical_package_layout::{closure#0} as core::ops::function::FnOnce<()>>::call_once
  386. 73.12 s gammaloop-nextest-core> note: Some details are omitted, run with `RUST_BACKTRACE=full` for a verbose backtrace.
  387. 73.12 s gammaloop-nextest-core> system-out
  388. 73.12 s gammaloop-nextest-core> running 1 test
  389. 73.12 s gammaloop-nextest-core> test templates::tests::extract_templates_uses_canonical_package_layout ... FAILED
  390. 73.12 s gammaloop-nextest-core>
  391. 73.12 s gammaloop-nextest-core> failures:
  392. 73.12 s gammaloop-nextest-core>
  393. 73.12 s gammaloop-nextest-core> failures:
  394. 73.12 s gammaloop-nextest-core> templates::tests::extract_templates_uses_canonical_package_layout
  395. 73.12 s gammaloop-nextest-core>
  396. 73.12 s gammaloop-nextest-core> test result: FAILED. 0 passed; 1 failed; 0 ignored; 0 measured; 338 filtered out; finished in 0.09s
  397. 73.12 s gammaloop-nextest-core> system-err
  398. 73.12 s gammaloop-nextest-core> thread 'templates::tests::extract_templates_uses_canonical_package_layout' (876) panicked at crates/gammaloop-api/src/templates.rs:99:9:
  399. 73.12 s gammaloop-nextest-core> assertion failed: figure.contains("amplitude-mode")
  400. 73.12 s gammaloop-nextest-core> stack backtrace:
  401. 73.12 s gammaloop-nextest-core> 0: __rustc::rust_begin_unwind
  402. 73.12 s gammaloop-nextest-core> 1: core::panicking::panic_fmt
  403. 73.12 s gammaloop-nextest-core> 2: core::panicking::panic
  404. 73.12 s gammaloop-nextest-core> 3: gammaloop_api::templates::tests::extract_templates_uses_canonical_package_layout
  405. 73.12 s gammaloop-nextest-core> 4: <gammaloop_api::templates::tests::extract_templates_uses_canonical_package_layout::{closure#0} as core::ops::function::FnOnce<()>>::call_once
  406. 73.12 s gammaloop-nextest-core> note: Some details are omitted, run with `RUST_BACKTRACE=full` for a verbose backtrace.
  407. 73.12 s gammaloop-nextest-core> =========================================
  408. 73.14 s gammaloop-nextest-core> Extracting 1 binary and 1 linked path to /build/nextest-archive-RSHIKK
  409. 73.22 s gammaloop-nextest-core> Extracted 7 files to /build/nextest-archive-RSHIKK in 0.08s
  410. 73.23 s gammaloop-nextest-core> ------------
  411. 73.23 s gammaloop-nextest-core> Nextest run ID 6dd8f6a6-bdef-4ca9-ab1d-6d73e4dc4d32 with nextest profile: ci_gammaloop
  412. 73.23 s gammaloop-nextest-core> Starting 19 tests across 1 binary
  413. 73.25 s gammaloop-nextest-core> ------------
  414. 73.25 s gammaloop-nextest-core> Summary [ 0.017s] 19 tests run: 19 passed, 0 skipped
  415. 73.29 s gammaloop-nextest-core>
  416. 73.29 s gammaloop-nextest-core> ========== nextest test summary ==========
  417. 73.29 s gammaloop-nextest-core> report: target/nextest/ci_gammaloop/junit.xml
  418. 73.29 s gammaloop-nextest-core> tests: 19, failures: 0, errors: 0
  419. 73.29 s gammaloop-nextest-core> No failing testcases found.
  420. 73.29 s gammaloop-nextest-core> =========================================
  421. 73.30 s gammaloop-nextest-core> Extracting 1 binary to /build/nextest-archive-pho77r
  422. 73.35 s gammaloop-nextest-core> Extracted 4 files to /build/nextest-archive-pho77r in 0.05s
  423. 73.36 s gammaloop-nextest-core> ------------
  424. 73.36 s gammaloop-nextest-core> Nextest run ID 7f1b56d5-22c0-4cbd-a23a-8b0f6becbadb with nextest profile: ci_gammaloop
  425. 73.36 s gammaloop-nextest-core> Starting 0 tests across 1 binary
  426. 73.36 s gammaloop-nextest-core> ------------
  427. 73.36 s gammaloop-nextest-core> Summary [ 0.000s] 0 tests run: 0 passed, 0 skipped
  428. 73.40 s gammaloop-nextest-core>
  429. 73.40 s gammaloop-nextest-core> ========== nextest test summary ==========
  430. 73.40 s gammaloop-nextest-core> report: target/nextest/ci_gammaloop/junit.xml
  431. 73.40 s gammaloop-nextest-core> tests: 0, failures: 0, errors: 0
  432. 73.40 s gammaloop-nextest-core> No failing testcases found.
  433. 73.40 s gammaloop-nextest-core> =========================================
  434. 73.41 s gammaloop-nextest-core> Extracting 4 binaries, 1 build script output directory, and 2 linked paths to /build/nextest-archive-xB9eVc
  435. 73.98 s gammaloop-nextest-core> Extracted 18 files to /build/nextest-archive-xB9eVc in 0.57s
  436. 73.99 s gammaloop-nextest-core> ------------
  437. 73.99 s gammaloop-nextest-core> Nextest run ID d307d8dd-1544-402f-a800-77372c7dd921 with nextest profile: ci_gammaloop
  438. 73.99 s gammaloop-nextest-core> Starting 456 tests across 4 binaries (61 tests skipped, including 60 tests via profile.ci_gammaloop.default-filter)
  439. 74.37 s gammaloop-nextest-core> FAIL [ 0.229s] (156/456) gammalooprs graph::parse::tests::parse_lmbsetting_crossection
  440. 74.37 s gammaloop-nextest-core> stdout ---
  441. 74.37 s gammaloop-nextest-core>
  442. 74.37 s gammaloop-nextest-core> running 1 test
  443. 74.37 s gammaloop-nextest-core> ━━━━━━━━━━━━━━━━━━━━━━━━━━━━━━━ Snapshot Summary ━━━━━━━━━━━━━━━━━━━━━━━━━━━━━━━
  444. 74.37 s gammaloop-nextest-core> Snapshot: parse_lmbsetting_crossection
  445. 74.37 s gammaloop-nextest-core> Source: crates/gammalooprs/src/graph/parse/tests.rs:252
  446. 74.37 s gammaloop-nextest-core> ────────────────────────────────────────────────────────────────────────────────
  447. 74.37 s gammaloop-nextest-core> Expression: g.debug_dot()
  448. 74.37 s gammaloop-nextest-core> ────────────────────────────────────────────────────────────────────────────────
  449. 74.37 s gammaloop-nextest-core> -old snapshot
  450. 74.37 s gammaloop-nextest-core> +new results
  451. 74.37 s gammaloop-nextest-core> ────────────┬───────────────────────────────────────────────────────────────────
  452. 74.37 s gammaloop-nextest-core> 1 │-digraph G{
  453. 74.37 s gammaloop-nextest-core> 1 │+digraph G {
  454. 74.37 s gammaloop-nextest-core> 2 2 │ num = "1/2";
  455. 74.37 s gammaloop-nextest-core> 3 3 │ overall_factor = "2*x";
  456. 74.37 s gammaloop-nextest-core> 4 4 │ overall_factor_evaluated = "2*x";
  457. 74.37 s gammaloop-nextest-core> 5 5 │ projector = "spenso::t";
  458. 74.37 s gammaloop-nextest-core> ────────────┴───────────────────────────────────────────────────────────────────
  459. 74.37 s gammaloop-nextest-core> To update snapshots run `cargo insta review`
  460. 74.37 s gammaloop-nextest-core> Stopped on the first failure. Run `cargo insta test` to run all snapshots.
  461. 74.37 s gammaloop-nextest-core> test graph::parse::tests::parse_lmbsetting_crossection ... FAILED
  462. 74.37 s gammaloop-nextest-core>
  463. 74.37 s gammaloop-nextest-core> failures:
  464. 74.37 s gammaloop-nextest-core>
  465. 74.37 s gammaloop-nextest-core> failures:
  466. 74.37 s gammaloop-nextest-core> graph::parse::tests::parse_lmbsetting_crossection
  467. 74.37 s gammaloop-nextest-core>
  468. 74.37 s gammaloop-nextest-core> test result: FAILED. 0 passed; 1 failed; 0 ignored; 0 measured; 508 filtered out; finished in 0.21s
  469. 74.37 s gammaloop-nextest-core>
  470. 74.37 s gammaloop-nextest-core> stderr ---
  471. 74.37 s gammaloop-nextest-core> [21:19:02.939] @gammalooprs::graph::attribute_warnings WARNING : Unknown node attribute 'color_num' on graph 'G', node 'A'; did you mean 'num'?
  472. 74.37 s gammaloop-nextest-core> at crates/gammalooprs/src/graph/attribute_warnings.rs:198
  473. 74.37 s gammaloop-nextest-core> The application panicked (crashed).
  474. 74.37 s gammaloop-nextest-core> Message: snapshot assertion for 'parse_lmbsetting_crossection' failed in line 252
  475. 74.37 s gammaloop-nextest-core> Location: /nix/store/xdy1vvhll2bijdplvl9fcc2b9plkxhaa-vendor-cargo-deps/c19b7c6f923b580ac259164a89f2577984ad5ab09ee9d583b888f934adbbe8d0/insta-1.47.2/src/runtime.rs:719
  476. 74.37 s gammaloop-nextest-core>
  477. 74.37 s gammaloop-nextest-core> ━━━━━━━━━━━━━━━━━━━━━━━━━━━━━━━━━━ BACKTRACE ━━━━━━━━━━━━━━━━━━━━━━━━━━━━━━━━━━━
  478. 74.37 s gammaloop-nextest-core> 1: <color_eyre[b0c9e66060e883b2]::config::PanicHook>::panic_report<unknown>
  479. 74.37 s gammaloop-nextest-core> at <unknown source file>:<unknown line>
  480. 74.37 s gammaloop-nextest-core> 2: <color_eyre[b0c9e66060e883b2]::config::PanicHook>::into_panic_hook::{closure#0}<unknown>
  481. 74.37 s gammaloop-nextest-core> at <unknown source file>:<unknown line>
  482. 74.37 s gammaloop-nextest-core> 3: std[bcb96dfbba0ab899]::panicking::panic_with_hook<unknown>
  483. 74.37 s gammaloop-nextest-core> at <unknown source file>:<unknown line>
  484. 74.37 s gammaloop-nextest-core> 4: std[bcb96dfbba0ab899]::panicking::panic_handler::{closure#0}<unknown>
  485. 74.37 s gammaloop-nextest-core> at <unknown source file>:<unknown line>
  486. 74.37 s gammaloop-nextest-core> 5: std[bcb96dfbba0ab899]::sys::backtrace::__rust_end_short_backtrace::<std[bcb96dfbba0ab899]::panicking::panic_handler::{closure#0}, !><unknown>
  487. 74.37 s gammaloop-nextest-core> at <unknown source file>:<unknown line>
  488. 74.37 s gammaloop-nextest-core> 6: __rustc[6c289b9f9c454d21]::rust_begin_unwind<unknown>
  489. 74.37 s gammaloop-nextest-core> at <unknown source file>:<unknown line>
  490. 74.37 s gammaloop-nextest-core> 7: core[940e698046960fd5]::panicking::panic_fmt<unknown>
  491. 74.37 s gammaloop-nextest-core> at <unknown source file>:<unknown line>
  492. 74.37 s gammaloop-nextest-core> 8: insta[307a548ac79ef4d9]::runtime::assert_snapshot<unknown>
  493. 74.37 s gammaloop-nextest-core> at <unknown source file>:<unknown line>
  494. 74.37 s gammaloop-nextest-core> 9: gammalooprs[5490727360442cce]::graph::parse::tests::parse_lmbsetting_crossection<unknown>
  495. 74.37 s gammaloop-nextest-core> at <unknown source file>:<unknown line>
  496. 74.37 s gammaloop-nextest-core> 10: <gammalooprs[5490727360442cce]::graph::parse::tests::parse_lmbsetting_crossection::{closure#0} as core[940e698046960fd5]::ops::function::FnOnce<()>>::call_once<unknown>
  497. 74.37 s gammaloop-nextest-core> at <unknown source file>:<unknown line>
  498. 74.37 s gammaloop-nextest-core> 11: test[75d6903177b1d7e9]::__rust_begin_short_backtrace::<core[940e698046960fd5]::result::Result<(), alloc[2ea6bcb46fca0c42]::string::String>, fn() -> core[940e698046960fd5]::result::Result<(), alloc[2ea6bcb46fca0c42]::string::String>><unknown>
  499. 74.37 s gammaloop-nextest-core> at <unknown source file>:<unknown line>
  500. 74.37 s gammaloop-nextest-core> 12: test[75d6903177b1d7e9]::run_test::{closure#0}<unknown>
  501. 74.37 s gammaloop-nextest-core> at <unknown source file>:<unknown line>
  502. 74.37 s gammaloop-nextest-core> 13: std[bcb96dfbba0ab899]::sys::backtrace::__rust_begin_short_backtrace::<test[75d6903177b1d7e9]::run_test::{closure#1}, ()><unknown>
  503. 74.37 s gammaloop-nextest-core> at <unknown source file>:<unknown line>
  504. 74.37 s gammaloop-nextest-core> 14: <std[bcb96dfbba0ab899]::thread::lifecycle::spawn_unchecked<test[75d6903177b1d7e9]::run_test::{closure#1}, ()>::{closure#1} as core[940e698046960fd5]::ops::function::FnOnce<()>>::call_once::{shim:vtable#0}<unknown>
  505. 74.37 s gammaloop-nextest-core> at <unknown source file>:<unknown line>
  506. 74.37 s gammaloop-nextest-core> 15: <std[bcb96dfbba0ab899]::sys::thread::unix::Thread>::new::thread_start<unknown>
  507. 74.37 s gammaloop-nextest-core> at <unknown source file>:<unknown line>
  508. 74.37 s gammaloop-nextest-core> 16: start_thread<unknown>
  509. 74.37 s gammaloop-nextest-core> at <unknown source file>:<unknown line>
  510. 74.37 s gammaloop-nextest-core> 17: __clone3<unknown>
  511. 74.37 s gammaloop-nextest-core> at <unknown source file>:<unknown line>
  512. 74.37 s gammaloop-nextest-core>
  513. 74.37 s gammaloop-nextest-core> Run with COLORBT_SHOW_HIDDEN=1 environment variable to disable frame filtering.
  514. 74.37 s gammaloop-nextest-core> Run with RUST_BACKTRACE=full to include source snippets.
  515. 74.37 s gammaloop-nextest-core>
  516. 74.85 s gammaloop-nextest-core> FAIL [ 0.083s] (407/456) gammalooprs uv::export::tests::computed_node_full_numerator_is_a_spenso_aware_typst_fragment
  517. 74.85 s gammaloop-nextest-core> stdout ---
  518. 74.85 s gammaloop-nextest-core>
  519. 74.85 s gammaloop-nextest-core> running 1 test
  520. 74.85 s gammaloop-nextest-core> test uv::export::tests::computed_node_full_numerator_is_a_spenso_aware_typst_fragment ... FAILED
  521. 74.85 s gammaloop-nextest-core>
  522. 74.85 s gammaloop-nextest-core> failures:
  523. 74.85 s gammaloop-nextest-core>
  524. 74.85 s gammaloop-nextest-core> failures:
  525. 74.85 s gammaloop-nextest-core> uv::export::tests::computed_node_full_numerator_is_a_spenso_aware_typst_fragment
  526. 74.85 s gammaloop-nextest-core>
  527. 74.85 s gammaloop-nextest-core> test result: FAILED. 0 passed; 1 failed; 0 ignored; 0 measured; 508 filtered out; finished in 0.07s
  528. 74.85 s gammaloop-nextest-core>
  529. 74.85 s gammaloop-nextest-core> stderr ---
  530. 74.85 s gammaloop-nextest-core> The application panicked (crashed).
  531. 74.85 s gammaloop-nextest-core> Message: assertion failed: exported.dot.contains(r#"full_num = "op(\"Tr\")(1)";"#)
  532. 74.85 s gammaloop-nextest-core> Location: crates/gammalooprs/src/uv/export.rs:483
  533. 74.85 s gammaloop-nextest-core>
  534. 74.85 s gammaloop-nextest-core> ━━━━━━━━━━━━━━━━━━━━━━━━━━━━━━━━━━ BACKTRACE ━━━━━━━━━━━━━━━━━━━━━━━━━━━━━━━━━━━
  535. 74.85 s gammaloop-nextest-core> 1: <color_eyre[b0c9e66060e883b2]::config::PanicHook>::panic_report<unknown>
  536. 74.85 s gammaloop-nextest-core> at <unknown source file>:<unknown line>
  537. 74.85 s gammaloop-nextest-core> 2: <color_eyre[b0c9e66060e883b2]::config::PanicHook>::into_panic_hook::{closure#0}<unknown>
  538. 74.85 s gammaloop-nextest-core> at <unknown source file>:<unknown line>
  539. 74.85 s gammaloop-nextest-core> 3: std[bcb96dfbba0ab899]::panicking::panic_with_hook<unknown>
  540. 74.85 s gammaloop-nextest-core> at <unknown source file>:<unknown line>
  541. 74.85 s gammaloop-nextest-core> 4: std[bcb96dfbba0ab899]::panicking::panic_handler::{closure#0}<unknown>
  542. 74.85 s gammaloop-nextest-core> at <unknown source file>:<unknown line>
  543. 74.85 s gammaloop-nextest-core> 5: std[bcb96dfbba0ab899]::sys::backtrace::__rust_end_short_backtrace::<std[bcb96dfbba0ab899]::panicking::panic_handler::{closure#0}, !><unknown>
  544. 74.85 s gammaloop-nextest-core> at <unknown source file>:<unknown line>
  545. 74.85 s gammaloop-nextest-core> 6: __rustc[6c289b9f9c454d21]::rust_begin_unwind<unknown>
  546. 74.85 s gammaloop-nextest-core> at <unknown source file>:<unknown line>
  547. 74.85 s gammaloop-nextest-core> 7: core[940e698046960fd5]::panicking::panic_fmt<unknown>
  548. 74.85 s gammaloop-nextest-core> at <unknown source file>:<unknown line>
  549. 74.85 s gammaloop-nextest-core> 8: core[940e698046960fd5]::panicking::panic<unknown>
  550. 74.85 s gammaloop-nextest-core> at <unknown source file>:<unknown line>
  551. 74.85 s gammaloop-nextest-core> 9: gammalooprs[5490727360442cce]::uv::export::tests::computed_node_full_numerator_is_a_spenso_aware_typst_fragment<unknown>
  552. 74.85 s gammaloop-nextest-core> at <unknown source file>:<unknown line>
  553. 74.85 s gammaloop-nextest-core> 10: <gammalooprs[5490727360442cce]::uv::export::tests::computed_node_full_numerator_is_a_spenso_aware_typst_fragment::{closure#0} as core[940e698046960fd5]::ops::function::FnOnce<()>>::call_once<unknown>
  554. 74.85 s gammaloop-nextest-core> at <unknown source file>:<unknown line>
  555. 74.85 s gammaloop-nextest-core> 11: test[75d6903177b1d7e9]::__rust_begin_short_backtrace::<core[940e698046960fd5]::result::Result<(), alloc[2ea6bcb46fca0c42]::string::String>, fn() -> core[940e698046960fd5]::result::Result<(), alloc[2ea6bcb46fca0c42]::string::String>><unknown>
  556. 74.85 s gammaloop-nextest-core> at <unknown source file>:<unknown line>
  557. 74.85 s gammaloop-nextest-core> 12: test[75d6903177b1d7e9]::run_test::{closure#0}<unknown>
  558. 74.85 s gammaloop-nextest-core> at <unknown source file>:<unknown line>
  559. 74.85 s gammaloop-nextest-core> 13: std[bcb96dfbba0ab899]::sys::backtrace::__rust_begin_short_backtrace::<test[75d6903177b1d7e9]::run_test::{closure#1}, ()><unknown>
  560. 74.85 s gammaloop-nextest-core> at <unknown source file>:<unknown line>
  561. 74.85 s gammaloop-nextest-core> 14: <std[bcb96dfbba0ab899]::thread::lifecycle::spawn_unchecked<test[75d6903177b1d7e9]::run_test::{closure#1}, ()>::{closure#1} as core[940e698046960fd5]::ops::function::FnOnce<()>>::call_once::{shim:vtable#0}<unknown>
  562. 74.85 s gammaloop-nextest-core> at <unknown source file>:<unknown line>
  563. 74.85 s gammaloop-nextest-core> 15: <std[bcb96dfbba0ab899]::sys::thread::unix::Thread>::new::thread_start<unknown>
  564. 74.85 s gammaloop-nextest-core> at <unknown source file>:<unknown line>
  565. 74.85 s gammaloop-nextest-core> 16: start_thread<unknown>
  566. 74.85 s gammaloop-nextest-core> at <unknown source file>:<unknown line>
  567. 74.85 s gammaloop-nextest-core> 17: __clone3<unknown>
  568. 74.85 s gammaloop-nextest-core> at <unknown source file>:<unknown line>
  569. 74.85 s gammaloop-nextest-core>
  570. 74.85 s gammaloop-nextest-core> Run with COLORBT_SHOW_HIDDEN=1 environment variable to disable frame filtering.
  571. 74.85 s gammaloop-nextest-core> Run with RUST_BACKTRACE=full to include source snippets.
  572. 74.85 s gammaloop-nextest-core>
  573. 86.88 s gammaloop-nextest-core> ------------
  574. 86.93 s gammaloop-nextest-core> Summary [ 12.886s] 456 tests run: 454 passed, 2 failed, 61 skipped
  575. 86.93 s gammaloop-nextest-core> FAIL [ 0.229s] (156/456) gammalooprs graph::parse::tests::parse_lmbsetting_crossection
  576. 86.93 s gammaloop-nextest-core> stdout ---
  577. 86.93 s gammaloop-nextest-core>
  578. 86.93 s gammaloop-nextest-core> running 1 test
  579. 86.93 s gammaloop-nextest-core> ━━━━━━━━━━━━━━━━━━━━━━━━━━━━━━━ Snapshot Summary ━━━━━━━━━━━━━━━━━━━━━━━━━━━━━━━
  580. 86.93 s gammaloop-nextest-core> Snapshot: parse_lmbsetting_crossection
  581. 86.93 s gammaloop-nextest-core> Source: crates/gammalooprs/src/graph/parse/tests.rs:252
  582. 86.93 s gammaloop-nextest-core> ────────────────────────────────────────────────────────────────────────────────
  583. 86.93 s gammaloop-nextest-core> Expression: g.debug_dot()
  584. 86.93 s gammaloop-nextest-core> ────────────────────────────────────────────────────────────────────────────────
  585. 86.93 s gammaloop-nextest-core> -old snapshot
  586. 86.93 s gammaloop-nextest-core> +new results
  587. 86.93 s gammaloop-nextest-core> ────────────┬───────────────────────────────────────────────────────────────────
  588. 86.93 s gammaloop-nextest-core> 1 │-digraph G{
  589. 86.93 s gammaloop-nextest-core> 1 │+digraph G {
  590. 86.93 s gammaloop-nextest-core> 2 2 │ num = "1/2";
  591. 86.93 s gammaloop-nextest-core> 3 3 │ overall_factor = "2*x";
  592. 86.93 s gammaloop-nextest-core> 4 4 │ overall_factor_evaluated = "2*x";
  593. 86.93 s gammaloop-nextest-core> 5 5 │ projector = "spenso::t";
  594. 86.93 s gammaloop-nextest-core> ────────────┴───────────────────────────────────────────────────────────────────
  595. 86.93 s gammaloop-nextest-core> To update snapshots run `cargo insta review`
  596. 86.93 s gammaloop-nextest-core> Stopped on the first failure. Run `cargo insta test` to run all snapshots.
  597. 86.93 s gammaloop-nextest-core> test graph::parse::tests::parse_lmbsetting_crossection ... FAILED
  598. 86.93 s gammaloop-nextest-core>
  599. 86.93 s gammaloop-nextest-core> failures:
  600. 86.93 s gammaloop-nextest-core>
  601. 86.93 s gammaloop-nextest-core> failures:
  602. 86.93 s gammaloop-nextest-core> graph::parse::tests::parse_lmbsetting_crossection
  603. 86.93 s gammaloop-nextest-core>
  604. 86.93 s gammaloop-nextest-core> test result: FAILED. 0 passed; 1 failed; 0 ignored; 0 measured; 508 filtered out; finished in 0.21s
  605. 86.93 s gammaloop-nextest-core>
  606. 86.93 s gammaloop-nextest-core> stderr ---
  607. 86.93 s gammaloop-nextest-core> [21:19:02.939] @gammalooprs::graph::attribute_warnings WARNING : Unknown node attribute 'color_num' on graph 'G', node 'A'; did you mean 'num'?
  608. 86.93 s gammaloop-nextest-core> at crates/gammalooprs/src/graph/attribute_warnings.rs:198
  609. 86.93 s gammaloop-nextest-core> The application panicked (crashed).
  610. 86.93 s gammaloop-nextest-core> Message: snapshot assertion for 'parse_lmbsetting_crossection' failed in line 252
  611. 86.93 s gammaloop-nextest-core> Location: /nix/store/xdy1vvhll2bijdplvl9fcc2b9plkxhaa-vendor-cargo-deps/c19b7c6f923b580ac259164a89f2577984ad5ab09ee9d583b888f934adbbe8d0/insta-1.47.2/src/runtime.rs:719
  612. 86.93 s gammaloop-nextest-core>
  613. 86.93 s gammaloop-nextest-core> ━━━━━━━━━━━━━━━━━━━━━━━━━━━━━━━━━━ BACKTRACE ━━━━━━━━━━━━━━━━━━━━━━━━━━━━━━━━━━━
  614. 86.93 s gammaloop-nextest-core> 1: <color_eyre[b0c9e66060e883b2]::config::PanicHook>::panic_report<unknown>
  615. 86.93 s gammaloop-nextest-core> at <unknown source file>:<unknown line>
  616. 86.93 s gammaloop-nextest-core> 2: <color_eyre[b0c9e66060e883b2]::config::PanicHook>::into_panic_hook::{closure#0}<unknown>
  617. 86.93 s gammaloop-nextest-core> at <unknown source file>:<unknown line>
  618. 86.93 s gammaloop-nextest-core> 3: std[bcb96dfbba0ab899]::panicking::panic_with_hook<unknown>
  619. 86.93 s gammaloop-nextest-core> at <unknown source file>:<unknown line>
  620. 86.93 s gammaloop-nextest-core> 4: std[bcb96dfbba0ab899]::panicking::panic_handler::{closure#0}<unknown>
  621. 86.93 s gammaloop-nextest-core> at <unknown source file>:<unknown line>
  622. 86.93 s gammaloop-nextest-core> 5: std[bcb96dfbba0ab899]::sys::backtrace::__rust_end_short_backtrace::<std[bcb96dfbba0ab899]::panicking::panic_handler::{closure#0}, !><unknown>
  623. 86.93 s gammaloop-nextest-core> at <unknown source file>:<unknown line>
  624. 86.93 s gammaloop-nextest-core> 6: __rustc[6c289b9f9c454d21]::rust_begin_unwind<unknown>
  625. 86.93 s gammaloop-nextest-core> at <unknown source file>:<unknown line>
  626. 86.93 s gammaloop-nextest-core> 7: core[940e698046960fd5]::panicking::panic_fmt<unknown>
  627. 86.93 s gammaloop-nextest-core> at <unknown source file>:<unknown line>
  628. 86.93 s gammaloop-nextest-core> 8: insta[307a548ac79ef4d9]::runtime::assert_snapshot<unknown>
  629. 86.93 s gammaloop-nextest-core> at <unknown source file>:<unknown line>
  630. 86.93 s gammaloop-nextest-core> 9: gammalooprs[5490727360442cce]::graph::parse::tests::parse_lmbsetting_crossection<unknown>
  631. 86.93 s gammaloop-nextest-core> at <unknown source file>:<unknown line>
  632. 86.93 s gammaloop-nextest-core> 10: <gammalooprs[5490727360442cce]::graph::parse::tests::parse_lmbsetting_crossection::{closure#0} as core[940e698046960fd5]::ops::function::FnOnce<()>>::call_once<unknown>
  633. 86.93 s gammaloop-nextest-core> at <unknown source file>:<unknown line>
  634. 86.93 s gammaloop-nextest-core> 11: test[75d6903177b1d7e9]::__rust_begin_short_backtrace::<core[940e698046960fd5]::result::Result<(), alloc[2ea6bcb46fca0c42]::string::String>, fn() -> core[940e698046960fd5]::result::Result<(), alloc[2ea6bcb46fca0c42]::string::String>><unknown>
  635. 86.93 s gammaloop-nextest-core> at <unknown source file>:<unknown line>
  636. 86.93 s gammaloop-nextest-core> 12: test[75d6903177b1d7e9]::run_test::{closure#0}<unknown>
  637. 86.93 s gammaloop-nextest-core> at <unknown source file>:<unknown line>
  638. 86.93 s gammaloop-nextest-core> 13: std[bcb96dfbba0ab899]::sys::backtrace::__rust_begin_short_backtrace::<test[75d6903177b1d7e9]::run_test::{closure#1}, ()><unknown>
  639. 86.93 s gammaloop-nextest-core> at <unknown source file>:<unknown line>
  640. 86.93 s gammaloop-nextest-core> 14: <std[bcb96dfbba0ab899]::thread::lifecycle::spawn_unchecked<test[75d6903177b1d7e9]::run_test::{closure#1}, ()>::{closure#1} as core[940e698046960fd5]::ops::function::FnOnce<()>>::call_once::{shim:vtable#0}<unknown>
  641. 86.93 s gammaloop-nextest-core> at <unknown source file>:<unknown line>
  642. 86.93 s gammaloop-nextest-core> 15: <std[bcb96dfbba0ab899]::sys::thread::unix::Thread>::new::thread_start<unknown>
  643. 86.93 s gammaloop-nextest-core> at <unknown source file>:<unknown line>
  644. 86.93 s gammaloop-nextest-core> 16: start_thread<unknown>
  645. 86.93 s gammaloop-nextest-core> at <unknown source file>:<unknown line>
  646. 86.93 s gammaloop-nextest-core> 17: __clone3<unknown>
  647. 86.93 s gammaloop-nextest-core> at <unknown source file>:<unknown line>
  648. 86.93 s gammaloop-nextest-core>
  649. 86.93 s gammaloop-nextest-core> Run with COLORBT_SHOW_HIDDEN=1 environment variable to disable frame filtering.
  650. 86.93 s gammaloop-nextest-core> Run with RUST_BACKTRACE=full to include source snippets.
  651. 86.93 s gammaloop-nextest-core>
  652. 86.93 s gammaloop-nextest-core> FAIL [ 0.083s] (407/456) gammalooprs uv::export::tests::computed_node_full_numerator_is_a_spenso_aware_typst_fragment
  653. 86.93 s gammaloop-nextest-core> stdout ---
  654. 86.93 s gammaloop-nextest-core>
  655. 86.93 s gammaloop-nextest-core> running 1 test
  656. 86.93 s gammaloop-nextest-core> test uv::export::tests::computed_node_full_numerator_is_a_spenso_aware_typst_fragment ... FAILED
  657. 86.93 s gammaloop-nextest-core>
  658. 86.93 s gammaloop-nextest-core> failures:
  659. 86.93 s gammaloop-nextest-core>
  660. 86.93 s gammaloop-nextest-core> failures:
  661. 86.93 s gammaloop-nextest-core> uv::export::tests::computed_node_full_numerator_is_a_spenso_aware_typst_fragment
  662. 86.93 s gammaloop-nextest-core>
  663. 86.93 s gammaloop-nextest-core> test result: FAILED. 0 passed; 1 failed; 0 ignored; 0 measured; 508 filtered out; finished in 0.07s
  664. 86.93 s gammaloop-nextest-core>
  665. 86.93 s gammaloop-nextest-core> stderr ---
  666. 86.93 s gammaloop-nextest-core> The application panicked (crashed).
  667. 86.93 s gammaloop-nextest-core> Message: assertion failed: exported.dot.contains(r#"full_num = "op(\"Tr\")(1)";"#)
  668. 86.93 s gammaloop-nextest-core> Location: crates/gammalooprs/src/uv/export.rs:483
  669. 86.93 s gammaloop-nextest-core>
  670. 86.93 s gammaloop-nextest-core> ━━━━━━━━━━━━━━━━━━━━━━━━━━━━━━━━━━ BACKTRACE ━━━━━━━━━━━━━━━━━━━━━━━━━━━━━━━━━━━
  671. 86.93 s gammaloop-nextest-core> 1: <color_eyre[b0c9e66060e883b2]::config::PanicHook>::panic_report<unknown>
  672. 86.93 s gammaloop-nextest-core> at <unknown source file>:<unknown line>
  673. 86.93 s gammaloop-nextest-core> 2: <color_eyre[b0c9e66060e883b2]::config::PanicHook>::into_panic_hook::{closure#0}<unknown>
  674. 86.93 s gammaloop-nextest-core> at <unknown source file>:<unknown line>
  675. 86.93 s gammaloop-nextest-core> 3: std[bcb96dfbba0ab899]::panicking::panic_with_hook<unknown>
  676. 86.93 s gammaloop-nextest-core> at <unknown source file>:<unknown line>
  677. 86.93 s gammaloop-nextest-core> 4: std[bcb96dfbba0ab899]::panicking::panic_handler::{closure#0}<unknown>
  678. 86.93 s gammaloop-nextest-core> at <unknown source file>:<unknown line>
  679. 86.93 s gammaloop-nextest-core> 5: std[bcb96dfbba0ab899]::sys::backtrace::__rust_end_short_backtrace::<std[bcb96dfbba0ab899]::panicking::panic_handler::{closure#0}, !><unknown>
  680. 86.93 s gammaloop-nextest-core> at <unknown source file>:<unknown line>
  681. 86.93 s gammaloop-nextest-core> 6: __rustc[6c289b9f9c454d21]::rust_begin_unwind<unknown>
  682. 86.93 s gammaloop-nextest-core> at <unknown source file>:<unknown line>
  683. 86.93 s gammaloop-nextest-core> 7: core[940e698046960fd5]::panicking::panic_fmt<unknown>
  684. 86.93 s gammaloop-nextest-core> at <unknown source file>:<unknown line>
  685. 86.93 s gammaloop-nextest-core> 8: core[940e698046960fd5]::panicking::panic<unknown>
  686. 86.93 s gammaloop-nextest-core> at <unknown source file>:<unknown line>
  687. 86.93 s gammaloop-nextest-core> 9: gammalooprs[5490727360442cce]::uv::export::tests::computed_node_full_numerator_is_a_spenso_aware_typst_fragment<unknown>
  688. 86.93 s gammaloop-nextest-core> at <unknown source file>:<unknown line>
  689. 86.93 s gammaloop-nextest-core> 10: <gammalooprs[5490727360442cce]::uv::export::tests::computed_node_full_numerator_is_a_spenso_aware_typst_fragment::{closure#0} as core[940e698046960fd5]::ops::function::FnOnce<()>>::call_once<unknown>
  690. 86.93 s gammaloop-nextest-core> at <unknown source file>:<unknown line>
  691. 86.93 s gammaloop-nextest-core> 11: test[75d6903177b1d7e9]::__rust_begin_short_backtrace::<core[940e698046960fd5]::result::Result<(), alloc[2ea6bcb46fca0c42]::string::String>, fn() -> core[940e698046960fd5]::result::Result<(), alloc[2ea6bcb46fca0c42]::string::String>><unknown>
  692. 86.93 s gammaloop-nextest-core> at <unknown source file>:<unknown line>
  693. 86.93 s gammaloop-nextest-core> 12: test[75d6903177b1d7e9]::run_test::{closure#0}<unknown>
  694. 86.93 s gammaloop-nextest-core> at <unknown source file>:<unknown line>
  695. 86.93 s gammaloop-nextest-core> 13: std[bcb96dfbba0ab899]::sys::backtrace::__rust_begin_short_backtrace::<test[75d6903177b1d7e9]::run_test::{closure#1}, ()><unknown>
  696. 86.93 s gammaloop-nextest-core> at <unknown source file>:<unknown line>
  697. 86.93 s gammaloop-nextest-core> 14: <std[bcb96dfbba0ab899]::thread::lifecycle::spawn_unchecked<test[75d6903177b1d7e9]::run_test::{closure#1}, ()>::{closure#1} as core[940e698046960fd5]::ops::function::FnOnce<()>>::call_once::{shim:vtable#0}<unknown>
  698. 86.93 s gammaloop-nextest-core> at <unknown source file>:<unknown line>
  699. 86.93 s gammaloop-nextest-core> 15: <std[bcb96dfbba0ab899]::sys::thread::unix::Thread>::new::thread_start<unknown>
  700. 86.93 s gammaloop-nextest-core> at <unknown source file>:<unknown line>
  701. 86.93 s gammaloop-nextest-core> 16: start_thread<unknown>
  702. 86.93 s gammaloop-nextest-core> at <unknown source file>:<unknown line>
  703. 86.93 s gammaloop-nextest-core> 17: __clone3<unknown>
  704. 86.93 s gammaloop-nextest-core> at <unknown source file>:<unknown line>
  705. 86.93 s gammaloop-nextest-core>
  706. 86.93 s gammaloop-nextest-core> Run with COLORBT_SHOW_HIDDEN=1 environment variable to disable frame filtering.
  707. 86.93 s gammaloop-nextest-core> Run with RUST_BACKTRACE=full to include source snippets.
  708. 86.93 s gammaloop-nextest-core>
  709. 86.94 s gammaloop-nextest-core> error: test run failed
  710. 86.97 s gammaloop-nextest-core>
  711. 86.97 s gammaloop-nextest-core> ========== nextest test summary ==========
  712. 86.97 s gammaloop-nextest-core> report: target/nextest/ci_gammaloop/junit.xml
  713. 86.97 s gammaloop-nextest-core> tests: 456, failures: 2, errors: 0
  714. 86.97 s gammaloop-nextest-core>
  715. 86.97 s gammaloop-nextest-core> 1. gammalooprs::graph::parse::tests::parse_lmbsetting_crossection
  716. 86.97 s gammaloop-nextest-core> failure: test failure with exit code 101
  717. 86.97 s gammaloop-nextest-core> system-out
  718. 86.97 s gammaloop-nextest-core> running 1 test
  719. 86.97 s gammaloop-nextest-core> ━━━━━━━━━━━━━━━━━━━━━━━━━━━━━━━ Snapshot Summary ━━━━━━━━━━━━━━━━━━━━━━━━━━━━━━━
  720. 86.97 s gammaloop-nextest-core> Snapshot: parse_lmbsetting_crossection
  721. 86.97 s gammaloop-nextest-core> Source: crates/gammalooprs/src/graph/parse/tests.rs:252
  722. 86.97 s gammaloop-nextest-core> ────────────────────────────────────────────────────────────────────────────────
  723. 86.97 s gammaloop-nextest-core> Expression: g.debug_dot()
  724. 86.97 s gammaloop-nextest-core> ────────────────────────────────────────────────────────────────────────────────
  725. 86.97 s gammaloop-nextest-core> -old snapshot
  726. 86.97 s gammaloop-nextest-core> +new results
  727. 86.97 s gammaloop-nextest-core> ────────────┬───────────────────────────────────────────────────────────────────
  728. 86.97 s gammaloop-nextest-core> 1 │-digraph G{
  729. 86.97 s gammaloop-nextest-core> 1 │+digraph G {
  730. 86.97 s gammaloop-nextest-core> 2 2 │ num = "1/2";
  731. 86.97 s gammaloop-nextest-core> 3 3 │ overall_factor = "2*x";
  732. 86.97 s gammaloop-nextest-core> 4 4 │ overall_factor_evaluated = "2*x";
  733. 86.97 s gammaloop-nextest-core> 5 5 │ projector = "spenso::t";
  734. 86.97 s gammaloop-nextest-core> ────────────┴───────────────────────────────────────────────────────────────────
  735. 86.97 s gammaloop-nextest-core> To update snapshots run `cargo insta review`
  736. 86.97 s gammaloop-nextest-core> Stopped on the first failure. Run `cargo insta test` to run all snapshots.
  737. 86.97 s gammaloop-nextest-core> test graph::parse::tests::parse_lmbsetting_crossection ... FAILED
  738. 86.97 s gammaloop-nextest-core>
  739. 86.97 s gammaloop-nextest-core> failures:
  740. 86.97 s gammaloop-nextest-core>
  741. 86.97 s gammaloop-nextest-core> failures:
  742. 86.97 s gammaloop-nextest-core> graph::parse::tests::parse_lmbsetting_crossection
  743. 86.97 s gammaloop-nextest-core>
  744. 86.97 s gammaloop-nextest-core> test result: FAILED. 0 passed; 1 failed; 0 ignored; 0 measured; 508 filtered out; finished in 0.21s
  745. 86.97 s gammaloop-nextest-core> system-err
  746. 86.97 s gammaloop-nextest-core> [21:19:02.939] @gammalooprs::graph::attribute_warnings WARNING : Unknown node attribute 'color_num' on graph 'G', node 'A'; did you mean 'num'?
  747. 86.97 s gammaloop-nextest-core> at crates/gammalooprs/src/graph/attribute_warnings.rs:198
  748. 86.97 s gammaloop-nextest-core> The application panicked (crashed).
  749. 86.97 s gammaloop-nextest-core> Message: snapshot assertion for 'parse_lmbsetting_crossection' failed in line 252
  750. 86.97 s gammaloop-nextest-core> Location: /nix/store/xdy1vvhll2bijdplvl9fcc2b9plkxhaa-vendor-cargo-deps/c19b7c6f923b580ac259164a89f2577984ad5ab09ee9d583b888f934adbbe8d0/insta-1.47.2/src/runtime.rs:719
  751. 86.97 s gammaloop-nextest-core>
  752. 86.97 s gammaloop-nextest-core> ━━━━━━━━━━━━━━━━━━━━━━━━━━━━━━━━━━ BACKTRACE ━━━━━━━━━━━━━━━━━━━━━━━━━━━━━━━━━━━
  753. 86.97 s gammaloop-nextest-core> 1: <color_eyre[b0c9e66060e883b2]::config::PanicHook>::panic_report<unknown>
  754. 86.97 s gammaloop-nextest-core> at <unknown source file>:<unknown line>
  755. 86.97 s gammaloop-nextest-core> 2: <color_eyre[b0c9e66060e883b2]::config::PanicHook>::into_panic_hook::{closure#0}<unknown>
  756. 86.97 s gammaloop-nextest-core> at <unknown source file>:<unknown line>
  757. 86.97 s gammaloop-nextest-core> 3: std[bcb96dfbba0ab899]::panicking::panic_with_hook<unknown>
  758. 86.97 s gammaloop-nextest-core> at <unknown source file>:<unknown line>
  759. 86.97 s gammaloop-nextest-core> 4: std[bcb96dfbba0ab899]::panicking::panic_handler::{closure#0}<unknown>
  760. 86.97 s gammaloop-nextest-core> at <unknown source file>:<unknown line>
  761. 86.97 s gammaloop-nextest-core> 5: std[bcb96dfbba0ab899]::sys::backtrace::__rust_end_short_backtrace::<std[bcb96dfbba0ab899]::panicking::panic_handler::{closure#0}, !><unknown>
  762. 86.97 s gammaloop-nextest-core> at <unknown source file>:<unknown line>
  763. 86.97 s gammaloop-nextest-core> 6: __rustc[6c289b9f9c454d21]::rust_begin_unwind<unknown>
  764. 86.97 s gammaloop-nextest-core> at <unknown source file>:<unknown line>
  765. 86.97 s gammaloop-nextest-core> 7: core[940e698046960fd5]::panicking::panic_fmt<unknown>
  766. 86.97 s gammaloop-nextest-core> at <unknown source file>:<unknown line>
  767. 86.97 s gammaloop-nextest-core> 8: insta[307a548ac79ef4d9]::runtime::assert_snapshot<unknown>
  768. 86.97 s gammaloop-nextest-core> at <unknown source file>:<unknown line>
  769. 86.97 s gammaloop-nextest-core> 9: gammalooprs[5490727360442cce]::graph::parse::tests::parse_lmbsetting_crossection<unknown>
  770. 86.97 s gammaloop-nextest-core> at <unknown source file>:<unknown line>
  771. 86.97 s gammaloop-nextest-core> 10: <gammalooprs[5490727360442cce]::graph::parse::tests::parse_lmbsetting_crossection::{closure#0} as core[940e698046960fd5]::ops::function::FnOnce<()>>::call_once<unknown>
  772. 86.97 s gammaloop-nextest-core> at <unknown source file>:<unknown line>
  773. 86.97 s gammaloop-nextest-core> 11: test[75d6903177b1d7e9]::__rust_begin_short_backtrace::<core[940e698046960fd5]::result::Result<(), alloc[2ea6bcb46fca0c42]::string::String>, fn() -> core[940e698046960fd5]::result::Result<(), alloc[2ea6bcb46fca0c42]::string::String>><unknown>
  774. 86.97 s gammaloop-nextest-core> at <unknown source file>:<unknown line>
  775. 86.97 s gammaloop-nextest-core> 12: test[75d6903177b1d7e9]::run_test::{closure#0}<unknown>
  776. 86.97 s gammaloop-nextest-core> at <unknown source file>:<unknown line>
  777. 86.97 s gammaloop-nextest-core> 13: std[bcb96dfbba0ab899]::sys::backtrace::__rust_begin_short_backtrace::<test[75d6903177b1d7e9]::run_test::{closure#1}, ()><unknown>
  778. 86.97 s gammaloop-nextest-core> at <unknown source file>:<unknown line>
  779. 86.97 s gammaloop-nextest-core> 14: <std[bcb96dfbba0ab899]::thread::lifecycle::spawn_unchecked<test[75d6903177b1d7e9]::run_test::{closure#1}, ()>::{closure#1} as core[940e698046960fd5]::ops::function::FnOnce<()>>::call_once::{shim:vtable#0}<unknown>
  780. 86.97 s gammaloop-nextest-core> at <unknown source file>:<unknown line>
  781. 86.97 s gammaloop-nextest-core> 15: <std[bcb96dfbba0ab899]::sys::thread::unix::Thread>::new::thread_start<unknown>
  782. 86.97 s gammaloop-nextest-core> at <unknown source file>:<unknown line>
  783. 86.97 s gammaloop-nextest-core> 16: start_thread<unknown>
  784. 86.97 s gammaloop-nextest-core> at <unknown source file>:<unknown line>
  785. 86.97 s gammaloop-nextest-core> 17: __clone3<unknown>
  786. 86.97 s gammaloop-nextest-core> at <unknown source file>:<unknown line>
  787. 86.97 s gammaloop-nextest-core>
  788. 86.97 s gammaloop-nextest-core> Run with COLORBT_SHOW_HIDDEN=1 environment variable to disable frame filtering.
  789. 86.97 s gammaloop-nextest-core> Run with RUST_BACKTRACE=full to include source snippets.
  790. 86.97 s gammaloop-nextest-core>
  791. 86.97 s gammaloop-nextest-core> 2. gammalooprs::uv::export::tests::computed_node_full_numerator_is_a_spenso_aware_typst_fragment
  792. 86.97 s gammaloop-nextest-core> failure: test failure with exit code 101
  793. 86.97 s gammaloop-nextest-core> system-out
  794. 86.97 s gammaloop-nextest-core> running 1 test
  795. 86.97 s gammaloop-nextest-core> test uv::export::tests::computed_node_full_numerator_is_a_spenso_aware_typst_fragment ... FAILED
  796. 86.97 s gammaloop-nextest-core>
  797. 86.97 s gammaloop-nextest-core> failures:
  798. 86.97 s gammaloop-nextest-core>
  799. 86.97 s gammaloop-nextest-core> failures:
  800. 86.97 s gammaloop-nextest-core> uv::export::tests::computed_node_full_numerator_is_a_spenso_aware_typst_fragment
  801. 86.97 s gammaloop-nextest-core>
  802. 86.97 s gammaloop-nextest-core> test result: FAILED. 0 passed; 1 failed; 0 ignored; 0 measured; 508 filtered out; finished in 0.07s
  803. 86.97 s gammaloop-nextest-core> system-err
  804. 86.97 s gammaloop-nextest-core> The application panicked (crashed).
  805. 86.97 s gammaloop-nextest-core> Message: assertion failed: exported.dot.contains(r#"full_num = "op(\"Tr\")(1)";"#)
  806. 86.97 s gammaloop-nextest-core> Location: crates/gammalooprs/src/uv/export.rs:483
  807. 86.97 s gammaloop-nextest-core>
  808. 86.97 s gammaloop-nextest-core> ━━━━━━━━━━━━━━━━━━━━━━━━━━━━━━━━━━ BACKTRACE ━━━━━━━━━━━━━━━━━━━━━━━━━━━━━━━━━━━
  809. 86.97 s gammaloop-nextest-core> 1: <color_eyre[b0c9e66060e883b2]::config::PanicHook>::panic_report<unknown>
  810. 86.97 s gammaloop-nextest-core> at <unknown source file>:<unknown line>
  811. 86.97 s gammaloop-nextest-core> 2: <color_eyre[b0c9e66060e883b2]::config::PanicHook>::into_panic_hook::{closure#0}<unknown>
  812. 86.97 s gammaloop-nextest-core> at <unknown source file>:<unknown line>
  813. 86.97 s gammaloop-nextest-core> 3: std[bcb96dfbba0ab899]::panicking::panic_with_hook<unknown>
  814. 86.97 s gammaloop-nextest-core> at <unknown source file>:<unknown line>
  815. 86.97 s gammaloop-nextest-core> 4: std[bcb96dfbba0ab899]::panicking::panic_handler::{closure#0}<unknown>
  816. 86.97 s gammaloop-nextest-core> at <unknown source file>:<unknown line>
  817. 86.97 s gammaloop-nextest-core> 5: std[bcb96dfbba0ab899]::sys::backtrace::__rust_end_short_backtrace::<std[bcb96dfbba0ab899]::panicking::panic_handler::{closure#0}, !><unknown>
  818. 86.97 s gammaloop-nextest-core> at <unknown source file>:<unknown line>
  819. 86.97 s gammaloop-nextest-core> 6: __rustc[6c289b9f9c454d21]::rust_begin_unwind<unknown>
  820. 86.97 s gammaloop-nextest-core> at <unknown source file>:<unknown line>
  821. 86.97 s gammaloop-nextest-core> 7: core[940e698046960fd5]::panicking::panic_fmt<unknown>
  822. 86.97 s gammaloop-nextest-core> at <unknown source file>:<unknown line>
  823. 86.97 s gammaloop-nextest-core> 8: core[940e698046960fd5]::panicking::panic<unknown>
  824. 86.97 s gammaloop-nextest-core> at <unknown source file>:<unknown line>
  825. 86.97 s gammaloop-nextest-core> 9: gammalooprs[5490727360442cce]::uv::export::tests::computed_node_full_numerator_is_a_spenso_aware_typst_fragment<unknown>
  826. 86.97 s gammaloop-nextest-core> at <unknown source file>:<unknown line>
  827. 86.97 s gammaloop-nextest-core> 10: <gammalooprs[5490727360442cce]::uv::export::tests::computed_node_full_numerator_is_a_spenso_aware_typst_fragment::{closure#0} as core[940e698046960fd5]::ops::function::FnOnce<()>>::call_once<unknown>
  828. 86.97 s gammaloop-nextest-core> at <unknown source file>:<unknown line>
  829. 86.98 s gammaloop-nextest-core> 11: test[75d6903177b1d7e9]::__rust_begin_short_backtrace::<core[940e698046960fd5]::result::Result<(), alloc[2ea6bcb46fca0c42]::string::String>, fn() -> core[940e698046960fd5]::result::Result<(), alloc[2ea6bcb46fca0c42]::string::String>><unknown>
  830. 86.98 s gammaloop-nextest-core> at <unknown source file>:<unknown line>
  831. 86.98 s gammaloop-nextest-core> 12: test[75d6903177b1d7e9]::run_test::{closure#0}<unknown>
  832. 86.98 s gammaloop-nextest-core> at <unknown source file>:<unknown line>
  833. 86.98 s gammaloop-nextest-core> 13: std[bcb96dfbba0ab899]::sys::backtrace::__rust_begin_short_backtrace::<test[75d6903177b1d7e9]::run_test::{closure#1}, ()><unknown>
  834. 86.98 s gammaloop-nextest-core> at <unknown source file>:<unknown line>
  835. 86.98 s gammaloop-nextest-core> 14: <std[bcb96dfbba0ab899]::thread::lifecycle::spawn_unchecked<test[75d6903177b1d7e9]::run_test::{closure#1}, ()>::{closure#1} as core[940e698046960fd5]::ops::function::FnOnce<()>>::call_once::{shim:vtable#0}<unknown>
  836. 86.98 s gammaloop-nextest-core> at <unknown source file>:<unknown line>
  837. 86.98 s gammaloop-nextest-core> 15: <std[bcb96dfbba0ab899]::sys::thread::unix::Thread>::new::thread_start<unknown>
  838. 86.98 s gammaloop-nextest-core> at <unknown source file>:<unknown line>
  839. 86.98 s gammaloop-nextest-core> 16: start_thread<unknown>
  840. 86.98 s gammaloop-nextest-core> at <unknown source file>:<unknown line>
  841. 86.98 s gammaloop-nextest-core> 17: __clone3<unknown>
  842. 86.98 s gammaloop-nextest-core> at <unknown source file>:<unknown line>
  843. 86.98 s gammaloop-nextest-core>
  844. 86.98 s gammaloop-nextest-core> Run with COLORBT_SHOW_HIDDEN=1 environment variable to disable frame filtering.
  845. 86.98 s gammaloop-nextest-core> Run with RUST_BACKTRACE=full to include source snippets.
  846. 86.98 s gammaloop-nextest-core> =========================================
  847. 87.04 s error: Cannot build '/nix/store/07lma8g6p1n7jxf8azmxf90ca6pqjydj-gammaloop-nextest-core.drv'.
  848. 87.04 s Reason: builder failed with exit code 100.
  849. 87.04 s Output paths:
  850. 87.04 s /nix/store/cb0qr129ypswd8fgpp9k932nrjfvk3s0-gammaloop-nextest-core
  851. 87.04 s Last 612 log lines:
  852. 87.04 s > Extracting 3 binaries (including 1 non-test binary), 1 build script output directory, and 2 linked paths to /build/nextest-archive-rwBuRm
  853. 87.04 s > Extracted 18 files to /build/nextest-archive-rwBuRm in 0.59s
  854. 87.04 s > ------------
  855. 87.04 s > Nextest run ID 76bc058a-26a0-47a5-b110-6539d5013011 with nextest profile: ci_gammaloop
  856. 87.04 s > Starting 339 tests across 2 binaries
  857. 87.04 s > FAIL [ 0.031s] (243/339) gammaloop-api repl::tests::completion_shows_type_hint_for_non_boolean_settings_leaf
  858. 87.04 s > stdout ---
  859. 87.04 s >
  860. 87.04 s > running 1 test
  861. 87.04 s > test repl::tests::completion_shows_type_hint_for_non_boolean_settings_leaf ... FAILED
  862. 87.04 s >
  863. 87.04 s > failures:
  864. 87.04 s >
  865. 87.04 s > failures:
  866. 87.04 s > repl::tests::completion_shows_type_hint_for_non_boolean_settings_leaf
  867. 87.04 s >
  868. 87.04 s > test result: FAILED. 0 passed; 1 failed; 0 ignored; 0 measured; 338 filtered out; finished in 0.01s
  869. 87.04 s >
  870. 87.04 s > stderr ---
  871. 87.04 s >
  872. 87.04 s > thread 'repl::tests::completion_shows_type_hint_for_non_boolean_settings_leaf' (775) panicked at crates/gammaloop-api/src/repl.rs:5778:9:
  873. 87.04 s > [Suggestion { value: "", description: Some("Number of samples in the first Monte Carlo iteration."), style: None, extra: None, span: Span { start: 42, end: 42 }, append_whitespace: false }]
  874. 87.04 s > stack backtrace:
  875. 87.04 s > 0: __rustc::rust_begin_unwind
  876. 87.04 s > 1: core::panicking::panic_fmt
  877. 87.04 s > 2: gammaloop_api::repl::tests::completion_shows_type_hint_for_non_boolean_settings_leaf
  878. 87.04 s > 3: <gammaloop_api::repl::tests::completion_shows_type_hint_for_non_boolean_settings_leaf::{closure#0} as core::ops::function::FnOnce<()>>::call_once
  879. 87.04 s > note: Some details are omitted, run with `RUST_BACKTRACE=full` for a verbose backtrace.
  880. 87.04 s >
  881. 87.04 s > FAIL [ 0.101s] (290/339) gammaloop-api templates::tests::extract_templates_uses_canonical_package_layout
  882. 87.04 s > stdout ---
  883. 87.04 s >
  884. 87.04 s > running 1 test
  885. 87.04 s > test templates::tests::extract_templates_uses_canonical_package_layout ... FAILED
  886. 87.04 s >
  887. 87.04 s > failures:
  888. 87.04 s >
  889. 87.04 s > failures:
  890. 87.04 s > templates::tests::extract_templates_uses_canonical_package_layout
  891. 87.04 s >
  892. 87.04 s > test result: FAILED. 0 passed; 1 failed; 0 ignored; 0 measured; 338 filtered out; finished in 0.09s
  893. 87.04 s >
  894. 87.04 s > stderr ---
  895. 87.04 s >
  896. 87.04 s > thread 'templates::tests::extract_templates_uses_canonical_package_layout' (876) panicked at crates/gammaloop-api/src/templates.rs:99:9:
  897. 87.04 s > assertion failed: figure.contains("amplitude-mode")
  898. 87.04 s > stack backtrace:
  899. 87.04 s > 0: __rustc::rust_begin_unwind
  900. 87.04 s > 1: core::panicking::panic_fmt
  901. 87.04 s > 2: core::panicking::panic
  902. 87.04 s > 3: gammaloop_api::templates::tests::extract_templates_uses_canonical_package_layout
  903. 87.04 s > 4: <gammaloop_api::templates::tests::extract_templates_uses_canonical_package_layout::{closure#0} as core::ops::function::FnOnce<()>>::call_once
  904. 87.04 s > note: Some details are omitted, run with `RUST_BACKTRACE=full` for a verbose backtrace.
  905. 87.04 s >
  906. 87.04 s > ------------
  907. 87.04 s > Summary [ 0.644s] 339 tests run: 337 passed, 2 failed, 0 skipped
  908. 87.04 s > FAIL [ 0.031s] (243/339) gammaloop-api repl::tests::completion_shows_type_hint_for_non_boolean_settings_leaf
  909. 87.04 s > stdout ---
  910. 87.04 s >
  911. 87.04 s > running 1 test
  912. 87.04 s > test repl::tests::completion_shows_type_hint_for_non_boolean_settings_leaf ... FAILED
  913. 87.04 s >
  914. 87.04 s > failures:
  915. 87.04 s >
  916. 87.04 s > failures:
  917. 87.04 s > repl::tests::completion_shows_type_hint_for_non_boolean_settings_leaf
  918. 87.04 s >
  919. 87.04 s > test result: FAILED. 0 passed; 1 failed; 0 ignored; 0 measured; 338 filtered out; finished in 0.01s
  920. 87.04 s >
  921. 87.04 s > stderr ---
  922. 87.04 s >
  923. 87.04 s > thread 'repl::tests::completion_shows_type_hint_for_non_boolean_settings_leaf' (775) panicked at crates/gammaloop-api/src/repl.rs:5778:9:
  924. 87.04 s > [Suggestion { value: "", description: Some("Number of samples in the first Monte Carlo iteration."), style: None, extra: None, span: Span { start: 42, end: 42 }, append_whitespace: false }]
  925. 87.04 s > stack backtrace:
  926. 87.04 s > 0: __rustc::rust_begin_unwind
  927. 87.04 s > 1: core::panicking::panic_fmt
  928. 87.04 s > 2: gammaloop_api::repl::tests::completion_shows_type_hint_for_non_boolean_settings_leaf
  929. 87.04 s > 3: <gammaloop_api::repl::tests::completion_shows_type_hint_for_non_boolean_settings_leaf::{closure#0} as core::ops::function::FnOnce<()>>::call_once
  930. 87.04 s > note: Some details are omitted, run with `RUST_BACKTRACE=full` for a verbose backtrace.
  931. 87.04 s >
  932. 87.04 s > FAIL [ 0.101s] (290/339) gammaloop-api templates::tests::extract_templates_uses_canonical_package_layout
  933. 87.04 s > stdout ---
  934. 87.04 s >
  935. 87.04 s > running 1 test
  936. 87.04 s > test templates::tests::extract_templates_uses_canonical_package_layout ... FAILED
  937. 87.04 s >
  938. 87.04 s > failures:
  939. 87.04 s >
  940. 87.04 s > failures:
  941. 87.04 s > templates::tests::extract_templates_uses_canonical_package_layout
  942. 87.04 s >
  943. 87.04 s > test result: FAILED. 0 passed; 1 failed; 0 ignored; 0 measured; 338 filtered out; finished in 0.09s
  944. 87.04 s >
  945. 87.04 s > stderr ---
  946. 87.04 s >
  947. 87.04 s > thread 'templates::tests::extract_templates_uses_canonical_package_layout' (876) panicked at crates/gammaloop-api/src/templates.rs:99:9:
  948. 87.04 s > assertion failed: figure.contains("amplitude-mode")
  949. 87.04 s > stack backtrace:
  950. 87.04 s > 0: __rustc::rust_begin_unwind
  951. 87.04 s > 1: core::panicking::panic_fmt
  952. 87.04 s > 2: core::panicking::panic
  953. 87.04 s > 3: gammaloop_api::templates::tests::extract_templates_uses_canonical_package_layout
  954. 87.04 s > 4: <gammaloop_api::templates::tests::extract_templates_uses_canonical_package_layout::{closure#0} as core::ops::function::FnOnce<()>>::call_once
  955. 87.04 s > note: Some details are omitted, run with `RUST_BACKTRACE=full` for a verbose backtrace.
  956. 87.04 s >
  957. 87.04 s > error: test run failed
  958. 87.04 s >
  959. 87.04 s > ========== nextest test summary ==========
  960. 87.04 s > report: target/nextest/ci_gammaloop/junit.xml
  961. 87.04 s > tests: 339, failures: 2, errors: 0
  962. 87.04 s >
  963. 87.04 s > 1. gammaloop-api::repl::tests::completion_shows_type_hint_for_non_boolean_settings_leaf
  964. 87.04 s > failure: test failure with exit code 101
  965. 87.04 s > thread 'repl::tests::completion_shows_type_hint_for_non_boolean_settings_leaf' (775) panicked at crates/gammaloop-api/src/repl.rs:5778:9:
  966. 87.04 s > [Suggestion { value: "", description: Some("Number of samples in the first Monte Carlo iteration."), style: None, extra: None, span: Span { start: 42, end: 42 }, append_whitespace: false }]
  967. 87.04 s > stack backtrace:
  968. 87.04 s > 0: __rustc::rust_begin_unwind
  969. 87.04 s > 1: core::panicking::panic_fmt
  970. 87.04 s > 2: gammaloop_api::repl::tests::completion_shows_type_hint_for_non_boolean_settings_leaf
  971. 87.04 s > 3: <gammaloop_api::repl::tests::completion_shows_type_hint_for_non_boolean_settings_leaf::{closure#0} as core::ops::function::FnOnce<()>>::call_once
  972. 87.04 s > note: Some details are omitted, run with `RUST_BACKTRACE=full` for a verbose backtrace.
  973. 87.04 s > system-out
  974. 87.04 s > running 1 test
  975. 87.04 s > test repl::tests::completion_shows_type_hint_for_non_boolean_settings_leaf ... FAILED
  976. 87.04 s >
  977. 87.04 s > failures:
  978. 87.04 s >
  979. 87.04 s > failures:
  980. 87.04 s > repl::tests::completion_shows_type_hint_for_non_boolean_settings_leaf
  981. 87.04 s >
  982. 87.04 s > test result: FAILED. 0 passed; 1 failed; 0 ignored; 0 measured; 338 filtered out; finished in 0.01s
  983. 87.04 s > system-err
  984. 87.04 s > thread 'repl::tests::completion_shows_type_hint_for_non_boolean_settings_leaf' (775) panicked at crates/gammaloop-api/src/repl.rs:5778:9:
  985. 87.04 s > [Suggestion { value: "", description: Some("Number of samples in the first Monte Carlo iteration."), style: None, extra: None, span: Span { start: 42, end: 42 }, append_whitespace: false }]
  986. 87.04 s > stack backtrace:
  987. 87.04 s > 0: __rustc::rust_begin_unwind
  988. 87.04 s > 1: core::panicking::panic_fmt
  989. 87.04 s > 2: gammaloop_api::repl::tests::completion_shows_type_hint_for_non_boolean_settings_leaf
  990. 87.04 s > 3: <gammaloop_api::repl::tests::completion_shows_type_hint_for_non_boolean_settings_leaf::{closure#0} as core::ops::function::FnOnce<()>>::call_once
  991. 87.04 s > note: Some details are omitted, run with `RUST_BACKTRACE=full` for a verbose backtrace.
  992. 87.04 s >
  993. 87.04 s > 2. gammaloop-api::templates::tests::extract_templates_uses_canonical_package_layout
  994. 87.04 s > failure: test failure with exit code 101
  995. 87.04 s > thread 'templates::tests::extract_templates_uses_canonical_package_layout' (876) panicked at crates/gammaloop-api/src/templates.rs:99:9:
  996. 87.04 s > assertion failed: figure.contains("amplitude-mode")
  997. 87.04 s > stack backtrace:
  998. 87.04 s > 0: __rustc::rust_begin_unwind
  999. 87.04 s > 1: core::panicking::panic_fmt
  1000. 87.04 s > 2: core::panicking::panic
  1001. 87.04 s > 3: gammaloop_api::templates::tests::extract_templates_uses_canonical_package_layout
  1002. 87.04 s > 4: <gammaloop_api::templates::tests::extract_templates_uses_canonical_package_layout::{closure#0} as core::ops::function::FnOnce<()>>::call_once
  1003. 87.04 s > note: Some details are omitted, run with `RUST_BACKTRACE=full` for a verbose backtrace.
  1004. 87.04 s > system-out
  1005. 87.04 s > running 1 test
  1006. 87.04 s > test templates::tests::extract_templates_uses_canonical_package_layout ... FAILED
  1007. 87.04 s >
  1008. 87.04 s > failures:
  1009. 87.04 s >
  1010. 87.04 s > failures:
  1011. 87.04 s > templates::tests::extract_templates_uses_canonical_package_layout
  1012. 87.04 s >
  1013. 87.04 s > test result: FAILED. 0 passed; 1 failed; 0 ignored; 0 measured; 338 filtered out; finished in 0.09s
  1014. 87.04 s > system-err
  1015. 87.04 s > thread 'templates::tests::extract_templates_uses_canonical_package_layout' (876) panicked at crates/gammaloop-api/src/templates.rs:99:9:
  1016. 87.04 s > assertion failed: figure.contains("amplitude-mode")
  1017. 87.04 s > stack backtrace:
  1018. 87.04 s > 0: __rustc::rust_begin_unwind
  1019. 87.04 s > 1: core::panicking::panic_fmt
  1020. 87.04 s > 2: core::panicking::panic
  1021. 87.04 s > 3: gammaloop_api::templates::tests::extract_templates_uses_canonical_package_layout
  1022. 87.04 s > 4: <gammaloop_api::templates::tests::extract_templates_uses_canonical_package_layout::{closure#0} as core::ops::function::FnOnce<()>>::call_once
  1023. 87.04 s > note: Some details are omitted, run with `RUST_BACKTRACE=full` for a verbose backtrace.
  1024. 87.04 s > =========================================
  1025. 87.04 s > Extracting 1 binary and 1 linked path to /build/nextest-archive-RSHIKK
  1026. 87.04 s > Extracted 7 files to /build/nextest-archive-RSHIKK in 0.08s
  1027. 87.04 s > ------------
  1028. 87.04 s > Nextest run ID 6dd8f6a6-bdef-4ca9-ab1d-6d73e4dc4d32 with nextest profile: ci_gammaloop
  1029. 87.04 s > Starting 19 tests across 1 binary
  1030. 87.04 s > ------------
  1031. 87.04 s > Summary [ 0.017s] 19 tests run: 19 passed, 0 skipped
  1032. 87.04 s >
  1033. 87.04 s > ========== nextest test summary ==========
  1034. 87.04 s > report: target/nextest/ci_gammaloop/junit.xml
  1035. 87.04 s > tests: 19, failures: 0, errors: 0
  1036. 87.04 s > No failing testcases found.
  1037. 87.04 s > =========================================
  1038. 87.04 s > Extracting 1 binary to /build/nextest-archive-pho77r
  1039. 87.04 s > Extracted 4 files to /build/nextest-archive-pho77r in 0.05s
  1040. 87.04 s > ------------
  1041. 87.04 s > Nextest run ID 7f1b56d5-22c0-4cbd-a23a-8b0f6becbadb with nextest profile: ci_gammaloop
  1042. 87.04 s > Starting 0 tests across 1 binary
  1043. 87.04 s > ------------
  1044. 87.04 s > Summary [ 0.000s] 0 tests run: 0 passed, 0 skipped
  1045. 87.04 s >
  1046. 87.04 s > ========== nextest test summary ==========
  1047. 87.04 s > report: target/nextest/ci_gammaloop/junit.xml
  1048. 87.04 s > tests: 0, failures: 0, errors: 0
  1049. 87.04 s > No failing testcases found.
  1050. 87.04 s > =========================================
  1051. 87.04 s > Extracting 4 binaries, 1 build script output directory, and 2 linked paths to /build/nextest-archive-xB9eVc
  1052. 87.04 s > Extracted 18 files to /build/nextest-archive-xB9eVc in 0.57s
  1053. 87.04 s > ------------
  1054. 87.04 s > Nextest run ID d307d8dd-1544-402f-a800-77372c7dd921 with nextest profile: ci_gammaloop
  1055. 87.04 s > Starting 456 tests across 4 binaries (61 tests skipped, including 60 tests via profile.ci_gammaloop.default-filter)
  1056. 87.04 s > FAIL [ 0.229s] (156/456) gammalooprs graph::parse::tests::parse_lmbsetting_crossection
  1057. 87.04 s > stdout ---
  1058. 87.04 s >
  1059. 87.04 s > running 1 test
  1060. 87.04 s > ━━━━━━━━━━━━━━━━━━━━━━━━━━━━━━━ Snapshot Summary ━━━━━━━━━━━━━━━━━━━━━━━━━━━━━━━
  1061. 87.04 s > Snapshot: parse_lmbsetting_crossection
  1062. 87.04 s > Source: crates/gammalooprs/src/graph/parse/tests.rs:252
  1063. 87.04 s > ────────────────────────────────────────────────────────────────────────────────
  1064. 87.04 s > Expression: g.debug_dot()
  1065. 87.04 s > ────────────────────────────────────────────────────────────────────────────────
  1066. 87.04 s > -old snapshot
  1067. 87.04 s > +new results
  1068. 87.04 s > ────────────┬───────────────────────────────────────────────────────────────────
  1069. 87.04 s > 1 │-digraph G{
  1070. 87.04 s > 1 │+digraph G {
  1071. 87.04 s > 2 2 │ num = "1/2";
  1072. 87.04 s > 3 3 │ overall_factor = "2*x";
  1073. 87.04 s > 4 4 │ overall_factor_evaluated = "2*x";
  1074. 87.04 s > 5 5 │ projector = "spenso::t";
  1075. 87.04 s > ────────────┴───────────────────────────────────────────────────────────────────
  1076. 87.04 s > To update snapshots run `cargo insta review`
  1077. 87.04 s > Stopped on the first failure. Run `cargo insta test` to run all snapshots.
  1078. 87.04 s > test graph::parse::tests::parse_lmbsetting_crossection ... FAILED
  1079. 87.04 s >
  1080. 87.04 s > failures:
  1081. 87.04 s >
  1082. 87.04 s > failures:
  1083. 87.04 s > graph::parse::tests::parse_lmbsetting_crossection
  1084. 87.04 s >
  1085. 87.04 s > test result: FAILED. 0 passed; 1 failed; 0 ignored; 0 measured; 508 filtered out; finished in 0.21s
  1086. 87.04 s >
  1087. 87.04 s > stderr ---
  1088. 87.04 s > [21:19:02.939] @gammalooprs::graph::attribute_warnings WARNING : Unknown node attribute 'color_num' on graph 'G', node 'A'; did you mean 'num'?
  1089. 87.04 s > at crates/gammalooprs/src/graph/attribute_warnings.rs:198
  1090. 87.04 s > The application panicked (crashed).
  1091. 87.04 s > Message: snapshot assertion for 'parse_lmbsetting_crossection' failed in line 252
  1092. 87.04 s > Location: /nix/store/xdy1vvhll2bijdplvl9fcc2b9plkxhaa-vendor-cargo-deps/c19b7c6f923b580ac259164a89f2577984ad5ab09ee9d583b888f934adbbe8d0/insta-1.47.2/src/runtime.rs:719
  1093. 87.04 s >
  1094. 87.04 s > ━━━━━━━━━━━━━━━━━━━━━━━━━━━━━━━━━━ BACKTRACE ━━━━━━━━━━━━━━━━━━━━━━━━━━━━━━━━━━━
  1095. 87.04 s > 1: <color_eyre[b0c9e66060e883b2]::config::PanicHook>::panic_report<unknown>
  1096. 87.04 s > at <unknown source file>:<unknown line>
  1097. 87.04 s > 2: <color_eyre[b0c9e66060e883b2]::config::PanicHook>::into_panic_hook::{closure#0}<unknown>
  1098. 87.04 s > at <unknown source file>:<unknown line>
  1099. 87.04 s > 3: std[bcb96dfbba0ab899]::panicking::panic_with_hook<unknown>
  1100. 87.04 s > at <unknown source file>:<unknown line>
  1101. 87.04 s > 4: std[bcb96dfbba0ab899]::panicking::panic_handler::{closure#0}<unknown>
  1102. 87.04 s > at <unknown source file>:<unknown line>
  1103. 87.04 s > 5: std[bcb96dfbba0ab899]::sys::backtrace::__rust_end_short_backtrace::<std[bcb96dfbba0ab899]::panicking::panic_handler::{closure#0}, !><unknown>
  1104. 87.04 s > at <unknown source file>:<unknown line>
  1105. 87.04 s > 6: __rustc[6c289b9f9c454d21]::rust_begin_unwind<unknown>
  1106. 87.04 s > at <unknown source file>:<unknown line>
  1107. 87.04 s > 7: core[940e698046960fd5]::panicking::panic_fmt<unknown>
  1108. 87.04 s > at <unknown source file>:<unknown line>
  1109. 87.04 s > 8: insta[307a548ac79ef4d9]::runtime::assert_snapshot<unknown>
  1110. 87.04 s > at <unknown source file>:<unknown line>
  1111. 87.04 s > 9: gammalooprs[5490727360442cce]::graph::parse::tests::parse_lmbsetting_crossection<unknown>
  1112. 87.04 s > at <unknown source file>:<unknown line>
  1113. 87.04 s > 10: <gammalooprs[5490727360442cce]::graph::parse::tests::parse_lmbsetting_crossection::{closure#0} as core[940e698046960fd5]::ops::function::FnOnce<()>>::call_once<unknown>
  1114. 87.04 s > at <unknown source file>:<unknown line>
  1115. 87.04 s > 11: test[75d6903177b1d7e9]::__rust_begin_short_backtrace::<core[940e698046960fd5]::result::Result<(), alloc[2ea6bcb46fca0c42]::string::String>, fn() -> core[940e698046960fd5]::result::Result<(), alloc[2ea6bcb46fca0c42]::string::String>><unknown>
  1116. 87.04 s > at <unknown source file>:<unknown line>
  1117. 87.04 s > 12: test[75d6903177b1d7e9]::run_test::{closure#0}<unknown>
  1118. 87.04 s > at <unknown source file>:<unknown line>
  1119. 87.04 s > 13: std[bcb96dfbba0ab899]::sys::backtrace::__rust_begin_short_backtrace::<test[75d6903177b1d7e9]::run_test::{closure#1}, ()><unknown>
  1120. 87.04 s > at <unknown source file>:<unknown line>
  1121. 87.04 s > 14: <std[bcb96dfbba0ab899]::thread::lifecycle::spawn_unchecked<test[75d6903177b1d7e9]::run_test::{closure#1}, ()>::{closure#1} as core[940e698046960fd5]::ops::function::FnOnce<()>>::call_once::{shim:vtable#0}<unknown>
  1122. 87.04 s > at <unknown source file>:<unknown line>
  1123. 87.04 s > 15: <std[bcb96dfbba0ab899]::sys::thread::unix::Thread>::new::thread_start<unknown>
  1124. 87.04 s > at <unknown source file>:<unknown line>
  1125. 87.04 s > 16: start_thread<unknown>
  1126. 87.04 s > at <unknown source file>:<unknown line>
  1127. 87.04 s > 17: __clone3<unknown>
  1128. 87.04 s > at <unknown source file>:<unknown line>
  1129. 87.04 s >
  1130. 87.04 s > Run with COLORBT_SHOW_HIDDEN=1 environment variable to disable frame filtering.
  1131. 87.04 s > Run with RUST_BACKTRACE=full to include source snippets.
  1132. 87.04 s >
  1133. 87.04 s > FAIL [ 0.083s] (407/456) gammalooprs uv::export::tests::computed_node_full_numerator_is_a_spenso_aware_typst_fragment
  1134. 87.04 s > stdout ---
  1135. 87.04 s >
  1136. 87.04 s > running 1 test
  1137. 87.04 s > test uv::export::tests::computed_node_full_numerator_is_a_spenso_aware_typst_fragment ... FAILED
  1138. 87.04 s >
  1139. 87.04 s > failures:
  1140. 87.04 s >
  1141. 87.04 s > failures:
  1142. 87.04 s > uv::export::tests::computed_node_full_numerator_is_a_spenso_aware_typst_fragment
  1143. 87.04 s >
  1144. 87.04 s > test result: FAILED. 0 passed; 1 failed; 0 ignored; 0 measured; 508 filtered out; finished in 0.07s
  1145. 87.04 s >
  1146. 87.04 s > stderr ---
  1147. 87.04 s > The application panicked (crashed).
  1148. 87.04 s > Message: assertion failed: exported.dot.contains(r#"full_num = "op(\"Tr\")(1)";"#)
  1149. 87.04 s > Location: crates/gammalooprs/src/uv/export.rs:483
  1150. 87.04 s >
  1151. 87.04 s > ━━━━━━━━━━━━━━━━━━━━━━━━━━━━━━━━━━ BACKTRACE ━━━━━━━━━━━━━━━━━━━━━━━━━━━━━━━━━━━
  1152. 87.04 s > 1: <color_eyre[b0c9e66060e883b2]::config::PanicHook>::panic_report<unknown>
  1153. 87.04 s > at <unknown source file>:<unknown line>
  1154. 87.04 s > 2: <color_eyre[b0c9e66060e883b2]::config::PanicHook>::into_panic_hook::{closure#0}<unknown>
  1155. 87.04 s > at <unknown source file>:<unknown line>
  1156. 87.04 s > 3: std[bcb96dfbba0ab899]::panicking::panic_with_hook<unknown>
  1157. 87.04 s > at <unknown source file>:<unknown line>
  1158. 87.04 s > 4: std[bcb96dfbba0ab899]::panicking::panic_handler::{closure#0}<unknown>
  1159. 87.04 s > at <unknown source file>:<unknown line>
  1160. 87.04 s > 5: std[bcb96dfbba0ab899]::sys::backtrace::__rust_end_short_backtrace::<std[bcb96dfbba0ab899]::panicking::panic_handler::{closure#0}, !><unknown>
  1161. 87.04 s > at <unknown source file>:<unknown line>
  1162. 87.04 s > 6: __rustc[6c289b9f9c454d21]::rust_begin_unwind<unknown>
  1163. 87.04 s > at <unknown source file>:<unknown line>
  1164. 87.04 s > 7: core[940e698046960fd5]::panicking::panic_fmt<unknown>
  1165. 87.04 s > at <unknown source file>:<unknown line>
  1166. 87.04 s > 8: core[940e698046960fd5]::panicking::panic<unknown>
  1167. 87.04 s > at <unknown source file>:<unknown line>
  1168. 87.04 s > 9: gammalooprs[5490727360442cce]::uv::export::tests::computed_node_full_numerator_is_a_spenso_aware_typst_fragment<unknown>
  1169. 87.04 s > at <unknown source file>:<unknown line>
  1170. 87.04 s > 10: <gammalooprs[5490727360442cce]::uv::export::tests::computed_node_full_numerator_is_a_spenso_aware_typst_fragment::{closure#0} as core[940e698046960fd5]::ops::function::FnOnce<()>>::call_once<unknown>
  1171. 87.04 s > at <unknown source file>:<unknown line>
  1172. 87.04 s > 11: test[75d6903177b1d7e9]::__rust_begin_short_backtrace::<core[940e698046960fd5]::result::Result<(), alloc[2ea6bcb46fca0c42]::string::String>, fn() -> core[940e698046960fd5]::result::Result<(), alloc[2ea6bcb46fca0c42]::string::String>><unknown>
  1173. 87.04 s > at <unknown source file>:<unknown line>
  1174. 87.04 s > 12: test[75d6903177b1d7e9]::run_test::{closure#0}<unknown>
  1175. 87.04 s > at <unknown source file>:<unknown line>
  1176. 87.04 s > 13: std[bcb96dfbba0ab899]::sys::backtrace::__rust_begin_short_backtrace::<test[75d6903177b1d7e9]::run_test::{closure#1}, ()><unknown>
  1177. 87.04 s > at <unknown source file>:<unknown line>
  1178. 87.04 s > 14: <std[bcb96dfbba0ab899]::thread::lifecycle::spawn_unchecked<test[75d6903177b1d7e9]::run_test::{closure#1}, ()>::{closure#1} as core[940e698046960fd5]::ops::function::FnOnce<()>>::call_once::{shim:vtable#0}<unknown>
  1179. 87.04 s > at <unknown source file>:<unknown line>
  1180. 87.04 s > 15: <std[bcb96dfbba0ab899]::sys::thread::unix::Thread>::new::thread_start<unknown>
  1181. 87.04 s > at <unknown source file>:<unknown line>
  1182. 87.04 s > 16: start_thread<unknown>
  1183. 87.04 s > at <unknown source file>:<unknown line>
  1184. 87.04 s > 17: __clone3<unknown>
  1185. 87.04 s > at <unknown source file>:<unknown line>
  1186. 87.04 s >
  1187. 87.04 s > Run with COLORBT_SHOW_HIDDEN=1 environment variable to disable frame filtering.
  1188. 87.04 s > Run with RUST_BACKTRACE=full to include source snippets.
  1189. 87.04 s >
  1190. 87.04 s > ------------
  1191. 87.04 s > Summary [ 12.886s] 456 tests run: 454 passed, 2 failed, 61 skipped
  1192. 87.04 s > FAIL [ 0.229s] (156/456) gammalooprs graph::parse::tests::parse_lmbsetting_crossection
  1193. 87.04 s > stdout ---
  1194. 87.04 s >
  1195. 87.04 s > running 1 test
  1196. 87.04 s > ━━━━━━━━━━━━━━━━━━━━━━━━━━━━━━━ Snapshot Summary ━━━━━━━━━━━━━━━━━━━━━━━━━━━━━━━
  1197. 87.04 s > Snapshot: parse_lmbsetting_crossection
  1198. 87.04 s > Source: crates/gammalooprs/src/graph/parse/tests.rs:252
  1199. 87.04 s > ────────────────────────────────────────────────────────────────────────────────
  1200. 87.04 s > Expression: g.debug_dot()
  1201. 87.04 s > ────────────────────────────────────────────────────────────────────────────────
  1202. 87.04 s > -old snapshot
  1203. 87.04 s > +new results
  1204. 87.04 s > ────────────┬───────────────────────────────────────────────────────────────────
  1205. 87.04 s > 1 │-digraph G{
  1206. 87.04 s > 1 │+digraph G {
  1207. 87.04 s > 2 2 │ num = "1/2";
  1208. 87.04 s > 3 3 │ overall_factor = "2*x";
  1209. 87.04 s > 4 4 │ overall_factor_evaluated = "2*x";
  1210. 87.04 s > 5 5 │ projector = "spenso::t";
  1211. 87.04 s > ────────────┴───────────────────────────────────────────────────────────────────
  1212. 87.04 s > To update snapshots run `cargo insta review`
  1213. 87.04 s > Stopped on the first failure. Run `cargo insta test` to run all snapshots.
  1214. 87.04 s > test graph::parse::tests::parse_lmbsetting_crossection ... FAILED
  1215. 87.04 s >
  1216. 87.04 s > failures:
  1217. 87.04 s >
  1218. 87.04 s > failures:
  1219. 87.04 s > graph::parse::tests::parse_lmbsetting_crossection
  1220. 87.04 s >
  1221. 87.04 s > test result: FAILED. 0 passed; 1 failed; 0 ignored; 0 measured; 508 filtered out; finished in 0.21s
  1222. 87.04 s >
  1223. 87.04 s > stderr ---
  1224. 87.04 s > [21:19:02.939] @gammalooprs::graph::attribute_warnings WARNING : Unknown node attribute 'color_num' on graph 'G', node 'A'; did you mean 'num'?
  1225. 87.04 s > at crates/gammalooprs/src/graph/attribute_warnings.rs:198
  1226. 87.04 s > The application panicked (crashed).
  1227. 87.04 s > Message: snapshot assertion for 'parse_lmbsetting_crossection' failed in line 252
  1228. 87.04 s > Location: /nix/store/xdy1vvhll2bijdplvl9fcc2b9plkxhaa-vendor-cargo-deps/c19b7c6f923b580ac259164a89f2577984ad5ab09ee9d583b888f934adbbe8d0/insta-1.47.2/src/runtime.rs:719
  1229. 87.04 s >
  1230. 87.04 s > ━━━━━━━━━━━━━━━━━━━━━━━━━━━━━━━━━━ BACKTRACE ━━━━━━━━━━━━━━━━━━━━━━━━━━━━━━━━━━━
  1231. 87.04 s > 1: <color_eyre[b0c9e66060e883b2]::config::PanicHook>::panic_report<unknown>
  1232. 87.04 s > at <unknown source file>:<unknown line>
  1233. 87.04 s > 2: <color_eyre[b0c9e66060e883b2]::config::PanicHook>::into_panic_hook::{closure#0}<unknown>
  1234. 87.04 s > at <unknown source file>:<unknown line>
  1235. 87.04 s > 3: std[bcb96dfbba0ab899]::panicking::panic_with_hook<unknown>
  1236. 87.04 s > at <unknown source file>:<unknown line>
  1237. 87.05 s > 4: std[bcb96dfbba0ab899]::panicking::panic_handler::{closure#0}<unknown>
  1238. 87.05 s > at <unknown source file>:<unknown line>
  1239. 87.05 s > 5: std[bcb96dfbba0ab899]::sys::backtrace::__rust_end_short_backtrace::<std[bcb96dfbba0ab899]::panicking::panic_handler::{closure#0}, !><unknown>
  1240. 87.05 s > at <unknown source file>:<unknown line>
  1241. 87.05 s > 6: __rustc[6c289b9f9c454d21]::rust_begin_unwind<unknown>
  1242. 87.05 s > at <unknown source file>:<unknown line>
  1243. 87.05 s > 7: core[940e698046960fd5]::panicking::panic_fmt<unknown>
  1244. 87.05 s > at <unknown source file>:<unknown line>
  1245. 87.05 s > 8: insta[307a548ac79ef4d9]::runtime::assert_snapshot<unknown>
  1246. 87.05 s > at <unknown source file>:<unknown line>
  1247. 87.05 s > 9: gammalooprs[5490727360442cce]::graph::parse::tests::parse_lmbsetting_crossection<unknown>
  1248. 87.05 s > at <unknown source file>:<unknown line>
  1249. 87.05 s > 10: <gammalooprs[5490727360442cce]::graph::parse::tests::parse_lmbsetting_crossection::{closure#0} as core[940e698046960fd5]::ops::function::FnOnce<()>>::call_once<unknown>
  1250. 87.05 s > at <unknown source file>:<unknown line>
  1251. 87.05 s > 11: test[75d6903177b1d7e9]::__rust_begin_short_backtrace::<core[940e698046960fd5]::result::Result<(), alloc[2ea6bcb46fca0c42]::string::String>, fn() -> core[940e698046960fd5]::result::Result<(), alloc[2ea6bcb46fca0c42]::string::String>><unknown>
  1252. 87.05 s > at <unknown source file>:<unknown line>
  1253. 87.05 s > 12: test[75d6903177b1d7e9]::run_test::{closure#0}<unknown>
  1254. 87.05 s > at <unknown source file>:<unknown line>
  1255. 87.05 s > 13: std[bcb96dfbba0ab899]::sys::backtrace::__rust_begin_short_backtrace::<test[75d6903177b1d7e9]::run_test::{closure#1}, ()><unknown>
  1256. 87.05 s > at <unknown source file>:<unknown line>
  1257. 87.05 s > 14: <std[bcb96dfbba0ab899]::thread::lifecycle::spawn_unchecked<test[75d6903177b1d7e9]::run_test::{closure#1}, ()>::{closure#1} as core[940e698046960fd5]::ops::function::FnOnce<()>>::call_once::{shim:vtable#0}<unknown>
  1258. 87.05 s > at <unknown source file>:<unknown line>
  1259. 87.05 s > 15: <std[bcb96dfbba0ab899]::sys::thread::unix::Thread>::new::thread_start<unknown>
  1260. 87.05 s > at <unknown source file>:<unknown line>
  1261. 87.05 s > 16: start_thread<unknown>
  1262. 87.05 s > at <unknown source file>:<unknown line>
  1263. 87.05 s > 17: __clone3<unknown>
  1264. 87.05 s > at <unknown source file>:<unknown line>
  1265. 87.05 s >
  1266. 87.05 s > Run with COLORBT_SHOW_HIDDEN=1 environment variable to disable frame filtering.
  1267. 87.05 s > Run with RUST_BACKTRACE=full to include source snippets.
  1268. 87.05 s >
  1269. 87.05 s > FAIL [ 0.083s] (407/456) gammalooprs uv::export::tests::computed_node_full_numerator_is_a_spenso_aware_typst_fragment
  1270. 87.05 s > stdout ---
  1271. 87.05 s >
  1272. 87.05 s > running 1 test
  1273. 87.05 s > test uv::export::tests::computed_node_full_numerator_is_a_spenso_aware_typst_fragment ... FAILED
  1274. 87.05 s >
  1275. 87.05 s > failures:
  1276. 87.05 s >
  1277. 87.05 s > failures:
  1278. 87.05 s > uv::export::tests::computed_node_full_numerator_is_a_spenso_aware_typst_fragment
  1279. 87.05 s >
  1280. 87.05 s > test result: FAILED. 0 passed; 1 failed; 0 ignored; 0 measured; 508 filtered out; finished in 0.07s
  1281. 87.05 s >
  1282. 87.05 s > stderr ---
  1283. 87.05 s > The application panicked (crashed).
  1284. 87.05 s > Message: assertion failed: exported.dot.contains(r#"full_num = "op(\"Tr\")(1)";"#)
  1285. 87.05 s > Location: crates/gammalooprs/src/uv/export.rs:483
  1286. 87.05 s >
  1287. 87.05 s > ━━━━━━━━━━━━━━━━━━━━━━━━━━━━━━━━━━ BACKTRACE ━━━━━━━━━━━━━━━━━━━━━━━━━━━━━━━━━━━
  1288. 87.05 s > 1: <color_eyre[b0c9e66060e883b2]::config::PanicHook>::panic_report<unknown>
  1289. 87.05 s > at <unknown source file>:<unknown line>
  1290. 87.05 s > 2: <color_eyre[b0c9e66060e883b2]::config::PanicHook>::into_panic_hook::{closure#0}<unknown>
  1291. 87.05 s > at <unknown source file>:<unknown line>
  1292. 87.05 s > 3: std[bcb96dfbba0ab899]::panicking::panic_with_hook<unknown>
  1293. 87.05 s > at <unknown source file>:<unknown line>
  1294. 87.05 s > 4: std[bcb96dfbba0ab899]::panicking::panic_handler::{closure#0}<unknown>
  1295. 87.05 s > at <unknown source file>:<unknown line>
  1296. 87.05 s > 5: std[bcb96dfbba0ab899]::sys::backtrace::__rust_end_short_backtrace::<std[bcb96dfbba0ab899]::panicking::panic_handler::{closure#0}, !><unknown>
  1297. 87.05 s > at <unknown source file>:<unknown line>
  1298. 87.05 s > 6: __rustc[6c289b9f9c454d21]::rust_begin_unwind<unknown>
  1299. 87.05 s > at <unknown source file>:<unknown line>
  1300. 87.05 s > 7: core[940e698046960fd5]::panicking::panic_fmt<unknown>
  1301. 87.05 s > at <unknown source file>:<unknown line>
  1302. 87.05 s > 8: core[940e698046960fd5]::panicking::panic<unknown>
  1303. 87.05 s > at <unknown source file>:<unknown line>
  1304. 87.05 s > 9: gammalooprs[5490727360442cce]::uv::export::tests::computed_node_full_numerator_is_a_spenso_aware_typst_fragment<unknown>
  1305. 87.05 s > at <unknown source file>:<unknown line>
  1306. 87.05 s > 10: <gammalooprs[5490727360442cce]::uv::export::tests::computed_node_full_numerator_is_a_spenso_aware_typst_fragment::{closure#0} as core[940e698046960fd5]::ops::function::FnOnce<()>>::call_once<unknown>
  1307. 87.05 s > at <unknown source file>:<unknown line>
  1308. 87.05 s > 11: test[75d6903177b1d7e9]::__rust_begin_short_backtrace::<core[940e698046960fd5]::result::Result<(), alloc[2ea6bcb46fca0c42]::string::String>, fn() -> core[940e698046960fd5]::result::Result<(), alloc[2ea6bcb46fca0c42]::string::String>><unknown>
  1309. 87.05 s > at <unknown source file>:<unknown line>
  1310. 87.05 s > 12: test[75d6903177b1d7e9]::run_test::{closure#0}<unknown>
  1311. 87.05 s > at <unknown source file>:<unknown line>
  1312. 87.05 s > 13: std[bcb96dfbba0ab899]::sys::backtrace::__rust_begin_short_backtrace::<test[75d6903177b1d7e9]::run_test::{closure#1}, ()><unknown>
  1313. 87.05 s > at <unknown source file>:<unknown line>
  1314. 87.05 s > 14: <std[bcb96dfbba0ab899]::thread::lifecycle::spawn_unchecked<test[75d6903177b1d7e9]::run_test::{closure#1}, ()>::{closure#1} as core[940e698046960fd5]::ops::function::FnOnce<()>>::call_once::{shim:vtable#0}<unknown>
  1315. 87.05 s > at <unknown source file>:<unknown line>
  1316. 87.05 s > 15: <std[bcb96dfbba0ab899]::sys::thread::unix::Thread>::new::thread_start<unknown>
  1317. 87.05 s > at <unknown source file>:<unknown line>
  1318. 87.05 s > 16: start_thread<unknown>
  1319. 87.05 s > at <unknown source file>:<unknown line>
  1320. 87.05 s > 17: __clone3<unknown>
  1321. 87.05 s > at <unknown source file>:<unknown line>
  1322. 87.05 s >
  1323. 87.05 s > Run with COLORBT_SHOW_HIDDEN=1 environment variable to disable frame filtering.
  1324. 87.05 s > Run with RUST_BACKTRACE=full to include source snippets.
  1325. 87.05 s >
  1326. 87.05 s > error: test run failed
  1327. 87.05 s >
  1328. 87.05 s > ========== nextest test summary ==========
  1329. 87.05 s > report: target/nextest/ci_gammaloop/junit.xml
  1330. 87.05 s > tests: 456, failures: 2, errors: 0
  1331. 87.05 s >
  1332. 87.05 s > 1. gammalooprs::graph::parse::tests::parse_lmbsetting_crossection
  1333. 87.05 s > failure: test failure with exit code 101
  1334. 87.05 s > system-out
  1335. 87.05 s > running 1 test
  1336. 87.05 s > ━━━━━━━━━━━━━━━━━━━━━━━━━━━━━━━ Snapshot Summary ━━━━━━━━━━━━━━━━━━━━━━━━━━━━━━━
  1337. 87.05 s > Snapshot: parse_lmbsetting_crossection
  1338. 87.05 s > Source: crates/gammalooprs/src/graph/parse/tests.rs:252
  1339. 87.05 s > ────────────────────────────────────────────────────────────────────────────────
  1340. 87.05 s > Expression: g.debug_dot()
  1341. 87.05 s > ────────────────────────────────────────────────────────────────────────────────
  1342. 87.05 s > -old snapshot
  1343. 87.05 s > +new results
  1344. 87.05 s > ────────────┬───────────────────────────────────────────────────────────────────
  1345. 87.05 s > 1 │-digraph G{
  1346. 87.05 s > 1 │+digraph G {
  1347. 87.05 s > 2 2 │ num = "1/2";
  1348. 87.05 s > 3 3 │ overall_factor = "2*x";
  1349. 87.05 s > 4 4 │ overall_factor_evaluated = "2*x";
  1350. 87.05 s > 5 5 │ projector = "spenso::t";
  1351. 87.05 s > ────────────┴───────────────────────────────────────────────────────────────────
  1352. 87.05 s > To update snapshots run `cargo insta review`
  1353. 87.05 s > Stopped on the first failure. Run `cargo insta test` to run all snapshots.
  1354. 87.05 s > test graph::parse::tests::parse_lmbsetting_crossection ... FAILED
  1355. 87.05 s >
  1356. 87.05 s > failures:
  1357. 87.05 s >
  1358. 87.05 s > failures:
  1359. 87.05 s > graph::parse::tests::parse_lmbsetting_crossection
  1360. 87.05 s >
  1361. 87.05 s > test result: FAILED. 0 passed; 1 failed; 0 ignored; 0 measured; 508 filtered out; finished in 0.21s
  1362. 87.05 s > system-err
  1363. 87.05 s > [21:19:02.939] @gammalooprs::graph::attribute_warnings WARNING : Unknown node attribute 'color_num' on graph 'G', node 'A'; did you mean 'num'?
  1364. 87.05 s > at crates/gammalooprs/src/graph/attribute_warnings.rs:198
  1365. 87.05 s > The application panicked (crashed).
  1366. 87.05 s > Message: snapshot assertion for 'parse_lmbsetting_crossection' failed in line 252
  1367. 87.05 s > Location: /nix/store/xdy1vvhll2bijdplvl9fcc2b9plkxhaa-vendor-cargo-deps/c19b7c6f923b580ac259164a89f2577984ad5ab09ee9d583b888f934adbbe8d0/insta-1.47.2/src/runtime.rs:719
  1368. 87.05 s >
  1369. 87.05 s > ━━━━━━━━━━━━━━━━━━━━━━━━━━━━━━━━━━ BACKTRACE ━━━━━━━━━━━━━━━━━━━━━━━━━━━━━━━━━━━
  1370. 87.05 s > 1: <color_eyre[b0c9e66060e883b2]::config::PanicHook>::panic_report<unknown>
  1371. 87.05 s > at <unknown source file>:<unknown line>
  1372. 87.05 s > 2: <color_eyre[b0c9e66060e883b2]::config::PanicHook>::into_panic_hook::{closure#0}<unknown>
  1373. 87.05 s > at <unknown source file>:<unknown line>
  1374. 87.05 s > 3: std[bcb96dfbba0ab899]::panicking::panic_with_hook<unknown>
  1375. 87.05 s > at <unknown source file>:<unknown line>
  1376. 87.05 s > 4: std[bcb96dfbba0ab899]::panicking::panic_handler::{closure#0}<unknown>
  1377. 87.05 s > at <unknown source file>:<unknown line>
  1378. 87.05 s > 5: std[bcb96dfbba0ab899]::sys::backtrace::__rust_end_short_backtrace::<std[bcb96dfbba0ab899]::panicking::panic_handler::{closure#0}, !><unknown>
  1379. 87.05 s > at <unknown source file>:<unknown line>
  1380. 87.05 s > 6: __rustc[6c289b9f9c454d21]::rust_begin_unwind<unknown>
  1381. 87.05 s > at <unknown source file>:<unknown line>
  1382. 87.05 s > 7: core[940e698046960fd5]::panicking::panic_fmt<unknown>
  1383. 87.05 s > at <unknown source file>:<unknown line>
  1384. 87.05 s > 8: insta[307a548ac79ef4d9]::runtime::assert_snapshot<unknown>
  1385. 87.05 s > at <unknown source file>:<unknown line>
  1386. 87.05 s > 9: gammalooprs[5490727360442cce]::graph::parse::tests::parse_lmbsetting_crossection<unknown>
  1387. 87.05 s > at <unknown source file>:<unknown line>
  1388. 87.05 s > 10: <gammalooprs[5490727360442cce]::graph::parse::tests::parse_lmbsetting_crossection::{closure#0} as core[940e698046960fd5]::ops::function::FnOnce<()>>::call_once<unknown>
  1389. 87.05 s > at <unknown source file>:<unknown line>
  1390. 87.05 s > 11: test[75d6903177b1d7e9]::__rust_begin_short_backtrace::<core[940e698046960fd5]::result::Result<(), alloc[2ea6bcb46fca0c42]::string::String>, fn() -> core[940e698046960fd5]::result::Result<(), alloc[2ea6bcb46fca0c42]::string::String>><unknown>
  1391. 87.05 s > at <unknown source file>:<unknown line>
  1392. 87.05 s > 12: test[75d6903177b1d7e9]::run_test::{closure#0}<unknown>
  1393. 87.05 s > at <unknown source file>:<unknown line>
  1394. 87.05 s > 13: std[bcb96dfbba0ab899]::sys::backtrace::__rust_begin_short_backtrace::<test[75d6903177b1d7e9]::run_test::{closure#1}, ()><unknown>
  1395. 87.05 s > at <unknown source file>:<unknown line>
  1396. 87.05 s > 14: <std[bcb96dfbba0ab899]::thread::lifecycle::spawn_unchecked<test[75d6903177b1d7e9]::run_test::{closure#1}, ()>::{closure#1} as core[940e698046960fd5]::ops::function::FnOnce<()>>::call_once::{shim:vtable#0}<unknown>
  1397. 87.05 s > at <unknown source file>:<unknown line>
  1398. 87.05 s > 15: <std[bcb96dfbba0ab899]::sys::thread::unix::Thread>::new::thread_start<unknown>
  1399. 87.05 s > at <unknown source file>:<unknown line>
  1400. 87.05 s > 16: start_thread<unknown>
  1401. 87.05 s > at <unknown source file>:<unknown line>
  1402. 87.05 s > 17: __clone3<unknown>
  1403. 87.05 s > at <unknown source file>:<unknown line>
  1404. 87.05 s >
  1405. 87.05 s > Run with COLORBT_SHOW_HIDDEN=1 environment variable to disable frame filtering.
  1406. 87.05 s > Run with RUST_BACKTRACE=full to include source snippets.
  1407. 87.05 s >
  1408. 87.05 s > 2. gammalooprs::uv::export::tests::computed_node_full_numerator_is_a_spenso_aware_typst_fragment
  1409. 87.05 s > failure: test failure with exit code 101
  1410. 87.05 s > system-out
  1411. 87.05 s > running 1 test
  1412. 87.05 s > test uv::export::tests::computed_node_full_numerator_is_a_spenso_aware_typst_fragment ... FAILED
  1413. 87.05 s >
  1414. 87.05 s > failures:
  1415. 87.05 s >
  1416. 87.05 s > failures:
  1417. 87.05 s > uv::export::tests::computed_node_full_numerator_is_a_spenso_aware_typst_fragment
  1418. 87.05 s >
  1419. 87.05 s > test result: FAILED. 0 passed; 1 failed; 0 ignored; 0 measured; 508 filtered out; finished in 0.07s
  1420. 87.05 s > system-err
  1421. 87.05 s > The application panicked (crashed).
  1422. 87.05 s > Message: assertion failed: exported.dot.contains(r#"full_num = "op(\"Tr\")(1)";"#)
  1423. 87.05 s > Location: crates/gammalooprs/src/uv/export.rs:483
  1424. 87.05 s >
  1425. 87.05 s > ━━━━━━━━━━━━━━━━━━━━━━━━━━━━━━━━━━ BACKTRACE ━━━━━━━━━━━━━━━━━━━━━━━━━━━━━━━━━━━
  1426. 87.05 s > 1: <color_eyre[b0c9e66060e883b2]::config::PanicHook>::panic_report<unknown>
  1427. 87.05 s > at <unknown source file>:<unknown line>
  1428. 87.05 s > 2: <color_eyre[b0c9e66060e883b2]::config::PanicHook>::into_panic_hook::{closure#0}<unknown>
  1429. 87.05 s > at <unknown source file>:<unknown line>
  1430. 87.05 s > 3: std[bcb96dfbba0ab899]::panicking::panic_with_hook<unknown>
  1431. 87.05 s > at <unknown source file>:<unknown line>
  1432. 87.05 s > 4: std[bcb96dfbba0ab899]::panicking::panic_handler::{closure#0}<unknown>
  1433. 87.05 s > at <unknown source file>:<unknown line>
  1434. 87.05 s > 5: std[bcb96dfbba0ab899]::sys::backtrace::__rust_end_short_backtrace::<std[bcb96dfbba0ab899]::panicking::panic_handler::{closure#0}, !><unknown>
  1435. 87.05 s > at <unknown source file>:<unknown line>
  1436. 87.05 s > 6: __rustc[6c289b9f9c454d21]::rust_begin_unwind<unknown>
  1437. 87.05 s > at <unknown source file>:<unknown line>
  1438. 87.05 s > 7: core[940e698046960fd5]::panicking::panic_fmt<unknown>
  1439. 87.05 s > at <unknown source file>:<unknown line>
  1440. 87.05 s > 8: core[940e698046960fd5]::panicking::panic<unknown>
  1441. 87.05 s > at <unknown source file>:<unknown line>
  1442. 87.05 s > 9: gammalooprs[5490727360442cce]::uv::export::tests::computed_node_full_numerator_is_a_spenso_aware_typst_fragment<unknown>
  1443. 87.05 s > at <unknown source file>:<unknown line>
  1444. 87.05 s > 10: <gammalooprs[5490727360442cce]::uv::export::tests::computed_node_full_numerator_is_a_spenso_aware_typst_fragment::{closure#0} as core[940e698046960fd5]::ops::function::FnOnce<()>>::call_once<unknown>
  1445. 87.05 s > at <unknown source file>:<unknown line>
  1446. 87.05 s > 11: test[75d6903177b1d7e9]::__rust_begin_short_backtrace::<core[940e698046960fd5]::result::Result<(), alloc[2ea6bcb46fca0c42]::string::String>, fn() -> core[940e698046960fd5]::result::Result<(), alloc[2ea6bcb46fca0c42]::string::String>><unknown>
  1447. 87.05 s > at <unknown source file>:<unknown line>
  1448. 87.05 s > 12: test[75d6903177b1d7e9]::run_test::{closure#0}<unknown>
  1449. 87.05 s > at <unknown source file>:<unknown line>
  1450. 87.05 s > 13: std[bcb96dfbba0ab899]::sys::backtrace::__rust_begin_short_backtrace::<test[75d6903177b1d7e9]::run_test::{closure#1}, ()><unknown>
  1451. 87.05 s > at <unknown source file>:<unknown line>
  1452. 87.05 s > 14: <std[bcb96dfbba0ab899]::thread::lifecycle::spawn_unchecked<test[75d6903177b1d7e9]::run_test::{closure#1}, ()>::{closure#1} as core[940e698046960fd5]::ops::function::FnOnce<()>>::call_once::{shim:vtable#0}<unknown>
  1453. 87.05 s > at <unknown source file>:<unknown line>
  1454. 87.05 s > 15: <std[bcb96dfbba0ab899]::sys::thread::unix::Thread>::new::thread_start<unknown>
  1455. 87.05 s > at <unknown source file>:<unknown line>
  1456. 87.05 s > 16: start_thread<unknown>
  1457. 87.05 s > at <unknown source file>:<unknown line>
  1458. 87.05 s > 17: __clone3<unknown>
  1459. 87.05 s > at <unknown source file>:<unknown line>
  1460. 87.05 s >
  1461. 87.05 s > Run with COLORBT_SHOW_HIDDEN=1 environment variable to disable frame filtering.
  1462. 87.05 s > Run with RUST_BACKTRACE=full to include source snippets.
  1463. 87.05 s > =========================================
  1464. 87.05 s For full logs, run:
  1465. 87.05 s nix log /nix/store/07lma8g6p1n7jxf8azmxf90ca6pqjydj-gammaloop-nextest-core.drv
  1466. 87.18 s [2 built (1 failed), 13 Run failed.