1. 0.08 s $ /nix/store/9ypz3flqsrl5xl495mm8h645gadjsxi1-coreutils-9.11/bin/timeout --kill-after=15s 7200s /nix/store/23zk8sgzamrbmj1fday15szf7f2279s8-nix-2.34.7/bin/nix --extra-experimental-features nix-command --extra-experimental-features flakes flake clone git+https://github.com/alphal00p/gammaloop --dest /tmp/nix-ci-worker/stable-pwd/repo/
  2. 0.09 s Cloning into '/tmp/nix-ci-worker/stable-pwd/repo'...
  3. 1.49 s remote: Enumerating objects: 64185, done.
  4. 1.73 s remote: Counting objects: 0% (1/9539) remote: Counting objects: 1% (96/9539) remote: Counting objects: 2% (191/9539) remote: Counting objects: 3% (287/9539) remote: Counting objects: 4% (382/9539) remote: Counting objects: 5% (477/9539) remote: Counting objects: 6% (573/9539) remote: Counting objects: 7% (668/9539) remote: Counting objects: 8% (764/9539) remote: Counting objects: 9% (859/9539) remote: Counting objects: 10% (954/9539) remote: Counting objects: 11% (1050/9539) remote: Counting objects: 12% (1145/9539) remote: Counting objects: 13% (1241/9539) remote: Counting objects: 14% (1336/9539) remote: Counting objects: 15% (1431/9539) remote: Counting objects: 16% (1527/9539) remote: Counting objects: 17% (1622/9539) remote: Counting objects: 18% (1718/9539) remote: Counting objects: 19% (1813/9539) remote: Counting objects: 20% (1908/9539) remote: Counting objects: 21% (2004/9539) remote: Counting objects: 22% (2099/9539) remote: Counting objects: 23% (2194/9539) remote: Counting objects: 24% (2290/9539) remote: Counting objects: 25% (2385/9539) remote: Counting objects: 26% (2481/9539) remote: Counting objects: 27% (2576/9539) remote: Counting objects: 28% (2671/9539) remote: Counting objects: 29% (2767/9539) remote: Counting objects: 30% (2862/9539) remote: Counting objects: 31% (2958/9539) remote: Counting objects: 32% (3053/9539) remote: Counting objects: 33% (3148/9539) remote: Counting objects: 34% (3244/9539) remote: Counting objects: 35% (3339/9539) remote: Counting objects: 36% (3435/9539) remote: Counting objects: 37% (3530/9539) remote: Counting objects: 38% (3625/9539) remote: Counting objects: 39% (3721/9539) remote: Counting objects: 40% (3816/9539) remote: Counting objects: 41% (3911/9539) remote: Counting objects: 42% (4007/9539) remote: Counting objects: 43% (4102/9539) remote: Counting objects: 44% (4198/9539) remote: Counting objects: 45% (4293/9539) remote: Counting objects: 46% (4388/9539) remote: Counting objects: 47% (4484/9539) remote: Counting objects: 48% (4579/9539) remote: Counting objects: 49% (4675/9539) remote: Counting objects: 50% (4770/9539) remote: Counting objects: 51% (4865/9539) remote: Counting objects: 52% (4961/9539) remote: Counting objects: 53% (5056/9539) remote: Counting objects: 54% (5152/9539) remote: Counting objects: 55% (5247/9539) remote: Counting objects: 56% (5342/9539) remote: Counting objects: 57% (5438/9539) remote: Counting objects: 58% (5533/9539) remote: Counting objects: 59% (5629/9539) remote: Counting objects: 60% (5724/9539) remote: Counting objects: 61% (5819/9539) remote: Counting objects: 62% (5915/9539) remote: Counting objects: 63% (6010/9539) remote: Counting objects: 64% (6105/9539) remote: Counting objects: 65% (6201/9539) remote: Counting objects: 66% (6296/9539) remote: Counting objects: 67% (6392/9539) remote: Counting objects: 68% (6487/9539) remote: Counting objects: 69% (6582/9539) remote: Counting objects: 70% (6678/9539) remote: Counting objects: 71% (6773/9539) remote: Counting objects: 72% (6869/9539) remote: Counting objects: 73% (6964/9539) remote: Counting objects: 74% (7059/9539) remote: Counting objects: 75% (7155/9539) remote: Counting objects: 76% (7250/9539) remote: Counting objects: 77% (7346/9539) remote: Counting objects: 78% (7441/9539) remote: Counting objects: 79% (7536/9539) remote: Counting objects: 80% (7632/9539) remote: Counting objects: 81% (7727/9539) remote: Counting objects: 82% (7822/9539) remote: Counting objects: 83% (7918/9539) remote: Counting objects: 84% (8013/9539) remote: Counting objects: 85% (8109/9539) remote: Counting objects: 86% (8204/9539) remote: Counting objects: 87% (8299/9539) remote: Counting objects: 88% (8395/9539) remote: Counting objects: 89% (8490/9539) remote: Counting objects: 90% (8586/9539) remote: Counting objects: 91% (8681/9539) remote: Counting objects: 92% (8776/9539) remote: Counting objects: 93% (8872/9539) remote: Counting objects: 94% (8967/9539) remote: Counting objects: 95% (9063/9539) remote: Counting objects: 96% (9158/9539) remote: Counting objects: 97% (9253/9539) remote: Counting objects: 98% (9349/9539) remote: Counting objects: 99% (9444/9539) remote: Counting objects: 100% (9539/9539) remote: Counting objects: 100% (9539/9539), done.
  5. 4.14 s remote: Compressing objects: 0% (1/2325) remote: Compressing objects: 1% (24/2325) remote: Compressing objects: 2% (47/2325) remote: Compressing objects: 3% (70/2325) remote: Compressing objects: 4% (93/2325) remote: Compressing objects: 5% (117/2325) remote: Compressing objects: 6% (140/2325) remote: Compressing objects: 7% (163/2325) remote: Compressing objects: 8% (186/2325) remote: Compressing objects: 9% (210/2325) remote: Compressing objects: 10% (233/2325) remote: Compressing objects: 11% (256/2325) remote: Compressing objects: 12% (279/2325) remote: Compressing objects: 13% (303/2325) remote: Compressing objects: 14% (326/2325) remote: Compressing objects: 15% (349/2325) remote: Compressing objects: 16% (372/2325) remote: Compressing objects: 17% (396/2325) remote: Compressing objects: 18% (419/2325) remote: Compressing objects: 19% (442/2325) remote: Compressing objects: 20% (465/2325) remote: Compressing objects: 21% (489/2325) remote: Compressing objects: 22% (512/2325) remote: Compressing objects: 23% (535/2325) remote: Compressing objects: 23% (543/2325) remote: Compressing objects: 24% (558/2325) remote: Compressing objects: 25% (582/2325) remote: Compressing objects: 26% (605/2325) remote: Compressing objects: 27% (628/2325) remote: Compressing objects: 28% (651/2325) remote: Compressing objects: 29% (675/2325) remote: Compressing objects: 29% (684/2325) remote: Compressing objects: 30% (698/2325) remote: Compressing objects: 31% (721/2325) remote: Compressing objects: 32% (744/2325) remote: Compressing objects: 33% (768/2325) remote: Compressing objects: 34% (791/2325) remote: Compressing objects: 35% (814/2325) remote: Compressing objects: 36% (837/2325) remote: Compressing objects: 37% (861/2325) remote: Compressing objects: 38% (884/2325) remote: Compressing objects: 39% (907/2325) remote: Compressing objects: 40% (930/2325) remote: Compressing objects: 41% (954/2325) remote: Compressing objects: 42% (977/2325) remote: Compressing objects: 43% (1000/2325) remote: Compressing objects: 44% (1023/2325) remote: Compressing objects: 45% (1047/2325) remote: Compressing objects: 46% (1070/2325) remote: Compressing objects: 47% (1093/2325) remote: Compressing objects: 48% (1116/2325) remote: Compressing objects: 49% (1140/2325) remote: Compressing objects: 50% (1163/2325) remote: Compressing objects: 51% (1186/2325) remote: Compressing objects: 52% (1209/2325) remote: Compressing objects: 53% (1233/2325) remote: Compressing objects: 54% (1256/2325) remote: Compressing objects: 55% (1279/2325) remote: Compressing objects: 56% (1302/2325) remote: Compressing objects: 57% (1326/2325) remote: Compressing objects: 58% (1349/2325) remote: Compressing objects: 59% (1372/2325) remote: Compressing objects: 60% (1395/2325) remote: Compressing objects: 61% (1419/2325) remote: Compressing objects: 62% (1442/2325) remote: Compressing objects: 63% (1465/2325) remote: Compressing objects: 64% (1488/2325) remote: Compressing objects: 65% (1512/2325) remote: Compressing objects: 66% (1535/2325) remote: Compressing objects: 67% (1558/2325) remote: Compressing objects: 68% (1581/2325) remote: Compressing objects: 69% (1605/2325) remote: Compressing objects: 70% (1628/2325) remote: Compressing objects: 71% (1651/2325) remote: Compressing objects: 72% (1674/2325) remote: Compressing objects: 73% (1698/2325) remote: Compressing objects: 74% (1721/2325) remote: Compressing objects: 75% (1744/2325) remote: Compressing objects: 76% (1767/2325) remote: Compressing objects: 77% (1791/2325) remote: Compressing objects: 78% (1814/2325) remote: Compressing objects: 79% (1837/2325) remote: Compressing objects: 80% (1860/2325) remote: Compressing objects: 81% (1884/2325) remote: Compressing objects: 82% (1907/2325) remote: Compressing objects: 83% (1930/2325) remote: Compressing objects: 84% (1953/2325) remote: Compressing objects: 85% (1977/2325) remote: Compressing objects: 86% (2000/2325) remote: Compressing objects: 87% (2023/2325) remote: Compressing objects: 88% (2046/2325) remote: Compressing objects: 89% (2070/2325) remote: Compressing objects: 90% (2093/2325) remote: Compressing objects: 91% (2116/2325) remote: Compressing objects: 92% (2139/2325) remote: Compressing objects: 93% (2163/2325) remote: Compressing objects: 94% (2186/2325) remote: Compressing objects: 95% (2209/2325) remote: Compressing objects: 96% (2232/2325) remote: Compressing objects: 97% (2256/2325) remote: Compressing objects: 98% (2279/2325) remote: Compressing objects: 99% (2302/2325) remote: Compressing objects: 100% (2325/2325) remote: Compressing objects: 100% (2325/2325), done.
  6. 7.16 s Receiving objects: 0% (1/64185) Receiving objects: 1% (642/64185) Receiving objects: 2% (1284/64185) Receiving objects: 3% (1926/64185) Receiving objects: 4% (2568/64185) Receiving objects: 5% (3210/64185) Receiving objects: 6% (3852/64185) Receiving objects: 7% (4493/64185) Receiving objects: 8% (5135/64185) Receiving objects: 9% (5777/64185) Receiving objects: 10% (6419/64185) Receiving objects: 11% (7061/64185) Receiving objects: 12% (7703/64185), 14.22 MiB | 28.42 MiB/s Receiving objects: 13% (8345/64185), 14.22 MiB | 28.42 MiB/s Receiving objects: 14% (8986/64185), 14.22 MiB | 28.42 MiB/s Receiving objects: 15% (9628/64185), 14.22 MiB | 28.42 MiB/s Receiving objects: 16% (10270/64185), 14.22 MiB | 28.42 MiB/s Receiving objects: 17% (10912/64185), 14.22 MiB | 28.42 MiB/s Receiving objects: 18% (11554/64185), 14.22 MiB | 28.42 MiB/s Receiving objects: 19% (12196/64185), 14.22 MiB | 28.42 MiB/s Receiving objects: 20% (12837/64185), 14.22 MiB | 28.42 MiB/s Receiving objects: 21% (13479/64185), 14.22 MiB | 28.42 MiB/s Receiving objects: 22% (14121/64185), 14.22 MiB | 28.42 MiB/s Receiving objects: 23% (14763/64185), 14.22 MiB | 28.42 MiB/s Receiving objects: 24% (15405/64185), 14.22 MiB | 28.42 MiB/s Receiving objects: 25% (16047/64185), 14.22 MiB | 28.42 MiB/s Receiving objects: 26% (16689/64185), 14.22 MiB | 28.42 MiB/s Receiving objects: 27% (17330/64185), 14.22 MiB | 28.42 MiB/s Receiving objects: 28% (17972/64185), 14.22 MiB | 28.42 MiB/s Receiving objects: 29% (18614/64185), 14.22 MiB | 28.42 MiB/s Receiving objects: 30% (19256/64185), 14.22 MiB | 28.42 MiB/s Receiving objects: 31% (19898/64185), 14.22 MiB | 28.42 MiB/s Receiving objects: 32% (20540/64185), 14.22 MiB | 28.42 MiB/s Receiving objects: 33% (21182/64185), 14.22 MiB | 28.42 MiB/s Receiving objects: 34% (21823/64185), 14.22 MiB | 28.42 MiB/s Receiving objects: 35% (22465/64185), 14.22 MiB | 28.42 MiB/s Receiving objects: 36% (23107/64185), 14.22 MiB | 28.42 MiB/s Receiving objects: 37% (23749/64185), 14.22 MiB | 28.42 MiB/s Receiving objects: 38% (24391/64185), 14.22 MiB | 28.42 MiB/s Receiving objects: 39% (25033/64185), 14.22 MiB | 28.42 MiB/s Receiving objects: 40% (25674/64185), 14.22 MiB | 28.42 MiB/s Receiving objects: 41% (26316/64185), 14.22 MiB | 28.42 MiB/s Receiving objects: 42% (26958/64185), 14.22 MiB | 28.42 MiB/s Receiving objects: 43% (27600/64185), 14.22 MiB | 28.42 MiB/s Receiving objects: 44% (28242/64185), 14.22 MiB | 28.42 MiB/s Receiving objects: 45% (28884/64185), 14.22 MiB | 28.42 MiB/s Receiving objects: 46% (29526/64185), 14.22 MiB | 28.42 MiB/s Receiving objects: 47% (30167/64185), 14.22 MiB | 28.42 MiB/s Receiving objects: 48% (30809/64185), 14.22 MiB | 28.42 MiB/s Receiving objects: 49% (31451/64185), 14.22 MiB | 28.42 MiB/s Receiving objects: 50% (32093/64185), 14.22 MiB | 28.42 MiB/s Receiving objects: 51% (32735/64185), 14.22 MiB | 28.42 MiB/s Receiving objects: 52% (33377/64185), 14.22 MiB | 28.42 MiB/s Receiving objects: 52% (33854/64185), 33.09 MiB | 31.90 MiB/s Receiving objects: 53% (34019/64185), 33.09 MiB | 31.90 MiB/s Receiving objects: 54% (34660/64185), 33.09 MiB | 31.90 MiB/s Receiving objects: 55% (35302/64185), 33.09 MiB | 31.90 MiB/s Receiving objects: 56% (35944/64185), 33.09 MiB | 31.90 MiB/s Receiving objects: 57% (36586/64185), 33.09 MiB | 31.90 MiB/s Receiving objects: 58% (37228/64185), 33.09 MiB | 31.90 MiB/s Receiving objects: 59% (37870/64185), 33.09 MiB | 31.90 MiB/s Receiving objects: 60% (38511/64185), 33.09 MiB | 31.90 MiB/s Receiving objects: 61% (39153/64185), 49.42 MiB | 32.17 MiB/s Receiving objects: 62% (39795/64185), 49.42 MiB | 32.17 MiB/s Receiving objects: 63% (40437/64185), 49.42 MiB | 32.17 MiB/s Receiving objects: 64% (41079/64185), 49.42 MiB | 32.17 MiB/s Receiving objects: 65% (41721/64185), 49.42 MiB | 32.17 MiB/s Receiving objects: 66% (42363/64185), 49.42 MiB | 32.17 MiB/s Receiving objects: 67% (43004/64185), 49.42 MiB | 32.17 MiB/s Receiving objects: 68% (43646/64185), 49.42 MiB | 32.17 MiB/s Receiving objects: 69% (44288/64185), 49.42 MiB | 32.17 MiB/s Receiving objects: 69% (44788/64185), 49.42 MiB | 32.17 MiB/s Receiving objects: 70% (44930/64185), 49.42 MiB | 32.17 MiB/s Receiving objects: 71% (45572/64185), 49.42 MiB | 32.17 MiB/s Receiving objects: 72% (46214/64185), 66.40 MiB | 32.61 MiB/s Receiving objects: 73% (46856/64185), 66.40 MiB | 32.61 MiB/s Receiving objects: 74% (47497/64185), 66.40 MiB | 32.61 MiB/s Receiving objects: 75% (48139/64185), 66.40 MiB | 32.61 MiB/s Receiving objects: 76% (48781/64185), 66.40 MiB | 32.61 MiB/s Receiving objects: 77% (49423/64185), 66.40 MiB | 32.61 MiB/s Receiving objects: 78% (50065/64185), 66.40 MiB | 32.61 MiB/s Receiving objects: 79% (50707/64185), 66.40 MiB | 32.61 MiB/s Receiving objects: 80% (51348/64185), 66.40 MiB | 32.61 MiB/s Receiving objects: 81% (51990/64185), 66.40 MiB | 32.61 MiB/s Receiving objects: 82% (52632/64185), 66.40 MiB | 32.61 MiB/s Receiving objects: 83% (53274/64185), 66.40 MiB | 32.61 MiB/s Receiving objects: 84% (53916/64185), 66.40 MiB | 32.61 MiB/s Receiving objects: 85% (54558/64185), 82.39 MiB | 32.36 MiB/s Receiving objects: 86% (55200/64185), 82.39 MiB | 32.36 MiB/s Receiving objects: 87% (55841/64185), 82.39 MiB | 32.36 MiB/s Receiving objects: 88% (56483/64185), 82.39 MiB | 32.36 MiB/s Receiving objects: 89% (57125/64185), 82.39 MiB | 32.36 MiB/s Receiving objects: 90% (57767/64185), 82.39 MiB | 32.36 MiB/s Receiving objects: 91% (58409/64185), 82.39 MiB | 32.36 MiB/s Receiving objects: 92% (59051/64185), 82.39 MiB | 32.36 MiB/s Receiving objects: 93% (59693/64185), 82.39 MiB | 32.36 MiB/s Receiving objects: 94% (60334/64185), 82.39 MiB | 32.36 MiB/s Receiving objects: 95% (60976/64185), 82.39 MiB | 32.36 MiB/s Receiving objects: 96% (61618/64185), 82.39 MiB | 32.36 MiB/s Receiving objects: 97% (62260/64185), 82.39 MiB | 32.36 MiB/s Receiving objects: 98% (62902/64185), 82.39 MiB | 32.36 MiB/s Receiving objects: 99% (63544/64185), 82.39 MiB | 32.36 MiB/s Receiving objects: 99% (64114/64185), 82.39 MiB | 32.36 MiB/s remote: Total 64185 (delta 7386), reused 7765 (delta 6669), pack-reused 54646 (from 3)
  7. 7.18 s Receiving objects: 100% (64185/64185), 82.39 MiB | 32.36 MiB/s Receiving objects: 100% (64185/64185), 97.83 MiB | 32.43 MiB/s, done.
  8. 7.85 s Resolving deltas: 0% (0/44316) Resolving deltas: 1% (444/44316) Resolving deltas: 2% (887/44316) Resolving deltas: 3% (1330/44316) Resolving deltas: 4% (1773/44316) Resolving deltas: 5% (2216/44316) Resolving deltas: 6% (2659/44316) Resolving deltas: 7% (3103/44316) Resolving deltas: 8% (3549/44316) Resolving deltas: 9% (3989/44316) Resolving deltas: 10% (4432/44316) Resolving deltas: 11% (4875/44316) Resolving deltas: 12% (5318/44316) Resolving deltas: 13% (5762/44316) Resolving deltas: 14% (6205/44316) Resolving deltas: 15% (6648/44316) Resolving deltas: 16% (7091/44316) Resolving deltas: 17% (7534/44316) Resolving deltas: 18% (7977/44316) Resolving deltas: 19% (8421/44316) Resolving deltas: 20% (8864/44316) Resolving deltas: 21% (9307/44316) Resolving deltas: 22% (9750/44316) Resolving deltas: 23% (10193/44316) Resolving deltas: 24% (10636/44316) Resolving deltas: 25% (11079/44316) Resolving deltas: 26% (11523/44316) Resolving deltas: 27% (11966/44316) Resolving deltas: 28% (12410/44316) Resolving deltas: 29% (12852/44316) Resolving deltas: 30% (13295/44316) Resolving deltas: 31% (13739/44316) Resolving deltas: 32% (14182/44316) Resolving deltas: 33% (14625/44316) Resolving deltas: 34% (15069/44316) Resolving deltas: 35% (15511/44316) Resolving deltas: 36% (15954/44316) Resolving deltas: 37% (16397/44316) Resolving deltas: 38% (16841/44316) Resolving deltas: 39% (17284/44316) Resolving deltas: 40% (17727/44316) Resolving deltas: 41% (18170/44316) Resolving deltas: 42% (18613/44316) Resolving deltas: 43% (19057/44316) Resolving deltas: 44% (19502/44316) Resolving deltas: 45% (19943/44316) Resolving deltas: 46% (20386/44316) Resolving deltas: 47% (20829/44316) Resolving deltas: 48% (21272/44316) Resolving deltas: 49% (21716/44316) Resolving deltas: 50% (22158/44316) Resolving deltas: 51% (22602/44316) Resolving deltas: 52% (23045/44316) Resolving deltas: 53% (23490/44316) Resolving deltas: 54% (23931/44316) Resolving deltas: 55% (24376/44316) Resolving deltas: 56% (24818/44316) Resolving deltas: 57% (25261/44316) Resolving deltas: 58% (25704/44316) Resolving deltas: 59% (26147/44316) Resolving deltas: 60% (26591/44316) Resolving deltas: 61% (27033/44316) Resolving deltas: 62% (27476/44316) Resolving deltas: 63% (27920/44316) Resolving deltas: 64% (28363/44316) Resolving deltas: 65% (28806/44316) Resolving deltas: 66% (29249/44316) Resolving deltas: 67% (29692/44316) Resolving deltas: 68% (30135/44316) Resolving deltas: 69% (30579/44316) Resolving deltas: 70% (31022/44316) Resolving deltas: 71% (31465/44316) Resolving deltas: 72% (31908/44316) Resolving deltas: 73% (32351/44316) Resolving deltas: 74% (32794/44316) Resolving deltas: 75% (33240/44316) Resolving deltas: 76% (33681/44316) Resolving deltas: 77% (34125/44316) Resolving deltas: 78% (34567/44316) Resolving deltas: 79% (35010/44316) Resolving deltas: 80% (35454/44316) Resolving deltas: 81% (35896/44316) Resolving deltas: 82% (36340/44316) Resolving deltas: 83% (36783/44316) Resolving deltas: 84% (37226/44316) Resolving deltas: 85% (37669/44316) Resolving deltas: 86% (38112/44316) Resolving deltas: 87% (38555/44316) Resolving deltas: 88% (38999/44316) Resolving deltas: 89% (39442/44316) Resolving deltas: 90% (39885/44316) Resolving deltas: 91% (40328/44316) Resolving deltas: 92% (40771/44316) Resolving deltas: 93% (41214/44316) Resolving deltas: 94% (41658/44316) Resolving deltas: 95% (42101/44316) Resolving deltas: 96% (42544/44316) Resolving deltas: 97% (42987/44316) Resolving deltas: 98% (43430/44316) Resolving deltas: 99% (43873/44316) Resolving deltas: 100% (44316/44316) Resolving deltas: 100% (44316/44316), done.
  9. 8.17 s Fetching commit e848309923f9136d533613bb15d1029beb045263 for push-vrpyqyylypmw ...
  10. 8.17 s $ /nix/store/bcnisk3ydfgv26v2gw3zlky24g00yww2-git-2.54.0/bin/git fetch origin e848309923f9136d533613bb15d1029beb045263
  11. 8.66 s From https://github.com/alphal00p/gammaloop
  12. 8.66 s * branch e848309923f9136d533613bb15d1029beb045263 -> FETCH_HEAD
  13. 8.68 s $ /nix/store/9ypz3flqsrl5xl495mm8h645gadjsxi1-coreutils-9.11/bin/timeout --kill-after=15s 7200s /nix/store/bcnisk3ydfgv26v2gw3zlky24g00yww2-git-2.54.0/bin/git -c advice.detachedHead=false checkout e848309923f9136d533613bb15d1029beb045263
  14. 8.89 s HEAD is now at e8483099 fix Python extension artifact builds
  15. 8.89 s $ /nix/store/9ypz3flqsrl5xl495mm8h645gadjsxi1-coreutils-9.11/bin/timeout --kill-after=15s 7200s /nix/store/23zk8sgzamrbmj1fday15szf7f2279s8-nix-2.34.7/bin/nix --extra-experimental-features nix-command --extra-experimental-features flakes --log-format internal-json run .#packages.x86_64-linux.nix-ci-check-gammaloop-doctest --print-build-logs
  16. 13.64 s
  17. 13.80 s Downloading cached boehm-gc from https://cache.nix-ci.com
  18. 13.82 s Downloading cached busybox from https://cache.nix-ci.com
  19. 13.82 s Downloading cached aws-c-common from https://cache.nix-ci.com
  20. 13.82 s Downloading cached editline-1.17.1-unstable-2025-05 from https://cache.nix-ci.com
  21. 13.82 s Downloading cached libcpuid from https://cache.nix-ci.com
  22. 13.82 s Downloading cached libseccomp-2.6.0-lib from https://cache.nix-ci.com
  23. 13.82 s Downloading cached libsodium-1.0.22-unstable-2026-04 from https://cache.nix-ci.com
  24. 13.82 s Downloading cached lowdown-3.0.1-lib from https://cache.nix-ci.com
  25. 13.82 s Downloading cached icu4c from https://cache.nix-ci.com
  26. 13.82 s Downloading cached libxml2 from https://cache.nix-ci.com
  27. 13.82 s Downloading cached llhttp from https://cache.nix-ci.com
  28. 13.82 s Downloading cached s2n-tls from https://cache.nix-ci.com
  29. 13.82 s Downloading cached hwloc-2.14.0-lib from https://cache.nix-ci.com
  30. 13.86 s Downloaded cached llhttp (89 KiB) in 37ms
  31. 13.86 s Progress: 0 of 1 built, 1 of 40 downloaded from cache (12 downloading)
  32. 13.86 s Downloading cached libgit2-1.9.4-lib from https://cache.nix-ci.com
  33. 13.86 s Downloaded cached boehm-gc (312 KiB) in 52ms
  34. 13.86 s Progress: 0 of 1 built, 2 of 40 downloaded from cache (12 downloading)
  35. 13.86 s Downloaded cached editline-1.17.1-unstable-2025-05 (58 KiB) in 40ms
  36. 13.86 s Progress: 0 of 1 built, 3 of 40 downloaded from cache (11 downloading)
  37. 13.86 s Downloaded cached libseccomp-2.6.0-lib (193 KiB) in 44ms
  38. 13.86 s Progress: 0 of 1 built, 4 of 40 downloaded from cache (10 downloading)
  39. 13.86 s Downloaded cached libcpuid (326 KiB) in 46ms
  40. 13.86 s Progress: 0 of 1 built, 5 of 40 downloaded from cache (9 downloading)
  41. 13.87 s Downloaded cached busybox (230 KiB) in 49ms
  42. 13.87 s Progress: 0 of 1 built, 6 of 40 downloaded from cache (8 downloading)
  43. 13.87 s Downloaded cached lowdown-3.0.1-lib (341 KiB) in 49ms
  44. 13.87 s Progress: 0 of 1 built, 7 of 40 downloaded from cache (7 downloading)
  45. 13.87 s Downloaded cached hwloc-2.14.0-lib (459 KiB) in 52ms
  46. 13.87 s Progress: 0 of 1 built, 8 of 40 downloaded from cache (6 downloading)
  47. 13.87 s Downloading cached onetbb from https://cache.nix-ci.com
  48. 13.87 s Downloaded cached libsodium-1.0.22-unstable-2026-04 (666 KiB) in 57ms
  49. 13.87 s Progress: 0 of 1 built, 9 of 40 downloaded from cache (6 downloading)
  50. 13.88 s Downloaded cached aws-c-common (1.1 MiB) in 58ms
  51. 13.88 s Progress: 0 of 1 built, 10 of 40 downloaded from cache (5 downloading)
  52. 13.88 s Downloading cached aws-c-cal from https://cache.nix-ci.com
  53. 13.88 s Downloading cached aws-c-compression from https://cache.nix-ci.com
  54. 13.88 s Downloading cached aws-c-sdkutils from https://cache.nix-ci.com
  55. 13.88 s Downloading cached aws-checksums from https://cache.nix-ci.com
  56. 13.89 s Downloaded cached s2n-tls (1.3 MiB) in 71ms
  57. 13.89 s Progress: 0 of 1 built, 11 of 40 downloaded from cache (8 downloading)
  58. 13.89 s Downloaded cached libxml2 (1.4 MiB) in 72ms
  59. 13.89 s Progress: 0 of 1 built, 12 of 40 downloaded from cache (7 downloading)
  60. 13.89 s Downloading cached libarchive-3.8.8-lib from https://cache.nix-ci.com
  61. 13.90 s Downloaded cached libgit2-1.9.4-lib (1.6 MiB) in 47ms
  62. 13.90 s Progress: 0 of 1 built, 13 of 40 downloaded from cache (7 downloading)
  63. 13.92 s Downloaded cached aws-c-compression (31 KiB) in 46ms
  64. 13.92 s Progress: 0 of 1 built, 14 of 40 downloaded from cache (6 downloading)
  65. 13.92 s Downloaded cached aws-c-cal (158 KiB) in 47ms
  66. 13.92 s Downloaded cached aws-checksums (86 KiB) in 47ms
  67. 13.92 s Progress: 0 of 1 built, 15 of 40 downloaded from cache (5 downloading)
  68. 13.93 s Progress: 0 of 1 built, 16 of 40 downloaded from cache (5 downloading)
  69. 13.93 s Downloading cached aws-c-io from https://cache.nix-ci.com
  70. 13.93 s Downloaded cached aws-c-sdkutils (155 KiB) in 48ms
  71. 13.93 s Progress: 0 of 1 built, 17 of 40 downloaded from cache (4 downloading)
  72. 13.93 s Downloaded cached onetbb (626 KiB) in 55ms
  73. 13.93 s Progress: 0 of 1 built, 18 of 40 downloaded from cache (3 downloading)
  74. 13.93 s Downloading cached libblake3 from https://cache.nix-ci.com
  75. 13.94 s Downloaded cached libarchive-3.8.8-lib (953 KiB) in 54ms
  76. 13.94 s Progress: 0 of 1 built, 19 of 40 downloaded from cache (3 downloading)
  77. 13.97 s Downloaded cached libblake3 (117 KiB) in 44ms
  78. 13.97 s Progress: 0 of 1 built, 20 of 40 downloaded from cache (2 downloading)
  79. 13.97 s Downloaded cached aws-c-io (648 KiB) in 48ms
  80. 13.97 s Progress: 0 of 1 built, 21 of 40 downloaded from cache (1 downloading)
  81. 13.97 s Downloading cached aws-c-event-stream from https://cache.nix-ci.com
  82. 13.97 s Downloading cached aws-c-http from https://cache.nix-ci.com
  83. 14.02 s Downloaded cached icu4c (38.2 MiB) in 200ms
  84. 14.02 s Progress: 0 of 1 built, 22 of 40 downloaded from cache (2 downloading)
  85. 14.02 s Downloading cached boost from https://cache.nix-ci.com
  86. 14.02 s Downloaded cached aws-c-event-stream (176 KiB) in 45ms
  87. 14.02 s Progress: 0 of 1 built, 23 of 40 downloaded from cache (2 downloading)
  88. 14.02 s Downloaded cached aws-c-http (641 KiB) in 46ms
  89. 14.02 s Progress: 0 of 1 built, 24 of 40 downloaded from cache (1 downloading)
  90. 14.02 s Downloading cached aws-c-auth from https://cache.nix-ci.com
  91. 14.02 s Downloading cached aws-c-mqtt from https://cache.nix-ci.com
  92. 14.04 s Downloaded cached aws-c-auth (387 KiB) in 20ms
  93. 14.04 s Progress: 0 of 1 built, 25 of 40 downloaded from cache (2 downloading)
  94. 14.04 s Downloading cached aws-c-s3 from https://cache.nix-ci.com
  95. 14.04 s Downloaded cached aws-c-mqtt (557 KiB) in 22ms
  96. 14.04 s Progress: 0 of 1 built, 26 of 40 downloaded from cache (2 downloading)
  97. 14.07 s Downloaded cached boost (14.5 MiB) in 52ms
  98. 14.07 s Progress: 0 of 1 built, 27 of 40 downloaded from cache (1 downloading)
  99. 14.07 s Downloading cached nix-util from https://cache.nix-ci.com
  100. 14.07 s Downloaded cached aws-c-s3 (384 KiB) in 30ms
  101. 14.07 s Progress: 0 of 1 built, 28 of 40 downloaded from cache (1 downloading)
  102. 14.07 s Downloading cached aws-crt-cpp from https://cache.nix-ci.com
  103. 14.09 s Downloaded cached aws-crt-cpp (979 KiB) in 14ms
  104. 14.09 s Progress: 0 of 1 built, 29 of 40 downloaded from cache (1 downloading)
  105. 14.18 s Downloaded cached nix-util (2.4 MiB) in 105ms
  106. 14.18 s Progress: 0 of 1 built, 30 of 40 downloaded from cache
  107. 14.18 s Downloading cached nix-nswrapper from https://cache.nix-ci.com
  108. 14.18 s Downloading cached nix-store from https://cache.nix-ci.com
  109. 14.19 s Downloaded cached nix-nswrapper (131 KiB) in 11ms
  110. 14.19 s Progress: 0 of 1 built, 31 of 40 downloaded from cache (1 downloading)
  111. 14.21 s Downloaded cached nix-store (5.8 MiB) in 32ms
  112. 14.21 s Progress: 0 of 1 built, 32 of 40 downloaded from cache
  113. 14.21 s Downloading cached nix-fetchers from https://cache.nix-ci.com
  114. 14.21 s Downloading cached nix-main from https://cache.nix-ci.com
  115. 14.23 s Downloaded cached nix-main (393 KiB) in 16ms
  116. 14.23 s Progress: 0 of 1 built, 33 of 40 downloaded from cache (1 downloading)
  117. 14.23 s Downloaded cached nix-fetchers (1.5 MiB) in 17ms
  118. 14.23 s Progress: 0 of 1 built, 34 of 40 downloaded from cache
  119. 14.23 s Downloading cached nix-expr from https://cache.nix-ci.com
  120. 14.34 s Downloaded cached nix-expr (3.3 MiB) in 109ms
  121. 14.34 s Progress: 0 of 1 built, 35 of 40 downloaded from cache
  122. 14.34 s Downloading cached nix-flake from https://cache.nix-ci.com
  123. 14.35 s Downloaded cached nix-flake (956 KiB) in 15ms
  124. 14.35 s Progress: 0 of 1 built, 36 of 40 downloaded from cache
  125. 14.35 s Downloading cached nix-cmd from https://cache.nix-ci.com
  126. 14.37 s Downloaded cached nix-cmd (1 MiB) in 14ms
  127. 14.37 s Progress: 0 of 1 built, 37 of 40 downloaded from cache
  128. 14.37 s Downloading cached nix from https://cache.nix-ci.com
  129. 14.39 s Downloaded cached nix (3.9 MiB) in 24ms
  130. 14.39 s Progress: 0 of 1 built, 38 of 40 downloaded from cache
  131. 14.39 s Downloading cached nix from https://cache.nix-ci.com
  132. 14.41 s Downloaded cached nix (8848 B) in 18ms
  133. 14.41 s Progress: 0 of 1 built, 39 of 40 downloaded from cache
  134. 14.41 s Downloading cached nix-ci-check-gammaloop-doctest from https://cache.nix-ci.com
  135. 14.42 s Downloaded cached nix-ci-check-gammaloop-doctest (1000 B) in 4ms
  136. 14.42 s Progress: 0 of 1 built, 40 of 40 downloaded from cache
  137. 17.08 s evaluating derivation 'g copying '/nix/store/lvky evaluating derivation 'g querying gammaloop-works [0.0 KiB DL] querying ga [0.0 KiB DL] querying in [0/1 built, 0.0 KiB DL] [1/0/1 built, 0.0 KiB DLgammaloop-workspace-doctest> Running phase: unpackPhase
  138. 17.10 s gammaloop-workspace-doctest> unpacking source archive /nix/store/n62xwv096bc248rr6y7qpggfdbwshkw9-source
  139. 17.23 s gammaloop-workspace-doctest> source root is source
  140. 17.26 s gammaloop-workspace-doctest> Running phase: patchPhase
  141. 17.27 s gammaloop-workspace-doctest> Executing configureCargoCommonVars
  142. 17.27 s gammaloop-workspace-doctest> decompressing cargo artifacts from /nix/store/kbgwngi7xvi54jsr0kp8rhj1b9mfja7d-gammaloop-workspace-deps-deps-0.1.0/target.tar.zst to target
  143. 18.67 s gammaloop-workspace-doctest> Running phase: updateAutotoolsGnuConfigScriptsPhase
  144. 18.70 s gammaloop-workspace-doctest> Running phase: configurePhase
  145. 18.71 s gammaloop-workspace-doctest> will append /build/source/.cargo-home/config.toml with contents of /nix/store/xdy1vvhll2bijdplvl9fcc2b9plkxhaa-vendor-cargo-deps/config.toml
  146. 18.71 s gammaloop-workspace-doctest> default configurePhase, nothing to do
  147. 18.71 s gammaloop-workspace-doctest> Running phase: buildPhase
  148. 18.72 s gammaloop-workspace-doctest> +++ command cargo --version
  149. 18.72 s gammaloop-workspace-doctest> cargo 1.97.0 (c980f4866 2026-06-30)
  150. 18.75 s gammaloop-workspace-doctest> +++ command cargo test --profile ci-optim --doc --locked --workspace --features gammaloop-api/cli,gammaloop-tracing-filter/clap,gammaloop-tracing-filter/symbolica,idenso/bincode,idenso/reference-cases,linnet/bincode,linnet/drawing,linnet/nodestore-vec,linnet/rkyv,linnet/serde,linnet/symbolica,spenso-macros/shadowing,spenso/shadowing,symbolica/tracing_max_level_info
  151. 19.25 s gammaloop-workspace-doctest> Compiling target-lexicon v0.13.5
  152. 19.28 s gammaloop-workspace-doctest> Compiling symbolica v2.2.0 (https://github.com/symbolica-dev/symbolica?branch=dev#0441bd7a)
  153. 19.28 s gammaloop-workspace-doctest> Compiling maplit v1.0.2
  154. 19.28 s gammaloop-workspace-doctest> Compiling gammaloop-tracing-filter-macros v0.1.0 (/build/source/crates/gammaloop-tracing-filter-macros)
  155. 19.28 s gammaloop-workspace-doctest> Compiling vakint v0.1.2 (/build/source/crates/vakint)
  156. 19.29 s gammaloop-workspace-doctest> Compiling gammalooprs v0.3.4 (/build/source/crates/gammalooprs)
  157. 19.29 s gammaloop-workspace-doctest> Compiling alphal00p-docs-macros v0.1.0 (/build/source/crates/alphal00p-docs-macros)
  158. 19.29 s gammaloop-workspace-doctest> Compiling alphal00p-docs-schema v0.1.0 (/build/source/crates/alphal00p-docs-schema)
  159. 19.30 s gammaloop-workspace-doctest> Compiling rustc_version v0.4.1
  160. 19.30 s gammaloop-workspace-doctest> Compiling bincode v1.3.3
  161. 19.30 s gammaloop-workspace-doctest> Compiling target-triple v1.0.1
  162. 19.31 s gammaloop-workspace-doctest> Compiling gungraun-runner v0.18.2
  163. 19.31 s gammaloop-workspace-doctest> Compiling iai-callgrind-runner v0.14.2
  164. 19.31 s gammaloop-workspace-doctest> Compiling clinnet v0.1.8 (/build/source/crates/clinnet)
  165. 19.31 s gammaloop-workspace-doctest> Compiling gammaloop-integration-tests v0.1.0 (/build/source/tests)
  166. 19.49 s gammaloop-workspace-doctest> Compiling test-log-core v0.2.20
  167. 19.50 s gammaloop-workspace-doctest> Compiling wait-timeout v0.2.1
  168. 19.52 s gammaloop-workspace-doctest> Compiling iai-callgrind v0.14.2
  169. 19.54 s gammaloop-workspace-doctest> Compiling quick-error v1.2.3
  170. 19.57 s gammaloop-workspace-doctest> Compiling bit-vec v0.8.0
  171. 19.59 s gammaloop-workspace-doctest> Compiling rusty-fork v0.3.1
  172. 19.78 s gammaloop-workspace-doctest> Compiling bit-set v0.8.0
  173. 19.82 s gammaloop-workspace-doctest> Compiling iai-callgrind-macros v0.5.1
  174. 19.85 s gammaloop-workspace-doctest> Compiling rand_xorshift v0.4.0
  175. 19.93 s gammaloop-workspace-doctest> Compiling gungraun-macros v0.8.0
  176. 19.96 s gammaloop-workspace-doctest> Compiling console v0.15.11
  177. 19.99 s gammaloop-workspace-doctest> Compiling termcolor v1.4.1
  178. 20.05 s gammaloop-workspace-doctest> Compiling unarray v0.1.4
  179. 20.11 s gammaloop-workspace-doctest> Compiling glob v0.3.4
  180. 20.18 s gammaloop-workspace-doctest> Compiling base64 v0.21.7
  181. 20.39 s gammaloop-workspace-doctest> Compiling similar-asserts v1.7.0
  182. 20.48 s gammaloop-workspace-doctest> Compiling alphal00p-docs-catalogs v0.1.0 (/build/source/crates/alphal00p-docs-catalogs)
  183. 20.58 s gammaloop-workspace-doctest> Compiling ron v0.8.1
  184. 20.68 s gammaloop-workspace-doctest> Compiling pyo3-build-config v0.28.3
  185. 20.69 s gammaloop-workspace-doctest> Compiling trybuild v1.0.120
  186. 20.72 s gammaloop-workspace-doctest> Compiling alphal00p-docs-builder v0.1.0 (/build/source/crates/alphal00p-docs-builder)
  187. 20.91 s gammaloop-workspace-doctest> Compiling proptest v1.11.0
  188. 20.94 s gammaloop-workspace-doctest> Compiling kurvst v0.1.0 (/build/source/crates/kurvst)
  189. 21.21 s gammaloop-workspace-doctest> Compiling test-log-macros v0.2.20
  190. 24.90 s gammaloop-workspace-doctest> Compiling alphal00p-docs-examples v0.1.0 (/build/source/crates/alphal00p-docs-examples)
  191. 25.58 s gammaloop-workspace-doctest> Compiling test-log v0.2.20
  192. 28.82 s gammaloop-workspace-doctest> Compiling pyo3-macros-backend v0.28.3
  193. 28.86 s gammaloop-workspace-doctest> Compiling pyo3-ffi v0.28.3
  194. 28.87 s gammaloop-workspace-doctest> Compiling pyo3 v0.28.3
  195. 29.11 s gammaloop-workspace-doctest> Compiling numpy v0.28.0
  196. 29.29 s gammaloop-workspace-doctest> Compiling gammaloop-api v0.1.0 (/build/source/crates/gammaloop-api)
  197. 29.72 s gammaloop-workspace-doctest> Compiling gungraun v0.18.2
  198. 38.61 s gammaloop-workspace-doctest> Compiling pyo3-macros v0.28.3
  199. 43.89 s gammaloop-workspace-doctest> Compiling pyo3-stub-gen v0.17.2
  200. 44.56 s gammaloop-workspace-doctest> Compiling numerica v2.2.0 (https://github.com/symbolica-dev/symbolica?branch=dev#0441bd7a)
  201. 46.82 s gammaloop-workspace-doctest> Compiling graphica v2.1.0 (https://github.com/symbolica-dev/symbolica?branch=dev#0441bd7a)
  202. 49.77 s gammaloop-workspace-doctest> Compiling symbolica-utils v0.1.0 (/build/source/crates/symbolica-utils)
  203. 214.04 s gammaloop-workspace-doctest> Compiling gammaloop-workspace-hack v0.1.0 (/build/source/crates/gammaloop-workspace-hack)
  204. 215.55 s gammaloop-workspace-doctest> Compiling spenso-macros v0.3.2 (/build/source/crates/spenso-macros)
  205. 215.55 s gammaloop-workspace-doctest> Compiling linnet v0.17.0 (/build/source/crates/linnet)
  206. 218.17 s gammaloop-workspace-doctest> Compiling spenso v0.6.0 (/build/source/crates/spenso)
  207. 227.44 s gammaloop-workspace-doctest> Compiling idenso v0.3.0 (/build/source/crates/idenso)
  208. 227.45 s gammaloop-workspace-doctest> Compiling gammaloop-tracing-filter v0.1.0 (/build/source/crates/gammaloop-tracing-filter)
  209. 232.87 s gammaloop-workspace-doctest> Compiling spenso-hep-lib v0.1.7 (/build/source/crates/spenso-hep-lib)
  210. 233.33 s gammaloop-workspace-doctest> Compiling spynso3 v0.1.2 (/build/source/crates/spynso3)
  211. 293.68 s gammaloop-workspace-doctest> Compiling linnest v0.1.0 (/build/source/crates/linnest)
  212. 293.69 s gammaloop-workspace-doctest> Compiling linnet-py v0.1.0 (/build/source/crates/linnet-py)
  213. 449.39 s gammaloop-workspace-doctest> Finished `ci-optim` profile [optimized] target(s) in 7m 10s
  214. 449.51 s gammaloop-workspace-doctest> warning: the following packages contain code that will be rejected by a future version of Rust: proc-macro-error2 v2.0.1
  215. 449.51 s gammaloop-workspace-doctest> note: to see what the problems were, use the option `--future-incompat-report`, or run `cargo report future-incompatibilities --id 1`
  216. 449.53 s gammaloop-workspace-doctest> Doc-tests alphal00p_docs_builder
  217. 449.68 s gammaloop-workspace-doctest>
  218. 449.68 s gammaloop-workspace-doctest> running 0 tests
  219. 449.68 s gammaloop-workspace-doctest>
  220. 449.68 s gammaloop-workspace-doctest> test result: ok. 0 passed; 0 failed; 0 ignored; 0 measured; 0 filtered out; finished in 0.00s
  221. 449.68 s gammaloop-workspace-doctest>
  222. 449.68 s gammaloop-workspace-doctest> Doc-tests alphal00p_docs_catalogs
  223. 450.91 s gammaloop-workspace-doctest>
  224. 450.91 s gammaloop-workspace-doctest> running 0 tests
  225. 450.91 s gammaloop-workspace-doctest>
  226. 450.91 s gammaloop-workspace-doctest> test result: ok. 0 passed; 0 failed; 0 ignored; 0 measured; 0 filtered out; finished in 0.00s
  227. 450.91 s gammaloop-workspace-doctest>
  228. 450.91 s gammaloop-workspace-doctest> Doc-tests alphal00p_docs_examples
  229. 450.93 s gammaloop-workspace-doctest>
  230. 450.93 s gammaloop-workspace-doctest> running 0 tests
  231. 450.93 s gammaloop-workspace-doctest>
  232. 450.93 s gammaloop-workspace-doctest> test result: ok. 0 passed; 0 failed; 0 ignored; 0 measured; 0 filtered out; finished in 0.00s
  233. 450.93 s gammaloop-workspace-doctest>
  234. 450.93 s gammaloop-workspace-doctest> Doc-tests alphal00p_docs
  235. 450.99 s gammaloop-workspace-doctest>
  236. 450.99 s gammaloop-workspace-doctest> running 0 tests
  237. 450.99 s gammaloop-workspace-doctest>
  238. 450.99 s gammaloop-workspace-doctest> test result: ok. 0 passed; 0 failed; 0 ignored; 0 measured; 0 filtered out; finished in 0.00s
  239. 450.99 s gammaloop-workspace-doctest>
  240. 450.99 s gammaloop-workspace-doctest> Doc-tests alphal00p_docs_schema
  241. 451.07 s gammaloop-workspace-doctest>
  242. 451.07 s gammaloop-workspace-doctest> running 0 tests
  243. 451.07 s gammaloop-workspace-doctest>
  244. 451.07 s gammaloop-workspace-doctest> test result: ok. 0 passed; 0 failed; 0 ignored; 0 measured; 0 filtered out; finished in 0.00s
  245. 451.07 s gammaloop-workspace-doctest>
  246. 451.07 s gammaloop-workspace-doctest> Doc-tests clinnet
  247. 451.11 s gammaloop-workspace-doctest>
  248. 451.11 s gammaloop-workspace-doctest> running 0 tests
  249. 451.11 s gammaloop-workspace-doctest>
  250. 451.11 s gammaloop-workspace-doctest> test result: ok. 0 passed; 0 failed; 0 ignored; 0 measured; 0 filtered out; finished in 0.00s
  251. 451.11 s gammaloop-workspace-doctest>
  252. 451.11 s gammaloop-workspace-doctest> Doc-tests gammaloop_api
  253. 452.08 s gammaloop-workspace-doctest>
  254. 452.08 s gammaloop-workspace-doctest> running 13 tests
  255. 452.10 s gammaloop-workspace-doctest> test crates/gammaloop-api/src/python.rs - python::GammaLoopAPI::get_active_command_blocks (line 3652) ... FAILED
  256. 452.10 s gammaloop-workspace-doctest> test crates/gammaloop-api/src/python.rs - python::GammaLoopAPI::evaluate_samples (line 3040) ... FAILED
  257. 452.10 s gammaloop-workspace-doctest> test crates/gammaloop-api/src/python.rs - python::GammaLoopAPI::evaluate_sample (line 2926) ... FAILED
  258. 452.10 s gammaloop-workspace-doctest> test crates/gammaloop-api/src/python.rs - python::GammaLoopAPI::get_default_runtime_settings (line 3688) ... FAILED
  259. 452.10 s gammaloop-workspace-doctest> test crates/gammaloop-api/src/python.rs - python::GammaLoopAPI::get_integrand_info (line 3496) ... FAILED
  260. 452.10 s gammaloop-workspace-doctest> test crates/gammaloop-api/src/python.rs - python::GammaLoopAPI::get_integrand_settings (line 3539) ... FAILED
  261. 452.19 s gammaloop-workspace-doctest> test crates/gammaloop-api/src/python.rs - python::GammaLoopAPI::run_command (line 3793) ... FAILED
  262. 452.19 s gammaloop-workspace-doctest> test crates/gammaloop-api/src/python.rs - python::GammaLoopAPI::get_run_history (line 3603) ... FAILED
  263. 452.20 s gammaloop-workspace-doctest> test crates/gammaloop-api/src/python.rs - python::evaluate_graph_overall_factor (line 95) ... FAILED
  264. 452.20 s gammaloop-workspace-doctest> test crates/gammaloop-api/src/python.rs - python::GammaLoopAPI::new_python (line 2804) ... FAILED
  265. 452.20 s gammaloop-workspace-doctest> test crates/gammaloop-api/src/python.rs - python::atom_to_canonical_string (line 128) ... FAILED
  266. 452.21 s gammaloop-workspace-doctest> test crates/gammaloop-api/src/python.rs - python::GammaLoopAPI::get_global_settings (line 3631) ... FAILED
  267. 452.22 s gammaloop-workspace-doctest> test crates/gammaloop-api/src/python.rs - python::atom_to_dots (line 157) ... FAILED
  268. 452.22 s gammaloop-workspace-doctest>
  269. 452.22 s gammaloop-workspace-doctest> failures:
  270. 452.22 s gammaloop-workspace-doctest>
  271. 452.22 s gammaloop-workspace-doctest> ---- crates/gammaloop-api/src/python.rs - python::GammaLoopAPI::get_active_command_blocks (line 3652) stdout ----
  272. 452.22 s gammaloop-workspace-doctest> error: expected item, found keyword `for`
  273. 452.22 s gammaloop-workspace-doctest> --> crates/gammaloop-api/src/python.rs:3653:1
  274. 452.22 s gammaloop-workspace-doctest> |
  275. 452.22 s gammaloop-workspace-doctest> 3653 | for name, commands in api.get_active_command_blocks().items():
  276. 452.22 s gammaloop-workspace-doctest> | ^^^ expected item
  277. 452.22 s gammaloop-workspace-doctest> |
  278. 452.22 s gammaloop-workspace-doctest> = note: for a full list of items that can appear in modules, see <https://doc.rust-lang.org/reference/items.html>
  279. 452.22 s gammaloop-workspace-doctest>
  280. 452.22 s gammaloop-workspace-doctest> error: aborting due to 1 previous error
  281. 452.22 s gammaloop-workspace-doctest>
  282. 452.22 s gammaloop-workspace-doctest> Couldn't compile the test.
  283. 452.22 s gammaloop-workspace-doctest> ---- crates/gammaloop-api/src/python.rs - python::GammaLoopAPI::evaluate_samples (line 3040) stdout ----
  284. 452.22 s gammaloop-workspace-doctest> error: expected one of `!` or `::`, found `=`
  285. 452.22 s gammaloop-workspace-doctest> --> crates/gammaloop-api/src/python.rs:3041:8
  286. 452.22 s gammaloop-workspace-doctest> |
  287. 452.22 s gammaloop-workspace-doctest> 3041 | points = numpy.asarray(points, dtype=numpy.float64)
  288. 452.22 s gammaloop-workspace-doctest> | ^ expected one of `!` or `::`
  289. 452.22 s gammaloop-workspace-doctest>
  290. 452.22 s gammaloop-workspace-doctest> error: aborting due to 1 previous error
  291. 452.22 s gammaloop-workspace-doctest>
  292. 452.22 s gammaloop-workspace-doctest> Couldn't compile the test.
  293. 452.22 s gammaloop-workspace-doctest> ---- crates/gammaloop-api/src/python.rs - python::GammaLoopAPI::evaluate_sample (line 2926) stdout ----
  294. 452.22 s gammaloop-workspace-doctest> error: expected one of `!` or `::`, found `=`
  295. 452.22 s gammaloop-workspace-doctest> --> crates/gammaloop-api/src/python.rs:2927:8
  296. 452.22 s gammaloop-workspace-doctest> |
  297. 452.22 s gammaloop-workspace-doctest> 2927 | result = api.evaluate_sample(point, process_id=0, minimal_output=True)
  298. 452.22 s gammaloop-workspace-doctest> | ^ expected one of `!` or `::`
  299. 452.22 s gammaloop-workspace-doctest>
  300. 452.22 s gammaloop-workspace-doctest> error: aborting due to 1 previous error
  301. 452.22 s gammaloop-workspace-doctest>
  302. 452.22 s gammaloop-workspace-doctest> Couldn't compile the test.
  303. 452.22 s gammaloop-workspace-doctest> ---- crates/gammaloop-api/src/python.rs - python::GammaLoopAPI::get_default_runtime_settings (line 3688) stdout ----
  304. 452.22 s gammaloop-workspace-doctest> error: expected one of `!` or `::`, found `=`
  305. 452.22 s gammaloop-workspace-doctest> --> crates/gammaloop-api/src/python.rs:3689:9
  306. 452.22 s gammaloop-workspace-doctest> |
  307. 452.22 s gammaloop-workspace-doctest> 3689 | runtime = api.get_default_runtime_settings()
  308. 452.22 s gammaloop-workspace-doctest> | ^ expected one of `!` or `::`
  309. 452.22 s gammaloop-workspace-doctest>
  310. 452.22 s gammaloop-workspace-doctest> error: aborting due to 1 previous error
  311. 452.22 s gammaloop-workspace-doctest>
  312. 452.22 s gammaloop-workspace-doctest> Couldn't compile the test.
  313. 452.22 s gammaloop-workspace-doctest> ---- crates/gammaloop-api/src/python.rs - python::GammaLoopAPI::get_integrand_info (line 3496) stdout ----
  314. 452.22 s gammaloop-workspace-doctest> error: expected one of `!` or `::`, found `=`
  315. 452.22 s gammaloop-workspace-doctest> --> crates/gammaloop-api/src/python.rs:3497:6
  316. 452.22 s gammaloop-workspace-doctest> |
  317. 452.22 s gammaloop-workspace-doctest> 3497 | info = api.get_integrand_info(process_id=0)
  318. 452.22 s gammaloop-workspace-doctest> | ^ expected one of `!` or `::`
  319. 452.22 s gammaloop-workspace-doctest>
  320. 452.22 s gammaloop-workspace-doctest> error: aborting due to 1 previous error
  321. 452.22 s gammaloop-workspace-doctest>
  322. 452.22 s gammaloop-workspace-doctest> Couldn't compile the test.
  323. 452.22 s gammaloop-workspace-doctest> ---- crates/gammaloop-api/src/python.rs - python::GammaLoopAPI::get_integrand_settings (line 3539) stdout ----
  324. 452.22 s gammaloop-workspace-doctest> error: expected one of `!` or `::`, found `=`
  325. 452.22 s gammaloop-workspace-doctest> --> crates/gammaloop-api/src/python.rs:3540:10
  326. 452.22 s gammaloop-workspace-doctest> |
  327. 452.22 s gammaloop-workspace-doctest> 3540 | settings = api.get_integrand_settings(process_id=0)
  328. 452.22 s gammaloop-workspace-doctest> | ^ expected one of `!` or `::`
  329. 452.22 s gammaloop-workspace-doctest>
  330. 452.22 s gammaloop-workspace-doctest> error: aborting due to 1 previous error
  331. 452.22 s gammaloop-workspace-doctest>
  332. 452.22 s gammaloop-workspace-doctest> Couldn't compile the test.
  333. 452.22 s gammaloop-workspace-doctest> ---- crates/gammaloop-api/src/python.rs - python::GammaLoopAPI::run_command (line 3793) stdout ----
  334. 452.22 s gammaloop-workspace-doctest> error[E0425]: cannot find value `api` in this scope
  335. 452.22 s gammaloop-workspace-doctest> --> crates/gammaloop-api/src/python.rs:3794:1
  336. 452.22 s gammaloop-workspace-doctest> |
  337. 452.22 s gammaloop-workspace-doctest> 3794 | api.run("display processes")
  338. 452.22 s gammaloop-workspace-doctest> | ^^^ not found in this scope
  339. 452.22 s gammaloop-workspace-doctest>
  340. 452.22 s gammaloop-workspace-doctest> error: aborting due to 1 previous error
  341. 452.22 s gammaloop-workspace-doctest>
  342. 452.22 s gammaloop-workspace-doctest> For more information about this error, try `rustc --explain E0425`.
  343. 452.22 s gammaloop-workspace-doctest> Couldn't compile the test.
  344. 452.22 s gammaloop-workspace-doctest> ---- crates/gammaloop-api/src/python.rs - python::GammaLoopAPI::get_run_history (line 3603) stdout ----
  345. 452.22 s gammaloop-workspace-doctest> error[E0425]: cannot find value `run_card_toml` in this scope
  346. 452.22 s gammaloop-workspace-doctest> --> crates/gammaloop-api/src/python.rs:3604:1
  347. 452.22 s gammaloop-workspace-doctest> |
  348. 452.22 s gammaloop-workspace-doctest> 3604 | run_card_toml = api.get_run_history()
  349. 452.22 s gammaloop-workspace-doctest> | ^^^^^^^^^^^^^
  350. 452.22 s gammaloop-workspace-doctest> |
  351. 452.22 s gammaloop-workspace-doctest> help: you might have meant to introduce a new binding
  352. 452.22 s gammaloop-workspace-doctest> |
  353. 452.22 s gammaloop-workspace-doctest> 3604 | let run_card_toml = api.get_run_history()
  354. 452.22 s gammaloop-workspace-doctest> | +++
  355. 452.22 s gammaloop-workspace-doctest>
  356. 452.22 s gammaloop-workspace-doctest> error[E0425]: cannot find value `api` in this scope
  357. 452.22 s gammaloop-workspace-doctest> --> crates/gammaloop-api/src/python.rs:3604:17
  358. 452.22 s gammaloop-workspace-doctest> |
  359. 452.22 s gammaloop-workspace-doctest> 3604 | run_card_toml = api.get_run_history()
  360. 452.22 s gammaloop-workspace-doctest> | ^^^ not found in this scope
  361. 452.22 s gammaloop-workspace-doctest>
  362. 452.22 s gammaloop-workspace-doctest> error: aborting due to 2 previous errors
  363. 452.22 s gammaloop-workspace-doctest>
  364. 452.22 s gammaloop-workspace-doctest> For more information about this error, try `rustc --explain E0425`.
  365. 452.22 s gammaloop-workspace-doctest> Couldn't compile the test.
  366. 452.22 s gammaloop-workspace-doctest> ---- crates/gammaloop-api/src/python.rs - python::evaluate_graph_overall_factor (line 95) stdout ----
  367. 452.22 s gammaloop-workspace-doctest> error[E0425]: cannot find function `evaluate_graph_overall_factor` in this scope
  368. 452.22 s gammaloop-workspace-doctest> --> crates/gammaloop-api/src/python.rs:96:1
  369. 452.22 s gammaloop-workspace-doctest> |
  370. 452.22 s gammaloop-workspace-doctest> 96 | evaluate_graph_overall_factor(
  371. 452.22 s gammaloop-workspace-doctest> | ^^^^^^^^^^^^^^^^^^^^^^^^^^^^^ not found in this scope
  372. 452.22 s gammaloop-workspace-doctest>
  373. 452.22 s gammaloop-workspace-doctest> error: aborting due to 1 previous error
  374. 452.22 s gammaloop-workspace-doctest>
  375. 452.22 s gammaloop-workspace-doctest> For more information about this error, try `rustc --explain E0425`.
  376. 452.22 s gammaloop-workspace-doctest> Couldn't compile the test.
  377. 452.22 s gammaloop-workspace-doctest> ---- crates/gammaloop-api/src/python.rs - python::GammaLoopAPI::new_python (line 2804) stdout ----
  378. 452.22 s gammaloop-workspace-doctest> error[E0425]: cannot find value `api` in this scope
  379. 452.22 s gammaloop-workspace-doctest> --> crates/gammaloop-api/src/python.rs:2805:1
  380. 452.22 s gammaloop-workspace-doctest> |
  381. 452.22 s gammaloop-workspace-doctest> 2805 | api = GammaLoopAPI(state_folder="./state", read_only_state=True)
  382. 452.22 s gammaloop-workspace-doctest> | ^^^
  383. 452.22 s gammaloop-workspace-doctest> |
  384. 452.22 s gammaloop-workspace-doctest> help: you might have meant to introduce a new binding
  385. 452.22 s gammaloop-workspace-doctest> |
  386. 452.22 s gammaloop-workspace-doctest> 2805 | let api = GammaLoopAPI(state_folder="./state", read_only_state=True)
  387. 452.22 s gammaloop-workspace-doctest> | +++
  388. 452.22 s gammaloop-workspace-doctest>
  389. 452.22 s gammaloop-workspace-doctest> error[E0425]: cannot find value `state_folder` in this scope
  390. 452.22 s gammaloop-workspace-doctest> --> crates/gammaloop-api/src/python.rs:2805:20
  391. 452.22 s gammaloop-workspace-doctest> |
  392. 452.22 s gammaloop-workspace-doctest> 2805 | api = GammaLoopAPI(state_folder="./state", read_only_state=True)
  393. 452.22 s gammaloop-workspace-doctest> | ^^^^^^^^^^^^ not found in this scope
  394. 452.22 s gammaloop-workspace-doctest>
  395. 452.22 s gammaloop-workspace-doctest> error[E0425]: cannot find value `read_only_state` in this scope
  396. 452.22 s gammaloop-workspace-doctest> --> crates/gammaloop-api/src/python.rs:2805:44
  397. 452.22 s gammaloop-workspace-doctest> |
  398. 452.22 s gammaloop-workspace-doctest> 2805 | api = GammaLoopAPI(state_folder="./state", read_only_state=True)
  399. 452.22 s gammaloop-workspace-doctest> | ^^^^^^^^^^^^^^^ not found in this scope
  400. 452.22 s gammaloop-workspace-doctest>
  401. 452.22 s gammaloop-workspace-doctest> error[E0425]: cannot find value `True` in this scope
  402. 452.22 s gammaloop-workspace-doctest> --> crates/gammaloop-api/src/python.rs:2805:60
  403. 452.22 s gammaloop-workspace-doctest> |
  404. 452.22 s gammaloop-workspace-doctest> 2805 | api = GammaLoopAPI(state_folder="./state", read_only_state=True)
  405. 452.22 s gammaloop-workspace-doctest> | ^^^^ not found in this scope
  406. 452.22 s gammaloop-workspace-doctest> |
  407. 452.22 s gammaloop-workspace-doctest> help: you may want to use a bool value instead
  408. 452.22 s gammaloop-workspace-doctest> |
  409. 452.22 s gammaloop-workspace-doctest> 2805 - api = GammaLoopAPI(state_folder="./state", read_only_state=True)
  410. 452.22 s gammaloop-workspace-doctest> 2805 + api = GammaLoopAPI(state_folder="./state", read_only_state=true)
  411. 452.22 s gammaloop-workspace-doctest> |
  412. 452.22 s gammaloop-workspace-doctest>
  413. 452.22 s gammaloop-workspace-doctest> error[E0425]: cannot find function, tuple struct or tuple variant `GammaLoopAPI` in this scope
  414. 452.22 s gammaloop-workspace-doctest> --> crates/gammaloop-api/src/python.rs:2805:7
  415. 452.22 s gammaloop-workspace-doctest> |
  416. 452.22 s gammaloop-workspace-doctest> 2805 | api = GammaLoopAPI(state_folder="./state", read_only_state=True)
  417. 452.22 s gammaloop-workspace-doctest> | ^^^^^^^^^^^^ not found in this scope
  418. 452.22 s gammaloop-workspace-doctest>
  419. 452.22 s gammaloop-workspace-doctest> error: aborting due to 5 previous errors
  420. 452.22 s gammaloop-workspace-doctest>
  421. 452.22 s gammaloop-workspace-doctest> For more information about this error, try `rustc --explain E0425`.
  422. 452.22 s gammaloop-workspace-doctest> Couldn't compile the test.
  423. 452.22 s gammaloop-workspace-doctest> ---- crates/gammaloop-api/src/python.rs - python::atom_to_canonical_string (line 128) stdout ----
  424. 452.22 s gammaloop-workspace-doctest> error[E0425]: cannot find function `atom_to_canonical_string` in this scope
  425. 452.22 s gammaloop-workspace-doctest> --> crates/gammaloop-api/src/python.rs:129:1
  426. 452.22 s gammaloop-workspace-doctest> |
  427. 452.22 s gammaloop-workspace-doctest> 129 | atom_to_canonical_string("x + x")
  428. 452.22 s gammaloop-workspace-doctest> | ^^^^^^^^^^^^^^^^^^^^^^^^ not found in this scope
  429. 452.22 s gammaloop-workspace-doctest>
  430. 452.22 s gammaloop-workspace-doctest> error: aborting due to 1 previous error
  431. 452.22 s gammaloop-workspace-doctest>
  432. 452.22 s gammaloop-workspace-doctest> For more information about this error, try `rustc --explain E0425`.
  433. 452.22 s gammaloop-workspace-doctest> Couldn't compile the test.
  434. 452.22 s gammaloop-workspace-doctest> ---- crates/gammaloop-api/src/python.rs - python::GammaLoopAPI::get_global_settings (line 3631) stdout ----
  435. 452.22 s gammaloop-workspace-doctest> error[E0425]: cannot find value `settings_toml` in this scope
  436. 452.22 s gammaloop-workspace-doctest> --> crates/gammaloop-api/src/python.rs:3632:1
  437. 452.22 s gammaloop-workspace-doctest> |
  438. 452.22 s gammaloop-workspace-doctest> 3632 | settings_toml = api.get_global_settings()
  439. 452.22 s gammaloop-workspace-doctest> | ^^^^^^^^^^^^^
  440. 452.22 s gammaloop-workspace-doctest> |
  441. 452.22 s gammaloop-workspace-doctest> help: you might have meant to introduce a new binding
  442. 452.22 s gammaloop-workspace-doctest> |
  443. 452.22 s gammaloop-workspace-doctest> 3632 | let settings_toml = api.get_global_settings()
  444. 452.22 s gammaloop-workspace-doctest> | +++
  445. 452.22 s gammaloop-workspace-doctest>
  446. 452.22 s gammaloop-workspace-doctest> error[E0425]: cannot find value `api` in this scope
  447. 452.22 s gammaloop-workspace-doctest> --> crates/gammaloop-api/src/python.rs:3632:17
  448. 452.22 s gammaloop-workspace-doctest> |
  449. 452.22 s gammaloop-workspace-doctest> 3632 | settings_toml = api.get_global_settings()
  450. 452.22 s gammaloop-workspace-doctest> | ^^^ not found in this scope
  451. 452.23 s gammaloop-workspace-doctest>
  452. 452.23 s gammaloop-workspace-doctest> error: aborting due to 2 previous errors
  453. 452.23 s gammaloop-workspace-doctest>
  454. 452.23 s gammaloop-workspace-doctest> For more information about this error, try `rustc --explain E0425`.
  455. 452.23 s gammaloop-workspace-doctest> Couldn't compile the test.
  456. 452.23 s gammaloop-workspace-doctest> ---- crates/gammaloop-api/src/python.rs - python::atom_to_dots (line 157) stdout ----
  457. 452.23 s gammaloop-workspace-doctest> error[E0425]: cannot find function `to_dots` in this scope
  458. 452.23 s gammaloop-workspace-doctest> --> crates/gammaloop-api/src/python.rs:158:1
  459. 452.23 s gammaloop-workspace-doctest> |
  460. 452.23 s gammaloop-workspace-doctest> 158 | to_dots("p(mu) * q(mu)")
  461. 452.23 s gammaloop-workspace-doctest> | ^^^^^^^ not found in this scope
  462. 452.23 s gammaloop-workspace-doctest>
  463. 452.23 s gammaloop-workspace-doctest> error: aborting due to 1 previous error
  464. 452.23 s gammaloop-workspace-doctest>
  465. 452.23 s gammaloop-workspace-doctest> For more information about this error, try `rustc --explain E0425`.
  466. 452.23 s gammaloop-workspace-doctest> Couldn't compile the test.
  467. 452.23 s gammaloop-workspace-doctest>
  468. 452.23 s gammaloop-workspace-doctest> failures:
  469. 452.23 s gammaloop-workspace-doctest> crates/gammaloop-api/src/python.rs - python::GammaLoopAPI::evaluate_sample (line 2926)
  470. 452.23 s gammaloop-workspace-doctest> crates/gammaloop-api/src/python.rs - python::GammaLoopAPI::evaluate_samples (line 3040)
  471. 452.23 s gammaloop-workspace-doctest> crates/gammaloop-api/src/python.rs - python::GammaLoopAPI::get_active_command_blocks (line 3652)
  472. 452.23 s gammaloop-workspace-doctest> crates/gammaloop-api/src/python.rs - python::GammaLoopAPI::get_default_runtime_settings (line 3688)
  473. 452.23 s gammaloop-workspace-doctest> crates/gammaloop-api/src/python.rs - python::GammaLoopAPI::get_global_settings (line 3631)
  474. 452.23 s gammaloop-workspace-doctest> crates/gammaloop-api/src/python.rs - python::GammaLoopAPI::get_integrand_info (line 3496)
  475. 452.23 s gammaloop-workspace-doctest> crates/gammaloop-api/src/python.rs - python::GammaLoopAPI::get_integrand_settings (line 3539)
  476. 452.23 s gammaloop-workspace-doctest> crates/gammaloop-api/src/python.rs - python::GammaLoopAPI::get_run_history (line 3603)
  477. 452.23 s gammaloop-workspace-doctest> crates/gammaloop-api/src/python.rs - python::GammaLoopAPI::new_python (line 2804)
  478. 452.23 s gammaloop-workspace-doctest> crates/gammaloop-api/src/python.rs - python::GammaLoopAPI::run_command (line 3793)
  479. 452.23 s gammaloop-workspace-doctest> crates/gammaloop-api/src/python.rs - python::atom_to_canonical_string (line 128)
  480. 452.23 s gammaloop-workspace-doctest> crates/gammaloop-api/src/python.rs - python::atom_to_dots (line 157)
  481. 452.23 s gammaloop-workspace-doctest> crates/gammaloop-api/src/python.rs - python::evaluate_graph_overall_factor (line 95)
  482. 452.23 s gammaloop-workspace-doctest>
  483. 452.23 s gammaloop-workspace-doctest> test result: FAILED. 0 passed; 13 failed; 0 ignored; 0 measured; 0 filtered out; finished in 0.14s
  484. 452.23 s gammaloop-workspace-doctest>
  485. 452.23 s gammaloop-workspace-doctest> error: doctest failed, to rerun pass `-p gammaloop-api --doc`
  486. 452.67 s error: Cannot build '/nix/store/d7n0kzr0ab2qmzp3m3y3jhx03bbngjym-gammaloop-workspace-doctest-0.1.0.drv'.
  487. 452.67 s Reason: builder failed with exit code 101.
  488. 452.67 s Output paths:
  489. 452.67 s /nix/store/m1rbsc5idl2jxvknq7bvqysz3ysaha7l-gammaloop-workspace-doctest-0.1.0
  490. 452.67 s Last 349 log lines:
  491. 452.67 s > Running phase: unpackPhase
  492. 452.67 s > unpacking source archive /nix/store/n62xwv096bc248rr6y7qpggfdbwshkw9-source
  493. 452.67 s > source root is source
  494. 452.67 s > Running phase: patchPhase
  495. 452.67 s > Executing configureCargoCommonVars
  496. 452.67 s > decompressing cargo artifacts from /nix/store/kbgwngi7xvi54jsr0kp8rhj1b9mfja7d-gammaloop-workspace-deps-deps-0.1.0/target.tar.zst to target
  497. 452.67 s > Running phase: updateAutotoolsGnuConfigScriptsPhase
  498. 452.67 s > Running phase: configurePhase
  499. 452.67 s > will append /build/source/.cargo-home/config.toml with contents of /nix/store/xdy1vvhll2bijdplvl9fcc2b9plkxhaa-vendor-cargo-deps/config.toml
  500. 452.67 s > default configurePhase, nothing to do
  501. 452.67 s > Running phase: buildPhase
  502. 452.67 s > +++ command cargo --version
  503. 452.67 s > cargo 1.97.0 (c980f4866 2026-06-30)
  504. 452.67 s > +++ command cargo test --profile ci-optim --doc --locked --workspace --features gammaloop-api/cli,gammaloop-tracing-filter/clap,gammaloop-tracing-filter/symbolica,idenso/bincode,idenso/reference-cases,linnet/bincode,linnet/drawing,linnet/nodestore-vec,linnet/rkyv,linnet/serde,linnet/symbolica,spenso-macros/shadowing,spenso/shadowing,symbolica/tracing_max_level_info
  505. 452.67 s > Compiling target-lexicon v0.13.5
  506. 452.67 s > Compiling symbolica v2.2.0 (https://github.com/symbolica-dev/symbolica?branch=dev#0441bd7a)
  507. 452.67 s > Compiling maplit v1.0.2
  508. 452.67 s > Compiling gammaloop-tracing-filter-macros v0.1.0 (/build/source/crates/gammaloop-tracing-filter-macros)
  509. 452.67 s > Compiling vakint v0.1.2 (/build/source/crates/vakint)
  510. 452.67 s > Compiling gammalooprs v0.3.4 (/build/source/crates/gammalooprs)
  511. 452.67 s > Compiling alphal00p-docs-macros v0.1.0 (/build/source/crates/alphal00p-docs-macros)
  512. 452.67 s > Compiling alphal00p-docs-schema v0.1.0 (/build/source/crates/alphal00p-docs-schema)
  513. 452.67 s > Compiling rustc_version v0.4.1
  514. 452.67 s > Compiling bincode v1.3.3
  515. 452.67 s > Compiling target-triple v1.0.1
  516. 452.67 s > Compiling gungraun-runner v0.18.2
  517. 452.67 s > Compiling iai-callgrind-runner v0.14.2
  518. 452.67 s > Compiling clinnet v0.1.8 (/build/source/crates/clinnet)
  519. 452.67 s > Compiling gammaloop-integration-tests v0.1.0 (/build/source/tests)
  520. 452.67 s > Compiling test-log-core v0.2.20
  521. 452.67 s > Compiling wait-timeout v0.2.1
  522. 452.67 s > Compiling iai-callgrind v0.14.2
  523. 452.67 s > Compiling quick-error v1.2.3
  524. 452.67 s > Compiling bit-vec v0.8.0
  525. 452.67 s > Compiling rusty-fork v0.3.1
  526. 452.67 s > Compiling bit-set v0.8.0
  527. 452.67 s > Compiling iai-callgrind-macros v0.5.1
  528. 452.67 s > Compiling rand_xorshift v0.4.0
  529. 452.67 s > Compiling gungraun-macros v0.8.0
  530. 452.67 s > Compiling console v0.15.11
  531. 452.67 s > Compiling termcolor v1.4.1
  532. 452.67 s > Compiling unarray v0.1.4
  533. 452.67 s > Compiling glob v0.3.4
  534. 452.67 s > Compiling base64 v0.21.7
  535. 452.67 s > Compiling similar-asserts v1.7.0
  536. 452.67 s > Compiling alphal00p-docs-catalogs v0.1.0 (/build/source/crates/alphal00p-docs-catalogs)
  537. 452.67 s > Compiling ron v0.8.1
  538. 452.67 s > Compiling pyo3-build-config v0.28.3
  539. 452.67 s > Compiling trybuild v1.0.120
  540. 452.67 s > Compiling alphal00p-docs-builder v0.1.0 (/build/source/crates/alphal00p-docs-builder)
  541. 452.67 s > Compiling proptest v1.11.0
  542. 452.67 s > Compiling kurvst v0.1.0 (/build/source/crates/kurvst)
  543. 452.67 s > Compiling test-log-macros v0.2.20
  544. 452.67 s > Compiling alphal00p-docs-examples v0.1.0 (/build/source/crates/alphal00p-docs-examples)
  545. 452.67 s > Compiling test-log v0.2.20
  546. 452.67 s > Compiling pyo3-macros-backend v0.28.3
  547. 452.67 s > Compiling pyo3-ffi v0.28.3
  548. 452.67 s > Compiling pyo3 v0.28.3
  549. 452.67 s > Compiling numpy v0.28.0
  550. 452.67 s > Compiling gammaloop-api v0.1.0 (/build/source/crates/gammaloop-api)
  551. 452.67 s > Compiling gungraun v0.18.2
  552. 452.67 s > Compiling pyo3-macros v0.28.3
  553. 452.67 s > Compiling pyo3-stub-gen v0.17.2
  554. 452.67 s > Compiling numerica v2.2.0 (https://github.com/symbolica-dev/symbolica?branch=dev#0441bd7a)
  555. 452.67 s > Compiling graphica v2.1.0 (https://github.com/symbolica-dev/symbolica?branch=dev#0441bd7a)
  556. 452.67 s > Compiling symbolica-utils v0.1.0 (/build/source/crates/symbolica-utils)
  557. 452.67 s > Compiling gammaloop-workspace-hack v0.1.0 (/build/source/crates/gammaloop-workspace-hack)
  558. 452.67 s > Compiling spenso-macros v0.3.2 (/build/source/crates/spenso-macros)
  559. 452.67 s > Compiling linnet v0.17.0 (/build/source/crates/linnet)
  560. 452.67 s > Compiling spenso v0.6.0 (/build/source/crates/spenso)
  561. 452.67 s > Compiling idenso v0.3.0 (/build/source/crates/idenso)
  562. 452.67 s > Compiling gammaloop-tracing-filter v0.1.0 (/build/source/crates/gammaloop-tracing-filter)
  563. 452.67 s > Compiling spenso-hep-lib v0.1.7 (/build/source/crates/spenso-hep-lib)
  564. 452.67 s > Compiling spynso3 v0.1.2 (/build/source/crates/spynso3)
  565. 452.67 s > Compiling linnest v0.1.0 (/build/source/crates/linnest)
  566. 452.67 s > Compiling linnet-py v0.1.0 (/build/source/crates/linnet-py)
  567. 452.67 s > Finished `ci-optim` profile [optimized] target(s) in 7m 10s
  568. 452.67 s > warning: the following packages contain code that will be rejected by a future version of Rust: proc-macro-error2 v2.0.1
  569. 452.67 s > note: to see what the problems were, use the option `--future-incompat-report`, or run `cargo report future-incompatibilities --id 1`
  570. 452.67 s > Doc-tests alphal00p_docs_builder
  571. 452.67 s >
  572. 452.67 s > running 0 tests
  573. 452.67 s >
  574. 452.67 s > test result: ok. 0 passed; 0 failed; 0 ignored; 0 measured; 0 filtered out; finished in 0.00s
  575. 452.67 s >
  576. 452.67 s > Doc-tests alphal00p_docs_catalogs
  577. 452.67 s >
  578. 452.67 s > running 0 tests
  579. 452.67 s >
  580. 452.67 s > test result: ok. 0 passed; 0 failed; 0 ignored; 0 measured; 0 filtered out; finished in 0.00s
  581. 452.67 s >
  582. 452.67 s > Doc-tests alphal00p_docs_examples
  583. 452.67 s >
  584. 452.67 s > running 0 tests
  585. 452.67 s >
  586. 452.67 s > test result: ok. 0 passed; 0 failed; 0 ignored; 0 measured; 0 filtered out; finished in 0.00s
  587. 452.67 s >
  588. 452.67 s > Doc-tests alphal00p_docs
  589. 452.67 s >
  590. 452.67 s > running 0 tests
  591. 452.67 s >
  592. 452.67 s > test result: ok. 0 passed; 0 failed; 0 ignored; 0 measured; 0 filtered out; finished in 0.00s
  593. 452.67 s >
  594. 452.67 s > Doc-tests alphal00p_docs_schema
  595. 452.67 s >
  596. 452.67 s > running 0 tests
  597. 452.67 s >
  598. 452.67 s > test result: ok. 0 passed; 0 failed; 0 ignored; 0 measured; 0 filtered out; finished in 0.00s
  599. 452.67 s >
  600. 452.67 s > Doc-tests clinnet
  601. 452.67 s >
  602. 452.67 s > running 0 tests
  603. 452.67 s >
  604. 452.67 s > test result: ok. 0 passed; 0 failed; 0 ignored; 0 measured; 0 filtered out; finished in 0.00s
  605. 452.67 s >
  606. 452.67 s > Doc-tests gammaloop_api
  607. 452.67 s >
  608. 452.67 s > running 13 tests
  609. 452.67 s > test crates/gammaloop-api/src/python.rs - python::GammaLoopAPI::get_active_command_blocks (line 3652) ... FAILED
  610. 452.67 s > test crates/gammaloop-api/src/python.rs - python::GammaLoopAPI::evaluate_samples (line 3040) ... FAILED
  611. 452.67 s > test crates/gammaloop-api/src/python.rs - python::GammaLoopAPI::evaluate_sample (line 2926) ... FAILED
  612. 452.67 s > test crates/gammaloop-api/src/python.rs - python::GammaLoopAPI::get_default_runtime_settings (line 3688) ... FAILED
  613. 452.67 s > test crates/gammaloop-api/src/python.rs - python::GammaLoopAPI::get_integrand_info (line 3496) ... FAILED
  614. 452.67 s > test crates/gammaloop-api/src/python.rs - python::GammaLoopAPI::get_integrand_settings (line 3539) ... FAILED
  615. 452.67 s > test crates/gammaloop-api/src/python.rs - python::GammaLoopAPI::run_command (line 3793) ... FAILED
  616. 452.67 s > test crates/gammaloop-api/src/python.rs - python::GammaLoopAPI::get_run_history (line 3603) ... FAILED
  617. 452.67 s > test crates/gammaloop-api/src/python.rs - python::evaluate_graph_overall_factor (line 95) ... FAILED
  618. 452.67 s > test crates/gammaloop-api/src/python.rs - python::GammaLoopAPI::new_python (line 2804) ... FAILED
  619. 452.67 s > test crates/gammaloop-api/src/python.rs - python::atom_to_canonical_string (line 128) ... FAILED
  620. 452.67 s > test crates/gammaloop-api/src/python.rs - python::GammaLoopAPI::get_global_settings (line 3631) ... FAILED
  621. 452.67 s > test crates/gammaloop-api/src/python.rs - python::atom_to_dots (line 157) ... FAILED
  622. 452.67 s >
  623. 452.67 s > failures:
  624. 452.67 s >
  625. 452.67 s > ---- crates/gammaloop-api/src/python.rs - python::GammaLoopAPI::get_active_command_blocks (line 3652) stdout ----
  626. 452.67 s > error: expected item, found keyword `for`
  627. 452.67 s > --> crates/gammaloop-api/src/python.rs:3653:1
  628. 452.67 s > |
  629. 452.67 s > 3653 | for name, commands in api.get_active_command_blocks().items():
  630. 452.67 s > | ^^^ expected item
  631. 452.67 s > |
  632. 452.67 s > = note: for a full list of items that can appear in modules, see <https://doc.rust-lang.org/reference/items.html>
  633. 452.67 s >
  634. 452.67 s > error: aborting due to 1 previous error
  635. 452.67 s >
  636. 452.67 s > Couldn't compile the test.
  637. 452.67 s > ---- crates/gammaloop-api/src/python.rs - python::GammaLoopAPI::evaluate_samples (line 3040) stdout ----
  638. 452.67 s > error: expected one of `!` or `::`, found `=`
  639. 452.67 s > --> crates/gammaloop-api/src/python.rs:3041:8
  640. 452.67 s > |
  641. 452.67 s > 3041 | points = numpy.asarray(points, dtype=numpy.float64)
  642. 452.67 s > | ^ expected one of `!` or `::`
  643. 452.67 s >
  644. 452.67 s > error: aborting due to 1 previous error
  645. 452.67 s >
  646. 452.67 s > Couldn't compile the test.
  647. 452.67 s > ---- crates/gammaloop-api/src/python.rs - python::GammaLoopAPI::evaluate_sample (line 2926) stdout ----
  648. 452.67 s > error: expected one of `!` or `::`, found `=`
  649. 452.67 s > --> crates/gammaloop-api/src/python.rs:2927:8
  650. 452.67 s > |
  651. 452.67 s > 2927 | result = api.evaluate_sample(point, process_id=0, minimal_output=True)
  652. 452.67 s > | ^ expected one of `!` or `::`
  653. 452.67 s >
  654. 452.67 s > error: aborting due to 1 previous error
  655. 452.67 s >
  656. 452.67 s > Couldn't compile the test.
  657. 452.67 s > ---- crates/gammaloop-api/src/python.rs - python::GammaLoopAPI::get_default_runtime_settings (line 3688) stdout ----
  658. 452.67 s > error: expected one of `!` or `::`, found `=`
  659. 452.67 s > --> crates/gammaloop-api/src/python.rs:3689:9
  660. 452.67 s > |
  661. 452.67 s > 3689 | runtime = api.get_default_runtime_settings()
  662. 452.67 s > | ^ expected one of `!` or `::`
  663. 452.67 s >
  664. 452.67 s > error: aborting due to 1 previous error
  665. 452.67 s >
  666. 452.67 s > Couldn't compile the test.
  667. 452.67 s > ---- crates/gammaloop-api/src/python.rs - python::GammaLoopAPI::get_integrand_info (line 3496) stdout ----
  668. 452.67 s > error: expected one of `!` or `::`, found `=`
  669. 452.67 s > --> crates/gammaloop-api/src/python.rs:3497:6
  670. 452.67 s > |
  671. 452.67 s > 3497 | info = api.get_integrand_info(process_id=0)
  672. 452.67 s > | ^ expected one of `!` or `::`
  673. 452.67 s >
  674. 452.67 s > error: aborting due to 1 previous error
  675. 452.67 s >
  676. 452.67 s > Couldn't compile the test.
  677. 452.67 s > ---- crates/gammaloop-api/src/python.rs - python::GammaLoopAPI::get_integrand_settings (line 3539) stdout ----
  678. 452.67 s > error: expected one of `!` or `::`, found `=`
  679. 452.67 s > --> crates/gammaloop-api/src/python.rs:3540:10
  680. 452.67 s > |
  681. 452.67 s > 3540 | settings = api.get_integrand_settings(process_id=0)
  682. 452.67 s > | ^ expected one of `!` or `::`
  683. 452.67 s >
  684. 452.67 s > error: aborting due to 1 previous error
  685. 452.67 s >
  686. 452.67 s > Couldn't compile the test.
  687. 452.67 s > ---- crates/gammaloop-api/src/python.rs - python::GammaLoopAPI::run_command (line 3793) stdout ----
  688. 452.67 s > error[E0425]: cannot find value `api` in this scope
  689. 452.67 s > --> crates/gammaloop-api/src/python.rs:3794:1
  690. 452.67 s > |
  691. 452.67 s > 3794 | api.run("display processes")
  692. 452.67 s > | ^^^ not found in this scope
  693. 452.67 s >
  694. 452.67 s > error: aborting due to 1 previous error
  695. 452.67 s >
  696. 452.67 s > For more information about this error, try `rustc --explain E0425`.
  697. 452.67 s > Couldn't compile the test.
  698. 452.67 s > ---- crates/gammaloop-api/src/python.rs - python::GammaLoopAPI::get_run_history (line 3603) stdout ----
  699. 452.67 s > error[E0425]: cannot find value `run_card_toml` in this scope
  700. 452.67 s > --> crates/gammaloop-api/src/python.rs:3604:1
  701. 452.67 s > |
  702. 452.67 s > 3604 | run_card_toml = api.get_run_history()
  703. 452.67 s > | ^^^^^^^^^^^^^
  704. 452.67 s > |
  705. 452.67 s > help: you might have meant to introduce a new binding
  706. 452.67 s > |
  707. 452.67 s > 3604 | let run_card_toml = api.get_run_history()
  708. 452.67 s > | +++
  709. 452.67 s >
  710. 452.67 s > error[E0425]: cannot find value `api` in this scope
  711. 452.67 s > --> crates/gammaloop-api/src/python.rs:3604:17
  712. 452.67 s > |
  713. 452.67 s > 3604 | run_card_toml = api.get_run_history()
  714. 452.67 s > | ^^^ not found in this scope
  715. 452.67 s >
  716. 452.67 s > error: aborting due to 2 previous errors
  717. 452.67 s >
  718. 452.67 s > For more information about this error, try `rustc --explain E0425`.
  719. 452.67 s > Couldn't compile the test.
  720. 452.67 s > ---- crates/gammaloop-api/src/python.rs - python::evaluate_graph_overall_factor (line 95) stdout ----
  721. 452.67 s > error[E0425]: cannot find function `evaluate_graph_overall_factor` in this scope
  722. 452.67 s > --> crates/gammaloop-api/src/python.rs:96:1
  723. 452.67 s > |
  724. 452.67 s > 96 | evaluate_graph_overall_factor(
  725. 452.67 s > | ^^^^^^^^^^^^^^^^^^^^^^^^^^^^^ not found in this scope
  726. 452.67 s >
  727. 452.67 s > error: aborting due to 1 previous error
  728. 452.67 s >
  729. 452.67 s > For more information about this error, try `rustc --explain E0425`.
  730. 452.67 s > Couldn't compile the test.
  731. 452.67 s > ---- crates/gammaloop-api/src/python.rs - python::GammaLoopAPI::new_python (line 2804) stdout ----
  732. 452.67 s > error[E0425]: cannot find value `api` in this scope
  733. 452.67 s > --> crates/gammaloop-api/src/python.rs:2805:1
  734. 452.67 s > |
  735. 452.67 s > 2805 | api = GammaLoopAPI(state_folder="./state", read_only_state=True)
  736. 452.67 s > | ^^^
  737. 452.67 s > |
  738. 452.67 s > help: you might have meant to introduce a new binding
  739. 452.67 s > |
  740. 452.67 s > 2805 | let api = GammaLoopAPI(state_folder="./state", read_only_state=True)
  741. 452.67 s > | +++
  742. 452.67 s >
  743. 452.67 s > error[E0425]: cannot find value `state_folder` in this scope
  744. 452.67 s > --> crates/gammaloop-api/src/python.rs:2805:20
  745. 452.67 s > |
  746. 452.67 s > 2805 | api = GammaLoopAPI(state_folder="./state", read_only_state=True)
  747. 452.67 s > | ^^^^^^^^^^^^ not found in this scope
  748. 452.67 s >
  749. 452.67 s > error[E0425]: cannot find value `read_only_state` in this scope
  750. 452.67 s > --> crates/gammaloop-api/src/python.rs:2805:44
  751. 452.67 s > |
  752. 452.67 s > 2805 | api = GammaLoopAPI(state_folder="./state", read_only_state=True)
  753. 452.67 s > | ^^^^^^^^^^^^^^^ not found in this scope
  754. 452.67 s >
  755. 452.67 s > error[E0425]: cannot find value `True` in this scope
  756. 452.67 s > --> crates/gammaloop-api/src/python.rs:2805:60
  757. 452.67 s > |
  758. 452.67 s > 2805 | api = GammaLoopAPI(state_folder="./state", read_only_state=True)
  759. 452.67 s > | ^^^^ not found in this scope
  760. 452.67 s > |
  761. 452.67 s > help: you may want to use a bool value instead
  762. 452.67 s > |
  763. 452.67 s > 2805 - api = GammaLoopAPI(state_folder="./state", read_only_state=True)
  764. 452.67 s > 2805 + api = GammaLoopAPI(state_folder="./state", read_only_state=true)
  765. 452.67 s > |
  766. 452.67 s >
  767. 452.67 s > error[E0425]: cannot find function, tuple struct or tuple variant `GammaLoopAPI` in this scope
  768. 452.67 s > --> crates/gammaloop-api/src/python.rs:2805:7
  769. 452.67 s > |
  770. 452.67 s > 2805 | api = GammaLoopAPI(state_folder="./state", read_only_state=True)
  771. 452.67 s > | ^^^^^^^^^^^^ not found in this scope
  772. 452.67 s >
  773. 452.67 s > error: aborting due to 5 previous errors
  774. 452.67 s >
  775. 452.67 s > For more information about this error, try `rustc --explain E0425`.
  776. 452.67 s > Couldn't compile the test.
  777. 452.67 s > ---- crates/gammaloop-api/src/python.rs - python::atom_to_canonical_string (line 128) stdout ----
  778. 452.67 s > error[E0425]: cannot find function `atom_to_canonical_string` in this scope
  779. 452.67 s > --> crates/gammaloop-api/src/python.rs:129:1
  780. 452.67 s > |
  781. 452.67 s > 129 | atom_to_canonical_string("x + x")
  782. 452.67 s > | ^^^^^^^^^^^^^^^^^^^^^^^^ not found in this scope
  783. 452.67 s >
  784. 452.67 s > error: aborting due to 1 previous error
  785. 452.67 s >
  786. 452.67 s > For more information about this error, try `rustc --explain E0425`.
  787. 452.67 s > Couldn't compile the test.
  788. 452.67 s > ---- crates/gammaloop-api/src/python.rs - python::GammaLoopAPI::get_global_settings (line 3631) stdout ----
  789. 452.67 s > error[E0425]: cannot find value `settings_toml` in this scope
  790. 452.67 s > --> crates/gammaloop-api/src/python.rs:3632:1
  791. 452.67 s > |
  792. 452.67 s > 3632 | settings_toml = api.get_global_settings()
  793. 452.67 s > | ^^^^^^^^^^^^^
  794. 452.67 s > |
  795. 452.67 s > help: you might have meant to introduce a new binding
  796. 452.67 s > |
  797. 452.67 s > 3632 | let settings_toml = api.get_global_settings()
  798. 452.67 s > | +++
  799. 452.67 s >
  800. 452.67 s > error[E0425]: cannot find value `api` in this scope
  801. 452.67 s > --> crates/gammaloop-api/src/python.rs:3632:17
  802. 452.67 s > |
  803. 452.67 s > 3632 | settings_toml = api.get_global_settings()
  804. 452.67 s > | ^^^ not found in this scope
  805. 452.67 s >
  806. 452.67 s > error: aborting due to 2 previous errors
  807. 452.67 s >
  808. 452.67 s > For more information about this error, try `rustc --explain E0425`.
  809. 452.67 s > Couldn't compile the test.
  810. 452.67 s > ---- crates/gammaloop-api/src/python.rs - python::atom_to_dots (line 157) stdout ----
  811. 452.67 s > error[E0425]: cannot find function `to_dots` in this scope
  812. 452.67 s > --> crates/gammaloop-api/src/python.rs:158:1
  813. 452.67 s > |
  814. 452.67 s > 158 | to_dots("p(mu) * q(mu)")
  815. 452.67 s > | ^^^^^^^ not found in this scope
  816. 452.67 s >
  817. 452.67 s > error: aborting due to 1 previous error
  818. 452.67 s >
  819. 452.67 s > For more information about this error, try `rustc --explain E0425`.
  820. 452.67 s > Couldn't compile the test.
  821. 452.67 s >
  822. 452.67 s > failures:
  823. 452.67 s > crates/gammaloop-api/src/python.rs - python::GammaLoopAPI::evaluate_sample (line 2926)
  824. 452.67 s > crates/gammaloop-api/src/python.rs - python::GammaLoopAPI::evaluate_samples (line 3040)
  825. 452.67 s > crates/gammaloop-api/src/python.rs - python::GammaLoopAPI::get_active_command_blocks (line 3652)
  826. 452.67 s > crates/gammaloop-api/src/python.rs - python::GammaLoopAPI::get_default_runtime_settings (line 3688)
  827. 452.67 s > crates/gammaloop-api/src/python.rs - python::GammaLoopAPI::get_global_settings (line 3631)
  828. 452.67 s > crates/gammaloop-api/src/python.rs - python::GammaLoopAPI::get_integrand_info (line 3496)
  829. 452.67 s > crates/gammaloop-api/src/python.rs - python::GammaLoopAPI::get_integrand_settings (line 3539)
  830. 452.67 s > crates/gammaloop-api/src/python.rs - python::GammaLoopAPI::get_run_history (line 3603)
  831. 452.67 s > crates/gammaloop-api/src/python.rs - python::GammaLoopAPI::new_python (line 2804)
  832. 452.67 s > crates/gammaloop-api/src/python.rs - python::GammaLoopAPI::run_command (line 3793)
  833. 452.67 s > crates/gammaloop-api/src/python.rs - python::atom_to_canonical_string (line 128)
  834. 452.67 s > crates/gammaloop-api/src/python.rs - python::atom_to_dots (line 157)
  835. 452.67 s > crates/gammaloop-api/src/python.rs - python::evaluate_graph_overall_factor (line 95)
  836. 452.67 s >
  837. 452.67 s > test result: FAILED. 0 passed; 13 failed; 0 ignored; 0 measured; 0 filtered out; finished in 0.14s
  838. 452.67 s >
  839. 452.67 s > error: doctest failed, to rerun pass `-p gammaloop-api --doc`
  840. 452.67 s For full logs, run:
  841. 452.67 s nix log /nix/store/d7n0kzr0ab2qmzp3m3y3jhx03bbngjym-gammaloop-workspace-doctest-0.1.0.drv
  842. 452.75 s [0 built (1 failed), 0.0Run failed.