test packages.x86_64-linux.nix-ci-check-gammaloop-doctest
0.08 s
$ /nix/store/9ypz3flqsrl5xl495mm8h645gadjsxi1-coreutils-9.11/bin/timeout --kill-after=15s 7200s /nix/store/23zk8sgzamrbmj1fday15szf7f2279s8-nix-2.34.7/bin/nix --extra-experimental-features nix-command --extra-experimental-features flakes flake clone git+https://github.com/alphal00p/gammaloop --dest /tmp/nix-ci-worker/stable-pwd/repo/
0.09 s
Cloning into '/tmp/nix-ci-worker/stable-pwd/repo'...
1.49 s
remote: Enumerating objects: 64185, done.
1.73 s
remote: Counting objects: 0% (1/9539)
remote: Counting objects: 1% (96/9539)
remote: Counting objects: 2% (191/9539)
remote: Counting objects: 3% (287/9539)
remote: Counting objects: 4% (382/9539)
remote: Counting objects: 5% (477/9539)
remote: Counting objects: 6% (573/9539)
remote: Counting objects: 7% (668/9539)
remote: Counting objects: 8% (764/9539)
remote: Counting objects: 9% (859/9539)
remote: Counting objects: 10% (954/9539)
remote: Counting objects: 11% (1050/9539)
remote: Counting objects: 12% (1145/9539)
remote: Counting objects: 13% (1241/9539)
remote: Counting objects: 14% (1336/9539)
remote: Counting objects: 15% (1431/9539)
remote: Counting objects: 16% (1527/9539)
remote: Counting objects: 17% (1622/9539)
remote: Counting objects: 18% (1718/9539)
remote: Counting objects: 19% (1813/9539)
remote: Counting objects: 20% (1908/9539)
remote: Counting objects: 21% (2004/9539)
remote: Counting objects: 22% (2099/9539)
remote: Counting objects: 23% (2194/9539)
remote: Counting objects: 24% (2290/9539)
remote: Counting objects: 25% (2385/9539)
remote: Counting objects: 26% (2481/9539)
remote: Counting objects: 27% (2576/9539)
remote: Counting objects: 28% (2671/9539)
remote: Counting objects: 29% (2767/9539)
remote: Counting objects: 30% (2862/9539)
remote: Counting objects: 31% (2958/9539)
remote: Counting objects: 32% (3053/9539)
remote: Counting objects: 33% (3148/9539)
remote: Counting objects: 34% (3244/9539)
remote: Counting objects: 35% (3339/9539)
remote: Counting objects: 36% (3435/9539)
remote: Counting objects: 37% (3530/9539)
remote: Counting objects: 38% (3625/9539)
remote: Counting objects: 39% (3721/9539)
remote: Counting objects: 40% (3816/9539)
remote: Counting objects: 41% (3911/9539)
remote: Counting objects: 42% (4007/9539)
remote: Counting objects: 43% (4102/9539)
remote: Counting objects: 44% (4198/9539)
remote: Counting objects: 45% (4293/9539)
remote: Counting objects: 46% (4388/9539)
remote: Counting objects: 47% (4484/9539)
remote: Counting objects: 48% (4579/9539)
remote: Counting objects: 49% (4675/9539)
remote: Counting objects: 50% (4770/9539)
remote: Counting objects: 51% (4865/9539)
remote: Counting objects: 52% (4961/9539)
remote: Counting objects: 53% (5056/9539)
remote: Counting objects: 54% (5152/9539)
remote: Counting objects: 55% (5247/9539)
remote: Counting objects: 56% (5342/9539)
remote: Counting objects: 57% (5438/9539)
remote: Counting objects: 58% (5533/9539)
remote: Counting objects: 59% (5629/9539)
remote: Counting objects: 60% (5724/9539)
remote: Counting objects: 61% (5819/9539)
remote: Counting objects: 62% (5915/9539)
remote: Counting objects: 63% (6010/9539)
remote: Counting objects: 64% (6105/9539)
remote: Counting objects: 65% (6201/9539)
remote: Counting objects: 66% (6296/9539)
remote: Counting objects: 67% (6392/9539)
remote: Counting objects: 68% (6487/9539)
remote: Counting objects: 69% (6582/9539)
remote: Counting objects: 70% (6678/9539)
remote: Counting objects: 71% (6773/9539)
remote: Counting objects: 72% (6869/9539)
remote: Counting objects: 73% (6964/9539)
remote: Counting objects: 74% (7059/9539)
remote: Counting objects: 75% (7155/9539)
remote: Counting objects: 76% (7250/9539)
remote: Counting objects: 77% (7346/9539)
remote: Counting objects: 78% (7441/9539)
remote: Counting objects: 79% (7536/9539)
remote: Counting objects: 80% (7632/9539)
remote: Counting objects: 81% (7727/9539)
remote: Counting objects: 82% (7822/9539)
remote: Counting objects: 83% (7918/9539)
remote: Counting objects: 84% (8013/9539)
remote: Counting objects: 85% (8109/9539)
remote: Counting objects: 86% (8204/9539)
remote: Counting objects: 87% (8299/9539)
remote: Counting objects: 88% (8395/9539)
remote: Counting objects: 89% (8490/9539)
remote: Counting objects: 90% (8586/9539)
remote: Counting objects: 91% (8681/9539)
remote: Counting objects: 92% (8776/9539)
remote: Counting objects: 93% (8872/9539)
remote: Counting objects: 94% (8967/9539)
remote: Counting objects: 95% (9063/9539)
remote: Counting objects: 96% (9158/9539)
remote: Counting objects: 97% (9253/9539)
remote: Counting objects: 98% (9349/9539)
remote: Counting objects: 99% (9444/9539)
remote: Counting objects: 100% (9539/9539)
remote: Counting objects: 100% (9539/9539), done.
4.14 s
remote: Compressing objects: 0% (1/2325)
remote: Compressing objects: 1% (24/2325)
remote: Compressing objects: 2% (47/2325)
remote: Compressing objects: 3% (70/2325)
remote: Compressing objects: 4% (93/2325)
remote: Compressing objects: 5% (117/2325)
remote: Compressing objects: 6% (140/2325)
remote: Compressing objects: 7% (163/2325)
remote: Compressing objects: 8% (186/2325)
remote: Compressing objects: 9% (210/2325)
remote: Compressing objects: 10% (233/2325)
remote: Compressing objects: 11% (256/2325)
remote: Compressing objects: 12% (279/2325)
remote: Compressing objects: 13% (303/2325)
remote: Compressing objects: 14% (326/2325)
remote: Compressing objects: 15% (349/2325)
remote: Compressing objects: 16% (372/2325)
remote: Compressing objects: 17% (396/2325)
remote: Compressing objects: 18% (419/2325)
remote: Compressing objects: 19% (442/2325)
remote: Compressing objects: 20% (465/2325)
remote: Compressing objects: 21% (489/2325)
remote: Compressing objects: 22% (512/2325)
remote: Compressing objects: 23% (535/2325)
remote: Compressing objects: 23% (543/2325)
remote: Compressing objects: 24% (558/2325)
remote: Compressing objects: 25% (582/2325)
remote: Compressing objects: 26% (605/2325)
remote: Compressing objects: 27% (628/2325)
remote: Compressing objects: 28% (651/2325)
remote: Compressing objects: 29% (675/2325)
remote: Compressing objects: 29% (684/2325)
remote: Compressing objects: 30% (698/2325)
remote: Compressing objects: 31% (721/2325)
remote: Compressing objects: 32% (744/2325)
remote: Compressing objects: 33% (768/2325)
remote: Compressing objects: 34% (791/2325)
remote: Compressing objects: 35% (814/2325)
remote: Compressing objects: 36% (837/2325)
remote: Compressing objects: 37% (861/2325)
remote: Compressing objects: 38% (884/2325)
remote: Compressing objects: 39% (907/2325)
remote: Compressing objects: 40% (930/2325)
remote: Compressing objects: 41% (954/2325)
remote: Compressing objects: 42% (977/2325)
remote: Compressing objects: 43% (1000/2325)
remote: Compressing objects: 44% (1023/2325)
remote: Compressing objects: 45% (1047/2325)
remote: Compressing objects: 46% (1070/2325)
remote: Compressing objects: 47% (1093/2325)
remote: Compressing objects: 48% (1116/2325)
remote: Compressing objects: 49% (1140/2325)
remote: Compressing objects: 50% (1163/2325)
remote: Compressing objects: 51% (1186/2325)
remote: Compressing objects: 52% (1209/2325)
remote: Compressing objects: 53% (1233/2325)
remote: Compressing objects: 54% (1256/2325)
remote: Compressing objects: 55% (1279/2325)
remote: Compressing objects: 56% (1302/2325)
remote: Compressing objects: 57% (1326/2325)
remote: Compressing objects: 58% (1349/2325)
remote: Compressing objects: 59% (1372/2325)
remote: Compressing objects: 60% (1395/2325)
remote: Compressing objects: 61% (1419/2325)
remote: Compressing objects: 62% (1442/2325)
remote: Compressing objects: 63% (1465/2325)
remote: Compressing objects: 64% (1488/2325)
remote: Compressing objects: 65% (1512/2325)
remote: Compressing objects: 66% (1535/2325)
remote: Compressing objects: 67% (1558/2325)
remote: Compressing objects: 68% (1581/2325)
remote: Compressing objects: 69% (1605/2325)
remote: Compressing objects: 70% (1628/2325)
remote: Compressing objects: 71% (1651/2325)
remote: Compressing objects: 72% (1674/2325)
remote: Compressing objects: 73% (1698/2325)
remote: Compressing objects: 74% (1721/2325)
remote: Compressing objects: 75% (1744/2325)
remote: Compressing objects: 76% (1767/2325)
remote: Compressing objects: 77% (1791/2325)
remote: Compressing objects: 78% (1814/2325)
remote: Compressing objects: 79% (1837/2325)
remote: Compressing objects: 80% (1860/2325)
remote: Compressing objects: 81% (1884/2325)
remote: Compressing objects: 82% (1907/2325)
remote: Compressing objects: 83% (1930/2325)
remote: Compressing objects: 84% (1953/2325)
remote: Compressing objects: 85% (1977/2325)
remote: Compressing objects: 86% (2000/2325)
remote: Compressing objects: 87% (2023/2325)
remote: Compressing objects: 88% (2046/2325)
remote: Compressing objects: 89% (2070/2325)
remote: Compressing objects: 90% (2093/2325)
remote: Compressing objects: 91% (2116/2325)
remote: Compressing objects: 92% (2139/2325)
remote: Compressing objects: 93% (2163/2325)
remote: Compressing objects: 94% (2186/2325)
remote: Compressing objects: 95% (2209/2325)
remote: Compressing objects: 96% (2232/2325)
remote: Compressing objects: 97% (2256/2325)
remote: Compressing objects: 98% (2279/2325)
remote: Compressing objects: 99% (2302/2325)
remote: Compressing objects: 100% (2325/2325)
remote: Compressing objects: 100% (2325/2325), done.
7.16 s
Receiving objects: 0% (1/64185)
Receiving objects: 1% (642/64185)
Receiving objects: 2% (1284/64185)
Receiving objects: 3% (1926/64185)
Receiving objects: 4% (2568/64185)
Receiving objects: 5% (3210/64185)
Receiving objects: 6% (3852/64185)
Receiving objects: 7% (4493/64185)
Receiving objects: 8% (5135/64185)
Receiving objects: 9% (5777/64185)
Receiving objects: 10% (6419/64185)
Receiving objects: 11% (7061/64185)
Receiving objects: 12% (7703/64185), 14.22 MiB | 28.42 MiB/s
Receiving objects: 13% (8345/64185), 14.22 MiB | 28.42 MiB/s
Receiving objects: 14% (8986/64185), 14.22 MiB | 28.42 MiB/s
Receiving objects: 15% (9628/64185), 14.22 MiB | 28.42 MiB/s
Receiving objects: 16% (10270/64185), 14.22 MiB | 28.42 MiB/s
Receiving objects: 17% (10912/64185), 14.22 MiB | 28.42 MiB/s
Receiving objects: 18% (11554/64185), 14.22 MiB | 28.42 MiB/s
Receiving objects: 19% (12196/64185), 14.22 MiB | 28.42 MiB/s
Receiving objects: 20% (12837/64185), 14.22 MiB | 28.42 MiB/s
Receiving objects: 21% (13479/64185), 14.22 MiB | 28.42 MiB/s
Receiving objects: 22% (14121/64185), 14.22 MiB | 28.42 MiB/s
Receiving objects: 23% (14763/64185), 14.22 MiB | 28.42 MiB/s
Receiving objects: 24% (15405/64185), 14.22 MiB | 28.42 MiB/s
Receiving objects: 25% (16047/64185), 14.22 MiB | 28.42 MiB/s
Receiving objects: 26% (16689/64185), 14.22 MiB | 28.42 MiB/s
Receiving objects: 27% (17330/64185), 14.22 MiB | 28.42 MiB/s
Receiving objects: 28% (17972/64185), 14.22 MiB | 28.42 MiB/s
Receiving objects: 29% (18614/64185), 14.22 MiB | 28.42 MiB/s
Receiving objects: 30% (19256/64185), 14.22 MiB | 28.42 MiB/s
Receiving objects: 31% (19898/64185), 14.22 MiB | 28.42 MiB/s
Receiving objects: 32% (20540/64185), 14.22 MiB | 28.42 MiB/s
Receiving objects: 33% (21182/64185), 14.22 MiB | 28.42 MiB/s
Receiving objects: 34% (21823/64185), 14.22 MiB | 28.42 MiB/s
Receiving objects: 35% (22465/64185), 14.22 MiB | 28.42 MiB/s
Receiving objects: 36% (23107/64185), 14.22 MiB | 28.42 MiB/s
Receiving objects: 37% (23749/64185), 14.22 MiB | 28.42 MiB/s
Receiving objects: 38% (24391/64185), 14.22 MiB | 28.42 MiB/s
Receiving objects: 39% (25033/64185), 14.22 MiB | 28.42 MiB/s
Receiving objects: 40% (25674/64185), 14.22 MiB | 28.42 MiB/s
Receiving objects: 41% (26316/64185), 14.22 MiB | 28.42 MiB/s
Receiving objects: 42% (26958/64185), 14.22 MiB | 28.42 MiB/s
Receiving objects: 43% (27600/64185), 14.22 MiB | 28.42 MiB/s
Receiving objects: 44% (28242/64185), 14.22 MiB | 28.42 MiB/s
Receiving objects: 45% (28884/64185), 14.22 MiB | 28.42 MiB/s
Receiving objects: 46% (29526/64185), 14.22 MiB | 28.42 MiB/s
Receiving objects: 47% (30167/64185), 14.22 MiB | 28.42 MiB/s
Receiving objects: 48% (30809/64185), 14.22 MiB | 28.42 MiB/s
Receiving objects: 49% (31451/64185), 14.22 MiB | 28.42 MiB/s
Receiving objects: 50% (32093/64185), 14.22 MiB | 28.42 MiB/s
Receiving objects: 51% (32735/64185), 14.22 MiB | 28.42 MiB/s
Receiving objects: 52% (33377/64185), 14.22 MiB | 28.42 MiB/s
Receiving objects: 52% (33854/64185), 33.09 MiB | 31.90 MiB/s
Receiving objects: 53% (34019/64185), 33.09 MiB | 31.90 MiB/s
Receiving objects: 54% (34660/64185), 33.09 MiB | 31.90 MiB/s
Receiving objects: 55% (35302/64185), 33.09 MiB | 31.90 MiB/s
Receiving objects: 56% (35944/64185), 33.09 MiB | 31.90 MiB/s
Receiving objects: 57% (36586/64185), 33.09 MiB | 31.90 MiB/s
Receiving objects: 58% (37228/64185), 33.09 MiB | 31.90 MiB/s
Receiving objects: 59% (37870/64185), 33.09 MiB | 31.90 MiB/s
Receiving objects: 60% (38511/64185), 33.09 MiB | 31.90 MiB/s
Receiving objects: 61% (39153/64185), 49.42 MiB | 32.17 MiB/s
Receiving objects: 62% (39795/64185), 49.42 MiB | 32.17 MiB/s
Receiving objects: 63% (40437/64185), 49.42 MiB | 32.17 MiB/s
Receiving objects: 64% (41079/64185), 49.42 MiB | 32.17 MiB/s
Receiving objects: 65% (41721/64185), 49.42 MiB | 32.17 MiB/s
Receiving objects: 66% (42363/64185), 49.42 MiB | 32.17 MiB/s
Receiving objects: 67% (43004/64185), 49.42 MiB | 32.17 MiB/s
Receiving objects: 68% (43646/64185), 49.42 MiB | 32.17 MiB/s
Receiving objects: 69% (44288/64185), 49.42 MiB | 32.17 MiB/s
Receiving objects: 69% (44788/64185), 49.42 MiB | 32.17 MiB/s
Receiving objects: 70% (44930/64185), 49.42 MiB | 32.17 MiB/s
Receiving objects: 71% (45572/64185), 49.42 MiB | 32.17 MiB/s
Receiving objects: 72% (46214/64185), 66.40 MiB | 32.61 MiB/s
Receiving objects: 73% (46856/64185), 66.40 MiB | 32.61 MiB/s
Receiving objects: 74% (47497/64185), 66.40 MiB | 32.61 MiB/s
Receiving objects: 75% (48139/64185), 66.40 MiB | 32.61 MiB/s
Receiving objects: 76% (48781/64185), 66.40 MiB | 32.61 MiB/s
Receiving objects: 77% (49423/64185), 66.40 MiB | 32.61 MiB/s
Receiving objects: 78% (50065/64185), 66.40 MiB | 32.61 MiB/s
Receiving objects: 79% (50707/64185), 66.40 MiB | 32.61 MiB/s
Receiving objects: 80% (51348/64185), 66.40 MiB | 32.61 MiB/s
Receiving objects: 81% (51990/64185), 66.40 MiB | 32.61 MiB/s
Receiving objects: 82% (52632/64185), 66.40 MiB | 32.61 MiB/s
Receiving objects: 83% (53274/64185), 66.40 MiB | 32.61 MiB/s
Receiving objects: 84% (53916/64185), 66.40 MiB | 32.61 MiB/s
Receiving objects: 85% (54558/64185), 82.39 MiB | 32.36 MiB/s
Receiving objects: 86% (55200/64185), 82.39 MiB | 32.36 MiB/s
Receiving objects: 87% (55841/64185), 82.39 MiB | 32.36 MiB/s
Receiving objects: 88% (56483/64185), 82.39 MiB | 32.36 MiB/s
Receiving objects: 89% (57125/64185), 82.39 MiB | 32.36 MiB/s
Receiving objects: 90% (57767/64185), 82.39 MiB | 32.36 MiB/s
Receiving objects: 91% (58409/64185), 82.39 MiB | 32.36 MiB/s
Receiving objects: 92% (59051/64185), 82.39 MiB | 32.36 MiB/s
Receiving objects: 93% (59693/64185), 82.39 MiB | 32.36 MiB/s
Receiving objects: 94% (60334/64185), 82.39 MiB | 32.36 MiB/s
Receiving objects: 95% (60976/64185), 82.39 MiB | 32.36 MiB/s
Receiving objects: 96% (61618/64185), 82.39 MiB | 32.36 MiB/s
Receiving objects: 97% (62260/64185), 82.39 MiB | 32.36 MiB/s
Receiving objects: 98% (62902/64185), 82.39 MiB | 32.36 MiB/s
Receiving objects: 99% (63544/64185), 82.39 MiB | 32.36 MiB/s
Receiving objects: 99% (64114/64185), 82.39 MiB | 32.36 MiB/s
remote: Total 64185 (delta 7386), reused 7765 (delta 6669), pack-reused 54646 (from 3)
7.18 s
Receiving objects: 100% (64185/64185), 82.39 MiB | 32.36 MiB/s
Receiving objects: 100% (64185/64185), 97.83 MiB | 32.43 MiB/s, done.
7.85 s
Resolving deltas: 0% (0/44316)
Resolving deltas: 1% (444/44316)
Resolving deltas: 2% (887/44316)
Resolving deltas: 3% (1330/44316)
Resolving deltas: 4% (1773/44316)
Resolving deltas: 5% (2216/44316)
Resolving deltas: 6% (2659/44316)
Resolving deltas: 7% (3103/44316)
Resolving deltas: 8% (3549/44316)
Resolving deltas: 9% (3989/44316)
Resolving deltas: 10% (4432/44316)
Resolving deltas: 11% (4875/44316)
Resolving deltas: 12% (5318/44316)
Resolving deltas: 13% (5762/44316)
Resolving deltas: 14% (6205/44316)
Resolving deltas: 15% (6648/44316)
Resolving deltas: 16% (7091/44316)
Resolving deltas: 17% (7534/44316)
Resolving deltas: 18% (7977/44316)
Resolving deltas: 19% (8421/44316)
Resolving deltas: 20% (8864/44316)
Resolving deltas: 21% (9307/44316)
Resolving deltas: 22% (9750/44316)
Resolving deltas: 23% (10193/44316)
Resolving deltas: 24% (10636/44316)
Resolving deltas: 25% (11079/44316)
Resolving deltas: 26% (11523/44316)
Resolving deltas: 27% (11966/44316)
Resolving deltas: 28% (12410/44316)
Resolving deltas: 29% (12852/44316)
Resolving deltas: 30% (13295/44316)
Resolving deltas: 31% (13739/44316)
Resolving deltas: 32% (14182/44316)
Resolving deltas: 33% (14625/44316)
Resolving deltas: 34% (15069/44316)
Resolving deltas: 35% (15511/44316)
Resolving deltas: 36% (15954/44316)
Resolving deltas: 37% (16397/44316)
Resolving deltas: 38% (16841/44316)
Resolving deltas: 39% (17284/44316)
Resolving deltas: 40% (17727/44316)
Resolving deltas: 41% (18170/44316)
Resolving deltas: 42% (18613/44316)
Resolving deltas: 43% (19057/44316)
Resolving deltas: 44% (19502/44316)
Resolving deltas: 45% (19943/44316)
Resolving deltas: 46% (20386/44316)
Resolving deltas: 47% (20829/44316)
Resolving deltas: 48% (21272/44316)
Resolving deltas: 49% (21716/44316)
Resolving deltas: 50% (22158/44316)
Resolving deltas: 51% (22602/44316)
Resolving deltas: 52% (23045/44316)
Resolving deltas: 53% (23490/44316)
Resolving deltas: 54% (23931/44316)
Resolving deltas: 55% (24376/44316)
Resolving deltas: 56% (24818/44316)
Resolving deltas: 57% (25261/44316)
Resolving deltas: 58% (25704/44316)
Resolving deltas: 59% (26147/44316)
Resolving deltas: 60% (26591/44316)
Resolving deltas: 61% (27033/44316)
Resolving deltas: 62% (27476/44316)
Resolving deltas: 63% (27920/44316)
Resolving deltas: 64% (28363/44316)
Resolving deltas: 65% (28806/44316)
Resolving deltas: 66% (29249/44316)
Resolving deltas: 67% (29692/44316)
Resolving deltas: 68% (30135/44316)
Resolving deltas: 69% (30579/44316)
Resolving deltas: 70% (31022/44316)
Resolving deltas: 71% (31465/44316)
Resolving deltas: 72% (31908/44316)
Resolving deltas: 73% (32351/44316)
Resolving deltas: 74% (32794/44316)
Resolving deltas: 75% (33240/44316)
Resolving deltas: 76% (33681/44316)
Resolving deltas: 77% (34125/44316)
Resolving deltas: 78% (34567/44316)
Resolving deltas: 79% (35010/44316)
Resolving deltas: 80% (35454/44316)
Resolving deltas: 81% (35896/44316)
Resolving deltas: 82% (36340/44316)
Resolving deltas: 83% (36783/44316)
Resolving deltas: 84% (37226/44316)
Resolving deltas: 85% (37669/44316)
Resolving deltas: 86% (38112/44316)
Resolving deltas: 87% (38555/44316)
Resolving deltas: 88% (38999/44316)
Resolving deltas: 89% (39442/44316)
Resolving deltas: 90% (39885/44316)
Resolving deltas: 91% (40328/44316)
Resolving deltas: 92% (40771/44316)
Resolving deltas: 93% (41214/44316)
Resolving deltas: 94% (41658/44316)
Resolving deltas: 95% (42101/44316)
Resolving deltas: 96% (42544/44316)
Resolving deltas: 97% (42987/44316)
Resolving deltas: 98% (43430/44316)
Resolving deltas: 99% (43873/44316)
Resolving deltas: 100% (44316/44316)
Resolving deltas: 100% (44316/44316), done.
8.17 s
Fetching commit e848309923f9136d533613bb15d1029beb045263 for push-vrpyqyylypmw ...
8.17 s
$ /nix/store/bcnisk3ydfgv26v2gw3zlky24g00yww2-git-2.54.0/bin/git fetch origin e848309923f9136d533613bb15d1029beb045263
8.66 s
From https://github.com/alphal00p/gammaloop
8.66 s
* branch e848309923f9136d533613bb15d1029beb045263 -> FETCH_HEAD
8.68 s
$ /nix/store/9ypz3flqsrl5xl495mm8h645gadjsxi1-coreutils-9.11/bin/timeout --kill-after=15s 7200s /nix/store/bcnisk3ydfgv26v2gw3zlky24g00yww2-git-2.54.0/bin/git -c advice.detachedHead=false checkout e848309923f9136d533613bb15d1029beb045263
8.89 s
HEAD is now at e8483099 fix Python extension artifact builds
8.89 s
$ /nix/store/9ypz3flqsrl5xl495mm8h645gadjsxi1-coreutils-9.11/bin/timeout --kill-after=15s 7200s /nix/store/23zk8sgzamrbmj1fday15szf7f2279s8-nix-2.34.7/bin/nix --extra-experimental-features nix-command --extra-experimental-features flakes --log-format internal-json run .#packages.x86_64-linux.nix-ci-check-gammaloop-doctest --print-build-logs
13.64 s
13.80 s
Downloading cached boehm-gc from https://cache.nix-ci.com
13.82 s
Downloading cached busybox from https://cache.nix-ci.com
13.82 s
Downloading cached aws-c-common from https://cache.nix-ci.com
13.82 s
Downloading cached editline-1.17.1-unstable-2025-05 from https://cache.nix-ci.com
13.82 s
Downloading cached libcpuid from https://cache.nix-ci.com
13.82 s
Downloading cached libseccomp-2.6.0-lib from https://cache.nix-ci.com
13.82 s
Downloading cached libsodium-1.0.22-unstable-2026-04 from https://cache.nix-ci.com
13.82 s
Downloading cached lowdown-3.0.1-lib from https://cache.nix-ci.com
13.82 s
Downloading cached icu4c from https://cache.nix-ci.com
13.82 s
Downloading cached libxml2 from https://cache.nix-ci.com
13.82 s
Downloading cached llhttp from https://cache.nix-ci.com
13.82 s
Downloading cached s2n-tls from https://cache.nix-ci.com
13.82 s
Downloading cached hwloc-2.14.0-lib from https://cache.nix-ci.com
13.86 s
Downloaded cached llhttp (89 KiB) in 37ms
13.86 s
Progress: 0 of 1 built, 1 of 40 downloaded from cache (12 downloading)
13.86 s
Downloading cached libgit2-1.9.4-lib from https://cache.nix-ci.com
13.86 s
Downloaded cached boehm-gc (312 KiB) in 52ms
13.86 s
Progress: 0 of 1 built, 2 of 40 downloaded from cache (12 downloading)
13.86 s
Downloaded cached editline-1.17.1-unstable-2025-05 (58 KiB) in 40ms
13.86 s
Progress: 0 of 1 built, 3 of 40 downloaded from cache (11 downloading)
13.86 s
Downloaded cached libseccomp-2.6.0-lib (193 KiB) in 44ms
13.86 s
Progress: 0 of 1 built, 4 of 40 downloaded from cache (10 downloading)
13.86 s
Downloaded cached libcpuid (326 KiB) in 46ms
13.86 s
Progress: 0 of 1 built, 5 of 40 downloaded from cache (9 downloading)
13.87 s
Downloaded cached busybox (230 KiB) in 49ms
13.87 s
Progress: 0 of 1 built, 6 of 40 downloaded from cache (8 downloading)
13.87 s
Downloaded cached lowdown-3.0.1-lib (341 KiB) in 49ms
13.87 s
Progress: 0 of 1 built, 7 of 40 downloaded from cache (7 downloading)
13.87 s
Downloaded cached hwloc-2.14.0-lib (459 KiB) in 52ms
13.87 s
Progress: 0 of 1 built, 8 of 40 downloaded from cache (6 downloading)
13.87 s
Downloading cached onetbb from https://cache.nix-ci.com
13.87 s
Downloaded cached libsodium-1.0.22-unstable-2026-04 (666 KiB) in 57ms
13.87 s
Progress: 0 of 1 built, 9 of 40 downloaded from cache (6 downloading)
13.88 s
Downloaded cached aws-c-common (1.1 MiB) in 58ms
13.88 s
Progress: 0 of 1 built, 10 of 40 downloaded from cache (5 downloading)
13.88 s
Downloading cached aws-c-cal from https://cache.nix-ci.com
13.88 s
Downloading cached aws-c-compression from https://cache.nix-ci.com
13.88 s
Downloading cached aws-c-sdkutils from https://cache.nix-ci.com
13.88 s
Downloading cached aws-checksums from https://cache.nix-ci.com
13.89 s
Downloaded cached s2n-tls (1.3 MiB) in 71ms
13.89 s
Progress: 0 of 1 built, 11 of 40 downloaded from cache (8 downloading)
13.89 s
Downloaded cached libxml2 (1.4 MiB) in 72ms
13.89 s
Progress: 0 of 1 built, 12 of 40 downloaded from cache (7 downloading)
13.89 s
Downloading cached libarchive-3.8.8-lib from https://cache.nix-ci.com
13.90 s
Downloaded cached libgit2-1.9.4-lib (1.6 MiB) in 47ms
13.90 s
Progress: 0 of 1 built, 13 of 40 downloaded from cache (7 downloading)
13.92 s
Downloaded cached aws-c-compression (31 KiB) in 46ms
13.92 s
Progress: 0 of 1 built, 14 of 40 downloaded from cache (6 downloading)
13.92 s
Downloaded cached aws-c-cal (158 KiB) in 47ms
13.92 s
Downloaded cached aws-checksums (86 KiB) in 47ms
13.92 s
Progress: 0 of 1 built, 15 of 40 downloaded from cache (5 downloading)
13.93 s
Progress: 0 of 1 built, 16 of 40 downloaded from cache (5 downloading)
13.93 s
Downloading cached aws-c-io from https://cache.nix-ci.com
13.93 s
Downloaded cached aws-c-sdkutils (155 KiB) in 48ms
13.93 s
Progress: 0 of 1 built, 17 of 40 downloaded from cache (4 downloading)
13.93 s
Downloaded cached onetbb (626 KiB) in 55ms
13.93 s
Progress: 0 of 1 built, 18 of 40 downloaded from cache (3 downloading)
13.93 s
Downloading cached libblake3 from https://cache.nix-ci.com
13.94 s
Downloaded cached libarchive-3.8.8-lib (953 KiB) in 54ms
13.94 s
Progress: 0 of 1 built, 19 of 40 downloaded from cache (3 downloading)
13.97 s
Downloaded cached libblake3 (117 KiB) in 44ms
13.97 s
Progress: 0 of 1 built, 20 of 40 downloaded from cache (2 downloading)
13.97 s
Downloaded cached aws-c-io (648 KiB) in 48ms
13.97 s
Progress: 0 of 1 built, 21 of 40 downloaded from cache (1 downloading)
13.97 s
Downloading cached aws-c-event-stream from https://cache.nix-ci.com
13.97 s
Downloading cached aws-c-http from https://cache.nix-ci.com
14.02 s
Downloaded cached icu4c (38.2 MiB) in 200ms
14.02 s
Progress: 0 of 1 built, 22 of 40 downloaded from cache (2 downloading)
14.02 s
Downloading cached boost from https://cache.nix-ci.com
14.02 s
Downloaded cached aws-c-event-stream (176 KiB) in 45ms
14.02 s
Progress: 0 of 1 built, 23 of 40 downloaded from cache (2 downloading)
14.02 s
Downloaded cached aws-c-http (641 KiB) in 46ms
14.02 s
Progress: 0 of 1 built, 24 of 40 downloaded from cache (1 downloading)
14.02 s
Downloading cached aws-c-auth from https://cache.nix-ci.com
14.02 s
Downloading cached aws-c-mqtt from https://cache.nix-ci.com
14.04 s
Downloaded cached aws-c-auth (387 KiB) in 20ms
14.04 s
Progress: 0 of 1 built, 25 of 40 downloaded from cache (2 downloading)
14.04 s
Downloading cached aws-c-s3 from https://cache.nix-ci.com
14.04 s
Downloaded cached aws-c-mqtt (557 KiB) in 22ms
14.04 s
Progress: 0 of 1 built, 26 of 40 downloaded from cache (2 downloading)
14.07 s
Downloaded cached boost (14.5 MiB) in 52ms
14.07 s
Progress: 0 of 1 built, 27 of 40 downloaded from cache (1 downloading)
14.07 s
Downloading cached nix-util from https://cache.nix-ci.com
14.07 s
Downloaded cached aws-c-s3 (384 KiB) in 30ms
14.07 s
Progress: 0 of 1 built, 28 of 40 downloaded from cache (1 downloading)
14.07 s
Downloading cached aws-crt-cpp from https://cache.nix-ci.com
14.09 s
Downloaded cached aws-crt-cpp (979 KiB) in 14ms
14.09 s
Progress: 0 of 1 built, 29 of 40 downloaded from cache (1 downloading)
14.18 s
Downloaded cached nix-util (2.4 MiB) in 105ms
14.18 s
Progress: 0 of 1 built, 30 of 40 downloaded from cache
14.18 s
Downloading cached nix-nswrapper from https://cache.nix-ci.com
14.18 s
Downloading cached nix-store from https://cache.nix-ci.com
14.19 s
Downloaded cached nix-nswrapper (131 KiB) in 11ms
14.19 s
Progress: 0 of 1 built, 31 of 40 downloaded from cache (1 downloading)
14.21 s
Downloaded cached nix-store (5.8 MiB) in 32ms
14.21 s
Progress: 0 of 1 built, 32 of 40 downloaded from cache
14.21 s
Downloading cached nix-fetchers from https://cache.nix-ci.com
14.21 s
Downloading cached nix-main from https://cache.nix-ci.com
14.23 s
Downloaded cached nix-main (393 KiB) in 16ms
14.23 s
Progress: 0 of 1 built, 33 of 40 downloaded from cache (1 downloading)
14.23 s
Downloaded cached nix-fetchers (1.5 MiB) in 17ms
14.23 s
Progress: 0 of 1 built, 34 of 40 downloaded from cache
14.23 s
Downloading cached nix-expr from https://cache.nix-ci.com
14.34 s
Downloaded cached nix-expr (3.3 MiB) in 109ms
14.34 s
Progress: 0 of 1 built, 35 of 40 downloaded from cache
14.34 s
Downloading cached nix-flake from https://cache.nix-ci.com
14.35 s
Downloaded cached nix-flake (956 KiB) in 15ms
14.35 s
Progress: 0 of 1 built, 36 of 40 downloaded from cache
14.35 s
Downloading cached nix-cmd from https://cache.nix-ci.com
14.37 s
Downloaded cached nix-cmd (1 MiB) in 14ms
14.37 s
Progress: 0 of 1 built, 37 of 40 downloaded from cache
14.37 s
Downloading cached nix from https://cache.nix-ci.com
14.39 s
Downloaded cached nix (3.9 MiB) in 24ms
14.39 s
Progress: 0 of 1 built, 38 of 40 downloaded from cache
14.39 s
Downloading cached nix from https://cache.nix-ci.com
14.41 s
Downloaded cached nix (8848 B) in 18ms
14.41 s
Progress: 0 of 1 built, 39 of 40 downloaded from cache
14.41 s
Downloading cached nix-ci-check-gammaloop-doctest from https://cache.nix-ci.com
14.42 s
Downloaded cached nix-ci-check-gammaloop-doctest (1000 B) in 4ms
14.42 s
Progress: 0 of 1 built, 40 of 40 downloaded from cache
17.08 s
evaluating derivation 'g
copying '/nix/store/lvky
evaluating derivation 'g
querying gammaloop-works
[0.0 KiB DL] querying ga
[0.0 KiB DL] querying in
[0 /1 built, 0.0 KiB DL]
[1 /0 /1 built, 0.0 KiB DLgammaloop-workspace-doctest> Running phase: unpackPhase
17.10 s
gammaloop-workspace-doctest> unpacking source archive /nix/store/n62xwv096bc248rr6y7qpggfdbwshkw9-source
17.23 s
gammaloop-workspace-doctest> source root is source
17.26 s
gammaloop-workspace-doctest> Running phase: patchPhase
17.27 s
gammaloop-workspace-doctest> Executing configureCargoCommonVars
17.27 s
gammaloop-workspace-doctest> decompressing cargo artifacts from /nix/store/kbgwngi7xvi54jsr0kp8rhj1b9mfja7d-gammaloop-workspace-deps-deps-0.1.0/target.tar.zst to target
18.67 s
gammaloop-workspace-doctest> Running phase: updateAutotoolsGnuConfigScriptsPhase
18.70 s
gammaloop-workspace-doctest> Running phase: configurePhase
18.71 s
gammaloop-workspace-doctest> will append /build/source/.cargo-home/config.toml with contents of /nix/store/xdy1vvhll2bijdplvl9fcc2b9plkxhaa-vendor-cargo-deps/config.toml
18.71 s
gammaloop-workspace-doctest> default configurePhase, nothing to do
18.71 s
gammaloop-workspace-doctest> Running phase: buildPhase
18.72 s
gammaloop-workspace-doctest> +++ command cargo --version
18.72 s
gammaloop-workspace-doctest> cargo 1.97.0 (c980f4866 2026-06-30)
18.75 s
gammaloop-workspace-doctest> +++ command cargo test --profile ci-optim --doc --locked --workspace --features gammaloop-api/cli,gammaloop-tracing-filter/clap,gammaloop-tracing-filter/symbolica,idenso/bincode,idenso/reference-cases,linnet/bincode,linnet/drawing,linnet/nodestore-vec,linnet/rkyv,linnet/serde,linnet/symbolica,spenso-macros/shadowing,spenso/shadowing,symbolica/tracing_max_level_info
19.25 s
gammaloop-workspace-doctest> Compiling target-lexicon v0.13.5
19.28 s
gammaloop-workspace-doctest> Compiling symbolica v2.2.0 (https://github.com/symbolica-dev/symbolica?branch=dev#0441bd7a)
19.28 s
gammaloop-workspace-doctest> Compiling maplit v1.0.2
19.28 s
gammaloop-workspace-doctest> Compiling gammaloop-tracing-filter-macros v0.1.0 (/build/source/crates/gammaloop-tracing-filter-macros)
19.28 s
gammaloop-workspace-doctest> Compiling vakint v0.1.2 (/build/source/crates/vakint)
19.29 s
gammaloop-workspace-doctest> Compiling gammalooprs v0.3.4 (/build/source/crates/gammalooprs)
19.29 s
gammaloop-workspace-doctest> Compiling alphal00p-docs-macros v0.1.0 (/build/source/crates/alphal00p-docs-macros)
19.29 s
gammaloop-workspace-doctest> Compiling alphal00p-docs-schema v0.1.0 (/build/source/crates/alphal00p-docs-schema)
19.30 s
gammaloop-workspace-doctest> Compiling rustc_version v0.4.1
19.30 s
gammaloop-workspace-doctest> Compiling bincode v1.3.3
19.30 s
gammaloop-workspace-doctest> Compiling target-triple v1.0.1
19.31 s
gammaloop-workspace-doctest> Compiling gungraun-runner v0.18.2
19.31 s
gammaloop-workspace-doctest> Compiling iai-callgrind-runner v0.14.2
19.31 s
gammaloop-workspace-doctest> Compiling clinnet v0.1.8 (/build/source/crates/clinnet)
19.31 s
gammaloop-workspace-doctest> Compiling gammaloop-integration-tests v0.1.0 (/build/source/tests)
19.49 s
gammaloop-workspace-doctest> Compiling test-log-core v0.2.20
19.50 s
gammaloop-workspace-doctest> Compiling wait-timeout v0.2.1
19.52 s
gammaloop-workspace-doctest> Compiling iai-callgrind v0.14.2
19.54 s
gammaloop-workspace-doctest> Compiling quick-error v1.2.3
19.57 s
gammaloop-workspace-doctest> Compiling bit-vec v0.8.0
19.59 s
gammaloop-workspace-doctest> Compiling rusty-fork v0.3.1
19.78 s
gammaloop-workspace-doctest> Compiling bit-set v0.8.0
19.82 s
gammaloop-workspace-doctest> Compiling iai-callgrind-macros v0.5.1
19.85 s
gammaloop-workspace-doctest> Compiling rand_xorshift v0.4.0
19.93 s
gammaloop-workspace-doctest> Compiling gungraun-macros v0.8.0
19.96 s
gammaloop-workspace-doctest> Compiling console v0.15.11
19.99 s
gammaloop-workspace-doctest> Compiling termcolor v1.4.1
20.05 s
gammaloop-workspace-doctest> Compiling unarray v0.1.4
20.11 s
gammaloop-workspace-doctest> Compiling glob v0.3.4
20.18 s
gammaloop-workspace-doctest> Compiling base64 v0.21.7
20.39 s
gammaloop-workspace-doctest> Compiling similar-asserts v1.7.0
20.48 s
gammaloop-workspace-doctest> Compiling alphal00p-docs-catalogs v0.1.0 (/build/source/crates/alphal00p-docs-catalogs)
20.58 s
gammaloop-workspace-doctest> Compiling ron v0.8.1
20.68 s
gammaloop-workspace-doctest> Compiling pyo3-build-config v0.28.3
20.69 s
gammaloop-workspace-doctest> Compiling trybuild v1.0.120
20.72 s
gammaloop-workspace-doctest> Compiling alphal00p-docs-builder v0.1.0 (/build/source/crates/alphal00p-docs-builder)
20.91 s
gammaloop-workspace-doctest> Compiling proptest v1.11.0
20.94 s
gammaloop-workspace-doctest> Compiling kurvst v0.1.0 (/build/source/crates/kurvst)
21.21 s
gammaloop-workspace-doctest> Compiling test-log-macros v0.2.20
24.90 s
gammaloop-workspace-doctest> Compiling alphal00p-docs-examples v0.1.0 (/build/source/crates/alphal00p-docs-examples)
25.58 s
gammaloop-workspace-doctest> Compiling test-log v0.2.20
28.82 s
gammaloop-workspace-doctest> Compiling pyo3-macros-backend v0.28.3
28.86 s
gammaloop-workspace-doctest> Compiling pyo3-ffi v0.28.3
28.87 s
gammaloop-workspace-doctest> Compiling pyo3 v0.28.3
29.11 s
gammaloop-workspace-doctest> Compiling numpy v0.28.0
29.29 s
gammaloop-workspace-doctest> Compiling gammaloop-api v0.1.0 (/build/source/crates/gammaloop-api)
29.72 s
gammaloop-workspace-doctest> Compiling gungraun v0.18.2
38.61 s
gammaloop-workspace-doctest> Compiling pyo3-macros v0.28.3
43.89 s
gammaloop-workspace-doctest> Compiling pyo3-stub-gen v0.17.2
44.56 s
gammaloop-workspace-doctest> Compiling numerica v2.2.0 (https://github.com/symbolica-dev/symbolica?branch=dev#0441bd7a)
46.82 s
gammaloop-workspace-doctest> Compiling graphica v2.1.0 (https://github.com/symbolica-dev/symbolica?branch=dev#0441bd7a)
49.77 s
gammaloop-workspace-doctest> Compiling symbolica-utils v0.1.0 (/build/source/crates/symbolica-utils)
214.04 s
gammaloop-workspace-doctest> Compiling gammaloop-workspace-hack v0.1.0 (/build/source/crates/gammaloop-workspace-hack)
215.55 s
gammaloop-workspace-doctest> Compiling spenso-macros v0.3.2 (/build/source/crates/spenso-macros)
215.55 s
gammaloop-workspace-doctest> Compiling linnet v0.17.0 (/build/source/crates/linnet)
218.17 s
gammaloop-workspace-doctest> Compiling spenso v0.6.0 (/build/source/crates/spenso)
227.44 s
gammaloop-workspace-doctest> Compiling idenso v0.3.0 (/build/source/crates/idenso)
227.45 s
gammaloop-workspace-doctest> Compiling gammaloop-tracing-filter v0.1.0 (/build/source/crates/gammaloop-tracing-filter)
232.87 s
gammaloop-workspace-doctest> Compiling spenso-hep-lib v0.1.7 (/build/source/crates/spenso-hep-lib)
233.33 s
gammaloop-workspace-doctest> Compiling spynso3 v0.1.2 (/build/source/crates/spynso3)
293.68 s
gammaloop-workspace-doctest> Compiling linnest v0.1.0 (/build/source/crates/linnest)
293.69 s
gammaloop-workspace-doctest> Compiling linnet-py v0.1.0 (/build/source/crates/linnet-py)
449.39 s
gammaloop-workspace-doctest> Finished `ci-optim` profile [optimized] target(s) in 7m 10s
449.51 s
gammaloop-workspace-doctest> warning : the following packages contain code that will be rejected by a future version of Rust: proc-macro-error2 v2.0.1
449.51 s
gammaloop-workspace-doctest> note : to see what the problems were, use the option `--future-incompat-report`, or run `cargo report future-incompatibilities --id 1`
449.53 s
gammaloop-workspace-doctest> Doc-tests alphal00p_docs_builder
449.68 s
gammaloop-workspace-doctest>
449.68 s
gammaloop-workspace-doctest> running 0 tests
449.68 s
gammaloop-workspace-doctest>
449.68 s
gammaloop-workspace-doctest> test result: ok. 0 passed; 0 failed; 0 ignored; 0 measured; 0 filtered out; finished in 0.00s
449.68 s
gammaloop-workspace-doctest>
449.68 s
gammaloop-workspace-doctest> Doc-tests alphal00p_docs_catalogs
450.91 s
gammaloop-workspace-doctest>
450.91 s
gammaloop-workspace-doctest> running 0 tests
450.91 s
gammaloop-workspace-doctest>
450.91 s
gammaloop-workspace-doctest> test result: ok. 0 passed; 0 failed; 0 ignored; 0 measured; 0 filtered out; finished in 0.00s
450.91 s
gammaloop-workspace-doctest>
450.91 s
gammaloop-workspace-doctest> Doc-tests alphal00p_docs_examples
450.93 s
gammaloop-workspace-doctest>
450.93 s
gammaloop-workspace-doctest> running 0 tests
450.93 s
gammaloop-workspace-doctest>
450.93 s
gammaloop-workspace-doctest> test result: ok. 0 passed; 0 failed; 0 ignored; 0 measured; 0 filtered out; finished in 0.00s
450.93 s
gammaloop-workspace-doctest>
450.93 s
gammaloop-workspace-doctest> Doc-tests alphal00p_docs
450.99 s
gammaloop-workspace-doctest>
450.99 s
gammaloop-workspace-doctest> running 0 tests
450.99 s
gammaloop-workspace-doctest>
450.99 s
gammaloop-workspace-doctest> test result: ok. 0 passed; 0 failed; 0 ignored; 0 measured; 0 filtered out; finished in 0.00s
450.99 s
gammaloop-workspace-doctest>
450.99 s
gammaloop-workspace-doctest> Doc-tests alphal00p_docs_schema
451.07 s
gammaloop-workspace-doctest>
451.07 s
gammaloop-workspace-doctest> running 0 tests
451.07 s
gammaloop-workspace-doctest>
451.07 s
gammaloop-workspace-doctest> test result: ok. 0 passed; 0 failed; 0 ignored; 0 measured; 0 filtered out; finished in 0.00s
451.07 s
gammaloop-workspace-doctest>
451.07 s
gammaloop-workspace-doctest> Doc-tests clinnet
451.11 s
gammaloop-workspace-doctest>
451.11 s
gammaloop-workspace-doctest> running 0 tests
451.11 s
gammaloop-workspace-doctest>
451.11 s
gammaloop-workspace-doctest> test result: ok. 0 passed; 0 failed; 0 ignored; 0 measured; 0 filtered out; finished in 0.00s
451.11 s
gammaloop-workspace-doctest>
451.11 s
gammaloop-workspace-doctest> Doc-tests gammaloop_api
452.08 s
gammaloop-workspace-doctest>
452.08 s
gammaloop-workspace-doctest> running 13 tests
452.10 s
gammaloop-workspace-doctest> test crates/gammaloop-api/src/python.rs - python::GammaLoopAPI::get_active_command_blocks (line 3652) ... FAILED
452.10 s
gammaloop-workspace-doctest> test crates/gammaloop-api/src/python.rs - python::GammaLoopAPI::evaluate_samples (line 3040) ... FAILED
452.10 s
gammaloop-workspace-doctest> test crates/gammaloop-api/src/python.rs - python::GammaLoopAPI::evaluate_sample (line 2926) ... FAILED
452.10 s
gammaloop-workspace-doctest> test crates/gammaloop-api/src/python.rs - python::GammaLoopAPI::get_default_runtime_settings (line 3688) ... FAILED
452.10 s
gammaloop-workspace-doctest> test crates/gammaloop-api/src/python.rs - python::GammaLoopAPI::get_integrand_info (line 3496) ... FAILED
452.10 s
gammaloop-workspace-doctest> test crates/gammaloop-api/src/python.rs - python::GammaLoopAPI::get_integrand_settings (line 3539) ... FAILED
452.19 s
gammaloop-workspace-doctest> test crates/gammaloop-api/src/python.rs - python::GammaLoopAPI::run_command (line 3793) ... FAILED
452.19 s
gammaloop-workspace-doctest> test crates/gammaloop-api/src/python.rs - python::GammaLoopAPI::get_run_history (line 3603) ... FAILED
452.20 s
gammaloop-workspace-doctest> test crates/gammaloop-api/src/python.rs - python::evaluate_graph_overall_factor (line 95) ... FAILED
452.20 s
gammaloop-workspace-doctest> test crates/gammaloop-api/src/python.rs - python::GammaLoopAPI::new_python (line 2804) ... FAILED
452.20 s
gammaloop-workspace-doctest> test crates/gammaloop-api/src/python.rs - python::atom_to_canonical_string (line 128) ... FAILED
452.21 s
gammaloop-workspace-doctest> test crates/gammaloop-api/src/python.rs - python::GammaLoopAPI::get_global_settings (line 3631) ... FAILED
452.22 s
gammaloop-workspace-doctest> test crates/gammaloop-api/src/python.rs - python::atom_to_dots (line 157) ... FAILED
452.22 s
gammaloop-workspace-doctest>
452.22 s
gammaloop-workspace-doctest> failures:
452.22 s
gammaloop-workspace-doctest>
452.22 s
gammaloop-workspace-doctest> ---- crates/gammaloop-api/src/python.rs - python::GammaLoopAPI::get_active_command_blocks (line 3652) stdout ----
452.22 s
gammaloop-workspace-doctest> error: expected item, found keyword `for`
452.22 s
gammaloop-workspace-doctest> --> crates/gammaloop-api/src/python.rs:3653:1
452.22 s
gammaloop-workspace-doctest> |
452.22 s
gammaloop-workspace-doctest> 3653 | for name, commands in api.get_active_command_blocks().items():
452.22 s
gammaloop-workspace-doctest> | ^^^ expected item
452.22 s
gammaloop-workspace-doctest> |
452.22 s
gammaloop-workspace-doctest> = note: for a full list of items that can appear in modules, see <https://doc.rust-lang.org/reference/items.html>
452.22 s
gammaloop-workspace-doctest>
452.22 s
gammaloop-workspace-doctest> error: aborting due to 1 previous error
452.22 s
gammaloop-workspace-doctest>
452.22 s
gammaloop-workspace-doctest> Couldn't compile the test.
452.22 s
gammaloop-workspace-doctest> ---- crates/gammaloop-api/src/python.rs - python::GammaLoopAPI::evaluate_samples (line 3040) stdout ----
452.22 s
gammaloop-workspace-doctest> error: expected one of `!` or `::`, found `=`
452.22 s
gammaloop-workspace-doctest> --> crates/gammaloop-api/src/python.rs:3041:8
452.22 s
gammaloop-workspace-doctest> |
452.22 s
gammaloop-workspace-doctest> 3041 | points = numpy.asarray(points, dtype=numpy.float64)
452.22 s
gammaloop-workspace-doctest> | ^ expected one of `!` or `::`
452.22 s
gammaloop-workspace-doctest>
452.22 s
gammaloop-workspace-doctest> error: aborting due to 1 previous error
452.22 s
gammaloop-workspace-doctest>
452.22 s
gammaloop-workspace-doctest> Couldn't compile the test.
452.22 s
gammaloop-workspace-doctest> ---- crates/gammaloop-api/src/python.rs - python::GammaLoopAPI::evaluate_sample (line 2926) stdout ----
452.22 s
gammaloop-workspace-doctest> error: expected one of `!` or `::`, found `=`
452.22 s
gammaloop-workspace-doctest> --> crates/gammaloop-api/src/python.rs:2927:8
452.22 s
gammaloop-workspace-doctest> |
452.22 s
gammaloop-workspace-doctest> 2927 | result = api.evaluate_sample(point, process_id=0, minimal_output=True)
452.22 s
gammaloop-workspace-doctest> | ^ expected one of `!` or `::`
452.22 s
gammaloop-workspace-doctest>
452.22 s
gammaloop-workspace-doctest> error: aborting due to 1 previous error
452.22 s
gammaloop-workspace-doctest>
452.22 s
gammaloop-workspace-doctest> Couldn't compile the test.
452.22 s
gammaloop-workspace-doctest> ---- crates/gammaloop-api/src/python.rs - python::GammaLoopAPI::get_default_runtime_settings (line 3688) stdout ----
452.22 s
gammaloop-workspace-doctest> error: expected one of `!` or `::`, found `=`
452.22 s
gammaloop-workspace-doctest> --> crates/gammaloop-api/src/python.rs:3689:9
452.22 s
gammaloop-workspace-doctest> |
452.22 s
gammaloop-workspace-doctest> 3689 | runtime = api.get_default_runtime_settings()
452.22 s
gammaloop-workspace-doctest> | ^ expected one of `!` or `::`
452.22 s
gammaloop-workspace-doctest>
452.22 s
gammaloop-workspace-doctest> error: aborting due to 1 previous error
452.22 s
gammaloop-workspace-doctest>
452.22 s
gammaloop-workspace-doctest> Couldn't compile the test.
452.22 s
gammaloop-workspace-doctest> ---- crates/gammaloop-api/src/python.rs - python::GammaLoopAPI::get_integrand_info (line 3496) stdout ----
452.22 s
gammaloop-workspace-doctest> error: expected one of `!` or `::`, found `=`
452.22 s
gammaloop-workspace-doctest> --> crates/gammaloop-api/src/python.rs:3497:6
452.22 s
gammaloop-workspace-doctest> |
452.22 s
gammaloop-workspace-doctest> 3497 | info = api.get_integrand_info(process_id=0)
452.22 s
gammaloop-workspace-doctest> | ^ expected one of `!` or `::`
452.22 s
gammaloop-workspace-doctest>
452.22 s
gammaloop-workspace-doctest> error: aborting due to 1 previous error
452.22 s
gammaloop-workspace-doctest>
452.22 s
gammaloop-workspace-doctest> Couldn't compile the test.
452.22 s
gammaloop-workspace-doctest> ---- crates/gammaloop-api/src/python.rs - python::GammaLoopAPI::get_integrand_settings (line 3539) stdout ----
452.22 s
gammaloop-workspace-doctest> error: expected one of `!` or `::`, found `=`
452.22 s
gammaloop-workspace-doctest> --> crates/gammaloop-api/src/python.rs:3540:10
452.22 s
gammaloop-workspace-doctest> |
452.22 s
gammaloop-workspace-doctest> 3540 | settings = api.get_integrand_settings(process_id=0)
452.22 s
gammaloop-workspace-doctest> | ^ expected one of `!` or `::`
452.22 s
gammaloop-workspace-doctest>
452.22 s
gammaloop-workspace-doctest> error: aborting due to 1 previous error
452.22 s
gammaloop-workspace-doctest>
452.22 s
gammaloop-workspace-doctest> Couldn't compile the test.
452.22 s
gammaloop-workspace-doctest> ---- crates/gammaloop-api/src/python.rs - python::GammaLoopAPI::run_command (line 3793) stdout ----
452.22 s
gammaloop-workspace-doctest> error[E0425] : cannot find value `api` in this scope
452.22 s
gammaloop-workspace-doctest> --> crates/gammaloop-api/src/python.rs:3794:1
452.22 s
gammaloop-workspace-doctest> |
452.22 s
gammaloop-workspace-doctest> 3794 | api.run("display processes")
452.22 s
gammaloop-workspace-doctest> | ^^^ not found in this scope
452.22 s
gammaloop-workspace-doctest>
452.22 s
gammaloop-workspace-doctest> error : aborting due to 1 previous error
452.22 s
gammaloop-workspace-doctest>
452.22 s
gammaloop-workspace-doctest> For more information about this error, try `rustc --explain E0425`.
452.22 s
gammaloop-workspace-doctest> Couldn't compile the test.
452.22 s
gammaloop-workspace-doctest> ---- crates/gammaloop-api/src/python.rs - python::GammaLoopAPI::get_run_history (line 3603) stdout ----
452.22 s
gammaloop-workspace-doctest> error[E0425] : cannot find value `run_card_toml` in this scope
452.22 s
gammaloop-workspace-doctest> --> crates/gammaloop-api/src/python.rs:3604:1
452.22 s
gammaloop-workspace-doctest> |
452.22 s
gammaloop-workspace-doctest> 3604 | run_card_toml = api.get_run_history()
452.22 s
gammaloop-workspace-doctest> | ^^^^^^^^^^^^^
452.22 s
gammaloop-workspace-doctest> |
452.22 s
gammaloop-workspace-doctest> help : you might have meant to introduce a new binding
452.22 s
gammaloop-workspace-doctest> |
452.22 s
gammaloop-workspace-doctest> 3604 | let run_card_toml = api.get_run_history()
452.22 s
gammaloop-workspace-doctest> | +++
452.22 s
gammaloop-workspace-doctest>
452.22 s
gammaloop-workspace-doctest> error[E0425] : cannot find value `api` in this scope
452.22 s
gammaloop-workspace-doctest> --> crates/gammaloop-api/src/python.rs:3604:17
452.22 s
gammaloop-workspace-doctest> |
452.22 s
gammaloop-workspace-doctest> 3604 | run_card_toml = api.get_run_history()
452.22 s
gammaloop-workspace-doctest> | ^^^ not found in this scope
452.22 s
gammaloop-workspace-doctest>
452.22 s
gammaloop-workspace-doctest> error : aborting due to 2 previous errors
452.22 s
gammaloop-workspace-doctest>
452.22 s
gammaloop-workspace-doctest> For more information about this error, try `rustc --explain E0425`.
452.22 s
gammaloop-workspace-doctest> Couldn't compile the test.
452.22 s
gammaloop-workspace-doctest> ---- crates/gammaloop-api/src/python.rs - python::evaluate_graph_overall_factor (line 95) stdout ----
452.22 s
gammaloop-workspace-doctest> error[E0425] : cannot find function `evaluate_graph_overall_factor` in this scope
452.22 s
gammaloop-workspace-doctest> --> crates/gammaloop-api/src/python.rs:96:1
452.22 s
gammaloop-workspace-doctest> |
452.22 s
gammaloop-workspace-doctest> 96 | evaluate_graph_overall_factor(
452.22 s
gammaloop-workspace-doctest> | ^^^^^^^^^^^^^^^^^^^^^^^^^^^^^ not found in this scope
452.22 s
gammaloop-workspace-doctest>
452.22 s
gammaloop-workspace-doctest> error : aborting due to 1 previous error
452.22 s
gammaloop-workspace-doctest>
452.22 s
gammaloop-workspace-doctest> For more information about this error, try `rustc --explain E0425`.
452.22 s
gammaloop-workspace-doctest> Couldn't compile the test.
452.22 s
gammaloop-workspace-doctest> ---- crates/gammaloop-api/src/python.rs - python::GammaLoopAPI::new_python (line 2804) stdout ----
452.22 s
gammaloop-workspace-doctest> error[E0425] : cannot find value `api` in this scope
452.22 s
gammaloop-workspace-doctest> --> crates/gammaloop-api/src/python.rs:2805:1
452.22 s
gammaloop-workspace-doctest> |
452.22 s
gammaloop-workspace-doctest> 2805 | api = GammaLoopAPI(state_folder="./state", read_only_state=True)
452.22 s
gammaloop-workspace-doctest> | ^^^
452.22 s
gammaloop-workspace-doctest> |
452.22 s
gammaloop-workspace-doctest> help : you might have meant to introduce a new binding
452.22 s
gammaloop-workspace-doctest> |
452.22 s
gammaloop-workspace-doctest> 2805 | let api = GammaLoopAPI(state_folder="./state", read_only_state=True)
452.22 s
gammaloop-workspace-doctest> | +++
452.22 s
gammaloop-workspace-doctest>
452.22 s
gammaloop-workspace-doctest> error[E0425] : cannot find value `state_folder` in this scope
452.22 s
gammaloop-workspace-doctest> --> crates/gammaloop-api/src/python.rs:2805:20
452.22 s
gammaloop-workspace-doctest> |
452.22 s
gammaloop-workspace-doctest> 2805 | api = GammaLoopAPI(state_folder="./state", read_only_state=True)
452.22 s
gammaloop-workspace-doctest> | ^^^^^^^^^^^^ not found in this scope
452.22 s
gammaloop-workspace-doctest>
452.22 s
gammaloop-workspace-doctest> error[E0425] : cannot find value `read_only_state` in this scope
452.22 s
gammaloop-workspace-doctest> --> crates/gammaloop-api/src/python.rs:2805:44
452.22 s
gammaloop-workspace-doctest> |
452.22 s
gammaloop-workspace-doctest> 2805 | api = GammaLoopAPI(state_folder="./state", read_only_state=True)
452.22 s
gammaloop-workspace-doctest> | ^^^^^^^^^^^^^^^ not found in this scope
452.22 s
gammaloop-workspace-doctest>
452.22 s
gammaloop-workspace-doctest> error[E0425] : cannot find value `True` in this scope
452.22 s
gammaloop-workspace-doctest> --> crates/gammaloop-api/src/python.rs:2805:60
452.22 s
gammaloop-workspace-doctest> |
452.22 s
gammaloop-workspace-doctest> 2805 | api = GammaLoopAPI(state_folder="./state", read_only_state=True)
452.22 s
gammaloop-workspace-doctest> | ^^^^ not found in this scope
452.22 s
gammaloop-workspace-doctest> |
452.22 s
gammaloop-workspace-doctest> help : you may want to use a bool value instead
452.22 s
gammaloop-workspace-doctest> |
452.22 s
gammaloop-workspace-doctest> 2805 - api = GammaLoopAPI(state_folder="./state", read_only_state=True )
452.22 s
gammaloop-workspace-doctest> 2805 + api = GammaLoopAPI(state_folder="./state", read_only_state=true )
452.22 s
gammaloop-workspace-doctest> |
452.22 s
gammaloop-workspace-doctest>
452.22 s
gammaloop-workspace-doctest> error[E0425] : cannot find function, tuple struct or tuple variant `GammaLoopAPI` in this scope
452.22 s
gammaloop-workspace-doctest> --> crates/gammaloop-api/src/python.rs:2805:7
452.22 s
gammaloop-workspace-doctest> |
452.22 s
gammaloop-workspace-doctest> 2805 | api = GammaLoopAPI(state_folder="./state", read_only_state=True)
452.22 s
gammaloop-workspace-doctest> | ^^^^^^^^^^^^ not found in this scope
452.22 s
gammaloop-workspace-doctest>
452.22 s
gammaloop-workspace-doctest> error : aborting due to 5 previous errors
452.22 s
gammaloop-workspace-doctest>
452.22 s
gammaloop-workspace-doctest> For more information about this error, try `rustc --explain E0425`.
452.22 s
gammaloop-workspace-doctest> Couldn't compile the test.
452.22 s
gammaloop-workspace-doctest> ---- crates/gammaloop-api/src/python.rs - python::atom_to_canonical_string (line 128) stdout ----
452.22 s
gammaloop-workspace-doctest> error[E0425] : cannot find function `atom_to_canonical_string` in this scope
452.22 s
gammaloop-workspace-doctest> --> crates/gammaloop-api/src/python.rs:129:1
452.22 s
gammaloop-workspace-doctest> |
452.22 s
gammaloop-workspace-doctest> 129 | atom_to_canonical_string("x + x")
452.22 s
gammaloop-workspace-doctest> | ^^^^^^^^^^^^^^^^^^^^^^^^ not found in this scope
452.22 s
gammaloop-workspace-doctest>
452.22 s
gammaloop-workspace-doctest> error : aborting due to 1 previous error
452.22 s
gammaloop-workspace-doctest>
452.22 s
gammaloop-workspace-doctest> For more information about this error, try `rustc --explain E0425`.
452.22 s
gammaloop-workspace-doctest> Couldn't compile the test.
452.22 s
gammaloop-workspace-doctest> ---- crates/gammaloop-api/src/python.rs - python::GammaLoopAPI::get_global_settings (line 3631) stdout ----
452.22 s
gammaloop-workspace-doctest> error[E0425] : cannot find value `settings_toml` in this scope
452.22 s
gammaloop-workspace-doctest> --> crates/gammaloop-api/src/python.rs:3632:1
452.22 s
gammaloop-workspace-doctest> |
452.22 s
gammaloop-workspace-doctest> 3632 | settings_toml = api.get_global_settings()
452.22 s
gammaloop-workspace-doctest> | ^^^^^^^^^^^^^
452.22 s
gammaloop-workspace-doctest> |
452.22 s
gammaloop-workspace-doctest> help : you might have meant to introduce a new binding
452.22 s
gammaloop-workspace-doctest> |
452.22 s
gammaloop-workspace-doctest> 3632 | let settings_toml = api.get_global_settings()
452.22 s
gammaloop-workspace-doctest> | +++
452.22 s
gammaloop-workspace-doctest>
452.22 s
gammaloop-workspace-doctest> error[E0425] : cannot find value `api` in this scope
452.22 s
gammaloop-workspace-doctest> --> crates/gammaloop-api/src/python.rs:3632:17
452.22 s
gammaloop-workspace-doctest> |
452.22 s
gammaloop-workspace-doctest> 3632 | settings_toml = api.get_global_settings()
452.22 s
gammaloop-workspace-doctest> | ^^^ not found in this scope
452.23 s
gammaloop-workspace-doctest>
452.23 s
gammaloop-workspace-doctest> error : aborting due to 2 previous errors
452.23 s
gammaloop-workspace-doctest>
452.23 s
gammaloop-workspace-doctest> For more information about this error, try `rustc --explain E0425`.
452.23 s
gammaloop-workspace-doctest> Couldn't compile the test.
452.23 s
gammaloop-workspace-doctest> ---- crates/gammaloop-api/src/python.rs - python::atom_to_dots (line 157) stdout ----
452.23 s
gammaloop-workspace-doctest> error[E0425] : cannot find function `to_dots` in this scope
452.23 s
gammaloop-workspace-doctest> --> crates/gammaloop-api/src/python.rs:158:1
452.23 s
gammaloop-workspace-doctest> |
452.23 s
gammaloop-workspace-doctest> 158 | to_dots("p(mu) * q(mu)")
452.23 s
gammaloop-workspace-doctest> | ^^^^^^^ not found in this scope
452.23 s
gammaloop-workspace-doctest>
452.23 s
gammaloop-workspace-doctest> error : aborting due to 1 previous error
452.23 s
gammaloop-workspace-doctest>
452.23 s
gammaloop-workspace-doctest> For more information about this error, try `rustc --explain E0425`.
452.23 s
gammaloop-workspace-doctest> Couldn't compile the test.
452.23 s
gammaloop-workspace-doctest>
452.23 s
gammaloop-workspace-doctest> failures:
452.23 s
gammaloop-workspace-doctest> crates/gammaloop-api/src/python.rs - python::GammaLoopAPI::evaluate_sample (line 2926)
452.23 s
gammaloop-workspace-doctest> crates/gammaloop-api/src/python.rs - python::GammaLoopAPI::evaluate_samples (line 3040)
452.23 s
gammaloop-workspace-doctest> crates/gammaloop-api/src/python.rs - python::GammaLoopAPI::get_active_command_blocks (line 3652)
452.23 s
gammaloop-workspace-doctest> crates/gammaloop-api/src/python.rs - python::GammaLoopAPI::get_default_runtime_settings (line 3688)
452.23 s
gammaloop-workspace-doctest> crates/gammaloop-api/src/python.rs - python::GammaLoopAPI::get_global_settings (line 3631)
452.23 s
gammaloop-workspace-doctest> crates/gammaloop-api/src/python.rs - python::GammaLoopAPI::get_integrand_info (line 3496)
452.23 s
gammaloop-workspace-doctest> crates/gammaloop-api/src/python.rs - python::GammaLoopAPI::get_integrand_settings (line 3539)
452.23 s
gammaloop-workspace-doctest> crates/gammaloop-api/src/python.rs - python::GammaLoopAPI::get_run_history (line 3603)
452.23 s
gammaloop-workspace-doctest> crates/gammaloop-api/src/python.rs - python::GammaLoopAPI::new_python (line 2804)
452.23 s
gammaloop-workspace-doctest> crates/gammaloop-api/src/python.rs - python::GammaLoopAPI::run_command (line 3793)
452.23 s
gammaloop-workspace-doctest> crates/gammaloop-api/src/python.rs - python::atom_to_canonical_string (line 128)
452.23 s
gammaloop-workspace-doctest> crates/gammaloop-api/src/python.rs - python::atom_to_dots (line 157)
452.23 s
gammaloop-workspace-doctest> crates/gammaloop-api/src/python.rs - python::evaluate_graph_overall_factor (line 95)
452.23 s
gammaloop-workspace-doctest>
452.23 s
gammaloop-workspace-doctest> test result: FAILED. 0 passed; 13 failed; 0 ignored; 0 measured; 0 filtered out; finished in 0.14s
452.23 s
gammaloop-workspace-doctest>
452.23 s
gammaloop-workspace-doctest> error : doctest failed, to rerun pass `-p gammaloop-api --doc`
452.67 s
error: Cannot build '/nix/store/d7n0kzr0ab2qmzp3m3y3jhx03bbngjym-gammaloop-workspace-doctest-0.1.0.drv '.
452.67 s
Reason: builder failed with exit code 101 .
452.67 s
Output paths:
452.67 s
/nix/store/m1rbsc5idl2jxvknq7bvqysz3ysaha7l-gammaloop-workspace-doctest-0.1.0
452.67 s
Last 349 log lines:
452.67 s
> Running phase: unpackPhase
452.67 s
> unpacking source archive /nix/store/n62xwv096bc248rr6y7qpggfdbwshkw9-source
452.67 s
> source root is source
452.67 s
> Running phase: patchPhase
452.67 s
> Executing configureCargoCommonVars
452.67 s
> decompressing cargo artifacts from /nix/store/kbgwngi7xvi54jsr0kp8rhj1b9mfja7d-gammaloop-workspace-deps-deps-0.1.0/target.tar.zst to target
452.67 s
> Running phase: updateAutotoolsGnuConfigScriptsPhase
452.67 s
> Running phase: configurePhase
452.67 s
> will append /build/source/.cargo-home/config.toml with contents of /nix/store/xdy1vvhll2bijdplvl9fcc2b9plkxhaa-vendor-cargo-deps/config.toml
452.67 s
> default configurePhase, nothing to do
452.67 s
> Running phase: buildPhase
452.67 s
> +++ command cargo --version
452.67 s
> cargo 1.97.0 (c980f4866 2026-06-30)
452.67 s
> +++ command cargo test --profile ci-optim --doc --locked --workspace --features gammaloop-api/cli,gammaloop-tracing-filter/clap,gammaloop-tracing-filter/symbolica,idenso/bincode,idenso/reference-cases,linnet/bincode,linnet/drawing,linnet/nodestore-vec,linnet/rkyv,linnet/serde,linnet/symbolica,spenso-macros/shadowing,spenso/shadowing,symbolica/tracing_max_level_info
452.67 s
> Compiling target-lexicon v0.13.5
452.67 s
> Compiling symbolica v2.2.0 (https://github.com/symbolica-dev/symbolica?branch=dev#0441bd7a)
452.67 s
> Compiling maplit v1.0.2
452.67 s
> Compiling gammaloop-tracing-filter-macros v0.1.0 (/build/source/crates/gammaloop-tracing-filter-macros)
452.67 s
> Compiling vakint v0.1.2 (/build/source/crates/vakint)
452.67 s
> Compiling gammalooprs v0.3.4 (/build/source/crates/gammalooprs)
452.67 s
> Compiling alphal00p-docs-macros v0.1.0 (/build/source/crates/alphal00p-docs-macros)
452.67 s
> Compiling alphal00p-docs-schema v0.1.0 (/build/source/crates/alphal00p-docs-schema)
452.67 s
> Compiling rustc_version v0.4.1
452.67 s
> Compiling bincode v1.3.3
452.67 s
> Compiling target-triple v1.0.1
452.67 s
> Compiling gungraun-runner v0.18.2
452.67 s
> Compiling iai-callgrind-runner v0.14.2
452.67 s
> Compiling clinnet v0.1.8 (/build/source/crates/clinnet)
452.67 s
> Compiling gammaloop-integration-tests v0.1.0 (/build/source/tests)
452.67 s
> Compiling test-log-core v0.2.20
452.67 s
> Compiling wait-timeout v0.2.1
452.67 s
> Compiling iai-callgrind v0.14.2
452.67 s
> Compiling quick-error v1.2.3
452.67 s
> Compiling bit-vec v0.8.0
452.67 s
> Compiling rusty-fork v0.3.1
452.67 s
> Compiling bit-set v0.8.0
452.67 s
> Compiling iai-callgrind-macros v0.5.1
452.67 s
> Compiling rand_xorshift v0.4.0
452.67 s
> Compiling gungraun-macros v0.8.0
452.67 s
> Compiling console v0.15.11
452.67 s
> Compiling termcolor v1.4.1
452.67 s
> Compiling unarray v0.1.4
452.67 s
> Compiling glob v0.3.4
452.67 s
> Compiling base64 v0.21.7
452.67 s
> Compiling similar-asserts v1.7.0
452.67 s
> Compiling alphal00p-docs-catalogs v0.1.0 (/build/source/crates/alphal00p-docs-catalogs)
452.67 s
> Compiling ron v0.8.1
452.67 s
> Compiling pyo3-build-config v0.28.3
452.67 s
> Compiling trybuild v1.0.120
452.67 s
> Compiling alphal00p-docs-builder v0.1.0 (/build/source/crates/alphal00p-docs-builder)
452.67 s
> Compiling proptest v1.11.0
452.67 s
> Compiling kurvst v0.1.0 (/build/source/crates/kurvst)
452.67 s
> Compiling test-log-macros v0.2.20
452.67 s
> Compiling alphal00p-docs-examples v0.1.0 (/build/source/crates/alphal00p-docs-examples)
452.67 s
> Compiling test-log v0.2.20
452.67 s
> Compiling pyo3-macros-backend v0.28.3
452.67 s
> Compiling pyo3-ffi v0.28.3
452.67 s
> Compiling pyo3 v0.28.3
452.67 s
> Compiling numpy v0.28.0
452.67 s
> Compiling gammaloop-api v0.1.0 (/build/source/crates/gammaloop-api)
452.67 s
> Compiling gungraun v0.18.2
452.67 s
> Compiling pyo3-macros v0.28.3
452.67 s
> Compiling pyo3-stub-gen v0.17.2
452.67 s
> Compiling numerica v2.2.0 (https://github.com/symbolica-dev/symbolica?branch=dev#0441bd7a)
452.67 s
> Compiling graphica v2.1.0 (https://github.com/symbolica-dev/symbolica?branch=dev#0441bd7a)
452.67 s
> Compiling symbolica-utils v0.1.0 (/build/source/crates/symbolica-utils)
452.67 s
> Compiling gammaloop-workspace-hack v0.1.0 (/build/source/crates/gammaloop-workspace-hack)
452.67 s
> Compiling spenso-macros v0.3.2 (/build/source/crates/spenso-macros)
452.67 s
> Compiling linnet v0.17.0 (/build/source/crates/linnet)
452.67 s
> Compiling spenso v0.6.0 (/build/source/crates/spenso)
452.67 s
> Compiling idenso v0.3.0 (/build/source/crates/idenso)
452.67 s
> Compiling gammaloop-tracing-filter v0.1.0 (/build/source/crates/gammaloop-tracing-filter)
452.67 s
> Compiling spenso-hep-lib v0.1.7 (/build/source/crates/spenso-hep-lib)
452.67 s
> Compiling spynso3 v0.1.2 (/build/source/crates/spynso3)
452.67 s
> Compiling linnest v0.1.0 (/build/source/crates/linnest)
452.67 s
> Compiling linnet-py v0.1.0 (/build/source/crates/linnet-py)
452.67 s
> Finished `ci-optim` profile [optimized] target(s) in 7m 10s
452.67 s
> warning : the following packages contain code that will be rejected by a future version of Rust: proc-macro-error2 v2.0.1
452.67 s
> note : to see what the problems were, use the option `--future-incompat-report`, or run `cargo report future-incompatibilities --id 1`
452.67 s
> Doc-tests alphal00p_docs_builder
452.67 s
>
452.67 s
> running 0 tests
452.67 s
>
452.67 s
> test result: ok. 0 passed; 0 failed; 0 ignored; 0 measured; 0 filtered out; finished in 0.00s
452.67 s
>
452.67 s
> Doc-tests alphal00p_docs_catalogs
452.67 s
>
452.67 s
> running 0 tests
452.67 s
>
452.67 s
> test result: ok. 0 passed; 0 failed; 0 ignored; 0 measured; 0 filtered out; finished in 0.00s
452.67 s
>
452.67 s
> Doc-tests alphal00p_docs_examples
452.67 s
>
452.67 s
> running 0 tests
452.67 s
>
452.67 s
> test result: ok. 0 passed; 0 failed; 0 ignored; 0 measured; 0 filtered out; finished in 0.00s
452.67 s
>
452.67 s
> Doc-tests alphal00p_docs
452.67 s
>
452.67 s
> running 0 tests
452.67 s
>
452.67 s
> test result: ok. 0 passed; 0 failed; 0 ignored; 0 measured; 0 filtered out; finished in 0.00s
452.67 s
>
452.67 s
> Doc-tests alphal00p_docs_schema
452.67 s
>
452.67 s
> running 0 tests
452.67 s
>
452.67 s
> test result: ok. 0 passed; 0 failed; 0 ignored; 0 measured; 0 filtered out; finished in 0.00s
452.67 s
>
452.67 s
> Doc-tests clinnet
452.67 s
>
452.67 s
> running 0 tests
452.67 s
>
452.67 s
> test result: ok. 0 passed; 0 failed; 0 ignored; 0 measured; 0 filtered out; finished in 0.00s
452.67 s
>
452.67 s
> Doc-tests gammaloop_api
452.67 s
>
452.67 s
> running 13 tests
452.67 s
> test crates/gammaloop-api/src/python.rs - python::GammaLoopAPI::get_active_command_blocks (line 3652) ... FAILED
452.67 s
> test crates/gammaloop-api/src/python.rs - python::GammaLoopAPI::evaluate_samples (line 3040) ... FAILED
452.67 s
> test crates/gammaloop-api/src/python.rs - python::GammaLoopAPI::evaluate_sample (line 2926) ... FAILED
452.67 s
> test crates/gammaloop-api/src/python.rs - python::GammaLoopAPI::get_default_runtime_settings (line 3688) ... FAILED
452.67 s
> test crates/gammaloop-api/src/python.rs - python::GammaLoopAPI::get_integrand_info (line 3496) ... FAILED
452.67 s
> test crates/gammaloop-api/src/python.rs - python::GammaLoopAPI::get_integrand_settings (line 3539) ... FAILED
452.67 s
> test crates/gammaloop-api/src/python.rs - python::GammaLoopAPI::run_command (line 3793) ... FAILED
452.67 s
> test crates/gammaloop-api/src/python.rs - python::GammaLoopAPI::get_run_history (line 3603) ... FAILED
452.67 s
> test crates/gammaloop-api/src/python.rs - python::evaluate_graph_overall_factor (line 95) ... FAILED
452.67 s
> test crates/gammaloop-api/src/python.rs - python::GammaLoopAPI::new_python (line 2804) ... FAILED
452.67 s
> test crates/gammaloop-api/src/python.rs - python::atom_to_canonical_string (line 128) ... FAILED
452.67 s
> test crates/gammaloop-api/src/python.rs - python::GammaLoopAPI::get_global_settings (line 3631) ... FAILED
452.67 s
> test crates/gammaloop-api/src/python.rs - python::atom_to_dots (line 157) ... FAILED
452.67 s
>
452.67 s
> failures:
452.67 s
>
452.67 s
> ---- crates/gammaloop-api/src/python.rs - python::GammaLoopAPI::get_active_command_blocks (line 3652) stdout ----
452.67 s
> error: expected item, found keyword `for`
452.67 s
> --> crates/gammaloop-api/src/python.rs:3653:1
452.67 s
> |
452.67 s
> 3653 | for name, commands in api.get_active_command_blocks().items():
452.67 s
> | ^^^ expected item
452.67 s
> |
452.67 s
> = note: for a full list of items that can appear in modules, see <https://doc.rust-lang.org/reference/items.html>
452.67 s
>
452.67 s
> error: aborting due to 1 previous error
452.67 s
>
452.67 s
> Couldn't compile the test.
452.67 s
> ---- crates/gammaloop-api/src/python.rs - python::GammaLoopAPI::evaluate_samples (line 3040) stdout ----
452.67 s
> error: expected one of `!` or `::`, found `=`
452.67 s
> --> crates/gammaloop-api/src/python.rs:3041:8
452.67 s
> |
452.67 s
> 3041 | points = numpy.asarray(points, dtype=numpy.float64)
452.67 s
> | ^ expected one of `!` or `::`
452.67 s
>
452.67 s
> error: aborting due to 1 previous error
452.67 s
>
452.67 s
> Couldn't compile the test.
452.67 s
> ---- crates/gammaloop-api/src/python.rs - python::GammaLoopAPI::evaluate_sample (line 2926) stdout ----
452.67 s
> error: expected one of `!` or `::`, found `=`
452.67 s
> --> crates/gammaloop-api/src/python.rs:2927:8
452.67 s
> |
452.67 s
> 2927 | result = api.evaluate_sample(point, process_id=0, minimal_output=True)
452.67 s
> | ^ expected one of `!` or `::`
452.67 s
>
452.67 s
> error: aborting due to 1 previous error
452.67 s
>
452.67 s
> Couldn't compile the test.
452.67 s
> ---- crates/gammaloop-api/src/python.rs - python::GammaLoopAPI::get_default_runtime_settings (line 3688) stdout ----
452.67 s
> error: expected one of `!` or `::`, found `=`
452.67 s
> --> crates/gammaloop-api/src/python.rs:3689:9
452.67 s
> |
452.67 s
> 3689 | runtime = api.get_default_runtime_settings()
452.67 s
> | ^ expected one of `!` or `::`
452.67 s
>
452.67 s
> error: aborting due to 1 previous error
452.67 s
>
452.67 s
> Couldn't compile the test.
452.67 s
> ---- crates/gammaloop-api/src/python.rs - python::GammaLoopAPI::get_integrand_info (line 3496) stdout ----
452.67 s
> error: expected one of `!` or `::`, found `=`
452.67 s
> --> crates/gammaloop-api/src/python.rs:3497:6
452.67 s
> |
452.67 s
> 3497 | info = api.get_integrand_info(process_id=0)
452.67 s
> | ^ expected one of `!` or `::`
452.67 s
>
452.67 s
> error: aborting due to 1 previous error
452.67 s
>
452.67 s
> Couldn't compile the test.
452.67 s
> ---- crates/gammaloop-api/src/python.rs - python::GammaLoopAPI::get_integrand_settings (line 3539) stdout ----
452.67 s
> error: expected one of `!` or `::`, found `=`
452.67 s
> --> crates/gammaloop-api/src/python.rs:3540:10
452.67 s
> |
452.67 s
> 3540 | settings = api.get_integrand_settings(process_id=0)
452.67 s
> | ^ expected one of `!` or `::`
452.67 s
>
452.67 s
> error: aborting due to 1 previous error
452.67 s
>
452.67 s
> Couldn't compile the test.
452.67 s
> ---- crates/gammaloop-api/src/python.rs - python::GammaLoopAPI::run_command (line 3793) stdout ----
452.67 s
> error[E0425] : cannot find value `api` in this scope
452.67 s
> --> crates/gammaloop-api/src/python.rs:3794:1
452.67 s
> |
452.67 s
> 3794 | api.run("display processes")
452.67 s
> | ^^^ not found in this scope
452.67 s
>
452.67 s
> error : aborting due to 1 previous error
452.67 s
>
452.67 s
> For more information about this error, try `rustc --explain E0425`.
452.67 s
> Couldn't compile the test.
452.67 s
> ---- crates/gammaloop-api/src/python.rs - python::GammaLoopAPI::get_run_history (line 3603) stdout ----
452.67 s
> error[E0425] : cannot find value `run_card_toml` in this scope
452.67 s
> --> crates/gammaloop-api/src/python.rs:3604:1
452.67 s
> |
452.67 s
> 3604 | run_card_toml = api.get_run_history()
452.67 s
> | ^^^^^^^^^^^^^
452.67 s
> |
452.67 s
> help : you might have meant to introduce a new binding
452.67 s
> |
452.67 s
> 3604 | let run_card_toml = api.get_run_history()
452.67 s
> | +++
452.67 s
>
452.67 s
> error[E0425] : cannot find value `api` in this scope
452.67 s
> --> crates/gammaloop-api/src/python.rs:3604:17
452.67 s
> |
452.67 s
> 3604 | run_card_toml = api.get_run_history()
452.67 s
> | ^^^ not found in this scope
452.67 s
>
452.67 s
> error : aborting due to 2 previous errors
452.67 s
>
452.67 s
> For more information about this error, try `rustc --explain E0425`.
452.67 s
> Couldn't compile the test.
452.67 s
> ---- crates/gammaloop-api/src/python.rs - python::evaluate_graph_overall_factor (line 95) stdout ----
452.67 s
> error[E0425] : cannot find function `evaluate_graph_overall_factor` in this scope
452.67 s
> --> crates/gammaloop-api/src/python.rs:96:1
452.67 s
> |
452.67 s
> 96 | evaluate_graph_overall_factor(
452.67 s
> | ^^^^^^^^^^^^^^^^^^^^^^^^^^^^^ not found in this scope
452.67 s
>
452.67 s
> error : aborting due to 1 previous error
452.67 s
>
452.67 s
> For more information about this error, try `rustc --explain E0425`.
452.67 s
> Couldn't compile the test.
452.67 s
> ---- crates/gammaloop-api/src/python.rs - python::GammaLoopAPI::new_python (line 2804) stdout ----
452.67 s
> error[E0425] : cannot find value `api` in this scope
452.67 s
> --> crates/gammaloop-api/src/python.rs:2805:1
452.67 s
> |
452.67 s
> 2805 | api = GammaLoopAPI(state_folder="./state", read_only_state=True)
452.67 s
> | ^^^
452.67 s
> |
452.67 s
> help : you might have meant to introduce a new binding
452.67 s
> |
452.67 s
> 2805 | let api = GammaLoopAPI(state_folder="./state", read_only_state=True)
452.67 s
> | +++
452.67 s
>
452.67 s
> error[E0425] : cannot find value `state_folder` in this scope
452.67 s
> --> crates/gammaloop-api/src/python.rs:2805:20
452.67 s
> |
452.67 s
> 2805 | api = GammaLoopAPI(state_folder="./state", read_only_state=True)
452.67 s
> | ^^^^^^^^^^^^ not found in this scope
452.67 s
>
452.67 s
> error[E0425] : cannot find value `read_only_state` in this scope
452.67 s
> --> crates/gammaloop-api/src/python.rs:2805:44
452.67 s
> |
452.67 s
> 2805 | api = GammaLoopAPI(state_folder="./state", read_only_state=True)
452.67 s
> | ^^^^^^^^^^^^^^^ not found in this scope
452.67 s
>
452.67 s
> error[E0425] : cannot find value `True` in this scope
452.67 s
> --> crates/gammaloop-api/src/python.rs:2805:60
452.67 s
> |
452.67 s
> 2805 | api = GammaLoopAPI(state_folder="./state", read_only_state=True)
452.67 s
> | ^^^^ not found in this scope
452.67 s
> |
452.67 s
> help : you may want to use a bool value instead
452.67 s
> |
452.67 s
> 2805 - api = GammaLoopAPI(state_folder="./state", read_only_state=True )
452.67 s
> 2805 + api = GammaLoopAPI(state_folder="./state", read_only_state=true )
452.67 s
> |
452.67 s
>
452.67 s
> error[E0425] : cannot find function, tuple struct or tuple variant `GammaLoopAPI` in this scope
452.67 s
> --> crates/gammaloop-api/src/python.rs:2805:7
452.67 s
> |
452.67 s
> 2805 | api = GammaLoopAPI(state_folder="./state", read_only_state=True)
452.67 s
> | ^^^^^^^^^^^^ not found in this scope
452.67 s
>
452.67 s
> error : aborting due to 5 previous errors
452.67 s
>
452.67 s
> For more information about this error, try `rustc --explain E0425`.
452.67 s
> Couldn't compile the test.
452.67 s
> ---- crates/gammaloop-api/src/python.rs - python::atom_to_canonical_string (line 128) stdout ----
452.67 s
> error[E0425] : cannot find function `atom_to_canonical_string` in this scope
452.67 s
> --> crates/gammaloop-api/src/python.rs:129:1
452.67 s
> |
452.67 s
> 129 | atom_to_canonical_string("x + x")
452.67 s
> | ^^^^^^^^^^^^^^^^^^^^^^^^ not found in this scope
452.67 s
>
452.67 s
> error : aborting due to 1 previous error
452.67 s
>
452.67 s
> For more information about this error, try `rustc --explain E0425`.
452.67 s
> Couldn't compile the test.
452.67 s
> ---- crates/gammaloop-api/src/python.rs - python::GammaLoopAPI::get_global_settings (line 3631) stdout ----
452.67 s
> error[E0425] : cannot find value `settings_toml` in this scope
452.67 s
> --> crates/gammaloop-api/src/python.rs:3632:1
452.67 s
> |
452.67 s
> 3632 | settings_toml = api.get_global_settings()
452.67 s
> | ^^^^^^^^^^^^^
452.67 s
> |
452.67 s
> help : you might have meant to introduce a new binding
452.67 s
> |
452.67 s
> 3632 | let settings_toml = api.get_global_settings()
452.67 s
> | +++
452.67 s
>
452.67 s
> error[E0425] : cannot find value `api` in this scope
452.67 s
> --> crates/gammaloop-api/src/python.rs:3632:17
452.67 s
> |
452.67 s
> 3632 | settings_toml = api.get_global_settings()
452.67 s
> | ^^^ not found in this scope
452.67 s
>
452.67 s
> error : aborting due to 2 previous errors
452.67 s
>
452.67 s
> For more information about this error, try `rustc --explain E0425`.
452.67 s
> Couldn't compile the test.
452.67 s
> ---- crates/gammaloop-api/src/python.rs - python::atom_to_dots (line 157) stdout ----
452.67 s
> error[E0425] : cannot find function `to_dots` in this scope
452.67 s
> --> crates/gammaloop-api/src/python.rs:158:1
452.67 s
> |
452.67 s
> 158 | to_dots("p(mu) * q(mu)")
452.67 s
> | ^^^^^^^ not found in this scope
452.67 s
>
452.67 s
> error : aborting due to 1 previous error
452.67 s
>
452.67 s
> For more information about this error, try `rustc --explain E0425`.
452.67 s
> Couldn't compile the test.
452.67 s
>
452.67 s
> failures:
452.67 s
> crates/gammaloop-api/src/python.rs - python::GammaLoopAPI::evaluate_sample (line 2926)
452.67 s
> crates/gammaloop-api/src/python.rs - python::GammaLoopAPI::evaluate_samples (line 3040)
452.67 s
> crates/gammaloop-api/src/python.rs - python::GammaLoopAPI::get_active_command_blocks (line 3652)
452.67 s
> crates/gammaloop-api/src/python.rs - python::GammaLoopAPI::get_default_runtime_settings (line 3688)
452.67 s
> crates/gammaloop-api/src/python.rs - python::GammaLoopAPI::get_global_settings (line 3631)
452.67 s
> crates/gammaloop-api/src/python.rs - python::GammaLoopAPI::get_integrand_info (line 3496)
452.67 s
> crates/gammaloop-api/src/python.rs - python::GammaLoopAPI::get_integrand_settings (line 3539)
452.67 s
> crates/gammaloop-api/src/python.rs - python::GammaLoopAPI::get_run_history (line 3603)
452.67 s
> crates/gammaloop-api/src/python.rs - python::GammaLoopAPI::new_python (line 2804)
452.67 s
> crates/gammaloop-api/src/python.rs - python::GammaLoopAPI::run_command (line 3793)
452.67 s
> crates/gammaloop-api/src/python.rs - python::atom_to_canonical_string (line 128)
452.67 s
> crates/gammaloop-api/src/python.rs - python::atom_to_dots (line 157)
452.67 s
> crates/gammaloop-api/src/python.rs - python::evaluate_graph_overall_factor (line 95)
452.67 s
>
452.67 s
> test result: FAILED. 0 passed; 13 failed; 0 ignored; 0 measured; 0 filtered out; finished in 0.14s
452.67 s
>
452.67 s
> error : doctest failed, to rerun pass `-p gammaloop-api --doc`
452.67 s
For full logs, run:
452.67 s
nix log /nix/store/d7n0kzr0ab2qmzp3m3y3jhx03bbngjym-gammaloop-workspace-doctest-0.1.0.drv
452.75 s
[0 built (1 failed ), 0.0 Run failed.