test packages.x86_64-linux.nix-ci-check-gammaloop-nextest-core

Reproduce this run
Retry Run
  1. 0.22 s $ /nix/store/9ypz3flqsrl5xl495mm8h645gadjsxi1-coreutils-9.11/bin/timeout --kill-after=15s 7200s /nix/store/23zk8sgzamrbmj1fday15szf7f2279s8-nix-2.34.7/bin/nix --extra-experimental-features nix-command --extra-experimental-features flakes flake clone git+https://github.com/alphal00p/gammaloop --dest /tmp/nix-ci-worker/stable-pwd/repo/
  2. 0.30 s Cloning into '/tmp/nix-ci-worker/stable-pwd/repo'...
  3. 1.62 s remote: Enumerating objects: 64185, done.
  4. 1.85 s remote: Counting objects: 0% (1/9551) remote: Counting objects: 1% (96/9551) remote: Counting objects: 2% (192/9551) remote: Counting objects: 3% (287/9551) remote: Counting objects: 4% (383/9551) remote: Counting objects: 5% (478/9551) remote: Counting objects: 6% (574/9551) remote: Counting objects: 7% (669/9551) remote: Counting objects: 8% (765/9551) remote: Counting objects: 9% (860/9551) remote: Counting objects: 10% (956/9551) remote: Counting objects: 11% (1051/9551) remote: Counting objects: 12% (1147/9551) remote: Counting objects: 13% (1242/9551) remote: Counting objects: 14% (1338/9551) remote: Counting objects: 15% (1433/9551) remote: Counting objects: 16% (1529/9551) remote: Counting objects: 17% (1624/9551) remote: Counting objects: 18% (1720/9551) remote: Counting objects: 19% (1815/9551) remote: Counting objects: 20% (1911/9551) remote: Counting objects: 21% (2006/9551) remote: Counting objects: 22% (2102/9551) remote: Counting objects: 23% (2197/9551) remote: Counting objects: 24% (2293/9551) remote: Counting objects: 25% (2388/9551) remote: Counting objects: 26% (2484/9551) remote: Counting objects: 27% (2579/9551) remote: Counting objects: 28% (2675/9551) remote: Counting objects: 29% (2770/9551) remote: Counting objects: 30% (2866/9551) remote: Counting objects: 31% (2961/9551) remote: Counting objects: 32% (3057/9551) remote: Counting objects: 33% (3152/9551) remote: Counting objects: 34% (3248/9551) remote: Counting objects: 35% (3343/9551) remote: Counting objects: 36% (3439/9551) remote: Counting objects: 37% (3534/9551) remote: Counting objects: 38% (3630/9551) remote: Counting objects: 39% (3725/9551) remote: Counting objects: 40% (3821/9551) remote: Counting objects: 41% (3916/9551) remote: Counting objects: 42% (4012/9551) remote: Counting objects: 43% (4107/9551) remote: Counting objects: 44% (4203/9551) remote: Counting objects: 45% (4298/9551) remote: Counting objects: 46% (4394/9551) remote: Counting objects: 47% (4489/9551) remote: Counting objects: 48% (4585/9551) remote: Counting objects: 49% (4680/9551) remote: Counting objects: 50% (4776/9551) remote: Counting objects: 51% (4872/9551) remote: Counting objects: 52% (4967/9551) remote: Counting objects: 53% (5063/9551) remote: Counting objects: 54% (5158/9551) remote: Counting objects: 55% (5254/9551) remote: Counting objects: 56% (5349/9551) remote: Counting objects: 57% (5445/9551) remote: Counting objects: 58% (5540/9551) remote: Counting objects: 59% (5636/9551) remote: Counting objects: 60% (5731/9551) remote: Counting objects: 61% (5827/9551) remote: Counting objects: 62% (5922/9551) remote: Counting objects: 63% (6018/9551) remote: Counting objects: 64% (6113/9551) remote: Counting objects: 65% (6209/9551) remote: Counting objects: 66% (6304/9551) remote: Counting objects: 67% (6400/9551) remote: Counting objects: 68% (6495/9551) remote: Counting objects: 69% (6591/9551) remote: Counting objects: 70% (6686/9551) remote: Counting objects: 71% (6782/9551) remote: Counting objects: 72% (6877/9551) remote: Counting objects: 73% (6973/9551) remote: Counting objects: 74% (7068/9551) remote: Counting objects: 75% (7164/9551) remote: Counting objects: 76% (7259/9551) remote: Counting objects: 77% (7355/9551) remote: Counting objects: 78% (7450/9551) remote: Counting objects: 79% (7546/9551) remote: Counting objects: 80% (7641/9551) remote: Counting objects: 81% (7737/9551) remote: Counting objects: 82% (7832/9551) remote: Counting objects: 83% (7928/9551) remote: Counting objects: 84% (8023/9551) remote: Counting objects: 85% (8119/9551) remote: Counting objects: 86% (8214/9551) remote: Counting objects: 87% (8310/9551) remote: Counting objects: 88% (8405/9551) remote: Counting objects: 89% (8501/9551) remote: Counting objects: 90% (8596/9551) remote: Counting objects: 91% (8692/9551) remote: Counting objects: 92% (8787/9551) remote: Counting objects: 93% (8883/9551) remote: Counting objects: 94% (8978/9551) remote: Counting objects: 95% (9074/9551) remote: Counting objects: 96% (9169/9551) remote: Counting objects: 97% (9265/9551) remote: Counting objects: 98% (9360/9551) remote: Counting objects: 99% (9456/9551) remote: Counting objects: 100% (9551/9551) remote: Counting objects: 100% (9551/9551), done.
  5. 3.98 s remote: Compressing objects: 0% (1/2326) remote: Compressing objects: 1% (24/2326) remote: Compressing objects: 2% (47/2326) remote: Compressing objects: 3% (70/2326) remote: Compressing objects: 4% (94/2326) remote: Compressing objects: 5% (117/2326) remote: Compressing objects: 6% (140/2326) remote: Compressing objects: 7% (163/2326) remote: Compressing objects: 8% (187/2326) remote: Compressing objects: 9% (210/2326) remote: Compressing objects: 10% (233/2326) remote: Compressing objects: 11% (256/2326) remote: Compressing objects: 12% (280/2326) remote: Compressing objects: 13% (303/2326) remote: Compressing objects: 14% (326/2326) remote: Compressing objects: 15% (349/2326) remote: Compressing objects: 16% (373/2326) remote: Compressing objects: 17% (396/2326) remote: Compressing objects: 18% (419/2326) remote: Compressing objects: 19% (442/2326) remote: Compressing objects: 20% (466/2326) remote: Compressing objects: 21% (489/2326) remote: Compressing objects: 22% (512/2326) remote: Compressing objects: 23% (535/2326) remote: Compressing objects: 23% (551/2326) remote: Compressing objects: 24% (559/2326) remote: Compressing objects: 25% (582/2326) remote: Compressing objects: 26% (605/2326) remote: Compressing objects: 27% (629/2326) remote: Compressing objects: 28% (652/2326) remote: Compressing objects: 29% (675/2326) remote: Compressing objects: 30% (698/2326) remote: Compressing objects: 31% (722/2326) remote: Compressing objects: 32% (745/2326) remote: Compressing objects: 32% (748/2326) remote: Compressing objects: 33% (768/2326) remote: Compressing objects: 34% (791/2326) remote: Compressing objects: 35% (815/2326) remote: Compressing objects: 36% (838/2326) remote: Compressing objects: 37% (861/2326) remote: Compressing objects: 38% (884/2326) remote: Compressing objects: 39% (908/2326) remote: Compressing objects: 40% (931/2326) remote: Compressing objects: 41% (954/2326) remote: Compressing objects: 42% (977/2326) remote: Compressing objects: 43% (1001/2326) remote: Compressing objects: 44% (1024/2326) remote: Compressing objects: 45% (1047/2326) remote: Compressing objects: 46% (1070/2326) remote: Compressing objects: 47% (1094/2326) remote: Compressing objects: 48% (1117/2326) remote: Compressing objects: 49% (1140/2326) remote: Compressing objects: 50% (1163/2326) remote: Compressing objects: 51% (1187/2326) remote: Compressing objects: 52% (1210/2326) remote: Compressing objects: 53% (1233/2326) remote: Compressing objects: 54% (1257/2326) remote: Compressing objects: 55% (1280/2326) remote: Compressing objects: 56% (1303/2326) remote: Compressing objects: 57% (1326/2326) remote: Compressing objects: 58% (1350/2326) remote: Compressing objects: 59% (1373/2326) remote: Compressing objects: 60% (1396/2326) remote: Compressing objects: 61% (1419/2326) remote: Compressing objects: 62% (1443/2326) remote: Compressing objects: 63% (1466/2326) remote: Compressing objects: 64% (1489/2326) remote: Compressing objects: 65% (1512/2326) remote: Compressing objects: 66% (1536/2326) remote: Compressing objects: 67% (1559/2326) remote: Compressing objects: 68% (1582/2326) remote: Compressing objects: 69% (1605/2326) remote: Compressing objects: 70% (1629/2326) remote: Compressing objects: 71% (1652/2326) remote: Compressing objects: 72% (1675/2326) remote: Compressing objects: 73% (1698/2326) remote: Compressing objects: 74% (1722/2326) remote: Compressing objects: 75% (1745/2326) remote: Compressing objects: 76% (1768/2326) remote: Compressing objects: 77% (1792/2326) remote: Compressing objects: 78% (1815/2326) remote: Compressing objects: 79% (1838/2326) remote: Compressing objects: 80% (1861/2326) remote: Compressing objects: 81% (1885/2326) remote: Compressing objects: 82% (1908/2326) remote: Compressing objects: 83% (1931/2326) remote: Compressing objects: 84% (1954/2326) remote: Compressing objects: 85% (1978/2326) remote: Compressing objects: 86% (2001/2326) remote: Compressing objects: 87% (2024/2326) remote: Compressing objects: 88% (2047/2326) remote: Compressing objects: 89% (2071/2326) remote: Compressing objects: 90% (2094/2326) remote: Compressing objects: 91% (2117/2326) remote: Compressing objects: 92% (2140/2326) remote: Compressing objects: 93% (2164/2326) remote: Compressing objects: 94% (2187/2326) remote: Compressing objects: 95% (2210/2326) remote: Compressing objects: 96% (2233/2326) remote: Compressing objects: 97% (2257/2326) remote: Compressing objects: 98% (2280/2326) remote: Compressing objects: 99% (2303/2326) remote: Compressing objects: 100% (2326/2326) remote: Compressing objects: 100% (2326/2326), done.
  6. 7.09 s Receiving objects: 0% (1/64185) Receiving objects: 1% (642/64185) Receiving objects: 2% (1284/64185) Receiving objects: 3% (1926/64185) Receiving objects: 4% (2568/64185) Receiving objects: 5% (3210/64185) Receiving objects: 6% (3852/64185), 5.16 MiB | 10.30 MiB/s Receiving objects: 7% (4493/64185), 5.16 MiB | 10.30 MiB/s Receiving objects: 8% (5135/64185), 5.16 MiB | 10.30 MiB/s Receiving objects: 9% (5777/64185), 5.16 MiB | 10.30 MiB/s Receiving objects: 10% (6419/64185), 5.16 MiB | 10.30 MiB/s Receiving objects: 11% (7061/64185), 5.16 MiB | 10.30 MiB/s Receiving objects: 12% (7703/64185), 5.16 MiB | 10.30 MiB/s Receiving objects: 13% (8345/64185), 5.16 MiB | 10.30 MiB/s Receiving objects: 14% (8986/64185), 5.16 MiB | 10.30 MiB/s Receiving objects: 15% (9628/64185), 5.16 MiB | 10.30 MiB/s Receiving objects: 16% (10270/64185), 5.16 MiB | 10.30 MiB/s Receiving objects: 17% (10912/64185), 5.16 MiB | 10.30 MiB/s Receiving objects: 18% (11554/64185), 5.16 MiB | 10.30 MiB/s Receiving objects: 19% (12196/64185), 5.16 MiB | 10.30 MiB/s Receiving objects: 20% (12837/64185), 5.16 MiB | 10.30 MiB/s Receiving objects: 21% (13479/64185), 5.16 MiB | 10.30 MiB/s Receiving objects: 22% (14121/64185), 5.16 MiB | 10.30 MiB/s Receiving objects: 23% (14763/64185), 5.16 MiB | 10.30 MiB/s Receiving objects: 24% (15405/64185), 5.16 MiB | 10.30 MiB/s Receiving objects: 25% (16047/64185), 5.16 MiB | 10.30 MiB/s Receiving objects: 26% (16689/64185), 5.16 MiB | 10.30 MiB/s Receiving objects: 27% (17330/64185), 5.16 MiB | 10.30 MiB/s Receiving objects: 28% (17972/64185), 5.16 MiB | 10.30 MiB/s Receiving objects: 29% (18614/64185), 5.16 MiB | 10.30 MiB/s Receiving objects: 30% (19256/64185), 5.16 MiB | 10.30 MiB/s Receiving objects: 31% (19898/64185), 5.16 MiB | 10.30 MiB/s Receiving objects: 32% (20540/64185), 5.16 MiB | 10.30 MiB/s Receiving objects: 33% (21182/64185), 5.16 MiB | 10.30 MiB/s Receiving objects: 33% (21620/64185), 5.16 MiB | 10.30 MiB/s Receiving objects: 34% (21823/64185), 5.16 MiB | 10.30 MiB/s Receiving objects: 35% (22465/64185), 21.77 MiB | 21.76 MiB/s Receiving objects: 36% (23107/64185), 21.77 MiB | 21.76 MiB/s Receiving objects: 37% (23749/64185), 21.77 MiB | 21.76 MiB/s Receiving objects: 38% (24391/64185), 21.77 MiB | 21.76 MiB/s Receiving objects: 39% (25033/64185), 21.77 MiB | 21.76 MiB/s Receiving objects: 40% (25674/64185), 21.77 MiB | 21.76 MiB/s Receiving objects: 41% (26316/64185), 21.77 MiB | 21.76 MiB/s Receiving objects: 42% (26958/64185), 21.77 MiB | 21.76 MiB/s Receiving objects: 43% (27600/64185), 21.77 MiB | 21.76 MiB/s Receiving objects: 44% (28242/64185), 21.77 MiB | 21.76 MiB/s Receiving objects: 45% (28884/64185), 21.77 MiB | 21.76 MiB/s Receiving objects: 46% (29526/64185), 21.77 MiB | 21.76 MiB/s Receiving objects: 47% (30167/64185), 21.77 MiB | 21.76 MiB/s Receiving objects: 48% (30809/64185), 21.77 MiB | 21.76 MiB/s Receiving objects: 49% (31451/64185), 21.77 MiB | 21.76 MiB/s Receiving objects: 50% (32093/64185), 21.77 MiB | 21.76 MiB/s Receiving objects: 51% (32735/64185), 21.77 MiB | 21.76 MiB/s Receiving objects: 52% (33377/64185), 21.77 MiB | 21.76 MiB/s Receiving objects: 53% (34019/64185), 21.77 MiB | 21.76 MiB/s Receiving objects: 54% (34660/64185), 21.77 MiB | 21.76 MiB/s Receiving objects: 55% (35302/64185), 21.77 MiB | 21.76 MiB/s Receiving objects: 56% (35944/64185), 21.77 MiB | 21.76 MiB/s Receiving objects: 57% (36586/64185), 21.77 MiB | 21.76 MiB/s Receiving objects: 58% (37228/64185), 21.77 MiB | 21.76 MiB/s Receiving objects: 59% (37870/64185), 21.77 MiB | 21.76 MiB/s Receiving objects: 60% (38511/64185), 21.77 MiB | 21.76 MiB/s Receiving objects: 61% (39153/64185), 44.63 MiB | 29.75 MiB/s Receiving objects: 62% (39795/64185), 44.63 MiB | 29.75 MiB/s Receiving objects: 63% (40437/64185), 44.63 MiB | 29.75 MiB/s Receiving objects: 64% (41079/64185), 44.63 MiB | 29.75 MiB/s Receiving objects: 65% (41721/64185), 44.63 MiB | 29.75 MiB/s Receiving objects: 66% (42363/64185), 44.63 MiB | 29.75 MiB/s Receiving objects: 67% (43004/64185), 44.63 MiB | 29.75 MiB/s Receiving objects: 68% (43646/64185), 44.63 MiB | 29.75 MiB/s Receiving objects: 69% (44288/64185), 44.63 MiB | 29.75 MiB/s Receiving objects: 70% (44930/64185), 44.63 MiB | 29.75 MiB/s Receiving objects: 71% (45572/64185), 44.63 MiB | 29.75 MiB/s Receiving objects: 72% (46214/64185), 44.63 MiB | 29.75 MiB/s Receiving objects: 73% (46856/64185), 44.63 MiB | 29.75 MiB/s Receiving objects: 74% (47497/64185), 44.63 MiB | 29.75 MiB/s Receiving objects: 74% (47872/64185), 60.88 MiB | 30.44 MiB/s Receiving objects: 75% (48139/64185), 60.88 MiB | 30.44 MiB/s Receiving objects: 76% (48781/64185), 60.88 MiB | 30.44 MiB/s Receiving objects: 77% (49423/64185), 60.88 MiB | 30.44 MiB/s Receiving objects: 78% (50065/64185), 60.88 MiB | 30.44 MiB/s Receiving objects: 79% (50707/64185), 60.88 MiB | 30.44 MiB/s Receiving objects: 80% (51348/64185), 60.88 MiB | 30.44 MiB/s Receiving objects: 81% (51990/64185), 60.88 MiB | 30.44 MiB/s Receiving objects: 82% (52632/64185), 77.80 MiB | 31.12 MiB/s Receiving objects: 83% (53274/64185), 77.80 MiB | 31.12 MiB/s Receiving objects: 84% (53916/64185), 77.80 MiB | 31.12 MiB/s Receiving objects: 85% (54558/64185), 77.80 MiB | 31.12 MiB/s Receiving objects: 86% (55200/64185), 77.80 MiB | 31.12 MiB/s Receiving objects: 87% (55841/64185), 77.80 MiB | 31.12 MiB/s Receiving objects: 88% (56483/64185), 77.80 MiB | 31.12 MiB/s Receiving objects: 89% (57125/64185), 77.80 MiB | 31.12 MiB/s Receiving objects: 90% (57767/64185), 77.80 MiB | 31.12 MiB/s Receiving objects: 91% (58409/64185), 77.80 MiB | 31.12 MiB/s Receiving objects: 92% (59051/64185), 77.80 MiB | 31.12 MiB/s Receiving objects: 93% (59693/64185), 77.80 MiB | 31.12 MiB/s Receiving objects: 94% (60334/64185), 77.80 MiB | 31.12 MiB/s Receiving objects: 95% (60976/64185), 77.80 MiB | 31.12 MiB/s Receiving objects: 96% (61618/64185), 77.80 MiB | 31.12 MiB/s Receiving objects: 97% (62260/64185), 77.80 MiB | 31.12 MiB/s Receiving objects: 98% (62902/64185), 77.80 MiB | 31.12 MiB/s Receiving objects: 98% (62919/64185), 94.84 MiB | 31.61 MiB/s Receiving objects: 99% (63544/64185), 94.84 MiB | 31.61 MiB/s remote: Total 64185 (delta 7397), reused 7776 (delta 6680), pack-reused 54634 (from 3)
  7. 7.18 s Receiving objects: 100% (64185/64185), 94.84 MiB | 31.61 MiB/s Receiving objects: 100% (64185/64185), 97.84 MiB | 31.70 MiB/s, done.
  8. 8.98 s Resolving deltas: 0% (0/44316) Resolving deltas: 1% (444/44316) Resolving deltas: 2% (887/44316) Resolving deltas: 3% (1330/44316) Resolving deltas: 4% (1773/44316) Resolving deltas: 5% (2216/44316) Resolving deltas: 6% (2659/44316) Resolving deltas: 7% (3103/44316) Resolving deltas: 8% (3546/44316) Resolving deltas: 9% (3989/44316) Resolving deltas: 10% (4432/44316) Resolving deltas: 11% (4876/44316) Resolving deltas: 12% (5319/44316) Resolving deltas: 13% (5762/44316) Resolving deltas: 14% (6205/44316) Resolving deltas: 15% (6648/44316) Resolving deltas: 16% (7091/44316) Resolving deltas: 17% (7534/44316) Resolving deltas: 18% (7977/44316) Resolving deltas: 19% (8421/44316) Resolving deltas: 20% (8864/44316) Resolving deltas: 21% (9307/44316) Resolving deltas: 22% (9750/44316) Resolving deltas: 23% (10193/44316) Resolving deltas: 24% (10637/44316) Resolving deltas: 25% (11079/44316) Resolving deltas: 26% (11523/44316) Resolving deltas: 27% (11966/44316) Resolving deltas: 28% (12409/44316) Resolving deltas: 29% (12852/44316) Resolving deltas: 30% (13295/44316) Resolving deltas: 31% (13738/44316) Resolving deltas: 32% (14182/44316) Resolving deltas: 33% (14625/44316) Resolving deltas: 34% (15068/44316) Resolving deltas: 35% (15511/44316) Resolving deltas: 36% (15954/44316) Resolving deltas: 37% (16397/44316) Resolving deltas: 38% (16841/44316) Resolving deltas: 39% (17284/44316) Resolving deltas: 40% (17727/44316) Resolving deltas: 41% (18170/44316) Resolving deltas: 42% (18613/44316) Resolving deltas: 43% (19056/44316) Resolving deltas: 44% (19501/44316) Resolving deltas: 45% (19943/44316) Resolving deltas: 46% (20386/44316) Resolving deltas: 47% (20829/44316) Resolving deltas: 48% (21272/44316) Resolving deltas: 49% (21715/44316) Resolving deltas: 50% (22158/44316) Resolving deltas: 51% (22602/44316) Resolving deltas: 52% (23045/44316) Resolving deltas: 53% (23488/44316) Resolving deltas: 54% (23931/44316) Resolving deltas: 55% (24374/44316) Resolving deltas: 56% (24818/44316) Resolving deltas: 57% (25262/44316) Resolving deltas: 58% (25704/44316) Resolving deltas: 59% (26147/44316) Resolving deltas: 60% (26590/44316) Resolving deltas: 61% (27033/44316) Resolving deltas: 62% (27476/44316) Resolving deltas: 63% (27920/44316) Resolving deltas: 63% (28342/44316) Resolving deltas: 64% (28363/44316) Resolving deltas: 65% (28806/44316) Resolving deltas: 66% (29249/44316) Resolving deltas: 67% (29692/44316) Resolving deltas: 68% (30135/44316) Resolving deltas: 69% (30579/44316) Resolving deltas: 70% (31022/44316) Resolving deltas: 71% (31465/44316) Resolving deltas: 72% (31908/44316) Resolving deltas: 73% (32351/44316) Resolving deltas: 74% (32794/44316) Resolving deltas: 75% (33237/44316) Resolving deltas: 76% (33681/44316) Resolving deltas: 77% (34124/44316) Resolving deltas: 78% (34567/44316) Resolving deltas: 79% (35010/44316) Resolving deltas: 80% (35453/44316) Resolving deltas: 81% (35896/44316) Resolving deltas: 82% (36340/44316) Resolving deltas: 83% (36784/44316) Resolving deltas: 84% (37226/44316) Resolving deltas: 85% (37669/44316) Resolving deltas: 86% (38112/44316) Resolving deltas: 87% (38555/44316) Resolving deltas: 88% (38999/44316) Resolving deltas: 89% (39442/44316) Resolving deltas: 90% (39885/44316) Resolving deltas: 91% (40328/44316) Resolving deltas: 92% (40771/44316) Resolving deltas: 93% (41214/44316) Resolving deltas: 94% (41658/44316) Resolving deltas: 95% (42101/44316) Resolving deltas: 96% (42544/44316) Resolving deltas: 97% (42987/44316) Resolving deltas: 98% (43430/44316) Resolving deltas: 99% (43873/44316) Resolving deltas: 100% (44316/44316) Resolving deltas: 100% (44316/44316), done.
  9. 9.74 s Fetching commit e848309923f9136d533613bb15d1029beb045263 for push-vrpyqyylypmw ...
  10. 9.74 s $ /nix/store/bcnisk3ydfgv26v2gw3zlky24g00yww2-git-2.54.0/bin/git fetch origin e848309923f9136d533613bb15d1029beb045263
  11. 10.77 s From https://github.com/alphal00p/gammaloop
  12. 10.77 s * branch e848309923f9136d533613bb15d1029beb045263 -> FETCH_HEAD
  13. 10.86 s $ /nix/store/9ypz3flqsrl5xl495mm8h645gadjsxi1-coreutils-9.11/bin/timeout --kill-after=15s 7200s /nix/store/bcnisk3ydfgv26v2gw3zlky24g00yww2-git-2.54.0/bin/git -c advice.detachedHead=false checkout e848309923f9136d533613bb15d1029beb045263
  14. 11.30 s HEAD is now at e8483099 fix Python extension artifact builds
  15. 11.31 s $ /nix/store/9ypz3flqsrl5xl495mm8h645gadjsxi1-coreutils-9.11/bin/timeout --kill-after=15s 7200s /nix/store/23zk8sgzamrbmj1fday15szf7f2279s8-nix-2.34.7/bin/nix --extra-experimental-features nix-command --extra-experimental-features flakes --log-format internal-json run .#packages.x86_64-linux.nix-ci-check-gammaloop-nextest-core --print-build-logs
  16. 18.76 s
  17. 19.50 s Downloading cached gammaloop-nextest-binaries-core-gammaloop-tracing-filter from https://cache.nix-ci.com
  18. 19.56 s Downloading cached publicsuffix-list-0-unstable-2026-05 from https://cache.nix-ci.com
  19. 19.56 s Downloading cached gammaloop-nextest-binaries-core-gammalooprs from https://cache.nix-ci.com
  20. 19.56 s Downloading cached aws-c-common from https://cache.nix-ci.com
  21. 19.56 s Downloading cached libssh2 from https://cache.nix-ci.com
  22. 19.56 s Downloading cached json-c from https://cache.nix-ci.com
  23. 19.56 s Downloading cached gammaloop-nextest-binaries-core-gammaloop-api from https://cache.nix-ci.com
  24. 19.56 s Downloading cached libcpuid from https://cache.nix-ci.com
  25. 19.56 s Downloading cached editline-1.17.1-unstable-2025-05 from https://cache.nix-ci.com
  26. 19.56 s Downloading cached busybox from https://cache.nix-ci.com
  27. 19.56 s Downloading cached boehm-gc from https://cache.nix-ci.com
  28. 19.56 s Downloading cached libsodium-1.0.22-unstable-2026-04 from https://cache.nix-ci.com
  29. 19.56 s Downloading cached libseccomp-2.6.0-lib from https://cache.nix-ci.com
  30. 19.56 s Downloading cached gammaloop-nextest-binaries-core-gammaloop-tracing-filter-macros from https://cache.nix-ci.com
  31. 19.56 s Downloading cached brotli-1.2.0-lib from https://cache.nix-ci.com
  32. 19.56 s Downloading cached numactl from https://cache.nix-ci.com
  33. 19.86 s Downloaded cached gammaloop-nextest-binaries-core-gammaloop-tracing-filter-macros (1.7 MiB) in 303ms
  34. 19.86 s Progress: 0 of 8 built, 1 of 57 downloaded from cache (15 downloading)
  35. 19.87 s Downloading cached hwloc-2.14.0-lib from https://cache.nix-ci.com
  36. 19.89 s Downloaded cached editline-1.17.1-unstable-2025-05 (58 KiB) in 329ms
  37. 19.89 s Progress: 0 of 7 built, 2 of 57 downloaded from cache (15 downloading)
  38. 19.89 s Downloading cached icu4c from https://cache.nix-ci.com
  39. 19.90 s Downloaded cached json-c (244 KiB) in 344ms
  40. 19.92 s Downloaded cached libcpuid (326 KiB) in 357ms
  41. 19.92 s Downloaded cached busybox (230 KiB) in 360ms
  42. 19.93 s Downloaded cached publicsuffix-list-0-unstable-2026-05 (329 KiB) in 369ms
  43. 19.94 s Downloaded cached brotli-1.2.0-lib (961 KiB) in 383ms
  44. 19.96 s Progress: 0 of 7 built, 3 of 57 downloaded from cache (15 downloading)
  45. 19.96 s Downloaded cached libseccomp-2.6.0-lib (193 KiB) in 399ms
  46. 19.96 s Downloading cached keyutils-1.6.3-lib from https://cache.nix-ci.com
  47. 19.98 s Downloaded cached numactl (269 KiB) in 421ms
  48. 20.01 s Progress: 0 of 7 built, 4 of 57 downloaded from cache (15 downloading)
  49. 20.01 s Progress: 0 of 7 built, 5 of 57 downloaded from cache (14 downloading)
  50. 20.01 s Progress: 0 of 7 built, 6 of 57 downloaded from cache (13 downloading)
  51. 20.01 s Progress: 0 of 7 built, 7 of 57 downloaded from cache (12 downloading)
  52. 20.01 s Progress: 0 of 7 built, 8 of 57 downloaded from cache (15 downloading)
  53. 20.01 s Progress: 0 of 7 built, 9 of 57 downloaded from cache (14 downloading)
  54. 20.01 s Downloading cached libxml2 from https://cache.nix-ci.com
  55. 20.01 s Downloading cached libpsl from https://cache.nix-ci.com
  56. 20.01 s Downloaded cached libssh2 (330 KiB) in 454ms
  57. 20.01 s Downloading cached llhttp from https://cache.nix-ci.com
  58. 20.01 s Downloading cached nghttp2-1.69.0-lib from https://cache.nix-ci.com
  59. 20.01 s Downloading cached lowdown-3.0.1-lib from https://cache.nix-ci.com
  60. 20.01 s Progress: 0 of 7 built, 10 of 57 downloaded from cache (15 downloading)
  61. 20.01 s Downloading cached ngtcp2 from https://cache.nix-ci.com
  62. 20.02 s Downloaded cached libsodium-1.0.22-unstable-2026-04 (666 KiB) in 458ms
  63. 20.02 s Downloading cached nghttp3 from https://cache.nix-ci.com
  64. 20.02 s Downloaded cached boehm-gc (312 KiB) in 465ms
  65. 20.03 s Downloaded cached gammaloop-nextest-binaries-core-gammaloop-tracing-filter (8.1 MiB) in 529ms
  66. 20.04 s Progress: 0 of 7 built, 11 of 57 downloaded from cache (15 downloading)
  67. 20.04 s Downloading cached s2n-tls from https://cache.nix-ci.com
  68. 20.04 s Downloaded cached hwloc-2.14.0-lib (459 KiB) in 177ms
  69. 20.06 s Downloaded cached aws-c-common (1.1 MiB) in 507ms
  70. 20.07 s Progress: 0 of 7 built, 12 of 57 downloaded from cache (15 downloading)
  71. 20.07 s Progress: 0 of 7 built, 13 of 57 downloaded from cache (14 downloading)
  72. 20.07 s Progress: 0 of 6 built, 14 of 57 downloaded from cache (13 downloading)
  73. 20.07 s Progress: 0 of 6 built, 15 of 57 downloaded from cache (12 downloading)
  74. 20.07 s Downloading cached aws-c-compression from https://cache.nix-ci.com
  75. 20.07 s Downloading cached aws-c-sdkutils from https://cache.nix-ci.com
  76. 20.07 s Downloading cached aws-checksums from https://cache.nix-ci.com
  77. 20.07 s Downloading cached aws-c-cal from https://cache.nix-ci.com
  78. 20.19 s Downloaded cached libxml2 (1.4 MiB) in 179ms
  79. 20.19 s Progress: 0 of 6 built, 16 of 57 downloaded from cache (15 downloading)
  80. 20.19 s Downloading cached onetbb from https://cache.nix-ci.com
  81. 20.27 s Downloaded cached aws-c-compression (31 KiB) in 201ms
  82. 20.28 s Downloaded cached nghttp2-1.69.0-lib (225 KiB) in 270ms
  83. 20.29 s Progress: 0 of 6 built, 17 of 57 downloaded from cache (15 downloading)
  84. 20.29 s Downloading cached libarchive-3.8.8-lib from https://cache.nix-ci.com
  85. 20.29 s Progress: 0 of 6 built, 18 of 57 downloaded from cache (15 downloading)
  86. 20.29 s Downloaded cached keyutils-1.6.3-lib (41 KiB) in 333ms
  87. 20.29 s Progress: 0 of 6 built, 19 of 57 downloaded from cache (14 downloading)
  88. 20.30 s Downloading cached krb5-1.22.2-lib from https://cache.nix-ci.com
  89. 20.30 s Downloaded cached lowdown-3.0.1-lib (341 KiB) in 285ms
  90. 20.33 s Downloaded cached aws-c-cal (158 KiB) in 257ms
  91. 20.35 s Progress: 0 of 6 built, 20 of 57 downloaded from cache (14 downloading)
  92. 20.35 s Progress: 0 of 6 built, 21 of 57 downloaded from cache (13 downloading)
  93. 20.35 s Downloaded cached libpsl (114 KiB) in 341ms
  94. 20.38 s Downloaded cached s2n-tls (1.3 MiB) in 338ms
  95. 20.38 s Downloaded cached nghttp3 (228 KiB) in 365ms
  96. 20.41 s Downloaded cached aws-checksums (86 KiB) in 341ms
  97. 20.43 s Downloaded cached onetbb (626 KiB) in 240ms
  98. 20.44 s Downloaded cached aws-c-sdkutils (155 KiB) in 377ms
  99. 20.46 s Progress: 0 of 6 built, 22 of 57 downloaded from cache (12 downloading)
  100. 20.46 s Progress: 0 of 6 built, 23 of 57 downloaded from cache (11 downloading)
  101. 20.46 s Progress: 0 of 6 built, 24 of 57 downloaded from cache (10 downloading)
  102. 20.46 s Progress: 0 of 6 built, 25 of 57 downloaded from cache (9 downloading)
  103. 20.46 s Progress: 0 of 6 built, 26 of 57 downloaded from cache (8 downloading)
  104. 20.46 s Progress: 0 of 6 built, 27 of 57 downloaded from cache (7 downloading)
  105. 20.46 s Downloaded cached llhttp (89 KiB) in 452ms
  106. 20.48 s Progress: 0 of 6 built, 28 of 57 downloaded from cache (8 downloading)
  107. 20.48 s Downloaded cached ngtcp2 (515 KiB) in 471ms
  108. 20.48 s Progress: 0 of 6 built, 29 of 57 downloaded from cache (8 downloading)
  109. 20.48 s Downloading cached aws-c-io from https://cache.nix-ci.com
  110. 20.48 s Downloading cached libgit2-1.9.4-lib from https://cache.nix-ci.com
  111. 20.49 s Downloading cached libblake3 from https://cache.nix-ci.com
  112. 20.58 s Downloaded cached libarchive-3.8.8-lib (953 KiB) in 295ms
  113. 20.58 s Progress: 0 of 6 built, 30 of 57 downloaded from cache (7 downloading)
  114. 20.65 s Downloaded cached icu4c (38.2 MiB) in 762ms
  115. 20.65 s Progress: 0 of 6 built, 31 of 57 downloaded from cache (6 downloading)
  116. 20.65 s Downloading cached boost from https://cache.nix-ci.com
  117. 20.71 s Downloaded cached aws-c-io (648 KiB) in 222ms
  118. 20.72 s Downloaded cached libblake3 (117 KiB) in 232ms
  119. 20.74 s Downloaded cached libgit2-1.9.4-lib (1.6 MiB) in 254ms
  120. 20.76 s Progress: 0 of 6 built, 32 of 57 downloaded from cache (6 downloading)
  121. 20.76 s Progress: 0 of 6 built, 33 of 57 downloaded from cache (7 downloading)
  122. 20.76 s Progress: 0 of 6 built, 34 of 57 downloaded from cache (6 downloading)
  123. 20.76 s Downloaded cached krb5-1.22.2-lib (2.7 MiB) in 465ms
  124. 20.76 s Downloading cached aws-c-http from https://cache.nix-ci.com
  125. 20.76 s Progress: 0 of 6 built, 35 of 57 downloaded from cache (5 downloading)
  126. 20.76 s Downloading cached curl from https://cache.nix-ci.com
  127. 20.76 s Downloading cached aws-c-event-stream from https://cache.nix-ci.com
  128. 20.90 s Downloaded cached aws-c-event-stream (176 KiB) in 136ms
  129. 20.93 s Progress: 0 of 6 built, 36 of 57 downloaded from cache (5 downloading)
  130. 20.93 s Downloaded cached aws-c-http (641 KiB) in 170ms
  131. 20.95 s Downloaded cached curl (1.2 MiB) in 192ms
  132. 20.98 s Progress: 0 of 6 built, 37 of 57 downloaded from cache (4 downloading)
  133. 20.98 s Progress: 0 of 6 built, 38 of 57 downloaded from cache (5 downloading)
  134. 20.98 s Downloading cached aws-c-mqtt from https://cache.nix-ci.com
  135. 20.98 s Downloading cached aws-c-auth from https://cache.nix-ci.com
  136. 20.98 s Downloaded cached boost (14.5 MiB) in 322ms
  137. 20.98 s Downloading cached elfutils from https://cache.nix-ci.com
  138. 20.98 s Progress: 0 of 6 built, 39 of 57 downloaded from cache (5 downloading)
  139. 20.99 s Downloading cached nix-util from https://cache.nix-ci.com
  140. 21.14 s Downloaded cached aws-c-auth (387 KiB) in 164ms
  141. 21.17 s Downloaded cached nix-util (2.4 MiB) in 179ms
  142. 21.20 s Progress: 0 of 6 built, 40 of 57 downloaded from cache (5 downloading)
  143. 21.20 s Progress: 0 of 6 built, 41 of 57 downloaded from cache (5 downloading)
  144. 21.20 s Downloading cached nix-nswrapper from https://cache.nix-ci.com
  145. 21.20 s Downloading cached aws-c-s3 from https://cache.nix-ci.com
  146. 21.20 s Downloaded cached aws-c-mqtt (557 KiB) in 225ms
  147. 21.20 s Progress: 0 of 6 built, 42 of 57 downloaded from cache (5 downloading)
  148. 21.24 s Downloaded cached elfutils (4.1 MiB) in 264ms
  149. 21.24 s Progress: 0 of 6 built, 43 of 57 downloaded from cache (4 downloading)
  150. 21.24 s Downloading cached ShellCheck from https://cache.nix-ci.com
  151. 21.35 s Downloaded cached nix-nswrapper (131 KiB) in 151ms
  152. 21.36 s Progress: 0 of 6 built, 44 of 57 downloaded from cache (4 downloading)
  153. 21.36 s Downloaded cached aws-c-s3 (384 KiB) in 160ms
  154. 21.36 s Progress: 0 of 6 built, 45 of 57 downloaded from cache (3 downloading)
  155. 21.37 s Downloading cached aws-crt-cpp from https://cache.nix-ci.com
  156. 21.51 s Downloaded cached ShellCheck (7.5 MiB) in 265ms
  157. 21.53 s Progress: 0 of 6 built, 46 of 57 downloaded from cache (3 downloading)
  158. 21.55 s Downloaded cached aws-crt-cpp (979 KiB) in 178ms
  159. 21.55 s Progress: 0 of 5 built, 47 of 57 downloaded from cache (2 downloading)
  160. 21.55 s Downloading cached nix-store from https://cache.nix-ci.com
  161. 21.71 s Downloaded cached nix-store (5.8 MiB) in 164ms
  162. 21.71 s Progress: 0 of 5 built, 48 of 57 downloaded from cache (2 downloading)
  163. 21.71 s Downloading cached nix-fetchers from https://cache.nix-ci.com
  164. 21.71 s Downloading cached nix-main from https://cache.nix-ci.com
  165. 21.79 s Downloaded cached gammaloop-nextest-binaries-core-gammaloop-api (68.4 MiB) in 2.2s
  166. 21.79 s Progress: 0 of 5 built, 49 of 57 downloaded from cache (3 downloading)
  167. 21.88 s Downloaded cached nix-main (393 KiB) in 167ms
  168. 21.90 s Progress: 0 of 4 built, 50 of 57 downloaded from cache (2 downloading)
  169. 21.91 s Downloaded cached nix-fetchers (1.5 MiB) in 192ms
  170. 21.91 s Progress: 0 of 4 built, 51 of 57 downloaded from cache (1 downloading)
  171. 21.92 s Downloading cached nix-expr from https://cache.nix-ci.com
  172. 22.05 s Downloaded cached nix-expr (3.3 MiB) in 132ms
  173. 22.05 s Progress: 0 of 4 built, 52 of 57 downloaded from cache (1 downloading)
  174. 22.05 s Downloading cached nix-flake from https://cache.nix-ci.com
  175. 22.21 s Downloaded cached nix-flake (956 KiB) in 154ms
  176. 22.21 s Progress: 0 of 4 built, 53 of 57 downloaded from cache (1 downloading)
  177. 22.21 s Downloading cached nix-cmd from https://cache.nix-ci.com
  178. 22.33 s Downloaded cached nix-cmd (1 MiB) in 124ms
  179. 22.33 s Progress: 0 of 4 built, 54 of 57 downloaded from cache (1 downloading)
  180. 22.33 s Downloading cached nix from https://cache.nix-ci.com
  181. 22.53 s Downloaded cached nix (3.9 MiB) in 198ms
  182. 22.53 s Progress: 0 of 4 built, 55 of 57 downloaded from cache (1 downloading)
  183. 22.53 s Downloading cached nix from https://cache.nix-ci.com
  184. 22.65 s Downloaded cached nix (8848 B) in 112ms
  185. 22.65 s Progress: 0 of 4 built, 56 of 57 downloaded from cache (1 downloading)
  186. 23.65 s Downloaded cached gammaloop-nextest-binaries-core-gammalooprs (79.4 MiB) in 4.0s
  187. 23.65 s Progress: 0 of 3 built, 57 of 57 downloaded from cache
  188. 23.74 s Building /nix/store/pgw75qq7292qymbzyvfcfb80rk1vnbys-gammaloop-nextest-binaries-core.drv
  189. 23.94 s [gammaloop-nextest-binaries-core:post-build] Uploading to the NixCI cache: /nix/store/8c8xkh8pz19kwvbpp1rnhdxmff944ahj-gammaloop-nextest-binaries-core
  190. 24.62 s [gammaloop-nextest-binaries-core:post-build] warning: 'warn-short-path-literals' is deprecated, use 'lint-short-path-literals = ignore' instead
  191. 24.73 s [gammaloop-nextest-binaries-core:post-build] copying 0 paths...
  192. 25.58 s [gammaloop-nextest-binaries-core:post-build] warning: 'warn-short-path-literals' is deprecated, use 'lint-short-path-literals = ignore' instead
  193. 26.39 s [gammaloop-nextest-binaries-core:post-build] copying 0 paths...
  194. 26.66 s Uploaded gammaloop-nextest-binaries-core in 2.8s
  195. 26.66 s Progress: 1 of 3 built, 57 of 57 downloaded from cache
  196. 26.66 s Built gammaloop-nextest-binaries-core in 2.9s
  197. 27.65 s Building /nix/store/k80s8aj3jfsn1mhhw259dp0v1par5hf0-nix-ci-check-gammaloop-nextest-core.drv
  198. 27.88 s [nix-ci-check-gammaloop-nextest-core:post-build] Uploading to the NixCI cache: /nix/store/xa9pvmimyrna3z7wx1bi8llhf1hcai7v-nix-ci-check-gammaloop-nextest-core
  199. 28.56 s [nix-ci-check-gammaloop-nextest-core:post-build] warning: 'warn-short-path-literals' is deprecated, use 'lint-short-path-literals = ignore' instead
  200. 28.65 s [nix-ci-check-gammaloop-nextest-core:post-build] copying 1 paths...
  201. 28.65 s [nix-ci-check-gammaloop-nextest-core:post-build] copying path '/nix/store/xa9pvmimyrna3z7wx1bi8llhf1hcai7v-nix-ci-check-gammaloop-nextest-core' to 'https://cache.nix-ci.com'...
  202. 29.88 s [nix-ci-check-gammaloop-nextest-core:post-build] warning: 'warn-short-path-literals' is deprecated, use 'lint-short-path-literals = ignore' instead
  203. 31.74 s [nix-ci-check-gammaloop-nextest-core:post-build] copying 1 paths...
  204. 31.75 s [nix-ci-check-gammaloop-nextest-core:post-build] copying path '/nix/store/k80s8aj3jfsn1mhhw259dp0v1par5hf0-nix-ci-check-gammaloop-nextest-core.drv' to 'https://cache.nix-ci.com'...
  205. 32.28 s Uploaded nix-ci-check-gammaloop-nextest-core in 4.4s
  206. 32.28 s Progress: 2 of 3 built, 57 of 57 downloaded from cache
  207. 32.28 s Built nix-ci-check-gammaloop-nextest-core in 4.6s
  208. 32.28 s Progress: 3 of 3 built, 57 of 57 downloaded from cache
  209. 44.70 s evaluating derivation 'g copying '/nix/store/lvky evaluating derivation 'g copying '/nix/store/lvky evaluating derivation 'g copying '/nix/store/lvky evaluating derivation 'g copying '/nix/store/lvky evaluating derivation 'g copying '/nix/store/lvky evaluating derivation 'g copying '/nix/store/lvky evaluating derivation 'g copying '/nix/store/lvky evaluating derivation 'g copying '/nix/store/lvky evaluating derivation 'g copying '/nix/store/lvky evaluating derivation 'g copying '/nix/store/lvky evaluating derivation 'g copying '/nix/store/lvky evaluating derivation 'g copying '/nix/store/lvky evaluating derivation 'g copying '/nix/store/lvky evaluating derivation 'g querying gammaloop-nexte [0.0 KiB DL] querying fo [2.2 KiB DL] querying in [3.2 KiB DL] querying in [3.9/3.2 KiB DL] queryin [4.8 KiB DL] querying gf [6.2 KiB DL] querying gf [0/4 built, 4/0/9 copied [0/3 built, 3/1/9 copied [0/3 built, 3/3/9 copied [0/2 built, 2/5/9 copied [0/2 built, 1/6/9 copied [0/2 built, 1/7/9 copied [0/2 built, 1/8/9 copied [0/1 built, 9 copied (10 [1/0/1 built, 9 copied (gammaloop-nextest-core> Extracting 3 binaries (including 1 non-test binary), 1 build script output directory, and 2 linked paths to /build/nextest-archive-FDUGMO
  210. 45.47 s gammaloop-nextest-core> Extracted 18 files to /build/nextest-archive-FDUGMO in 0.77s
  211. 45.50 s gammaloop-nextest-core> ------------
  212. 45.50 s gammaloop-nextest-core> Nextest run ID 19e8fa39-75e9-46f6-ac20-bbc328807c55 with nextest profile: ci_gammaloop
  213. 45.50 s gammaloop-nextest-core> Starting 339 tests across 2 binaries
  214. 46.83 s gammaloop-nextest-core> FAIL [ 0.047s] (234/339) gammaloop-api repl::tests::completion_shows_type_hint_for_non_boolean_settings_leaf
  215. 46.83 s gammaloop-nextest-core> stdout ---
  216. 46.83 s gammaloop-nextest-core>
  217. 46.83 s gammaloop-nextest-core> running 1 test
  218. 46.83 s gammaloop-nextest-core> test repl::tests::completion_shows_type_hint_for_non_boolean_settings_leaf ... FAILED
  219. 46.83 s gammaloop-nextest-core>
  220. 46.83 s gammaloop-nextest-core> failures:
  221. 46.83 s gammaloop-nextest-core>
  222. 46.83 s gammaloop-nextest-core> failures:
  223. 46.83 s gammaloop-nextest-core> repl::tests::completion_shows_type_hint_for_non_boolean_settings_leaf
  224. 46.83 s gammaloop-nextest-core>
  225. 46.83 s gammaloop-nextest-core> test result: FAILED. 0 passed; 1 failed; 0 ignored; 0 measured; 338 filtered out; finished in 0.03s
  226. 46.83 s gammaloop-nextest-core>
  227. 46.83 s gammaloop-nextest-core> stderr ---
  228. 46.83 s gammaloop-nextest-core>
  229. 46.83 s gammaloop-nextest-core> thread 'repl::tests::completion_shows_type_hint_for_non_boolean_settings_leaf' (724) panicked at crates/gammaloop-api/src/repl.rs:5778:9:
  230. 46.83 s gammaloop-nextest-core> [Suggestion { value: "", description: Some("Number of samples in the first Monte Carlo iteration."), style: None, extra: None, span: Span { start: 42, end: 42 }, append_whitespace: false }]
  231. 46.83 s gammaloop-nextest-core> stack backtrace:
  232. 46.83 s gammaloop-nextest-core> 0: __rustc::rust_begin_unwind
  233. 46.83 s gammaloop-nextest-core> 1: core::panicking::panic_fmt
  234. 46.83 s gammaloop-nextest-core> 2: gammaloop_api::repl::tests::completion_shows_type_hint_for_non_boolean_settings_leaf
  235. 46.83 s gammaloop-nextest-core> 3: <gammaloop_api::repl::tests::completion_shows_type_hint_for_non_boolean_settings_leaf::{closure#0} as core::ops::function::FnOnce<()>>::call_once
  236. 46.83 s gammaloop-nextest-core> note: Some details are omitted, run with `RUST_BACKTRACE=full` for a verbose backtrace.
  237. 46.83 s gammaloop-nextest-core>
  238. 47.08 s gammaloop-nextest-core> FAIL [ 0.135s] (285/339) gammaloop-api templates::tests::extract_templates_uses_canonical_package_layout
  239. 47.08 s gammaloop-nextest-core> stdout ---
  240. 47.08 s gammaloop-nextest-core>
  241. 47.08 s gammaloop-nextest-core> running 1 test
  242. 47.08 s gammaloop-nextest-core> test templates::tests::extract_templates_uses_canonical_package_layout ... FAILED
  243. 47.08 s gammaloop-nextest-core>
  244. 47.08 s gammaloop-nextest-core> failures:
  245. 47.08 s gammaloop-nextest-core>
  246. 47.08 s gammaloop-nextest-core> failures:
  247. 47.08 s gammaloop-nextest-core> templates::tests::extract_templates_uses_canonical_package_layout
  248. 47.08 s gammaloop-nextest-core>
  249. 47.08 s gammaloop-nextest-core> test result: FAILED. 0 passed; 1 failed; 0 ignored; 0 measured; 338 filtered out; finished in 0.10s
  250. 47.08 s gammaloop-nextest-core>
  251. 47.08 s gammaloop-nextest-core> stderr ---
  252. 47.08 s gammaloop-nextest-core>
  253. 47.08 s gammaloop-nextest-core> thread 'templates::tests::extract_templates_uses_canonical_package_layout' (852) panicked at crates/gammaloop-api/src/templates.rs:99:9:
  254. 47.08 s gammaloop-nextest-core> assertion failed: figure.contains("amplitude-mode")
  255. 47.08 s gammaloop-nextest-core> stack backtrace:
  256. 47.08 s gammaloop-nextest-core> 0: __rustc::rust_begin_unwind
  257. 47.08 s gammaloop-nextest-core> 1: core::panicking::panic_fmt
  258. 47.08 s gammaloop-nextest-core> 2: core::panicking::panic
  259. 47.08 s gammaloop-nextest-core> 3: gammaloop_api::templates::tests::extract_templates_uses_canonical_package_layout
  260. 47.08 s gammaloop-nextest-core> 4: <gammaloop_api::templates::tests::extract_templates_uses_canonical_package_layout::{closure#0} as core::ops::function::FnOnce<()>>::call_once
  261. 47.08 s gammaloop-nextest-core> note: Some details are omitted, run with `RUST_BACKTRACE=full` for a verbose backtrace.
  262. 47.08 s gammaloop-nextest-core>
  263. 47.55 s gammaloop-nextest-core> ------------
  264. 47.55 s gammaloop-nextest-core> Summary [ 2.047s] 339 tests run: 337 passed, 2 failed, 0 skipped
  265. 47.55 s gammaloop-nextest-core> FAIL [ 0.047s] (234/339) gammaloop-api repl::tests::completion_shows_type_hint_for_non_boolean_settings_leaf
  266. 47.55 s gammaloop-nextest-core> stdout ---
  267. 47.55 s gammaloop-nextest-core>
  268. 47.55 s gammaloop-nextest-core> running 1 test
  269. 47.55 s gammaloop-nextest-core> test repl::tests::completion_shows_type_hint_for_non_boolean_settings_leaf ... FAILED
  270. 47.55 s gammaloop-nextest-core>
  271. 47.55 s gammaloop-nextest-core> failures:
  272. 47.55 s gammaloop-nextest-core>
  273. 47.55 s gammaloop-nextest-core> failures:
  274. 47.55 s gammaloop-nextest-core> repl::tests::completion_shows_type_hint_for_non_boolean_settings_leaf
  275. 47.55 s gammaloop-nextest-core>
  276. 47.55 s gammaloop-nextest-core> test result: FAILED. 0 passed; 1 failed; 0 ignored; 0 measured; 338 filtered out; finished in 0.03s
  277. 47.55 s gammaloop-nextest-core>
  278. 47.55 s gammaloop-nextest-core> stderr ---
  279. 47.55 s gammaloop-nextest-core>
  280. 47.55 s gammaloop-nextest-core> thread 'repl::tests::completion_shows_type_hint_for_non_boolean_settings_leaf' (724) panicked at crates/gammaloop-api/src/repl.rs:5778:9:
  281. 47.55 s gammaloop-nextest-core> [Suggestion { value: "", description: Some("Number of samples in the first Monte Carlo iteration."), style: None, extra: None, span: Span { start: 42, end: 42 }, append_whitespace: false }]
  282. 47.55 s gammaloop-nextest-core> stack backtrace:
  283. 47.55 s gammaloop-nextest-core> 0: __rustc::rust_begin_unwind
  284. 47.55 s gammaloop-nextest-core> 1: core::panicking::panic_fmt
  285. 47.55 s gammaloop-nextest-core> 2: gammaloop_api::repl::tests::completion_shows_type_hint_for_non_boolean_settings_leaf
  286. 47.55 s gammaloop-nextest-core> 3: <gammaloop_api::repl::tests::completion_shows_type_hint_for_non_boolean_settings_leaf::{closure#0} as core::ops::function::FnOnce<()>>::call_once
  287. 47.55 s gammaloop-nextest-core> note: Some details are omitted, run with `RUST_BACKTRACE=full` for a verbose backtrace.
  288. 47.55 s gammaloop-nextest-core>
  289. 47.55 s gammaloop-nextest-core> FAIL [ 0.135s] (285/339) gammaloop-api templates::tests::extract_templates_uses_canonical_package_layout
  290. 47.55 s gammaloop-nextest-core> stdout ---
  291. 47.55 s gammaloop-nextest-core>
  292. 47.55 s gammaloop-nextest-core> running 1 test
  293. 47.55 s gammaloop-nextest-core> test templates::tests::extract_templates_uses_canonical_package_layout ... FAILED
  294. 47.55 s gammaloop-nextest-core>
  295. 47.55 s gammaloop-nextest-core> failures:
  296. 47.55 s gammaloop-nextest-core>
  297. 47.55 s gammaloop-nextest-core> failures:
  298. 47.55 s gammaloop-nextest-core> templates::tests::extract_templates_uses_canonical_package_layout
  299. 47.55 s gammaloop-nextest-core>
  300. 47.55 s gammaloop-nextest-core> test result: FAILED. 0 passed; 1 failed; 0 ignored; 0 measured; 338 filtered out; finished in 0.10s
  301. 47.55 s gammaloop-nextest-core>
  302. 47.55 s gammaloop-nextest-core> stderr ---
  303. 47.55 s gammaloop-nextest-core>
  304. 47.55 s gammaloop-nextest-core> thread 'templates::tests::extract_templates_uses_canonical_package_layout' (852) panicked at crates/gammaloop-api/src/templates.rs:99:9:
  305. 47.55 s gammaloop-nextest-core> assertion failed: figure.contains("amplitude-mode")
  306. 47.55 s gammaloop-nextest-core> stack backtrace:
  307. 47.55 s gammaloop-nextest-core> 0: __rustc::rust_begin_unwind
  308. 47.55 s gammaloop-nextest-core> 1: core::panicking::panic_fmt
  309. 47.55 s gammaloop-nextest-core> 2: core::panicking::panic
  310. 47.55 s gammaloop-nextest-core> 3: gammaloop_api::templates::tests::extract_templates_uses_canonical_package_layout
  311. 47.55 s gammaloop-nextest-core> 4: <gammaloop_api::templates::tests::extract_templates_uses_canonical_package_layout::{closure#0} as core::ops::function::FnOnce<()>>::call_once
  312. 47.55 s gammaloop-nextest-core> note: Some details are omitted, run with `RUST_BACKTRACE=full` for a verbose backtrace.
  313. 47.55 s gammaloop-nextest-core>
  314. 47.66 s gammaloop-nextest-core> error: test run failed
  315. 47.79 s gammaloop-nextest-core>
  316. 47.79 s gammaloop-nextest-core> ========== nextest test summary ==========
  317. 47.79 s gammaloop-nextest-core> report: target/nextest/ci_gammaloop/junit.xml
  318. 47.79 s gammaloop-nextest-core> tests: 339, failures: 2, errors: 0
  319. 47.79 s gammaloop-nextest-core>
  320. 47.79 s gammaloop-nextest-core> 1. gammaloop-api::repl::tests::completion_shows_type_hint_for_non_boolean_settings_leaf
  321. 47.79 s gammaloop-nextest-core> failure: test failure with exit code 101
  322. 47.79 s gammaloop-nextest-core> thread 'repl::tests::completion_shows_type_hint_for_non_boolean_settings_leaf' (724) panicked at crates/gammaloop-api/src/repl.rs:5778:9:
  323. 47.79 s gammaloop-nextest-core> [Suggestion { value: "", description: Some("Number of samples in the first Monte Carlo iteration."), style: None, extra: None, span: Span { start: 42, end: 42 }, append_whitespace: false }]
  324. 47.79 s gammaloop-nextest-core> stack backtrace:
  325. 47.79 s gammaloop-nextest-core> 0: __rustc::rust_begin_unwind
  326. 47.79 s gammaloop-nextest-core> 1: core::panicking::panic_fmt
  327. 47.79 s gammaloop-nextest-core> 2: gammaloop_api::repl::tests::completion_shows_type_hint_for_non_boolean_settings_leaf
  328. 47.79 s gammaloop-nextest-core> 3: <gammaloop_api::repl::tests::completion_shows_type_hint_for_non_boolean_settings_leaf::{closure#0} as core::ops::function::FnOnce<()>>::call_once
  329. 47.79 s gammaloop-nextest-core> note: Some details are omitted, run with `RUST_BACKTRACE=full` for a verbose backtrace.
  330. 47.79 s gammaloop-nextest-core> system-out
  331. 47.79 s gammaloop-nextest-core> running 1 test
  332. 47.79 s gammaloop-nextest-core> test repl::tests::completion_shows_type_hint_for_non_boolean_settings_leaf ... FAILED
  333. 47.79 s gammaloop-nextest-core>
  334. 47.79 s gammaloop-nextest-core> failures:
  335. 47.79 s gammaloop-nextest-core>
  336. 47.79 s gammaloop-nextest-core> failures:
  337. 47.79 s gammaloop-nextest-core> repl::tests::completion_shows_type_hint_for_non_boolean_settings_leaf
  338. 47.79 s gammaloop-nextest-core>
  339. 47.79 s gammaloop-nextest-core> test result: FAILED. 0 passed; 1 failed; 0 ignored; 0 measured; 338 filtered out; finished in 0.03s
  340. 47.79 s gammaloop-nextest-core> system-err
  341. 47.79 s gammaloop-nextest-core> thread 'repl::tests::completion_shows_type_hint_for_non_boolean_settings_leaf' (724) panicked at crates/gammaloop-api/src/repl.rs:5778:9:
  342. 47.79 s gammaloop-nextest-core> [Suggestion { value: "", description: Some("Number of samples in the first Monte Carlo iteration."), style: None, extra: None, span: Span { start: 42, end: 42 }, append_whitespace: false }]
  343. 47.79 s gammaloop-nextest-core> stack backtrace:
  344. 47.79 s gammaloop-nextest-core> 0: __rustc::rust_begin_unwind
  345. 47.79 s gammaloop-nextest-core> 1: core::panicking::panic_fmt
  346. 47.79 s gammaloop-nextest-core> 2: gammaloop_api::repl::tests::completion_shows_type_hint_for_non_boolean_settings_leaf
  347. 47.79 s gammaloop-nextest-core> 3: <gammaloop_api::repl::tests::completion_shows_type_hint_for_non_boolean_settings_leaf::{closure#0} as core::ops::function::FnOnce<()>>::call_once
  348. 47.79 s gammaloop-nextest-core> note: Some details are omitted, run with `RUST_BACKTRACE=full` for a verbose backtrace.
  349. 47.79 s gammaloop-nextest-core>
  350. 47.79 s gammaloop-nextest-core> 2. gammaloop-api::templates::tests::extract_templates_uses_canonical_package_layout
  351. 47.79 s gammaloop-nextest-core> failure: test failure with exit code 101
  352. 47.79 s gammaloop-nextest-core> thread 'templates::tests::extract_templates_uses_canonical_package_layout' (852) panicked at crates/gammaloop-api/src/templates.rs:99:9:
  353. 47.79 s gammaloop-nextest-core> assertion failed: figure.contains("amplitude-mode")
  354. 47.79 s gammaloop-nextest-core> stack backtrace:
  355. 47.79 s gammaloop-nextest-core> 0: __rustc::rust_begin_unwind
  356. 47.79 s gammaloop-nextest-core> 1: core::panicking::panic_fmt
  357. 47.79 s gammaloop-nextest-core> 2: core::panicking::panic
  358. 47.79 s gammaloop-nextest-core> 3: gammaloop_api::templates::tests::extract_templates_uses_canonical_package_layout
  359. 47.79 s gammaloop-nextest-core> 4: <gammaloop_api::templates::tests::extract_templates_uses_canonical_package_layout::{closure#0} as core::ops::function::FnOnce<()>>::call_once
  360. 47.79 s gammaloop-nextest-core> note: Some details are omitted, run with `RUST_BACKTRACE=full` for a verbose backtrace.
  361. 47.79 s gammaloop-nextest-core> system-out
  362. 47.79 s gammaloop-nextest-core> running 1 test
  363. 47.79 s gammaloop-nextest-core> test templates::tests::extract_templates_uses_canonical_package_layout ... FAILED
  364. 47.79 s gammaloop-nextest-core>
  365. 47.79 s gammaloop-nextest-core> failures:
  366. 47.79 s gammaloop-nextest-core>
  367. 47.79 s gammaloop-nextest-core> failures:
  368. 47.79 s gammaloop-nextest-core> templates::tests::extract_templates_uses_canonical_package_layout
  369. 47.79 s gammaloop-nextest-core>
  370. 47.79 s gammaloop-nextest-core> test result: FAILED. 0 passed; 1 failed; 0 ignored; 0 measured; 338 filtered out; finished in 0.10s
  371. 47.79 s gammaloop-nextest-core> system-err
  372. 47.79 s gammaloop-nextest-core> thread 'templates::tests::extract_templates_uses_canonical_package_layout' (852) panicked at crates/gammaloop-api/src/templates.rs:99:9:
  373. 47.79 s gammaloop-nextest-core> assertion failed: figure.contains("amplitude-mode")
  374. 47.79 s gammaloop-nextest-core> stack backtrace:
  375. 47.79 s gammaloop-nextest-core> 0: __rustc::rust_begin_unwind
  376. 47.79 s gammaloop-nextest-core> 1: core::panicking::panic_fmt
  377. 47.79 s gammaloop-nextest-core> 2: core::panicking::panic
  378. 47.79 s gammaloop-nextest-core> 3: gammaloop_api::templates::tests::extract_templates_uses_canonical_package_layout
  379. 47.79 s gammaloop-nextest-core> 4: <gammaloop_api::templates::tests::extract_templates_uses_canonical_package_layout::{closure#0} as core::ops::function::FnOnce<()>>::call_once
  380. 47.79 s gammaloop-nextest-core> note: Some details are omitted, run with `RUST_BACKTRACE=full` for a verbose backtrace.
  381. 47.79 s gammaloop-nextest-core> =========================================
  382. 47.83 s gammaloop-nextest-core> Extracting 1 binary and 1 linked path to /build/nextest-archive-lBjI3y
  383. 47.95 s gammaloop-nextest-core> Extracted 7 files to /build/nextest-archive-lBjI3y in 0.13s
  384. 47.99 s gammaloop-nextest-core> ------------
  385. 47.99 s gammaloop-nextest-core> Nextest run ID 33ba6eb3-8d5d-4e5e-b6a3-f41240533ade with nextest profile: ci_gammaloop
  386. 47.99 s gammaloop-nextest-core> Starting 19 tests across 1 binary
  387. 48.09 s gammaloop-nextest-core> ------------
  388. 48.09 s gammaloop-nextest-core> Summary [ 0.095s] 19 tests run: 19 passed, 0 skipped
  389. 48.29 s gammaloop-nextest-core>
  390. 48.29 s gammaloop-nextest-core> ========== nextest test summary ==========
  391. 48.29 s gammaloop-nextest-core> report: target/nextest/ci_gammaloop/junit.xml
  392. 48.29 s gammaloop-nextest-core> tests: 19, failures: 0, errors: 0
  393. 48.29 s gammaloop-nextest-core> No failing testcases found.
  394. 48.29 s gammaloop-nextest-core> =========================================
  395. 48.38 s gammaloop-nextest-core> Extracting 1 binary to /build/nextest-archive-t1oFfQ
  396. 48.51 s gammaloop-nextest-core> Extracted 4 files to /build/nextest-archive-t1oFfQ in 0.13s
  397. 48.58 s gammaloop-nextest-core> ------------
  398. 48.58 s gammaloop-nextest-core> Nextest run ID a88082af-6818-4950-b905-b604fb41910c with nextest profile: ci_gammaloop
  399. 48.58 s gammaloop-nextest-core> Starting 0 tests across 1 binary
  400. 48.58 s gammaloop-nextest-core> ------------
  401. 48.58 s gammaloop-nextest-core> Summary [ 0.002s] 0 tests run: 0 passed, 0 skipped
  402. 48.76 s gammaloop-nextest-core>
  403. 48.76 s gammaloop-nextest-core> ========== nextest test summary ==========
  404. 48.76 s gammaloop-nextest-core> report: target/nextest/ci_gammaloop/junit.xml
  405. 48.76 s gammaloop-nextest-core> tests: 0, failures: 0, errors: 0
  406. 48.76 s gammaloop-nextest-core> No failing testcases found.
  407. 48.76 s gammaloop-nextest-core> =========================================
  408. 48.81 s gammaloop-nextest-core> Extracting 4 binaries, 1 build script output directory, and 2 linked paths to /build/nextest-archive-RAKGSV
  409. 49.57 s gammaloop-nextest-core> Extracted 18 files to /build/nextest-archive-RAKGSV in 0.77s
  410. 49.65 s gammaloop-nextest-core> ------------
  411. 49.65 s gammaloop-nextest-core> Nextest run ID 9bf32337-0e50-4210-9a66-aa426ecb6c4c with nextest profile: ci_gammaloop
  412. 49.65 s gammaloop-nextest-core> Starting 456 tests across 4 binaries (61 tests skipped, including 60 tests via profile.ci_gammaloop.default-filter)
  413. 50.64 s gammaloop-nextest-core> FAIL [ 0.630s] (114/456) gammalooprs graph::parse::tests::parse_lmbsetting_crossection
  414. 50.75 s gammaloop-nextest-core> stdout ---
  415. 50.75 s gammaloop-nextest-core>
  416. 50.75 s gammaloop-nextest-core> running 1 test
  417. 50.75 s gammaloop-nextest-core> ━━━━━━━━━━━━━━━━━━━━━━━━━━━━━━━ Snapshot Summary ━━━━━━━━━━━━━━━━━━━━━━━━━━━━━━━
  418. 50.75 s gammaloop-nextest-core> Snapshot: parse_lmbsetting_crossection
  419. 50.75 s gammaloop-nextest-core> Source: crates/gammalooprs/src/graph/parse/tests.rs:252
  420. 50.75 s gammaloop-nextest-core> ────────────────────────────────────────────────────────────────────────────────
  421. 50.75 s gammaloop-nextest-core> Expression: g.debug_dot()
  422. 50.75 s gammaloop-nextest-core> ────────────────────────────────────────────────────────────────────────────────
  423. 50.75 s gammaloop-nextest-core> -old snapshot
  424. 50.75 s gammaloop-nextest-core> +new results
  425. 50.75 s gammaloop-nextest-core> ────────────┬───────────────────────────────────────────────────────────────────
  426. 50.75 s gammaloop-nextest-core> 1 │-digraph G{
  427. 50.75 s gammaloop-nextest-core> 1 │+digraph G {
  428. 50.75 s gammaloop-nextest-core> 2 2 │ num = "1/2";
  429. 50.75 s gammaloop-nextest-core> 3 3 │ overall_factor = "2*x";
  430. 50.75 s gammaloop-nextest-core> 4 4 │ overall_factor_evaluated = "2*x";
  431. 50.75 s gammaloop-nextest-core> 5 5 │ projector = "spenso::t";
  432. 50.75 s gammaloop-nextest-core> ────────────┴───────────────────────────────────────────────────────────────────
  433. 50.75 s gammaloop-nextest-core> To update snapshots run `cargo insta review`
  434. 50.75 s gammaloop-nextest-core> Stopped on the first failure. Run `cargo insta test` to run all snapshots.
  435. 50.75 s gammaloop-nextest-core> test graph::parse::tests::parse_lmbsetting_crossection ... FAILED
  436. 50.75 s gammaloop-nextest-core>
  437. 50.75 s gammaloop-nextest-core> failures:
  438. 50.75 s gammaloop-nextest-core>
  439. 50.75 s gammaloop-nextest-core> failures:
  440. 50.75 s gammaloop-nextest-core> graph::parse::tests::parse_lmbsetting_crossection
  441. 50.75 s gammaloop-nextest-core>
  442. 50.75 s gammaloop-nextest-core> test result: FAILED. 0 passed; 1 failed; 0 ignored; 0 measured; 508 filtered out; finished in 0.61s
  443. 50.75 s gammaloop-nextest-core>
  444. 50.75 s gammaloop-nextest-core> stderr ---
  445. 50.75 s gammaloop-nextest-core> [21:00:41.499] @gammalooprs::graph::attribute_warnings WARNING : Unknown node attribute 'color_num' on graph 'G', node 'A'; did you mean 'num'?
  446. 50.75 s gammaloop-nextest-core> at crates/gammalooprs/src/graph/attribute_warnings.rs:198
  447. 50.75 s gammaloop-nextest-core> The application panicked (crashed).
  448. 50.75 s gammaloop-nextest-core> Message: snapshot assertion for 'parse_lmbsetting_crossection' failed in line 252
  449. 50.75 s gammaloop-nextest-core> Location: /nix/store/xdy1vvhll2bijdplvl9fcc2b9plkxhaa-vendor-cargo-deps/c19b7c6f923b580ac259164a89f2577984ad5ab09ee9d583b888f934adbbe8d0/insta-1.47.2/src/runtime.rs:719
  450. 50.75 s gammaloop-nextest-core>
  451. 50.75 s gammaloop-nextest-core> ━━━━━━━━━━━━━━━━━━━━━━━━━━━━━━━━━━ BACKTRACE ━━━━━━━━━━━━━━━━━━━━━━━━━━━━━━━━━━━
  452. 50.75 s gammaloop-nextest-core> 1: <color_eyre[b0c9e66060e883b2]::config::PanicHook>::panic_report<unknown>
  453. 50.75 s gammaloop-nextest-core> at <unknown source file>:<unknown line>
  454. 50.75 s gammaloop-nextest-core> 2: <color_eyre[b0c9e66060e883b2]::config::PanicHook>::into_panic_hook::{closure#0}<unknown>
  455. 50.75 s gammaloop-nextest-core> at <unknown source file>:<unknown line>
  456. 50.75 s gammaloop-nextest-core> 3: std[bcb96dfbba0ab899]::panicking::panic_with_hook<unknown>
  457. 50.75 s gammaloop-nextest-core> at <unknown source file>:<unknown line>
  458. 50.75 s gammaloop-nextest-core> 4: std[bcb96dfbba0ab899]::panicking::panic_handler::{closure#0}<unknown>
  459. 50.75 s gammaloop-nextest-core> at <unknown source file>:<unknown line>
  460. 50.75 s gammaloop-nextest-core> 5: std[bcb96dfbba0ab899]::sys::backtrace::__rust_end_short_backtrace::<std[bcb96dfbba0ab899]::panicking::panic_handler::{closure#0}, !><unknown>
  461. 50.75 s gammaloop-nextest-core> at <unknown source file>:<unknown line>
  462. 50.75 s gammaloop-nextest-core> 6: __rustc[6c289b9f9c454d21]::rust_begin_unwind<unknown>
  463. 50.75 s gammaloop-nextest-core> at <unknown source file>:<unknown line>
  464. 50.75 s gammaloop-nextest-core> 7: core[940e698046960fd5]::panicking::panic_fmt<unknown>
  465. 50.75 s gammaloop-nextest-core> at <unknown source file>:<unknown line>
  466. 50.75 s gammaloop-nextest-core> 8: insta[307a548ac79ef4d9]::runtime::assert_snapshot<unknown>
  467. 50.75 s gammaloop-nextest-core> at <unknown source file>:<unknown line>
  468. 50.75 s gammaloop-nextest-core> 9: gammalooprs[5490727360442cce]::graph::parse::tests::parse_lmbsetting_crossection<unknown>
  469. 50.75 s gammaloop-nextest-core> at <unknown source file>:<unknown line>
  470. 50.75 s gammaloop-nextest-core> 10: <gammalooprs[5490727360442cce]::graph::parse::tests::parse_lmbsetting_crossection::{closure#0} as core[940e698046960fd5]::ops::function::FnOnce<()>>::call_once<unknown>
  471. 50.75 s gammaloop-nextest-core> at <unknown source file>:<unknown line>
  472. 50.75 s gammaloop-nextest-core> 11: test[75d6903177b1d7e9]::__rust_begin_short_backtrace::<core[940e698046960fd5]::result::Result<(), alloc[2ea6bcb46fca0c42]::string::String>, fn() -> core[940e698046960fd5]::result::Result<(), alloc[2ea6bcb46fca0c42]::string::String>><unknown>
  473. 50.75 s gammaloop-nextest-core> at <unknown source file>:<unknown line>
  474. 50.75 s gammaloop-nextest-core> 12: test[75d6903177b1d7e9]::run_test::{closure#0}<unknown>
  475. 50.75 s gammaloop-nextest-core> at <unknown source file>:<unknown line>
  476. 50.75 s gammaloop-nextest-core> 13: std[bcb96dfbba0ab899]::sys::backtrace::__rust_begin_short_backtrace::<test[75d6903177b1d7e9]::run_test::{closure#1}, ()><unknown>
  477. 50.75 s gammaloop-nextest-core> at <unknown source file>:<unknown line>
  478. 50.75 s gammaloop-nextest-core> 14: <std[bcb96dfbba0ab899]::thread::lifecycle::spawn_unchecked<test[75d6903177b1d7e9]::run_test::{closure#1}, ()>::{closure#1} as core[940e698046960fd5]::ops::function::FnOnce<()>>::call_once::{shim:vtable#0}<unknown>
  479. 50.75 s gammaloop-nextest-core> at <unknown source file>:<unknown line>
  480. 50.75 s gammaloop-nextest-core> 15: <std[bcb96dfbba0ab899]::sys::thread::unix::Thread>::new::thread_start<unknown>
  481. 50.75 s gammaloop-nextest-core> at <unknown source file>:<unknown line>
  482. 50.75 s gammaloop-nextest-core> 16: start_thread<unknown>
  483. 50.75 s gammaloop-nextest-core> at <unknown source file>:<unknown line>
  484. 50.75 s gammaloop-nextest-core> 17: __clone3<unknown>
  485. 50.75 s gammaloop-nextest-core> at <unknown source file>:<unknown line>
  486. 50.75 s gammaloop-nextest-core>
  487. 50.75 s gammaloop-nextest-core> Run with COLORBT_SHOW_HIDDEN=1 environment variable to disable frame filtering.
  488. 50.75 s gammaloop-nextest-core> Run with RUST_BACKTRACE=full to include source snippets.
  489. 50.75 s gammaloop-nextest-core>
  490. 53.28 s gammaloop-nextest-core> FAIL [ 0.505s] (410/456) gammalooprs uv::export::tests::computed_node_full_numerator_is_a_spenso_aware_typst_fragment
  491. 53.28 s gammaloop-nextest-core> stdout ---
  492. 53.28 s gammaloop-nextest-core>
  493. 53.28 s gammaloop-nextest-core> running 1 test
  494. 53.28 s gammaloop-nextest-core> test uv::export::tests::computed_node_full_numerator_is_a_spenso_aware_typst_fragment ... FAILED
  495. 53.28 s gammaloop-nextest-core>
  496. 53.28 s gammaloop-nextest-core> failures:
  497. 53.28 s gammaloop-nextest-core>
  498. 53.28 s gammaloop-nextest-core> failures:
  499. 53.28 s gammaloop-nextest-core> uv::export::tests::computed_node_full_numerator_is_a_spenso_aware_typst_fragment
  500. 53.28 s gammaloop-nextest-core>
  501. 53.28 s gammaloop-nextest-core> test result: FAILED. 0 passed; 1 failed; 0 ignored; 0 measured; 508 filtered out; finished in 0.49s
  502. 53.28 s gammaloop-nextest-core>
  503. 53.28 s gammaloop-nextest-core> stderr ---
  504. 53.28 s gammaloop-nextest-core> The application panicked (crashed).
  505. 53.28 s gammaloop-nextest-core> Message: assertion failed: exported.dot.contains(r#"full_num = "op(\"Tr\")(1)";"#)
  506. 53.28 s gammaloop-nextest-core> Location: crates/gammalooprs/src/uv/export.rs:483
  507. 53.28 s gammaloop-nextest-core>
  508. 53.28 s gammaloop-nextest-core> ━━━━━━━━━━━━━━━━━━━━━━━━━━━━━━━━━━ BACKTRACE ━━━━━━━━━━━━━━━━━━━━━━━━━━━━━━━━━━━
  509. 53.28 s gammaloop-nextest-core> 1: <color_eyre[b0c9e66060e883b2]::config::PanicHook>::panic_report<unknown>
  510. 53.28 s gammaloop-nextest-core> at <unknown source file>:<unknown line>
  511. 53.28 s gammaloop-nextest-core> 2: <color_eyre[b0c9e66060e883b2]::config::PanicHook>::into_panic_hook::{closure#0}<unknown>
  512. 53.28 s gammaloop-nextest-core> at <unknown source file>:<unknown line>
  513. 53.28 s gammaloop-nextest-core> 3: std[bcb96dfbba0ab899]::panicking::panic_with_hook<unknown>
  514. 53.28 s gammaloop-nextest-core> at <unknown source file>:<unknown line>
  515. 53.28 s gammaloop-nextest-core> 4: std[bcb96dfbba0ab899]::panicking::panic_handler::{closure#0}<unknown>
  516. 53.28 s gammaloop-nextest-core> at <unknown source file>:<unknown line>
  517. 53.28 s gammaloop-nextest-core> 5: std[bcb96dfbba0ab899]::sys::backtrace::__rust_end_short_backtrace::<std[bcb96dfbba0ab899]::panicking::panic_handler::{closure#0}, !><unknown>
  518. 53.28 s gammaloop-nextest-core> at <unknown source file>:<unknown line>
  519. 53.28 s gammaloop-nextest-core> 6: __rustc[6c289b9f9c454d21]::rust_begin_unwind<unknown>
  520. 53.28 s gammaloop-nextest-core> at <unknown source file>:<unknown line>
  521. 53.28 s gammaloop-nextest-core> 7: core[940e698046960fd5]::panicking::panic_fmt<unknown>
  522. 53.28 s gammaloop-nextest-core> at <unknown source file>:<unknown line>
  523. 53.28 s gammaloop-nextest-core> 8: core[940e698046960fd5]::panicking::panic<unknown>
  524. 53.28 s gammaloop-nextest-core> at <unknown source file>:<unknown line>
  525. 53.28 s gammaloop-nextest-core> 9: gammalooprs[5490727360442cce]::uv::export::tests::computed_node_full_numerator_is_a_spenso_aware_typst_fragment<unknown>
  526. 53.28 s gammaloop-nextest-core> at <unknown source file>:<unknown line>
  527. 53.28 s gammaloop-nextest-core> 10: <gammalooprs[5490727360442cce]::uv::export::tests::computed_node_full_numerator_is_a_spenso_aware_typst_fragment::{closure#0} as core[940e698046960fd5]::ops::function::FnOnce<()>>::call_once<unknown>
  528. 53.28 s gammaloop-nextest-core> at <unknown source file>:<unknown line>
  529. 53.28 s gammaloop-nextest-core> 11: test[75d6903177b1d7e9]::__rust_begin_short_backtrace::<core[940e698046960fd5]::result::Result<(), alloc[2ea6bcb46fca0c42]::string::String>, fn() -> core[940e698046960fd5]::result::Result<(), alloc[2ea6bcb46fca0c42]::string::String>><unknown>
  530. 53.28 s gammaloop-nextest-core> at <unknown source file>:<unknown line>
  531. 53.28 s gammaloop-nextest-core> 12: test[75d6903177b1d7e9]::run_test::{closure#0}<unknown>
  532. 53.28 s gammaloop-nextest-core> at <unknown source file>:<unknown line>
  533. 53.28 s gammaloop-nextest-core> 13: std[bcb96dfbba0ab899]::sys::backtrace::__rust_begin_short_backtrace::<test[75d6903177b1d7e9]::run_test::{closure#1}, ()><unknown>
  534. 53.28 s gammaloop-nextest-core> at <unknown source file>:<unknown line>
  535. 53.28 s gammaloop-nextest-core> 14: <std[bcb96dfbba0ab899]::thread::lifecycle::spawn_unchecked<test[75d6903177b1d7e9]::run_test::{closure#1}, ()>::{closure#1} as core[940e698046960fd5]::ops::function::FnOnce<()>>::call_once::{shim:vtable#0}<unknown>
  536. 53.28 s gammaloop-nextest-core> at <unknown source file>:<unknown line>
  537. 53.28 s gammaloop-nextest-core> 15: <std[bcb96dfbba0ab899]::sys::thread::unix::Thread>::new::thread_start<unknown>
  538. 53.28 s gammaloop-nextest-core> at <unknown source file>:<unknown line>
  539. 53.28 s gammaloop-nextest-core> 16: start_thread<unknown>
  540. 53.28 s gammaloop-nextest-core> at <unknown source file>:<unknown line>
  541. 53.28 s gammaloop-nextest-core> 17: __clone3<unknown>
  542. 53.28 s gammaloop-nextest-core> at <unknown source file>:<unknown line>
  543. 53.28 s gammaloop-nextest-core>
  544. 53.28 s gammaloop-nextest-core> Run with COLORBT_SHOW_HIDDEN=1 environment variable to disable frame filtering.
  545. 53.28 s gammaloop-nextest-core> Run with RUST_BACKTRACE=full to include source snippets.
  546. 53.28 s gammaloop-nextest-core>
  547. 80.56 s gammaloop-nextest-core> ------------
  548. 80.61 s gammaloop-nextest-core> Summary [ 30.915s] 456 tests run: 454 passed, 2 failed, 61 skipped
  549. 80.61 s gammaloop-nextest-core> FAIL [ 0.630s] (114/456) gammalooprs graph::parse::tests::parse_lmbsetting_crossection
  550. 80.61 s gammaloop-nextest-core> stdout ---
  551. 80.61 s gammaloop-nextest-core>
  552. 80.61 s gammaloop-nextest-core> running 1 test
  553. 80.61 s gammaloop-nextest-core> ━━━━━━━━━━━━━━━━━━━━━━━━━━━━━━━ Snapshot Summary ━━━━━━━━━━━━━━━━━━━━━━━━━━━━━━━
  554. 80.61 s gammaloop-nextest-core> Snapshot: parse_lmbsetting_crossection
  555. 80.61 s gammaloop-nextest-core> Source: crates/gammalooprs/src/graph/parse/tests.rs:252
  556. 80.61 s gammaloop-nextest-core> ────────────────────────────────────────────────────────────────────────────────
  557. 80.61 s gammaloop-nextest-core> Expression: g.debug_dot()
  558. 80.61 s gammaloop-nextest-core> ────────────────────────────────────────────────────────────────────────────────
  559. 80.61 s gammaloop-nextest-core> -old snapshot
  560. 80.61 s gammaloop-nextest-core> +new results
  561. 80.61 s gammaloop-nextest-core> ────────────┬───────────────────────────────────────────────────────────────────
  562. 80.61 s gammaloop-nextest-core> 1 │-digraph G{
  563. 80.61 s gammaloop-nextest-core> 1 │+digraph G {
  564. 80.61 s gammaloop-nextest-core> 2 2 │ num = "1/2";
  565. 80.61 s gammaloop-nextest-core> 3 3 │ overall_factor = "2*x";
  566. 80.61 s gammaloop-nextest-core> 4 4 │ overall_factor_evaluated = "2*x";
  567. 80.61 s gammaloop-nextest-core> 5 5 │ projector = "spenso::t";
  568. 80.61 s gammaloop-nextest-core> ────────────┴───────────────────────────────────────────────────────────────────
  569. 80.61 s gammaloop-nextest-core> To update snapshots run `cargo insta review`
  570. 80.61 s gammaloop-nextest-core> Stopped on the first failure. Run `cargo insta test` to run all snapshots.
  571. 80.61 s gammaloop-nextest-core> test graph::parse::tests::parse_lmbsetting_crossection ... FAILED
  572. 80.61 s gammaloop-nextest-core>
  573. 80.61 s gammaloop-nextest-core> failures:
  574. 80.61 s gammaloop-nextest-core>
  575. 80.61 s gammaloop-nextest-core> failures:
  576. 80.61 s gammaloop-nextest-core> graph::parse::tests::parse_lmbsetting_crossection
  577. 80.61 s gammaloop-nextest-core>
  578. 80.61 s gammaloop-nextest-core> test result: FAILED. 0 passed; 1 failed; 0 ignored; 0 measured; 508 filtered out; finished in 0.61s
  579. 80.61 s gammaloop-nextest-core>
  580. 80.61 s gammaloop-nextest-core> stderr ---
  581. 80.61 s gammaloop-nextest-core> [21:00:41.499] @gammalooprs::graph::attribute_warnings WARNING : Unknown node attribute 'color_num' on graph 'G', node 'A'; did you mean 'num'?
  582. 80.61 s gammaloop-nextest-core> at crates/gammalooprs/src/graph/attribute_warnings.rs:198
  583. 80.61 s gammaloop-nextest-core> The application panicked (crashed).
  584. 80.61 s gammaloop-nextest-core> Message: snapshot assertion for 'parse_lmbsetting_crossection' failed in line 252
  585. 80.61 s gammaloop-nextest-core> Location: /nix/store/xdy1vvhll2bijdplvl9fcc2b9plkxhaa-vendor-cargo-deps/c19b7c6f923b580ac259164a89f2577984ad5ab09ee9d583b888f934adbbe8d0/insta-1.47.2/src/runtime.rs:719
  586. 80.61 s gammaloop-nextest-core>
  587. 80.61 s gammaloop-nextest-core> ━━━━━━━━━━━━━━━━━━━━━━━━━━━━━━━━━━ BACKTRACE ━━━━━━━━━━━━━━━━━━━━━━━━━━━━━━━━━━━
  588. 80.61 s gammaloop-nextest-core> 1: <color_eyre[b0c9e66060e883b2]::config::PanicHook>::panic_report<unknown>
  589. 80.61 s gammaloop-nextest-core> at <unknown source file>:<unknown line>
  590. 80.61 s gammaloop-nextest-core> 2: <color_eyre[b0c9e66060e883b2]::config::PanicHook>::into_panic_hook::{closure#0}<unknown>
  591. 80.61 s gammaloop-nextest-core> at <unknown source file>:<unknown line>
  592. 80.61 s gammaloop-nextest-core> 3: std[bcb96dfbba0ab899]::panicking::panic_with_hook<unknown>
  593. 80.61 s gammaloop-nextest-core> at <unknown source file>:<unknown line>
  594. 80.61 s gammaloop-nextest-core> 4: std[bcb96dfbba0ab899]::panicking::panic_handler::{closure#0}<unknown>
  595. 80.61 s gammaloop-nextest-core> at <unknown source file>:<unknown line>
  596. 80.61 s gammaloop-nextest-core> 5: std[bcb96dfbba0ab899]::sys::backtrace::__rust_end_short_backtrace::<std[bcb96dfbba0ab899]::panicking::panic_handler::{closure#0}, !><unknown>
  597. 80.61 s gammaloop-nextest-core> at <unknown source file>:<unknown line>
  598. 80.61 s gammaloop-nextest-core> 6: __rustc[6c289b9f9c454d21]::rust_begin_unwind<unknown>
  599. 80.61 s gammaloop-nextest-core> at <unknown source file>:<unknown line>
  600. 80.61 s gammaloop-nextest-core> 7: core[940e698046960fd5]::panicking::panic_fmt<unknown>
  601. 80.61 s gammaloop-nextest-core> at <unknown source file>:<unknown line>
  602. 80.61 s gammaloop-nextest-core> 8: insta[307a548ac79ef4d9]::runtime::assert_snapshot<unknown>
  603. 80.61 s gammaloop-nextest-core> at <unknown source file>:<unknown line>
  604. 80.61 s gammaloop-nextest-core> 9: gammalooprs[5490727360442cce]::graph::parse::tests::parse_lmbsetting_crossection<unknown>
  605. 80.61 s gammaloop-nextest-core> at <unknown source file>:<unknown line>
  606. 80.61 s gammaloop-nextest-core> 10: <gammalooprs[5490727360442cce]::graph::parse::tests::parse_lmbsetting_crossection::{closure#0} as core[940e698046960fd5]::ops::function::FnOnce<()>>::call_once<unknown>
  607. 80.61 s gammaloop-nextest-core> at <unknown source file>:<unknown line>
  608. 80.61 s gammaloop-nextest-core> 11: test[75d6903177b1d7e9]::__rust_begin_short_backtrace::<core[940e698046960fd5]::result::Result<(), alloc[2ea6bcb46fca0c42]::string::String>, fn() -> core[940e698046960fd5]::result::Result<(), alloc[2ea6bcb46fca0c42]::string::String>><unknown>
  609. 80.61 s gammaloop-nextest-core> at <unknown source file>:<unknown line>
  610. 80.61 s gammaloop-nextest-core> 12: test[75d6903177b1d7e9]::run_test::{closure#0}<unknown>
  611. 80.61 s gammaloop-nextest-core> at <unknown source file>:<unknown line>
  612. 80.61 s gammaloop-nextest-core> 13: std[bcb96dfbba0ab899]::sys::backtrace::__rust_begin_short_backtrace::<test[75d6903177b1d7e9]::run_test::{closure#1}, ()><unknown>
  613. 80.61 s gammaloop-nextest-core> at <unknown source file>:<unknown line>
  614. 80.61 s gammaloop-nextest-core> 14: <std[bcb96dfbba0ab899]::thread::lifecycle::spawn_unchecked<test[75d6903177b1d7e9]::run_test::{closure#1}, ()>::{closure#1} as core[940e698046960fd5]::ops::function::FnOnce<()>>::call_once::{shim:vtable#0}<unknown>
  615. 80.61 s gammaloop-nextest-core> at <unknown source file>:<unknown line>
  616. 80.61 s gammaloop-nextest-core> 15: <std[bcb96dfbba0ab899]::sys::thread::unix::Thread>::new::thread_start<unknown>
  617. 80.61 s gammaloop-nextest-core> at <unknown source file>:<unknown line>
  618. 80.61 s gammaloop-nextest-core> 16: start_thread<unknown>
  619. 80.61 s gammaloop-nextest-core> at <unknown source file>:<unknown line>
  620. 80.61 s gammaloop-nextest-core> 17: __clone3<unknown>
  621. 80.61 s gammaloop-nextest-core> at <unknown source file>:<unknown line>
  622. 80.61 s gammaloop-nextest-core>
  623. 80.61 s gammaloop-nextest-core> Run with COLORBT_SHOW_HIDDEN=1 environment variable to disable frame filtering.
  624. 80.61 s gammaloop-nextest-core> Run with RUST_BACKTRACE=full to include source snippets.
  625. 80.61 s gammaloop-nextest-core>
  626. 80.61 s gammaloop-nextest-core> FAIL [ 0.505s] (410/456) gammalooprs uv::export::tests::computed_node_full_numerator_is_a_spenso_aware_typst_fragment
  627. 80.61 s gammaloop-nextest-core> stdout ---
  628. 80.61 s gammaloop-nextest-core>
  629. 80.61 s gammaloop-nextest-core> running 1 test
  630. 80.61 s gammaloop-nextest-core> test uv::export::tests::computed_node_full_numerator_is_a_spenso_aware_typst_fragment ... FAILED
  631. 80.61 s gammaloop-nextest-core>
  632. 80.61 s gammaloop-nextest-core> failures:
  633. 80.61 s gammaloop-nextest-core>
  634. 80.61 s gammaloop-nextest-core> failures:
  635. 80.61 s gammaloop-nextest-core> uv::export::tests::computed_node_full_numerator_is_a_spenso_aware_typst_fragment
  636. 80.61 s gammaloop-nextest-core>
  637. 80.61 s gammaloop-nextest-core> test result: FAILED. 0 passed; 1 failed; 0 ignored; 0 measured; 508 filtered out; finished in 0.49s
  638. 80.61 s gammaloop-nextest-core>
  639. 80.61 s gammaloop-nextest-core> stderr ---
  640. 80.61 s gammaloop-nextest-core> The application panicked (crashed).
  641. 80.61 s gammaloop-nextest-core> Message: assertion failed: exported.dot.contains(r#"full_num = "op(\"Tr\")(1)";"#)
  642. 80.61 s gammaloop-nextest-core> Location: crates/gammalooprs/src/uv/export.rs:483
  643. 80.61 s gammaloop-nextest-core>
  644. 80.61 s gammaloop-nextest-core> ━━━━━━━━━━━━━━━━━━━━━━━━━━━━━━━━━━ BACKTRACE ━━━━━━━━━━━━━━━━━━━━━━━━━━━━━━━━━━━
  645. 80.61 s gammaloop-nextest-core> 1: <color_eyre[b0c9e66060e883b2]::config::PanicHook>::panic_report<unknown>
  646. 80.61 s gammaloop-nextest-core> at <unknown source file>:<unknown line>
  647. 80.61 s gammaloop-nextest-core> 2: <color_eyre[b0c9e66060e883b2]::config::PanicHook>::into_panic_hook::{closure#0}<unknown>
  648. 80.61 s gammaloop-nextest-core> at <unknown source file>:<unknown line>
  649. 80.61 s gammaloop-nextest-core> 3: std[bcb96dfbba0ab899]::panicking::panic_with_hook<unknown>
  650. 80.61 s gammaloop-nextest-core> at <unknown source file>:<unknown line>
  651. 80.61 s gammaloop-nextest-core> 4: std[bcb96dfbba0ab899]::panicking::panic_handler::{closure#0}<unknown>
  652. 80.61 s gammaloop-nextest-core> at <unknown source file>:<unknown line>
  653. 80.61 s gammaloop-nextest-core> 5: std[bcb96dfbba0ab899]::sys::backtrace::__rust_end_short_backtrace::<std[bcb96dfbba0ab899]::panicking::panic_handler::{closure#0}, !><unknown>
  654. 80.61 s gammaloop-nextest-core> at <unknown source file>:<unknown line>
  655. 80.61 s gammaloop-nextest-core> 6: __rustc[6c289b9f9c454d21]::rust_begin_unwind<unknown>
  656. 80.61 s gammaloop-nextest-core> at <unknown source file>:<unknown line>
  657. 80.61 s gammaloop-nextest-core> 7: core[940e698046960fd5]::panicking::panic_fmt<unknown>
  658. 80.61 s gammaloop-nextest-core> at <unknown source file>:<unknown line>
  659. 80.61 s gammaloop-nextest-core> 8: core[940e698046960fd5]::panicking::panic<unknown>
  660. 80.61 s gammaloop-nextest-core> at <unknown source file>:<unknown line>
  661. 80.61 s gammaloop-nextest-core> 9: gammalooprs[5490727360442cce]::uv::export::tests::computed_node_full_numerator_is_a_spenso_aware_typst_fragment<unknown>
  662. 80.61 s gammaloop-nextest-core> at <unknown source file>:<unknown line>
  663. 80.61 s gammaloop-nextest-core> 10: <gammalooprs[5490727360442cce]::uv::export::tests::computed_node_full_numerator_is_a_spenso_aware_typst_fragment::{closure#0} as core[940e698046960fd5]::ops::function::FnOnce<()>>::call_once<unknown>
  664. 80.61 s gammaloop-nextest-core> at <unknown source file>:<unknown line>
  665. 80.61 s gammaloop-nextest-core> 11: test[75d6903177b1d7e9]::__rust_begin_short_backtrace::<core[940e698046960fd5]::result::Result<(), alloc[2ea6bcb46fca0c42]::string::String>, fn() -> core[940e698046960fd5]::result::Result<(), alloc[2ea6bcb46fca0c42]::string::String>><unknown>
  666. 80.61 s gammaloop-nextest-core> at <unknown source file>:<unknown line>
  667. 80.61 s gammaloop-nextest-core> 12: test[75d6903177b1d7e9]::run_test::{closure#0}<unknown>
  668. 80.61 s gammaloop-nextest-core> at <unknown source file>:<unknown line>
  669. 80.61 s gammaloop-nextest-core> 13: std[bcb96dfbba0ab899]::sys::backtrace::__rust_begin_short_backtrace::<test[75d6903177b1d7e9]::run_test::{closure#1}, ()><unknown>
  670. 80.61 s gammaloop-nextest-core> at <unknown source file>:<unknown line>
  671. 80.61 s gammaloop-nextest-core> 14: <std[bcb96dfbba0ab899]::thread::lifecycle::spawn_unchecked<test[75d6903177b1d7e9]::run_test::{closure#1}, ()>::{closure#1} as core[940e698046960fd5]::ops::function::FnOnce<()>>::call_once::{shim:vtable#0}<unknown>
  672. 80.61 s gammaloop-nextest-core> at <unknown source file>:<unknown line>
  673. 80.61 s gammaloop-nextest-core> 15: <std[bcb96dfbba0ab899]::sys::thread::unix::Thread>::new::thread_start<unknown>
  674. 80.61 s gammaloop-nextest-core> at <unknown source file>:<unknown line>
  675. 80.61 s gammaloop-nextest-core> 16: start_thread<unknown>
  676. 80.61 s gammaloop-nextest-core> at <unknown source file>:<unknown line>
  677. 80.61 s gammaloop-nextest-core> 17: __clone3<unknown>
  678. 80.61 s gammaloop-nextest-core> at <unknown source file>:<unknown line>
  679. 80.61 s gammaloop-nextest-core>
  680. 80.61 s gammaloop-nextest-core> Run with COLORBT_SHOW_HIDDEN=1 environment variable to disable frame filtering.
  681. 80.61 s gammaloop-nextest-core> Run with RUST_BACKTRACE=full to include source snippets.
  682. 80.61 s gammaloop-nextest-core>
  683. 80.64 s gammaloop-nextest-core> error: test run failed
  684. 80.67 s gammaloop-nextest-core>
  685. 80.67 s gammaloop-nextest-core> ========== nextest test summary ==========
  686. 80.67 s gammaloop-nextest-core> report: target/nextest/ci_gammaloop/junit.xml
  687. 80.67 s gammaloop-nextest-core> tests: 456, failures: 2, errors: 0
  688. 80.67 s gammaloop-nextest-core>
  689. 80.67 s gammaloop-nextest-core> 1. gammalooprs::graph::parse::tests::parse_lmbsetting_crossection
  690. 80.67 s gammaloop-nextest-core> failure: test failure with exit code 101
  691. 80.67 s gammaloop-nextest-core> system-out
  692. 80.67 s gammaloop-nextest-core> running 1 test
  693. 80.67 s gammaloop-nextest-core> ━━━━━━━━━━━━━━━━━━━━━━━━━━━━━━━ Snapshot Summary ━━━━━━━━━━━━━━━━━━━━━━━━━━━━━━━
  694. 80.67 s gammaloop-nextest-core> Snapshot: parse_lmbsetting_crossection
  695. 80.67 s gammaloop-nextest-core> Source: crates/gammalooprs/src/graph/parse/tests.rs:252
  696. 80.67 s gammaloop-nextest-core> ────────────────────────────────────────────────────────────────────────────────
  697. 80.67 s gammaloop-nextest-core> Expression: g.debug_dot()
  698. 80.67 s gammaloop-nextest-core> ────────────────────────────────────────────────────────────────────────────────
  699. 80.67 s gammaloop-nextest-core> -old snapshot
  700. 80.67 s gammaloop-nextest-core> +new results
  701. 80.67 s gammaloop-nextest-core> ────────────┬───────────────────────────────────────────────────────────────────
  702. 80.67 s gammaloop-nextest-core> 1 │-digraph G{
  703. 80.67 s gammaloop-nextest-core> 1 │+digraph G {
  704. 80.67 s gammaloop-nextest-core> 2 2 │ num = "1/2";
  705. 80.67 s gammaloop-nextest-core> 3 3 │ overall_factor = "2*x";
  706. 80.67 s gammaloop-nextest-core> 4 4 │ overall_factor_evaluated = "2*x";
  707. 80.67 s gammaloop-nextest-core> 5 5 │ projector = "spenso::t";
  708. 80.67 s gammaloop-nextest-core> ────────────┴───────────────────────────────────────────────────────────────────
  709. 80.67 s gammaloop-nextest-core> To update snapshots run `cargo insta review`
  710. 80.67 s gammaloop-nextest-core> Stopped on the first failure. Run `cargo insta test` to run all snapshots.
  711. 80.67 s gammaloop-nextest-core> test graph::parse::tests::parse_lmbsetting_crossection ... FAILED
  712. 80.67 s gammaloop-nextest-core>
  713. 80.67 s gammaloop-nextest-core> failures:
  714. 80.67 s gammaloop-nextest-core>
  715. 80.67 s gammaloop-nextest-core> failures:
  716. 80.67 s gammaloop-nextest-core> graph::parse::tests::parse_lmbsetting_crossection
  717. 80.67 s gammaloop-nextest-core>
  718. 80.67 s gammaloop-nextest-core> test result: FAILED. 0 passed; 1 failed; 0 ignored; 0 measured; 508 filtered out; finished in 0.61s
  719. 80.67 s gammaloop-nextest-core> system-err
  720. 80.67 s gammaloop-nextest-core> [21:00:41.499] @gammalooprs::graph::attribute_warnings WARNING : Unknown node attribute 'color_num' on graph 'G', node 'A'; did you mean 'num'?
  721. 80.67 s gammaloop-nextest-core> at crates/gammalooprs/src/graph/attribute_warnings.rs:198
  722. 80.67 s gammaloop-nextest-core> The application panicked (crashed).
  723. 80.67 s gammaloop-nextest-core> Message: snapshot assertion for 'parse_lmbsetting_crossection' failed in line 252
  724. 80.67 s gammaloop-nextest-core> Location: /nix/store/xdy1vvhll2bijdplvl9fcc2b9plkxhaa-vendor-cargo-deps/c19b7c6f923b580ac259164a89f2577984ad5ab09ee9d583b888f934adbbe8d0/insta-1.47.2/src/runtime.rs:719
  725. 80.67 s gammaloop-nextest-core>
  726. 80.67 s gammaloop-nextest-core> ━━━━━━━━━━━━━━━━━━━━━━━━━━━━━━━━━━ BACKTRACE ━━━━━━━━━━━━━━━━━━━━━━━━━━━━━━━━━━━
  727. 80.67 s gammaloop-nextest-core> 1: <color_eyre[b0c9e66060e883b2]::config::PanicHook>::panic_report<unknown>
  728. 80.67 s gammaloop-nextest-core> at <unknown source file>:<unknown line>
  729. 80.67 s gammaloop-nextest-core> 2: <color_eyre[b0c9e66060e883b2]::config::PanicHook>::into_panic_hook::{closure#0}<unknown>
  730. 80.67 s gammaloop-nextest-core> at <unknown source file>:<unknown line>
  731. 80.67 s gammaloop-nextest-core> 3: std[bcb96dfbba0ab899]::panicking::panic_with_hook<unknown>
  732. 80.67 s gammaloop-nextest-core> at <unknown source file>:<unknown line>
  733. 80.67 s gammaloop-nextest-core> 4: std[bcb96dfbba0ab899]::panicking::panic_handler::{closure#0}<unknown>
  734. 80.67 s gammaloop-nextest-core> at <unknown source file>:<unknown line>
  735. 80.67 s gammaloop-nextest-core> 5: std[bcb96dfbba0ab899]::sys::backtrace::__rust_end_short_backtrace::<std[bcb96dfbba0ab899]::panicking::panic_handler::{closure#0}, !><unknown>
  736. 80.67 s gammaloop-nextest-core> at <unknown source file>:<unknown line>
  737. 80.67 s gammaloop-nextest-core> 6: __rustc[6c289b9f9c454d21]::rust_begin_unwind<unknown>
  738. 80.67 s gammaloop-nextest-core> at <unknown source file>:<unknown line>
  739. 80.67 s gammaloop-nextest-core> 7: core[940e698046960fd5]::panicking::panic_fmt<unknown>
  740. 80.67 s gammaloop-nextest-core> at <unknown source file>:<unknown line>
  741. 80.67 s gammaloop-nextest-core> 8: insta[307a548ac79ef4d9]::runtime::assert_snapshot<unknown>
  742. 80.67 s gammaloop-nextest-core> at <unknown source file>:<unknown line>
  743. 80.67 s gammaloop-nextest-core> 9: gammalooprs[5490727360442cce]::graph::parse::tests::parse_lmbsetting_crossection<unknown>
  744. 80.67 s gammaloop-nextest-core> at <unknown source file>:<unknown line>
  745. 80.67 s gammaloop-nextest-core> 10: <gammalooprs[5490727360442cce]::graph::parse::tests::parse_lmbsetting_crossection::{closure#0} as core[940e698046960fd5]::ops::function::FnOnce<()>>::call_once<unknown>
  746. 80.67 s gammaloop-nextest-core> at <unknown source file>:<unknown line>
  747. 80.67 s gammaloop-nextest-core> 11: test[75d6903177b1d7e9]::__rust_begin_short_backtrace::<core[940e698046960fd5]::result::Result<(), alloc[2ea6bcb46fca0c42]::string::String>, fn() -> core[940e698046960fd5]::result::Result<(), alloc[2ea6bcb46fca0c42]::string::String>><unknown>
  748. 80.67 s gammaloop-nextest-core> at <unknown source file>:<unknown line>
  749. 80.67 s gammaloop-nextest-core> 12: test[75d6903177b1d7e9]::run_test::{closure#0}<unknown>
  750. 80.67 s gammaloop-nextest-core> at <unknown source file>:<unknown line>
  751. 80.67 s gammaloop-nextest-core> 13: std[bcb96dfbba0ab899]::sys::backtrace::__rust_begin_short_backtrace::<test[75d6903177b1d7e9]::run_test::{closure#1}, ()><unknown>
  752. 80.67 s gammaloop-nextest-core> at <unknown source file>:<unknown line>
  753. 80.67 s gammaloop-nextest-core> 14: <std[bcb96dfbba0ab899]::thread::lifecycle::spawn_unchecked<test[75d6903177b1d7e9]::run_test::{closure#1}, ()>::{closure#1} as core[940e698046960fd5]::ops::function::FnOnce<()>>::call_once::{shim:vtable#0}<unknown>
  754. 80.67 s gammaloop-nextest-core> at <unknown source file>:<unknown line>
  755. 80.67 s gammaloop-nextest-core> 15: <std[bcb96dfbba0ab899]::sys::thread::unix::Thread>::new::thread_start<unknown>
  756. 80.67 s gammaloop-nextest-core> at <unknown source file>:<unknown line>
  757. 80.67 s gammaloop-nextest-core> 16: start_thread<unknown>
  758. 80.67 s gammaloop-nextest-core> at <unknown source file>:<unknown line>
  759. 80.67 s gammaloop-nextest-core> 17: __clone3<unknown>
  760. 80.67 s gammaloop-nextest-core> at <unknown source file>:<unknown line>
  761. 80.67 s gammaloop-nextest-core>
  762. 80.67 s gammaloop-nextest-core> Run with COLORBT_SHOW_HIDDEN=1 environment variable to disable frame filtering.
  763. 80.67 s gammaloop-nextest-core> Run with RUST_BACKTRACE=full to include source snippets.
  764. 80.67 s gammaloop-nextest-core>
  765. 80.67 s gammaloop-nextest-core> 2. gammalooprs::uv::export::tests::computed_node_full_numerator_is_a_spenso_aware_typst_fragment
  766. 80.67 s gammaloop-nextest-core> failure: test failure with exit code 101
  767. 80.67 s gammaloop-nextest-core> system-out
  768. 80.67 s gammaloop-nextest-core> running 1 test
  769. 80.67 s gammaloop-nextest-core> test uv::export::tests::computed_node_full_numerator_is_a_spenso_aware_typst_fragment ... FAILED
  770. 80.67 s gammaloop-nextest-core>
  771. 80.67 s gammaloop-nextest-core> failures:
  772. 80.67 s gammaloop-nextest-core>
  773. 80.67 s gammaloop-nextest-core> failures:
  774. 80.67 s gammaloop-nextest-core> uv::export::tests::computed_node_full_numerator_is_a_spenso_aware_typst_fragment
  775. 80.67 s gammaloop-nextest-core>
  776. 80.67 s gammaloop-nextest-core> test result: FAILED. 0 passed; 1 failed; 0 ignored; 0 measured; 508 filtered out; finished in 0.49s
  777. 80.67 s gammaloop-nextest-core> system-err
  778. 80.67 s gammaloop-nextest-core> The application panicked (crashed).
  779. 80.67 s gammaloop-nextest-core> Message: assertion failed: exported.dot.contains(r#"full_num = "op(\"Tr\")(1)";"#)
  780. 80.68 s gammaloop-nextest-core> Location: crates/gammalooprs/src/uv/export.rs:483
  781. 80.68 s gammaloop-nextest-core>
  782. 80.68 s gammaloop-nextest-core> ━━━━━━━━━━━━━━━━━━━━━━━━━━━━━━━━━━ BACKTRACE ━━━━━━━━━━━━━━━━━━━━━━━━━━━━━━━━━━━
  783. 80.68 s gammaloop-nextest-core> 1: <color_eyre[b0c9e66060e883b2]::config::PanicHook>::panic_report<unknown>
  784. 80.68 s gammaloop-nextest-core> at <unknown source file>:<unknown line>
  785. 80.68 s gammaloop-nextest-core> 2: <color_eyre[b0c9e66060e883b2]::config::PanicHook>::into_panic_hook::{closure#0}<unknown>
  786. 80.68 s gammaloop-nextest-core> at <unknown source file>:<unknown line>
  787. 80.68 s gammaloop-nextest-core> 3: std[bcb96dfbba0ab899]::panicking::panic_with_hook<unknown>
  788. 80.68 s gammaloop-nextest-core> at <unknown source file>:<unknown line>
  789. 80.68 s gammaloop-nextest-core> 4: std[bcb96dfbba0ab899]::panicking::panic_handler::{closure#0}<unknown>
  790. 80.68 s gammaloop-nextest-core> at <unknown source file>:<unknown line>
  791. 80.68 s gammaloop-nextest-core> 5: std[bcb96dfbba0ab899]::sys::backtrace::__rust_end_short_backtrace::<std[bcb96dfbba0ab899]::panicking::panic_handler::{closure#0}, !><unknown>
  792. 80.68 s gammaloop-nextest-core> at <unknown source file>:<unknown line>
  793. 80.68 s gammaloop-nextest-core> 6: __rustc[6c289b9f9c454d21]::rust_begin_unwind<unknown>
  794. 80.68 s gammaloop-nextest-core> at <unknown source file>:<unknown line>
  795. 80.68 s gammaloop-nextest-core> 7: core[940e698046960fd5]::panicking::panic_fmt<unknown>
  796. 80.68 s gammaloop-nextest-core> at <unknown source file>:<unknown line>
  797. 80.68 s gammaloop-nextest-core> 8: core[940e698046960fd5]::panicking::panic<unknown>
  798. 80.68 s gammaloop-nextest-core> at <unknown source file>:<unknown line>
  799. 80.68 s gammaloop-nextest-core> 9: gammalooprs[5490727360442cce]::uv::export::tests::computed_node_full_numerator_is_a_spenso_aware_typst_fragment<unknown>
  800. 80.68 s gammaloop-nextest-core> at <unknown source file>:<unknown line>
  801. 80.68 s gammaloop-nextest-core> 10: <gammalooprs[5490727360442cce]::uv::export::tests::computed_node_full_numerator_is_a_spenso_aware_typst_fragment::{closure#0} as core[940e698046960fd5]::ops::function::FnOnce<()>>::call_once<unknown>
  802. 80.68 s gammaloop-nextest-core> at <unknown source file>:<unknown line>
  803. 80.68 s gammaloop-nextest-core> 11: test[75d6903177b1d7e9]::__rust_begin_short_backtrace::<core[940e698046960fd5]::result::Result<(), alloc[2ea6bcb46fca0c42]::string::String>, fn() -> core[940e698046960fd5]::result::Result<(), alloc[2ea6bcb46fca0c42]::string::String>><unknown>
  804. 80.68 s gammaloop-nextest-core> at <unknown source file>:<unknown line>
  805. 80.68 s gammaloop-nextest-core> 12: test[75d6903177b1d7e9]::run_test::{closure#0}<unknown>
  806. 80.68 s gammaloop-nextest-core> at <unknown source file>:<unknown line>
  807. 80.68 s gammaloop-nextest-core> 13: std[bcb96dfbba0ab899]::sys::backtrace::__rust_begin_short_backtrace::<test[75d6903177b1d7e9]::run_test::{closure#1}, ()><unknown>
  808. 80.68 s gammaloop-nextest-core> at <unknown source file>:<unknown line>
  809. 80.68 s gammaloop-nextest-core> 14: <std[bcb96dfbba0ab899]::thread::lifecycle::spawn_unchecked<test[75d6903177b1d7e9]::run_test::{closure#1}, ()>::{closure#1} as core[940e698046960fd5]::ops::function::FnOnce<()>>::call_once::{shim:vtable#0}<unknown>
  810. 80.68 s gammaloop-nextest-core> at <unknown source file>:<unknown line>
  811. 80.68 s gammaloop-nextest-core> 15: <std[bcb96dfbba0ab899]::sys::thread::unix::Thread>::new::thread_start<unknown>
  812. 80.68 s gammaloop-nextest-core> at <unknown source file>:<unknown line>
  813. 80.68 s gammaloop-nextest-core> 16: start_thread<unknown>
  814. 80.68 s gammaloop-nextest-core> at <unknown source file>:<unknown line>
  815. 80.68 s gammaloop-nextest-core> 17: __clone3<unknown>
  816. 80.68 s gammaloop-nextest-core> at <unknown source file>:<unknown line>
  817. 80.68 s gammaloop-nextest-core>
  818. 80.68 s gammaloop-nextest-core> Run with COLORBT_SHOW_HIDDEN=1 environment variable to disable frame filtering.
  819. 80.68 s gammaloop-nextest-core> Run with RUST_BACKTRACE=full to include source snippets.
  820. 80.68 s gammaloop-nextest-core> =========================================
  821. 80.73 s error: Cannot build '/nix/store/07lma8g6p1n7jxf8azmxf90ca6pqjydj-gammaloop-nextest-core.drv'.
  822. 80.73 s Reason: builder failed with exit code 100.
  823. 80.73 s Output paths:
  824. 80.73 s /nix/store/cb0qr129ypswd8fgpp9k932nrjfvk3s0-gammaloop-nextest-core
  825. 80.73 s Last 612 log lines:
  826. 80.73 s > Extracting 3 binaries (including 1 non-test binary), 1 build script output directory, and 2 linked paths to /build/nextest-archive-FDUGMO
  827. 80.73 s > Extracted 18 files to /build/nextest-archive-FDUGMO in 0.77s
  828. 80.73 s > ------------
  829. 80.73 s > Nextest run ID 19e8fa39-75e9-46f6-ac20-bbc328807c55 with nextest profile: ci_gammaloop
  830. 80.73 s > Starting 339 tests across 2 binaries
  831. 80.73 s > FAIL [ 0.047s] (234/339) gammaloop-api repl::tests::completion_shows_type_hint_for_non_boolean_settings_leaf
  832. 80.73 s > stdout ---
  833. 80.73 s >
  834. 80.73 s > running 1 test
  835. 80.73 s > test repl::tests::completion_shows_type_hint_for_non_boolean_settings_leaf ... FAILED
  836. 80.73 s >
  837. 80.73 s > failures:
  838. 80.73 s >
  839. 80.73 s > failures:
  840. 80.73 s > repl::tests::completion_shows_type_hint_for_non_boolean_settings_leaf
  841. 80.73 s >
  842. 80.73 s > test result: FAILED. 0 passed; 1 failed; 0 ignored; 0 measured; 338 filtered out; finished in 0.03s
  843. 80.73 s >
  844. 80.73 s > stderr ---
  845. 80.73 s >
  846. 80.73 s > thread 'repl::tests::completion_shows_type_hint_for_non_boolean_settings_leaf' (724) panicked at crates/gammaloop-api/src/repl.rs:5778:9:
  847. 80.73 s > [Suggestion { value: "", description: Some("Number of samples in the first Monte Carlo iteration."), style: None, extra: None, span: Span { start: 42, end: 42 }, append_whitespace: false }]
  848. 80.73 s > stack backtrace:
  849. 80.73 s > 0: __rustc::rust_begin_unwind
  850. 80.73 s > 1: core::panicking::panic_fmt
  851. 80.73 s > 2: gammaloop_api::repl::tests::completion_shows_type_hint_for_non_boolean_settings_leaf
  852. 80.73 s > 3: <gammaloop_api::repl::tests::completion_shows_type_hint_for_non_boolean_settings_leaf::{closure#0} as core::ops::function::FnOnce<()>>::call_once
  853. 80.73 s > note: Some details are omitted, run with `RUST_BACKTRACE=full` for a verbose backtrace.
  854. 80.73 s >
  855. 80.73 s > FAIL [ 0.135s] (285/339) gammaloop-api templates::tests::extract_templates_uses_canonical_package_layout
  856. 80.73 s > stdout ---
  857. 80.73 s >
  858. 80.73 s > running 1 test
  859. 80.73 s > test templates::tests::extract_templates_uses_canonical_package_layout ... FAILED
  860. 80.73 s >
  861. 80.73 s > failures:
  862. 80.73 s >
  863. 80.73 s > failures:
  864. 80.73 s > templates::tests::extract_templates_uses_canonical_package_layout
  865. 80.73 s >
  866. 80.73 s > test result: FAILED. 0 passed; 1 failed; 0 ignored; 0 measured; 338 filtered out; finished in 0.10s
  867. 80.73 s >
  868. 80.73 s > stderr ---
  869. 80.73 s >
  870. 80.73 s > thread 'templates::tests::extract_templates_uses_canonical_package_layout' (852) panicked at crates/gammaloop-api/src/templates.rs:99:9:
  871. 80.73 s > assertion failed: figure.contains("amplitude-mode")
  872. 80.73 s > stack backtrace:
  873. 80.73 s > 0: __rustc::rust_begin_unwind
  874. 80.73 s > 1: core::panicking::panic_fmt
  875. 80.73 s > 2: core::panicking::panic
  876. 80.73 s > 3: gammaloop_api::templates::tests::extract_templates_uses_canonical_package_layout
  877. 80.73 s > 4: <gammaloop_api::templates::tests::extract_templates_uses_canonical_package_layout::{closure#0} as core::ops::function::FnOnce<()>>::call_once
  878. 80.73 s > note: Some details are omitted, run with `RUST_BACKTRACE=full` for a verbose backtrace.
  879. 80.73 s >
  880. 80.73 s > ------------
  881. 80.73 s > Summary [ 2.047s] 339 tests run: 337 passed, 2 failed, 0 skipped
  882. 80.73 s > FAIL [ 0.047s] (234/339) gammaloop-api repl::tests::completion_shows_type_hint_for_non_boolean_settings_leaf
  883. 80.73 s > stdout ---
  884. 80.73 s >
  885. 80.73 s > running 1 test
  886. 80.73 s > test repl::tests::completion_shows_type_hint_for_non_boolean_settings_leaf ... FAILED
  887. 80.73 s >
  888. 80.73 s > failures:
  889. 80.73 s >
  890. 80.73 s > failures:
  891. 80.73 s > repl::tests::completion_shows_type_hint_for_non_boolean_settings_leaf
  892. 80.73 s >
  893. 80.73 s > test result: FAILED. 0 passed; 1 failed; 0 ignored; 0 measured; 338 filtered out; finished in 0.03s
  894. 80.73 s >
  895. 80.73 s > stderr ---
  896. 80.73 s >
  897. 80.73 s > thread 'repl::tests::completion_shows_type_hint_for_non_boolean_settings_leaf' (724) panicked at crates/gammaloop-api/src/repl.rs:5778:9:
  898. 80.73 s > [Suggestion { value: "", description: Some("Number of samples in the first Monte Carlo iteration."), style: None, extra: None, span: Span { start: 42, end: 42 }, append_whitespace: false }]
  899. 80.73 s > stack backtrace:
  900. 80.73 s > 0: __rustc::rust_begin_unwind
  901. 80.73 s > 1: core::panicking::panic_fmt
  902. 80.73 s > 2: gammaloop_api::repl::tests::completion_shows_type_hint_for_non_boolean_settings_leaf
  903. 80.73 s > 3: <gammaloop_api::repl::tests::completion_shows_type_hint_for_non_boolean_settings_leaf::{closure#0} as core::ops::function::FnOnce<()>>::call_once
  904. 80.73 s > note: Some details are omitted, run with `RUST_BACKTRACE=full` for a verbose backtrace.
  905. 80.73 s >
  906. 80.73 s > FAIL [ 0.135s] (285/339) gammaloop-api templates::tests::extract_templates_uses_canonical_package_layout
  907. 80.73 s > stdout ---
  908. 80.73 s >
  909. 80.73 s > running 1 test
  910. 80.73 s > test templates::tests::extract_templates_uses_canonical_package_layout ... FAILED
  911. 80.73 s >
  912. 80.73 s > failures:
  913. 80.73 s >
  914. 80.73 s > failures:
  915. 80.73 s > templates::tests::extract_templates_uses_canonical_package_layout
  916. 80.73 s >
  917. 80.73 s > test result: FAILED. 0 passed; 1 failed; 0 ignored; 0 measured; 338 filtered out; finished in 0.10s
  918. 80.73 s >
  919. 80.73 s > stderr ---
  920. 80.73 s >
  921. 80.73 s > thread 'templates::tests::extract_templates_uses_canonical_package_layout' (852) panicked at crates/gammaloop-api/src/templates.rs:99:9:
  922. 80.73 s > assertion failed: figure.contains("amplitude-mode")
  923. 80.73 s > stack backtrace:
  924. 80.73 s > 0: __rustc::rust_begin_unwind
  925. 80.73 s > 1: core::panicking::panic_fmt
  926. 80.73 s > 2: core::panicking::panic
  927. 80.73 s > 3: gammaloop_api::templates::tests::extract_templates_uses_canonical_package_layout
  928. 80.73 s > 4: <gammaloop_api::templates::tests::extract_templates_uses_canonical_package_layout::{closure#0} as core::ops::function::FnOnce<()>>::call_once
  929. 80.73 s > note: Some details are omitted, run with `RUST_BACKTRACE=full` for a verbose backtrace.
  930. 80.73 s >
  931. 80.73 s > error: test run failed
  932. 80.73 s >
  933. 80.73 s > ========== nextest test summary ==========
  934. 80.73 s > report: target/nextest/ci_gammaloop/junit.xml
  935. 80.73 s > tests: 339, failures: 2, errors: 0
  936. 80.73 s >
  937. 80.73 s > 1. gammaloop-api::repl::tests::completion_shows_type_hint_for_non_boolean_settings_leaf
  938. 80.73 s > failure: test failure with exit code 101
  939. 80.73 s > thread 'repl::tests::completion_shows_type_hint_for_non_boolean_settings_leaf' (724) panicked at crates/gammaloop-api/src/repl.rs:5778:9:
  940. 80.73 s > [Suggestion { value: "", description: Some("Number of samples in the first Monte Carlo iteration."), style: None, extra: None, span: Span { start: 42, end: 42 }, append_whitespace: false }]
  941. 80.73 s > stack backtrace:
  942. 80.73 s > 0: __rustc::rust_begin_unwind
  943. 80.73 s > 1: core::panicking::panic_fmt
  944. 80.73 s > 2: gammaloop_api::repl::tests::completion_shows_type_hint_for_non_boolean_settings_leaf
  945. 80.73 s > 3: <gammaloop_api::repl::tests::completion_shows_type_hint_for_non_boolean_settings_leaf::{closure#0} as core::ops::function::FnOnce<()>>::call_once
  946. 80.73 s > note: Some details are omitted, run with `RUST_BACKTRACE=full` for a verbose backtrace.
  947. 80.73 s > system-out
  948. 80.73 s > running 1 test
  949. 80.73 s > test repl::tests::completion_shows_type_hint_for_non_boolean_settings_leaf ... FAILED
  950. 80.73 s >
  951. 80.73 s > failures:
  952. 80.73 s >
  953. 80.73 s > failures:
  954. 80.73 s > repl::tests::completion_shows_type_hint_for_non_boolean_settings_leaf
  955. 80.73 s >
  956. 80.73 s > test result: FAILED. 0 passed; 1 failed; 0 ignored; 0 measured; 338 filtered out; finished in 0.03s
  957. 80.73 s > system-err
  958. 80.73 s > thread 'repl::tests::completion_shows_type_hint_for_non_boolean_settings_leaf' (724) panicked at crates/gammaloop-api/src/repl.rs:5778:9:
  959. 80.73 s > [Suggestion { value: "", description: Some("Number of samples in the first Monte Carlo iteration."), style: None, extra: None, span: Span { start: 42, end: 42 }, append_whitespace: false }]
  960. 80.73 s > stack backtrace:
  961. 80.73 s > 0: __rustc::rust_begin_unwind
  962. 80.73 s > 1: core::panicking::panic_fmt
  963. 80.73 s > 2: gammaloop_api::repl::tests::completion_shows_type_hint_for_non_boolean_settings_leaf
  964. 80.73 s > 3: <gammaloop_api::repl::tests::completion_shows_type_hint_for_non_boolean_settings_leaf::{closure#0} as core::ops::function::FnOnce<()>>::call_once
  965. 80.73 s > note: Some details are omitted, run with `RUST_BACKTRACE=full` for a verbose backtrace.
  966. 80.73 s >
  967. 80.73 s > 2. gammaloop-api::templates::tests::extract_templates_uses_canonical_package_layout
  968. 80.73 s > failure: test failure with exit code 101
  969. 80.73 s > thread 'templates::tests::extract_templates_uses_canonical_package_layout' (852) panicked at crates/gammaloop-api/src/templates.rs:99:9:
  970. 80.73 s > assertion failed: figure.contains("amplitude-mode")
  971. 80.73 s > stack backtrace:
  972. 80.73 s > 0: __rustc::rust_begin_unwind
  973. 80.73 s > 1: core::panicking::panic_fmt
  974. 80.73 s > 2: core::panicking::panic
  975. 80.73 s > 3: gammaloop_api::templates::tests::extract_templates_uses_canonical_package_layout
  976. 80.73 s > 4: <gammaloop_api::templates::tests::extract_templates_uses_canonical_package_layout::{closure#0} as core::ops::function::FnOnce<()>>::call_once
  977. 80.73 s > note: Some details are omitted, run with `RUST_BACKTRACE=full` for a verbose backtrace.
  978. 80.73 s > system-out
  979. 80.73 s > running 1 test
  980. 80.73 s > test templates::tests::extract_templates_uses_canonical_package_layout ... FAILED
  981. 80.73 s >
  982. 80.73 s > failures:
  983. 80.73 s >
  984. 80.73 s > failures:
  985. 80.73 s > templates::tests::extract_templates_uses_canonical_package_layout
  986. 80.73 s >
  987. 80.73 s > test result: FAILED. 0 passed; 1 failed; 0 ignored; 0 measured; 338 filtered out; finished in 0.10s
  988. 80.73 s > system-err
  989. 80.73 s > thread 'templates::tests::extract_templates_uses_canonical_package_layout' (852) panicked at crates/gammaloop-api/src/templates.rs:99:9:
  990. 80.73 s > assertion failed: figure.contains("amplitude-mode")
  991. 80.73 s > stack backtrace:
  992. 80.73 s > 0: __rustc::rust_begin_unwind
  993. 80.73 s > 1: core::panicking::panic_fmt
  994. 80.73 s > 2: core::panicking::panic
  995. 80.73 s > 3: gammaloop_api::templates::tests::extract_templates_uses_canonical_package_layout
  996. 80.73 s > 4: <gammaloop_api::templates::tests::extract_templates_uses_canonical_package_layout::{closure#0} as core::ops::function::FnOnce<()>>::call_once
  997. 80.73 s > note: Some details are omitted, run with `RUST_BACKTRACE=full` for a verbose backtrace.
  998. 80.73 s > =========================================
  999. 80.73 s > Extracting 1 binary and 1 linked path to /build/nextest-archive-lBjI3y
  1000. 80.73 s > Extracted 7 files to /build/nextest-archive-lBjI3y in 0.13s
  1001. 80.73 s > ------------
  1002. 80.73 s > Nextest run ID 33ba6eb3-8d5d-4e5e-b6a3-f41240533ade with nextest profile: ci_gammaloop
  1003. 80.73 s > Starting 19 tests across 1 binary
  1004. 80.73 s > ------------
  1005. 80.73 s > Summary [ 0.095s] 19 tests run: 19 passed, 0 skipped
  1006. 80.73 s >
  1007. 80.73 s > ========== nextest test summary ==========
  1008. 80.73 s > report: target/nextest/ci_gammaloop/junit.xml
  1009. 80.73 s > tests: 19, failures: 0, errors: 0
  1010. 80.73 s > No failing testcases found.
  1011. 80.73 s > =========================================
  1012. 80.73 s > Extracting 1 binary to /build/nextest-archive-t1oFfQ
  1013. 80.73 s > Extracted 4 files to /build/nextest-archive-t1oFfQ in 0.13s
  1014. 80.73 s > ------------
  1015. 80.73 s > Nextest run ID a88082af-6818-4950-b905-b604fb41910c with nextest profile: ci_gammaloop
  1016. 80.73 s > Starting 0 tests across 1 binary
  1017. 80.73 s > ------------
  1018. 80.73 s > Summary [ 0.002s] 0 tests run: 0 passed, 0 skipped
  1019. 80.73 s >
  1020. 80.73 s > ========== nextest test summary ==========
  1021. 80.73 s > report: target/nextest/ci_gammaloop/junit.xml
  1022. 80.73 s > tests: 0, failures: 0, errors: 0
  1023. 80.73 s > No failing testcases found.
  1024. 80.73 s > =========================================
  1025. 80.73 s > Extracting 4 binaries, 1 build script output directory, and 2 linked paths to /build/nextest-archive-RAKGSV
  1026. 80.73 s > Extracted 18 files to /build/nextest-archive-RAKGSV in 0.77s
  1027. 80.73 s > ------------
  1028. 80.73 s > Nextest run ID 9bf32337-0e50-4210-9a66-aa426ecb6c4c with nextest profile: ci_gammaloop
  1029. 80.73 s > Starting 456 tests across 4 binaries (61 tests skipped, including 60 tests via profile.ci_gammaloop.default-filter)
  1030. 80.73 s > FAIL [ 0.630s] (114/456) gammalooprs graph::parse::tests::parse_lmbsetting_crossection
  1031. 80.73 s > stdout ---
  1032. 80.73 s >
  1033. 80.73 s > running 1 test
  1034. 80.73 s > ━━━━━━━━━━━━━━━━━━━━━━━━━━━━━━━ Snapshot Summary ━━━━━━━━━━━━━━━━━━━━━━━━━━━━━━━
  1035. 80.73 s > Snapshot: parse_lmbsetting_crossection
  1036. 80.73 s > Source: crates/gammalooprs/src/graph/parse/tests.rs:252
  1037. 80.73 s > ────────────────────────────────────────────────────────────────────────────────
  1038. 80.73 s > Expression: g.debug_dot()
  1039. 80.73 s > ────────────────────────────────────────────────────────────────────────────────
  1040. 80.73 s > -old snapshot
  1041. 80.73 s > +new results
  1042. 80.73 s > ────────────┬───────────────────────────────────────────────────────────────────
  1043. 80.73 s > 1 │-digraph G{
  1044. 80.73 s > 1 │+digraph G {
  1045. 80.73 s > 2 2 │ num = "1/2";
  1046. 80.73 s > 3 3 │ overall_factor = "2*x";
  1047. 80.73 s > 4 4 │ overall_factor_evaluated = "2*x";
  1048. 80.73 s > 5 5 │ projector = "spenso::t";
  1049. 80.73 s > ────────────┴───────────────────────────────────────────────────────────────────
  1050. 80.73 s > To update snapshots run `cargo insta review`
  1051. 80.73 s > Stopped on the first failure. Run `cargo insta test` to run all snapshots.
  1052. 80.73 s > test graph::parse::tests::parse_lmbsetting_crossection ... FAILED
  1053. 80.73 s >
  1054. 80.73 s > failures:
  1055. 80.73 s >
  1056. 80.73 s > failures:
  1057. 80.73 s > graph::parse::tests::parse_lmbsetting_crossection
  1058. 80.73 s >
  1059. 80.73 s > test result: FAILED. 0 passed; 1 failed; 0 ignored; 0 measured; 508 filtered out; finished in 0.61s
  1060. 80.73 s >
  1061. 80.73 s > stderr ---
  1062. 80.73 s > [21:00:41.499] @gammalooprs::graph::attribute_warnings WARNING : Unknown node attribute 'color_num' on graph 'G', node 'A'; did you mean 'num'?
  1063. 80.73 s > at crates/gammalooprs/src/graph/attribute_warnings.rs:198
  1064. 80.73 s > The application panicked (crashed).
  1065. 80.73 s > Message: snapshot assertion for 'parse_lmbsetting_crossection' failed in line 252
  1066. 80.73 s > Location: /nix/store/xdy1vvhll2bijdplvl9fcc2b9plkxhaa-vendor-cargo-deps/c19b7c6f923b580ac259164a89f2577984ad5ab09ee9d583b888f934adbbe8d0/insta-1.47.2/src/runtime.rs:719
  1067. 80.73 s >
  1068. 80.73 s > ━━━━━━━━━━━━━━━━━━━━━━━━━━━━━━━━━━ BACKTRACE ━━━━━━━━━━━━━━━━━━━━━━━━━━━━━━━━━━━
  1069. 80.73 s > 1: <color_eyre[b0c9e66060e883b2]::config::PanicHook>::panic_report<unknown>
  1070. 80.73 s > at <unknown source file>:<unknown line>
  1071. 80.73 s > 2: <color_eyre[b0c9e66060e883b2]::config::PanicHook>::into_panic_hook::{closure#0}<unknown>
  1072. 80.73 s > at <unknown source file>:<unknown line>
  1073. 80.73 s > 3: std[bcb96dfbba0ab899]::panicking::panic_with_hook<unknown>
  1074. 80.73 s > at <unknown source file>:<unknown line>
  1075. 80.73 s > 4: std[bcb96dfbba0ab899]::panicking::panic_handler::{closure#0}<unknown>
  1076. 80.73 s > at <unknown source file>:<unknown line>
  1077. 80.73 s > 5: std[bcb96dfbba0ab899]::sys::backtrace::__rust_end_short_backtrace::<std[bcb96dfbba0ab899]::panicking::panic_handler::{closure#0}, !><unknown>
  1078. 80.73 s > at <unknown source file>:<unknown line>
  1079. 80.73 s > 6: __rustc[6c289b9f9c454d21]::rust_begin_unwind<unknown>
  1080. 80.73 s > at <unknown source file>:<unknown line>
  1081. 80.73 s > 7: core[940e698046960fd5]::panicking::panic_fmt<unknown>
  1082. 80.73 s > at <unknown source file>:<unknown line>
  1083. 80.73 s > 8: insta[307a548ac79ef4d9]::runtime::assert_snapshot<unknown>
  1084. 80.73 s > at <unknown source file>:<unknown line>
  1085. 80.73 s > 9: gammalooprs[5490727360442cce]::graph::parse::tests::parse_lmbsetting_crossection<unknown>
  1086. 80.73 s > at <unknown source file>:<unknown line>
  1087. 80.73 s > 10: <gammalooprs[5490727360442cce]::graph::parse::tests::parse_lmbsetting_crossection::{closure#0} as core[940e698046960fd5]::ops::function::FnOnce<()>>::call_once<unknown>
  1088. 80.73 s > at <unknown source file>:<unknown line>
  1089. 80.73 s > 11: test[75d6903177b1d7e9]::__rust_begin_short_backtrace::<core[940e698046960fd5]::result::Result<(), alloc[2ea6bcb46fca0c42]::string::String>, fn() -> core[940e698046960fd5]::result::Result<(), alloc[2ea6bcb46fca0c42]::string::String>><unknown>
  1090. 80.73 s > at <unknown source file>:<unknown line>
  1091. 80.73 s > 12: test[75d6903177b1d7e9]::run_test::{closure#0}<unknown>
  1092. 80.73 s > at <unknown source file>:<unknown line>
  1093. 80.73 s > 13: std[bcb96dfbba0ab899]::sys::backtrace::__rust_begin_short_backtrace::<test[75d6903177b1d7e9]::run_test::{closure#1}, ()><unknown>
  1094. 80.73 s > at <unknown source file>:<unknown line>
  1095. 80.73 s > 14: <std[bcb96dfbba0ab899]::thread::lifecycle::spawn_unchecked<test[75d6903177b1d7e9]::run_test::{closure#1}, ()>::{closure#1} as core[940e698046960fd5]::ops::function::FnOnce<()>>::call_once::{shim:vtable#0}<unknown>
  1096. 80.73 s > at <unknown source file>:<unknown line>
  1097. 80.73 s > 15: <std[bcb96dfbba0ab899]::sys::thread::unix::Thread>::new::thread_start<unknown>
  1098. 80.73 s > at <unknown source file>:<unknown line>
  1099. 80.73 s > 16: start_thread<unknown>
  1100. 80.73 s > at <unknown source file>:<unknown line>
  1101. 80.73 s > 17: __clone3<unknown>
  1102. 80.73 s > at <unknown source file>:<unknown line>
  1103. 80.73 s >
  1104. 80.73 s > Run with COLORBT_SHOW_HIDDEN=1 environment variable to disable frame filtering.
  1105. 80.73 s > Run with RUST_BACKTRACE=full to include source snippets.
  1106. 80.73 s >
  1107. 80.73 s > FAIL [ 0.505s] (410/456) gammalooprs uv::export::tests::computed_node_full_numerator_is_a_spenso_aware_typst_fragment
  1108. 80.73 s > stdout ---
  1109. 80.73 s >
  1110. 80.73 s > running 1 test
  1111. 80.73 s > test uv::export::tests::computed_node_full_numerator_is_a_spenso_aware_typst_fragment ... FAILED
  1112. 80.73 s >
  1113. 80.73 s > failures:
  1114. 80.73 s >
  1115. 80.73 s > failures:
  1116. 80.73 s > uv::export::tests::computed_node_full_numerator_is_a_spenso_aware_typst_fragment
  1117. 80.73 s >
  1118. 80.73 s > test result: FAILED. 0 passed; 1 failed; 0 ignored; 0 measured; 508 filtered out; finished in 0.49s
  1119. 80.73 s >
  1120. 80.73 s > stderr ---
  1121. 80.73 s > The application panicked (crashed).
  1122. 80.73 s > Message: assertion failed: exported.dot.contains(r#"full_num = "op(\"Tr\")(1)";"#)
  1123. 80.73 s > Location: crates/gammalooprs/src/uv/export.rs:483
  1124. 80.73 s >
  1125. 80.73 s > ━━━━━━━━━━━━━━━━━━━━━━━━━━━━━━━━━━ BACKTRACE ━━━━━━━━━━━━━━━━━━━━━━━━━━━━━━━━━━━
  1126. 80.73 s > 1: <color_eyre[b0c9e66060e883b2]::config::PanicHook>::panic_report<unknown>
  1127. 80.73 s > at <unknown source file>:<unknown line>
  1128. 80.73 s > 2: <color_eyre[b0c9e66060e883b2]::config::PanicHook>::into_panic_hook::{closure#0}<unknown>
  1129. 80.73 s > at <unknown source file>:<unknown line>
  1130. 80.73 s > 3: std[bcb96dfbba0ab899]::panicking::panic_with_hook<unknown>
  1131. 80.73 s > at <unknown source file>:<unknown line>
  1132. 80.73 s > 4: std[bcb96dfbba0ab899]::panicking::panic_handler::{closure#0}<unknown>
  1133. 80.73 s > at <unknown source file>:<unknown line>
  1134. 80.73 s > 5: std[bcb96dfbba0ab899]::sys::backtrace::__rust_end_short_backtrace::<std[bcb96dfbba0ab899]::panicking::panic_handler::{closure#0}, !><unknown>
  1135. 80.73 s > at <unknown source file>:<unknown line>
  1136. 80.73 s > 6: __rustc[6c289b9f9c454d21]::rust_begin_unwind<unknown>
  1137. 80.73 s > at <unknown source file>:<unknown line>
  1138. 80.73 s > 7: core[940e698046960fd5]::panicking::panic_fmt<unknown>
  1139. 80.73 s > at <unknown source file>:<unknown line>
  1140. 80.73 s > 8: core[940e698046960fd5]::panicking::panic<unknown>
  1141. 80.73 s > at <unknown source file>:<unknown line>
  1142. 80.73 s > 9: gammalooprs[5490727360442cce]::uv::export::tests::computed_node_full_numerator_is_a_spenso_aware_typst_fragment<unknown>
  1143. 80.73 s > at <unknown source file>:<unknown line>
  1144. 80.73 s > 10: <gammalooprs[5490727360442cce]::uv::export::tests::computed_node_full_numerator_is_a_spenso_aware_typst_fragment::{closure#0} as core[940e698046960fd5]::ops::function::FnOnce<()>>::call_once<unknown>
  1145. 80.73 s > at <unknown source file>:<unknown line>
  1146. 80.73 s > 11: test[75d6903177b1d7e9]::__rust_begin_short_backtrace::<core[940e698046960fd5]::result::Result<(), alloc[2ea6bcb46fca0c42]::string::String>, fn() -> core[940e698046960fd5]::result::Result<(), alloc[2ea6bcb46fca0c42]::string::String>><unknown>
  1147. 80.73 s > at <unknown source file>:<unknown line>
  1148. 80.73 s > 12: test[75d6903177b1d7e9]::run_test::{closure#0}<unknown>
  1149. 80.73 s > at <unknown source file>:<unknown line>
  1150. 80.73 s > 13: std[bcb96dfbba0ab899]::sys::backtrace::__rust_begin_short_backtrace::<test[75d6903177b1d7e9]::run_test::{closure#1}, ()><unknown>
  1151. 80.73 s > at <unknown source file>:<unknown line>
  1152. 80.73 s > 14: <std[bcb96dfbba0ab899]::thread::lifecycle::spawn_unchecked<test[75d6903177b1d7e9]::run_test::{closure#1}, ()>::{closure#1} as core[940e698046960fd5]::ops::function::FnOnce<()>>::call_once::{shim:vtable#0}<unknown>
  1153. 80.73 s > at <unknown source file>:<unknown line>
  1154. 80.73 s > 15: <std[bcb96dfbba0ab899]::sys::thread::unix::Thread>::new::thread_start<unknown>
  1155. 80.73 s > at <unknown source file>:<unknown line>
  1156. 80.73 s > 16: start_thread<unknown>
  1157. 80.73 s > at <unknown source file>:<unknown line>
  1158. 80.73 s > 17: __clone3<unknown>
  1159. 80.73 s > at <unknown source file>:<unknown line>
  1160. 80.73 s >
  1161. 80.73 s > Run with COLORBT_SHOW_HIDDEN=1 environment variable to disable frame filtering.
  1162. 80.73 s > Run with RUST_BACKTRACE=full to include source snippets.
  1163. 80.73 s >
  1164. 80.73 s > ------------
  1165. 80.73 s > Summary [ 30.915s] 456 tests run: 454 passed, 2 failed, 61 skipped
  1166. 80.73 s > FAIL [ 0.630s] (114/456) gammalooprs graph::parse::tests::parse_lmbsetting_crossection
  1167. 80.73 s > stdout ---
  1168. 80.73 s >
  1169. 80.73 s > running 1 test
  1170. 80.73 s > ━━━━━━━━━━━━━━━━━━━━━━━━━━━━━━━ Snapshot Summary ━━━━━━━━━━━━━━━━━━━━━━━━━━━━━━━
  1171. 80.73 s > Snapshot: parse_lmbsetting_crossection
  1172. 80.73 s > Source: crates/gammalooprs/src/graph/parse/tests.rs:252
  1173. 80.73 s > ────────────────────────────────────────────────────────────────────────────────
  1174. 80.73 s > Expression: g.debug_dot()
  1175. 80.73 s > ────────────────────────────────────────────────────────────────────────────────
  1176. 80.73 s > -old snapshot
  1177. 80.73 s > +new results
  1178. 80.73 s > ────────────┬───────────────────────────────────────────────────────────────────
  1179. 80.73 s > 1 │-digraph G{
  1180. 80.73 s > 1 │+digraph G {
  1181. 80.73 s > 2 2 │ num = "1/2";
  1182. 80.73 s > 3 3 │ overall_factor = "2*x";
  1183. 80.73 s > 4 4 │ overall_factor_evaluated = "2*x";
  1184. 80.73 s > 5 5 │ projector = "spenso::t";
  1185. 80.73 s > ────────────┴───────────────────────────────────────────────────────────────────
  1186. 80.73 s > To update snapshots run `cargo insta review`
  1187. 80.73 s > Stopped on the first failure. Run `cargo insta test` to run all snapshots.
  1188. 80.73 s > test graph::parse::tests::parse_lmbsetting_crossection ... FAILED
  1189. 80.73 s >
  1190. 80.73 s > failures:
  1191. 80.73 s >
  1192. 80.73 s > failures:
  1193. 80.73 s > graph::parse::tests::parse_lmbsetting_crossection
  1194. 80.73 s >
  1195. 80.73 s > test result: FAILED. 0 passed; 1 failed; 0 ignored; 0 measured; 508 filtered out; finished in 0.61s
  1196. 80.73 s >
  1197. 80.73 s > stderr ---
  1198. 80.73 s > [21:00:41.499] @gammalooprs::graph::attribute_warnings WARNING : Unknown node attribute 'color_num' on graph 'G', node 'A'; did you mean 'num'?
  1199. 80.73 s > at crates/gammalooprs/src/graph/attribute_warnings.rs:198
  1200. 80.73 s > The application panicked (crashed).
  1201. 80.73 s > Message: snapshot assertion for 'parse_lmbsetting_crossection' failed in line 252
  1202. 80.73 s > Location: /nix/store/xdy1vvhll2bijdplvl9fcc2b9plkxhaa-vendor-cargo-deps/c19b7c6f923b580ac259164a89f2577984ad5ab09ee9d583b888f934adbbe8d0/insta-1.47.2/src/runtime.rs:719
  1203. 80.73 s >
  1204. 80.73 s > ━━━━━━━━━━━━━━━━━━━━━━━━━━━━━━━━━━ BACKTRACE ━━━━━━━━━━━━━━━━━━━━━━━━━━━━━━━━━━━
  1205. 80.73 s > 1: <color_eyre[b0c9e66060e883b2]::config::PanicHook>::panic_report<unknown>
  1206. 80.73 s > at <unknown source file>:<unknown line>
  1207. 80.73 s > 2: <color_eyre[b0c9e66060e883b2]::config::PanicHook>::into_panic_hook::{closure#0}<unknown>
  1208. 80.73 s > at <unknown source file>:<unknown line>
  1209. 80.73 s > 3: std[bcb96dfbba0ab899]::panicking::panic_with_hook<unknown>
  1210. 80.73 s > at <unknown source file>:<unknown line>
  1211. 80.73 s > 4: std[bcb96dfbba0ab899]::panicking::panic_handler::{closure#0}<unknown>
  1212. 80.73 s > at <unknown source file>:<unknown line>
  1213. 80.73 s > 5: std[bcb96dfbba0ab899]::sys::backtrace::__rust_end_short_backtrace::<std[bcb96dfbba0ab899]::panicking::panic_handler::{closure#0}, !><unknown>
  1214. 80.73 s > at <unknown source file>:<unknown line>
  1215. 80.73 s > 6: __rustc[6c289b9f9c454d21]::rust_begin_unwind<unknown>
  1216. 80.73 s > at <unknown source file>:<unknown line>
  1217. 80.73 s > 7: core[940e698046960fd5]::panicking::panic_fmt<unknown>
  1218. 80.73 s > at <unknown source file>:<unknown line>
  1219. 80.73 s > 8: insta[307a548ac79ef4d9]::runtime::assert_snapshot<unknown>
  1220. 80.73 s > at <unknown source file>:<unknown line>
  1221. 80.73 s > 9: gammalooprs[5490727360442cce]::graph::parse::tests::parse_lmbsetting_crossection<unknown>
  1222. 80.73 s > at <unknown source file>:<unknown line>
  1223. 80.73 s > 10: <gammalooprs[5490727360442cce]::graph::parse::tests::parse_lmbsetting_crossection::{closure#0} as core[940e698046960fd5]::ops::function::FnOnce<()>>::call_once<unknown>
  1224. 80.73 s > at <unknown source file>:<unknown line>
  1225. 80.73 s > 11: test[75d6903177b1d7e9]::__rust_begin_short_backtrace::<core[940e698046960fd5]::result::Result<(), alloc[2ea6bcb46fca0c42]::string::String>, fn() -> core[940e698046960fd5]::result::Result<(), alloc[2ea6bcb46fca0c42]::string::String>><unknown>
  1226. 80.73 s > at <unknown source file>:<unknown line>
  1227. 80.73 s > 12: test[75d6903177b1d7e9]::run_test::{closure#0}<unknown>
  1228. 80.73 s > at <unknown source file>:<unknown line>
  1229. 80.73 s > 13: std[bcb96dfbba0ab899]::sys::backtrace::__rust_begin_short_backtrace::<test[75d6903177b1d7e9]::run_test::{closure#1}, ()><unknown>
  1230. 80.73 s > at <unknown source file>:<unknown line>
  1231. 80.73 s > 14: <std[bcb96dfbba0ab899]::thread::lifecycle::spawn_unchecked<test[75d6903177b1d7e9]::run_test::{closure#1}, ()>::{closure#1} as core[940e698046960fd5]::ops::function::FnOnce<()>>::call_once::{shim:vtable#0}<unknown>
  1232. 80.73 s > at <unknown source file>:<unknown line>
  1233. 80.73 s > 15: <std[bcb96dfbba0ab899]::sys::thread::unix::Thread>::new::thread_start<unknown>
  1234. 80.73 s > at <unknown source file>:<unknown line>
  1235. 80.73 s > 16: start_thread<unknown>
  1236. 80.73 s > at <unknown source file>:<unknown line>
  1237. 80.73 s > 17: __clone3<unknown>
  1238. 80.73 s > at <unknown source file>:<unknown line>
  1239. 80.73 s >
  1240. 80.73 s > Run with COLORBT_SHOW_HIDDEN=1 environment variable to disable frame filtering.
  1241. 80.73 s > Run with RUST_BACKTRACE=full to include source snippets.
  1242. 80.73 s >
  1243. 80.73 s > FAIL [ 0.505s] (410/456) gammalooprs uv::export::tests::computed_node_full_numerator_is_a_spenso_aware_typst_fragment
  1244. 80.73 s > stdout ---
  1245. 80.73 s >
  1246. 80.73 s > running 1 test
  1247. 80.73 s > test uv::export::tests::computed_node_full_numerator_is_a_spenso_aware_typst_fragment ... FAILED
  1248. 80.73 s >
  1249. 80.73 s > failures:
  1250. 80.73 s >
  1251. 80.73 s > failures:
  1252. 80.73 s > uv::export::tests::computed_node_full_numerator_is_a_spenso_aware_typst_fragment
  1253. 80.73 s >
  1254. 80.73 s > test result: FAILED. 0 passed; 1 failed; 0 ignored; 0 measured; 508 filtered out; finished in 0.49s
  1255. 80.73 s >
  1256. 80.73 s > stderr ---
  1257. 80.73 s > The application panicked (crashed).
  1258. 80.73 s > Message: assertion failed: exported.dot.contains(r#"full_num = "op(\"Tr\")(1)";"#)
  1259. 80.73 s > Location: crates/gammalooprs/src/uv/export.rs:483
  1260. 80.73 s >
  1261. 80.73 s > ━━━━━━━━━━━━━━━━━━━━━━━━━━━━━━━━━━ BACKTRACE ━━━━━━━━━━━━━━━━━━━━━━━━━━━━━━━━━━━
  1262. 80.73 s > 1: <color_eyre[b0c9e66060e883b2]::config::PanicHook>::panic_report<unknown>
  1263. 80.73 s > at <unknown source file>:<unknown line>
  1264. 80.73 s > 2: <color_eyre[b0c9e66060e883b2]::config::PanicHook>::into_panic_hook::{closure#0}<unknown>
  1265. 80.73 s > at <unknown source file>:<unknown line>
  1266. 80.73 s > 3: std[bcb96dfbba0ab899]::panicking::panic_with_hook<unknown>
  1267. 80.73 s > at <unknown source file>:<unknown line>
  1268. 80.73 s > 4: std[bcb96dfbba0ab899]::panicking::panic_handler::{closure#0}<unknown>
  1269. 80.73 s > at <unknown source file>:<unknown line>
  1270. 80.73 s > 5: std[bcb96dfbba0ab899]::sys::backtrace::__rust_end_short_backtrace::<std[bcb96dfbba0ab899]::panicking::panic_handler::{closure#0}, !><unknown>
  1271. 80.73 s > at <unknown source file>:<unknown line>
  1272. 80.73 s > 6: __rustc[6c289b9f9c454d21]::rust_begin_unwind<unknown>
  1273. 80.73 s > at <unknown source file>:<unknown line>
  1274. 80.73 s > 7: core[940e698046960fd5]::panicking::panic_fmt<unknown>
  1275. 80.73 s > at <unknown source file>:<unknown line>
  1276. 80.73 s > 8: core[940e698046960fd5]::panicking::panic<unknown>
  1277. 80.73 s > at <unknown source file>:<unknown line>
  1278. 80.73 s > 9: gammalooprs[5490727360442cce]::uv::export::tests::computed_node_full_numerator_is_a_spenso_aware_typst_fragment<unknown>
  1279. 80.73 s > at <unknown source file>:<unknown line>
  1280. 80.73 s > 10: <gammalooprs[5490727360442cce]::uv::export::tests::computed_node_full_numerator_is_a_spenso_aware_typst_fragment::{closure#0} as core[940e698046960fd5]::ops::function::FnOnce<()>>::call_once<unknown>
  1281. 80.73 s > at <unknown source file>:<unknown line>
  1282. 80.73 s > 11: test[75d6903177b1d7e9]::__rust_begin_short_backtrace::<core[940e698046960fd5]::result::Result<(), alloc[2ea6bcb46fca0c42]::string::String>, fn() -> core[940e698046960fd5]::result::Result<(), alloc[2ea6bcb46fca0c42]::string::String>><unknown>
  1283. 80.73 s > at <unknown source file>:<unknown line>
  1284. 80.73 s > 12: test[75d6903177b1d7e9]::run_test::{closure#0}<unknown>
  1285. 80.73 s > at <unknown source file>:<unknown line>
  1286. 80.73 s > 13: std[bcb96dfbba0ab899]::sys::backtrace::__rust_begin_short_backtrace::<test[75d6903177b1d7e9]::run_test::{closure#1}, ()><unknown>
  1287. 80.73 s > at <unknown source file>:<unknown line>
  1288. 80.73 s > 14: <std[bcb96dfbba0ab899]::thread::lifecycle::spawn_unchecked<test[75d6903177b1d7e9]::run_test::{closure#1}, ()>::{closure#1} as core[940e698046960fd5]::ops::function::FnOnce<()>>::call_once::{shim:vtable#0}<unknown>
  1289. 80.73 s > at <unknown source file>:<unknown line>
  1290. 80.73 s > 15: <std[bcb96dfbba0ab899]::sys::thread::unix::Thread>::new::thread_start<unknown>
  1291. 80.73 s > at <unknown source file>:<unknown line>
  1292. 80.73 s > 16: start_thread<unknown>
  1293. 80.73 s > at <unknown source file>:<unknown line>
  1294. 80.73 s > 17: __clone3<unknown>
  1295. 80.73 s > at <unknown source file>:<unknown line>
  1296. 80.73 s >
  1297. 80.73 s > Run with COLORBT_SHOW_HIDDEN=1 environment variable to disable frame filtering.
  1298. 80.73 s > Run with RUST_BACKTRACE=full to include source snippets.
  1299. 80.73 s >
  1300. 80.73 s > error: test run failed
  1301. 80.73 s >
  1302. 80.73 s > ========== nextest test summary ==========
  1303. 80.73 s > report: target/nextest/ci_gammaloop/junit.xml
  1304. 80.73 s > tests: 456, failures: 2, errors: 0
  1305. 80.73 s >
  1306. 80.73 s > 1. gammalooprs::graph::parse::tests::parse_lmbsetting_crossection
  1307. 80.73 s > failure: test failure with exit code 101
  1308. 80.73 s > system-out
  1309. 80.73 s > running 1 test
  1310. 80.73 s > ━━━━━━━━━━━━━━━━━━━━━━━━━━━━━━━ Snapshot Summary ━━━━━━━━━━━━━━━━━━━━━━━━━━━━━━━
  1311. 80.73 s > Snapshot: parse_lmbsetting_crossection
  1312. 80.73 s > Source: crates/gammalooprs/src/graph/parse/tests.rs:252
  1313. 80.73 s > ────────────────────────────────────────────────────────────────────────────────
  1314. 80.73 s > Expression: g.debug_dot()
  1315. 80.73 s > ────────────────────────────────────────────────────────────────────────────────
  1316. 80.73 s > -old snapshot
  1317. 80.73 s > +new results
  1318. 80.73 s > ────────────┬───────────────────────────────────────────────────────────────────
  1319. 80.73 s > 1 │-digraph G{
  1320. 80.73 s > 1 │+digraph G {
  1321. 80.73 s > 2 2 │ num = "1/2";
  1322. 80.73 s > 3 3 │ overall_factor = "2*x";
  1323. 80.73 s > 4 4 │ overall_factor_evaluated = "2*x";
  1324. 80.73 s > 5 5 │ projector = "spenso::t";
  1325. 80.73 s > ────────────┴───────────────────────────────────────────────────────────────────
  1326. 80.73 s > To update snapshots run `cargo insta review`
  1327. 80.73 s > Stopped on the first failure. Run `cargo insta test` to run all snapshots.
  1328. 80.73 s > test graph::parse::tests::parse_lmbsetting_crossection ... FAILED
  1329. 80.73 s >
  1330. 80.73 s > failures:
  1331. 80.73 s >
  1332. 80.73 s > failures:
  1333. 80.73 s > graph::parse::tests::parse_lmbsetting_crossection
  1334. 80.73 s >
  1335. 80.73 s > test result: FAILED. 0 passed; 1 failed; 0 ignored; 0 measured; 508 filtered out; finished in 0.61s
  1336. 80.73 s > system-err
  1337. 80.73 s > [21:00:41.499] @gammalooprs::graph::attribute_warnings WARNING : Unknown node attribute 'color_num' on graph 'G', node 'A'; did you mean 'num'?
  1338. 80.73 s > at crates/gammalooprs/src/graph/attribute_warnings.rs:198
  1339. 80.73 s > The application panicked (crashed).
  1340. 80.73 s > Message: snapshot assertion for 'parse_lmbsetting_crossection' failed in line 252
  1341. 80.73 s > Location: /nix/store/xdy1vvhll2bijdplvl9fcc2b9plkxhaa-vendor-cargo-deps/c19b7c6f923b580ac259164a89f2577984ad5ab09ee9d583b888f934adbbe8d0/insta-1.47.2/src/runtime.rs:719
  1342. 80.73 s >
  1343. 80.73 s > ━━━━━━━━━━━━━━━━━━━━━━━━━━━━━━━━━━ BACKTRACE ━━━━━━━━━━━━━━━━━━━━━━━━━━━━━━━━━━━
  1344. 80.73 s > 1: <color_eyre[b0c9e66060e883b2]::config::PanicHook>::panic_report<unknown>
  1345. 80.73 s > at <unknown source file>:<unknown line>
  1346. 80.73 s > 2: <color_eyre[b0c9e66060e883b2]::config::PanicHook>::into_panic_hook::{closure#0}<unknown>
  1347. 80.73 s > at <unknown source file>:<unknown line>
  1348. 80.73 s > 3: std[bcb96dfbba0ab899]::panicking::panic_with_hook<unknown>
  1349. 80.73 s > at <unknown source file>:<unknown line>
  1350. 80.73 s > 4: std[bcb96dfbba0ab899]::panicking::panic_handler::{closure#0}<unknown>
  1351. 80.73 s > at <unknown source file>:<unknown line>
  1352. 80.73 s > 5: std[bcb96dfbba0ab899]::sys::backtrace::__rust_end_short_backtrace::<std[bcb96dfbba0ab899]::panicking::panic_handler::{closure#0}, !><unknown>
  1353. 80.73 s > at <unknown source file>:<unknown line>
  1354. 80.73 s > 6: __rustc[6c289b9f9c454d21]::rust_begin_unwind<unknown>
  1355. 80.73 s > at <unknown source file>:<unknown line>
  1356. 80.73 s > 7: core[940e698046960fd5]::panicking::panic_fmt<unknown>
  1357. 80.73 s > at <unknown source file>:<unknown line>
  1358. 80.73 s > 8: insta[307a548ac79ef4d9]::runtime::assert_snapshot<unknown>
  1359. 80.73 s > at <unknown source file>:<unknown line>
  1360. 80.73 s > 9: gammalooprs[5490727360442cce]::graph::parse::tests::parse_lmbsetting_crossection<unknown>
  1361. 80.73 s > at <unknown source file>:<unknown line>
  1362. 80.73 s > 10: <gammalooprs[5490727360442cce]::graph::parse::tests::parse_lmbsetting_crossection::{closure#0} as core[940e698046960fd5]::ops::function::FnOnce<()>>::call_once<unknown>
  1363. 80.73 s > at <unknown source file>:<unknown line>
  1364. 80.73 s > 11: test[75d6903177b1d7e9]::__rust_begin_short_backtrace::<core[940e698046960fd5]::result::Result<(), alloc[2ea6bcb46fca0c42]::string::String>, fn() -> core[940e698046960fd5]::result::Result<(), alloc[2ea6bcb46fca0c42]::string::String>><unknown>
  1365. 80.73 s > at <unknown source file>:<unknown line>
  1366. 80.73 s > 12: test[75d6903177b1d7e9]::run_test::{closure#0}<unknown>
  1367. 80.73 s > at <unknown source file>:<unknown line>
  1368. 80.73 s > 13: std[bcb96dfbba0ab899]::sys::backtrace::__rust_begin_short_backtrace::<test[75d6903177b1d7e9]::run_test::{closure#1}, ()><unknown>
  1369. 80.73 s > at <unknown source file>:<unknown line>
  1370. 80.73 s > 14: <std[bcb96dfbba0ab899]::thread::lifecycle::spawn_unchecked<test[75d6903177b1d7e9]::run_test::{closure#1}, ()>::{closure#1} as core[940e698046960fd5]::ops::function::FnOnce<()>>::call_once::{shim:vtable#0}<unknown>
  1371. 80.73 s > at <unknown source file>:<unknown line>
  1372. 80.73 s > 15: <std[bcb96dfbba0ab899]::sys::thread::unix::Thread>::new::thread_start<unknown>
  1373. 80.73 s > at <unknown source file>:<unknown line>
  1374. 80.73 s > 16: start_thread<unknown>
  1375. 80.73 s > at <unknown source file>:<unknown line>
  1376. 80.73 s > 17: __clone3<unknown>
  1377. 80.73 s > at <unknown source file>:<unknown line>
  1378. 80.73 s >
  1379. 80.73 s > Run with COLORBT_SHOW_HIDDEN=1 environment variable to disable frame filtering.
  1380. 80.73 s > Run with RUST_BACKTRACE=full to include source snippets.
  1381. 80.73 s >
  1382. 80.73 s > 2. gammalooprs::uv::export::tests::computed_node_full_numerator_is_a_spenso_aware_typst_fragment
  1383. 80.73 s > failure: test failure with exit code 101
  1384. 80.73 s > system-out
  1385. 80.73 s > running 1 test
  1386. 80.73 s > test uv::export::tests::computed_node_full_numerator_is_a_spenso_aware_typst_fragment ... FAILED
  1387. 80.73 s >
  1388. 80.73 s > failures:
  1389. 80.73 s >
  1390. 80.73 s > failures:
  1391. 80.73 s > uv::export::tests::computed_node_full_numerator_is_a_spenso_aware_typst_fragment
  1392. 80.73 s >
  1393. 80.73 s > test result: FAILED. 0 passed; 1 failed; 0 ignored; 0 measured; 508 filtered out; finished in 0.49s
  1394. 80.73 s > system-err
  1395. 80.73 s > The application panicked (crashed).
  1396. 80.73 s > Message: assertion failed: exported.dot.contains(r#"full_num = "op(\"Tr\")(1)";"#)
  1397. 80.73 s > Location: crates/gammalooprs/src/uv/export.rs:483
  1398. 80.73 s >
  1399. 80.73 s > ━━━━━━━━━━━━━━━━━━━━━━━━━━━━━━━━━━ BACKTRACE ━━━━━━━━━━━━━━━━━━━━━━━━━━━━━━━━━━━
  1400. 80.73 s > 1: <color_eyre[b0c9e66060e883b2]::config::PanicHook>::panic_report<unknown>
  1401. 80.73 s > at <unknown source file>:<unknown line>
  1402. 80.73 s > 2: <color_eyre[b0c9e66060e883b2]::config::PanicHook>::into_panic_hook::{closure#0}<unknown>
  1403. 80.73 s > at <unknown source file>:<unknown line>
  1404. 80.73 s > 3: std[bcb96dfbba0ab899]::panicking::panic_with_hook<unknown>
  1405. 80.73 s > at <unknown source file>:<unknown line>
  1406. 80.73 s > 4: std[bcb96dfbba0ab899]::panicking::panic_handler::{closure#0}<unknown>
  1407. 80.73 s > at <unknown source file>:<unknown line>
  1408. 80.73 s > 5: std[bcb96dfbba0ab899]::sys::backtrace::__rust_end_short_backtrace::<std[bcb96dfbba0ab899]::panicking::panic_handler::{closure#0}, !><unknown>
  1409. 80.73 s > at <unknown source file>:<unknown line>
  1410. 80.73 s > 6: __rustc[6c289b9f9c454d21]::rust_begin_unwind<unknown>
  1411. 80.73 s > at <unknown source file>:<unknown line>
  1412. 80.73 s > 7: core[940e698046960fd5]::panicking::panic_fmt<unknown>
  1413. 80.73 s > at <unknown source file>:<unknown line>
  1414. 80.73 s > 8: core[940e698046960fd5]::panicking::panic<unknown>
  1415. 80.73 s > at <unknown source file>:<unknown line>
  1416. 80.73 s > 9: gammalooprs[5490727360442cce]::uv::export::tests::computed_node_full_numerator_is_a_spenso_aware_typst_fragment<unknown>
  1417. 80.73 s > at <unknown source file>:<unknown line>
  1418. 80.73 s > 10: <gammalooprs[5490727360442cce]::uv::export::tests::computed_node_full_numerator_is_a_spenso_aware_typst_fragment::{closure#0} as core[940e698046960fd5]::ops::function::FnOnce<()>>::call_once<unknown>
  1419. 80.73 s > at <unknown source file>:<unknown line>
  1420. 80.73 s > 11: test[75d6903177b1d7e9]::__rust_begin_short_backtrace::<core[940e698046960fd5]::result::Result<(), alloc[2ea6bcb46fca0c42]::string::String>, fn() -> core[940e698046960fd5]::result::Result<(), alloc[2ea6bcb46fca0c42]::string::String>><unknown>
  1421. 80.73 s > at <unknown source file>:<unknown line>
  1422. 80.73 s > 12: test[75d6903177b1d7e9]::run_test::{closure#0}<unknown>
  1423. 80.73 s > at <unknown source file>:<unknown line>
  1424. 80.73 s > 13: std[bcb96dfbba0ab899]::sys::backtrace::__rust_begin_short_backtrace::<test[75d6903177b1d7e9]::run_test::{closure#1}, ()><unknown>
  1425. 80.73 s > at <unknown source file>:<unknown line>
  1426. 80.73 s > 14: <std[bcb96dfbba0ab899]::thread::lifecycle::spawn_unchecked<test[75d6903177b1d7e9]::run_test::{closure#1}, ()>::{closure#1} as core[940e698046960fd5]::ops::function::FnOnce<()>>::call_once::{shim:vtable#0}<unknown>
  1427. 80.73 s > at <unknown source file>:<unknown line>
  1428. 80.73 s > 15: <std[bcb96dfbba0ab899]::sys::thread::unix::Thread>::new::thread_start<unknown>
  1429. 80.73 s > at <unknown source file>:<unknown line>
  1430. 80.73 s > 16: start_thread<unknown>
  1431. 80.73 s > at <unknown source file>:<unknown line>
  1432. 80.73 s > 17: __clone3<unknown>
  1433. 80.73 s > at <unknown source file>:<unknown line>
  1434. 80.73 s >
  1435. 80.73 s > Run with COLORBT_SHOW_HIDDEN=1 environment variable to disable frame filtering.
  1436. 80.73 s > Run with RUST_BACKTRACE=full to include source snippets.
  1437. 80.73 s > =========================================
  1438. 80.73 s For full logs, run:
  1439. 80.73 s nix log /nix/store/07lma8g6p1n7jxf8azmxf90ca6pqjydj-gammaloop-nextest-core.drv
  1440. 80.86 s [0 built (1 failed), 9 cRun failed.