build packages.x86_64-linux.crate-test-binaries-three-dimensional-reps
0.00 s
$ /nix/store/9ypz3flqsrl5xl495mm8h645gadjsxi1-coreutils-9.11/bin/timeout --kill-after=15s 7200s /nix/store/23zk8sgzamrbmj1fday15szf7f2279s8-nix-2.34.7/bin/nix --extra-experimental-features nix-command --extra-experimental-features flakes --log-format internal-json build --no-link --print-out-paths git+https://github.com/alphal00p/gammaloop?ref=raised_energy_cff_wip&rev=568679e1dc0e12b5bbc800a45457d6a711abf74a&shallow=1#packages.x86_64-linux.crate-test-binaries-three-dimensional-reps --print-build-logs
0.32 s
error (ignored): SQLite database '/var/cache/nix-ci-worker/eval-cache-v6/5a0a28588cf4967ee83cdafce2d2c04e0b19a8b4993c2fc53cda0d9272a50e31.sqlite ' is busy
1.91 s
8.96 s
Building /nix/store/jw4czjjdv1cc9jr1gsiygk91yx66v8ip-gammaloop-crate-test-binaries-three-dimensional-reps-50150770f831b638-deps-0.1.0.drv
9.02 s
[gammaloop-crate-test-binaries-three-dimensional-reps-50150770f831b638-deps] Phase: unpackPhase
9.02 s
[gammaloop-crate-test-binaries-three-dimensional-reps-50150770f831b638-deps] unpacking source archive /nix/store/s1ajjdsb6bzj5dvvg360rj0kxnvgb27s-source
9.05 s
[gammaloop-crate-test-binaries-three-dimensional-reps-50150770f831b638-deps] source root is source
9.06 s
[gammaloop-crate-test-binaries-three-dimensional-reps-50150770f831b638-deps] Phase: patchPhase
9.16 s
[gammaloop-crate-test-binaries-three-dimensional-reps-50150770f831b638-deps] Executing configureCargoCommonVars
9.16 s
[gammaloop-crate-test-binaries-three-dimensional-reps-50150770f831b638-deps] copying cargo artifacts from /nix/store/71lg5z9qr6b69cp7v2y427r8blvhr0lh-gammaloop-crate-test-binaries-three-dimensional-reps-50150770f831b638-inputs/target to target
9.16 s
[gammaloop-crate-test-binaries-three-dimensional-reps-50150770f831b638-deps] will deep copy artifacts (instead of symlinking) as requested
10.78 s
[gammaloop-crate-test-binaries-three-dimensional-reps-50150770f831b638-deps] Phase: updateAutotoolsGnuConfigScriptsPhase
10.80 s
[gammaloop-crate-test-binaries-three-dimensional-reps-50150770f831b638-deps] Phase: configurePhase
10.81 s
[gammaloop-crate-test-binaries-three-dimensional-reps-50150770f831b638-deps] will append /build/source/.cargo-home/config.toml with contents of /nix/store/1sigmg52bb61pfngmk9k8wq5fz9r7bf1-vendor-cargo-deps/config.toml
10.81 s
[gammaloop-crate-test-binaries-three-dimensional-reps-50150770f831b638-deps] default configurePhase, nothing to do
10.81 s
[gammaloop-crate-test-binaries-three-dimensional-reps-50150770f831b638-deps] Phase: buildPhase
10.81 s
[gammaloop-crate-test-binaries-three-dimensional-reps-50150770f831b638-deps] +++ command cargo --version
10.82 s
[gammaloop-crate-test-binaries-three-dimensional-reps-50150770f831b638-deps] cargo 1.97.0 (c980f4866 2026-06-30)
10.82 s
[gammaloop-crate-test-binaries-three-dimensional-reps-50150770f831b638-deps] +++ command cargo test --profile ci-optim --no-run --offline -p three-dimensional-reps --features three-dimensional-reps/serde
11.09 s
[gammaloop-crate-test-binaries-three-dimensional-reps-50150770f831b638-deps] Compiling three-dimensional-reps v0.1.0 (/build/source/crates/three-dimensional-reps)
11.22 s
[gammaloop-crate-test-binaries-three-dimensional-reps-50150770f831b638-deps] error[E0433] : cannot find `eval` in `crate`
11.22 s
[gammaloop-crate-test-binaries-three-dimensional-reps-50150770f831b638-deps] --> crates/three-dimensional-reps/src/generation.rs:8045:28
11.22 s
[gammaloop-crate-test-binaries-three-dimensional-reps-50150770f831b638-deps] |
11.22 s
[gammaloop-crate-test-binaries-three-dimensional-reps-50150770f831b638-deps] 8045 | let input = crate::eval::EvaluationInput {
11.22 s
[gammaloop-crate-test-binaries-three-dimensional-reps-50150770f831b638-deps] | ^^^^ could not find `eval` in the crate root
11.22 s
[gammaloop-crate-test-binaries-three-dimensional-reps-50150770f831b638-deps] |
11.22 s
[gammaloop-crate-test-binaries-three-dimensional-reps-50150770f831b638-deps] note : found an item that was configured out
11.22 s
[gammaloop-crate-test-binaries-three-dimensional-reps-50150770f831b638-deps] --> crates/three-dimensional-reps/src/lib.rs:7:9
11.22 s
[gammaloop-crate-test-binaries-three-dimensional-reps-50150770f831b638-deps] |
11.22 s
[gammaloop-crate-test-binaries-three-dimensional-reps-50150770f831b638-deps] 6 | #[cfg(feature = "eval")]
11.22 s
[gammaloop-crate-test-binaries-three-dimensional-reps-50150770f831b638-deps] | ---------------- the item is gated behind the `eval` feature
11.22 s
[gammaloop-crate-test-binaries-three-dimensional-reps-50150770f831b638-deps] 7 | pub mod eval;
11.23 s
[gammaloop-crate-test-binaries-three-dimensional-reps-50150770f831b638-deps] | ^^^^
11.23 s
[gammaloop-crate-test-binaries-three-dimensional-reps-50150770f831b638-deps]
11.23 s
[gammaloop-crate-test-binaries-three-dimensional-reps-50150770f831b638-deps] error[E0433] : cannot find `eval` in `crate`
11.23 s
[gammaloop-crate-test-binaries-three-dimensional-reps-50150770f831b638-deps] --> crates/three-dimensional-reps/src/generation.rs:8052:30
11.23 s
[gammaloop-crate-test-binaries-three-dimensional-reps-50150770f831b638-deps] |
11.23 s
[gammaloop-crate-test-binaries-three-dimensional-reps-50150770f831b638-deps] 8052 | let contact = crate::eval::evaluate_expression(
11.23 s
[gammaloop-crate-test-binaries-three-dimensional-reps-50150770f831b638-deps] | ^^^^ could not find `eval` in the crate root
11.23 s
[gammaloop-crate-test-binaries-three-dimensional-reps-50150770f831b638-deps] |
11.23 s
[gammaloop-crate-test-binaries-three-dimensional-reps-50150770f831b638-deps] note : found an item that was configured out
11.23 s
[gammaloop-crate-test-binaries-three-dimensional-reps-50150770f831b638-deps] --> crates/three-dimensional-reps/src/lib.rs:7:9
11.23 s
[gammaloop-crate-test-binaries-three-dimensional-reps-50150770f831b638-deps] |
11.23 s
[gammaloop-crate-test-binaries-three-dimensional-reps-50150770f831b638-deps] 6 | #[cfg(feature = "eval")]
11.23 s
[gammaloop-crate-test-binaries-three-dimensional-reps-50150770f831b638-deps] | ---------------- the item is gated behind the `eval` feature
11.23 s
[gammaloop-crate-test-binaries-three-dimensional-reps-50150770f831b638-deps] 7 | pub mod eval;
11.23 s
[gammaloop-crate-test-binaries-three-dimensional-reps-50150770f831b638-deps] | ^^^^
11.23 s
[gammaloop-crate-test-binaries-three-dimensional-reps-50150770f831b638-deps]
11.23 s
[gammaloop-crate-test-binaries-three-dimensional-reps-50150770f831b638-deps] error[E0433] : cannot find `eval` in `crate`
11.23 s
[gammaloop-crate-test-binaries-three-dimensional-reps-50150770f831b638-deps] --> crates/three-dimensional-reps/src/generation.rs:8060:32
11.23 s
[gammaloop-crate-test-binaries-three-dimensional-reps-50150770f831b638-deps] |
11.23 s
[gammaloop-crate-test-binaries-three-dimensional-reps-50150770f831b638-deps] 8060 | let remainder = crate::eval::evaluate_expression(
11.23 s
[gammaloop-crate-test-binaries-three-dimensional-reps-50150770f831b638-deps] | ^^^^ could not find `eval` in the crate root
11.23 s
[gammaloop-crate-test-binaries-three-dimensional-reps-50150770f831b638-deps] |
11.23 s
[gammaloop-crate-test-binaries-three-dimensional-reps-50150770f831b638-deps] note : found an item that was configured out
11.23 s
[gammaloop-crate-test-binaries-three-dimensional-reps-50150770f831b638-deps] --> crates/three-dimensional-reps/src/lib.rs:7:9
11.23 s
[gammaloop-crate-test-binaries-three-dimensional-reps-50150770f831b638-deps] |
11.24 s
[gammaloop-crate-test-binaries-three-dimensional-reps-50150770f831b638-deps] 6 | #[cfg(feature = "eval")]
11.24 s
[gammaloop-crate-test-binaries-three-dimensional-reps-50150770f831b638-deps] | ---------------- the item is gated behind the `eval` feature
11.24 s
[gammaloop-crate-test-binaries-three-dimensional-reps-50150770f831b638-deps] 7 | pub mod eval;
11.24 s
[gammaloop-crate-test-binaries-three-dimensional-reps-50150770f831b638-deps] | ^^^^
11.24 s
[gammaloop-crate-test-binaries-three-dimensional-reps-50150770f831b638-deps]
11.24 s
[gammaloop-crate-test-binaries-three-dimensional-reps-50150770f831b638-deps] error[E0433] : cannot find `eval` in `crate`
11.24 s
[gammaloop-crate-test-binaries-three-dimensional-reps-50150770f831b638-deps] --> crates/three-dimensional-reps/src/generation.rs:8068:28
11.24 s
[gammaloop-crate-test-binaries-three-dimensional-reps-50150770f831b638-deps] |
11.24 s
[gammaloop-crate-test-binaries-three-dimensional-reps-50150770f831b638-deps] 8068 | let total = crate::eval::evaluate_expression(&powered, &expression, numerator, &input)
11.24 s
[gammaloop-crate-test-binaries-three-dimensional-reps-50150770f831b638-deps] | ^^^^ could not find `eval` in the crate root
11.24 s
[gammaloop-crate-test-binaries-three-dimensional-reps-50150770f831b638-deps] |
11.24 s
[gammaloop-crate-test-binaries-three-dimensional-reps-50150770f831b638-deps] note : found an item that was configured out
11.24 s
[gammaloop-crate-test-binaries-three-dimensional-reps-50150770f831b638-deps] --> crates/three-dimensional-reps/src/lib.rs:7:9
11.24 s
[gammaloop-crate-test-binaries-three-dimensional-reps-50150770f831b638-deps] |
11.24 s
[gammaloop-crate-test-binaries-three-dimensional-reps-50150770f831b638-deps] 6 | #[cfg(feature = "eval")]
11.24 s
[gammaloop-crate-test-binaries-three-dimensional-reps-50150770f831b638-deps] | ---------------- the item is gated behind the `eval` feature
11.24 s
[gammaloop-crate-test-binaries-three-dimensional-reps-50150770f831b638-deps] 7 | pub mod eval;
11.24 s
[gammaloop-crate-test-binaries-three-dimensional-reps-50150770f831b638-deps] | ^^^^
11.24 s
[gammaloop-crate-test-binaries-three-dimensional-reps-50150770f831b638-deps]
12.33 s
[gammaloop-crate-test-binaries-three-dimensional-reps-50150770f831b638-deps] For more information about this error, try `rustc --explain E0433`.
12.34 s
[gammaloop-crate-test-binaries-three-dimensional-reps-50150770f831b638-deps] error : could not compile `three-dimensional-reps` (lib test) due to 4 previous errors
12.55 s
Progress: 0 of 2 built (1 failed)
12.55 s
Failed to build gammaloop-crate-test-binaries-three-dimensional-reps-50150770f831b638-deps after 3.5s
12.55 s
error: Cannot build '/nix/store/jw4czjjdv1cc9jr1gsiygk91yx66v8ip-gammaloop-crate-test-binaries-three-dimensional-reps-50150770f831b638-deps-0.1.0.drv '.
12.55 s
Reason: builder failed with exit code 101 .
12.55 s
Output paths:
12.55 s
/nix/store/vf8ksab94faladqcwqcly6amf5fvpg1h-gammaloop-crate-test-binaries-three-dimensional-reps-50150770f831b638-deps-0.1.0
12.55 s
Last 74 log lines:
12.55 s
> Running phase: unpackPhase
12.55 s
> unpacking source archive /nix/store/s1ajjdsb6bzj5dvvg360rj0kxnvgb27s-source
12.55 s
> source root is source
12.55 s
> Running phase: patchPhase
12.55 s
> Executing configureCargoCommonVars
12.55 s
> copying cargo artifacts from /nix/store/71lg5z9qr6b69cp7v2y427r8blvhr0lh-gammaloop-crate-test-binaries-three-dimensional-reps-50150770f831b638-inputs/target to target
12.55 s
> will deep copy artifacts (instead of symlinking) as requested
12.55 s
> Running phase: updateAutotoolsGnuConfigScriptsPhase
12.55 s
> Running phase: configurePhase
12.55 s
> will append /build/source/.cargo-home/config.toml with contents of /nix/store/1sigmg52bb61pfngmk9k8wq5fz9r7bf1-vendor-cargo-deps/config.toml
12.55 s
> default configurePhase, nothing to do
12.55 s
> Running phase: buildPhase
12.55 s
> +++ command cargo --version
12.55 s
> cargo 1.97.0 (c980f4866 2026-06-30)
12.55 s
> +++ command cargo test --profile ci-optim --no-run --offline -p three-dimensional-reps --features three-dimensional-reps/serde
12.55 s
> Compiling three-dimensional-reps v0.1.0 (/build/source/crates/three-dimensional-reps)
12.55 s
> error[E0433] : cannot find `eval` in `crate`
12.55 s
> --> crates/three-dimensional-reps/src/generation.rs:8045:28
12.55 s
> |
12.55 s
> 8045 | let input = crate::eval::EvaluationInput {
12.55 s
> | ^^^^ could not find `eval` in the crate root
12.55 s
> |
12.55 s
> note : found an item that was configured out
12.55 s
> --> crates/three-dimensional-reps/src/lib.rs:7:9
12.55 s
> |
12.55 s
> 6 | #[cfg(feature = "eval")]
12.55 s
> | ---------------- the item is gated behind the `eval` feature
12.55 s
> 7 | pub mod eval;
12.55 s
> | ^^^^
12.55 s
>
12.55 s
> error[E0433] : cannot find `eval` in `crate`
12.55 s
> --> crates/three-dimensional-reps/src/generation.rs:8052:30
12.55 s
> |
12.55 s
> 8052 | let contact = crate::eval::evaluate_expression(
12.55 s
> | ^^^^ could not find `eval` in the crate root
12.55 s
> |
12.55 s
> note : found an item that was configured out
12.55 s
> --> crates/three-dimensional-reps/src/lib.rs:7:9
12.55 s
> |
12.55 s
> 6 | #[cfg(feature = "eval")]
12.55 s
> | ---------------- the item is gated behind the `eval` feature
12.55 s
> 7 | pub mod eval;
12.55 s
> | ^^^^
12.55 s
>
12.55 s
> error[E0433] : cannot find `eval` in `crate`
12.55 s
> --> crates/three-dimensional-reps/src/generation.rs:8060:32
12.55 s
> |
12.55 s
> 8060 | let remainder = crate::eval::evaluate_expression(
12.55 s
> | ^^^^ could not find `eval` in the crate root
12.55 s
> |
12.55 s
> note : found an item that was configured out
12.55 s
> --> crates/three-dimensional-reps/src/lib.rs:7:9
12.55 s
> |
12.55 s
> 6 | #[cfg(feature = "eval")]
12.55 s
> | ---------------- the item is gated behind the `eval` feature
12.55 s
> 7 | pub mod eval;
12.55 s
> | ^^^^
12.55 s
>
12.55 s
> error[E0433] : cannot find `eval` in `crate`
12.55 s
> --> crates/three-dimensional-reps/src/generation.rs:8068:28
12.55 s
> |
12.55 s
> 8068 | let total = crate::eval::evaluate_expression(&powered, &expression, numerator, &input)
12.55 s
> | ^^^^ could not find `eval` in the crate root
12.55 s
> |
12.55 s
> note : found an item that was configured out
12.55 s
> --> crates/three-dimensional-reps/src/lib.rs:7:9
12.55 s
> |
12.55 s
> 6 | #[cfg(feature = "eval")]
12.55 s
> | ---------------- the item is gated behind the `eval` feature
12.55 s
> 7 | pub mod eval;
12.55 s
> | ^^^^
12.55 s
>
12.55 s
> For more information about this error, try `rustc --explain E0433`.
12.55 s
> error : could not compile `three-dimensional-reps` (lib test) due to 4 previous errors
12.55 s
For full logs, run:
12.55 s
nix log /nix/store/jw4czjjdv1cc9jr1gsiygk91yx66v8ip-gammaloop-crate-test-binaries-three-dimensional-reps-50150770f831b638-deps-0.1.0.drv
12.55 s
error: Cannot build '/nix/store/hdrw9410pf7vbcdib4fnnha206nxa8ci-nix-ci-artifact-barrier-crate-test-binaries-three-dimensional-reps.drv '.
12.55 s
Reason: 1 dependency failed .
12.55 s
Output paths:
12.55 s
/nix/store/cag7br89rpacnd54b7zyzl9gwdr72kb7-nix-ci-artifact-barrier-crate-test-binaries-three-dimensional-reps
12.55 s
Build failed due to failed dependency
12.58 s
Build failed.