build packages.x86_64-linux.crate-test-binaries-three-dimensional-reps

Reproduce this run
Original Run
  1. 0.00 s $ /nix/store/9ypz3flqsrl5xl495mm8h645gadjsxi1-coreutils-9.11/bin/timeout --kill-after=15s 7200s /nix/store/23zk8sgzamrbmj1fday15szf7f2279s8-nix-2.34.7/bin/nix --extra-experimental-features nix-command --extra-experimental-features flakes --log-format internal-json build --no-link --print-out-paths git+https://github.com/alphal00p/gammaloop?ref=raised_energy_cff_wip&rev=568679e1dc0e12b5bbc800a45457d6a711abf74a&shallow=1#packages.x86_64-linux.crate-test-binaries-three-dimensional-reps --print-build-logs
  2. 0.31 s error (ignored): SQLite database '/var/cache/nix-ci-worker/eval-cache-v6/5a0a28588cf4967ee83cdafce2d2c04e0b19a8b4993c2fc53cda0d9272a50e31.sqlite' is busy
  3. 1.69 s
  4. 1.90 s Building /nix/store/jw4czjjdv1cc9jr1gsiygk91yx66v8ip-gammaloop-crate-test-binaries-three-dimensional-reps-50150770f831b638-deps-0.1.0.drv
  5. 1.96 s [gammaloop-crate-test-binaries-three-dimensional-reps-50150770f831b638-deps] Phase: unpackPhase
  6. 1.96 s [gammaloop-crate-test-binaries-three-dimensional-reps-50150770f831b638-deps] unpacking source archive /nix/store/s1ajjdsb6bzj5dvvg360rj0kxnvgb27s-source
  7. 1.97 s [gammaloop-crate-test-binaries-three-dimensional-reps-50150770f831b638-deps] source root is source
  8. 1.98 s [gammaloop-crate-test-binaries-three-dimensional-reps-50150770f831b638-deps] Phase: patchPhase
  9. 2.08 s [gammaloop-crate-test-binaries-three-dimensional-reps-50150770f831b638-deps] Executing configureCargoCommonVars
  10. 2.09 s [gammaloop-crate-test-binaries-three-dimensional-reps-50150770f831b638-deps] copying cargo artifacts from /nix/store/71lg5z9qr6b69cp7v2y427r8blvhr0lh-gammaloop-crate-test-binaries-three-dimensional-reps-50150770f831b638-inputs/target to target
  11. 2.09 s [gammaloop-crate-test-binaries-three-dimensional-reps-50150770f831b638-deps] will deep copy artifacts (instead of symlinking) as requested
  12. 2.80 s [gammaloop-crate-test-binaries-three-dimensional-reps-50150770f831b638-deps] Phase: updateAutotoolsGnuConfigScriptsPhase
  13. 2.83 s [gammaloop-crate-test-binaries-three-dimensional-reps-50150770f831b638-deps] Phase: configurePhase
  14. 2.83 s [gammaloop-crate-test-binaries-three-dimensional-reps-50150770f831b638-deps] will append /build/source/.cargo-home/config.toml with contents of /nix/store/1sigmg52bb61pfngmk9k8wq5fz9r7bf1-vendor-cargo-deps/config.toml
  15. 2.83 s [gammaloop-crate-test-binaries-three-dimensional-reps-50150770f831b638-deps] default configurePhase, nothing to do
  16. 2.83 s [gammaloop-crate-test-binaries-three-dimensional-reps-50150770f831b638-deps] Phase: buildPhase
  17. 2.84 s [gammaloop-crate-test-binaries-three-dimensional-reps-50150770f831b638-deps] +++ command cargo --version
  18. 2.84 s [gammaloop-crate-test-binaries-three-dimensional-reps-50150770f831b638-deps] cargo 1.97.0 (c980f4866 2026-06-30)
  19. 2.84 s [gammaloop-crate-test-binaries-three-dimensional-reps-50150770f831b638-deps] +++ command cargo test --profile ci-optim --no-run --offline -p three-dimensional-reps --features three-dimensional-reps/serde
  20. 3.12 s [gammaloop-crate-test-binaries-three-dimensional-reps-50150770f831b638-deps] Compiling three-dimensional-reps v0.1.0 (/build/source/crates/three-dimensional-reps)
  21. 3.26 s [gammaloop-crate-test-binaries-three-dimensional-reps-50150770f831b638-deps] error[E0433]: cannot find `eval` in `crate`
  22. 3.26 s [gammaloop-crate-test-binaries-three-dimensional-reps-50150770f831b638-deps] --> crates/three-dimensional-reps/src/generation.rs:8045:28
  23. 3.26 s [gammaloop-crate-test-binaries-three-dimensional-reps-50150770f831b638-deps] |
  24. 3.26 s [gammaloop-crate-test-binaries-three-dimensional-reps-50150770f831b638-deps] 8045 | let input = crate::eval::EvaluationInput {
  25. 3.26 s [gammaloop-crate-test-binaries-three-dimensional-reps-50150770f831b638-deps] | ^^^^ could not find `eval` in the crate root
  26. 3.26 s [gammaloop-crate-test-binaries-three-dimensional-reps-50150770f831b638-deps] |
  27. 3.26 s [gammaloop-crate-test-binaries-three-dimensional-reps-50150770f831b638-deps] note: found an item that was configured out
  28. 3.26 s [gammaloop-crate-test-binaries-three-dimensional-reps-50150770f831b638-deps] --> crates/three-dimensional-reps/src/lib.rs:7:9
  29. 3.26 s [gammaloop-crate-test-binaries-three-dimensional-reps-50150770f831b638-deps] |
  30. 3.26 s [gammaloop-crate-test-binaries-three-dimensional-reps-50150770f831b638-deps] 6 | #[cfg(feature = "eval")]
  31. 3.26 s [gammaloop-crate-test-binaries-three-dimensional-reps-50150770f831b638-deps] | ---------------- the item is gated behind the `eval` feature
  32. 3.26 s [gammaloop-crate-test-binaries-three-dimensional-reps-50150770f831b638-deps] 7 | pub mod eval;
  33. 3.26 s [gammaloop-crate-test-binaries-three-dimensional-reps-50150770f831b638-deps] | ^^^^
  34. 3.26 s [gammaloop-crate-test-binaries-three-dimensional-reps-50150770f831b638-deps]
  35. 3.27 s [gammaloop-crate-test-binaries-three-dimensional-reps-50150770f831b638-deps] error[E0433]: cannot find `eval` in `crate`
  36. 3.27 s [gammaloop-crate-test-binaries-three-dimensional-reps-50150770f831b638-deps] --> crates/three-dimensional-reps/src/generation.rs:8052:30
  37. 3.27 s [gammaloop-crate-test-binaries-three-dimensional-reps-50150770f831b638-deps] |
  38. 3.27 s [gammaloop-crate-test-binaries-three-dimensional-reps-50150770f831b638-deps] 8052 | let contact = crate::eval::evaluate_expression(
  39. 3.27 s [gammaloop-crate-test-binaries-three-dimensional-reps-50150770f831b638-deps] | ^^^^ could not find `eval` in the crate root
  40. 3.27 s [gammaloop-crate-test-binaries-three-dimensional-reps-50150770f831b638-deps] |
  41. 3.27 s [gammaloop-crate-test-binaries-three-dimensional-reps-50150770f831b638-deps] note: found an item that was configured out
  42. 3.27 s [gammaloop-crate-test-binaries-three-dimensional-reps-50150770f831b638-deps] --> crates/three-dimensional-reps/src/lib.rs:7:9
  43. 3.27 s [gammaloop-crate-test-binaries-three-dimensional-reps-50150770f831b638-deps] |
  44. 3.27 s [gammaloop-crate-test-binaries-three-dimensional-reps-50150770f831b638-deps] 6 | #[cfg(feature = "eval")]
  45. 3.27 s [gammaloop-crate-test-binaries-three-dimensional-reps-50150770f831b638-deps] | ---------------- the item is gated behind the `eval` feature
  46. 3.27 s [gammaloop-crate-test-binaries-three-dimensional-reps-50150770f831b638-deps] 7 | pub mod eval;
  47. 3.27 s [gammaloop-crate-test-binaries-three-dimensional-reps-50150770f831b638-deps] | ^^^^
  48. 3.27 s [gammaloop-crate-test-binaries-three-dimensional-reps-50150770f831b638-deps]
  49. 3.27 s [gammaloop-crate-test-binaries-three-dimensional-reps-50150770f831b638-deps] error[E0433]: cannot find `eval` in `crate`
  50. 3.27 s [gammaloop-crate-test-binaries-three-dimensional-reps-50150770f831b638-deps] --> crates/three-dimensional-reps/src/generation.rs:8060:32
  51. 3.27 s [gammaloop-crate-test-binaries-three-dimensional-reps-50150770f831b638-deps] |
  52. 3.27 s [gammaloop-crate-test-binaries-three-dimensional-reps-50150770f831b638-deps] 8060 | let remainder = crate::eval::evaluate_expression(
  53. 3.27 s [gammaloop-crate-test-binaries-three-dimensional-reps-50150770f831b638-deps] | ^^^^ could not find `eval` in the crate root
  54. 3.27 s [gammaloop-crate-test-binaries-three-dimensional-reps-50150770f831b638-deps] |
  55. 3.27 s [gammaloop-crate-test-binaries-three-dimensional-reps-50150770f831b638-deps] note: found an item that was configured out
  56. 3.27 s [gammaloop-crate-test-binaries-three-dimensional-reps-50150770f831b638-deps] --> crates/three-dimensional-reps/src/lib.rs:7:9
  57. 3.27 s [gammaloop-crate-test-binaries-three-dimensional-reps-50150770f831b638-deps] |
  58. 3.27 s [gammaloop-crate-test-binaries-three-dimensional-reps-50150770f831b638-deps] 6 | #[cfg(feature = "eval")]
  59. 3.27 s [gammaloop-crate-test-binaries-three-dimensional-reps-50150770f831b638-deps] | ---------------- the item is gated behind the `eval` feature
  60. 3.27 s [gammaloop-crate-test-binaries-three-dimensional-reps-50150770f831b638-deps] 7 | pub mod eval;
  61. 3.27 s [gammaloop-crate-test-binaries-three-dimensional-reps-50150770f831b638-deps] | ^^^^
  62. 3.27 s [gammaloop-crate-test-binaries-three-dimensional-reps-50150770f831b638-deps]
  63. 3.28 s [gammaloop-crate-test-binaries-three-dimensional-reps-50150770f831b638-deps] error[E0433]: cannot find `eval` in `crate`
  64. 3.28 s [gammaloop-crate-test-binaries-three-dimensional-reps-50150770f831b638-deps] --> crates/three-dimensional-reps/src/generation.rs:8068:28
  65. 3.28 s [gammaloop-crate-test-binaries-three-dimensional-reps-50150770f831b638-deps] |
  66. 3.28 s [gammaloop-crate-test-binaries-three-dimensional-reps-50150770f831b638-deps] 8068 | let total = crate::eval::evaluate_expression(&powered, &expression, numerator, &input)
  67. 3.28 s [gammaloop-crate-test-binaries-three-dimensional-reps-50150770f831b638-deps] | ^^^^ could not find `eval` in the crate root
  68. 3.28 s [gammaloop-crate-test-binaries-three-dimensional-reps-50150770f831b638-deps] |
  69. 3.28 s [gammaloop-crate-test-binaries-three-dimensional-reps-50150770f831b638-deps] note: found an item that was configured out
  70. 3.28 s [gammaloop-crate-test-binaries-three-dimensional-reps-50150770f831b638-deps] --> crates/three-dimensional-reps/src/lib.rs:7:9
  71. 3.28 s [gammaloop-crate-test-binaries-three-dimensional-reps-50150770f831b638-deps] |
  72. 3.28 s [gammaloop-crate-test-binaries-three-dimensional-reps-50150770f831b638-deps] 6 | #[cfg(feature = "eval")]
  73. 3.28 s [gammaloop-crate-test-binaries-three-dimensional-reps-50150770f831b638-deps] | ---------------- the item is gated behind the `eval` feature
  74. 3.28 s [gammaloop-crate-test-binaries-three-dimensional-reps-50150770f831b638-deps] 7 | pub mod eval;
  75. 3.28 s [gammaloop-crate-test-binaries-three-dimensional-reps-50150770f831b638-deps] | ^^^^
  76. 3.28 s [gammaloop-crate-test-binaries-three-dimensional-reps-50150770f831b638-deps]
  77. 4.43 s [gammaloop-crate-test-binaries-three-dimensional-reps-50150770f831b638-deps] For more information about this error, try `rustc --explain E0433`.
  78. 4.44 s [gammaloop-crate-test-binaries-three-dimensional-reps-50150770f831b638-deps] error: could not compile `three-dimensional-reps` (lib test) due to 4 previous errors
  79. 4.65 s Progress: 0 of 2 built (1 failed)
  80. 4.65 s Failed to build gammaloop-crate-test-binaries-three-dimensional-reps-50150770f831b638-deps after 2.7s
  81. 4.65 s error: Cannot build '/nix/store/jw4czjjdv1cc9jr1gsiygk91yx66v8ip-gammaloop-crate-test-binaries-three-dimensional-reps-50150770f831b638-deps-0.1.0.drv'.
  82. 4.65 s Reason: builder failed with exit code 101.
  83. 4.65 s Output paths:
  84. 4.65 s /nix/store/vf8ksab94faladqcwqcly6amf5fvpg1h-gammaloop-crate-test-binaries-three-dimensional-reps-50150770f831b638-deps-0.1.0
  85. 4.65 s Last 74 log lines:
  86. 4.65 s > Running phase: unpackPhase
  87. 4.65 s > unpacking source archive /nix/store/s1ajjdsb6bzj5dvvg360rj0kxnvgb27s-source
  88. 4.65 s > source root is source
  89. 4.65 s > Running phase: patchPhase
  90. 4.65 s > Executing configureCargoCommonVars
  91. 4.65 s > copying cargo artifacts from /nix/store/71lg5z9qr6b69cp7v2y427r8blvhr0lh-gammaloop-crate-test-binaries-three-dimensional-reps-50150770f831b638-inputs/target to target
  92. 4.65 s > will deep copy artifacts (instead of symlinking) as requested
  93. 4.65 s > Running phase: updateAutotoolsGnuConfigScriptsPhase
  94. 4.65 s > Running phase: configurePhase
  95. 4.65 s > will append /build/source/.cargo-home/config.toml with contents of /nix/store/1sigmg52bb61pfngmk9k8wq5fz9r7bf1-vendor-cargo-deps/config.toml
  96. 4.65 s > default configurePhase, nothing to do
  97. 4.65 s > Running phase: buildPhase
  98. 4.65 s > +++ command cargo --version
  99. 4.65 s > cargo 1.97.0 (c980f4866 2026-06-30)
  100. 4.65 s > +++ command cargo test --profile ci-optim --no-run --offline -p three-dimensional-reps --features three-dimensional-reps/serde
  101. 4.65 s > Compiling three-dimensional-reps v0.1.0 (/build/source/crates/three-dimensional-reps)
  102. 4.65 s > error[E0433]: cannot find `eval` in `crate`
  103. 4.65 s > --> crates/three-dimensional-reps/src/generation.rs:8045:28
  104. 4.65 s > |
  105. 4.65 s > 8045 | let input = crate::eval::EvaluationInput {
  106. 4.65 s > | ^^^^ could not find `eval` in the crate root
  107. 4.65 s > |
  108. 4.65 s > note: found an item that was configured out
  109. 4.65 s > --> crates/three-dimensional-reps/src/lib.rs:7:9
  110. 4.65 s > |
  111. 4.65 s > 6 | #[cfg(feature = "eval")]
  112. 4.65 s > | ---------------- the item is gated behind the `eval` feature
  113. 4.65 s > 7 | pub mod eval;
  114. 4.65 s > | ^^^^
  115. 4.65 s >
  116. 4.65 s > error[E0433]: cannot find `eval` in `crate`
  117. 4.65 s > --> crates/three-dimensional-reps/src/generation.rs:8052:30
  118. 4.65 s > |
  119. 4.65 s > 8052 | let contact = crate::eval::evaluate_expression(
  120. 4.65 s > | ^^^^ could not find `eval` in the crate root
  121. 4.65 s > |
  122. 4.65 s > note: found an item that was configured out
  123. 4.65 s > --> crates/three-dimensional-reps/src/lib.rs:7:9
  124. 4.65 s > |
  125. 4.65 s > 6 | #[cfg(feature = "eval")]
  126. 4.65 s > | ---------------- the item is gated behind the `eval` feature
  127. 4.65 s > 7 | pub mod eval;
  128. 4.65 s > | ^^^^
  129. 4.65 s >
  130. 4.65 s > error[E0433]: cannot find `eval` in `crate`
  131. 4.65 s > --> crates/three-dimensional-reps/src/generation.rs:8060:32
  132. 4.65 s > |
  133. 4.65 s > 8060 | let remainder = crate::eval::evaluate_expression(
  134. 4.65 s > | ^^^^ could not find `eval` in the crate root
  135. 4.65 s > |
  136. 4.65 s > note: found an item that was configured out
  137. 4.65 s > --> crates/three-dimensional-reps/src/lib.rs:7:9
  138. 4.65 s > |
  139. 4.65 s > 6 | #[cfg(feature = "eval")]
  140. 4.65 s > | ---------------- the item is gated behind the `eval` feature
  141. 4.65 s > 7 | pub mod eval;
  142. 4.65 s > | ^^^^
  143. 4.65 s >
  144. 4.65 s > error[E0433]: cannot find `eval` in `crate`
  145. 4.65 s > --> crates/three-dimensional-reps/src/generation.rs:8068:28
  146. 4.65 s > |
  147. 4.65 s > 8068 | let total = crate::eval::evaluate_expression(&powered, &expression, numerator, &input)
  148. 4.65 s > | ^^^^ could not find `eval` in the crate root
  149. 4.65 s > |
  150. 4.65 s > note: found an item that was configured out
  151. 4.65 s > --> crates/three-dimensional-reps/src/lib.rs:7:9
  152. 4.65 s > |
  153. 4.65 s > 6 | #[cfg(feature = "eval")]
  154. 4.65 s > | ---------------- the item is gated behind the `eval` feature
  155. 4.65 s > 7 | pub mod eval;
  156. 4.65 s > | ^^^^
  157. 4.65 s >
  158. 4.65 s > For more information about this error, try `rustc --explain E0433`.
  159. 4.65 s > error: could not compile `three-dimensional-reps` (lib test) due to 4 previous errors
  160. 4.65 s For full logs, run:
  161. 4.65 s nix log /nix/store/jw4czjjdv1cc9jr1gsiygk91yx66v8ip-gammaloop-crate-test-binaries-three-dimensional-reps-50150770f831b638-deps-0.1.0.drv
  162. 4.65 s error: Cannot build '/nix/store/hdrw9410pf7vbcdib4fnnha206nxa8ci-nix-ci-artifact-barrier-crate-test-binaries-three-dimensional-reps.drv'.
  163. 4.65 s Reason: 1 dependency failed.
  164. 4.65 s Output paths:
  165. 4.65 s /nix/store/cag7br89rpacnd54b7zyzl9gwdr72kb7-nix-ci-artifact-barrier-crate-test-binaries-three-dimensional-reps
  166. 4.65 s Build failed due to failed dependency
  167. 4.68 s Build failed.