build checks.x86_64-linux.gammaloop-nextest-binaries-core

Reproduce this run
Retry Run
  1. 0.00 s $ /nix/store/9ypz3flqsrl5xl495mm8h645gadjsxi1-coreutils-9.11/bin/timeout --kill-after=15s 7200s /nix/store/23zk8sgzamrbmj1fday15szf7f2279s8-nix-2.34.7/bin/nix --extra-experimental-features nix-command --extra-experimental-features flakes --log-format internal-json build --no-link --print-out-paths git+https://github.com/alphal00p/gammaloop?ref=raised_energy_cff_wip&rev=568679e1dc0e12b5bbc800a45457d6a711abf74a&shallow=1#checks.x86_64-linux.gammaloop-nextest-binaries-core --print-build-logs
  2. 0.34 s error (ignored): SQLite database '/var/cache/nix-ci-worker/eval-cache-v6/5a0a28588cf4967ee83cdafce2d2c04e0b19a8b4993c2fc53cda0d9272a50e31.sqlite' is busy
  3. 4.16 s
  4. 5.02 s Downloading cached gammaloop-crate-test-binaries-gammaloop-api-f0f952c3f8c3050c-inputs from https://cache.nix-ci.com
  5. 5.02 s Downloading cached gammaloop-crate-test-binaries-gammaloop-tracing-filter-31e37aec92971227-inputs from https://cache.nix-ci.com
  6. 5.02 s Downloading cached gammaloop-crate-test-binaries-gammalooprs-247ff5d63201fb2c-inputs from https://cache.nix-ci.com
  7. 5.16 s Building /nix/store/yjzirl57bq9sc0522g2wzwkc0j9gdza5-gammaloop-nextest-binaries-core-gammaloop-tracing-filter-macros-0.1.0.drv
  8. 5.24 s Building /nix/store/hfhr1vnsz0zwj9xfb244lm3kzkl3ndib-gammaloop-crate-test-binaries-three-dimensional-reps-50150770f831b638-inputs.drv
  9. 5.24 s [gammaloop-nextest-binaries-core-gammaloop-tracing-filter-macros] Phase: unpackPhase
  10. 5.24 s [gammaloop-nextest-binaries-core-gammaloop-tracing-filter-macros] unpacking source archive /nix/store/shvhcbmji2xmavcxyrk20w4h9992czkb-source
  11. 5.25 s [gammaloop-nextest-binaries-core-gammaloop-tracing-filter-macros] source root is source
  12. 5.26 s [gammaloop-nextest-binaries-core-gammaloop-tracing-filter-macros] Phase: patchPhase
  13. 5.39 s [gammaloop-nextest-binaries-core-gammaloop-tracing-filter-macros] copying cargo artifacts from /nix/store/dlh3rl0zih31g7l8hwjabhdf9wlzr0db-gammaloop-crate-test-binaries-gammaloop-tracing-filter-macros-1b17e1ec025c6580-inputs/target to target
  14. 7.91 s [gammaloop-nextest-binaries-core-gammaloop-tracing-filter-macros] Executing configureCargoCommonVars
  15. 7.92 s [gammaloop-nextest-binaries-core-gammaloop-tracing-filter-macros] decompressing cargo artifacts from /nix/store/7v5kj1x4cvs2ixg2cjqarhd57l0d9d3b-gammaloop-crate-test-binaries-gammaloop-tracing-filter-macros-1b17e1ec025c6580-deps-0.1.0/target.tar.zst to target
  16. 7.93 s [gammaloop-nextest-binaries-core-gammaloop-tracing-filter-macros] Phase: updateAutotoolsGnuConfigScriptsPhase
  17. 7.97 s [gammaloop-nextest-binaries-core-gammaloop-tracing-filter-macros] Phase: configurePhase
  18. 7.99 s [gammaloop-nextest-binaries-core-gammaloop-tracing-filter-macros] will append /build/source/.cargo-home/config.toml with contents of /nix/store/1sigmg52bb61pfngmk9k8wq5fz9r7bf1-vendor-cargo-deps/config.toml
  19. 7.99 s [gammaloop-nextest-binaries-core-gammaloop-tracing-filter-macros] default configurePhase, nothing to do
  20. 7.99 s [gammaloop-nextest-binaries-core-gammaloop-tracing-filter-macros] Phase: buildPhase
  21. 8.03 s [gammaloop-nextest-binaries-core-gammaloop-tracing-filter-macros] +++ command cargo --version
  22. 8.04 s [gammaloop-nextest-binaries-core-gammaloop-tracing-filter-macros] cargo 1.97.0 (c980f4866 2026-06-30)
  23. 8.08 s [gammaloop-nextest-binaries-core-gammaloop-tracing-filter-macros] +++ command cargo nextest --version
  24. 8.74 s [gammaloop-nextest-binaries-core-gammaloop-tracing-filter-macros] cargo-nextest 0.9.140
  25. 8.74 s [gammaloop-nextest-binaries-core-gammaloop-tracing-filter-macros] release: 0.9.140
  26. 8.74 s [gammaloop-nextest-binaries-core-gammaloop-tracing-filter-macros] host: x86_64-unknown-linux-gnu
  27. 8.75 s [gammaloop-nextest-binaries-core-gammaloop-tracing-filter-macros] +++ command cargo nextest archive --cargo-profile ci-optim --offline -p gammaloop-tracing-filter-macros -E 'package(gammaloop-tracing-filter-macros)' --profile ci_gammaloop --archive-file /nix/store/hb0pghxi3jsb4w5i459dvlq61icml1jy-gammaloop-nextest-binaries-core-gammaloop-tracing-filter-macros-0.1.0/gammaloop-nextest-core-gammaloop-tracing-filter-macros.tar.zst
  28. 10.69 s [gammaloop-crate-test-binaries-three-dimensional-reps-50150770f831b638-inputs:post-build] Uploading to the NixCI cache: /nix/store/71lg5z9qr6b69cp7v2y427r8blvhr0lh-gammaloop-crate-test-binaries-three-dimensional-reps-50150770f831b638-inputs
  29. 10.75 s [gammaloop-crate-test-binaries-three-dimensional-reps-50150770f831b638-inputs:post-build] warning: 'warn-short-path-literals' is deprecated, use 'lint-short-path-literals = ignore' instead
  30. 10.79 s [gammaloop-crate-test-binaries-three-dimensional-reps-50150770f831b638-inputs:post-build] copying 1 paths...
  31. 10.79 s [gammaloop-crate-test-binaries-three-dimensional-reps-50150770f831b638-inputs:post-build] copying path '/nix/store/71lg5z9qr6b69cp7v2y427r8blvhr0lh-gammaloop-crate-test-binaries-three-dimensional-reps-50150770f831b638-inputs' to 'https://cache.nix-ci.com'...
  32. 34.31 s Downloaded cached gammaloop-crate-test-binaries-gammaloop-tracing-filter-31e37aec92971227-inputs (1.6 GiB) in 29.2s
  33. 51.85 s Downloaded cached gammaloop-crate-test-binaries-gammalooprs-247ff5d63201fb2c-inputs (2.3 GiB) in 46.8s
  34. 66.32 s Downloaded cached gammaloop-crate-test-binaries-gammaloop-api-f0f952c3f8c3050c-inputs (3 GiB) in 1m01s
  35. 110.35 s [gammaloop-crate-test-binaries-three-dimensional-reps-50150770f831b638-inputs:post-build] warning: 'warn-short-path-literals' is deprecated, use 'lint-short-path-literals = ignore' instead
  36. 110.62 s [gammaloop-crate-test-binaries-three-dimensional-reps-50150770f831b638-inputs:post-build] copying 1 paths...
  37. 110.62 s [gammaloop-crate-test-binaries-three-dimensional-reps-50150770f831b638-inputs:post-build] copying path '/nix/store/hfhr1vnsz0zwj9xfb244lm3kzkl3ndib-gammaloop-crate-test-binaries-three-dimensional-reps-50150770f831b638-inputs.drv' to 'https://cache.nix-ci.com'...
  38. 110.78 s Uploaded gammaloop-crate-test-binaries-three-dimensional-reps-50150770f831b638-inputs in 1m40s
  39. 110.78 s Progress: 1 of 12 built (1 building), 0 of 6 downloaded from cache (3 downloading)
  40. 110.78 s Built gammaloop-crate-test-binaries-three-dimensional-reps-50150770f831b638-inputs in 1m45s
  41. 110.86 s Building /nix/store/jw4czjjdv1cc9jr1gsiygk91yx66v8ip-gammaloop-crate-test-binaries-three-dimensional-reps-50150770f831b638-deps-0.1.0.drv
  42. 110.86 s Progress: 1 of 11 built (2 building), 1 of 6 downloaded from cache (2 downloading)
  43. 110.86 s Progress: 1 of 11 built (2 building), 2 of 6 downloaded from cache (1 downloading)
  44. 110.86 s Progress: 1 of 11 built (2 building), 3 of 6 downloaded from cache
  45. 110.86 s [gammaloop-nextest-binaries-core-gammaloop-tracing-filter-macros] Finished `ci-optim` profile [optimized] target(s) in 0.18s
  46. 110.86 s [gammaloop-nextest-binaries-core-gammaloop-tracing-filter-macros] Archiving 1 binary and 1 standard library to /nix/store/hb0pghxi3jsb4w5i459dvlq61icml1jy-gammaloop-nextest-binaries-core-gammaloop-tracing-filter-macros-0.1.0/gammaloop-nextest-core-gammaloop-tracing-filter-macros.tar.zst
  47. 110.86 s [gammaloop-nextest-binaries-core-gammaloop-tracing-filter-macros] Archived 4 files to /nix/store/hb0pghxi3jsb4w5i459dvlq61icml1jy-gammaloop-nextest-binaries-core-gammaloop-tracing-filter-macros-0.1.0/gammaloop-nextest-core-gammaloop-tracing-filter-macros.tar.zst in 0.27s
  48. 110.86 s [gammaloop-nextest-binaries-core-gammaloop-tracing-filter-macros] Phase: installPhase
  49. 110.86 s [gammaloop-nextest-binaries-core-gammaloop-tracing-filter-macros] Phase: fixupPhase
  50. 110.86 s [gammaloop-nextest-binaries-core-gammaloop-tracing-filter-macros] shrinking RPATHs of ELF executables and libraries in /nix/store/hb0pghxi3jsb4w5i459dvlq61icml1jy-gammaloop-nextest-binaries-core-gammaloop-tracing-filter-macros-0.1.0
  51. 110.86 s [gammaloop-nextest-binaries-core-gammaloop-tracing-filter-macros] checking for references to /build/ in /nix/store/hb0pghxi3jsb4w5i459dvlq61icml1jy-gammaloop-nextest-binaries-core-gammaloop-tracing-filter-macros-0.1.0...
  52. 110.86 s [gammaloop-nextest-binaries-core-gammaloop-tracing-filter-macros] patching script interpreter paths in /nix/store/hb0pghxi3jsb4w5i459dvlq61icml1jy-gammaloop-nextest-binaries-core-gammaloop-tracing-filter-macros-0.1.0
  53. 110.86 s Downloading cached gammaloop-crate-test-binaries-gammaloop-api-f0f952c3f8c3050c-deps from https://cache.nix-ci.com
  54. 110.86 s Downloading cached gammaloop-crate-test-binaries-gammaloop-tracing-filter-31e37aec92971227-deps from https://cache.nix-ci.com
  55. 110.86 s Downloading cached gammaloop-crate-test-binaries-gammalooprs-247ff5d63201fb2c-deps from https://cache.nix-ci.com
  56. 111.05 s Downloaded cached gammaloop-crate-test-binaries-gammaloop-tracing-filter-31e37aec92971227-deps (5.8 MiB) in 188ms
  57. 111.05 s [gammaloop-nextest-binaries-core-gammaloop-tracing-filter-macros:post-build] Uploading to the NixCI cache: /nix/store/hb0pghxi3jsb4w5i459dvlq61icml1jy-gammaloop-nextest-binaries-core-gammaloop-tracing-filter-macros-0.1.0
  58. 111.14 s [gammaloop-nextest-binaries-core-gammaloop-tracing-filter-macros:post-build] warning: 'warn-short-path-literals' is deprecated, use 'lint-short-path-literals = ignore' instead
  59. 111.15 s [gammaloop-nextest-binaries-core-gammaloop-tracing-filter-macros:post-build] copying 1 paths...
  60. 111.15 s [gammaloop-nextest-binaries-core-gammaloop-tracing-filter-macros:post-build] copying path '/nix/store/hb0pghxi3jsb4w5i459dvlq61icml1jy-gammaloop-nextest-binaries-core-gammaloop-tracing-filter-macros-0.1.0' to 'https://cache.nix-ci.com'...
  61. 112.04 s [gammaloop-nextest-binaries-core-gammaloop-tracing-filter-macros:post-build] warning: 'warn-short-path-literals' is deprecated, use 'lint-short-path-literals = ignore' instead
  62. 112.36 s [gammaloop-nextest-binaries-core-gammaloop-tracing-filter-macros:post-build] copying 2 paths...
  63. 112.37 s [gammaloop-nextest-binaries-core-gammaloop-tracing-filter-macros:post-build] copying path '/nix/store/shvhcbmji2xmavcxyrk20w4h9992czkb-source' to 'https://cache.nix-ci.com'...
  64. 112.56 s Downloaded cached gammaloop-crate-test-binaries-gammaloop-api-f0f952c3f8c3050c-deps (93.1 MiB) in 1.7s
  65. 112.58 s [gammaloop-nextest-binaries-core-gammaloop-tracing-filter-macros:post-build] copying path '/nix/store/yjzirl57bq9sc0522g2wzwkc0j9gdza5-gammaloop-nextest-binaries-core-gammaloop-tracing-filter-macros-0.1.0.drv' to 'https://cache.nix-ci.com'...
  66. 112.77 s Uploaded gammaloop-nextest-binaries-core-gammaloop-tracing-filter-macros in 1.7s
  67. 112.77 s Progress: 2 of 12 built (1 building), 3 of 6 downloaded from cache (3 downloading)
  68. 112.77 s Built gammaloop-nextest-binaries-core-gammaloop-tracing-filter-macros in 1m47s
  69. 112.77 s Progress: 2 of 11 built (1 building), 4 of 6 downloaded from cache (2 downloading)
  70. 112.77 s Progress: 2 of 11 built (1 building), 5 of 6 downloaded from cache (1 downloading)
  71. 112.77 s [gammaloop-crate-test-binaries-three-dimensional-reps-50150770f831b638-deps] Phase: unpackPhase
  72. 112.77 s [gammaloop-crate-test-binaries-three-dimensional-reps-50150770f831b638-deps] unpacking source archive /nix/store/s1ajjdsb6bzj5dvvg360rj0kxnvgb27s-source
  73. 112.77 s [gammaloop-crate-test-binaries-three-dimensional-reps-50150770f831b638-deps] source root is source
  74. 112.77 s [gammaloop-crate-test-binaries-three-dimensional-reps-50150770f831b638-deps] Phase: patchPhase
  75. 112.77 s [gammaloop-crate-test-binaries-three-dimensional-reps-50150770f831b638-deps] Executing configureCargoCommonVars
  76. 112.77 s [gammaloop-crate-test-binaries-three-dimensional-reps-50150770f831b638-deps] copying cargo artifacts from /nix/store/71lg5z9qr6b69cp7v2y427r8blvhr0lh-gammaloop-crate-test-binaries-three-dimensional-reps-50150770f831b638-inputs/target to target
  77. 112.77 s [gammaloop-crate-test-binaries-three-dimensional-reps-50150770f831b638-deps] will deep copy artifacts (instead of symlinking) as requested
  78. 112.78 s Downloaded cached gammaloop-crate-test-binaries-gammalooprs-247ff5d63201fb2c-deps (117.5 MiB) in 1.9s
  79. 112.89 s Building /nix/store/c2r798vyf1a0vifc38jl48gv9cbicx28-gammaloop-nextest-binaries-core-gammaloop-api-0.1.0.drv
  80. 112.98 s Building /nix/store/wffgjgpgwl82kvvypasslsrjyd68wb7p-gammaloop-nextest-binaries-core-gammaloop-tracing-filter-0.1.0.drv
  81. 112.98 s Progress: 2 of 9 built (3 building), 6 of 6 downloaded from cache
  82. 112.98 s [gammaloop-nextest-binaries-core-gammaloop-api] Phase: unpackPhase
  83. 113.07 s Building /nix/store/ii3b0w0gs21ypmn0jci121kanbxww8fd-gammaloop-nextest-binaries-core-gammalooprs-0.1.0.drv
  84. 113.07 s [gammaloop-crate-test-binaries-three-dimensional-reps-50150770f831b638-deps] Phase: updateAutotoolsGnuConfigScriptsPhase
  85. 113.07 s [gammaloop-crate-test-binaries-three-dimensional-reps-50150770f831b638-deps] Phase: configurePhase
  86. 113.07 s [gammaloop-crate-test-binaries-three-dimensional-reps-50150770f831b638-deps] will append /build/source/.cargo-home/config.toml with contents of /nix/store/1sigmg52bb61pfngmk9k8wq5fz9r7bf1-vendor-cargo-deps/config.toml
  87. 113.07 s [gammaloop-crate-test-binaries-three-dimensional-reps-50150770f831b638-deps] default configurePhase, nothing to do
  88. 113.07 s [gammaloop-crate-test-binaries-three-dimensional-reps-50150770f831b638-deps] Phase: buildPhase
  89. 113.07 s [gammaloop-nextest-binaries-core-gammaloop-api] unpacking source archive /nix/store/92f08przlkbjrkjxn1ddmn2nn0zc842a-source
  90. 113.07 s [gammaloop-crate-test-binaries-three-dimensional-reps-50150770f831b638-deps] +++ command cargo --version
  91. 113.08 s [gammaloop-crate-test-binaries-three-dimensional-reps-50150770f831b638-deps] cargo 1.97.0 (c980f4866 2026-06-30)
  92. 113.08 s [gammaloop-crate-test-binaries-three-dimensional-reps-50150770f831b638-deps] +++ command cargo test --profile ci-optim --no-run --offline -p three-dimensional-reps --features three-dimensional-reps/serde
  93. 113.08 s [gammaloop-nextest-binaries-core-gammaloop-tracing-filter] Phase: unpackPhase
  94. 113.08 s [gammaloop-nextest-binaries-core-gammaloop-tracing-filter] unpacking source archive /nix/store/dswxnihpwd5f48mzmzxmh9s5ykzwdqcr-source
  95. 113.13 s [gammaloop-nextest-binaries-core-gammaloop-tracing-filter] source root is source
  96. 113.15 s [gammaloop-nextest-binaries-core-gammaloop-tracing-filter] Phase: patchPhase
  97. 113.15 s [gammaloop-nextest-binaries-core-gammalooprs] Phase: unpackPhase
  98. 113.15 s [gammaloop-nextest-binaries-core-gammalooprs] unpacking source archive /nix/store/r614z5fvfcqqnlylkk2033dxcn7vywpd-source
  99. 113.16 s [gammaloop-nextest-binaries-core-gammaloop-api] source root is source
  100. 113.18 s [gammaloop-nextest-binaries-core-gammaloop-api] Phase: patchPhase
  101. 113.29 s [gammaloop-nextest-binaries-core-gammalooprs] source root is source
  102. 113.29 s [gammaloop-nextest-binaries-core-gammaloop-tracing-filter] copying cargo artifacts from /nix/store/lrqyi3nmrf07zddkafn9qilj067gy5f6-gammaloop-crate-test-binaries-gammaloop-tracing-filter-31e37aec92971227-inputs/target to target
  103. 113.31 s [gammaloop-nextest-binaries-core-gammaloop-api] copying cargo artifacts from /nix/store/ljcp3i8k8dah00zw155a0w2mpfqp9sfq-gammaloop-crate-test-binaries-gammaloop-api-f0f952c3f8c3050c-inputs/target to target
  104. 113.31 s [gammaloop-nextest-binaries-core-gammalooprs] Phase: patchPhase
  105. 113.44 s [gammaloop-nextest-binaries-core-gammalooprs] copying cargo artifacts from /nix/store/fpfz9p19l7w80kji3dlmwcy8gpl3rfwi-gammaloop-crate-test-binaries-gammalooprs-247ff5d63201fb2c-inputs/target to target
  106. 113.64 s [gammaloop-crate-test-binaries-three-dimensional-reps-50150770f831b638-deps] Compiling three-dimensional-reps v0.1.0 (/build/source/crates/three-dimensional-reps)
  107. 113.91 s [gammaloop-crate-test-binaries-three-dimensional-reps-50150770f831b638-deps] error[E0433]: cannot find `eval` in `crate`
  108. 113.91 s [gammaloop-crate-test-binaries-three-dimensional-reps-50150770f831b638-deps] --> crates/three-dimensional-reps/src/generation.rs:8045:28
  109. 113.91 s [gammaloop-crate-test-binaries-three-dimensional-reps-50150770f831b638-deps] |
  110. 113.91 s [gammaloop-crate-test-binaries-three-dimensional-reps-50150770f831b638-deps] 8045 | let input = crate::eval::EvaluationInput {
  111. 113.91 s [gammaloop-crate-test-binaries-three-dimensional-reps-50150770f831b638-deps] | ^^^^ could not find `eval` in the crate root
  112. 113.91 s [gammaloop-crate-test-binaries-three-dimensional-reps-50150770f831b638-deps] |
  113. 113.91 s [gammaloop-crate-test-binaries-three-dimensional-reps-50150770f831b638-deps] note: found an item that was configured out
  114. 113.91 s [gammaloop-crate-test-binaries-three-dimensional-reps-50150770f831b638-deps] --> crates/three-dimensional-reps/src/lib.rs:7:9
  115. 113.91 s [gammaloop-crate-test-binaries-three-dimensional-reps-50150770f831b638-deps] |
  116. 113.91 s [gammaloop-crate-test-binaries-three-dimensional-reps-50150770f831b638-deps] 6 | #[cfg(feature = "eval")]
  117. 113.91 s [gammaloop-crate-test-binaries-three-dimensional-reps-50150770f831b638-deps] | ---------------- the item is gated behind the `eval` feature
  118. 113.91 s [gammaloop-crate-test-binaries-three-dimensional-reps-50150770f831b638-deps] 7 | pub mod eval;
  119. 113.91 s [gammaloop-crate-test-binaries-three-dimensional-reps-50150770f831b638-deps] | ^^^^
  120. 113.91 s [gammaloop-crate-test-binaries-three-dimensional-reps-50150770f831b638-deps]
  121. 113.92 s [gammaloop-crate-test-binaries-three-dimensional-reps-50150770f831b638-deps] error[E0433]: cannot find `eval` in `crate`
  122. 113.92 s [gammaloop-crate-test-binaries-three-dimensional-reps-50150770f831b638-deps] --> crates/three-dimensional-reps/src/generation.rs:8052:30
  123. 113.92 s [gammaloop-crate-test-binaries-three-dimensional-reps-50150770f831b638-deps] |
  124. 113.92 s [gammaloop-crate-test-binaries-three-dimensional-reps-50150770f831b638-deps] 8052 | let contact = crate::eval::evaluate_expression(
  125. 113.92 s [gammaloop-crate-test-binaries-three-dimensional-reps-50150770f831b638-deps] | ^^^^ could not find `eval` in the crate root
  126. 113.92 s [gammaloop-crate-test-binaries-three-dimensional-reps-50150770f831b638-deps] |
  127. 113.92 s [gammaloop-crate-test-binaries-three-dimensional-reps-50150770f831b638-deps] note: found an item that was configured out
  128. 113.92 s [gammaloop-crate-test-binaries-three-dimensional-reps-50150770f831b638-deps] --> crates/three-dimensional-reps/src/lib.rs:7:9
  129. 113.92 s [gammaloop-crate-test-binaries-three-dimensional-reps-50150770f831b638-deps] |
  130. 113.92 s [gammaloop-crate-test-binaries-three-dimensional-reps-50150770f831b638-deps] 6 | #[cfg(feature = "eval")]
  131. 113.92 s [gammaloop-crate-test-binaries-three-dimensional-reps-50150770f831b638-deps] | ---------------- the item is gated behind the `eval` feature
  132. 113.92 s [gammaloop-crate-test-binaries-three-dimensional-reps-50150770f831b638-deps] 7 | pub mod eval;
  133. 113.92 s [gammaloop-crate-test-binaries-three-dimensional-reps-50150770f831b638-deps] | ^^^^
  134. 113.92 s [gammaloop-crate-test-binaries-three-dimensional-reps-50150770f831b638-deps]
  135. 113.93 s [gammaloop-crate-test-binaries-three-dimensional-reps-50150770f831b638-deps] error[E0433]: cannot find `eval` in `crate`
  136. 113.93 s [gammaloop-crate-test-binaries-three-dimensional-reps-50150770f831b638-deps] --> crates/three-dimensional-reps/src/generation.rs:8060:32
  137. 113.93 s [gammaloop-crate-test-binaries-three-dimensional-reps-50150770f831b638-deps] |
  138. 113.93 s [gammaloop-crate-test-binaries-three-dimensional-reps-50150770f831b638-deps] 8060 | let remainder = crate::eval::evaluate_expression(
  139. 113.93 s [gammaloop-crate-test-binaries-three-dimensional-reps-50150770f831b638-deps] | ^^^^ could not find `eval` in the crate root
  140. 113.93 s [gammaloop-crate-test-binaries-three-dimensional-reps-50150770f831b638-deps] |
  141. 113.93 s [gammaloop-crate-test-binaries-three-dimensional-reps-50150770f831b638-deps] note: found an item that was configured out
  142. 113.93 s [gammaloop-crate-test-binaries-three-dimensional-reps-50150770f831b638-deps] --> crates/three-dimensional-reps/src/lib.rs:7:9
  143. 113.93 s [gammaloop-crate-test-binaries-three-dimensional-reps-50150770f831b638-deps] |
  144. 113.93 s [gammaloop-crate-test-binaries-three-dimensional-reps-50150770f831b638-deps] 6 | #[cfg(feature = "eval")]
  145. 113.93 s [gammaloop-crate-test-binaries-three-dimensional-reps-50150770f831b638-deps] | ---------------- the item is gated behind the `eval` feature
  146. 113.93 s [gammaloop-crate-test-binaries-three-dimensional-reps-50150770f831b638-deps] 7 | pub mod eval;
  147. 113.93 s [gammaloop-crate-test-binaries-three-dimensional-reps-50150770f831b638-deps] | ^^^^
  148. 113.93 s [gammaloop-crate-test-binaries-three-dimensional-reps-50150770f831b638-deps]
  149. 113.94 s [gammaloop-crate-test-binaries-three-dimensional-reps-50150770f831b638-deps] error[E0433]: cannot find `eval` in `crate`
  150. 113.94 s [gammaloop-crate-test-binaries-three-dimensional-reps-50150770f831b638-deps] --> crates/three-dimensional-reps/src/generation.rs:8068:28
  151. 113.94 s [gammaloop-crate-test-binaries-three-dimensional-reps-50150770f831b638-deps] |
  152. 113.94 s [gammaloop-crate-test-binaries-three-dimensional-reps-50150770f831b638-deps] 8068 | let total = crate::eval::evaluate_expression(&powered, &expression, numerator, &input)
  153. 113.94 s [gammaloop-crate-test-binaries-three-dimensional-reps-50150770f831b638-deps] | ^^^^ could not find `eval` in the crate root
  154. 113.94 s [gammaloop-crate-test-binaries-three-dimensional-reps-50150770f831b638-deps] |
  155. 113.94 s [gammaloop-crate-test-binaries-three-dimensional-reps-50150770f831b638-deps] note: found an item that was configured out
  156. 113.94 s [gammaloop-crate-test-binaries-three-dimensional-reps-50150770f831b638-deps] --> crates/three-dimensional-reps/src/lib.rs:7:9
  157. 113.94 s [gammaloop-crate-test-binaries-three-dimensional-reps-50150770f831b638-deps] |
  158. 113.94 s [gammaloop-crate-test-binaries-three-dimensional-reps-50150770f831b638-deps] 6 | #[cfg(feature = "eval")]
  159. 113.94 s [gammaloop-crate-test-binaries-three-dimensional-reps-50150770f831b638-deps] | ---------------- the item is gated behind the `eval` feature
  160. 113.94 s [gammaloop-crate-test-binaries-three-dimensional-reps-50150770f831b638-deps] 7 | pub mod eval;
  161. 113.94 s [gammaloop-crate-test-binaries-three-dimensional-reps-50150770f831b638-deps] | ^^^^
  162. 113.94 s [gammaloop-crate-test-binaries-three-dimensional-reps-50150770f831b638-deps]
  163. 115.81 s [gammaloop-crate-test-binaries-three-dimensional-reps-50150770f831b638-deps] For more information about this error, try `rustc --explain E0433`.
  164. 115.83 s [gammaloop-crate-test-binaries-three-dimensional-reps-50150770f831b638-deps] error: could not compile `three-dimensional-reps` (lib test) due to 4 previous errors
  165. 116.12 s Progress: 2 of 8 built (3 building, 1 failed), 6 of 6 downloaded from cache
  166. 116.12 s Failed to build gammaloop-crate-test-binaries-three-dimensional-reps-50150770f831b638-deps after 5.2s
  167. 116.12 s error: Cannot build '/nix/store/jw4czjjdv1cc9jr1gsiygk91yx66v8ip-gammaloop-crate-test-binaries-three-dimensional-reps-50150770f831b638-deps-0.1.0.drv'.
  168. 116.12 s Reason: builder failed with exit code 101.
  169. 116.12 s Output paths:
  170. 116.12 s /nix/store/vf8ksab94faladqcwqcly6amf5fvpg1h-gammaloop-crate-test-binaries-three-dimensional-reps-50150770f831b638-deps-0.1.0
  171. 116.12 s Last 74 log lines:
  172. 116.12 s > Running phase: unpackPhase
  173. 116.12 s > unpacking source archive /nix/store/s1ajjdsb6bzj5dvvg360rj0kxnvgb27s-source
  174. 116.12 s > source root is source
  175. 116.12 s > Running phase: patchPhase
  176. 116.12 s > Executing configureCargoCommonVars
  177. 116.12 s > copying cargo artifacts from /nix/store/71lg5z9qr6b69cp7v2y427r8blvhr0lh-gammaloop-crate-test-binaries-three-dimensional-reps-50150770f831b638-inputs/target to target
  178. 116.12 s > will deep copy artifacts (instead of symlinking) as requested
  179. 116.12 s > Running phase: updateAutotoolsGnuConfigScriptsPhase
  180. 116.12 s > Running phase: configurePhase
  181. 116.12 s > will append /build/source/.cargo-home/config.toml with contents of /nix/store/1sigmg52bb61pfngmk9k8wq5fz9r7bf1-vendor-cargo-deps/config.toml
  182. 116.12 s > default configurePhase, nothing to do
  183. 116.12 s > Running phase: buildPhase
  184. 116.12 s > +++ command cargo --version
  185. 116.12 s > cargo 1.97.0 (c980f4866 2026-06-30)
  186. 116.12 s > +++ command cargo test --profile ci-optim --no-run --offline -p three-dimensional-reps --features three-dimensional-reps/serde
  187. 116.12 s > Compiling three-dimensional-reps v0.1.0 (/build/source/crates/three-dimensional-reps)
  188. 116.12 s > error[E0433]: cannot find `eval` in `crate`
  189. 116.12 s > --> crates/three-dimensional-reps/src/generation.rs:8045:28
  190. 116.12 s > |
  191. 116.12 s > 8045 | let input = crate::eval::EvaluationInput {
  192. 116.12 s > | ^^^^ could not find `eval` in the crate root
  193. 116.12 s > |
  194. 116.12 s > note: found an item that was configured out
  195. 116.12 s > --> crates/three-dimensional-reps/src/lib.rs:7:9
  196. 116.12 s > |
  197. 116.12 s > 6 | #[cfg(feature = "eval")]
  198. 116.12 s > | ---------------- the item is gated behind the `eval` feature
  199. 116.12 s > 7 | pub mod eval;
  200. 116.12 s > | ^^^^
  201. 116.12 s >
  202. 116.12 s > error[E0433]: cannot find `eval` in `crate`
  203. 116.12 s > --> crates/three-dimensional-reps/src/generation.rs:8052:30
  204. 116.12 s > |
  205. 116.12 s > 8052 | let contact = crate::eval::evaluate_expression(
  206. 116.12 s > | ^^^^ could not find `eval` in the crate root
  207. 116.12 s > |
  208. 116.12 s > note: found an item that was configured out
  209. 116.12 s > --> crates/three-dimensional-reps/src/lib.rs:7:9
  210. 116.12 s > |
  211. 116.12 s > 6 | #[cfg(feature = "eval")]
  212. 116.12 s > | ---------------- the item is gated behind the `eval` feature
  213. 116.12 s > 7 | pub mod eval;
  214. 116.12 s > | ^^^^
  215. 116.12 s >
  216. 116.12 s > error[E0433]: cannot find `eval` in `crate`
  217. 116.12 s > --> crates/three-dimensional-reps/src/generation.rs:8060:32
  218. 116.12 s > |
  219. 116.12 s > 8060 | let remainder = crate::eval::evaluate_expression(
  220. 116.12 s > | ^^^^ could not find `eval` in the crate root
  221. 116.12 s > |
  222. 116.12 s > note: found an item that was configured out
  223. 116.12 s > --> crates/three-dimensional-reps/src/lib.rs:7:9
  224. 116.12 s > |
  225. 116.12 s > 6 | #[cfg(feature = "eval")]
  226. 116.12 s > | ---------------- the item is gated behind the `eval` feature
  227. 116.12 s > 7 | pub mod eval;
  228. 116.12 s > | ^^^^
  229. 116.12 s >
  230. 116.12 s > error[E0433]: cannot find `eval` in `crate`
  231. 116.12 s > --> crates/three-dimensional-reps/src/generation.rs:8068:28
  232. 116.12 s > |
  233. 116.12 s > 8068 | let total = crate::eval::evaluate_expression(&powered, &expression, numerator, &input)
  234. 116.12 s > | ^^^^ could not find `eval` in the crate root
  235. 116.12 s > |
  236. 116.12 s > note: found an item that was configured out
  237. 116.12 s > --> crates/three-dimensional-reps/src/lib.rs:7:9
  238. 116.12 s > |
  239. 116.12 s > 6 | #[cfg(feature = "eval")]
  240. 116.12 s > | ---------------- the item is gated behind the `eval` feature
  241. 116.12 s > 7 | pub mod eval;
  242. 116.12 s > | ^^^^
  243. 116.12 s >
  244. 116.12 s > For more information about this error, try `rustc --explain E0433`.
  245. 116.12 s > error: could not compile `three-dimensional-reps` (lib test) due to 4 previous errors
  246. 116.12 s For full logs, run:
  247. 116.12 s nix log /nix/store/jw4czjjdv1cc9jr1gsiygk91yx66v8ip-gammaloop-crate-test-binaries-three-dimensional-reps-50150770f831b638-deps-0.1.0.drv
  248. 116.12 s error: Cannot build '/nix/store/n64jh2l9fd4566xfkazhlvh31mb5nvcr-gammaloop-nextest-binaries-core-three-dimensional-reps-0.1.0.drv'.
  249. 116.12 s Reason: 1 dependency failed.
  250. 116.12 s Output paths:
  251. 116.12 s /nix/store/cknhk043civswak50spgn0xzjd0qbx21-gammaloop-nextest-binaries-core-three-dimensional-reps-0.1.0
  252. 116.12 s error: Build failed due to failed dependency
  253. 116.12 s error: Cannot build '/nix/store/w0gifhcb5lpmirzradwa1xs6bvpgvic0-gammaloop-nextest-binaries-core.drv'.
  254. 116.12 s Reason: 1 dependency failed.
  255. 116.12 s Output paths:
  256. 116.12 s /nix/store/jyjmfx2ildjcb45wwlvzhapyli1b4lfq-gammaloop-nextest-binaries-core
  257. 116.12 s warning: killing stray builder process 556049 ()...
  258. 116.12 s warning: killing stray builder process 559739 ()...
  259. 116.12 s warning: killing stray builder process 559680 ()...
  260. 116.43 s Built gammaloop-nextest-binaries-core-gammaloop-tracing-filter in 3.4s
  261. 116.43 s warning: killing stray builder process 556095 ()...
  262. 116.43 s warning: killing stray builder process 559926 ()...
  263. 116.66 s Built gammaloop-nextest-binaries-core-gammalooprs in 3.5s
  264. 116.66 s warning: killing stray builder process 556047 ()...
  265. 116.89 s Built gammaloop-nextest-binaries-core-gammaloop-api in 4.0s
  266. 116.90 s Build failed due to failed dependency
  267. 116.94 s Build failed.