build checks.x86_64-linux.gammaloop-nextest-binaries-core

Reproduce this run
Original Run
  1. 0.00 s $ /nix/store/9ypz3flqsrl5xl495mm8h645gadjsxi1-coreutils-9.11/bin/timeout --kill-after=15s 7200s /nix/store/23zk8sgzamrbmj1fday15szf7f2279s8-nix-2.34.7/bin/nix --extra-experimental-features nix-command --extra-experimental-features flakes --log-format internal-json build --no-link --print-out-paths git+https://github.com/alphal00p/gammaloop?ref=raised_energy_cff_wip&rev=568679e1dc0e12b5bbc800a45457d6a711abf74a&shallow=1#checks.x86_64-linux.gammaloop-nextest-binaries-core --print-build-logs
  2. 0.36 s error (ignored): SQLite database '/var/cache/nix-ci-worker/eval-cache-v6/5a0a28588cf4967ee83cdafce2d2c04e0b19a8b4993c2fc53cda0d9272a50e31.sqlite' is busy
  3. 4.11 s
  4. 4.42 s Building /nix/store/c2r798vyf1a0vifc38jl48gv9cbicx28-gammaloop-nextest-binaries-core-gammaloop-api-0.1.0.drv
  5. 4.47 s Building /nix/store/wffgjgpgwl82kvvypasslsrjyd68wb7p-gammaloop-nextest-binaries-core-gammaloop-tracing-filter-0.1.0.drv
  6. 4.54 s Building /nix/store/ii3b0w0gs21ypmn0jci121kanbxww8fd-gammaloop-nextest-binaries-core-gammalooprs-0.1.0.drv
  7. 4.62 s Building /nix/store/jw4czjjdv1cc9jr1gsiygk91yx66v8ip-gammaloop-crate-test-binaries-three-dimensional-reps-50150770f831b638-deps-0.1.0.drv
  8. 4.62 s [gammaloop-nextest-binaries-core-gammaloop-api] Phase: unpackPhase
  9. 4.62 s [gammaloop-nextest-binaries-core-gammaloop-api] unpacking source archive /nix/store/92f08przlkbjrkjxn1ddmn2nn0zc842a-source
  10. 4.62 s [gammaloop-nextest-binaries-core-gammaloop-api] source root is source
  11. 4.62 s [gammaloop-nextest-binaries-core-gammaloop-tracing-filter] Phase: unpackPhase
  12. 4.62 s [gammaloop-nextest-binaries-core-gammaloop-tracing-filter] unpacking source archive /nix/store/dswxnihpwd5f48mzmzxmh9s5ykzwdqcr-source
  13. 4.62 s [gammaloop-nextest-binaries-core-gammaloop-tracing-filter] source root is source
  14. 4.62 s [gammaloop-nextest-binaries-core-gammaloop-tracing-filter] Phase: patchPhase
  15. 4.62 s [gammaloop-nextest-binaries-core-gammalooprs] Phase: unpackPhase
  16. 4.62 s [gammaloop-nextest-binaries-core-gammaloop-api] Phase: patchPhase
  17. 4.62 s [gammaloop-nextest-binaries-core-gammalooprs] unpacking source archive /nix/store/r614z5fvfcqqnlylkk2033dxcn7vywpd-source
  18. 4.68 s [gammaloop-crate-test-binaries-three-dimensional-reps-50150770f831b638-deps] Phase: unpackPhase
  19. 4.69 s [gammaloop-crate-test-binaries-three-dimensional-reps-50150770f831b638-deps] unpacking source archive /nix/store/s1ajjdsb6bzj5dvvg360rj0kxnvgb27s-source
  20. 4.70 s [gammaloop-nextest-binaries-core-gammaloop-tracing-filter] copying cargo artifacts from /nix/store/lrqyi3nmrf07zddkafn9qilj067gy5f6-gammaloop-crate-test-binaries-gammaloop-tracing-filter-31e37aec92971227-inputs/target to target
  21. 4.71 s [gammaloop-crate-test-binaries-three-dimensional-reps-50150770f831b638-deps] source root is source
  22. 4.71 s [gammaloop-nextest-binaries-core-gammaloop-api] copying cargo artifacts from /nix/store/ljcp3i8k8dah00zw155a0w2mpfqp9sfq-gammaloop-crate-test-binaries-gammaloop-api-f0f952c3f8c3050c-inputs/target to target
  23. 4.72 s [gammaloop-crate-test-binaries-three-dimensional-reps-50150770f831b638-deps] Phase: patchPhase
  24. 4.72 s [gammaloop-nextest-binaries-core-gammalooprs] source root is source
  25. 4.74 s [gammaloop-nextest-binaries-core-gammalooprs] Phase: patchPhase
  26. 4.83 s [gammaloop-nextest-binaries-core-gammalooprs] copying cargo artifacts from /nix/store/fpfz9p19l7w80kji3dlmwcy8gpl3rfwi-gammaloop-crate-test-binaries-gammalooprs-247ff5d63201fb2c-inputs/target to target
  27. 4.83 s [gammaloop-crate-test-binaries-three-dimensional-reps-50150770f831b638-deps] Executing configureCargoCommonVars
  28. 4.84 s [gammaloop-crate-test-binaries-three-dimensional-reps-50150770f831b638-deps] copying cargo artifacts from /nix/store/71lg5z9qr6b69cp7v2y427r8blvhr0lh-gammaloop-crate-test-binaries-three-dimensional-reps-50150770f831b638-inputs/target to target
  29. 4.84 s [gammaloop-crate-test-binaries-three-dimensional-reps-50150770f831b638-deps] will deep copy artifacts (instead of symlinking) as requested
  30. 6.34 s [gammaloop-crate-test-binaries-three-dimensional-reps-50150770f831b638-deps] Phase: updateAutotoolsGnuConfigScriptsPhase
  31. 6.38 s [gammaloop-crate-test-binaries-three-dimensional-reps-50150770f831b638-deps] Phase: configurePhase
  32. 6.38 s [gammaloop-crate-test-binaries-three-dimensional-reps-50150770f831b638-deps] will append /build/source/.cargo-home/config.toml with contents of /nix/store/1sigmg52bb61pfngmk9k8wq5fz9r7bf1-vendor-cargo-deps/config.toml
  33. 6.38 s [gammaloop-crate-test-binaries-three-dimensional-reps-50150770f831b638-deps] default configurePhase, nothing to do
  34. 6.38 s [gammaloop-crate-test-binaries-three-dimensional-reps-50150770f831b638-deps] Phase: buildPhase
  35. 6.39 s [gammaloop-crate-test-binaries-three-dimensional-reps-50150770f831b638-deps] +++ command cargo --version
  36. 6.39 s [gammaloop-crate-test-binaries-three-dimensional-reps-50150770f831b638-deps] cargo 1.97.0 (c980f4866 2026-06-30)
  37. 6.39 s [gammaloop-crate-test-binaries-three-dimensional-reps-50150770f831b638-deps] +++ command cargo test --profile ci-optim --no-run --offline -p three-dimensional-reps --features three-dimensional-reps/serde
  38. 6.77 s [gammaloop-nextest-binaries-core-gammaloop-tracing-filter] Executing configureCargoCommonVars
  39. 6.77 s [gammaloop-nextest-binaries-core-gammaloop-tracing-filter] decompressing cargo artifacts from /nix/store/hkialgfs0rf1qzg7fgd6vf1ki3npqdla-gammaloop-crate-test-binaries-gammaloop-tracing-filter-31e37aec92971227-deps-0.1.0/target.tar.zst to target
  40. 6.78 s [gammaloop-crate-test-binaries-three-dimensional-reps-50150770f831b638-deps] Compiling three-dimensional-reps v0.1.0 (/build/source/crates/three-dimensional-reps)
  41. 6.80 s [gammaloop-nextest-binaries-core-gammaloop-tracing-filter] Phase: updateAutotoolsGnuConfigScriptsPhase
  42. 6.83 s [gammaloop-nextest-binaries-core-gammaloop-tracing-filter] Phase: configurePhase
  43. 6.83 s [gammaloop-nextest-binaries-core-gammaloop-tracing-filter] will append /build/source/.cargo-home/config.toml with contents of /nix/store/1sigmg52bb61pfngmk9k8wq5fz9r7bf1-vendor-cargo-deps/config.toml
  44. 6.84 s [gammaloop-nextest-binaries-core-gammaloop-tracing-filter] default configurePhase, nothing to do
  45. 6.84 s [gammaloop-nextest-binaries-core-gammaloop-tracing-filter] Phase: buildPhase
  46. 6.84 s [gammaloop-nextest-binaries-core-gammaloop-tracing-filter] +++ command cargo --version
  47. 6.85 s [gammaloop-nextest-binaries-core-gammaloop-tracing-filter] cargo 1.97.0 (c980f4866 2026-06-30)
  48. 6.89 s [gammaloop-nextest-binaries-core-gammaloop-tracing-filter] +++ command cargo nextest --version
  49. 6.90 s [gammaloop-nextest-binaries-core-gammaloop-tracing-filter] cargo-nextest 0.9.140
  50. 6.90 s [gammaloop-nextest-binaries-core-gammaloop-tracing-filter] release: 0.9.140
  51. 6.90 s [gammaloop-nextest-binaries-core-gammaloop-tracing-filter] host: x86_64-unknown-linux-gnu
  52. 6.90 s [gammaloop-nextest-binaries-core-gammaloop-tracing-filter] +++ command cargo nextest archive --cargo-profile ci-optim --offline -p gammaloop-tracing-filter --features gammaloop-tracing-filter/clap,gammaloop-tracing-filter/symbolica -E 'package(gammaloop-tracing-filter)' --profile ci_gammaloop --archive-file /nix/store/iwg9lyvi06mhy42pwwgh49y7f17vqahf-gammaloop-nextest-binaries-core-gammaloop-tracing-filter-0.1.0/gammaloop-nextest-core-gammaloop-tracing-filter.tar.zst
  53. 6.97 s [gammaloop-crate-test-binaries-three-dimensional-reps-50150770f831b638-deps] error[E0433]: cannot find `eval` in `crate`
  54. 6.97 s [gammaloop-crate-test-binaries-three-dimensional-reps-50150770f831b638-deps] --> crates/three-dimensional-reps/src/generation.rs:8045:28
  55. 6.97 s [gammaloop-crate-test-binaries-three-dimensional-reps-50150770f831b638-deps] |
  56. 6.97 s [gammaloop-crate-test-binaries-three-dimensional-reps-50150770f831b638-deps] 8045 | let input = crate::eval::EvaluationInput {
  57. 6.97 s [gammaloop-crate-test-binaries-three-dimensional-reps-50150770f831b638-deps] | ^^^^ could not find `eval` in the crate root
  58. 6.97 s [gammaloop-crate-test-binaries-three-dimensional-reps-50150770f831b638-deps] |
  59. 6.97 s [gammaloop-crate-test-binaries-three-dimensional-reps-50150770f831b638-deps] note: found an item that was configured out
  60. 6.97 s [gammaloop-crate-test-binaries-three-dimensional-reps-50150770f831b638-deps] --> crates/three-dimensional-reps/src/lib.rs:7:9
  61. 6.97 s [gammaloop-crate-test-binaries-three-dimensional-reps-50150770f831b638-deps] |
  62. 6.97 s [gammaloop-crate-test-binaries-three-dimensional-reps-50150770f831b638-deps] 6 | #[cfg(feature = "eval")]
  63. 6.97 s [gammaloop-crate-test-binaries-three-dimensional-reps-50150770f831b638-deps] | ---------------- the item is gated behind the `eval` feature
  64. 6.97 s [gammaloop-crate-test-binaries-three-dimensional-reps-50150770f831b638-deps] 7 | pub mod eval;
  65. 6.97 s [gammaloop-crate-test-binaries-three-dimensional-reps-50150770f831b638-deps] | ^^^^
  66. 6.97 s [gammaloop-crate-test-binaries-three-dimensional-reps-50150770f831b638-deps]
  67. 6.97 s [gammaloop-crate-test-binaries-three-dimensional-reps-50150770f831b638-deps] error[E0433]: cannot find `eval` in `crate`
  68. 6.97 s [gammaloop-crate-test-binaries-three-dimensional-reps-50150770f831b638-deps] --> crates/three-dimensional-reps/src/generation.rs:8052:30
  69. 6.97 s [gammaloop-crate-test-binaries-three-dimensional-reps-50150770f831b638-deps] |
  70. 6.97 s [gammaloop-crate-test-binaries-three-dimensional-reps-50150770f831b638-deps] 8052 | let contact = crate::eval::evaluate_expression(
  71. 6.97 s [gammaloop-crate-test-binaries-three-dimensional-reps-50150770f831b638-deps] | ^^^^ could not find `eval` in the crate root
  72. 6.97 s [gammaloop-crate-test-binaries-three-dimensional-reps-50150770f831b638-deps] |
  73. 6.97 s [gammaloop-crate-test-binaries-three-dimensional-reps-50150770f831b638-deps] note: found an item that was configured out
  74. 6.97 s [gammaloop-crate-test-binaries-three-dimensional-reps-50150770f831b638-deps] --> crates/three-dimensional-reps/src/lib.rs:7:9
  75. 6.97 s [gammaloop-crate-test-binaries-three-dimensional-reps-50150770f831b638-deps] |
  76. 6.97 s [gammaloop-crate-test-binaries-three-dimensional-reps-50150770f831b638-deps] 6 | #[cfg(feature = "eval")]
  77. 6.97 s [gammaloop-crate-test-binaries-three-dimensional-reps-50150770f831b638-deps] | ---------------- the item is gated behind the `eval` feature
  78. 6.97 s [gammaloop-crate-test-binaries-three-dimensional-reps-50150770f831b638-deps] 7 | pub mod eval;
  79. 6.97 s [gammaloop-crate-test-binaries-three-dimensional-reps-50150770f831b638-deps] | ^^^^
  80. 6.97 s [gammaloop-crate-test-binaries-three-dimensional-reps-50150770f831b638-deps]
  81. 6.98 s [gammaloop-crate-test-binaries-three-dimensional-reps-50150770f831b638-deps] error[E0433]: cannot find `eval` in `crate`
  82. 6.98 s [gammaloop-crate-test-binaries-three-dimensional-reps-50150770f831b638-deps] --> crates/three-dimensional-reps/src/generation.rs:8060:32
  83. 6.98 s [gammaloop-crate-test-binaries-three-dimensional-reps-50150770f831b638-deps] |
  84. 6.98 s [gammaloop-crate-test-binaries-three-dimensional-reps-50150770f831b638-deps] 8060 | let remainder = crate::eval::evaluate_expression(
  85. 6.98 s [gammaloop-crate-test-binaries-three-dimensional-reps-50150770f831b638-deps] | ^^^^ could not find `eval` in the crate root
  86. 6.98 s [gammaloop-crate-test-binaries-three-dimensional-reps-50150770f831b638-deps] |
  87. 6.98 s [gammaloop-crate-test-binaries-three-dimensional-reps-50150770f831b638-deps] note: found an item that was configured out
  88. 6.98 s [gammaloop-crate-test-binaries-three-dimensional-reps-50150770f831b638-deps] --> crates/three-dimensional-reps/src/lib.rs:7:9
  89. 6.98 s [gammaloop-crate-test-binaries-three-dimensional-reps-50150770f831b638-deps] |
  90. 6.98 s [gammaloop-crate-test-binaries-three-dimensional-reps-50150770f831b638-deps] 6 | #[cfg(feature = "eval")]
  91. 6.98 s [gammaloop-crate-test-binaries-three-dimensional-reps-50150770f831b638-deps] | ---------------- the item is gated behind the `eval` feature
  92. 6.98 s [gammaloop-crate-test-binaries-three-dimensional-reps-50150770f831b638-deps] 7 | pub mod eval;
  93. 6.98 s [gammaloop-crate-test-binaries-three-dimensional-reps-50150770f831b638-deps] | ^^^^
  94. 6.98 s [gammaloop-crate-test-binaries-three-dimensional-reps-50150770f831b638-deps]
  95. 6.99 s [gammaloop-crate-test-binaries-three-dimensional-reps-50150770f831b638-deps] error[E0433]: cannot find `eval` in `crate`
  96. 6.99 s [gammaloop-crate-test-binaries-three-dimensional-reps-50150770f831b638-deps] --> crates/three-dimensional-reps/src/generation.rs:8068:28
  97. 6.99 s [gammaloop-crate-test-binaries-three-dimensional-reps-50150770f831b638-deps] |
  98. 6.99 s [gammaloop-crate-test-binaries-three-dimensional-reps-50150770f831b638-deps] 8068 | let total = crate::eval::evaluate_expression(&powered, &expression, numerator, &input)
  99. 6.99 s [gammaloop-crate-test-binaries-three-dimensional-reps-50150770f831b638-deps] | ^^^^ could not find `eval` in the crate root
  100. 6.99 s [gammaloop-crate-test-binaries-three-dimensional-reps-50150770f831b638-deps] |
  101. 6.99 s [gammaloop-crate-test-binaries-three-dimensional-reps-50150770f831b638-deps] note: found an item that was configured out
  102. 6.99 s [gammaloop-crate-test-binaries-three-dimensional-reps-50150770f831b638-deps] --> crates/three-dimensional-reps/src/lib.rs:7:9
  103. 6.99 s [gammaloop-crate-test-binaries-three-dimensional-reps-50150770f831b638-deps] |
  104. 6.99 s [gammaloop-crate-test-binaries-three-dimensional-reps-50150770f831b638-deps] 6 | #[cfg(feature = "eval")]
  105. 6.99 s [gammaloop-crate-test-binaries-three-dimensional-reps-50150770f831b638-deps] | ---------------- the item is gated behind the `eval` feature
  106. 6.99 s [gammaloop-crate-test-binaries-three-dimensional-reps-50150770f831b638-deps] 7 | pub mod eval;
  107. 6.99 s [gammaloop-crate-test-binaries-three-dimensional-reps-50150770f831b638-deps] | ^^^^
  108. 6.99 s [gammaloop-crate-test-binaries-three-dimensional-reps-50150770f831b638-deps]
  109. 7.18 s [gammaloop-nextest-binaries-core-gammalooprs] Executing configureCargoCommonVars
  110. 7.18 s [gammaloop-nextest-binaries-core-gammalooprs] decompressing cargo artifacts from /nix/store/63jq69chrxwnsdq74yycwxhfmizncsmm-gammaloop-crate-test-binaries-gammalooprs-247ff5d63201fb2c-deps-0.1.0/target.tar.zst to target
  111. 7.24 s [gammaloop-nextest-binaries-core-gammaloop-api] Executing configureCargoCommonVars
  112. 7.24 s [gammaloop-nextest-binaries-core-gammaloop-api] decompressing cargo artifacts from /nix/store/29g6fbqgjr2g91mvln6glczdqs8cf6cy-gammaloop-crate-test-binaries-gammaloop-api-f0f952c3f8c3050c-deps-0.1.0/target.tar.zst to target
  113. 7.65 s [gammaloop-nextest-binaries-core-gammaloop-api] Phase: updateAutotoolsGnuConfigScriptsPhase
  114. 7.70 s [gammaloop-nextest-binaries-core-gammaloop-api] Phase: configurePhase
  115. 7.70 s [gammaloop-nextest-binaries-core-gammaloop-api] will append /build/source/.cargo-home/config.toml with contents of /nix/store/1sigmg52bb61pfngmk9k8wq5fz9r7bf1-vendor-cargo-deps/config.toml
  116. 7.70 s [gammaloop-nextest-binaries-core-gammaloop-api] default configurePhase, nothing to do
  117. 7.71 s [gammaloop-nextest-binaries-core-gammaloop-api] Phase: buildPhase
  118. 7.71 s [gammaloop-nextest-binaries-core-gammaloop-api] +++ command cargo --version
  119. 7.71 s [gammaloop-nextest-binaries-core-gammaloop-api] cargo 1.97.0 (c980f4866 2026-06-30)
  120. 7.72 s [gammaloop-nextest-binaries-core-gammalooprs] Phase: updateAutotoolsGnuConfigScriptsPhase
  121. 7.74 s [gammaloop-nextest-binaries-core-gammaloop-tracing-filter] Finished `ci-optim` profile [optimized] target(s) in 0.32s
  122. 7.76 s [gammaloop-nextest-binaries-core-gammalooprs] Phase: configurePhase
  123. 7.76 s [gammaloop-nextest-binaries-core-gammaloop-api] +++ command cargo nextest --version
  124. 7.76 s [gammaloop-nextest-binaries-core-gammalooprs] will append /build/source/.cargo-home/config.toml with contents of /nix/store/1sigmg52bb61pfngmk9k8wq5fz9r7bf1-vendor-cargo-deps/config.toml
  125. 7.76 s [gammaloop-nextest-binaries-core-gammalooprs] default configurePhase, nothing to do
  126. 7.77 s [gammaloop-nextest-binaries-core-gammalooprs] Phase: buildPhase
  127. 7.77 s [gammaloop-nextest-binaries-core-gammalooprs] +++ command cargo --version
  128. 7.77 s [gammaloop-nextest-binaries-core-gammaloop-api] cargo-nextest 0.9.140
  129. 7.77 s [gammaloop-nextest-binaries-core-gammaloop-api] release: 0.9.140
  130. 7.77 s [gammaloop-nextest-binaries-core-gammaloop-api] host: x86_64-unknown-linux-gnu
  131. 7.77 s [gammaloop-nextest-binaries-core-gammaloop-api] +++ command cargo nextest archive --cargo-profile ci-optim --offline -p gammaloop-api -E 'package(gammaloop-api)' --profile ci_gammaloop --archive-file /nix/store/981hrchm1id5zwypkrbhh5ij656rpi05-gammaloop-nextest-binaries-core-gammaloop-api-0.1.0/gammaloop-nextest-core-gammaloop-api.tar.zst
  132. 7.77 s [gammaloop-nextest-binaries-core-gammalooprs] cargo 1.97.0 (c980f4866 2026-06-30)
  133. 7.82 s [gammaloop-nextest-binaries-core-gammalooprs] +++ command cargo nextest --version
  134. 7.83 s [gammaloop-nextest-binaries-core-gammalooprs] cargo-nextest 0.9.140
  135. 7.83 s [gammaloop-nextest-binaries-core-gammalooprs] release: 0.9.140
  136. 7.83 s [gammaloop-nextest-binaries-core-gammalooprs] host: x86_64-unknown-linux-gnu
  137. 7.83 s [gammaloop-nextest-binaries-core-gammalooprs] +++ command cargo nextest archive --cargo-profile ci-optim --offline -p gammalooprs -E 'package(gammalooprs)' --profile ci_gammaloop --archive-file /nix/store/0n5wrkz7pwavwc1wrpn9awrnx7jwjsvc-gammaloop-nextest-binaries-core-gammalooprs-0.1.0/gammaloop-nextest-core-gammalooprs.tar.zst
  138. 7.87 s [gammaloop-nextest-binaries-core-gammaloop-tracing-filter] warning: the following packages contain code that will be rejected by a future version of Rust: proc-macro-error2 v2.0.1
  139. 7.87 s [gammaloop-nextest-binaries-core-gammaloop-tracing-filter] note: to see what the problems were, use the option `--future-incompat-report`, or run `cargo report future-incompatibilities --id 1`
  140. 7.90 s [gammaloop-nextest-binaries-core-gammaloop-tracing-filter] Archiving 1 binary, 1 linked path, and 1 standard library to /nix/store/iwg9lyvi06mhy42pwwgh49y7f17vqahf-gammaloop-nextest-binaries-core-gammaloop-tracing-filter-0.1.0/gammaloop-nextest-core-gammaloop-tracing-filter.tar.zst
  141. 8.34 s [gammaloop-nextest-binaries-core-gammaloop-tracing-filter] Archived 7 files to /nix/store/iwg9lyvi06mhy42pwwgh49y7f17vqahf-gammaloop-nextest-binaries-core-gammaloop-tracing-filter-0.1.0/gammaloop-nextest-core-gammaloop-tracing-filter.tar.zst in 0.43s
  142. 8.35 s [gammaloop-nextest-binaries-core-gammaloop-tracing-filter] Phase: installPhase
  143. 8.35 s [gammaloop-nextest-binaries-core-gammaloop-tracing-filter] Phase: fixupPhase
  144. 8.36 s [gammaloop-nextest-binaries-core-gammaloop-tracing-filter] shrinking RPATHs of ELF executables and libraries in /nix/store/iwg9lyvi06mhy42pwwgh49y7f17vqahf-gammaloop-nextest-binaries-core-gammaloop-tracing-filter-0.1.0
  145. 8.37 s [gammaloop-nextest-binaries-core-gammaloop-tracing-filter] checking for references to /build/ in /nix/store/iwg9lyvi06mhy42pwwgh49y7f17vqahf-gammaloop-nextest-binaries-core-gammaloop-tracing-filter-0.1.0...
  146. 8.38 s [gammaloop-nextest-binaries-core-gammaloop-tracing-filter] patching script interpreter paths in /nix/store/iwg9lyvi06mhy42pwwgh49y7f17vqahf-gammaloop-nextest-binaries-core-gammaloop-tracing-filter-0.1.0
  147. 8.68 s [gammaloop-nextest-binaries-core-gammaloop-tracing-filter:post-build] Uploading to the NixCI cache: /nix/store/iwg9lyvi06mhy42pwwgh49y7f17vqahf-gammaloop-nextest-binaries-core-gammaloop-tracing-filter-0.1.0
  148. 8.72 s [gammaloop-nextest-binaries-core-gammaloop-tracing-filter:post-build] warning: 'warn-short-path-literals' is deprecated, use 'lint-short-path-literals = ignore' instead
  149. 8.73 s [gammaloop-nextest-binaries-core-gammaloop-tracing-filter:post-build] copying 1 paths...
  150. 8.73 s [gammaloop-nextest-binaries-core-gammaloop-tracing-filter:post-build] copying path '/nix/store/iwg9lyvi06mhy42pwwgh49y7f17vqahf-gammaloop-nextest-binaries-core-gammaloop-tracing-filter-0.1.0' to 'https://cache.nix-ci.com'...
  151. 11.95 s [gammaloop-nextest-binaries-core-gammaloop-tracing-filter:post-build] warning: 'warn-short-path-literals' is deprecated, use 'lint-short-path-literals = ignore' instead
  152. 12.19 s [gammaloop-nextest-binaries-core-gammaloop-tracing-filter:post-build] copying 2 paths...
  153. 12.19 s [gammaloop-nextest-binaries-core-gammaloop-tracing-filter:post-build] copying path '/nix/store/dswxnihpwd5f48mzmzxmh9s5ykzwdqcr-source' to 'https://cache.nix-ci.com'...
  154. 13.01 s [gammaloop-nextest-binaries-core-gammaloop-tracing-filter:post-build] copying path '/nix/store/wffgjgpgwl82kvvypasslsrjyd68wb7p-gammaloop-nextest-binaries-core-gammaloop-tracing-filter-0.1.0.drv' to 'https://cache.nix-ci.com'...
  155. 13.17 s Uploaded gammaloop-nextest-binaries-core-gammaloop-tracing-filter in 4.5s
  156. 13.17 s Progress: 1 of 7 built (3 building)
  157. 13.17 s Built gammaloop-nextest-binaries-core-gammaloop-tracing-filter in 8.6s
  158. 13.17 s [gammaloop-crate-test-binaries-three-dimensional-reps-50150770f831b638-deps] For more information about this error, try `rustc --explain E0433`.
  159. 13.17 s [gammaloop-crate-test-binaries-three-dimensional-reps-50150770f831b638-deps] error: could not compile `three-dimensional-reps` (lib test) due to 4 previous errors
  160. 13.17 s [gammaloop-nextest-binaries-core-gammaloop-api] Finished `ci-optim` profile [optimized] target(s) in 0.28s
  161. 13.17 s [gammaloop-nextest-binaries-core-gammaloop-api] warning: the following packages contain code that will be rejected by a future version of Rust: proc-macro-error2 v2.0.1
  162. 13.17 s [gammaloop-nextest-binaries-core-gammaloop-api] note: to see what the problems were, use the option `--future-incompat-report`, or run `cargo report future-incompatibilities --id 1`
  163. 13.17 s [gammaloop-nextest-binaries-core-gammaloop-api] Archiving 4 binaries (including 1 non-test binary; 1 non-test binary filtered out), 1 build script output directory, 2 linked paths, and 1 standard library to /nix/store/981hrchm1id5zwypkrbhh5ij656rpi05-gammaloop-nextest-binaries-core-gammaloop-api-0.1.0/gammaloop-nextest-core-gammaloop-api.tar.zst
  164. 13.17 s [gammaloop-nextest-binaries-core-gammaloop-api] Archived 20 files to /nix/store/981hrchm1id5zwypkrbhh5ij656rpi05-gammaloop-nextest-binaries-core-gammaloop-api-0.1.0/gammaloop-nextest-core-gammaloop-api.tar.zst in 0.61s
  165. 13.17 s [gammaloop-nextest-binaries-core-gammaloop-api] Phase: installPhase
  166. 13.17 s [gammaloop-nextest-binaries-core-gammaloop-api] Phase: fixupPhase
  167. 13.17 s [gammaloop-nextest-binaries-core-gammaloop-api] shrinking RPATHs of ELF executables and libraries in /nix/store/981hrchm1id5zwypkrbhh5ij656rpi05-gammaloop-nextest-binaries-core-gammaloop-api-0.1.0
  168. 13.17 s [gammaloop-nextest-binaries-core-gammaloop-api] checking for references to /build/ in /nix/store/981hrchm1id5zwypkrbhh5ij656rpi05-gammaloop-nextest-binaries-core-gammaloop-api-0.1.0...
  169. 13.17 s [gammaloop-nextest-binaries-core-gammaloop-api] patching script interpreter paths in /nix/store/981hrchm1id5zwypkrbhh5ij656rpi05-gammaloop-nextest-binaries-core-gammaloop-api-0.1.0
  170. 13.17 s [gammaloop-nextest-binaries-core-gammalooprs] Finished `ci-optim` profile [optimized] target(s) in 0.27s
  171. 13.17 s [gammaloop-nextest-binaries-core-gammalooprs] warning: the following packages contain code that will be rejected by a future version of Rust: proc-macro-error2 v2.0.1
  172. 13.17 s [gammaloop-nextest-binaries-core-gammalooprs] note: to see what the problems were, use the option `--future-incompat-report`, or run `cargo report future-incompatibilities --id 1`
  173. 13.17 s [gammaloop-nextest-binaries-core-gammalooprs] Archiving 4 binaries (1 non-test binary filtered out), 1 build script output directory, 2 linked paths, and 1 standard library to /nix/store/0n5wrkz7pwavwc1wrpn9awrnx7jwjsvc-gammaloop-nextest-binaries-core-gammalooprs-0.1.0/gammaloop-nextest-core-gammalooprs.tar.zst
  174. 13.17 s [gammaloop-nextest-binaries-core-gammalooprs] Archived 18 files to /nix/store/0n5wrkz7pwavwc1wrpn9awrnx7jwjsvc-gammaloop-nextest-binaries-core-gammalooprs-0.1.0/gammaloop-nextest-core-gammalooprs.tar.zst in 0.61s
  175. 13.17 s [gammaloop-nextest-binaries-core-gammalooprs] Phase: installPhase
  176. 13.17 s [gammaloop-nextest-binaries-core-gammalooprs] Phase: fixupPhase
  177. 13.17 s [gammaloop-nextest-binaries-core-gammalooprs] shrinking RPATHs of ELF executables and libraries in /nix/store/0n5wrkz7pwavwc1wrpn9awrnx7jwjsvc-gammaloop-nextest-binaries-core-gammalooprs-0.1.0
  178. 13.17 s [gammaloop-nextest-binaries-core-gammalooprs] checking for references to /build/ in /nix/store/0n5wrkz7pwavwc1wrpn9awrnx7jwjsvc-gammaloop-nextest-binaries-core-gammalooprs-0.1.0...
  179. 13.17 s [gammaloop-nextest-binaries-core-gammalooprs] patching script interpreter paths in /nix/store/0n5wrkz7pwavwc1wrpn9awrnx7jwjsvc-gammaloop-nextest-binaries-core-gammalooprs-0.1.0
  180. 13.38 s Progress: 1 of 6 built (2 building, 1 failed)
  181. 13.38 s Failed to build gammaloop-crate-test-binaries-three-dimensional-reps-50150770f831b638-deps after 8.7s
  182. 13.71 s [gammaloop-nextest-binaries-core-gammaloop-api:post-build] Uploading to the NixCI cache: /nix/store/981hrchm1id5zwypkrbhh5ij656rpi05-gammaloop-nextest-binaries-core-gammaloop-api-0.1.0
  183. 13.75 s [gammaloop-nextest-binaries-core-gammaloop-api:post-build] warning: 'warn-short-path-literals' is deprecated, use 'lint-short-path-literals = ignore' instead
  184. 13.76 s [gammaloop-nextest-binaries-core-gammaloop-api:post-build] copying 1 paths...
  185. 13.76 s [gammaloop-nextest-binaries-core-gammaloop-api:post-build] copying path '/nix/store/981hrchm1id5zwypkrbhh5ij656rpi05-gammaloop-nextest-binaries-core-gammaloop-api-0.1.0' to 'https://cache.nix-ci.com'...
  186. 27.84 s [gammaloop-nextest-binaries-core-gammaloop-api:post-build] warning: 'warn-short-path-literals' is deprecated, use 'lint-short-path-literals = ignore' instead
  187. 28.05 s [gammaloop-nextest-binaries-core-gammaloop-api:post-build] copying 2 paths...
  188. 28.05 s [gammaloop-nextest-binaries-core-gammaloop-api:post-build] copying path '/nix/store/92f08przlkbjrkjxn1ddmn2nn0zc842a-source' to 'https://cache.nix-ci.com'...
  189. 43.96 s [gammaloop-nextest-binaries-core-gammaloop-api:post-build] copying path '/nix/store/c2r798vyf1a0vifc38jl48gv9cbicx28-gammaloop-nextest-binaries-core-gammaloop-api-0.1.0.drv' to 'https://cache.nix-ci.com'...
  190. 44.38 s Uploaded gammaloop-nextest-binaries-core-gammaloop-api in 30.6s
  191. 44.38 s Progress: 2 of 7 built (1 building, 1 failed)
  192. 44.38 s Built gammaloop-nextest-binaries-core-gammaloop-api in 39.9s
  193. 44.76 s [gammaloop-nextest-binaries-core-gammalooprs:post-build] Uploading to the NixCI cache: /nix/store/0n5wrkz7pwavwc1wrpn9awrnx7jwjsvc-gammaloop-nextest-binaries-core-gammalooprs-0.1.0
  194. 45.36 s [gammaloop-nextest-binaries-core-gammalooprs:post-build] warning: 'warn-short-path-literals' is deprecated, use 'lint-short-path-literals = ignore' instead
  195. 45.41 s [gammaloop-nextest-binaries-core-gammalooprs:post-build] copying 1 paths...
  196. 45.41 s [gammaloop-nextest-binaries-core-gammalooprs:post-build] copying path '/nix/store/0n5wrkz7pwavwc1wrpn9awrnx7jwjsvc-gammaloop-nextest-binaries-core-gammalooprs-0.1.0' to 'https://cache.nix-ci.com'...
  197. 63.51 s [gammaloop-nextest-binaries-core-gammalooprs:post-build] warning: 'warn-short-path-literals' is deprecated, use 'lint-short-path-literals = ignore' instead
  198. 63.80 s [gammaloop-nextest-binaries-core-gammalooprs:post-build] copying 2 paths...
  199. 63.80 s [gammaloop-nextest-binaries-core-gammalooprs:post-build] copying path '/nix/store/r614z5fvfcqqnlylkk2033dxcn7vywpd-source' to 'https://cache.nix-ci.com'...
  200. 78.79 s [gammaloop-nextest-binaries-core-gammalooprs:post-build] copying path '/nix/store/ii3b0w0gs21ypmn0jci121kanbxww8fd-gammaloop-nextest-binaries-core-gammalooprs-0.1.0.drv' to 'https://cache.nix-ci.com'...
  201. 78.96 s Uploaded gammaloop-nextest-binaries-core-gammalooprs in 34.2s
  202. 78.96 s Progress: 3 of 8 built (1 failed)
  203. 78.96 s Built gammaloop-nextest-binaries-core-gammalooprs in 1m14s
  204. 78.96 s error: Cannot build '/nix/store/jw4czjjdv1cc9jr1gsiygk91yx66v8ip-gammaloop-crate-test-binaries-three-dimensional-reps-50150770f831b638-deps-0.1.0.drv'.
  205. 78.96 s Reason: builder failed with exit code 101.
  206. 78.96 s Output paths:
  207. 78.96 s /nix/store/vf8ksab94faladqcwqcly6amf5fvpg1h-gammaloop-crate-test-binaries-three-dimensional-reps-50150770f831b638-deps-0.1.0
  208. 78.96 s Last 74 log lines:
  209. 78.96 s > Running phase: unpackPhase
  210. 78.96 s > unpacking source archive /nix/store/s1ajjdsb6bzj5dvvg360rj0kxnvgb27s-source
  211. 78.96 s > source root is source
  212. 78.96 s > Running phase: patchPhase
  213. 78.96 s > Executing configureCargoCommonVars
  214. 78.96 s > copying cargo artifacts from /nix/store/71lg5z9qr6b69cp7v2y427r8blvhr0lh-gammaloop-crate-test-binaries-three-dimensional-reps-50150770f831b638-inputs/target to target
  215. 78.96 s > will deep copy artifacts (instead of symlinking) as requested
  216. 78.96 s > Running phase: updateAutotoolsGnuConfigScriptsPhase
  217. 78.96 s > Running phase: configurePhase
  218. 78.96 s > will append /build/source/.cargo-home/config.toml with contents of /nix/store/1sigmg52bb61pfngmk9k8wq5fz9r7bf1-vendor-cargo-deps/config.toml
  219. 78.96 s > default configurePhase, nothing to do
  220. 78.96 s > Running phase: buildPhase
  221. 78.96 s > +++ command cargo --version
  222. 78.96 s > cargo 1.97.0 (c980f4866 2026-06-30)
  223. 78.96 s > +++ command cargo test --profile ci-optim --no-run --offline -p three-dimensional-reps --features three-dimensional-reps/serde
  224. 78.96 s > Compiling three-dimensional-reps v0.1.0 (/build/source/crates/three-dimensional-reps)
  225. 78.96 s > error[E0433]: cannot find `eval` in `crate`
  226. 78.96 s > --> crates/three-dimensional-reps/src/generation.rs:8045:28
  227. 78.96 s > |
  228. 78.96 s > 8045 | let input = crate::eval::EvaluationInput {
  229. 78.96 s > | ^^^^ could not find `eval` in the crate root
  230. 78.96 s > |
  231. 78.96 s > note: found an item that was configured out
  232. 78.96 s > --> crates/three-dimensional-reps/src/lib.rs:7:9
  233. 78.96 s > |
  234. 78.96 s > 6 | #[cfg(feature = "eval")]
  235. 78.96 s > | ---------------- the item is gated behind the `eval` feature
  236. 78.96 s > 7 | pub mod eval;
  237. 78.96 s > | ^^^^
  238. 78.96 s >
  239. 78.96 s > error[E0433]: cannot find `eval` in `crate`
  240. 78.96 s > --> crates/three-dimensional-reps/src/generation.rs:8052:30
  241. 78.96 s > |
  242. 78.96 s > 8052 | let contact = crate::eval::evaluate_expression(
  243. 78.96 s > | ^^^^ could not find `eval` in the crate root
  244. 78.96 s > |
  245. 78.96 s > note: found an item that was configured out
  246. 78.96 s > --> crates/three-dimensional-reps/src/lib.rs:7:9
  247. 78.96 s > |
  248. 78.96 s > 6 | #[cfg(feature = "eval")]
  249. 78.96 s > | ---------------- the item is gated behind the `eval` feature
  250. 78.96 s > 7 | pub mod eval;
  251. 78.96 s > | ^^^^
  252. 78.96 s >
  253. 78.96 s > error[E0433]: cannot find `eval` in `crate`
  254. 78.96 s > --> crates/three-dimensional-reps/src/generation.rs:8060:32
  255. 78.96 s > |
  256. 78.96 s > 8060 | let remainder = crate::eval::evaluate_expression(
  257. 78.96 s > | ^^^^ could not find `eval` in the crate root
  258. 78.96 s > |
  259. 78.96 s > note: found an item that was configured out
  260. 78.96 s > --> crates/three-dimensional-reps/src/lib.rs:7:9
  261. 78.96 s > |
  262. 78.96 s > 6 | #[cfg(feature = "eval")]
  263. 78.96 s > | ---------------- the item is gated behind the `eval` feature
  264. 78.96 s > 7 | pub mod eval;
  265. 78.96 s > | ^^^^
  266. 78.96 s >
  267. 78.96 s > error[E0433]: cannot find `eval` in `crate`
  268. 78.96 s > --> crates/three-dimensional-reps/src/generation.rs:8068:28
  269. 78.96 s > |
  270. 78.96 s > 8068 | let total = crate::eval::evaluate_expression(&powered, &expression, numerator, &input)
  271. 78.96 s > | ^^^^ could not find `eval` in the crate root
  272. 78.96 s > |
  273. 78.96 s > note: found an item that was configured out
  274. 78.96 s > --> crates/three-dimensional-reps/src/lib.rs:7:9
  275. 78.96 s > |
  276. 78.96 s > 6 | #[cfg(feature = "eval")]
  277. 78.96 s > | ---------------- the item is gated behind the `eval` feature
  278. 78.96 s > 7 | pub mod eval;
  279. 78.96 s > | ^^^^
  280. 78.96 s >
  281. 78.96 s > For more information about this error, try `rustc --explain E0433`.
  282. 78.96 s > error: could not compile `three-dimensional-reps` (lib test) due to 4 previous errors
  283. 78.96 s For full logs, run:
  284. 78.96 s nix log /nix/store/jw4czjjdv1cc9jr1gsiygk91yx66v8ip-gammaloop-crate-test-binaries-three-dimensional-reps-50150770f831b638-deps-0.1.0.drv
  285. 78.96 s error: Cannot build '/nix/store/n64jh2l9fd4566xfkazhlvh31mb5nvcr-gammaloop-nextest-binaries-core-three-dimensional-reps-0.1.0.drv'.
  286. 78.96 s Reason: 1 dependency failed.
  287. 78.96 s Output paths:
  288. 78.96 s /nix/store/cknhk043civswak50spgn0xzjd0qbx21-gammaloop-nextest-binaries-core-three-dimensional-reps-0.1.0
  289. 78.96 s error: Build failed due to failed dependency
  290. 78.96 s error: Cannot build '/nix/store/w0gifhcb5lpmirzradwa1xs6bvpgvic0-gammaloop-nextest-binaries-core.drv'.
  291. 78.96 s Reason: 1 dependency failed.
  292. 78.96 s Output paths:
  293. 78.96 s /nix/store/jyjmfx2ildjcb45wwlvzhapyli1b4lfq-gammaloop-nextest-binaries-core
  294. 78.96 s Build failed due to failed dependency
  295. 79.02 s Build failed.