1.74 s
$ /nix/store/9ypz3flqsrl5xl495mm8h645gadjsxi1-coreutils-9.11/bin/timeout --kill-after=15s 7200s /nix/store/23zk8sgzamrbmj1fday15szf7f2279s8-nix-2.34.7/bin/nix --extra-experimental-features nix-command --extra-experimental-features flakes flake clone git+https://github.com/alphal00p/gammaloop --dest /tmp/nix-ci-worker/stable-pwd/repo/
1.75 s
Cloning into '/tmp/nix-ci-worker/stable-pwd/repo'...
1.93 s
remote: Enumerating objects: 64545, done.
2.16 s
remote: Counting objects: 0% (1/9899)
remote: Counting objects: 1% (99/9899)
remote: Counting objects: 2% (198/9899)
remote: Counting objects: 3% (297/9899)
remote: Counting objects: 4% (396/9899)
remote: Counting objects: 5% (495/9899)
remote: Counting objects: 6% (594/9899)
remote: Counting objects: 7% (693/9899)
remote: Counting objects: 8% (792/9899)
remote: Counting objects: 9% (891/9899)
remote: Counting objects: 10% (990/9899)
remote: Counting objects: 11% (1089/9899)
remote: Counting objects: 12% (1188/9899)
remote: Counting objects: 13% (1287/9899)
remote: Counting objects: 14% (1386/9899)
remote: Counting objects: 15% (1485/9899)
remote: Counting objects: 16% (1584/9899)
remote: Counting objects: 17% (1683/9899)
remote: Counting objects: 18% (1782/9899)
remote: Counting objects: 19% (1881/9899)
remote: Counting objects: 20% (1980/9899)
remote: Counting objects: 21% (2079/9899)
remote: Counting objects: 22% (2178/9899)
remote: Counting objects: 23% (2277/9899)
remote: Counting objects: 24% (2376/9899)
remote: Counting objects: 25% (2475/9899)
remote: Counting objects: 26% (2574/9899)
remote: Counting objects: 27% (2673/9899)
remote: Counting objects: 28% (2772/9899)
remote: Counting objects: 29% (2871/9899)
remote: Counting objects: 30% (2970/9899)
remote: Counting objects: 31% (3069/9899)
remote: Counting objects: 32% (3168/9899)
remote: Counting objects: 33% (3267/9899)
remote: Counting objects: 34% (3366/9899)
remote: Counting objects: 35% (3465/9899)
remote: Counting objects: 36% (3564/9899)
remote: Counting objects: 37% (3663/9899)
remote: Counting objects: 38% (3762/9899)
remote: Counting objects: 39% (3861/9899)
remote: Counting objects: 40% (3960/9899)
remote: Counting objects: 41% (4059/9899)
remote: Counting objects: 42% (4158/9899)
remote: Counting objects: 43% (4257/9899)
remote: Counting objects: 44% (4356/9899)
remote: Counting objects: 45% (4455/9899)
remote: Counting objects: 46% (4554/9899)
remote: Counting objects: 47% (4653/9899)
remote: Counting objects: 48% (4752/9899)
remote: Counting objects: 49% (4851/9899)
remote: Counting objects: 50% (4950/9899)
remote: Counting objects: 51% (5049/9899)
remote: Counting objects: 52% (5148/9899)
remote: Counting objects: 53% (5247/9899)
remote: Counting objects: 54% (5346/9899)
remote: Counting objects: 55% (5445/9899)
remote: Counting objects: 56% (5544/9899)
remote: Counting objects: 57% (5643/9899)
remote: Counting objects: 58% (5742/9899)
remote: Counting objects: 59% (5841/9899)
remote: Counting objects: 60% (5940/9899)
remote: Counting objects: 61% (6039/9899)
remote: Counting objects: 62% (6138/9899)
remote: Counting objects: 63% (6237/9899)
remote: Counting objects: 64% (6336/9899)
remote: Counting objects: 65% (6435/9899)
remote: Counting objects: 66% (6534/9899)
remote: Counting objects: 67% (6633/9899)
remote: Counting objects: 68% (6732/9899)
remote: Counting objects: 69% (6831/9899)
remote: Counting objects: 70% (6930/9899)
remote: Counting objects: 71% (7029/9899)
remote: Counting objects: 72% (7128/9899)
remote: Counting objects: 73% (7227/9899)
remote: Counting objects: 74% (7326/9899)
remote: Counting objects: 75% (7425/9899)
remote: Counting objects: 76% (7524/9899)
remote: Counting objects: 77% (7623/9899)
remote: Counting objects: 78% (7722/9899)
remote: Counting objects: 79% (7821/9899)
remote: Counting objects: 80% (7920/9899)
remote: Counting objects: 81% (8019/9899)
remote: Counting objects: 82% (8118/9899)
remote: Counting objects: 83% (8217/9899)
remote: Counting objects: 84% (8316/9899)
remote: Counting objects: 85% (8415/9899)
remote: Counting objects: 86% (8514/9899)
remote: Counting objects: 87% (8613/9899)
remote: Counting objects: 88% (8712/9899)
remote: Counting objects: 89% (8811/9899)
remote: Counting objects: 90% (8910/9899)
remote: Counting objects: 91% (9009/9899)
remote: Counting objects: 92% (9108/9899)
remote: Counting objects: 93% (9207/9899)
remote: Counting objects: 94% (9306/9899)
remote: Counting objects: 95% (9405/9899)
remote: Counting objects: 96% (9504/9899)
remote: Counting objects: 97% (9603/9899)
remote: Counting objects: 98% (9702/9899)
remote: Counting objects: 99% (9801/9899)
remote: Counting objects: 100% (9899/9899)
remote: Counting objects: 100% (9899/9899), done.
5.15 s
remote: Compressing objects: 0% (1/2477)
remote: Compressing objects: 1% (25/2477)
remote: Compressing objects: 2% (50/2477)
remote: Compressing objects: 3% (75/2477)
remote: Compressing objects: 4% (100/2477)
remote: Compressing objects: 5% (124/2477)
remote: Compressing objects: 6% (149/2477)
remote: Compressing objects: 7% (174/2477)
remote: Compressing objects: 8% (199/2477)
remote: Compressing objects: 9% (223/2477)
remote: Compressing objects: 10% (248/2477)
remote: Compressing objects: 11% (273/2477)
remote: Compressing objects: 12% (298/2477)
remote: Compressing objects: 13% (323/2477)
remote: Compressing objects: 14% (347/2477)
remote: Compressing objects: 15% (372/2477)
remote: Compressing objects: 16% (397/2477)
remote: Compressing objects: 17% (422/2477)
remote: Compressing objects: 18% (446/2477)
remote: Compressing objects: 19% (471/2477)
remote: Compressing objects: 20% (496/2477)
remote: Compressing objects: 21% (521/2477)
remote: Compressing objects: 22% (545/2477)
remote: Compressing objects: 23% (570/2477)
remote: Compressing objects: 23% (594/2477)
remote: Compressing objects: 24% (595/2477)
remote: Compressing objects: 25% (620/2477)
remote: Compressing objects: 26% (645/2477)
remote: Compressing objects: 27% (669/2477)
remote: Compressing objects: 27% (688/2477)
remote: Compressing objects: 28% (694/2477)
remote: Compressing objects: 29% (719/2477)
remote: Compressing objects: 30% (744/2477)
remote: Compressing objects: 31% (768/2477)
remote: Compressing objects: 32% (793/2477)
remote: Compressing objects: 33% (818/2477)
remote: Compressing objects: 34% (843/2477)
remote: Compressing objects: 35% (867/2477)
remote: Compressing objects: 36% (892/2477)
remote: Compressing objects: 37% (917/2477)
remote: Compressing objects: 38% (942/2477)
remote: Compressing objects: 38% (952/2477)
remote: Compressing objects: 39% (967/2477)
remote: Compressing objects: 40% (991/2477)
remote: Compressing objects: 41% (1016/2477)
remote: Compressing objects: 42% (1041/2477)
remote: Compressing objects: 43% (1066/2477)
remote: Compressing objects: 44% (1090/2477)
remote: Compressing objects: 45% (1115/2477)
remote: Compressing objects: 46% (1140/2477)
remote: Compressing objects: 47% (1165/2477)
remote: Compressing objects: 48% (1189/2477)
remote: Compressing objects: 49% (1214/2477)
remote: Compressing objects: 50% (1239/2477)
remote: Compressing objects: 51% (1264/2477)
remote: Compressing objects: 52% (1289/2477)
remote: Compressing objects: 53% (1313/2477)
remote: Compressing objects: 54% (1338/2477)
remote: Compressing objects: 55% (1363/2477)
remote: Compressing objects: 56% (1388/2477)
remote: Compressing objects: 57% (1412/2477)
remote: Compressing objects: 58% (1437/2477)
remote: Compressing objects: 59% (1462/2477)
remote: Compressing objects: 60% (1487/2477)
remote: Compressing objects: 61% (1511/2477)
remote: Compressing objects: 62% (1536/2477)
remote: Compressing objects: 63% (1561/2477)
remote: Compressing objects: 64% (1586/2477)
remote: Compressing objects: 65% (1611/2477)
remote: Compressing objects: 66% (1635/2477)
remote: Compressing objects: 67% (1660/2477)
remote: Compressing objects: 68% (1685/2477)
remote: Compressing objects: 69% (1710/2477)
remote: Compressing objects: 70% (1734/2477)
remote: Compressing objects: 71% (1759/2477)
remote: Compressing objects: 72% (1784/2477)
remote: Compressing objects: 73% (1809/2477)
remote: Compressing objects: 74% (1833/2477)
remote: Compressing objects: 75% (1858/2477)
remote: Compressing objects: 76% (1883/2477)
remote: Compressing objects: 77% (1908/2477)
remote: Compressing objects: 78% (1933/2477)
remote: Compressing objects: 79% (1957/2477)
remote: Compressing objects: 80% (1982/2477)
remote: Compressing objects: 81% (2007/2477)
remote: Compressing objects: 82% (2032/2477)
remote: Compressing objects: 83% (2056/2477)
remote: Compressing objects: 84% (2081/2477)
remote: Compressing objects: 85% (2106/2477)
remote: Compressing objects: 86% (2131/2477)
remote: Compressing objects: 87% (2155/2477)
remote: Compressing objects: 88% (2180/2477)
remote: Compressing objects: 89% (2205/2477)
remote: Compressing objects: 90% (2230/2477)
remote: Compressing objects: 91% (2255/2477)
remote: Compressing objects: 92% (2279/2477)
remote: Compressing objects: 93% (2304/2477)
remote: Compressing objects: 94% (2329/2477)
remote: Compressing objects: 95% (2354/2477)
remote: Compressing objects: 96% (2378/2477)
remote: Compressing objects: 97% (2403/2477)
remote: Compressing objects: 98% (2428/2477)
remote: Compressing objects: 99% (2453/2477)
remote: Compressing objects: 100% (2477/2477)
remote: Compressing objects: 100% (2477/2477), done.
8.29 s
Receiving objects: 0% (1/64545)
Receiving objects: 1% (646/64545)
Receiving objects: 2% (1291/64545)
Receiving objects: 3% (1937/64545)
Receiving objects: 4% (2582/64545)
Receiving objects: 5% (3228/64545)
Receiving objects: 6% (3873/64545)
Receiving objects: 7% (4519/64545)
Receiving objects: 8% (5164/64545)
Receiving objects: 9% (5810/64545)
Receiving objects: 10% (6455/64545), 8.77 MiB | 17.53 MiB/s
Receiving objects: 11% (7100/64545), 8.77 MiB | 17.53 MiB/s
Receiving objects: 12% (7746/64545), 8.77 MiB | 17.53 MiB/s
Receiving objects: 13% (8391/64545), 8.77 MiB | 17.53 MiB/s
Receiving objects: 14% (9037/64545), 8.77 MiB | 17.53 MiB/s
Receiving objects: 15% (9682/64545), 8.77 MiB | 17.53 MiB/s
Receiving objects: 16% (10328/64545), 8.77 MiB | 17.53 MiB/s
Receiving objects: 17% (10973/64545), 8.77 MiB | 17.53 MiB/s
Receiving objects: 18% (11619/64545), 8.77 MiB | 17.53 MiB/s
Receiving objects: 19% (12264/64545), 8.77 MiB | 17.53 MiB/s
Receiving objects: 20% (12909/64545), 8.77 MiB | 17.53 MiB/s
Receiving objects: 21% (13555/64545), 8.77 MiB | 17.53 MiB/s
Receiving objects: 22% (14200/64545), 8.77 MiB | 17.53 MiB/s
Receiving objects: 23% (14846/64545), 8.77 MiB | 17.53 MiB/s
Receiving objects: 24% (15491/64545), 8.77 MiB | 17.53 MiB/s
Receiving objects: 25% (16137/64545), 8.77 MiB | 17.53 MiB/s
Receiving objects: 26% (16782/64545), 8.77 MiB | 17.53 MiB/s
Receiving objects: 27% (17428/64545), 8.77 MiB | 17.53 MiB/s
Receiving objects: 28% (18073/64545), 8.77 MiB | 17.53 MiB/s
Receiving objects: 29% (18719/64545), 8.77 MiB | 17.53 MiB/s
Receiving objects: 30% (19364/64545), 8.77 MiB | 17.53 MiB/s
Receiving objects: 31% (20009/64545), 8.77 MiB | 17.53 MiB/s
Receiving objects: 32% (20655/64545), 8.77 MiB | 17.53 MiB/s
Receiving objects: 33% (21300/64545), 8.77 MiB | 17.53 MiB/s
Receiving objects: 34% (21946/64545), 8.77 MiB | 17.53 MiB/s
Receiving objects: 35% (22591/64545), 8.77 MiB | 17.53 MiB/s
Receiving objects: 36% (23237/64545), 8.77 MiB | 17.53 MiB/s
Receiving objects: 37% (23882/64545), 8.77 MiB | 17.53 MiB/s
Receiving objects: 37% (24354/64545), 22.28 MiB | 22.27 MiB/s
Receiving objects: 38% (24528/64545), 22.28 MiB | 22.27 MiB/s
Receiving objects: 39% (25173/64545), 22.28 MiB | 22.27 MiB/s
Receiving objects: 40% (25818/64545), 22.28 MiB | 22.27 MiB/s
Receiving objects: 41% (26464/64545), 22.28 MiB | 22.27 MiB/s
Receiving objects: 42% (27109/64545), 22.28 MiB | 22.27 MiB/s
Receiving objects: 43% (27755/64545), 22.28 MiB | 22.27 MiB/s
Receiving objects: 44% (28400/64545), 22.28 MiB | 22.27 MiB/s
Receiving objects: 45% (29046/64545), 22.28 MiB | 22.27 MiB/s
Receiving objects: 46% (29691/64545), 22.28 MiB | 22.27 MiB/s
Receiving objects: 47% (30337/64545), 22.28 MiB | 22.27 MiB/s
Receiving objects: 48% (30982/64545), 22.28 MiB | 22.27 MiB/s
Receiving objects: 49% (31628/64545), 22.28 MiB | 22.27 MiB/s
Receiving objects: 50% (32273/64545), 22.28 MiB | 22.27 MiB/s
Receiving objects: 51% (32918/64545), 22.28 MiB | 22.27 MiB/s
Receiving objects: 52% (33564/64545), 22.28 MiB | 22.27 MiB/s
Receiving objects: 53% (34209/64545), 22.28 MiB | 22.27 MiB/s
Receiving objects: 54% (34855/64545), 22.28 MiB | 22.27 MiB/s
Receiving objects: 55% (35500/64545), 22.28 MiB | 22.27 MiB/s
Receiving objects: 56% (36146/64545), 22.28 MiB | 22.27 MiB/s
Receiving objects: 57% (36791/64545), 22.28 MiB | 22.27 MiB/s
Receiving objects: 58% (37437/64545), 44.67 MiB | 29.78 MiB/s
Receiving objects: 59% (38082/64545), 44.67 MiB | 29.78 MiB/s
Receiving objects: 60% (38727/64545), 44.67 MiB | 29.78 MiB/s
Receiving objects: 61% (39373/64545), 44.67 MiB | 29.78 MiB/s
Receiving objects: 62% (40018/64545), 44.67 MiB | 29.78 MiB/s
Receiving objects: 63% (40664/64545), 44.67 MiB | 29.78 MiB/s
Receiving objects: 64% (41309/64545), 44.67 MiB | 29.78 MiB/s
Receiving objects: 65% (41955/64545), 44.67 MiB | 29.78 MiB/s
Receiving objects: 66% (42600/64545), 44.67 MiB | 29.78 MiB/s
Receiving objects: 66% (42915/64545), 60.57 MiB | 30.28 MiB/s
Receiving objects: 67% (43246/64545), 60.57 MiB | 30.28 MiB/s
Receiving objects: 68% (43891/64545), 60.57 MiB | 30.28 MiB/s
Receiving objects: 69% (44537/64545), 60.57 MiB | 30.28 MiB/s
Receiving objects: 70% (45182/64545), 60.57 MiB | 30.28 MiB/s
Receiving objects: 71% (45827/64545), 60.57 MiB | 30.28 MiB/s
Receiving objects: 72% (46473/64545), 60.57 MiB | 30.28 MiB/s
Receiving objects: 73% (47118/64545), 60.57 MiB | 30.28 MiB/s
Receiving objects: 74% (47764/64545), 60.57 MiB | 30.28 MiB/s
Receiving objects: 75% (48409/64545), 60.57 MiB | 30.28 MiB/s
Receiving objects: 76% (49055/64545), 60.57 MiB | 30.28 MiB/s
Receiving objects: 77% (49700/64545), 60.57 MiB | 30.28 MiB/s
Receiving objects: 78% (50346/64545), 60.57 MiB | 30.28 MiB/s
Receiving objects: 79% (50991/64545), 60.57 MiB | 30.28 MiB/s
Receiving objects: 80% (51636/64545), 60.57 MiB | 30.28 MiB/s
Receiving objects: 81% (52282/64545), 60.57 MiB | 30.28 MiB/s
Receiving objects: 82% (52927/64545), 78.09 MiB | 31.23 MiB/s
Receiving objects: 83% (53573/64545), 78.09 MiB | 31.23 MiB/s
Receiving objects: 84% (54218/64545), 78.09 MiB | 31.23 MiB/s
Receiving objects: 85% (54864/64545), 78.09 MiB | 31.23 MiB/s
Receiving objects: 86% (55509/64545), 78.09 MiB | 31.23 MiB/s
Receiving objects: 87% (56155/64545), 78.09 MiB | 31.23 MiB/s
Receiving objects: 88% (56800/64545), 78.09 MiB | 31.23 MiB/s
Receiving objects: 89% (57446/64545), 78.09 MiB | 31.23 MiB/s
Receiving objects: 90% (58091/64545), 78.09 MiB | 31.23 MiB/s
Receiving objects: 91% (58736/64545), 78.09 MiB | 31.23 MiB/s
Receiving objects: 92% (59382/64545), 78.09 MiB | 31.23 MiB/s
Receiving objects: 93% (60027/64545), 78.09 MiB | 31.23 MiB/s
Receiving objects: 94% (60673/64545), 78.09 MiB | 31.23 MiB/s
Receiving objects: 95% (61318/64545), 78.09 MiB | 31.23 MiB/s
Receiving objects: 96% (61964/64545), 78.09 MiB | 31.23 MiB/s
Receiving objects: 96% (62457/64545), 78.09 MiB | 31.23 MiB/s
Receiving objects: 97% (62609/64545), 93.98 MiB | 31.33 MiB/s
Receiving objects: 98% (63255/64545), 93.98 MiB | 31.33 MiB/s
Receiving objects: 99% (63900/64545), 93.98 MiB | 31.33 MiB/s
remote: Total 64545 (delta 7628), reused 8035 (delta 6856), pack-reused 54646 (from 3)
8.30 s
Receiving objects: 100% (64545/64545), 93.98 MiB | 31.33 MiB/s
Receiving objects: 100% (64545/64545), 99.02 MiB | 31.50 MiB/s, done.
9.38 s
Resolving deltas: 0% (0/44558)
Resolving deltas: 1% (446/44558)
Resolving deltas: 2% (892/44558)
Resolving deltas: 3% (1337/44558)
Resolving deltas: 4% (1783/44558)
Resolving deltas: 5% (2228/44558)
Resolving deltas: 6% (2676/44558)
Resolving deltas: 7% (3120/44558)
Resolving deltas: 8% (3567/44558)
Resolving deltas: 9% (4011/44558)
Resolving deltas: 10% (4456/44558)
Resolving deltas: 11% (4902/44558)
Resolving deltas: 12% (5347/44558)
Resolving deltas: 13% (5793/44558)
Resolving deltas: 14% (6239/44558)
Resolving deltas: 15% (6684/44558)
Resolving deltas: 16% (7130/44558)
Resolving deltas: 17% (7576/44558)
Resolving deltas: 18% (8021/44558)
Resolving deltas: 19% (8467/44558)
Resolving deltas: 20% (8912/44558)
Resolving deltas: 21% (9358/44558)
Resolving deltas: 22% (9805/44558)
Resolving deltas: 23% (10249/44558)
Resolving deltas: 24% (10694/44558)
Resolving deltas: 25% (11140/44558)
Resolving deltas: 26% (11586/44558)
Resolving deltas: 27% (12031/44558)
Resolving deltas: 28% (12477/44558)
Resolving deltas: 29% (12922/44558)
Resolving deltas: 30% (13368/44558)
Resolving deltas: 31% (13813/44558)
Resolving deltas: 32% (14259/44558)
Resolving deltas: 33% (14708/44558)
Resolving deltas: 34% (15150/44558)
Resolving deltas: 35% (15596/44558)
Resolving deltas: 36% (16041/44558)
Resolving deltas: 37% (16488/44558)
Resolving deltas: 38% (16933/44558)
Resolving deltas: 39% (17378/44558)
Resolving deltas: 40% (17824/44558)
Resolving deltas: 41% (18269/44558)
Resolving deltas: 42% (18715/44558)
Resolving deltas: 43% (19160/44558)
Resolving deltas: 44% (19606/44558)
Resolving deltas: 45% (20052/44558)
Resolving deltas: 46% (20497/44558)
Resolving deltas: 47% (20943/44558)
Resolving deltas: 48% (21389/44558)
Resolving deltas: 49% (21834/44558)
Resolving deltas: 50% (22279/44558)
Resolving deltas: 51% (22725/44558)
Resolving deltas: 52% (23171/44558)
Resolving deltas: 53% (23616/44558)
Resolving deltas: 54% (24062/44558)
Resolving deltas: 55% (24507/44558)
Resolving deltas: 56% (24953/44558)
Resolving deltas: 57% (25399/44558)
Resolving deltas: 58% (25845/44558)
Resolving deltas: 59% (26290/44558)
Resolving deltas: 60% (26735/44558)
Resolving deltas: 61% (27182/44558)
Resolving deltas: 62% (27626/44558)
Resolving deltas: 63% (28072/44558)
Resolving deltas: 64% (28518/44558)
Resolving deltas: 65% (28963/44558)
Resolving deltas: 66% (29409/44558)
Resolving deltas: 67% (29854/44558)
Resolving deltas: 68% (30300/44558)
Resolving deltas: 69% (30746/44558)
Resolving deltas: 70% (31191/44558)
Resolving deltas: 71% (31637/44558)
Resolving deltas: 72% (32082/44558)
Resolving deltas: 73% (32529/44558)
Resolving deltas: 74% (32973/44558)
Resolving deltas: 75% (33419/44558)
Resolving deltas: 76% (33865/44558)
Resolving deltas: 77% (34311/44558)
Resolving deltas: 78% (34756/44558)
Resolving deltas: 79% (35201/44558)
Resolving deltas: 80% (35648/44558)
Resolving deltas: 81% (36093/44558)
Resolving deltas: 82% (36538/44558)
Resolving deltas: 83% (36985/44558)
Resolving deltas: 84% (37430/44558)
Resolving deltas: 85% (37875/44558)
Resolving deltas: 86% (38321/44558)
Resolving deltas: 87% (38766/44558)
Resolving deltas: 88% (39213/44558)
Resolving deltas: 89% (39657/44558)
Resolving deltas: 90% (40103/44558)
Resolving deltas: 91% (40548/44558)
Resolving deltas: 92% (40994/44558)
Resolving deltas: 93% (41439/44558)
Resolving deltas: 93% (41876/44558)
Resolving deltas: 94% (41885/44558)
Resolving deltas: 95% (42331/44558)
Resolving deltas: 96% (42776/44558)
Resolving deltas: 97% (43222/44558)
Resolving deltas: 98% (43667/44558)
Resolving deltas: 99% (44113/44558)
Resolving deltas: 100% (44558/44558)
Resolving deltas: 100% (44558/44558), done.
9.77 s
Fetching commit 5c3e7fca0a6881b11af8a1b5285c69bb7fe221d1 for raised_energy_cff_wip ...
9.77 s
$ /nix/store/bcnisk3ydfgv26v2gw3zlky24g00yww2-git-2.54.0/bin/git fetch origin 5c3e7fca0a6881b11af8a1b5285c69bb7fe221d1
10.25 s
From https://github.com/alphal00p/gammaloop
10.25 s
* branch 5c3e7fca0a6881b11af8a1b5285c69bb7fe221d1 -> FETCH_HEAD
10.28 s
$ /nix/store/9ypz3flqsrl5xl495mm8h645gadjsxi1-coreutils-9.11/bin/timeout --kill-after=15s 7200s /nix/store/bcnisk3ydfgv26v2gw3zlky24g00yww2-git-2.54.0/bin/git -c advice.detachedHead=false checkout 5c3e7fca0a6881b11af8a1b5285c69bb7fe221d1
10.55 s
HEAD is now at 5c3e7fca fix(uv): rebuild exact CFF sources from edge provenance
10.57 s
$ /nix/store/9ypz3flqsrl5xl495mm8h645gadjsxi1-coreutils-9.11/bin/timeout --kill-after=15s 7200s /nix/store/23zk8sgzamrbmj1fday15szf7f2279s8-nix-2.34.7/bin/nix --extra-experimental-features nix-command --extra-experimental-features flakes --log-format internal-json run .#packages.x86_64-linux.nix-ci-check-gammaloop-nextest-core --print-build-logs
19.37 s
19.42 s
Downloading cached gammaloop-nextest-binaries-core-gammaloop-tracing-filter from https://cache.nix-ci.com
19.43 s
Downloading cached gammaloop-nextest-binaries-core-gammaloop-api from https://cache.nix-ci.com
19.43 s
Downloading cached gammaloop-nextest-binaries-core-gammaloop-tracing-filter-macros from https://cache.nix-ci.com
19.43 s
Downloading cached gammaloop-nextest-binaries-core-gammalooprs from https://cache.nix-ci.com
19.43 s
Downloading cached gammaloop-nextest-binaries-core-three-dimensional-reps from https://cache.nix-ci.com
19.50 s
Downloaded cached gammaloop-nextest-binaries-core-gammaloop-tracing-filter-macros (1.7 MiB) in 72ms
19.50 s
Progress: 0 of 1 built, 1 of 7 downloaded from cache (4 downloading)
19.75 s
Downloaded cached gammaloop-nextest-binaries-core-gammaloop-tracing-filter (8.1 MiB) in 332ms
19.75 s
Progress: 0 of 1 built, 2 of 7 downloaded from cache (3 downloading)
19.75 s
Downloaded cached gammaloop-nextest-binaries-core-three-dimensional-reps (8.5 MiB) in 324ms
19.75 s
Progress: 0 of 1 built, 3 of 7 downloaded from cache (2 downloading)
20.95 s
Downloaded cached gammaloop-nextest-binaries-core-gammaloop-api (70.6 MiB) in 1.5s
20.95 s
Progress: 0 of 1 built, 4 of 7 downloaded from cache (1 downloading)
21.07 s
Downloaded cached gammaloop-nextest-binaries-core-gammalooprs (83.2 MiB) in 1.6s
21.07 s
Progress: 0 of 1 built, 5 of 7 downloaded from cache
21.07 s
Downloading cached gammaloop-nextest-binaries-core from https://cache.nix-ci.com
21.07 s
Downloaded cached gammaloop-nextest-binaries-core (2032 B) in 6ms
21.07 s
Progress: 0 of 1 built, 6 of 7 downloaded from cache
21.07 s
Downloading cached nix-ci-check-gammaloop-nextest-core from https://cache.nix-ci.com
21.08 s
Downloaded cached nix-ci-check-gammaloop-nextest-core (1016 B) in 6ms
21.08 s
Progress: 0 of 1 built, 7 of 7 downloaded from cache
28.57 s
evaluating derivation 'g
copying '/nix/store/07vg
evaluating derivation 'g
copying '/nix/store/07vg
evaluating derivation 'g
copying '/nix/store/07vg
evaluating derivation 'g
copying '/nix/store/07vg
evaluating derivation 'g
copying '/nix/store/07vg
evaluating derivation 'g
copying '/nix/store/07vg
evaluating derivation 'g
copying '/nix/store/07vg
evaluating derivation 'g
copying '/nix/store/07vg
evaluating derivation 'g
copying '/nix/store/07vg
evaluating derivation 'g
querying gammaloop-nexte
[0 /3 built, 0.0 KiB DL]
[0 /1 built, 0.0 KiB DL]
[1 /0 /1 built, 0.0 KiB DLgammaloop-nextest-core> Extracting 3 binaries (including 1 non-test binary), 1 build script output directory, and 2 linked paths to /build/nextest-archive-qgiWAu
29.36 s
gammaloop-nextest-core> Extracted 18 files to /build/nextest-archive-qgiWAu in 0.79s
29.38 s
gammaloop-nextest-core> ------------
29.38 s
gammaloop-nextest-core> Nextest run ID cc547a30-6dcc-4cc5-895e-914d68567169 with nextest profile: ci_gammaloop
29.38 s
gammaloop-nextest-core> Starting 375 tests across 2 binaries
30.22 s
gammaloop-nextest-core> ------------
30.22 s
gammaloop-nextest-core> Summary [ 0.844s] 375 tests run: 375 passed , 0 skipped
30.39 s
gammaloop-nextest-core>
30.39 s
gammaloop-nextest-core> ========== nextest test summary ==========
30.39 s
gammaloop-nextest-core> report: target/nextest/ci_gammaloop/junit.xml
30.39 s
gammaloop-nextest-core> tests: 375, failures: 0, errors: 0
30.39 s
gammaloop-nextest-core> No failing testcases found.
30.39 s
gammaloop-nextest-core> =========================================
30.41 s
gammaloop-nextest-core> Extracting 1 binary and 1 linked path to /build/nextest-archive-9APMuQ
30.52 s
gammaloop-nextest-core> Extracted 7 files to /build/nextest-archive-9APMuQ in 0.12s
30.54 s
gammaloop-nextest-core> ------------
30.54 s
gammaloop-nextest-core> Nextest run ID 2dbca648-db25-4192-ab72-552076e11be5 with nextest profile: ci_gammaloop
30.54 s
gammaloop-nextest-core> Starting 19 tests across 1 binary
30.55 s
gammaloop-nextest-core> ------------
30.55 s
gammaloop-nextest-core> Summary [ 0.018s] 19 tests run: 19 passed , 0 skipped
30.61 s
gammaloop-nextest-core>
30.61 s
gammaloop-nextest-core> ========== nextest test summary ==========
30.61 s
gammaloop-nextest-core> report: target/nextest/ci_gammaloop/junit.xml
30.61 s
gammaloop-nextest-core> tests: 19, failures: 0, errors: 0
30.61 s
gammaloop-nextest-core> No failing testcases found.
30.61 s
gammaloop-nextest-core> =========================================
30.63 s
gammaloop-nextest-core> Extracting 1 binary to /build/nextest-archive-ryyx3A
30.67 s
gammaloop-nextest-core> Extracted 4 files to /build/nextest-archive-ryyx3A in 0.04s
30.69 s
gammaloop-nextest-core> ------------
30.69 s
gammaloop-nextest-core> Nextest run ID d33c0584-2925-402e-8fb0-8bdefdea3c2a with nextest profile: ci_gammaloop
30.69 s
gammaloop-nextest-core> Starting 0 tests across 1 binary
30.69 s
gammaloop-nextest-core> ------------
30.69 s
gammaloop-nextest-core> Summary [ 0.000s] 0 tests run: 0 passed , 0 skipped
30.74 s
gammaloop-nextest-core>
30.74 s
gammaloop-nextest-core> ========== nextest test summary ==========
30.74 s
gammaloop-nextest-core> report: target/nextest/ci_gammaloop/junit.xml
30.74 s
gammaloop-nextest-core> tests: 0, failures: 0, errors: 0
30.74 s
gammaloop-nextest-core> No failing testcases found.
30.74 s
gammaloop-nextest-core> =========================================
30.77 s
gammaloop-nextest-core> Extracting 4 binaries, 1 build script output directory, and 2 linked paths to /build/nextest-archive-g8xNrQ
31.60 s
gammaloop-nextest-core> Extracted 18 files to /build/nextest-archive-g8xNrQ in 0.84s
31.63 s
gammaloop-nextest-core> ------------
31.63 s
gammaloop-nextest-core> Nextest run ID 0723af18-d531-4755-b18a-ff4aac75be75 with nextest profile: ci_gammaloop
31.63 s
gammaloop-nextest-core> Starting 561 tests across 4 binaries (59 tests skipped , including 58 tests via profile.ci_gammaloop.default-filter )
31.97 s
gammaloop-nextest-core> FAIL [ 0.168s] ( 53/561) gammalooprs cff::tests :: stored_production_cff_uses_typed_energy_factor_ownership
31.97 s
gammaloop-nextest-core> stdout ---
31.97 s
gammaloop-nextest-core>
31.97 s
gammaloop-nextest-core> running 1 test
31.97 s
gammaloop-nextest-core> test cff::tests::stored_production_cff_uses_typed_energy_factor_ownership ... FAILED
31.97 s
gammaloop-nextest-core>
31.97 s
gammaloop-nextest-core> failures:
31.97 s
gammaloop-nextest-core>
31.97 s
gammaloop-nextest-core> failures:
31.97 s
gammaloop-nextest-core> cff::tests::stored_production_cff_uses_typed_energy_factor_ownership
31.97 s
gammaloop-nextest-core>
31.97 s
gammaloop-nextest-core> test result: FAILED. 0 passed; 1 failed; 0 ignored; 0 measured; 611 filtered out; finished in 0.15s
31.97 s
gammaloop-nextest-core>
31.97 s
gammaloop-nextest-core> stderr ---
31.97 s
gammaloop-nextest-core> The application panicked (crashed).
31.97 s
gammaloop-nextest-core> Message: assertion `left == right` failed
31.97 s
gammaloop-nextest-core> left: 1
31.97 s
gammaloop-nextest-core> right: -1
31.97 s
gammaloop-nextest-core> Location: crates/gammalooprs/src/cff/mod.rs :2721
31.97 s
gammaloop-nextest-core>
31.97 s
gammaloop-nextest-core> ━━━━━━━━━━━━━━━━━━━━━━━━━━━━━━━━━━ BACKTRACE ━━━━━━━━━━━━━━━━━━━━━━━━━━━━━━━━━━━
31.97 s
gammaloop-nextest-core> 1: <color_eyre[51793ea62743adbd]::config::PanicHook>::panic_report <unknown>
31.97 s
gammaloop-nextest-core> at <unknown source file> :<unknown line>
31.97 s
gammaloop-nextest-core> 2: <color_eyre[51793ea62743adbd]::config::PanicHook>::into_panic_hook::{closure#0} <unknown>
31.97 s
gammaloop-nextest-core> at <unknown source file> :<unknown line>
31.97 s
gammaloop-nextest-core> 3: std[bcb96dfbba0ab899]::panicking::panic_with_hook <unknown>
31.97 s
gammaloop-nextest-core> at <unknown source file> :<unknown line>
31.97 s
gammaloop-nextest-core> 4: std[bcb96dfbba0ab899]::panicking::panic_handler::{closure#0} <unknown>
31.97 s
gammaloop-nextest-core> at <unknown source file> :<unknown line>
31.97 s
gammaloop-nextest-core> 5: std[bcb96dfbba0ab899]::sys::backtrace::__rust_end_short_backtrace::<std[bcb96dfbba0ab899]::panicking::panic_handler::{closure#0}, !> <unknown>
31.97 s
gammaloop-nextest-core> at <unknown source file> :<unknown line>
31.97 s
gammaloop-nextest-core> 6: __rustc[6c289b9f9c454d21]::rust_begin_unwind <unknown>
31.97 s
gammaloop-nextest-core> at <unknown source file> :<unknown line>
31.97 s
gammaloop-nextest-core> 7: core[940e698046960fd5]::panicking::panic_fmt <unknown>
31.97 s
gammaloop-nextest-core> at <unknown source file> :<unknown line>
31.97 s
gammaloop-nextest-core> 8: core[940e698046960fd5]::panicking::assert_failed_inner <unknown>
31.97 s
gammaloop-nextest-core> at <unknown source file> :<unknown line>
31.97 s
gammaloop-nextest-core> 9: core[940e698046960fd5]::panicking::assert_failed::<i64, i64> <unknown>
31.97 s
gammaloop-nextest-core> at <unknown source file> :<unknown line>
31.97 s
gammaloop-nextest-core> 10: gammalooprs[972dff90865981f6]::cff::tests::stored_production_cff_uses_typed_energy_factor_ownership <unknown>
31.97 s
gammaloop-nextest-core> at <unknown source file> :<unknown line>
31.97 s
gammaloop-nextest-core> 11: <gammalooprs[972dff90865981f6]::cff::tests::stored_production_cff_uses_typed_energy_factor_ownership::{closure#0} as core[940e698046960fd5]::ops::function::FnOnce<()>>::call_once <unknown>
31.97 s
gammaloop-nextest-core> at <unknown source file> :<unknown line>
31.97 s
gammaloop-nextest-core> 12: test[75d6903177b1d7e9]::__rust_begin_short_backtrace::<core[940e698046960fd5]::result::Result<(), alloc[2ea6bcb46fca0c42]::string::String>, fn() -> core[940e698046960fd5]::result::Result<(), alloc[2ea6bcb46fca0c42]::string::String>> <unknown>
31.97 s
gammaloop-nextest-core> at <unknown source file> :<unknown line>
31.97 s
gammaloop-nextest-core> 13: test[75d6903177b1d7e9]::run_test::{closure#0} <unknown>
31.97 s
gammaloop-nextest-core> at <unknown source file> :<unknown line>
31.97 s
gammaloop-nextest-core> 14: std[bcb96dfbba0ab899]::sys::backtrace::__rust_begin_short_backtrace::<test[75d6903177b1d7e9]::run_test::{closure#1}, ()> <unknown>
31.97 s
gammaloop-nextest-core> at <unknown source file> :<unknown line>
31.97 s
gammaloop-nextest-core> 15: <std[bcb96dfbba0ab899]::thread::lifecycle::spawn_unchecked<test[75d6903177b1d7e9]::run_test::{closure#1}, ()>::{closure#1} as core[940e698046960fd5]::ops::function::FnOnce<()>>::call_once::{shim:vtable#0} <unknown>
31.97 s
gammaloop-nextest-core> at <unknown source file> :<unknown line>
31.97 s
gammaloop-nextest-core> 16: <std[bcb96dfbba0ab899]::sys::thread::unix::Thread>::new::thread_start <unknown>
31.97 s
gammaloop-nextest-core> at <unknown source file> :<unknown line>
31.97 s
gammaloop-nextest-core> 17: start_thread <unknown>
31.97 s
gammaloop-nextest-core> at <unknown source file> :<unknown line>
31.97 s
gammaloop-nextest-core> 18: __clone3 <unknown>
31.97 s
gammaloop-nextest-core> at <unknown source file> :<unknown line>
31.97 s
gammaloop-nextest-core>
31.97 s
gammaloop-nextest-core> Run with COLORBT_SHOW_HIDDEN=1 environment variable to disable frame filtering.
31.97 s
gammaloop-nextest-core> Run with RUST_BACKTRACE=full to include source snippets.
31.97 s
gammaloop-nextest-core>
33.63 s
gammaloop-nextest-core> FAIL [ 0.108s] (483/561) gammalooprs uv::approx::local_3d::tests :: production_emr_map_cancels_one_powered_denominator
33.65 s
gammaloop-nextest-core> stdout ---
33.65 s
gammaloop-nextest-core>
33.65 s
gammaloop-nextest-core> running 1 test
33.65 s
gammaloop-nextest-core> test uv::approx::local_3d::tests::production_emr_map_cancels_one_powered_denominator ... FAILED
33.65 s
gammaloop-nextest-core>
33.65 s
gammaloop-nextest-core> failures:
33.65 s
gammaloop-nextest-core>
33.65 s
gammaloop-nextest-core> failures:
33.65 s
gammaloop-nextest-core> uv::approx::local_3d::tests::production_emr_map_cancels_one_powered_denominator
33.65 s
gammaloop-nextest-core>
33.65 s
gammaloop-nextest-core> test result: FAILED. 0 passed; 1 failed; 0 ignored; 0 measured; 611 filtered out; finished in 0.09s
33.65 s
gammaloop-nextest-core>
33.65 s
gammaloop-nextest-core> stderr ---
33.65 s
gammaloop-nextest-core> The application panicked (crashed).
33.65 s
gammaloop-nextest-core> Message: summed exact-source powered and selected lower channels differ: powered=-1 𝑖 /8/𝜋^3, lower=1𝑖 /16/𝜋^3, difference=-3𝑖 /16/𝜋^3
33.65 s
gammaloop-nextest-core> Location: crates/gammalooprs/src/uv/approx/local_3d.rs :2047
33.65 s
gammaloop-nextest-core>
33.65 s
gammaloop-nextest-core> ━━━━━━━━━━━━━━━━━━━━━━━━━━━━━━━━━━ BACKTRACE ━━━━━━━━━━━━━━━━━━━━━━━━━━━━━━━━━━━
33.65 s
gammaloop-nextest-core> 1: <color_eyre[51793ea62743adbd]::config::PanicHook>::panic_report <unknown>
33.65 s
gammaloop-nextest-core> at <unknown source file> :<unknown line>
33.65 s
gammaloop-nextest-core> 2: <color_eyre[51793ea62743adbd]::config::PanicHook>::into_panic_hook::{closure#0} <unknown>
33.65 s
gammaloop-nextest-core> at <unknown source file> :<unknown line>
33.65 s
gammaloop-nextest-core> 3: std[bcb96dfbba0ab899]::panicking::panic_with_hook <unknown>
33.65 s
gammaloop-nextest-core> at <unknown source file> :<unknown line>
33.65 s
gammaloop-nextest-core> 4: std[bcb96dfbba0ab899]::panicking::panic_handler::{closure#0} <unknown>
33.65 s
gammaloop-nextest-core> at <unknown source file> :<unknown line>
33.65 s
gammaloop-nextest-core> 5: std[bcb96dfbba0ab899]::sys::backtrace::__rust_end_short_backtrace::<std[bcb96dfbba0ab899]::panicking::panic_handler::{closure#0}, !> <unknown>
33.65 s
gammaloop-nextest-core> at <unknown source file> :<unknown line>
33.65 s
gammaloop-nextest-core> 6: __rustc[6c289b9f9c454d21]::rust_begin_unwind <unknown>
33.65 s
gammaloop-nextest-core> at <unknown source file> :<unknown line>
33.65 s
gammaloop-nextest-core> 7: core[940e698046960fd5]::panicking::panic_fmt <unknown>
33.65 s
gammaloop-nextest-core> at <unknown source file> :<unknown line>
33.65 s
gammaloop-nextest-core> 8: gammalooprs[972dff90865981f6]::uv::approx::local_3d::tests::production_emr_map_cancels_one_powered_denominator <unknown>
33.65 s
gammaloop-nextest-core> at <unknown source file> :<unknown line>
33.65 s
gammaloop-nextest-core> 9: <gammalooprs[972dff90865981f6]::uv::approx::local_3d::tests::production_emr_map_cancels_one_powered_denominator::{closure#0} as core[940e698046960fd5]::ops::function::FnOnce<()>>::call_once <unknown>
33.65 s
gammaloop-nextest-core> at <unknown source file> :<unknown line>
33.65 s
gammaloop-nextest-core> 10: test[75d6903177b1d7e9]::__rust_begin_short_backtrace::<core[940e698046960fd5]::result::Result<(), alloc[2ea6bcb46fca0c42]::string::String>, fn() -> core[940e698046960fd5]::result::Result<(), alloc[2ea6bcb46fca0c42]::string::String>> <unknown>
33.65 s
gammaloop-nextest-core> at <unknown source file> :<unknown line>
33.65 s
gammaloop-nextest-core> 11: test[75d6903177b1d7e9]::run_test::{closure#0} <unknown>
33.65 s
gammaloop-nextest-core> at <unknown source file> :<unknown line>
33.65 s
gammaloop-nextest-core> 12: std[bcb96dfbba0ab899]::sys::backtrace::__rust_begin_short_backtrace::<test[75d6903177b1d7e9]::run_test::{closure#1}, ()> <unknown>
33.65 s
gammaloop-nextest-core> at <unknown source file> :<unknown line>
33.65 s
gammaloop-nextest-core> 13: <std[bcb96dfbba0ab899]::thread::lifecycle::spawn_unchecked<test[75d6903177b1d7e9]::run_test::{closure#1}, ()>::{closure#1} as core[940e698046960fd5]::ops::function::FnOnce<()>>::call_once::{shim:vtable#0} <unknown>
33.65 s
gammaloop-nextest-core> at <unknown source file> :<unknown line>
33.65 s
gammaloop-nextest-core> 14: <std[bcb96dfbba0ab899]::sys::thread::unix::Thread>::new::thread_start <unknown>
33.65 s
gammaloop-nextest-core> at <unknown source file> :<unknown line>
33.65 s
gammaloop-nextest-core> 15: start_thread <unknown>
33.65 s
gammaloop-nextest-core> at <unknown source file> :<unknown line>
33.65 s
gammaloop-nextest-core> 16: __clone3 <unknown>
33.65 s
gammaloop-nextest-core> at <unknown source file> :<unknown line>
33.65 s
gammaloop-nextest-core>
33.65 s
gammaloop-nextest-core> Run with COLORBT_SHOW_HIDDEN=1 environment variable to disable frame filtering.
33.65 s
gammaloop-nextest-core> Run with RUST_BACKTRACE=full to include source snippets.
33.65 s
gammaloop-nextest-core>
34.35 s
gammaloop-nextest-core> FAIL [ 0.424s] (539/561) gammalooprs uv::hedge_poset::tests :: spectacles_typed_4d_projects_after_local_construction
34.35 s
gammaloop-nextest-core> stdout ---
34.35 s
gammaloop-nextest-core>
34.35 s
gammaloop-nextest-core> running 1 test
34.35 s
gammaloop-nextest-core> digraph {
34.35 s
gammaloop-nextest-core> node [shape=circle,height=0.1,label=""];
34.35 s
gammaloop-nextest-core> overlap = "scale";
34.35 s
gammaloop-nextest-core> layout = "neato";
34.35 s
gammaloop-nextest-core> start=2;
34.35 s
gammaloop-nextest-core> 4 [label="0"];
34.35 s
gammaloop-nextest-core> 1 [label="zw"];
34.35 s
gammaloop-nextest-core> 2 [label="F"];
34.35 s
gammaloop-nextest-core> 0 [label="143"];
34.35 s
gammaloop-nextest-core> 3 [label="10B"];
34.35 s
gammaloop-nextest-core> 4:0:s -> 1:1:s [id=0 color="red:blue;0.5" label="zw"];
34.35 s
gammaloop-nextest-core> 4:2:s -> 2:3:s [id=1 color="red:blue;0.5" label="F"];
34.35 s
gammaloop-nextest-core> 3:5:s -> 0:4:s [id=2 color="red:blue;0.5" label="143"];
34.35 s
gammaloop-nextest-core> 4:6:s -> 0:7:s [id=3 color="red:blue;0.5" label="143"];
34.35 s
gammaloop-nextest-core> 1:8:s -> 3:9:s [id=4 color="red:blue;0.5" label="F"];
34.35 s
gammaloop-nextest-core> 1:10:s -> 0:11:s [id=5 color="red:blue;0.5" label="143"];
34.35 s
gammaloop-nextest-core> 2:12:s -> 3:13:s [id=6 color="red:blue;0.5" label="zw"];
34.35 s
gammaloop-nextest-core> 2:14:s -> 0:15:s [id=7 color="red:blue;0.5" label="143"];
34.35 s
gammaloop-nextest-core> }
34.35 s
gammaloop-nextest-core>
34.35 s
gammaloop-nextest-core> digraph {
34.35 s
gammaloop-nextest-core> node [shape=circle,height=0.1,label=""];
34.35 s
gammaloop-nextest-core> overlap = "scale";
34.35 s
gammaloop-nextest-core> layout = "neato";
34.35 s
gammaloop-nextest-core> start=2;
34.35 s
gammaloop-nextest-core> 0 [label="∅"];
34.35 s
gammaloop-nextest-core> 1 [label="{zw}: Approx(S_zw(0))"];
34.35 s
gammaloop-nextest-core> 2 [label="{F}: Approx(S_F(1))"];
34.35 s
gammaloop-nextest-core> 3 [label="{143}: Approx(S_143(3))"];
34.35 s
gammaloop-nextest-core> 4 [label="{zw,F}: Approx(S_F(4))*Approx(S_zw(0))"];
34.35 s
gammaloop-nextest-core> 5 [label="{zw} · {143}: Approx((-1*S_zw+S_143(5))*Approx(S_zw(0)))"];
34.35 s
gammaloop-nextest-core> 6 [label="{F} · {143}: Approx((-1*S_F+S_143(7))*Approx(S_F(1)))"];
34.35 s
gammaloop-nextest-core> 7 [label="{zw,F} · {143}: Approx((-1*S_10B+S_143(2))*Approx(S_F(4))*Approx(S_zw(0)))"];
34.35 s
gammaloop-nextest-core> 0:0:s -> 1:1:s [id=0 color="red:blue;0.5"];
34.35 s
gammaloop-nextest-core> 0:2:s -> 2:3:s [id=1 color="red:blue;0.5"];
34.35 s
gammaloop-nextest-core> 0:4:s -> 3:5:s [id=2 color="red:blue;0.5"];
34.35 s
gammaloop-nextest-core> 1:6:s -> 4:7:s [id=3 color="red:blue;0.5"];
34.35 s
gammaloop-nextest-core> 1:8:s -> 5:9:s [id=4 color="red:blue;0.5"];
34.35 s
gammaloop-nextest-core> 2:10:s -> 4:11:s [id=5 color="red:blue;0.5"];
34.35 s
gammaloop-nextest-core> 2:12:s -> 6:13:s [id=6 color="red:blue;0.5"];
34.35 s
gammaloop-nextest-core> 4:14:s -> 7:15:s [id=7 color="red:blue;0.5"];
34.35 s
gammaloop-nextest-core> }
34.35 s
gammaloop-nextest-core>
34.35 s
gammaloop-nextest-core> test uv::hedge_poset::tests::spectacles_typed_4d_projects_after_local_construction ... FAILED
34.35 s
gammaloop-nextest-core>
34.35 s
gammaloop-nextest-core> failures:
34.35 s
gammaloop-nextest-core>
34.35 s
gammaloop-nextest-core> failures:
34.35 s
gammaloop-nextest-core> uv::hedge_poset::tests::spectacles_typed_4d_projects_after_local_construction
34.35 s
gammaloop-nextest-core>
34.35 s
gammaloop-nextest-core> test result: FAILED. 0 passed; 1 failed; 0 ignored; 0 measured; 611 filtered out; finished in 0.39s
34.35 s
gammaloop-nextest-core>
34.35 s
gammaloop-nextest-core> stderr ---
34.35 s
gammaloop-nextest-core> Error:
34.35 s
gammaloop-nextest-core> 0: failed to extract three-dimensional representation graph input: source edge 1 has no unique routing for rewritten exact signature [-1, 0, 0] modulo the factorized opposite-domain loop span
34.35 s
gammaloop-nextest-core>
34.35 s
gammaloop-nextest-core> Location:
34.35 s
gammaloop-nextest-core> crates/gammalooprs/src/uv/approx/local_3d.rs :845
34.35 s
gammaloop-nextest-core>
34.35 s
gammaloop-nextest-core> ━━━━━━━━━━━━━━━━━━━━━━━━━━━━━━━━━━ BACKTRACE ━━━━━━━━━━━━━━━━━━━━━━━━━━━━━━━━━━━
34.35 s
gammaloop-nextest-core> 1: <color_eyre[51793ea62743adbd]::config::EyreHook>::into_eyre_hook::{closure#0} <unknown>
34.35 s
gammaloop-nextest-core> at <unknown source file> :<unknown line>
34.35 s
gammaloop-nextest-core> 2: eyre[cb2fd339c0c40fca]::capture_handler <unknown>
34.35 s
gammaloop-nextest-core> at <unknown source file> :<unknown line>
34.35 s
gammaloop-nextest-core> 3: <eyre[cb2fd339c0c40fca]::Report>::from_std::<three_dimensional_reps[3cb572ff22d197ac]::graph_io::GraphIoError> <unknown>
34.35 s
gammaloop-nextest-core> at <unknown source file> :<unknown line>
34.35 s
gammaloop-nextest-core> 4: <gammalooprs[972dff90865981f6]::uv::approx::local_3d::Localizer>::project_4d <unknown>
34.35 s
gammaloop-nextest-core> at <unknown source file> :<unknown line>
34.35 s
gammaloop-nextest-core> 5: gammalooprs[972dff90865981f6]::uv::hedge_poset::tests::spectacles_typed_4d_projects_after_local_construction <unknown>
34.35 s
gammaloop-nextest-core> at <unknown source file> :<unknown line>
34.35 s
gammaloop-nextest-core> 6: <gammalooprs[972dff90865981f6]::uv::hedge_poset::tests::spectacles_typed_4d_projects_after_local_construction::{closure#0} as core[940e698046960fd5]::ops::function::FnOnce<()>>::call_once <unknown>
34.35 s
gammaloop-nextest-core> at <unknown source file> :<unknown line>
34.35 s
gammaloop-nextest-core> 7: test[75d6903177b1d7e9]::__rust_begin_short_backtrace::<core[940e698046960fd5]::result::Result<(), alloc[2ea6bcb46fca0c42]::string::String>, fn() -> core[940e698046960fd5]::result::Result<(), alloc[2ea6bcb46fca0c42]::string::String>> <unknown>
34.35 s
gammaloop-nextest-core> at <unknown source file> :<unknown line>
34.35 s
gammaloop-nextest-core> 8: test[75d6903177b1d7e9]::run_test::{closure#0} <unknown>
34.35 s
gammaloop-nextest-core> at <unknown source file> :<unknown line>
34.35 s
gammaloop-nextest-core> 9: std[bcb96dfbba0ab899]::sys::backtrace::__rust_begin_short_backtrace::<test[75d6903177b1d7e9]::run_test::{closure#1}, ()> <unknown>
34.35 s
gammaloop-nextest-core> at <unknown source file> :<unknown line>
34.35 s
gammaloop-nextest-core> 10: <std[bcb96dfbba0ab899]::thread::lifecycle::spawn_unchecked<test[75d6903177b1d7e9]::run_test::{closure#1}, ()>::{closure#1} as core[940e698046960fd5]::ops::function::FnOnce<()>>::call_once::{shim:vtable#0} <unknown>
34.35 s
gammaloop-nextest-core> at <unknown source file> :<unknown line>
34.35 s
gammaloop-nextest-core> 11: <std[bcb96dfbba0ab899]::sys::thread::unix::Thread>::new::thread_start <unknown>
34.35 s
gammaloop-nextest-core> at <unknown source file> :<unknown line>
34.35 s
gammaloop-nextest-core> 12: start_thread <unknown>
34.35 s
gammaloop-nextest-core> at <unknown source file> :<unknown line>
34.35 s
gammaloop-nextest-core> 13: __clone3 <unknown>
34.35 s
gammaloop-nextest-core> at <unknown source file> :<unknown line>
34.35 s
gammaloop-nextest-core>
34.35 s
gammaloop-nextest-core> Run with COLORBT_SHOW_HIDDEN=1 environment variable to disable frame filtering.
34.35 s
gammaloop-nextest-core> Run with RUST_BACKTRACE=full to include source snippets.
34.35 s
gammaloop-nextest-core>
44.30 s
gammaloop-nextest-core> FAIL [ 9.979s] (558/561) gammalooprs uv::tests :: scalars_profile
44.31 s
gammaloop-nextest-core> stdout ---
44.31 s
gammaloop-nextest-core>
44.31 s
gammaloop-nextest-core> running 1 test
44.31 s
gammaloop-nextest-core> test uv::tests::scalars_profile ... FAILED
44.31 s
gammaloop-nextest-core>
44.31 s
gammaloop-nextest-core> failures:
44.31 s
gammaloop-nextest-core>
44.31 s
gammaloop-nextest-core> failures:
44.31 s
gammaloop-nextest-core> uv::tests::scalars_profile
44.31 s
gammaloop-nextest-core>
44.31 s
gammaloop-nextest-core> test result: FAILED. 0 passed; 1 failed; 0 ignored; 0 measured; 611 filtered out; finished in 9.96s
44.31 s
gammaloop-nextest-core>
44.31 s
gammaloop-nextest-core> stderr ---
44.31 s
gammaloop-nextest-core> [18:17:53.343] @gammalooprs::settings::runtime WARNING : No external kinematics were provided; using default-generated external momenta and helicities.
44.31 s
gammaloop-nextest-core> field value
44.31 s
gammaloop-nextest-core> span build_integrand{amplitude.name = bub}
44.31 s
gammaloop-nextest-core> at crates/gammalooprs/src/settings/runtime.rs:131
44.31 s
gammaloop-nextest-core> [18:17:53.344] @gammalooprs::integrands::process::amplitude INFO : Input is below threshold: 0 existing threshold E-surfaces across 0/3 graph groups
44.31 s
gammaloop-nextest-core> field value
44.31 s
gammaloop-nextest-core> existing_esurfaces 0
44.31 s
gammaloop-nextest-core> group_count 3
44.31 s
gammaloop-nextest-core> groups_above_threshold 0
44.31 s
gammaloop-nextest-core> integrand bub
44.31 s
gammaloop-nextest-core> span warm_up{integrand.name = bub}
44.31 s
gammaloop-nextest-core> threshold_status below threshold
44.31 s
gammaloop-nextest-core> at crates/gammalooprs/src/integrands/process/amplitude/mod.rs:1666
44.31 s
gammaloop-nextest-core> [18:17:53.345] @gammalooprs::integrands::process::amplitude INFO : overlap structure of group 0: [0: []]
44.31 s
gammaloop-nextest-core> field value
44.31 s
gammaloop-nextest-core> span warm_up{integrand.name = bub}
44.31 s
gammaloop-nextest-core> at crates/gammalooprs/src/integrands/process/amplitude/mod.rs:2015
44.31 s
gammaloop-nextest-core> [18:17:53.345] @gammalooprs::integrands::process::amplitude INFO : overlap structure of group 1: [0: []]
44.31 s
gammaloop-nextest-core> field value
44.31 s
gammaloop-nextest-core> span warm_up{integrand.name = bub}
44.31 s
gammaloop-nextest-core> at crates/gammalooprs/src/integrands/process/amplitude/mod.rs:2015
44.31 s
gammaloop-nextest-core> [18:17:53.345] @gammalooprs::integrands::process::amplitude INFO : overlap structure of group 2: [0: []]
44.31 s
gammaloop-nextest-core> field value
44.31 s
gammaloop-nextest-core> span warm_up{integrand.name = bub}
44.31 s
gammaloop-nextest-core> at crates/gammalooprs/src/integrands/process/amplitude/mod.rs:2015
44.31 s
gammaloop-nextest-core> The application panicked (crashed).
44.31 s
gammaloop-nextest-core> Message: assertion `left == right` failed: subtracted scalar UV profile failed:
44.31 s
gammaloop-nextest-core> UVProfilePassFail {
44.31 s
gammaloop-nextest-core> max_dod: -0.9,
44.31 s
gammaloop-nextest-core> total: 16,
44.31 s
gammaloop-nextest-core> failed: 1,
44.31 s
gammaloop-nextest-core> failures: [
44.31 s
gammaloop-nextest-core> UVProfileFailure {
44.31 s
gammaloop-nextest-core> graph_index: 0,
44.31 s
gammaloop-nextest-core> graph_name: "banana",
44.31 s
gammaloop-nextest-core> cutkosky_cut: None,
44.31 s
gammaloop-nextest-core> lmb_index: 1,
44.31 s
gammaloop-nextest-core> fixed: [
44.31 s
gammaloop-nextest-core> EdgeIndex(
44.31 s
gammaloop-nextest-core> 2,
44.31 s
gammaloop-nextest-core> ),
44.31 s
gammaloop-nextest-core> EdgeIndex(
44.31 s
gammaloop-nextest-core> 0,
44.31 s
gammaloop-nextest-core> ),
44.31 s
gammaloop-nextest-core> ],
44.31 s
gammaloop-nextest-core> free: [
44.31 s
gammaloop-nextest-core> EdgeIndex(
44.31 s
gammaloop-nextest-core> 3,
44.31 s
gammaloop-nextest-core> ),
44.31 s
gammaloop-nextest-core> ],
44.31 s
gammaloop-nextest-core> orientation_label: None,
44.31 s
gammaloop-nextest-core> reason: "dod_exceeds_threshold",
44.31 s
gammaloop-nextest-core> },
44.31 s
gammaloop-nextest-core> ],
44.31 s
gammaloop-nextest-core> }
44.31 s
gammaloop-nextest-core>
44.31 s
gammaloop-nextest-core> ╭─────────┬────────────┬───────────┬───────┬─────┬──────────┬───────────╮
44.31 s
gammaloop-nextest-core> │ fixed │ → ∞ │ slope │ r2 │ DOD │ bare DOD │ inspect │
44.31 s
gammaloop-nextest-core> ├─────────┼────────────┼───────────┼───────┼─────┼──────────┼───────────┤
44.31 s
gammaloop-nextest-core> │ {e1,e2} │ {e3} │ -0.996752 │ 1.000 │ -1 │ 0 │ arb retry │
44.31 s
gammaloop-nextest-core> │ {e1,e3} │ {e2} │ -1.065665 │ 0.997 │ -1 │ 0 │ arb retry │
44.31 s
gammaloop-nextest-core> │ {e1} │ {e2,e3} │ -0.937151 │ 0.943 │ -1 │ 2 │ │
44.31 s
gammaloop-nextest-core> │ {e2,e3} │ {e1} │ -1.001075 │ 1.000 │ -1 │ 0 │ arb retry │
44.31 s
gammaloop-nextest-core> │ {e2} │ {e1,e3} │ -0.984146 │ 0.998 │ -1 │ 2 │ │
44.31 s
gammaloop-nextest-core> │ {e3} │ {e1,e2} │ -1.383911 │ 0.982 │ -1 │ 2 │ arb retry │
44.31 s
gammaloop-nextest-core> │ {} │ {e1,e2,e3} │ -1.094213 │ 0.258 │ -1 │ 4 │ │
44.31 s
gammaloop-nextest-core> │ {e2,e0} │ {e3} │ -0.803348 │ 0.861 │ -1 │ 0 │ arb retry │
44.31 s
gammaloop-nextest-core> │ {e3,e0} │ {e2} │ -0.999257 │ 1.000 │ -1 │ 0 │ │
44.31 s
gammaloop-nextest-core> │ {e0} │ {e2,e3} │ -1.000893 │ 1.000 │ -1 │ 2 │ │
44.31 s
gammaloop-nextest-core> │ {e1,e0} │ {e3} │ -0.997860 │ 1.000 │ -1 │ 0 │ │
44.31 s
gammaloop-nextest-core> ╰─────────┴────────────┴───────────┴───────┴─────┴──────────┴───────────╯
44.31 s
gammaloop-nextest-core>
44.31 s
gammaloop-nextest-core> ╭───────┬─────────┬───────────┬───────┬─────┬──────────┬───────────╮
44.31 s
gammaloop-nextest-core> │ fixed │ → ∞ │ slope │ r2 │ DOD │ bare DOD │ inspect │
44.31 s
gammaloop-nextest-core> ├───────┼─────────┼───────────┼───────┼─────┼──────────┼───────────┤
44.31 s
gammaloop-nextest-core> │ {e1} │ {e2} │ -1.005039 │ 1.000 │ -1 │ 0 │ arb retry │
44.31 s
gammaloop-nextest-core> │ {e2} │ {e1} │ -1.001098 │ 1.000 │ -1 │ 0 │ arb retry │
44.31 s
gammaloop-nextest-core> │ {} │ {e1,e2} │ -1.011289 │ 1.000 │ -1 │ 2 │ │
44.31 s
gammaloop-nextest-core> │ {e0} │ {e2} │ -0.998140 │ 1.000 │ -1 │ 0 │ │
44.31 s
gammaloop-nextest-core> ╰───────┴─────────┴───────────┴───────┴─────┴──────────┴───────────╯
44.31 s
gammaloop-nextest-core>
44.31 s
gammaloop-nextest-core> ╭───────┬──────┬───────────┬───────┬─────┬──────────┬─────────╮
44.31 s
gammaloop-nextest-core> │ fixed │ → ∞ │ slope │ r2 │ DOD │ bare DOD │ inspect │
44.31 s
gammaloop-nextest-core> ├───────┼──────┼───────────┼───────┼─────┼──────────┼─────────┤
44.31 s
gammaloop-nextest-core> │ {} │ {e1} │ -0.989949 │ 1.000 │ -1 │ 0 │ │
44.31 s
gammaloop-nextest-core> ╰───────┴──────┴───────────┴───────┴─────┴──────────┴─────────╯
44.31 s
gammaloop-nextest-core> left: 1
44.31 s
gammaloop-nextest-core> right: 0
44.31 s
gammaloop-nextest-core> Location: crates/gammalooprs/src/uv/tests.rs :259
44.31 s
gammaloop-nextest-core>
44.31 s
gammaloop-nextest-core> ━━━━━━━━━━━━━━━━━━━━━━━━━━━━━━━━━━ BACKTRACE ━━━━━━━━━━━━━━━━━━━━━━━━━━━━━━━━━━━
44.31 s
gammaloop-nextest-core> 1: <color_eyre[51793ea62743adbd]::config::PanicHook>::panic_report <unknown>
44.31 s
gammaloop-nextest-core> at <unknown source file> :<unknown line>
44.31 s
gammaloop-nextest-core> 2: <color_eyre[51793ea62743adbd]::config::PanicHook>::into_panic_hook::{closure#0} <unknown>
44.31 s
gammaloop-nextest-core> at <unknown source file> :<unknown line>
44.31 s
gammaloop-nextest-core> 3: std[bcb96dfbba0ab899]::panicking::panic_with_hook <unknown>
44.31 s
gammaloop-nextest-core> at <unknown source file> :<unknown line>
44.31 s
gammaloop-nextest-core> 4: std[bcb96dfbba0ab899]::panicking::panic_handler::{closure#0} <unknown>
44.31 s
gammaloop-nextest-core> at <unknown source file> :<unknown line>
44.31 s
gammaloop-nextest-core> 5: std[bcb96dfbba0ab899]::sys::backtrace::__rust_end_short_backtrace::<std[bcb96dfbba0ab899]::panicking::panic_handler::{closure#0}, !> <unknown>
44.31 s
gammaloop-nextest-core> at <unknown source file> :<unknown line>
44.31 s
gammaloop-nextest-core> 6: __rustc[6c289b9f9c454d21]::rust_begin_unwind <unknown>
44.31 s
gammaloop-nextest-core> at <unknown source file> :<unknown line>
44.31 s
gammaloop-nextest-core> 7: core[940e698046960fd5]::panicking::panic_fmt <unknown>
44.31 s
gammaloop-nextest-core> at <unknown source file> :<unknown line>
44.31 s
gammaloop-nextest-core> 8: core[940e698046960fd5]::panicking::assert_failed_inner <unknown>
44.31 s
gammaloop-nextest-core> at <unknown source file> :<unknown line>
44.31 s
gammaloop-nextest-core> 9: core[940e698046960fd5]::panicking::assert_failed::<usize, usize> <unknown>
44.31 s
gammaloop-nextest-core> at <unknown source file> :<unknown line>
44.31 s
gammaloop-nextest-core> 10: gammalooprs[972dff90865981f6]::uv::tests::scalars_profile <unknown>
44.31 s
gammaloop-nextest-core> at <unknown source file> :<unknown line>
44.31 s
gammaloop-nextest-core> 11: <gammalooprs[972dff90865981f6]::uv::tests::scalars_profile::{closure#0} as core[940e698046960fd5]::ops::function::FnOnce<()>>::call_once <unknown>
44.31 s
gammaloop-nextest-core> at <unknown source file> :<unknown line>
44.31 s
gammaloop-nextest-core> 12: test[75d6903177b1d7e9]::__rust_begin_short_backtrace::<core[940e698046960fd5]::result::Result<(), alloc[2ea6bcb46fca0c42]::string::String>, fn() -> core[940e698046960fd5]::result::Result<(), alloc[2ea6bcb46fca0c42]::string::String>> <unknown>
44.31 s
gammaloop-nextest-core> at <unknown source file> :<unknown line>
44.31 s
gammaloop-nextest-core> 13: test[75d6903177b1d7e9]::run_test::{closure#0} <unknown>
44.31 s
gammaloop-nextest-core> at <unknown source file> :<unknown line>
44.31 s
gammaloop-nextest-core> 14: std[bcb96dfbba0ab899]::sys::backtrace::__rust_begin_short_backtrace::<test[75d6903177b1d7e9]::run_test::{closure#1}, ()> <unknown>
44.31 s
gammaloop-nextest-core> at <unknown source file> :<unknown line>
44.31 s
gammaloop-nextest-core> 15: <std[bcb96dfbba0ab899]::thread::lifecycle::spawn_unchecked<test[75d6903177b1d7e9]::run_test::{closure#1}, ()>::{closure#1} as core[940e698046960fd5]::ops::function::FnOnce<()>>::call_once::{shim:vtable#0} <unknown>
44.31 s
gammaloop-nextest-core> at <unknown source file> :<unknown line>
44.31 s
gammaloop-nextest-core> 16: <std[bcb96dfbba0ab899]::sys::thread::unix::Thread>::new::thread_start <unknown>
44.31 s
gammaloop-nextest-core> at <unknown source file> :<unknown line>
44.31 s
gammaloop-nextest-core> 17: start_thread <unknown>
44.31 s
gammaloop-nextest-core> at <unknown source file> :<unknown line>
44.31 s
gammaloop-nextest-core> 18: __clone3 <unknown>
44.31 s
gammaloop-nextest-core> at <unknown source file> :<unknown line>
44.31 s
gammaloop-nextest-core>
44.31 s
gammaloop-nextest-core> Run with COLORBT_SHOW_HIDDEN=1 environment variable to disable frame filtering.
44.31 s
gammaloop-nextest-core> Run with RUST_BACKTRACE=full to include source snippets.
44.31 s
gammaloop-nextest-core>
45.49 s
gammaloop-nextest-core> FAIL [ 11.152s] (559/561) gammalooprs uv::tests :: scalars_profile_new
45.49 s
gammaloop-nextest-core> stdout ---
45.49 s
gammaloop-nextest-core>
45.49 s
gammaloop-nextest-core> running 1 test
45.49 s
gammaloop-nextest-core> test uv::tests::scalars_profile_new ... FAILED
45.49 s
gammaloop-nextest-core>
45.49 s
gammaloop-nextest-core> failures:
45.49 s
gammaloop-nextest-core>
45.49 s
gammaloop-nextest-core> failures:
45.49 s
gammaloop-nextest-core> uv::tests::scalars_profile_new
45.49 s
gammaloop-nextest-core>
45.49 s
gammaloop-nextest-core> test result: FAILED. 0 passed; 1 failed; 0 ignored; 0 measured; 611 filtered out; finished in 11.13s
45.49 s
gammaloop-nextest-core>
45.49 s
gammaloop-nextest-core> stderr ---
45.49 s
gammaloop-nextest-core> [18:17:54.561] @gammalooprs::settings::runtime WARNING : No external kinematics were provided; using default-generated external momenta and helicities.
45.49 s
gammaloop-nextest-core> field value
45.49 s
gammaloop-nextest-core> span build_integrand{amplitude.name = bub}
45.49 s
gammaloop-nextest-core> at crates/gammalooprs/src/settings/runtime.rs:131
45.49 s
gammaloop-nextest-core> [18:17:54.562] @gammalooprs::integrands::process::amplitude INFO : Input is below threshold: 0 existing threshold E-surfaces across 0/3 graph groups
45.49 s
gammaloop-nextest-core> field value
45.49 s
gammaloop-nextest-core> existing_esurfaces 0
45.49 s
gammaloop-nextest-core> group_count 3
45.49 s
gammaloop-nextest-core> groups_above_threshold 0
45.49 s
gammaloop-nextest-core> integrand bub
45.49 s
gammaloop-nextest-core> span warm_up{integrand.name = bub}
45.49 s
gammaloop-nextest-core> threshold_status below threshold
45.49 s
gammaloop-nextest-core> at crates/gammalooprs/src/integrands/process/amplitude/mod.rs:1666
45.49 s
gammaloop-nextest-core> [18:17:54.562] @gammalooprs::integrands::process::amplitude INFO : overlap structure of group 0: [0: []]
45.49 s
gammaloop-nextest-core> field value
45.49 s
gammaloop-nextest-core> span warm_up{integrand.name = bub}
45.49 s
gammaloop-nextest-core> at crates/gammalooprs/src/integrands/process/amplitude/mod.rs:2015
45.49 s
gammaloop-nextest-core> [18:17:54.562] @gammalooprs::integrands::process::amplitude INFO : overlap structure of group 1: [0: []]
45.49 s
gammaloop-nextest-core> field value
45.49 s
gammaloop-nextest-core> span warm_up{integrand.name = bub}
45.49 s
gammaloop-nextest-core> at crates/gammalooprs/src/integrands/process/amplitude/mod.rs:2015
45.49 s
gammaloop-nextest-core> [18:17:54.562] @gammalooprs::integrands::process::amplitude INFO : overlap structure of group 2: [0: []]
45.49 s
gammaloop-nextest-core> field value
45.49 s
gammaloop-nextest-core> span warm_up{integrand.name = bub}
45.49 s
gammaloop-nextest-core> at crates/gammalooprs/src/integrands/process/amplitude/mod.rs:2015
45.49 s
gammaloop-nextest-core> The application panicked (crashed).
45.49 s
gammaloop-nextest-core> Message: assertion `left == right` failed: subtracted scalar UV profile failed:
45.49 s
gammaloop-nextest-core> UVProfilePassFail {
45.49 s
gammaloop-nextest-core> max_dod: -0.9,
45.49 s
gammaloop-nextest-core> total: 16,
45.49 s
gammaloop-nextest-core> failed: 1,
45.49 s
gammaloop-nextest-core> failures: [
45.49 s
gammaloop-nextest-core> UVProfileFailure {
45.49 s
gammaloop-nextest-core> graph_index: 0,
45.49 s
gammaloop-nextest-core> graph_name: "banana",
45.49 s
gammaloop-nextest-core> cutkosky_cut: None,
45.49 s
gammaloop-nextest-core> lmb_index: 1,
45.49 s
gammaloop-nextest-core> fixed: [
45.49 s
gammaloop-nextest-core> EdgeIndex(
45.49 s
gammaloop-nextest-core> 2,
45.49 s
gammaloop-nextest-core> ),
45.49 s
gammaloop-nextest-core> EdgeIndex(
45.49 s
gammaloop-nextest-core> 0,
45.49 s
gammaloop-nextest-core> ),
45.49 s
gammaloop-nextest-core> ],
45.49 s
gammaloop-nextest-core> free: [
45.49 s
gammaloop-nextest-core> EdgeIndex(
45.49 s
gammaloop-nextest-core> 3,
45.49 s
gammaloop-nextest-core> ),
45.49 s
gammaloop-nextest-core> ],
45.49 s
gammaloop-nextest-core> orientation_label: None,
45.49 s
gammaloop-nextest-core> reason: "dod_exceeds_threshold",
45.49 s
gammaloop-nextest-core> },
45.49 s
gammaloop-nextest-core> ],
45.49 s
gammaloop-nextest-core> }
45.49 s
gammaloop-nextest-core>
45.49 s
gammaloop-nextest-core> ╭─────────┬────────────┬───────────┬───────┬─────┬──────────┬───────────╮
45.49 s
gammaloop-nextest-core> │ fixed │ → ∞ │ slope │ r2 │ DOD │ bare DOD │ inspect │
45.49 s
gammaloop-nextest-core> ├─────────┼────────────┼───────────┼───────┼─────┼──────────┼───────────┤
45.49 s
gammaloop-nextest-core> │ {e1,e2} │ {e3} │ -0.996752 │ 1.000 │ -1 │ 0 │ arb retry │
45.49 s
gammaloop-nextest-core> │ {e1,e3} │ {e2} │ -1.065665 │ 0.997 │ -1 │ 0 │ arb retry │
45.49 s
gammaloop-nextest-core> │ {e1} │ {e2,e3} │ -0.937151 │ 0.943 │ -1 │ 2 │ │
45.49 s
gammaloop-nextest-core> │ {e2,e3} │ {e1} │ -1.001075 │ 1.000 │ -1 │ 0 │ arb retry │
45.49 s
gammaloop-nextest-core> │ {e2} │ {e1,e3} │ -0.984146 │ 0.998 │ -1 │ 2 │ │
45.49 s
gammaloop-nextest-core> │ {e3} │ {e1,e2} │ -1.383911 │ 0.982 │ -1 │ 2 │ arb retry │
45.49 s
gammaloop-nextest-core> │ {} │ {e1,e2,e3} │ -1.094213 │ 0.258 │ -1 │ 4 │ │
45.49 s
gammaloop-nextest-core> │ {e2,e0} │ {e3} │ -0.803348 │ 0.861 │ -1 │ 0 │ arb retry │
45.49 s
gammaloop-nextest-core> │ {e3,e0} │ {e2} │ -0.999257 │ 1.000 │ -1 │ 0 │ │
45.49 s
gammaloop-nextest-core> │ {e0} │ {e2,e3} │ -1.000893 │ 1.000 │ -1 │ 2 │ │
45.49 s
gammaloop-nextest-core> │ {e1,e0} │ {e3} │ -0.997860 │ 1.000 │ -1 │ 0 │ │
45.49 s
gammaloop-nextest-core> ╰─────────┴────────────┴───────────┴───────┴─────┴──────────┴───────────╯
45.49 s
gammaloop-nextest-core>
45.49 s
gammaloop-nextest-core> ╭───────┬─────────┬───────────┬───────┬─────┬──────────┬───────────╮
45.49 s
gammaloop-nextest-core> │ fixed │ → ∞ │ slope │ r2 │ DOD │ bare DOD │ inspect │
45.49 s
gammaloop-nextest-core> ├───────┼─────────┼───────────┼───────┼─────┼──────────┼───────────┤
45.49 s
gammaloop-nextest-core> │ {e1} │ {e2} │ -1.005039 │ 1.000 │ -1 │ 0 │ arb retry │
45.49 s
gammaloop-nextest-core> │ {e2} │ {e1} │ -1.001098 │ 1.000 │ -1 │ 0 │ arb retry │
45.49 s
gammaloop-nextest-core> │ {} │ {e1,e2} │ -1.011289 │ 1.000 │ -1 │ 2 │ │
45.49 s
gammaloop-nextest-core> │ {e0} │ {e2} │ -0.998140 │ 1.000 │ -1 │ 0 │ │
45.49 s
gammaloop-nextest-core> ╰───────┴─────────┴───────────┴───────┴─────┴──────────┴───────────╯
45.49 s
gammaloop-nextest-core>
45.49 s
gammaloop-nextest-core> ╭───────┬──────┬───────────┬───────┬─────┬──────────┬─────────╮
45.49 s
gammaloop-nextest-core> │ fixed │ → ∞ │ slope │ r2 │ DOD │ bare DOD │ inspect │
45.49 s
gammaloop-nextest-core> ├───────┼──────┼───────────┼───────┼─────┼──────────┼─────────┤
45.49 s
gammaloop-nextest-core> │ {} │ {e1} │ -0.989949 │ 1.000 │ -1 │ 0 │ │
45.49 s
gammaloop-nextest-core> ╰───────┴──────┴───────────┴───────┴─────┴──────────┴─────────╯
45.49 s
gammaloop-nextest-core> left: 1
45.49 s
gammaloop-nextest-core> right: 0
45.49 s
gammaloop-nextest-core> Location: crates/gammalooprs/src/uv/tests.rs :325
45.49 s
gammaloop-nextest-core>
45.49 s
gammaloop-nextest-core> ━━━━━━━━━━━━━━━━━━━━━━━━━━━━━━━━━━ BACKTRACE ━━━━━━━━━━━━━━━━━━━━━━━━━━━━━━━━━━━
45.49 s
gammaloop-nextest-core> 1: <color_eyre[51793ea62743adbd]::config::PanicHook>::panic_report <unknown>
45.49 s
gammaloop-nextest-core> at <unknown source file> :<unknown line>
45.49 s
gammaloop-nextest-core> 2: <color_eyre[51793ea62743adbd]::config::PanicHook>::into_panic_hook::{closure#0} <unknown>
45.49 s
gammaloop-nextest-core> at <unknown source file> :<unknown line>
45.49 s
gammaloop-nextest-core> 3: std[bcb96dfbba0ab899]::panicking::panic_with_hook <unknown>
45.49 s
gammaloop-nextest-core> at <unknown source file> :<unknown line>
45.49 s
gammaloop-nextest-core> 4: std[bcb96dfbba0ab899]::panicking::panic_handler::{closure#0} <unknown>
45.49 s
gammaloop-nextest-core> at <unknown source file> :<unknown line>
45.49 s
gammaloop-nextest-core> 5: std[bcb96dfbba0ab899]::sys::backtrace::__rust_end_short_backtrace::<std[bcb96dfbba0ab899]::panicking::panic_handler::{closure#0}, !> <unknown>
45.49 s
gammaloop-nextest-core> at <unknown source file> :<unknown line>
45.49 s
gammaloop-nextest-core> 6: __rustc[6c289b9f9c454d21]::rust_begin_unwind <unknown>
45.49 s
gammaloop-nextest-core> at <unknown source file> :<unknown line>
45.49 s
gammaloop-nextest-core> 7: core[940e698046960fd5]::panicking::panic_fmt <unknown>
45.49 s
gammaloop-nextest-core> at <unknown source file> :<unknown line>
45.49 s
gammaloop-nextest-core> 8: core[940e698046960fd5]::panicking::assert_failed_inner <unknown>
45.49 s
gammaloop-nextest-core> at <unknown source file> :<unknown line>
45.49 s
gammaloop-nextest-core> 9: core[940e698046960fd5]::panicking::assert_failed::<usize, usize> <unknown>
45.49 s
gammaloop-nextest-core> at <unknown source file> :<unknown line>
45.49 s
gammaloop-nextest-core> 10: gammalooprs[972dff90865981f6]::uv::tests::scalars_profile_new <unknown>
45.49 s
gammaloop-nextest-core> at <unknown source file> :<unknown line>
45.49 s
gammaloop-nextest-core> 11: <gammalooprs[972dff90865981f6]::uv::tests::scalars_profile_new::{closure#0} as core[940e698046960fd5]::ops::function::FnOnce<()>>::call_once <unknown>
45.49 s
gammaloop-nextest-core> at <unknown source file> :<unknown line>
45.49 s
gammaloop-nextest-core> 12: test[75d6903177b1d7e9]::__rust_begin_short_backtrace::<core[940e698046960fd5]::result::Result<(), alloc[2ea6bcb46fca0c42]::string::String>, fn() -> core[940e698046960fd5]::result::Result<(), alloc[2ea6bcb46fca0c42]::string::String>> <unknown>
45.49 s
gammaloop-nextest-core> at <unknown source file> :<unknown line>
45.49 s
gammaloop-nextest-core> 13: test[75d6903177b1d7e9]::run_test::{closure#0} <unknown>
45.49 s
gammaloop-nextest-core> at <unknown source file> :<unknown line>
45.49 s
gammaloop-nextest-core> 14: std[bcb96dfbba0ab899]::sys::backtrace::__rust_begin_short_backtrace::<test[75d6903177b1d7e9]::run_test::{closure#1}, ()> <unknown>
45.49 s
gammaloop-nextest-core> at <unknown source file> :<unknown line>
45.49 s
gammaloop-nextest-core> 15: <std[bcb96dfbba0ab899]::thread::lifecycle::spawn_unchecked<test[75d6903177b1d7e9]::run_test::{closure#1}, ()>::{closure#1} as core[940e698046960fd5]::ops::function::FnOnce<()>>::call_once::{shim:vtable#0} <unknown>
45.49 s
gammaloop-nextest-core> at <unknown source file> :<unknown line>
45.49 s
gammaloop-nextest-core> 16: <std[bcb96dfbba0ab899]::sys::thread::unix::Thread>::new::thread_start <unknown>
45.49 s
gammaloop-nextest-core> at <unknown source file> :<unknown line>
45.49 s
gammaloop-nextest-core> 17: start_thread <unknown>
45.49 s
gammaloop-nextest-core> at <unknown source file> :<unknown line>
45.49 s
gammaloop-nextest-core> 18: __clone3 <unknown>
45.49 s
gammaloop-nextest-core> at <unknown source file> :<unknown line>
45.49 s
gammaloop-nextest-core>
45.49 s
gammaloop-nextest-core> Run with COLORBT_SHOW_HIDDEN=1 environment variable to disable frame filtering.
45.49 s
gammaloop-nextest-core> Run with RUST_BACKTRACE=full to include source snippets.
45.49 s
gammaloop-nextest-core>
47.18 s
gammaloop-nextest-core> ------------
47.18 s
gammaloop-nextest-core> Summary [ 15.540s] 561 tests run: 556 passed , 5 failed , 59 skipped
47.18 s
gammaloop-nextest-core> FAIL [ 0.168s] ( 53/561) gammalooprs cff::tests :: stored_production_cff_uses_typed_energy_factor_ownership
47.18 s
gammaloop-nextest-core> stdout ---
47.18 s
gammaloop-nextest-core>
47.18 s
gammaloop-nextest-core> running 1 test
47.18 s
gammaloop-nextest-core> test cff::tests::stored_production_cff_uses_typed_energy_factor_ownership ... FAILED
47.18 s
gammaloop-nextest-core>
47.18 s
gammaloop-nextest-core> failures:
47.18 s
gammaloop-nextest-core>
47.18 s
gammaloop-nextest-core> failures:
47.18 s
gammaloop-nextest-core> cff::tests::stored_production_cff_uses_typed_energy_factor_ownership
47.18 s
gammaloop-nextest-core>
47.18 s
gammaloop-nextest-core> test result: FAILED. 0 passed; 1 failed; 0 ignored; 0 measured; 611 filtered out; finished in 0.15s
47.18 s
gammaloop-nextest-core>
47.18 s
gammaloop-nextest-core> stderr ---
47.18 s
gammaloop-nextest-core> The application panicked (crashed).
47.18 s
gammaloop-nextest-core> Message: assertion `left == right` failed
47.18 s
gammaloop-nextest-core> left: 1
47.18 s
gammaloop-nextest-core> right: -1
47.18 s
gammaloop-nextest-core> Location: crates/gammalooprs/src/cff/mod.rs :2721
47.18 s
gammaloop-nextest-core>
47.18 s
gammaloop-nextest-core> ━━━━━━━━━━━━━━━━━━━━━━━━━━━━━━━━━━ BACKTRACE ━━━━━━━━━━━━━━━━━━━━━━━━━━━━━━━━━━━
47.18 s
gammaloop-nextest-core> 1: <color_eyre[51793ea62743adbd]::config::PanicHook>::panic_report <unknown>
47.18 s
gammaloop-nextest-core> at <unknown source file> :<unknown line>
47.18 s
gammaloop-nextest-core> 2: <color_eyre[51793ea62743adbd]::config::PanicHook>::into_panic_hook::{closure#0} <unknown>
47.18 s
gammaloop-nextest-core> at <unknown source file> :<unknown line>
47.18 s
gammaloop-nextest-core> 3: std[bcb96dfbba0ab899]::panicking::panic_with_hook <unknown>
47.18 s
gammaloop-nextest-core> at <unknown source file> :<unknown line>
47.18 s
gammaloop-nextest-core> 4: std[bcb96dfbba0ab899]::panicking::panic_handler::{closure#0} <unknown>
47.18 s
gammaloop-nextest-core> at <unknown source file> :<unknown line>
47.18 s
gammaloop-nextest-core> 5: std[bcb96dfbba0ab899]::sys::backtrace::__rust_end_short_backtrace::<std[bcb96dfbba0ab899]::panicking::panic_handler::{closure#0}, !> <unknown>
47.18 s
gammaloop-nextest-core> at <unknown source file> :<unknown line>
47.18 s
gammaloop-nextest-core> 6: __rustc[6c289b9f9c454d21]::rust_begin_unwind <unknown>
47.18 s
gammaloop-nextest-core> at <unknown source file> :<unknown line>
47.18 s
gammaloop-nextest-core> 7: core[940e698046960fd5]::panicking::panic_fmt <unknown>
47.18 s
gammaloop-nextest-core> at <unknown source file> :<unknown line>
47.18 s
gammaloop-nextest-core> 8: core[940e698046960fd5]::panicking::assert_failed_inner <unknown>
47.18 s
gammaloop-nextest-core> at <unknown source file> :<unknown line>
47.18 s
gammaloop-nextest-core> 9: core[940e698046960fd5]::panicking::assert_failed::<i64, i64> <unknown>
47.18 s
gammaloop-nextest-core> at <unknown source file> :<unknown line>
47.18 s
gammaloop-nextest-core> 10: gammalooprs[972dff90865981f6]::cff::tests::stored_production_cff_uses_typed_energy_factor_ownership <unknown>
47.18 s
gammaloop-nextest-core> at <unknown source file> :<unknown line>
47.18 s
gammaloop-nextest-core> 11: <gammalooprs[972dff90865981f6]::cff::tests::stored_production_cff_uses_typed_energy_factor_ownership::{closure#0} as core[940e698046960fd5]::ops::function::FnOnce<()>>::call_once <unknown>
47.18 s
gammaloop-nextest-core> at <unknown source file> :<unknown line>
47.18 s
gammaloop-nextest-core> 12: test[75d6903177b1d7e9]::__rust_begin_short_backtrace::<core[940e698046960fd5]::result::Result<(), alloc[2ea6bcb46fca0c42]::string::String>, fn() -> core[940e698046960fd5]::result::Result<(), alloc[2ea6bcb46fca0c42]::string::String>> <unknown>
47.18 s
gammaloop-nextest-core> at <unknown source file> :<unknown line>
47.18 s
gammaloop-nextest-core> 13: test[75d6903177b1d7e9]::run_test::{closure#0} <unknown>
47.18 s
gammaloop-nextest-core> at <unknown source file> :<unknown line>
47.18 s
gammaloop-nextest-core> 14: std[bcb96dfbba0ab899]::sys::backtrace::__rust_begin_short_backtrace::<test[75d6903177b1d7e9]::run_test::{closure#1}, ()> <unknown>
47.18 s
gammaloop-nextest-core> at <unknown source file> :<unknown line>
47.18 s
gammaloop-nextest-core> 15: <std[bcb96dfbba0ab899]::thread::lifecycle::spawn_unchecked<test[75d6903177b1d7e9]::run_test::{closure#1}, ()>::{closure#1} as core[940e698046960fd5]::ops::function::FnOnce<()>>::call_once::{shim:vtable#0} <unknown>
47.18 s
gammaloop-nextest-core> at <unknown source file> :<unknown line>
47.18 s
gammaloop-nextest-core> 16: <std[bcb96dfbba0ab899]::sys::thread::unix::Thread>::new::thread_start <unknown>
47.18 s
gammaloop-nextest-core> at <unknown source file> :<unknown line>
47.18 s
gammaloop-nextest-core> 17: start_thread <unknown>
47.18 s
gammaloop-nextest-core> at <unknown source file> :<unknown line>
47.18 s
gammaloop-nextest-core> 18: __clone3 <unknown>
47.18 s
gammaloop-nextest-core> at <unknown source file> :<unknown line>
47.18 s
gammaloop-nextest-core>
47.18 s
gammaloop-nextest-core> Run with COLORBT_SHOW_HIDDEN=1 environment variable to disable frame filtering.
47.18 s
gammaloop-nextest-core> Run with RUST_BACKTRACE=full to include source snippets.
47.18 s
gammaloop-nextest-core>
47.18 s
gammaloop-nextest-core> FAIL [ 0.108s] (483/561) gammalooprs uv::approx::local_3d::tests :: production_emr_map_cancels_one_powered_denominator
47.18 s
gammaloop-nextest-core> stdout ---
47.18 s
gammaloop-nextest-core>
47.18 s
gammaloop-nextest-core> running 1 test
47.18 s
gammaloop-nextest-core> test uv::approx::local_3d::tests::production_emr_map_cancels_one_powered_denominator ... FAILED
47.18 s
gammaloop-nextest-core>
47.18 s
gammaloop-nextest-core> failures:
47.18 s
gammaloop-nextest-core>
47.18 s
gammaloop-nextest-core> failures:
47.18 s
gammaloop-nextest-core> uv::approx::local_3d::tests::production_emr_map_cancels_one_powered_denominator
47.18 s
gammaloop-nextest-core>
47.18 s
gammaloop-nextest-core> test result: FAILED. 0 passed; 1 failed; 0 ignored; 0 measured; 611 filtered out; finished in 0.09s
47.18 s
gammaloop-nextest-core>
47.18 s
gammaloop-nextest-core> stderr ---
47.18 s
gammaloop-nextest-core> The application panicked (crashed).
47.18 s
gammaloop-nextest-core> Message: summed exact-source powered and selected lower channels differ: powered=-1 𝑖 /8/𝜋^3, lower=1𝑖 /16/𝜋^3, difference=-3𝑖 /16/𝜋^3
47.18 s
gammaloop-nextest-core> Location: crates/gammalooprs/src/uv/approx/local_3d.rs :2047
47.18 s
gammaloop-nextest-core>
47.18 s
gammaloop-nextest-core> ━━━━━━━━━━━━━━━━━━━━━━━━━━━━━━━━━━ BACKTRACE ━━━━━━━━━━━━━━━━━━━━━━━━━━━━━━━━━━━
47.18 s
gammaloop-nextest-core> 1: <color_eyre[51793ea62743adbd]::config::PanicHook>::panic_report <unknown>
47.18 s
gammaloop-nextest-core> at <unknown source file> :<unknown line>
47.18 s
gammaloop-nextest-core> 2: <color_eyre[51793ea62743adbd]::config::PanicHook>::into_panic_hook::{closure#0} <unknown>
47.18 s
gammaloop-nextest-core> at <unknown source file> :<unknown line>
47.18 s
gammaloop-nextest-core> 3: std[bcb96dfbba0ab899]::panicking::panic_with_hook <unknown>
47.18 s
gammaloop-nextest-core> at <unknown source file> :<unknown line>
47.18 s
gammaloop-nextest-core> 4: std[bcb96dfbba0ab899]::panicking::panic_handler::{closure#0} <unknown>
47.18 s
gammaloop-nextest-core> at <unknown source file> :<unknown line>
47.18 s
gammaloop-nextest-core> 5: std[bcb96dfbba0ab899]::sys::backtrace::__rust_end_short_backtrace::<std[bcb96dfbba0ab899]::panicking::panic_handler::{closure#0}, !> <unknown>
47.18 s
gammaloop-nextest-core> at <unknown source file> :<unknown line>
47.18 s
gammaloop-nextest-core> 6: __rustc[6c289b9f9c454d21]::rust_begin_unwind <unknown>
47.18 s
gammaloop-nextest-core> at <unknown source file> :<unknown line>
47.18 s
gammaloop-nextest-core> 7: core[940e698046960fd5]::panicking::panic_fmt <unknown>
47.18 s
gammaloop-nextest-core> at <unknown source file> :<unknown line>
47.18 s
gammaloop-nextest-core> 8: gammalooprs[972dff90865981f6]::uv::approx::local_3d::tests::production_emr_map_cancels_one_powered_denominator <unknown>
47.18 s
gammaloop-nextest-core> at <unknown source file> :<unknown line>
47.18 s
gammaloop-nextest-core> 9: <gammalooprs[972dff90865981f6]::uv::approx::local_3d::tests::production_emr_map_cancels_one_powered_denominator::{closure#0} as core[940e698046960fd5]::ops::function::FnOnce<()>>::call_once <unknown>
47.18 s
gammaloop-nextest-core> at <unknown source file> :<unknown line>
47.18 s
gammaloop-nextest-core> 10: test[75d6903177b1d7e9]::__rust_begin_short_backtrace::<core[940e698046960fd5]::result::Result<(), alloc[2ea6bcb46fca0c42]::string::String>, fn() -> core[940e698046960fd5]::result::Result<(), alloc[2ea6bcb46fca0c42]::string::String>> <unknown>
47.18 s
gammaloop-nextest-core> at <unknown source file> :<unknown line>
47.18 s
gammaloop-nextest-core> 11: test[75d6903177b1d7e9]::run_test::{closure#0} <unknown>
47.18 s
gammaloop-nextest-core> at <unknown source file> :<unknown line>
47.18 s
gammaloop-nextest-core> 12: std[bcb96dfbba0ab899]::sys::backtrace::__rust_begin_short_backtrace::<test[75d6903177b1d7e9]::run_test::{closure#1}, ()> <unknown>
47.18 s
gammaloop-nextest-core> at <unknown source file> :<unknown line>
47.18 s
gammaloop-nextest-core> 13: <std[bcb96dfbba0ab899]::thread::lifecycle::spawn_unchecked<test[75d6903177b1d7e9]::run_test::{closure#1}, ()>::{closure#1} as core[940e698046960fd5]::ops::function::FnOnce<()>>::call_once::{shim:vtable#0} <unknown>
47.18 s
gammaloop-nextest-core> at <unknown source file> :<unknown line>
47.18 s
gammaloop-nextest-core> 14: <std[bcb96dfbba0ab899]::sys::thread::unix::Thread>::new::thread_start <unknown>
47.18 s
gammaloop-nextest-core> at <unknown source file> :<unknown line>
47.18 s
gammaloop-nextest-core> 15: start_thread <unknown>
47.18 s
gammaloop-nextest-core> at <unknown source file> :<unknown line>
47.18 s
gammaloop-nextest-core> 16: __clone3 <unknown>
47.18 s
gammaloop-nextest-core> at <unknown source file> :<unknown line>
47.18 s
gammaloop-nextest-core>
47.18 s
gammaloop-nextest-core> Run with COLORBT_SHOW_HIDDEN=1 environment variable to disable frame filtering.
47.18 s
gammaloop-nextest-core> Run with RUST_BACKTRACE=full to include source snippets.
47.18 s
gammaloop-nextest-core>
47.18 s
gammaloop-nextest-core> FAIL [ 0.424s] (539/561) gammalooprs uv::hedge_poset::tests :: spectacles_typed_4d_projects_after_local_construction
47.18 s
gammaloop-nextest-core> stdout ---
47.18 s
gammaloop-nextest-core>
47.18 s
gammaloop-nextest-core> running 1 test
47.18 s
gammaloop-nextest-core> digraph {
47.18 s
gammaloop-nextest-core> node [shape=circle,height=0.1,label=""];
47.18 s
gammaloop-nextest-core> overlap = "scale";
47.18 s
gammaloop-nextest-core> layout = "neato";
47.18 s
gammaloop-nextest-core> start=2;
47.18 s
gammaloop-nextest-core> 4 [label="0"];
47.18 s
gammaloop-nextest-core> 1 [label="zw"];
47.18 s
gammaloop-nextest-core> 2 [label="F"];
47.18 s
gammaloop-nextest-core> 0 [label="143"];
47.18 s
gammaloop-nextest-core> 3 [label="10B"];
47.18 s
gammaloop-nextest-core> 4:0:s -> 1:1:s [id=0 color="red:blue;0.5" label="zw"];
47.18 s
gammaloop-nextest-core> 4:2:s -> 2:3:s [id=1 color="red:blue;0.5" label="F"];
47.18 s
gammaloop-nextest-core> 3:5:s -> 0:4:s [id=2 color="red:blue;0.5" label="143"];
47.18 s
gammaloop-nextest-core> 4:6:s -> 0:7:s [id=3 color="red:blue;0.5" label="143"];
47.18 s
gammaloop-nextest-core> 1:8:s -> 3:9:s [id=4 color="red:blue;0.5" label="F"];
47.18 s
gammaloop-nextest-core> 1:10:s -> 0:11:s [id=5 color="red:blue;0.5" label="143"];
47.18 s
gammaloop-nextest-core> 2:12:s -> 3:13:s [id=6 color="red:blue;0.5" label="zw"];
47.18 s
gammaloop-nextest-core> 2:14:s -> 0:15:s [id=7 color="red:blue;0.5" label="143"];
47.18 s
gammaloop-nextest-core> }
47.18 s
gammaloop-nextest-core>
47.18 s
gammaloop-nextest-core> digraph {
47.18 s
gammaloop-nextest-core> node [shape=circle,height=0.1,label=""];
47.18 s
gammaloop-nextest-core> overlap = "scale";
47.18 s
gammaloop-nextest-core> layout = "neato";
47.18 s
gammaloop-nextest-core> start=2;
47.18 s
gammaloop-nextest-core> 0 [label="∅"];
47.18 s
gammaloop-nextest-core> 1 [label="{zw}: Approx(S_zw(0))"];
47.18 s
gammaloop-nextest-core> 2 [label="{F}: Approx(S_F(1))"];
47.18 s
gammaloop-nextest-core> 3 [label="{143}: Approx(S_143(3))"];
47.18 s
gammaloop-nextest-core> 4 [label="{zw,F}: Approx(S_F(4))*Approx(S_zw(0))"];
47.18 s
gammaloop-nextest-core> 5 [label="{zw} · {143}: Approx((-1*S_zw+S_143(5))*Approx(S_zw(0)))"];
47.18 s
gammaloop-nextest-core> 6 [label="{F} · {143}: Approx((-1*S_F+S_143(7))*Approx(S_F(1)))"];
47.18 s
gammaloop-nextest-core> 7 [label="{zw,F} · {143}: Approx((-1*S_10B+S_143(2))*Approx(S_F(4))*Approx(S_zw(0)))"];
47.18 s
gammaloop-nextest-core> 0:0:s -> 1:1:s [id=0 color="red:blue;0.5"];
47.18 s
gammaloop-nextest-core> 0:2:s -> 2:3:s [id=1 color="red:blue;0.5"];
47.18 s
gammaloop-nextest-core> 0:4:s -> 3:5:s [id=2 color="red:blue;0.5"];
47.18 s
gammaloop-nextest-core> 1:6:s -> 4:7:s [id=3 color="red:blue;0.5"];
47.18 s
gammaloop-nextest-core> 1:8:s -> 5:9:s [id=4 color="red:blue;0.5"];
47.18 s
gammaloop-nextest-core> 2:10:s -> 4:11:s [id=5 color="red:blue;0.5"];
47.18 s
gammaloop-nextest-core> 2:12:s -> 6:13:s [id=6 color="red:blue;0.5"];
47.18 s
gammaloop-nextest-core> 4:14:s -> 7:15:s [id=7 color="red:blue;0.5"];
47.18 s
gammaloop-nextest-core> }
47.18 s
gammaloop-nextest-core>
47.18 s
gammaloop-nextest-core> test uv::hedge_poset::tests::spectacles_typed_4d_projects_after_local_construction ... FAILED
47.18 s
gammaloop-nextest-core>
47.18 s
gammaloop-nextest-core> failures:
47.18 s
gammaloop-nextest-core>
47.18 s
gammaloop-nextest-core> failures:
47.18 s
gammaloop-nextest-core> uv::hedge_poset::tests::spectacles_typed_4d_projects_after_local_construction
47.18 s
gammaloop-nextest-core>
47.18 s
gammaloop-nextest-core> test result: FAILED. 0 passed; 1 failed; 0 ignored; 0 measured; 611 filtered out; finished in 0.39s
47.18 s
gammaloop-nextest-core>
47.18 s
gammaloop-nextest-core> stderr ---
47.18 s
gammaloop-nextest-core> Error:
47.18 s
gammaloop-nextest-core> 0: failed to extract three-dimensional representation graph input: source edge 1 has no unique routing for rewritten exact signature [-1, 0, 0] modulo the factorized opposite-domain loop span
47.18 s
gammaloop-nextest-core>
47.18 s
gammaloop-nextest-core> Location:
47.18 s
gammaloop-nextest-core> crates/gammalooprs/src/uv/approx/local_3d.rs :845
47.18 s
gammaloop-nextest-core>
47.18 s
gammaloop-nextest-core> ━━━━━━━━━━━━━━━━━━━━━━━━━━━━━━━━━━ BACKTRACE ━━━━━━━━━━━━━━━━━━━━━━━━━━━━━━━━━━━
47.18 s
gammaloop-nextest-core> 1: <color_eyre[51793ea62743adbd]::config::EyreHook>::into_eyre_hook::{closure#0} <unknown>
47.18 s
gammaloop-nextest-core> at <unknown source file> :<unknown line>
47.18 s
gammaloop-nextest-core> 2: eyre[cb2fd339c0c40fca]::capture_handler <unknown>
47.18 s
gammaloop-nextest-core> at <unknown source file> :<unknown line>
47.18 s
gammaloop-nextest-core> 3: <eyre[cb2fd339c0c40fca]::Report>::from_std::<three_dimensional_reps[3cb572ff22d197ac]::graph_io::GraphIoError> <unknown>
47.18 s
gammaloop-nextest-core> at <unknown source file> :<unknown line>
47.18 s
gammaloop-nextest-core> 4: <gammalooprs[972dff90865981f6]::uv::approx::local_3d::Localizer>::project_4d <unknown>
47.18 s
gammaloop-nextest-core> at <unknown source file> :<unknown line>
47.18 s
gammaloop-nextest-core> 5: gammalooprs[972dff90865981f6]::uv::hedge_poset::tests::spectacles_typed_4d_projects_after_local_construction <unknown>
47.18 s
gammaloop-nextest-core> at <unknown source file> :<unknown line>
47.18 s
gammaloop-nextest-core> 6: <gammalooprs[972dff90865981f6]::uv::hedge_poset::tests::spectacles_typed_4d_projects_after_local_construction::{closure#0} as core[940e698046960fd5]::ops::function::FnOnce<()>>::call_once <unknown>
47.18 s
gammaloop-nextest-core> at <unknown source file> :<unknown line>
47.18 s
gammaloop-nextest-core> 7: test[75d6903177b1d7e9]::__rust_begin_short_backtrace::<core[940e698046960fd5]::result::Result<(), alloc[2ea6bcb46fca0c42]::string::String>, fn() -> core[940e698046960fd5]::result::Result<(), alloc[2ea6bcb46fca0c42]::string::String>> <unknown>
47.18 s
gammaloop-nextest-core> at <unknown source file> :<unknown line>
47.18 s
gammaloop-nextest-core> 8: test[75d6903177b1d7e9]::run_test::{closure#0} <unknown>
47.18 s
gammaloop-nextest-core> at <unknown source file> :<unknown line>
47.18 s
gammaloop-nextest-core> 9: std[bcb96dfbba0ab899]::sys::backtrace::__rust_begin_short_backtrace::<test[75d6903177b1d7e9]::run_test::{closure#1}, ()> <unknown>
47.18 s
gammaloop-nextest-core> at <unknown source file> :<unknown line>
47.18 s
gammaloop-nextest-core> 10: <std[bcb96dfbba0ab899]::thread::lifecycle::spawn_unchecked<test[75d6903177b1d7e9]::run_test::{closure#1}, ()>::{closure#1} as core[940e698046960fd5]::ops::function::FnOnce<()>>::call_once::{shim:vtable#0} <unknown>
47.18 s
gammaloop-nextest-core> at <unknown source file> :<unknown line>
47.18 s
gammaloop-nextest-core> 11: <std[bcb96dfbba0ab899]::sys::thread::unix::Thread>::new::thread_start <unknown>
47.18 s
gammaloop-nextest-core> at <unknown source file> :<unknown line>
47.18 s
gammaloop-nextest-core> 12: start_thread <unknown>
47.18 s
gammaloop-nextest-core> at <unknown source file> :<unknown line>
47.18 s
gammaloop-nextest-core> 13: __clone3 <unknown>
47.18 s
gammaloop-nextest-core> at <unknown source file> :<unknown line>
47.18 s
gammaloop-nextest-core>
47.18 s
gammaloop-nextest-core> Run with COLORBT_SHOW_HIDDEN=1 environment variable to disable frame filtering.
47.18 s
gammaloop-nextest-core> Run with RUST_BACKTRACE=full to include source snippets.
47.18 s
gammaloop-nextest-core>
47.18 s
gammaloop-nextest-core> FAIL [ 9.979s] (558/561) gammalooprs uv::tests :: scalars_profile
47.18 s
gammaloop-nextest-core> stdout ---
47.18 s
gammaloop-nextest-core>
47.18 s
gammaloop-nextest-core> running 1 test
47.18 s
gammaloop-nextest-core> test uv::tests::scalars_profile ... FAILED
47.18 s
gammaloop-nextest-core>
47.18 s
gammaloop-nextest-core> failures:
47.18 s
gammaloop-nextest-core>
47.18 s
gammaloop-nextest-core> failures:
47.18 s
gammaloop-nextest-core> uv::tests::scalars_profile
47.18 s
gammaloop-nextest-core>
47.18 s
gammaloop-nextest-core> test result: FAILED. 0 passed; 1 failed; 0 ignored; 0 measured; 611 filtered out; finished in 9.96s
47.18 s
gammaloop-nextest-core>
47.18 s
gammaloop-nextest-core> stderr ---
47.18 s
gammaloop-nextest-core> [18:17:53.343] @gammalooprs::settings::runtime WARNING : No external kinematics were provided; using default-generated external momenta and helicities.
47.18 s
gammaloop-nextest-core> field value
47.18 s
gammaloop-nextest-core> span build_integrand{amplitude.name = bub}
47.18 s
gammaloop-nextest-core> at crates/gammalooprs/src/settings/runtime.rs:131
47.18 s
gammaloop-nextest-core> [18:17:53.344] @gammalooprs::integrands::process::amplitude INFO : Input is below threshold: 0 existing threshold E-surfaces across 0/3 graph groups
47.18 s
gammaloop-nextest-core> field value
47.18 s
gammaloop-nextest-core> existing_esurfaces 0
47.18 s
gammaloop-nextest-core> group_count 3
47.18 s
gammaloop-nextest-core> groups_above_threshold 0
47.18 s
gammaloop-nextest-core> integrand bub
47.18 s
gammaloop-nextest-core> span warm_up{integrand.name = bub}
47.18 s
gammaloop-nextest-core> threshold_status below threshold
47.18 s
gammaloop-nextest-core> at crates/gammalooprs/src/integrands/process/amplitude/mod.rs:1666
47.18 s
gammaloop-nextest-core> [18:17:53.345] @gammalooprs::integrands::process::amplitude INFO : overlap structure of group 0: [0: []]
47.18 s
gammaloop-nextest-core> field value
47.18 s
gammaloop-nextest-core> span warm_up{integrand.name = bub}
47.18 s
gammaloop-nextest-core> at crates/gammalooprs/src/integrands/process/amplitude/mod.rs:2015
47.18 s
gammaloop-nextest-core> [18:17:53.345] @gammalooprs::integrands::process::amplitude INFO : overlap structure of group 1: [0: []]
47.18 s
gammaloop-nextest-core> field value
47.18 s
gammaloop-nextest-core> span warm_up{integrand.name = bub}
47.18 s
gammaloop-nextest-core> at crates/gammalooprs/src/integrands/process/amplitude/mod.rs:2015
47.18 s
gammaloop-nextest-core> [18:17:53.345] @gammalooprs::integrands::process::amplitude INFO : overlap structure of group 2: [0: []]
47.18 s
gammaloop-nextest-core> field value
47.18 s
gammaloop-nextest-core> span warm_up{integrand.name = bub}
47.18 s
gammaloop-nextest-core> at crates/gammalooprs/src/integrands/process/amplitude/mod.rs:2015
47.18 s
gammaloop-nextest-core> The application panicked (crashed).
47.18 s
gammaloop-nextest-core> Message: assertion `left == right` failed: subtracted scalar UV profile failed:
47.18 s
gammaloop-nextest-core> UVProfilePassFail {
47.18 s
gammaloop-nextest-core> max_dod: -0.9,
47.18 s
gammaloop-nextest-core> total: 16,
47.18 s
gammaloop-nextest-core> failed: 1,
47.18 s
gammaloop-nextest-core> failures: [
47.18 s
gammaloop-nextest-core> UVProfileFailure {
47.18 s
gammaloop-nextest-core> graph_index: 0,
47.18 s
gammaloop-nextest-core> graph_name: "banana",
47.18 s
gammaloop-nextest-core> cutkosky_cut: None,
47.18 s
gammaloop-nextest-core> lmb_index: 1,
47.18 s
gammaloop-nextest-core> fixed: [
47.18 s
gammaloop-nextest-core> EdgeIndex(
47.18 s
gammaloop-nextest-core> 2,
47.18 s
gammaloop-nextest-core> ),
47.18 s
gammaloop-nextest-core> EdgeIndex(
47.18 s
gammaloop-nextest-core> 0,
47.18 s
gammaloop-nextest-core> ),
47.18 s
gammaloop-nextest-core> ],
47.18 s
gammaloop-nextest-core> free: [
47.18 s
gammaloop-nextest-core> EdgeIndex(
47.18 s
gammaloop-nextest-core> 3,
47.18 s
gammaloop-nextest-core> ),
47.18 s
gammaloop-nextest-core> ],
47.18 s
gammaloop-nextest-core> orientation_label: None,
47.18 s
gammaloop-nextest-core> reason: "dod_exceeds_threshold",
47.18 s
gammaloop-nextest-core> },
47.18 s
gammaloop-nextest-core> ],
47.18 s
gammaloop-nextest-core> }
47.18 s
gammaloop-nextest-core>
47.18 s
gammaloop-nextest-core> ╭─────────┬────────────┬───────────┬───────┬─────┬──────────┬───────────╮
47.18 s
gammaloop-nextest-core> │ fixed │ → ∞ │ slope │ r2 │ DOD │ bare DOD │ inspect │
47.18 s
gammaloop-nextest-core> ├─────────┼────────────┼───────────┼───────┼─────┼──────────┼───────────┤
47.18 s
gammaloop-nextest-core> │ {e1,e2} │ {e3} │ -0.996752 │ 1.000 │ -1 │ 0 │ arb retry │
47.18 s
gammaloop-nextest-core> │ {e1,e3} │ {e2} │ -1.065665 │ 0.997 │ -1 │ 0 │ arb retry │
47.18 s
gammaloop-nextest-core> │ {e1} │ {e2,e3} │ -0.937151 │ 0.943 │ -1 │ 2 │ │
47.18 s
gammaloop-nextest-core> │ {e2,e3} │ {e1} │ -1.001075 │ 1.000 │ -1 │ 0 │ arb retry │
47.18 s
gammaloop-nextest-core> │ {e2} │ {e1,e3} │ -0.984146 │ 0.998 │ -1 │ 2 │ │
47.18 s
gammaloop-nextest-core> │ {e3} │ {e1,e2} │ -1.383911 │ 0.982 │ -1 │ 2 │ arb retry │
47.18 s
gammaloop-nextest-core> │ {} │ {e1,e2,e3} │ -1.094213 │ 0.258 │ -1 │ 4 │ │
47.18 s
gammaloop-nextest-core> │ {e2,e0} │ {e3} │ -0.803348 │ 0.861 │ -1 │ 0 │ arb retry │
47.18 s
gammaloop-nextest-core> │ {e3,e0} │ {e2} │ -0.999257 │ 1.000 │ -1 │ 0 │ │
47.18 s
gammaloop-nextest-core> │ {e0} │ {e2,e3} │ -1.000893 │ 1.000 │ -1 │ 2 │ │
47.18 s
gammaloop-nextest-core> │ {e1,e0} │ {e3} │ -0.997860 │ 1.000 │ -1 │ 0 │ │
47.18 s
gammaloop-nextest-core> ╰─────────┴────────────┴───────────┴───────┴─────┴──────────┴───────────╯
47.18 s
gammaloop-nextest-core>
47.18 s
gammaloop-nextest-core> ╭───────┬─────────┬───────────┬───────┬─────┬──────────┬───────────╮
47.18 s
gammaloop-nextest-core> │ fixed │ → ∞ │ slope │ r2 │ DOD │ bare DOD │ inspect │
47.18 s
gammaloop-nextest-core> ├───────┼─────────┼───────────┼───────┼─────┼──────────┼───────────┤
47.18 s
gammaloop-nextest-core> │ {e1} │ {e2} │ -1.005039 │ 1.000 │ -1 │ 0 │ arb retry │
47.18 s
gammaloop-nextest-core> │ {e2} │ {e1} │ -1.001098 │ 1.000 │ -1 │ 0 │ arb retry │
47.18 s
gammaloop-nextest-core> │ {} │ {e1,e2} │ -1.011289 │ 1.000 │ -1 │ 2 │ │
47.18 s
gammaloop-nextest-core> │ {e0} │ {e2} │ -0.998140 │ 1.000 │ -1 │ 0 │ │
47.18 s
gammaloop-nextest-core> ╰───────┴─────────┴───────────┴───────┴─────┴──────────┴───────────╯
47.18 s
gammaloop-nextest-core>
47.18 s
gammaloop-nextest-core> ╭───────┬──────┬───────────┬───────┬─────┬──────────┬─────────╮
47.18 s
gammaloop-nextest-core> │ fixed │ → ∞ │ slope │ r2 │ DOD │ bare DOD │ inspect │
47.18 s
gammaloop-nextest-core> ├───────┼──────┼───────────┼───────┼─────┼──────────┼─────────┤
47.18 s
gammaloop-nextest-core> │ {} │ {e1} │ -0.989949 │ 1.000 │ -1 │ 0 │ │
47.18 s
gammaloop-nextest-core> ╰───────┴──────┴───────────┴───────┴─────┴──────────┴─────────╯
47.18 s
gammaloop-nextest-core> left: 1
47.18 s
gammaloop-nextest-core> right: 0
47.18 s
gammaloop-nextest-core> Location: crates/gammalooprs/src/uv/tests.rs :259
47.18 s
gammaloop-nextest-core>
47.18 s
gammaloop-nextest-core> ━━━━━━━━━━━━━━━━━━━━━━━━━━━━━━━━━━ BACKTRACE ━━━━━━━━━━━━━━━━━━━━━━━━━━━━━━━━━━━
47.18 s
gammaloop-nextest-core> 1: <color_eyre[51793ea62743adbd]::config::PanicHook>::panic_report <unknown>
47.18 s
gammaloop-nextest-core> at <unknown source file> :<unknown line>
47.18 s
gammaloop-nextest-core> 2: <color_eyre[51793ea62743adbd]::config::PanicHook>::into_panic_hook::{closure#0} <unknown>
47.18 s
gammaloop-nextest-core> at <unknown source file> :<unknown line>
47.18 s
gammaloop-nextest-core> 3: std[bcb96dfbba0ab899]::panicking::panic_with_hook <unknown>
47.18 s
gammaloop-nextest-core> at <unknown source file> :<unknown line>
47.18 s
gammaloop-nextest-core> 4: std[bcb96dfbba0ab899]::panicking::panic_handler::{closure#0} <unknown>
47.18 s
gammaloop-nextest-core> at <unknown source file> :<unknown line>
47.18 s
gammaloop-nextest-core> 5: std[bcb96dfbba0ab899]::sys::backtrace::__rust_end_short_backtrace::<std[bcb96dfbba0ab899]::panicking::panic_handler::{closure#0}, !> <unknown>
47.18 s
gammaloop-nextest-core> at <unknown source file> :<unknown line>
47.18 s
gammaloop-nextest-core> 6: __rustc[6c289b9f9c454d21]::rust_begin_unwind <unknown>
47.18 s
gammaloop-nextest-core> at <unknown source file> :<unknown line>
47.18 s
gammaloop-nextest-core> 7: core[940e698046960fd5]::panicking::panic_fmt <unknown>
47.18 s
gammaloop-nextest-core> at <unknown source file> :<unknown line>
47.18 s
gammaloop-nextest-core> 8: core[940e698046960fd5]::panicking::assert_failed_inner <unknown>
47.18 s
gammaloop-nextest-core> at <unknown source file> :<unknown line>
47.18 s
gammaloop-nextest-core> 9: core[940e698046960fd5]::panicking::assert_failed::<usize, usize> <unknown>
47.18 s
gammaloop-nextest-core> at <unknown source file> :<unknown line>
47.18 s
gammaloop-nextest-core> 10: gammalooprs[972dff90865981f6]::uv::tests::scalars_profile <unknown>
47.18 s
gammaloop-nextest-core> at <unknown source file> :<unknown line>
47.18 s
gammaloop-nextest-core> 11: <gammalooprs[972dff90865981f6]::uv::tests::scalars_profile::{closure#0} as core[940e698046960fd5]::ops::function::FnOnce<()>>::call_once <unknown>
47.18 s
gammaloop-nextest-core> at <unknown source file> :<unknown line>
47.18 s
gammaloop-nextest-core> 12: test[75d6903177b1d7e9]::__rust_begin_short_backtrace::<core[940e698046960fd5]::result::Result<(), alloc[2ea6bcb46fca0c42]::string::String>, fn() -> core[940e698046960fd5]::result::Result<(), alloc[2ea6bcb46fca0c42]::string::String>> <unknown>
47.18 s
gammaloop-nextest-core> at <unknown source file> :<unknown line>
47.18 s
gammaloop-nextest-core> 13: test[75d6903177b1d7e9]::run_test::{closure#0} <unknown>
47.18 s
gammaloop-nextest-core> at <unknown source file> :<unknown line>
47.18 s
gammaloop-nextest-core> 14: std[bcb96dfbba0ab899]::sys::backtrace::__rust_begin_short_backtrace::<test[75d6903177b1d7e9]::run_test::{closure#1}, ()> <unknown>
47.18 s
gammaloop-nextest-core> at <unknown source file> :<unknown line>
47.18 s
gammaloop-nextest-core> 15: <std[bcb96dfbba0ab899]::thread::lifecycle::spawn_unchecked<test[75d6903177b1d7e9]::run_test::{closure#1}, ()>::{closure#1} as core[940e698046960fd5]::ops::function::FnOnce<()>>::call_once::{shim:vtable#0} <unknown>
47.18 s
gammaloop-nextest-core> at <unknown source file> :<unknown line>
47.18 s
gammaloop-nextest-core> 16: <std[bcb96dfbba0ab899]::sys::thread::unix::Thread>::new::thread_start <unknown>
47.18 s
gammaloop-nextest-core> at <unknown source file> :<unknown line>
47.18 s
gammaloop-nextest-core> 17: start_thread <unknown>
47.18 s
gammaloop-nextest-core> at <unknown source file> :<unknown line>
47.18 s
gammaloop-nextest-core> 18: __clone3 <unknown>
47.18 s
gammaloop-nextest-core> at <unknown source file> :<unknown line>
47.18 s
gammaloop-nextest-core>
47.18 s
gammaloop-nextest-core> Run with COLORBT_SHOW_HIDDEN=1 environment variable to disable frame filtering.
47.18 s
gammaloop-nextest-core> Run with RUST_BACKTRACE=full to include source snippets.
47.18 s
gammaloop-nextest-core>
47.18 s
gammaloop-nextest-core> FAIL [ 11.152s] (559/561) gammalooprs uv::tests :: scalars_profile_new
47.18 s
gammaloop-nextest-core> stdout ---
47.18 s
gammaloop-nextest-core>
47.18 s
gammaloop-nextest-core> running 1 test
47.18 s
gammaloop-nextest-core> test uv::tests::scalars_profile_new ... FAILED
47.18 s
gammaloop-nextest-core>
47.18 s
gammaloop-nextest-core> failures:
47.18 s
gammaloop-nextest-core>
47.18 s
gammaloop-nextest-core> failures:
47.18 s
gammaloop-nextest-core> uv::tests::scalars_profile_new
47.18 s
gammaloop-nextest-core>
47.18 s
gammaloop-nextest-core> test result: FAILED. 0 passed; 1 failed; 0 ignored; 0 measured; 611 filtered out; finished in 11.13s
47.18 s
gammaloop-nextest-core>
47.18 s
gammaloop-nextest-core> stderr ---
47.18 s
gammaloop-nextest-core> [18:17:54.561] @gammalooprs::settings::runtime WARNING : No external kinematics were provided; using default-generated external momenta and helicities.
47.18 s
gammaloop-nextest-core> field value
47.18 s
gammaloop-nextest-core> span build_integrand{amplitude.name = bub}
47.18 s
gammaloop-nextest-core> at crates/gammalooprs/src/settings/runtime.rs:131
47.18 s
gammaloop-nextest-core> [18:17:54.562] @gammalooprs::integrands::process::amplitude INFO : Input is below threshold: 0 existing threshold E-surfaces across 0/3 graph groups
47.18 s
gammaloop-nextest-core> field value
47.18 s
gammaloop-nextest-core> existing_esurfaces 0
47.18 s
gammaloop-nextest-core> group_count 3
47.18 s
gammaloop-nextest-core> groups_above_threshold 0
47.18 s
gammaloop-nextest-core> integrand bub
47.18 s
gammaloop-nextest-core> span warm_up{integrand.name = bub}
47.18 s
gammaloop-nextest-core> threshold_status below threshold
47.18 s
gammaloop-nextest-core> at crates/gammalooprs/src/integrands/process/amplitude/mod.rs:1666
47.18 s
gammaloop-nextest-core> [18:17:54.562] @gammalooprs::integrands::process::amplitude INFO : overlap structure of group 0: [0: []]
47.18 s
gammaloop-nextest-core> field value
47.18 s
gammaloop-nextest-core> span warm_up{integrand.name = bub}
47.18 s
gammaloop-nextest-core> at crates/gammalooprs/src/integrands/process/amplitude/mod.rs:2015
47.18 s
gammaloop-nextest-core> [18:17:54.562] @gammalooprs::integrands::process::amplitude INFO : overlap structure of group 1: [0: []]
47.18 s
gammaloop-nextest-core> field value
47.18 s
gammaloop-nextest-core> span warm_up{integrand.name = bub}
47.18 s
gammaloop-nextest-core> at crates/gammalooprs/src/integrands/process/amplitude/mod.rs:2015
47.18 s
gammaloop-nextest-core> [18:17:54.562] @gammalooprs::integrands::process::amplitude INFO : overlap structure of group 2: [0: []]
47.18 s
gammaloop-nextest-core> field value
47.18 s
gammaloop-nextest-core> span warm_up{integrand.name = bub}
47.18 s
gammaloop-nextest-core> at crates/gammalooprs/src/integrands/process/amplitude/mod.rs:2015
47.18 s
gammaloop-nextest-core> The application panicked (crashed).
47.18 s
gammaloop-nextest-core> Message: assertion `left == right` failed: subtracted scalar UV profile failed:
47.18 s
gammaloop-nextest-core> UVProfilePassFail {
47.18 s
gammaloop-nextest-core> max_dod: -0.9,
47.18 s
gammaloop-nextest-core> total: 16,
47.18 s
gammaloop-nextest-core> failed: 1,
47.18 s
gammaloop-nextest-core> failures: [
47.18 s
gammaloop-nextest-core> UVProfileFailure {
47.18 s
gammaloop-nextest-core> graph_index: 0,
47.18 s
gammaloop-nextest-core> graph_name: "banana",
47.18 s
gammaloop-nextest-core> cutkosky_cut: None,
47.18 s
gammaloop-nextest-core> lmb_index: 1,
47.18 s
gammaloop-nextest-core> fixed: [
47.18 s
gammaloop-nextest-core> EdgeIndex(
47.18 s
gammaloop-nextest-core> 2,
47.18 s
gammaloop-nextest-core> ),
47.18 s
gammaloop-nextest-core> EdgeIndex(
47.18 s
gammaloop-nextest-core> 0,
47.18 s
gammaloop-nextest-core> ),
47.18 s
gammaloop-nextest-core> ],
47.18 s
gammaloop-nextest-core> free: [
47.18 s
gammaloop-nextest-core> EdgeIndex(
47.18 s
gammaloop-nextest-core> 3,
47.18 s
gammaloop-nextest-core> ),
47.18 s
gammaloop-nextest-core> ],
47.18 s
gammaloop-nextest-core> orientation_label: None,
47.18 s
gammaloop-nextest-core> reason: "dod_exceeds_threshold",
47.18 s
gammaloop-nextest-core> },
47.18 s
gammaloop-nextest-core> ],
47.18 s
gammaloop-nextest-core> }
47.18 s
gammaloop-nextest-core>
47.18 s
gammaloop-nextest-core> ╭─────────┬────────────┬───────────┬───────┬─────┬──────────┬───────────╮
47.18 s
gammaloop-nextest-core> │ fixed │ → ∞ │ slope │ r2 │ DOD │ bare DOD │ inspect │
47.18 s
gammaloop-nextest-core> ├─────────┼────────────┼───────────┼───────┼─────┼──────────┼───────────┤
47.18 s
gammaloop-nextest-core> │ {e1,e2} │ {e3} │ -0.996752 │ 1.000 │ -1 │ 0 │ arb retry │
47.18 s
gammaloop-nextest-core> │ {e1,e3} │ {e2} │ -1.065665 │ 0.997 │ -1 │ 0 │ arb retry │
47.18 s
gammaloop-nextest-core> │ {e1} │ {e2,e3} │ -0.937151 │ 0.943 │ -1 │ 2 │ │
47.18 s
gammaloop-nextest-core> │ {e2,e3} │ {e1} │ -1.001075 │ 1.000 │ -1 │ 0 │ arb retry │
47.18 s
gammaloop-nextest-core> │ {e2} │ {e1,e3} │ -0.984146 │ 0.998 │ -1 │ 2 │ │
47.18 s
gammaloop-nextest-core> │ {e3} │ {e1,e2} │ -1.383911 │ 0.982 │ -1 │ 2 │ arb retry │
47.18 s
gammaloop-nextest-core> │ {} │ {e1,e2,e3} │ -1.094213 │ 0.258 │ -1 │ 4 │ │
47.18 s
gammaloop-nextest-core> │ {e2,e0} │ {e3} │ -0.803348 │ 0.861 │ -1 │ 0 │ arb retry │
47.18 s
gammaloop-nextest-core> │ {e3,e0} │ {e2} │ -0.999257 │ 1.000 │ -1 │ 0 │ │
47.18 s
gammaloop-nextest-core> │ {e0} │ {e2,e3} │ -1.000893 │ 1.000 │ -1 │ 2 │ │
47.18 s
gammaloop-nextest-core> │ {e1,e0} │ {e3} │ -0.997860 │ 1.000 │ -1 │ 0 │ │
47.18 s
gammaloop-nextest-core> ╰─────────┴────────────┴───────────┴───────┴─────┴──────────┴───────────╯
47.18 s
gammaloop-nextest-core>
47.18 s
gammaloop-nextest-core> ╭───────┬─────────┬───────────┬───────┬─────┬──────────┬───────────╮
47.18 s
gammaloop-nextest-core> │ fixed │ → ∞ │ slope │ r2 │ DOD │ bare DOD │ inspect │
47.18 s
gammaloop-nextest-core> ├───────┼─────────┼───────────┼───────┼─────┼──────────┼───────────┤
47.18 s
gammaloop-nextest-core> │ {e1} │ {e2} │ -1.005039 │ 1.000 │ -1 │ 0 │ arb retry │
47.18 s
gammaloop-nextest-core> │ {e2} │ {e1} │ -1.001098 │ 1.000 │ -1 │ 0 │ arb retry │
47.18 s
gammaloop-nextest-core> │ {} │ {e1,e2} │ -1.011289 │ 1.000 │ -1 │ 2 │ │
47.18 s
gammaloop-nextest-core> │ {e0} │ {e2} │ -0.998140 │ 1.000 │ -1 │ 0 │ │
47.18 s
gammaloop-nextest-core> ╰───────┴─────────┴───────────┴───────┴─────┴──────────┴───────────╯
47.18 s
gammaloop-nextest-core>
47.18 s
gammaloop-nextest-core> ╭───────┬──────┬───────────┬───────┬─────┬──────────┬─────────╮
47.18 s
gammaloop-nextest-core> │ fixed │ → ∞ │ slope │ r2 │ DOD │ bare DOD │ inspect │
47.18 s
gammaloop-nextest-core> ├───────┼──────┼───────────┼───────┼─────┼──────────┼─────────┤
47.18 s
gammaloop-nextest-core> │ {} │ {e1} │ -0.989949 │ 1.000 │ -1 │ 0 │ │
47.18 s
gammaloop-nextest-core> ╰───────┴──────┴───────────┴───────┴─────┴──────────┴─────────╯
47.18 s
gammaloop-nextest-core> left: 1
47.18 s
gammaloop-nextest-core> right: 0
47.18 s
gammaloop-nextest-core> Location: crates/gammalooprs/src/uv/tests.rs :325
47.18 s
gammaloop-nextest-core>
47.18 s
gammaloop-nextest-core> ━━━━━━━━━━━━━━━━━━━━━━━━━━━━━━━━━━ BACKTRACE ━━━━━━━━━━━━━━━━━━━━━━━━━━━━━━━━━━━
47.18 s
gammaloop-nextest-core> 1: <color_eyre[51793ea62743adbd]::config::PanicHook>::panic_report <unknown>
47.18 s
gammaloop-nextest-core> at <unknown source file> :<unknown line>
47.18 s
gammaloop-nextest-core> 2: <color_eyre[51793ea62743adbd]::config::PanicHook>::into_panic_hook::{closure#0} <unknown>
47.18 s
gammaloop-nextest-core> at <unknown source file> :<unknown line>
47.18 s
gammaloop-nextest-core> 3: std[bcb96dfbba0ab899]::panicking::panic_with_hook <unknown>
47.18 s
gammaloop-nextest-core> at <unknown source file> :<unknown line>
47.18 s
gammaloop-nextest-core> 4: std[bcb96dfbba0ab899]::panicking::panic_handler::{closure#0} <unknown>
47.18 s
gammaloop-nextest-core> at <unknown source file> :<unknown line>
47.18 s
gammaloop-nextest-core> 5: std[bcb96dfbba0ab899]::sys::backtrace::__rust_end_short_backtrace::<std[bcb96dfbba0ab899]::panicking::panic_handler::{closure#0}, !> <unknown>
47.18 s
gammaloop-nextest-core> at <unknown source file> :<unknown line>
47.18 s
gammaloop-nextest-core> 6: __rustc[6c289b9f9c454d21]::rust_begin_unwind <unknown>
47.18 s
gammaloop-nextest-core> at <unknown source file> :<unknown line>
47.18 s
gammaloop-nextest-core> 7: core[940e698046960fd5]::panicking::panic_fmt <unknown>
47.18 s
gammaloop-nextest-core> at <unknown source file> :<unknown line>
47.18 s
gammaloop-nextest-core> 8: core[940e698046960fd5]::panicking::assert_failed_inner <unknown>
47.18 s
gammaloop-nextest-core> at <unknown source file> :<unknown line>
47.18 s
gammaloop-nextest-core> 9: core[940e698046960fd5]::panicking::assert_failed::<usize, usize> <unknown>
47.18 s
gammaloop-nextest-core> at <unknown source file> :<unknown line>
47.18 s
gammaloop-nextest-core> 10: gammalooprs[972dff90865981f6]::uv::tests::scalars_profile_new <unknown>
47.18 s
gammaloop-nextest-core> at <unknown source file> :<unknown line>
47.18 s
gammaloop-nextest-core> 11: <gammalooprs[972dff90865981f6]::uv::tests::scalars_profile_new::{closure#0} as core[940e698046960fd5]::ops::function::FnOnce<()>>::call_once <unknown>
47.18 s
gammaloop-nextest-core> at <unknown source file> :<unknown line>
47.18 s
gammaloop-nextest-core> 12: test[75d6903177b1d7e9]::__rust_begin_short_backtrace::<core[940e698046960fd5]::result::Result<(), alloc[2ea6bcb46fca0c42]::string::String>, fn() -> core[940e698046960fd5]::result::Result<(), alloc[2ea6bcb46fca0c42]::string::String>> <unknown>
47.18 s
gammaloop-nextest-core> at <unknown source file> :<unknown line>
47.18 s
gammaloop-nextest-core> 13: test[75d6903177b1d7e9]::run_test::{closure#0} <unknown>
47.18 s
gammaloop-nextest-core> at <unknown source file> :<unknown line>
47.18 s
gammaloop-nextest-core> 14: std[bcb96dfbba0ab899]::sys::backtrace::__rust_begin_short_backtrace::<test[75d6903177b1d7e9]::run_test::{closure#1}, ()> <unknown>
47.18 s
gammaloop-nextest-core> at <unknown source file> :<unknown line>
47.18 s
gammaloop-nextest-core> 15: <std[bcb96dfbba0ab899]::thread::lifecycle::spawn_unchecked<test[75d6903177b1d7e9]::run_test::{closure#1}, ()>::{closure#1} as core[940e698046960fd5]::ops::function::FnOnce<()>>::call_once::{shim:vtable#0} <unknown>
47.18 s
gammaloop-nextest-core> at <unknown source file> :<unknown line>
47.18 s
gammaloop-nextest-core> 16: <std[bcb96dfbba0ab899]::sys::thread::unix::Thread>::new::thread_start <unknown>
47.18 s
gammaloop-nextest-core> at <unknown source file> :<unknown line>
47.18 s
gammaloop-nextest-core> 17: start_thread <unknown>
47.18 s
gammaloop-nextest-core> at <unknown source file> :<unknown line>
47.18 s
gammaloop-nextest-core> 18: __clone3 <unknown>
47.18 s
gammaloop-nextest-core> at <unknown source file> :<unknown line>
47.18 s
gammaloop-nextest-core>
47.18 s
gammaloop-nextest-core> Run with COLORBT_SHOW_HIDDEN=1 environment variable to disable frame filtering.
47.18 s
gammaloop-nextest-core> Run with RUST_BACKTRACE=full to include source snippets.
47.18 s
gammaloop-nextest-core>
47.29 s
gammaloop-nextest-core> error : test run failed
47.34 s
gammaloop-nextest-core>
47.34 s
gammaloop-nextest-core> ========== nextest test summary ==========
47.34 s
gammaloop-nextest-core> report: target/nextest/ci_gammaloop/junit.xml
47.34 s
gammaloop-nextest-core> tests: 561, failures: 5, errors: 0
47.34 s
gammaloop-nextest-core>
47.34 s
gammaloop-nextest-core> 1. gammalooprs::cff::tests::stored_production_cff_uses_typed_energy_factor_ownership
47.34 s
gammaloop-nextest-core> failure: test failure with exit code 101
47.34 s
gammaloop-nextest-core> system-out
47.34 s
gammaloop-nextest-core> running 1 test
47.34 s
gammaloop-nextest-core> test cff::tests::stored_production_cff_uses_typed_energy_factor_ownership ... FAILED
47.34 s
gammaloop-nextest-core>
47.34 s
gammaloop-nextest-core> failures:
47.34 s
gammaloop-nextest-core>
47.34 s
gammaloop-nextest-core> failures:
47.34 s
gammaloop-nextest-core> cff::tests::stored_production_cff_uses_typed_energy_factor_ownership
47.34 s
gammaloop-nextest-core>
47.34 s
gammaloop-nextest-core> test result: FAILED. 0 passed; 1 failed; 0 ignored; 0 measured; 611 filtered out; finished in 0.15s
47.34 s
gammaloop-nextest-core> system-err
47.34 s
gammaloop-nextest-core> The application panicked (crashed).
47.34 s
gammaloop-nextest-core> Message: assertion `left == right` failed
47.34 s
gammaloop-nextest-core> left: 1
47.34 s
gammaloop-nextest-core> right: -1
47.34 s
gammaloop-nextest-core> Location: crates/gammalooprs/src/cff/mod.rs:2721
47.34 s
gammaloop-nextest-core>
47.34 s
gammaloop-nextest-core> ━━━━━━━━━━━━━━━━━━━━━━━━━━━━━━━━━━ BACKTRACE ━━━━━━━━━━━━━━━━━━━━━━━━━━━━━━━━━━━
47.34 s
gammaloop-nextest-core> 1: <color_eyre[51793ea62743adbd]::config::PanicHook>::panic_report<unknown>
47.34 s
gammaloop-nextest-core> at <unknown source file>:<unknown line>
47.34 s
gammaloop-nextest-core> 2: <color_eyre[51793ea62743adbd]::config::PanicHook>::into_panic_hook::{closure#0}<unknown>
47.34 s
gammaloop-nextest-core> at <unknown source file>:<unknown line>
47.34 s
gammaloop-nextest-core> 3: std[bcb96dfbba0ab899]::panicking::panic_with_hook<unknown>
47.34 s
gammaloop-nextest-core> at <unknown source file>:<unknown line>
47.34 s
gammaloop-nextest-core> 4: std[bcb96dfbba0ab899]::panicking::panic_handler::{closure#0}<unknown>
47.34 s
gammaloop-nextest-core> at <unknown source file>:<unknown line>
47.34 s
gammaloop-nextest-core> 5: std[bcb96dfbba0ab899]::sys::backtrace::__rust_end_short_backtrace::<std[bcb96dfbba0ab899]::panicking::panic_handler::{closure#0}, !><unknown>
47.34 s
gammaloop-nextest-core> at <unknown source file>:<unknown line>
47.34 s
gammaloop-nextest-core> 6: __rustc[6c289b9f9c454d21]::rust_begin_unwind<unknown>
47.34 s
gammaloop-nextest-core> at <unknown source file>:<unknown line>
47.34 s
gammaloop-nextest-core> 7: core[940e698046960fd5]::panicking::panic_fmt<unknown>
47.34 s
gammaloop-nextest-core> at <unknown source file>:<unknown line>
47.34 s
gammaloop-nextest-core> 8: core[940e698046960fd5]::panicking::assert_failed_inner<unknown>
47.34 s
gammaloop-nextest-core> at <unknown source file>:<unknown line>
47.34 s
gammaloop-nextest-core> 9: core[940e698046960fd5]::panicking::assert_failed::<i64, i64><unknown>
47.34 s
gammaloop-nextest-core> at <unknown source file>:<unknown line>
47.34 s
gammaloop-nextest-core> 10: gammalooprs[972dff90865981f6]::cff::tests::stored_production_cff_uses_typed_energy_factor_ownership<unknown>
47.34 s
gammaloop-nextest-core> at <unknown source file>:<unknown line>
47.34 s
gammaloop-nextest-core> 11: <gammalooprs[972dff90865981f6]::cff::tests::stored_production_cff_uses_typed_energy_factor_ownership::{closure#0} as core[940e698046960fd5]::ops::function::FnOnce<()>>::call_once<unknown>
47.34 s
gammaloop-nextest-core> at <unknown source file>:<unknown line>
47.34 s
gammaloop-nextest-core> 12: test[75d6903177b1d7e9]::__rust_begin_short_backtrace::<core[940e698046960fd5]::result::Result<(), alloc[2ea6bcb46fca0c42]::string::String>, fn() -> core[940e698046960fd5]::result::Result<(), alloc[2ea6bcb46fca0c42]::string::String>><unknown>
47.34 s
gammaloop-nextest-core> at <unknown source file>:<unknown line>
47.34 s
gammaloop-nextest-core> 13: test[75d6903177b1d7e9]::run_test::{closure#0}<unknown>
47.34 s
gammaloop-nextest-core> at <unknown source file>:<unknown line>
47.34 s
gammaloop-nextest-core> 14: std[bcb96dfbba0ab899]::sys::backtrace::__rust_begin_short_backtrace::<test[75d6903177b1d7e9]::run_test::{closure#1}, ()><unknown>
47.34 s
gammaloop-nextest-core> at <unknown source file>:<unknown line>
47.34 s
gammaloop-nextest-core> 15: <std[bcb96dfbba0ab899]::thread::lifecycle::spawn_unchecked<test[75d6903177b1d7e9]::run_test::{closure#1}, ()>::{closure#1} as core[940e698046960fd5]::ops::function::FnOnce<()>>::call_once::{shim:vtable#0}<unknown>
47.34 s
gammaloop-nextest-core> at <unknown source file>:<unknown line>
47.34 s
gammaloop-nextest-core> 16: <std[bcb96dfbba0ab899]::sys::thread::unix::Thread>::new::thread_start<unknown>
47.34 s
gammaloop-nextest-core> at <unknown source file>:<unknown line>
47.34 s
gammaloop-nextest-core> 17: start_thread<unknown>
47.34 s
gammaloop-nextest-core> at <unknown source file>:<unknown line>
47.34 s
gammaloop-nextest-core> 18: __clone3<unknown>
47.34 s
gammaloop-nextest-core> at <unknown source file>:<unknown line>
47.34 s
gammaloop-nextest-core>
47.34 s
gammaloop-nextest-core> Run with COLORBT_SHOW_HIDDEN=1 environment variable to disable frame filtering.
47.34 s
gammaloop-nextest-core> Run with RUST_BACKTRACE=full to include source snippets.
47.34 s
gammaloop-nextest-core>
47.34 s
gammaloop-nextest-core> 2. gammalooprs::uv::approx::local_3d::tests::production_emr_map_cancels_one_powered_denominator
47.34 s
gammaloop-nextest-core> failure: test failure with exit code 101
47.34 s
gammaloop-nextest-core> system-out
47.34 s
gammaloop-nextest-core> running 1 test
47.34 s
gammaloop-nextest-core> test uv::approx::local_3d::tests::production_emr_map_cancels_one_powered_denominator ... FAILED
47.34 s
gammaloop-nextest-core>
47.34 s
gammaloop-nextest-core> failures:
47.34 s
gammaloop-nextest-core>
47.34 s
gammaloop-nextest-core> failures:
47.34 s
gammaloop-nextest-core> uv::approx::local_3d::tests::production_emr_map_cancels_one_powered_denominator
47.34 s
gammaloop-nextest-core>
47.34 s
gammaloop-nextest-core> test result: FAILED. 0 passed; 1 failed; 0 ignored; 0 measured; 611 filtered out; finished in 0.09s
47.34 s
gammaloop-nextest-core> system-err
47.34 s
gammaloop-nextest-core> The application panicked (crashed).
47.34 s
gammaloop-nextest-core> Message: summed exact-source powered and selected lower channels differ: powered=-1𝑖/8/𝜋^3, lower=1𝑖/16/𝜋^3, difference=-3𝑖/16/𝜋^3
47.34 s
gammaloop-nextest-core> Location: crates/gammalooprs/src/uv/approx/local_3d.rs:2047
47.34 s
gammaloop-nextest-core>
47.34 s
gammaloop-nextest-core> ━━━━━━━━━━━━━━━━━━━━━━━━━━━━━━━━━━ BACKTRACE ━━━━━━━━━━━━━━━━━━━━━━━━━━━━━━━━━━━
47.34 s
gammaloop-nextest-core> 1: <color_eyre[51793ea62743adbd]::config::PanicHook>::panic_report<unknown>
47.34 s
gammaloop-nextest-core> at <unknown source file>:<unknown line>
47.34 s
gammaloop-nextest-core> 2: <color_eyre[51793ea62743adbd]::config::PanicHook>::into_panic_hook::{closure#0}<unknown>
47.34 s
gammaloop-nextest-core> at <unknown source file>:<unknown line>
47.34 s
gammaloop-nextest-core> 3: std[bcb96dfbba0ab899]::panicking::panic_with_hook<unknown>
47.34 s
gammaloop-nextest-core> at <unknown source file>:<unknown line>
47.34 s
gammaloop-nextest-core> 4: std[bcb96dfbba0ab899]::panicking::panic_handler::{closure#0}<unknown>
47.34 s
gammaloop-nextest-core> at <unknown source file>:<unknown line>
47.34 s
gammaloop-nextest-core> 5: std[bcb96dfbba0ab899]::sys::backtrace::__rust_end_short_backtrace::<std[bcb96dfbba0ab899]::panicking::panic_handler::{closure#0}, !><unknown>
47.34 s
gammaloop-nextest-core> at <unknown source file>:<unknown line>
47.34 s
gammaloop-nextest-core> 6: __rustc[6c289b9f9c454d21]::rust_begin_unwind<unknown>
47.34 s
gammaloop-nextest-core> at <unknown source file>:<unknown line>
47.34 s
gammaloop-nextest-core> 7: core[940e698046960fd5]::panicking::panic_fmt<unknown>
47.34 s
gammaloop-nextest-core> at <unknown source file>:<unknown line>
47.34 s
gammaloop-nextest-core> 8: gammalooprs[972dff90865981f6]::uv::approx::local_3d::tests::production_emr_map_cancels_one_powered_denominator<unknown>
47.34 s
gammaloop-nextest-core> at <unknown source file>:<unknown line>
47.34 s
gammaloop-nextest-core> 9: <gammalooprs[972dff90865981f6]::uv::approx::local_3d::tests::production_emr_map_cancels_one_powered_denominator::{closure#0} as core[940e698046960fd5]::ops::function::FnOnce<()>>::call_once<unknown>
47.34 s
gammaloop-nextest-core> at <unknown source file>:<unknown line>
47.34 s
gammaloop-nextest-core> 10: test[75d6903177b1d7e9]::__rust_begin_short_backtrace::<core[940e698046960fd5]::result::Result<(), alloc[2ea6bcb46fca0c42]::string::String>, fn() -> core[940e698046960fd5]::result::Result<(), alloc[2ea6bcb46fca0c42]::string::String>><unknown>
47.34 s
gammaloop-nextest-core> at <unknown source file>:<unknown line>
47.34 s
gammaloop-nextest-core> 11: test[75d6903177b1d7e9]::run_test::{closure#0}<unknown>
47.34 s
gammaloop-nextest-core> at <unknown source file>:<unknown line>
47.34 s
gammaloop-nextest-core> 12: std[bcb96dfbba0ab899]::sys::backtrace::__rust_begin_short_backtrace::<test[75d6903177b1d7e9]::run_test::{closure#1}, ()><unknown>
47.34 s
gammaloop-nextest-core> at <unknown source file>:<unknown line>
47.34 s
gammaloop-nextest-core> 13: <std[bcb96dfbba0ab899]::thread::lifecycle::spawn_unchecked<test[75d6903177b1d7e9]::run_test::{closure#1}, ()>::{closure#1} as core[940e698046960fd5]::ops::function::FnOnce<()>>::call_once::{shim:vtable#0}<unknown>
47.34 s
gammaloop-nextest-core> at <unknown source file>:<unknown line>
47.34 s
gammaloop-nextest-core> 14: <std[bcb96dfbba0ab899]::sys::thread::unix::Thread>::new::thread_start<unknown>
47.34 s
gammaloop-nextest-core> at <unknown source file>:<unknown line>
47.34 s
gammaloop-nextest-core> 15: start_thread<unknown>
47.34 s
gammaloop-nextest-core> at <unknown source file>:<unknown line>
47.34 s
gammaloop-nextest-core> 16: __clone3<unknown>
47.34 s
gammaloop-nextest-core> at <unknown source file>:<unknown line>
47.34 s
gammaloop-nextest-core>
47.34 s
gammaloop-nextest-core> Run with COLORBT_SHOW_HIDDEN=1 environment variable to disable frame filtering.
47.34 s
gammaloop-nextest-core> Run with RUST_BACKTRACE=full to include source snippets.
47.34 s
gammaloop-nextest-core>
47.34 s
gammaloop-nextest-core> 3. gammalooprs::uv::hedge_poset::tests::spectacles_typed_4d_projects_after_local_construction
47.34 s
gammaloop-nextest-core> failure: test failure with exit code 101
47.34 s
gammaloop-nextest-core> Error:
47.34 s
gammaloop-nextest-core> 0: failed to extract three-dimensional representation graph input: source edge 1 has no unique routing for rewritten exact signature [-1, 0, 0] modulo the factorized opposite-domain loop span
47.34 s
gammaloop-nextest-core>
47.34 s
gammaloop-nextest-core> Location:
47.34 s
gammaloop-nextest-core> crates/gammalooprs/src/uv/approx/local_3d.rs:845
47.34 s
gammaloop-nextest-core>
47.34 s
gammaloop-nextest-core> ━━━━━━━━━━━━━━━━━━━━━━━━━━━━━━━━━━ BACKTRACE ━━━━━━━━━━━━━━━━━━━━━━━━━━━━━━━━━━━
47.34 s
gammaloop-nextest-core> 1: <color_eyre[51793ea62743adbd]::config::EyreHook>::into_eyre_hook::{closure#0}<unknown>
47.34 s
gammaloop-nextest-core> at <unknown source file>:<unknown line>
47.34 s
gammaloop-nextest-core> 2: eyre[cb2fd339c0c40fca]::capture_handler<unknown>
47.34 s
gammaloop-nextest-core> at <unknown source file>:<unknown line>
47.34 s
gammaloop-nextest-core> 3: <eyre[cb2fd339c0c40fca]::Report>::from_std::<three_dimensional_reps[3cb572ff22d197ac]::graph_io::GraphIoError><unknown>
47.34 s
gammaloop-nextest-core> at <unknown source file>:<unknown line>
47.34 s
gammaloop-nextest-core> 4: <gammalooprs[972dff90865981f6]::uv::approx::local_3d::Localizer>::project_4d<unknown>
47.34 s
gammaloop-nextest-core> at <unknown source file>:<unknown line>
47.34 s
gammaloop-nextest-core> 5: gammalooprs[972dff90865981f6]::uv::hedge_poset::tests::spectacles_typed_4d_projects_after_local_construction<unknown>
47.34 s
gammaloop-nextest-core> at <unknown source file>:<unknown line>
47.34 s
gammaloop-nextest-core> 6: <gammalooprs[972dff90865981f6]::uv::hedge_poset::tests::spectacles_typed_4d_projects_after_local_construction::{closure#0} as core[940e698046960fd5]::ops::function::FnOnce<()>>::call_once<unknown>
47.34 s
gammaloop-nextest-core> at <unknown source file>:<unknown line>
47.34 s
gammaloop-nextest-core> 7: test[75d6903177b1d7e9]::__rust_begin_short_backtrace::<core[940e698046960fd5]::result::Result<(), alloc[2ea6bcb46fca0c42]::string::String>, fn() -> core[940e698046960fd5]::result::Result<(), alloc[2ea6bcb46fca0c42]::string::String>><unknown>
47.34 s
gammaloop-nextest-core> at <unknown source file>:<unknown line>
47.34 s
gammaloop-nextest-core> 8: test[75d6903177b1d7e9]::run_test::{closure#0}<unknown>
47.34 s
gammaloop-nextest-core> at <unknown source file>:<unknown line>
47.34 s
gammaloop-nextest-core> 9: std[bcb96dfbba0ab899]::sys::backtrace::__rust_begin_short_backtrace::<test[75d6903177b1d7e9]::run_test::{closure#1}, ()><unknown>
47.34 s
gammaloop-nextest-core> at <unknown source file>:<unknown line>
47.34 s
gammaloop-nextest-core> 10: <std[bcb96dfbba0ab899]::thread::lifecycle::spawn_unchecked<test[75d6903177b1d7e9]::run_test::{closure#1}, ()>::{closure#1} as core[940e698046960fd5]::ops::function::FnOnce<()>>::call_once::{shim:vtable#0}<unknown>
47.34 s
gammaloop-nextest-core> at <unknown source file>:<unknown line>
47.34 s
gammaloop-nextest-core> 11: <std[bcb96dfbba0ab899]::sys::thread::unix::Thread>::new::thread_start<unknown>
47.34 s
gammaloop-nextest-core> at <unknown source file>:<unknown line>
47.34 s
gammaloop-nextest-core> 12: start_thread<unknown>
47.34 s
gammaloop-nextest-core> at <unknown source file>:<unknown line>
47.34 s
gammaloop-nextest-core> 13: __clone3<unknown>
47.34 s
gammaloop-nextest-core> at <unknown source file>:<unknown line>
47.34 s
gammaloop-nextest-core>
47.34 s
gammaloop-nextest-core> Run with COLORBT_SHOW_HIDDEN=1 environment variable to disable frame filtering.
47.34 s
gammaloop-nextest-core> Run with RUST_BACKTRACE=full to include source snippets.
47.34 s
gammaloop-nextest-core> system-out
47.34 s
gammaloop-nextest-core> running 1 test
47.34 s
gammaloop-nextest-core> digraph {
47.34 s
gammaloop-nextest-core> node [shape=circle,height=0.1,label=""];
47.34 s
gammaloop-nextest-core> overlap = "scale";
47.34 s
gammaloop-nextest-core> layout = "neato";
47.34 s
gammaloop-nextest-core> start=2;
47.34 s
gammaloop-nextest-core> 4 [label="0"];
47.34 s
gammaloop-nextest-core> 1 [label="zw"];
47.34 s
gammaloop-nextest-core> 2 [label="F"];
47.34 s
gammaloop-nextest-core> 0 [label="143"];
47.34 s
gammaloop-nextest-core> 3 [label="10B"];
47.34 s
gammaloop-nextest-core> 4:0:s-> 1:1:s [id=0 color="red:blue;0.5" label="zw"];
47.34 s
gammaloop-nextest-core> 4:2:s-> 2:3:s [id=1 color="red:blue;0.5" label="F"];
47.34 s
gammaloop-nextest-core> 3:5:s-> 0:4:s [id=2 color="red:blue;0.5" label="143"];
47.34 s
gammaloop-nextest-core> 4:6:s-> 0:7:s [id=3 color="red:blue;0.5" label="143"];
47.34 s
gammaloop-nextest-core> 1:8:s-> 3:9:s [id=4 color="red:blue;0.5" label="F"];
47.34 s
gammaloop-nextest-core> 1:10:s-> 0:11:s [id=5 color="red:blue;0.5" label="143"];
47.34 s
gammaloop-nextest-core> 2:12:s-> 3:13:s [id=6 color="red:blue;0.5" label="zw"];
47.34 s
gammaloop-nextest-core> 2:14:s-> 0:15:s [id=7 color="red:blue;0.5" label="143"];
47.34 s
gammaloop-nextest-core> }
47.34 s
gammaloop-nextest-core>
47.34 s
gammaloop-nextest-core> digraph {
47.34 s
gammaloop-nextest-core> node [shape=circle,height=0.1,label=""];
47.34 s
gammaloop-nextest-core> overlap = "scale";
47.34 s
gammaloop-nextest-core> layout = "neato";
47.34 s
gammaloop-nextest-core> start=2;
47.34 s
gammaloop-nextest-core> 0 [label="∅"];
47.34 s
gammaloop-nextest-core> 1 [label="{zw}: Approx(S_zw(0))"];
47.34 s
gammaloop-nextest-core> 2 [label="{F}: Approx(S_F(1))"];
47.34 s
gammaloop-nextest-core> 3 [label="{143}: Approx(S_143(3))"];
47.34 s
gammaloop-nextest-core> 4 [label="{zw,F}: Approx(S_F(4))*Approx(S_zw(0))"];
47.34 s
gammaloop-nextest-core> 5 [label="{zw} · {143}: Approx((-1*S_zw+S_143(5))*Approx(S_zw(0)))"];
47.34 s
gammaloop-nextest-core> 6 [label="{F} · {143}: Approx((-1*S_F+S_143(7))*Approx(S_F(1)))"];
47.34 s
gammaloop-nextest-core> 7 [label="{zw,F} · {143}: Approx((-1*S_10B+S_143(2))*Approx(S_F(4))*Approx(S_zw(0)))"];
47.34 s
gammaloop-nextest-core> 0:0:s-> 1:1:s [id=0 color="red:blue;0.5"];
47.34 s
gammaloop-nextest-core> 0:2:s-> 2:3:s [id=1 color="red:blue;0.5"];
47.34 s
gammaloop-nextest-core> 0:4:s-> 3:5:s [id=2 color="red:blue;0.5"];
47.34 s
gammaloop-nextest-core> 1:6:s-> 4:7:s [id=3 color="red:blue;0.5"];
47.34 s
gammaloop-nextest-core> 1:8:s-> 5:9:s [id=4 color="red:blue;0.5"];
47.34 s
gammaloop-nextest-core> 2:10:s-> 4:11:s [id=5 color="red:blue;0.5"];
47.34 s
gammaloop-nextest-core> 2:12:s-> 6:13:s [id=6 color="red:blue;0.5"];
47.34 s
gammaloop-nextest-core> 4:14:s-> 7:15:s [id=7 color="red:blue;0.5"];
47.34 s
gammaloop-nextest-core> }
47.34 s
gammaloop-nextest-core>
47.34 s
gammaloop-nextest-core> test uv::hedge_poset::tests::spectacles_typed_4d_projects_after_local_construction ... FAILED
47.34 s
gammaloop-nextest-core>
47.34 s
gammaloop-nextest-core> failures:
47.34 s
gammaloop-nextest-core>
47.34 s
gammaloop-nextest-core> failures:
47.34 s
gammaloop-nextest-core> uv::hedge_poset::tests::spectacles_typed_4d_projects_after_local_construction
47.34 s
gammaloop-nextest-core>
47.34 s
gammaloop-nextest-core> test result: FAILED. 0 passed; 1 failed; 0 ignored; 0 measured; 611 filtered out; finished in 0.39s
47.34 s
gammaloop-nextest-core> system-err
47.34 s
gammaloop-nextest-core> Error:
47.34 s
gammaloop-nextest-core> 0: failed to extract three-dimensional representation graph input: source edge 1 has no unique routing for rewritten exact signature [-1, 0, 0] modulo the factorized opposite-domain loop span
47.34 s
gammaloop-nextest-core>
47.34 s
gammaloop-nextest-core> Location:
47.34 s
gammaloop-nextest-core> crates/gammalooprs/src/uv/approx/local_3d.rs:845
47.34 s
gammaloop-nextest-core>
47.34 s
gammaloop-nextest-core> ━━━━━━━━━━━━━━━━━━━━━━━━━━━━━━━━━━ BACKTRACE ━━━━━━━━━━━━━━━━━━━━━━━━━━━━━━━━━━━
47.34 s
gammaloop-nextest-core> 1: <color_eyre[51793ea62743adbd]::config::EyreHook>::into_eyre_hook::{closure#0}<unknown>
47.34 s
gammaloop-nextest-core> at <unknown source file>:<unknown line>
47.34 s
gammaloop-nextest-core> 2: eyre[cb2fd339c0c40fca]::capture_handler<unknown>
47.34 s
gammaloop-nextest-core> at <unknown source file>:<unknown line>
47.34 s
gammaloop-nextest-core> 3: <eyre[cb2fd339c0c40fca]::Report>::from_std::<three_dimensional_reps[3cb572ff22d197ac]::graph_io::GraphIoError><unknown>
47.34 s
gammaloop-nextest-core> at <unknown source file>:<unknown line>
47.34 s
gammaloop-nextest-core> 4: <gammalooprs[972dff90865981f6]::uv::approx::local_3d::Localizer>::project_4d<unknown>
47.34 s
gammaloop-nextest-core> at <unknown source file>:<unknown line>
47.34 s
gammaloop-nextest-core> 5: gammalooprs[972dff90865981f6]::uv::hedge_poset::tests::spectacles_typed_4d_projects_after_local_construction<unknown>
47.34 s
gammaloop-nextest-core> at <unknown source file>:<unknown line>
47.34 s
gammaloop-nextest-core> 6: <gammalooprs[972dff90865981f6]::uv::hedge_poset::tests::spectacles_typed_4d_projects_after_local_construction::{closure#0} as core[940e698046960fd5]::ops::function::FnOnce<()>>::call_once<unknown>
47.34 s
gammaloop-nextest-core> at <unknown source file>:<unknown line>
47.34 s
gammaloop-nextest-core> 7: test[75d6903177b1d7e9]::__rust_begin_short_backtrace::<core[940e698046960fd5]::result::Result<(), alloc[2ea6bcb46fca0c42]::string::String>, fn() -> core[940e698046960fd5]::result::Result<(), alloc[2ea6bcb46fca0c42]::string::String>><unknown>
47.34 s
gammaloop-nextest-core> at <unknown source file>:<unknown line>
47.34 s
gammaloop-nextest-core> 8: test[75d6903177b1d7e9]::run_test::{closure#0}<unknown>
47.34 s
gammaloop-nextest-core> at <unknown source file>:<unknown line>
47.34 s
gammaloop-nextest-core> 9: std[bcb96dfbba0ab899]::sys::backtrace::__rust_begin_short_backtrace::<test[75d6903177b1d7e9]::run_test::{closure#1}, ()><unknown>
47.34 s
gammaloop-nextest-core> at <unknown source file>:<unknown line>
47.34 s
gammaloop-nextest-core> 10: <std[bcb96dfbba0ab899]::thread::lifecycle::spawn_unchecked<test[75d6903177b1d7e9]::run_test::{closure#1}, ()>::{closure#1} as core[940e698046960fd5]::ops::function::FnOnce<()>>::call_once::{shim:vtable#0}<unknown>
47.34 s
gammaloop-nextest-core> at <unknown source file>:<unknown line>
47.34 s
gammaloop-nextest-core> 11: <std[bcb96dfbba0ab899]::sys::thread::unix::Thread>::new::thread_start<unknown>
47.34 s
gammaloop-nextest-core> at <unknown source file>:<unknown line>
47.34 s
gammaloop-nextest-core> 12: start_thread<unknown>
47.34 s
gammaloop-nextest-core> at <unknown source file>:<unknown line>
47.34 s
gammaloop-nextest-core> 13: __clone3<unknown>
47.34 s
gammaloop-nextest-core> at <unknown source file>:<unknown line>
47.34 s
gammaloop-nextest-core>
47.34 s
gammaloop-nextest-core> Run with COLORBT_SHOW_HIDDEN=1 environment variable to disable frame filtering.
47.34 s
gammaloop-nextest-core> Run with RUST_BACKTRACE=full to include source snippets.
47.34 s
gammaloop-nextest-core>
47.34 s
gammaloop-nextest-core> 4. gammalooprs::uv::tests::scalars_profile
47.34 s
gammaloop-nextest-core> failure: test failure with exit code 101
47.34 s
gammaloop-nextest-core> system-out
47.34 s
gammaloop-nextest-core> running 1 test
47.34 s
gammaloop-nextest-core> test uv::tests::scalars_profile ... FAILED
47.34 s
gammaloop-nextest-core>
47.34 s
gammaloop-nextest-core> failures:
47.34 s
gammaloop-nextest-core>
47.34 s
gammaloop-nextest-core> failures:
47.34 s
gammaloop-nextest-core> uv::tests::scalars_profile
47.34 s
gammaloop-nextest-core>
47.34 s
gammaloop-nextest-core> test result: FAILED. 0 passed; 1 failed; 0 ignored; 0 measured; 611 filtered out; finished in 9.96s
47.34 s
gammaloop-nextest-core> system-err
47.34 s
gammaloop-nextest-core> [18:17:53.343] @gammalooprs::settings::runtime WARNING : No external kinematics were provided; using default-generated external momenta and helicities.
47.34 s
gammaloop-nextest-core> field value
47.34 s
gammaloop-nextest-core> span build_integrand{amplitude.name=bub}
47.34 s
gammaloop-nextest-core> at crates/gammalooprs/src/settings/runtime.rs:131
47.34 s
gammaloop-nextest-core> [18:17:53.344] @gammalooprs::integrands::process::amplitude INFO : Input is below threshold: 0 existing threshold E-surfaces across 0/3 graph groups
47.34 s
gammaloop-nextest-core> field value
47.34 s
gammaloop-nextest-core> existing_esurfaces 0
47.34 s
gammaloop-nextest-core> group_count 3
47.34 s
gammaloop-nextest-core> groups_above_threshold 0
47.34 s
gammaloop-nextest-core> integrand bub
47.34 s
gammaloop-nextest-core> span warm_up{integrand.name=bub}
47.34 s
gammaloop-nextest-core> threshold_status below threshold
47.34 s
gammaloop-nextest-core> at crates/gammalooprs/src/integrands/process/amplitude/mod.rs:1666
47.34 s
gammaloop-nextest-core> [18:17:53.345] @gammalooprs::integrands::process::amplitude INFO : overlap structure of group 0: [0: []]
47.34 s
gammaloop-nextest-core> field value
47.34 s
gammaloop-nextest-core> span warm_up{integrand.name=bub}
47.34 s
gammaloop-nextest-core> at crates/gammalooprs/src/integrands/process/amplitude/mod.rs:2015
47.34 s
gammaloop-nextest-core> [18:17:53.345] @gammalooprs::integrands::process::amplitude INFO : overlap structure of group 1: [0: []]
47.34 s
gammaloop-nextest-core> field value
47.34 s
gammaloop-nextest-core> span warm_up{integrand.name=bub}
47.34 s
gammaloop-nextest-core> at crates/gammalooprs/src/integrands/process/amplitude/mod.rs:2015
47.34 s
gammaloop-nextest-core> [18:17:53.345] @gammalooprs::integrands::process::amplitude INFO : overlap structure of group 2: [0: []]
47.34 s
gammaloop-nextest-core> field value
47.34 s
gammaloop-nextest-core> span warm_up{integrand.name=bub}
47.34 s
gammaloop-nextest-core> at crates/gammalooprs/src/integrands/process/amplitude/mod.rs:2015
47.34 s
gammaloop-nextest-core> The application panicked (crashed).
47.34 s
gammaloop-nextest-core> Message: assertion `left == right` failed: subtracted scalar UV profile failed:
47.34 s
gammaloop-nextest-core> UVProfilePassFail {
47.34 s
gammaloop-nextest-core> max_dod: -0.9,
47.34 s
gammaloop-nextest-core> total: 16,
47.34 s
gammaloop-nextest-core> failed: 1,
47.34 s
gammaloop-nextest-core> failures: [
47.34 s
gammaloop-nextest-core> UVProfileFailure {
47.34 s
gammaloop-nextest-core> graph_index: 0,
47.34 s
gammaloop-nextest-core> graph_name: "banana",
47.34 s
gammaloop-nextest-core> cutkosky_cut: None,
47.34 s
gammaloop-nextest-core> lmb_index: 1,
47.34 s
gammaloop-nextest-core> fixed: [
47.34 s
gammaloop-nextest-core> EdgeIndex(
47.34 s
gammaloop-nextest-core> 2,
47.34 s
gammaloop-nextest-core> ),
47.34 s
gammaloop-nextest-core> EdgeIndex(
47.34 s
gammaloop-nextest-core> 0,
47.34 s
gammaloop-nextest-core> ),
47.34 s
gammaloop-nextest-core> ],
47.34 s
gammaloop-nextest-core> free: [
47.34 s
gammaloop-nextest-core> EdgeIndex(
47.34 s
gammaloop-nextest-core> 3,
47.34 s
gammaloop-nextest-core> ),
47.34 s
gammaloop-nextest-core> ],
47.34 s
gammaloop-nextest-core> orientation_label: None,
47.34 s
gammaloop-nextest-core> reason: "dod_exceeds_threshold",
47.34 s
gammaloop-nextest-core> },
47.34 s
gammaloop-nextest-core> ],
47.34 s
gammaloop-nextest-core> }
47.34 s
gammaloop-nextest-core>
47.34 s
gammaloop-nextest-core> ╭─────────┬────────────┬───────────┬───────┬─────┬──────────┬───────────╮
47.34 s
gammaloop-nextest-core> │ fixed │ → ∞ │ slope │ r2 │ DOD │ bare DOD │ inspect │
47.34 s
gammaloop-nextest-core> ├─────────┼────────────┼───────────┼───────┼─────┼──────────┼───────────┤
47.34 s
gammaloop-nextest-core> │ {e1,e2} │ {e3} │ -0.996752 │ 1.000 │ -1 │ 0 │ arb retry │
47.34 s
gammaloop-nextest-core> │ {e1,e3} │ {e2} │ -1.065665 │ 0.997 │ -1 │ 0 │ arb retry │
47.34 s
gammaloop-nextest-core> │ {e1} │ {e2,e3} │ -0.937151 │ 0.943 │ -1 │ 2 │ │
47.34 s
gammaloop-nextest-core> │ {e2,e3} │ {e1} │ -1.001075 │ 1.000 │ -1 │ 0 │ arb retry │
47.34 s
gammaloop-nextest-core> │ {e2} │ {e1,e3} │ -0.984146 │ 0.998 │ -1 │ 2 │ │
47.34 s
gammaloop-nextest-core> │ {e3} │ {e1,e2} │ -1.383911 │ 0.982 │ -1 │ 2 │ arb retry │
47.34 s
gammaloop-nextest-core> │ {} │ {e1,e2,e3} │ -1.094213 │ 0.258 │ -1 │ 4 │ │
47.34 s
gammaloop-nextest-core> │ {e2,e0} │ {e3} │ -0.803348 │ 0.861 │ -1 │ 0 │ arb retry │
47.34 s
gammaloop-nextest-core> │ {e3,e0} │ {e2} │ -0.999257 │ 1.000 │ -1 │ 0 │ │
47.34 s
gammaloop-nextest-core> │ {e0} │ {e2,e3} │ -1.000893 │ 1.000 │ -1 │ 2 │ │
47.34 s
gammaloop-nextest-core> │ {e1,e0} │ {e3} │ -0.997860 │ 1.000 │ -1 │ 0 │ │
47.34 s
gammaloop-nextest-core> ╰─────────┴────────────┴───────────┴───────┴─────┴──────────┴───────────╯
47.34 s
gammaloop-nextest-core>
47.34 s
gammaloop-nextest-core> ╭───────┬─────────┬───────────┬───────┬─────┬──────────┬───────────╮
47.34 s
gammaloop-nextest-core> │ fixed │ → ∞ │ slope │ r2 │ DOD │ bare DOD │ inspect │
47.34 s
gammaloop-nextest-core> ├───────┼─────────┼───────────┼───────┼─────┼──────────┼───────────┤
47.34 s
gammaloop-nextest-core> │ {e1} │ {e2} │ -1.005039 │ 1.000 │ -1 │ 0 │ arb retry │
47.34 s
gammaloop-nextest-core> │ {e2} │ {e1} │ -1.001098 │ 1.000 │ -1 │ 0 │ arb retry │
47.34 s
gammaloop-nextest-core> │ {} │ {e1,e2} │ -1.011289 │ 1.000 │ -1 │ 2 │ │
47.34 s
gammaloop-nextest-core> │ {e0} │ {e2} │ -0.998140 │ 1.000 │ -1 │ 0 │ │
47.34 s
gammaloop-nextest-core> ╰───────┴─────────┴───────────┴───────┴─────┴──────────┴───────────╯
47.34 s
gammaloop-nextest-core>
47.34 s
gammaloop-nextest-core> ╭───────┬──────┬───────────┬───────┬─────┬──────────┬─────────╮
47.34 s
gammaloop-nextest-core> │ fixed │ → ∞ │ slope │ r2 │ DOD │ bare DOD │ inspect │
47.34 s
gammaloop-nextest-core> ├───────┼──────┼───────────┼───────┼─────┼──────────┼─────────┤
47.34 s
gammaloop-nextest-core> │ {} │ {e1} │ -0.989949 │ 1.000 │ -1 │ 0 │ │
47.34 s
gammaloop-nextest-core> ╰───────┴──────┴───────────┴───────┴─────┴──────────┴─────────╯
47.34 s
gammaloop-nextest-core> left: 1
47.34 s
gammaloop-nextest-core> right: 0
47.34 s
gammaloop-nextest-core> Location: crates/gammalooprs/src/uv/tests.rs:259
47.34 s
gammaloop-nextest-core>
47.34 s
gammaloop-nextest-core> ━━━━━━━━━━━━━━━━━━━━━━━━━━━━━━━━━━ BACKTRACE ━━━━━━━━━━━━━━━━━━━━━━━━━━━━━━━━━━━
47.34 s
gammaloop-nextest-core> 1: <color_eyre[51793ea62743adbd]::config::PanicHook>::panic_report<unknown>
47.34 s
gammaloop-nextest-core> at <unknown source file>:<unknown line>
47.34 s
gammaloop-nextest-core> 2: <color_eyre[51793ea62743adbd]::config::PanicHook>::into_panic_hook::{closure#0}<unknown>
47.34 s
gammaloop-nextest-core> at <unknown source file>:<unknown line>
47.34 s
gammaloop-nextest-core> 3: std[bcb96dfbba0ab899]::panicking::panic_with_hook<unknown>
47.34 s
gammaloop-nextest-core> at <unknown source file>:<unknown line>
47.34 s
gammaloop-nextest-core> 4: std[bcb96dfbba0ab899]::panicking::panic_handler::{closure#0}<unknown>
47.34 s
gammaloop-nextest-core> at <unknown source file>:<unknown line>
47.34 s
gammaloop-nextest-core> 5: std[bcb96dfbba0ab899]::sys::backtrace::__rust_end_short_backtrace::<std[bcb96dfbba0ab899]::panicking::panic_handler::{closure#0}, !><unknown>
47.34 s
gammaloop-nextest-core> at <unknown source file>:<unknown line>
47.34 s
gammaloop-nextest-core> 6: __rustc[6c289b9f9c454d21]::rust_begin_unwind<unknown>
47.34 s
gammaloop-nextest-core> at <unknown source file>:<unknown line>
47.34 s
gammaloop-nextest-core> 7: core[940e698046960fd5]::panicking::panic_fmt<unknown>
47.34 s
gammaloop-nextest-core> at <unknown source file>:<unknown line>
47.34 s
gammaloop-nextest-core> 8: core[940e698046960fd5]::panicking::assert_failed_inner<unknown>
47.34 s
gammaloop-nextest-core> at <unknown source file>:<unknown line>
47.34 s
gammaloop-nextest-core> 9: core[940e698046960fd5]::panicking::assert_failed::<usize, usize><unknown>
47.34 s
gammaloop-nextest-core> at <unknown source file>:<unknown line>
47.34 s
gammaloop-nextest-core> 10: gammalooprs[972dff90865981f6]::uv::tests::scalars_profile<unknown>
47.34 s
gammaloop-nextest-core> at <unknown source file>:<unknown line>
47.34 s
gammaloop-nextest-core> 11: <gammalooprs[972dff90865981f6]::uv::tests::scalars_profile::{closure#0} as core[940e698046960fd5]::ops::function::FnOnce<()>>::call_once<unknown>
47.34 s
gammaloop-nextest-core> at <unknown source file>:<unknown line>
47.34 s
gammaloop-nextest-core> 12: test[75d6903177b1d7e9]::__rust_begin_short_backtrace::<core[940e698046960fd5]::result::Result<(), alloc[2ea6bcb46fca0c42]::string::String>, fn() -> core[940e698046960fd5]::result::Result<(), alloc[2ea6bcb46fca0c42]::string::String>><unknown>
47.34 s
gammaloop-nextest-core> at <unknown source file>:<unknown line>
47.34 s
gammaloop-nextest-core> 13: test[75d6903177b1d7e9]::run_test::{closure#0}<unknown>
47.34 s
gammaloop-nextest-core> at <unknown source file>:<unknown line>
47.34 s
gammaloop-nextest-core> 14: std[bcb96dfbba0ab899]::sys::backtrace::__rust_begin_short_backtrace::<test[75d6903177b1d7e9]::run_test::{closure#1}, ()><unknown>
47.34 s
gammaloop-nextest-core> at <unknown source file>:<unknown line>
47.34 s
gammaloop-nextest-core> ... omitted 11 more lines; see full nextest output above
47.34 s
gammaloop-nextest-core>
47.34 s
gammaloop-nextest-core> 5. gammalooprs::uv::tests::scalars_profile_new
47.34 s
gammaloop-nextest-core> failure: test failure with exit code 101
47.34 s
gammaloop-nextest-core> system-out
47.34 s
gammaloop-nextest-core> running 1 test
47.34 s
gammaloop-nextest-core> test uv::tests::scalars_profile_new ... FAILED
47.34 s
gammaloop-nextest-core>
47.34 s
gammaloop-nextest-core> failures:
47.34 s
gammaloop-nextest-core>
47.34 s
gammaloop-nextest-core> failures:
47.34 s
gammaloop-nextest-core> uv::tests::scalars_profile_new
47.34 s
gammaloop-nextest-core>
47.34 s
gammaloop-nextest-core> test result: FAILED. 0 passed; 1 failed; 0 ignored; 0 measured; 611 filtered out; finished in 11.13s
47.34 s
gammaloop-nextest-core> system-err
47.34 s
gammaloop-nextest-core> [18:17:54.561] @gammalooprs::settings::runtime WARNING : No external kinematics were provided; using default-generated external momenta and helicities.
47.34 s
gammaloop-nextest-core> field value
47.34 s
gammaloop-nextest-core> span build_integrand{amplitude.name=bub}
47.34 s
gammaloop-nextest-core> at crates/gammalooprs/src/settings/runtime.rs:131
47.34 s
gammaloop-nextest-core> [18:17:54.562] @gammalooprs::integrands::process::amplitude INFO : Input is below threshold: 0 existing threshold E-surfaces across 0/3 graph groups
47.34 s
gammaloop-nextest-core> field value
47.34 s
gammaloop-nextest-core> existing_esurfaces 0
47.34 s
gammaloop-nextest-core> group_count 3
47.34 s
gammaloop-nextest-core> groups_above_threshold 0
47.34 s
gammaloop-nextest-core> integrand bub
47.34 s
gammaloop-nextest-core> span warm_up{integrand.name=bub}
47.34 s
gammaloop-nextest-core> threshold_status below threshold
47.34 s
gammaloop-nextest-core> at crates/gammalooprs/src/integrands/process/amplitude/mod.rs:1666
47.34 s
gammaloop-nextest-core> [18:17:54.562] @gammalooprs::integrands::process::amplitude INFO : overlap structure of group 0: [0: []]
47.34 s
gammaloop-nextest-core> field value
47.34 s
gammaloop-nextest-core> span warm_up{integrand.name=bub}
47.34 s
gammaloop-nextest-core> at crates/gammalooprs/src/integrands/process/amplitude/mod.rs:2015
47.34 s
gammaloop-nextest-core> [18:17:54.562] @gammalooprs::integrands::process::amplitude INFO : overlap structure of group 1: [0: []]
47.34 s
gammaloop-nextest-core> field value
47.34 s
gammaloop-nextest-core> span warm_up{integrand.name=bub}
47.34 s
gammaloop-nextest-core> at crates/gammalooprs/src/integrands/process/amplitude/mod.rs:2015
47.34 s
gammaloop-nextest-core> [18:17:54.562] @gammalooprs::integrands::process::amplitude INFO : overlap structure of group 2: [0: []]
47.34 s
gammaloop-nextest-core> field value
47.34 s
gammaloop-nextest-core> span warm_up{integrand.name=bub}
47.34 s
gammaloop-nextest-core> at crates/gammalooprs/src/integrands/process/amplitude/mod.rs:2015
47.34 s
gammaloop-nextest-core> The application panicked (crashed).
47.34 s
gammaloop-nextest-core> Message: assertion `left == right` failed: subtracted scalar UV profile failed:
47.34 s
gammaloop-nextest-core> UVProfilePassFail {
47.34 s
gammaloop-nextest-core> max_dod: -0.9,
47.34 s
gammaloop-nextest-core> total: 16,
47.34 s
gammaloop-nextest-core> failed: 1,
47.34 s
gammaloop-nextest-core> failures: [
47.34 s
gammaloop-nextest-core> UVProfileFailure {
47.34 s
gammaloop-nextest-core> graph_index: 0,
47.34 s
gammaloop-nextest-core> graph_name: "banana",
47.34 s
gammaloop-nextest-core> cutkosky_cut: None,
47.34 s
gammaloop-nextest-core> lmb_index: 1,
47.34 s
gammaloop-nextest-core> fixed: [
47.34 s
gammaloop-nextest-core> EdgeIndex(
47.34 s
gammaloop-nextest-core> 2,
47.34 s
gammaloop-nextest-core> ),
47.34 s
gammaloop-nextest-core> EdgeIndex(
47.34 s
gammaloop-nextest-core> 0,
47.34 s
gammaloop-nextest-core> ),
47.34 s
gammaloop-nextest-core> ],
47.34 s
gammaloop-nextest-core> free: [
47.34 s
gammaloop-nextest-core> EdgeIndex(
47.35 s
gammaloop-nextest-core> 3,
47.35 s
gammaloop-nextest-core> ),
47.35 s
gammaloop-nextest-core> ],
47.35 s
gammaloop-nextest-core> orientation_label: None,
47.35 s
gammaloop-nextest-core> reason: "dod_exceeds_threshold",
47.35 s
gammaloop-nextest-core> },
47.35 s
gammaloop-nextest-core> ],
47.35 s
gammaloop-nextest-core> }
47.35 s
gammaloop-nextest-core>
47.35 s
gammaloop-nextest-core> ╭─────────┬────────────┬───────────┬───────┬─────┬──────────┬───────────╮
47.35 s
gammaloop-nextest-core> │ fixed │ → ∞ │ slope │ r2 │ DOD │ bare DOD │ inspect │
47.35 s
gammaloop-nextest-core> ├─────────┼────────────┼───────────┼───────┼─────┼──────────┼───────────┤
47.35 s
gammaloop-nextest-core> │ {e1,e2} │ {e3} │ -0.996752 │ 1.000 │ -1 │ 0 │ arb retry │
47.35 s
gammaloop-nextest-core> │ {e1,e3} │ {e2} │ -1.065665 │ 0.997 │ -1 │ 0 │ arb retry │
47.35 s
gammaloop-nextest-core> │ {e1} │ {e2,e3} │ -0.937151 │ 0.943 │ -1 │ 2 │ │
47.35 s
gammaloop-nextest-core> │ {e2,e3} │ {e1} │ -1.001075 │ 1.000 │ -1 │ 0 │ arb retry │
47.35 s
gammaloop-nextest-core> │ {e2} │ {e1,e3} │ -0.984146 │ 0.998 │ -1 │ 2 │ │
47.35 s
gammaloop-nextest-core> │ {e3} │ {e1,e2} │ -1.383911 │ 0.982 │ -1 │ 2 │ arb retry │
47.35 s
gammaloop-nextest-core> │ {} │ {e1,e2,e3} │ -1.094213 │ 0.258 │ -1 │ 4 │ │
47.35 s
gammaloop-nextest-core> │ {e2,e0} │ {e3} │ -0.803348 │ 0.861 │ -1 │ 0 │ arb retry │
47.35 s
gammaloop-nextest-core> │ {e3,e0} │ {e2} │ -0.999257 │ 1.000 │ -1 │ 0 │ │
47.35 s
gammaloop-nextest-core> │ {e0} │ {e2,e3} │ -1.000893 │ 1.000 │ -1 │ 2 │ │
47.35 s
gammaloop-nextest-core> │ {e1,e0} │ {e3} │ -0.997860 │ 1.000 │ -1 │ 0 │ │
47.35 s
gammaloop-nextest-core> ╰─────────┴────────────┴───────────┴───────┴─────┴──────────┴───────────╯
47.35 s
gammaloop-nextest-core>
47.35 s
gammaloop-nextest-core> ╭───────┬─────────┬───────────┬───────┬─────┬──────────┬───────────╮
47.35 s
gammaloop-nextest-core> │ fixed │ → ∞ │ slope │ r2 │ DOD │ bare DOD │ inspect │
47.35 s
gammaloop-nextest-core> ├───────┼─────────┼───────────┼───────┼─────┼──────────┼───────────┤
47.35 s
gammaloop-nextest-core> │ {e1} │ {e2} │ -1.005039 │ 1.000 │ -1 │ 0 │ arb retry │
47.35 s
gammaloop-nextest-core> │ {e2} │ {e1} │ -1.001098 │ 1.000 │ -1 │ 0 │ arb retry │
47.35 s
gammaloop-nextest-core> │ {} │ {e1,e2} │ -1.011289 │ 1.000 │ -1 │ 2 │ │
47.35 s
gammaloop-nextest-core> │ {e0} │ {e2} │ -0.998140 │ 1.000 │ -1 │ 0 │ │
47.35 s
gammaloop-nextest-core> ╰───────┴─────────┴───────────┴───────┴─────┴──────────┴───────────╯
47.35 s
gammaloop-nextest-core>
47.35 s
gammaloop-nextest-core> ╭───────┬──────┬───────────┬───────┬─────┬──────────┬─────────╮
47.35 s
gammaloop-nextest-core> │ fixed │ → ∞ │ slope │ r2 │ DOD │ bare DOD │ inspect │
47.35 s
gammaloop-nextest-core> ├───────┼──────┼───────────┼───────┼─────┼──────────┼─────────┤
47.35 s
gammaloop-nextest-core> │ {} │ {e1} │ -0.989949 │ 1.000 │ -1 │ 0 │ │
47.35 s
gammaloop-nextest-core> ╰───────┴──────┴───────────┴───────┴─────┴──────────┴─────────╯
47.35 s
gammaloop-nextest-core> left: 1
47.35 s
gammaloop-nextest-core> right: 0
47.35 s
gammaloop-nextest-core> Location: crates/gammalooprs/src/uv/tests.rs:325
47.35 s
gammaloop-nextest-core>
47.35 s
gammaloop-nextest-core> ━━━━━━━━━━━━━━━━━━━━━━━━━━━━━━━━━━ BACKTRACE ━━━━━━━━━━━━━━━━━━━━━━━━━━━━━━━━━━━
47.35 s
gammaloop-nextest-core> 1: <color_eyre[51793ea62743adbd]::config::PanicHook>::panic_report<unknown>
47.35 s
gammaloop-nextest-core> at <unknown source file>:<unknown line>
47.35 s
gammaloop-nextest-core> 2: <color_eyre[51793ea62743adbd]::config::PanicHook>::into_panic_hook::{closure#0}<unknown>
47.35 s
gammaloop-nextest-core> at <unknown source file>:<unknown line>
47.35 s
gammaloop-nextest-core> 3: std[bcb96dfbba0ab899]::panicking::panic_with_hook<unknown>
47.35 s
gammaloop-nextest-core> at <unknown source file>:<unknown line>
47.35 s
gammaloop-nextest-core> 4: std[bcb96dfbba0ab899]::panicking::panic_handler::{closure#0}<unknown>
47.35 s
gammaloop-nextest-core> at <unknown source file>:<unknown line>
47.35 s
gammaloop-nextest-core> 5: std[bcb96dfbba0ab899]::sys::backtrace::__rust_end_short_backtrace::<std[bcb96dfbba0ab899]::panicking::panic_handler::{closure#0}, !><unknown>
47.35 s
gammaloop-nextest-core> at <unknown source file>:<unknown line>
47.35 s
gammaloop-nextest-core> 6: __rustc[6c289b9f9c454d21]::rust_begin_unwind<unknown>
47.35 s
gammaloop-nextest-core> at <unknown source file>:<unknown line>
47.35 s
gammaloop-nextest-core> 7: core[940e698046960fd5]::panicking::panic_fmt<unknown>
47.35 s
gammaloop-nextest-core> at <unknown source file>:<unknown line>
47.35 s
gammaloop-nextest-core> 8: core[940e698046960fd5]::panicking::assert_failed_inner<unknown>
47.35 s
gammaloop-nextest-core> at <unknown source file>:<unknown line>
47.35 s
gammaloop-nextest-core> 9: core[940e698046960fd5]::panicking::assert_failed::<usize, usize><unknown>
47.35 s
gammaloop-nextest-core> at <unknown source file>:<unknown line>
47.35 s
gammaloop-nextest-core> 10: gammalooprs[972dff90865981f6]::uv::tests::scalars_profile_new<unknown>
47.35 s
gammaloop-nextest-core> at <unknown source file>:<unknown line>
47.35 s
gammaloop-nextest-core> 11: <gammalooprs[972dff90865981f6]::uv::tests::scalars_profile_new::{closure#0} as core[940e698046960fd5]::ops::function::FnOnce<()>>::call_once<unknown>
47.35 s
gammaloop-nextest-core> at <unknown source file>:<unknown line>
47.35 s
gammaloop-nextest-core> 12: test[75d6903177b1d7e9]::__rust_begin_short_backtrace::<core[940e698046960fd5]::result::Result<(), alloc[2ea6bcb46fca0c42]::string::String>, fn() -> core[940e698046960fd5]::result::Result<(), alloc[2ea6bcb46fca0c42]::string::String>><unknown>
47.35 s
gammaloop-nextest-core> at <unknown source file>:<unknown line>
47.35 s
gammaloop-nextest-core> 13: test[75d6903177b1d7e9]::run_test::{closure#0}<unknown>
47.35 s
gammaloop-nextest-core> at <unknown source file>:<unknown line>
47.35 s
gammaloop-nextest-core> 14: std[bcb96dfbba0ab899]::sys::backtrace::__rust_begin_short_backtrace::<test[75d6903177b1d7e9]::run_test::{closure#1}, ()><unknown>
47.35 s
gammaloop-nextest-core> at <unknown source file>:<unknown line>
47.35 s
gammaloop-nextest-core> ... omitted 11 more lines; see full nextest output above
47.35 s
gammaloop-nextest-core> =========================================
47.36 s
gammaloop-nextest-core> Extracting 1 binary, 1 build script output directory, and 1 linked path to /build/nextest-archive-K8VOkI
47.48 s
gammaloop-nextest-core> Extracted 7 files to /build/nextest-archive-K8VOkI in 0.12s
47.49 s
gammaloop-nextest-core> ------------
47.49 s
gammaloop-nextest-core> Nextest run ID 57817a1c-c3ad-4dde-a811-f091efd2dc71 with nextest profile: ci_gammaloop
47.49 s
gammaloop-nextest-core> Starting 54 tests across 1 binary
47.87 s
gammaloop-nextest-core> ------------
47.87 s
gammaloop-nextest-core> Summary [ 0.382s] 54 tests run: 54 passed , 0 skipped
47.93 s
gammaloop-nextest-core>
47.93 s
gammaloop-nextest-core> ========== nextest test summary ==========
47.93 s
gammaloop-nextest-core> report: target/nextest/ci_gammaloop/junit.xml
47.93 s
gammaloop-nextest-core> tests: 54, failures: 0, errors: 0
47.93 s
gammaloop-nextest-core> No failing testcases found.
47.93 s
gammaloop-nextest-core> =========================================
47.98 s
[0 built (1 failed ), 0.0 error: Cannot build '/nix/store/xmqryc6f4382yn38pvqdg8lk2i1rvwkl-gammaloop-nextest-core.drv '.
47.98 s
Reason: builder failed with exit code 100 .
47.98 s
Output paths:
47.98 s
/nix/store/qs56ygvnfbmkl3lbwy1lyz1bkaf3fqsx-gammaloop-nextest-core
47.98 s
Last 1576 log lines:
47.98 s
> Extracting 3 binaries (including 1 non-test binary), 1 build script output directory, and 2 linked paths to /build/nextest-archive-qgiWAu
47.98 s
> Extracted 18 files to /build/nextest-archive-qgiWAu in 0.79s
47.98 s
> ------------
47.98 s
> Nextest run ID cc547a30-6dcc-4cc5-895e-914d68567169 with nextest profile: ci_gammaloop
47.98 s
> Starting 375 tests across 2 binaries
47.98 s
> ------------
47.98 s
> Summary [ 0.844s] 375 tests run: 375 passed , 0 skipped
47.98 s
>
47.98 s
> ========== nextest test summary ==========
47.98 s
> report: target/nextest/ci_gammaloop/junit.xml
47.98 s
> tests: 375, failures: 0, errors: 0
47.98 s
> No failing testcases found.
47.98 s
> =========================================
47.98 s
> Extracting 1 binary and 1 linked path to /build/nextest-archive-9APMuQ
47.98 s
> Extracted 7 files to /build/nextest-archive-9APMuQ in 0.12s
47.98 s
> ------------
47.98 s
> Nextest run ID 2dbca648-db25-4192-ab72-552076e11be5 with nextest profile: ci_gammaloop
47.98 s
> Starting 19 tests across 1 binary
47.98 s
> ------------
47.98 s
> Summary [ 0.018s] 19 tests run: 19 passed , 0 skipped
47.98 s
>
47.98 s
> ========== nextest test summary ==========
47.98 s
> report: target/nextest/ci_gammaloop/junit.xml
47.98 s
> tests: 19, failures: 0, errors: 0
47.98 s
> No failing testcases found.
47.98 s
> =========================================
47.98 s
> Extracting 1 binary to /build/nextest-archive-ryyx3A
47.98 s
> Extracted 4 files to /build/nextest-archive-ryyx3A in 0.04s
47.98 s
> ------------
47.98 s
> Nextest run ID d33c0584-2925-402e-8fb0-8bdefdea3c2a with nextest profile: ci_gammaloop
47.98 s
> Starting 0 tests across 1 binary
47.98 s
> ------------
47.98 s
> Summary [ 0.000s] 0 tests run: 0 passed , 0 skipped
47.98 s
>
47.98 s
> ========== nextest test summary ==========
47.98 s
> report: target/nextest/ci_gammaloop/junit.xml
47.98 s
> tests: 0, failures: 0, errors: 0
47.98 s
> No failing testcases found.
47.98 s
> =========================================
47.98 s
> Extracting 4 binaries, 1 build script output directory, and 2 linked paths to /build/nextest-archive-g8xNrQ
47.98 s
> Extracted 18 files to /build/nextest-archive-g8xNrQ in 0.84s
47.98 s
> ------------
47.98 s
> Nextest run ID 0723af18-d531-4755-b18a-ff4aac75be75 with nextest profile: ci_gammaloop
47.98 s
> Starting 561 tests across 4 binaries (59 tests skipped , including 58 tests via profile.ci_gammaloop.default-filter )
47.98 s
> FAIL [ 0.168s] ( 53/561) gammalooprs cff::tests :: stored_production_cff_uses_typed_energy_factor_ownership
47.98 s
> stdout ---
47.98 s
>
47.98 s
> running 1 test
47.98 s
> test cff::tests::stored_production_cff_uses_typed_energy_factor_ownership ... FAILED
47.98 s
>
47.98 s
> failures:
47.98 s
>
47.98 s
> failures:
47.98 s
> cff::tests::stored_production_cff_uses_typed_energy_factor_ownership
47.98 s
>
47.98 s
> test result: FAILED. 0 passed; 1 failed; 0 ignored; 0 measured; 611 filtered out; finished in 0.15s
47.98 s
>
47.98 s
> stderr ---
47.98 s
> The application panicked (crashed).
47.98 s
> Message: assertion `left == right` failed
47.98 s
> left: 1
47.98 s
> right: -1
47.98 s
> Location: crates/gammalooprs/src/cff/mod.rs :2721
47.98 s
>
47.98 s
> ━━━━━━━━━━━━━━━━━━━━━━━━━━━━━━━━━━ BACKTRACE ━━━━━━━━━━━━━━━━━━━━━━━━━━━━━━━━━━━
47.98 s
> 1: <color_eyre[51793ea62743adbd]::config::PanicHook>::panic_report <unknown>
47.98 s
> at <unknown source file> :<unknown line>
47.98 s
> 2: <color_eyre[51793ea62743adbd]::config::PanicHook>::into_panic_hook::{closure#0} <unknown>
47.98 s
> at <unknown source file> :<unknown line>
47.98 s
> 3: std[bcb96dfbba0ab899]::panicking::panic_with_hook <unknown>
47.98 s
> at <unknown source file> :<unknown line>
47.98 s
> 4: std[bcb96dfbba0ab899]::panicking::panic_handler::{closure#0} <unknown>
47.98 s
> at <unknown source file> :<unknown line>
47.98 s
> 5: std[bcb96dfbba0ab899]::sys::backtrace::__rust_end_short_backtrace::<std[bcb96dfbba0ab899]::panicking::panic_handler::{closure#0}, !> <unknown>
47.98 s
> at <unknown source file> :<unknown line>
47.98 s
> 6: __rustc[6c289b9f9c454d21]::rust_begin_unwind <unknown>
47.98 s
> at <unknown source file> :<unknown line>
47.99 s
> 7: core[940e698046960fd5]::panicking::panic_fmt <unknown>
47.99 s
> at <unknown source file> :<unknown line>
47.99 s
> 8: core[940e698046960fd5]::panicking::assert_failed_inner <unknown>
47.99 s
> at <unknown source file> :<unknown line>
47.99 s
> 9: core[940e698046960fd5]::panicking::assert_failed::<i64, i64> <unknown>
47.99 s
> at <unknown source file> :<unknown line>
47.99 s
> 10: gammalooprs[972dff90865981f6]::cff::tests::stored_production_cff_uses_typed_energy_factor_ownership <unknown>
47.99 s
> at <unknown source file> :<unknown line>
47.99 s
> 11: <gammalooprs[972dff90865981f6]::cff::tests::stored_production_cff_uses_typed_energy_factor_ownership::{closure#0} as core[940e698046960fd5]::ops::function::FnOnce<()>>::call_once <unknown>
47.99 s
> at <unknown source file> :<unknown line>
47.99 s
> 12: test[75d6903177b1d7e9]::__rust_begin_short_backtrace::<core[940e698046960fd5]::result::Result<(), alloc[2ea6bcb46fca0c42]::string::String>, fn() -> core[940e698046960fd5]::result::Result<(), alloc[2ea6bcb46fca0c42]::string::String>> <unknown>
47.99 s
> at <unknown source file> :<unknown line>
47.99 s
> 13: test[75d6903177b1d7e9]::run_test::{closure#0} <unknown>
47.99 s
> at <unknown source file> :<unknown line>
47.99 s
> 14: std[bcb96dfbba0ab899]::sys::backtrace::__rust_begin_short_backtrace::<test[75d6903177b1d7e9]::run_test::{closure#1}, ()> <unknown>
47.99 s
> at <unknown source file> :<unknown line>
47.99 s
> 15: <std[bcb96dfbba0ab899]::thread::lifecycle::spawn_unchecked<test[75d6903177b1d7e9]::run_test::{closure#1}, ()>::{closure#1} as core[940e698046960fd5]::ops::function::FnOnce<()>>::call_once::{shim:vtable#0} <unknown>
47.99 s
> at <unknown source file> :<unknown line>
47.99 s
> 16: <std[bcb96dfbba0ab899]::sys::thread::unix::Thread>::new::thread_start <unknown>
47.99 s
> at <unknown source file> :<unknown line>
47.99 s
> 17: start_thread <unknown>
47.99 s
> at <unknown source file> :<unknown line>
47.99 s
> 18: __clone3 <unknown>
47.99 s
> at <unknown source file> :<unknown line>
47.99 s
>
47.99 s
> Run with COLORBT_SHOW_HIDDEN=1 environment variable to disable frame filtering.
47.99 s
> Run with RUST_BACKTRACE=full to include source snippets.
47.99 s
>
47.99 s
> FAIL [ 0.108s] (483/561) gammalooprs uv::approx::local_3d::tests :: production_emr_map_cancels_one_powered_denominator
47.99 s
> stdout ---
47.99 s
>
47.99 s
> running 1 test
47.99 s
> test uv::approx::local_3d::tests::production_emr_map_cancels_one_powered_denominator ... FAILED
47.99 s
>
47.99 s
> failures:
47.99 s
>
47.99 s
> failures:
47.99 s
> uv::approx::local_3d::tests::production_emr_map_cancels_one_powered_denominator
47.99 s
>
47.99 s
> test result: FAILED. 0 passed; 1 failed; 0 ignored; 0 measured; 611 filtered out; finished in 0.09s
47.99 s
>
47.99 s
> stderr ---
47.99 s
> The application panicked (crashed).
47.99 s
> Message: summed exact-source powered and selected lower channels differ: powered=-1 𝑖 /8/𝜋^3, lower=1𝑖 /16/𝜋^3, difference=-3𝑖 /16/𝜋^3
47.99 s
> Location: crates/gammalooprs/src/uv/approx/local_3d.rs :2047
47.99 s
>
47.99 s
> ━━━━━━━━━━━━━━━━━━━━━━━━━━━━━━━━━━ BACKTRACE ━━━━━━━━━━━━━━━━━━━━━━━━━━━━━━━━━━━
47.99 s
> 1: <color_eyre[51793ea62743adbd]::config::PanicHook>::panic_report <unknown>
47.99 s
> at <unknown source file> :<unknown line>
47.99 s
> 2: <color_eyre[51793ea62743adbd]::config::PanicHook>::into_panic_hook::{closure#0} <unknown>
47.99 s
> at <unknown source file> :<unknown line>
47.99 s
> 3: std[bcb96dfbba0ab899]::panicking::panic_with_hook <unknown>
47.99 s
> at <unknown source file> :<unknown line>
47.99 s
> 4: std[bcb96dfbba0ab899]::panicking::panic_handler::{closure#0} <unknown>
47.99 s
> at <unknown source file> :<unknown line>
47.99 s
> 5: std[bcb96dfbba0ab899]::sys::backtrace::__rust_end_short_backtrace::<std[bcb96dfbba0ab899]::panicking::panic_handler::{closure#0}, !> <unknown>
47.99 s
> at <unknown source file> :<unknown line>
47.99 s
> 6: __rustc[6c289b9f9c454d21]::rust_begin_unwind <unknown>
47.99 s
> at <unknown source file> :<unknown line>
47.99 s
> 7: core[940e698046960fd5]::panicking::panic_fmt <unknown>
47.99 s
> at <unknown source file> :<unknown line>
47.99 s
> 8: gammalooprs[972dff90865981f6]::uv::approx::local_3d::tests::production_emr_map_cancels_one_powered_denominator <unknown>
47.99 s
> at <unknown source file> :<unknown line>
47.99 s
> 9: <gammalooprs[972dff90865981f6]::uv::approx::local_3d::tests::production_emr_map_cancels_one_powered_denominator::{closure#0} as core[940e698046960fd5]::ops::function::FnOnce<()>>::call_once <unknown>
47.99 s
> at <unknown source file> :<unknown line>
47.99 s
> 10: test[75d6903177b1d7e9]::__rust_begin_short_backtrace::<core[940e698046960fd5]::result::Result<(), alloc[2ea6bcb46fca0c42]::string::String>, fn() -> core[940e698046960fd5]::result::Result<(), alloc[2ea6bcb46fca0c42]::string::String>> <unknown>
47.99 s
> at <unknown source file> :<unknown line>
47.99 s
> 11: test[75d6903177b1d7e9]::run_test::{closure#0} <unknown>
47.99 s
> at <unknown source file> :<unknown line>
47.99 s
> 12: std[bcb96dfbba0ab899]::sys::backtrace::__rust_begin_short_backtrace::<test[75d6903177b1d7e9]::run_test::{closure#1}, ()> <unknown>
47.99 s
> at <unknown source file> :<unknown line>
47.99 s
> 13: <std[bcb96dfbba0ab899]::thread::lifecycle::spawn_unchecked<test[75d6903177b1d7e9]::run_test::{closure#1}, ()>::{closure#1} as core[940e698046960fd5]::ops::function::FnOnce<()>>::call_once::{shim:vtable#0} <unknown>
47.99 s
> at <unknown source file> :<unknown line>
47.99 s
> 14: <std[bcb96dfbba0ab899]::sys::thread::unix::Thread>::new::thread_start <unknown>
47.99 s
> at <unknown source file> :<unknown line>
47.99 s
> 15: start_thread <unknown>
47.99 s
> at <unknown source file> :<unknown line>
47.99 s
> 16: __clone3 <unknown>
47.99 s
> at <unknown source file> :<unknown line>
47.99 s
>
47.99 s
> Run with COLORBT_SHOW_HIDDEN=1 environment variable to disable frame filtering.
47.99 s
> Run with RUST_BACKTRACE=full to include source snippets.
47.99 s
>
47.99 s
> FAIL [ 0.424s] (539/561) gammalooprs uv::hedge_poset::tests :: spectacles_typed_4d_projects_after_local_construction
47.99 s
> stdout ---
47.99 s
>
47.99 s
> running 1 test
47.99 s
> digraph {
47.99 s
> node [shape=circle,height=0.1,label=""];
47.99 s
> overlap = "scale";
47.99 s
> layout = "neato";
47.99 s
> start=2;
47.99 s
> 4 [label="0"];
47.99 s
> 1 [label="zw"];
47.99 s
> 2 [label="F"];
47.99 s
> 0 [label="143"];
47.99 s
> 3 [label="10B"];
47.99 s
> 4:0:s -> 1:1:s [id=0 color="red:blue;0.5" label="zw"];
47.99 s
> 4:2:s -> 2:3:s [id=1 color="red:blue;0.5" label="F"];
47.99 s
> 3:5:s -> 0:4:s [id=2 color="red:blue;0.5" label="143"];
47.99 s
> 4:6:s -> 0:7:s [id=3 color="red:blue;0.5" label="143"];
47.99 s
> 1:8:s -> 3:9:s [id=4 color="red:blue;0.5" label="F"];
47.99 s
> 1:10:s -> 0:11:s [id=5 color="red:blue;0.5" label="143"];
47.99 s
> 2:12:s -> 3:13:s [id=6 color="red:blue;0.5" label="zw"];
47.99 s
> 2:14:s -> 0:15:s [id=7 color="red:blue;0.5" label="143"];
47.99 s
> }
47.99 s
>
47.99 s
> digraph {
47.99 s
> node [shape=circle,height=0.1,label=""];
47.99 s
> overlap = "scale";
47.99 s
> layout = "neato";
47.99 s
> start=2;
47.99 s
> 0 [label="∅"];
47.99 s
> 1 [label="{zw}: Approx(S_zw(0))"];
47.99 s
> 2 [label="{F}: Approx(S_F(1))"];
47.99 s
> 3 [label="{143}: Approx(S_143(3))"];
47.99 s
> 4 [label="{zw,F}: Approx(S_F(4))*Approx(S_zw(0))"];
47.99 s
> 5 [label="{zw} · {143}: Approx((-1*S_zw+S_143(5))*Approx(S_zw(0)))"];
47.99 s
> 6 [label="{F} · {143}: Approx((-1*S_F+S_143(7))*Approx(S_F(1)))"];
47.99 s
> 7 [label="{zw,F} · {143}: Approx((-1*S_10B+S_143(2))*Approx(S_F(4))*Approx(S_zw(0)))"];
47.99 s
> 0:0:s -> 1:1:s [id=0 color="red:blue;0.5"];
47.99 s
> 0:2:s -> 2:3:s [id=1 color="red:blue;0.5"];
47.99 s
> 0:4:s -> 3:5:s [id=2 color="red:blue;0.5"];
47.99 s
> 1:6:s -> 4:7:s [id=3 color="red:blue;0.5"];
47.99 s
> 1:8:s -> 5:9:s [id=4 color="red:blue;0.5"];
47.99 s
> 2:10:s -> 4:11:s [id=5 color="red:blue;0.5"];
47.99 s
> 2:12:s -> 6:13:s [id=6 color="red:blue;0.5"];
47.99 s
> 4:14:s -> 7:15:s [id=7 color="red:blue;0.5"];
47.99 s
> }
47.99 s
>
47.99 s
> test uv::hedge_poset::tests::spectacles_typed_4d_projects_after_local_construction ... FAILED
47.99 s
>
47.99 s
> failures:
47.99 s
>
47.99 s
> failures:
47.99 s
> uv::hedge_poset::tests::spectacles_typed_4d_projects_after_local_construction
47.99 s
>
47.99 s
> test result: FAILED. 0 passed; 1 failed; 0 ignored; 0 measured; 611 filtered out; finished in 0.39s
47.99 s
>
47.99 s
> stderr ---
47.99 s
> Error:
47.99 s
> 0: failed to extract three-dimensional representation graph input: source edge 1 has no unique routing for rewritten exact signature [-1, 0, 0] modulo the factorized opposite-domain loop span
47.99 s
>
47.99 s
> Location:
47.99 s
> crates/gammalooprs/src/uv/approx/local_3d.rs :845
47.99 s
>
47.99 s
> ━━━━━━━━━━━━━━━━━━━━━━━━━━━━━━━━━━ BACKTRACE ━━━━━━━━━━━━━━━━━━━━━━━━━━━━━━━━━━━
47.99 s
> 1: <color_eyre[51793ea62743adbd]::config::EyreHook>::into_eyre_hook::{closure#0} <unknown>
47.99 s
> at <unknown source file> :<unknown line>
47.99 s
> 2: eyre[cb2fd339c0c40fca]::capture_handler <unknown>
47.99 s
> at <unknown source file> :<unknown line>
47.99 s
> 3: <eyre[cb2fd339c0c40fca]::Report>::from_std::<three_dimensional_reps[3cb572ff22d197ac]::graph_io::GraphIoError> <unknown>
47.99 s
> at <unknown source file> :<unknown line>
47.99 s
> 4: <gammalooprs[972dff90865981f6]::uv::approx::local_3d::Localizer>::project_4d <unknown>
47.99 s
> at <unknown source file> :<unknown line>
47.99 s
> 5: gammalooprs[972dff90865981f6]::uv::hedge_poset::tests::spectacles_typed_4d_projects_after_local_construction <unknown>
47.99 s
> at <unknown source file> :<unknown line>
47.99 s
> 6: <gammalooprs[972dff90865981f6]::uv::hedge_poset::tests::spectacles_typed_4d_projects_after_local_construction::{closure#0} as core[940e698046960fd5]::ops::function::FnOnce<()>>::call_once <unknown>
47.99 s
> at <unknown source file> :<unknown line>
47.99 s
> 7: test[75d6903177b1d7e9]::__rust_begin_short_backtrace::<core[940e698046960fd5]::result::Result<(), alloc[2ea6bcb46fca0c42]::string::String>, fn() -> core[940e698046960fd5]::result::Result<(), alloc[2ea6bcb46fca0c42]::string::String>> <unknown>
47.99 s
> at <unknown source file> :<unknown line>
47.99 s
> 8: test[75d6903177b1d7e9]::run_test::{closure#0} <unknown>
47.99 s
> at <unknown source file> :<unknown line>
47.99 s
> 9: std[bcb96dfbba0ab899]::sys::backtrace::__rust_begin_short_backtrace::<test[75d6903177b1d7e9]::run_test::{closure#1}, ()> <unknown>
47.99 s
> at <unknown source file> :<unknown line>
47.99 s
> 10: <std[bcb96dfbba0ab899]::thread::lifecycle::spawn_unchecked<test[75d6903177b1d7e9]::run_test::{closure#1}, ()>::{closure#1} as core[940e698046960fd5]::ops::function::FnOnce<()>>::call_once::{shim:vtable#0} <unknown>
47.99 s
> at <unknown source file> :<unknown line>
47.99 s
> 11: <std[bcb96dfbba0ab899]::sys::thread::unix::Thread>::new::thread_start <unknown>
47.99 s
> at <unknown source file> :<unknown line>
47.99 s
> 12: start_thread <unknown>
47.99 s
> at <unknown source file> :<unknown line>
47.99 s
> 13: __clone3 <unknown>
47.99 s
> at <unknown source file> :<unknown line>
47.99 s
>
47.99 s
> Run with COLORBT_SHOW_HIDDEN=1 environment variable to disable frame filtering.
47.99 s
> Run with RUST_BACKTRACE=full to include source snippets.
47.99 s
>
47.99 s
> FAIL [ 9.979s] (558/561) gammalooprs uv::tests :: scalars_profile
47.99 s
> stdout ---
47.99 s
>
47.99 s
> running 1 test
47.99 s
> test uv::tests::scalars_profile ... FAILED
47.99 s
>
47.99 s
> failures:
47.99 s
>
47.99 s
> failures:
47.99 s
> uv::tests::scalars_profile
47.99 s
>
47.99 s
> test result: FAILED. 0 passed; 1 failed; 0 ignored; 0 measured; 611 filtered out; finished in 9.96s
47.99 s
>
47.99 s
> stderr ---
47.99 s
> [18:17:53.343] @gammalooprs::settings::runtime WARNING : No external kinematics were provided; using default-generated external momenta and helicities.
47.99 s
> field value
47.99 s
> span build_integrand{amplitude.name = bub}
47.99 s
> at crates/gammalooprs/src/settings/runtime.rs:131
47.99 s
> [18:17:53.344] @gammalooprs::integrands::process::amplitude INFO : Input is below threshold: 0 existing threshold E-surfaces across 0/3 graph groups
47.99 s
> field value
47.99 s
> existing_esurfaces 0
47.99 s
> group_count 3
47.99 s
> groups_above_threshold 0
47.99 s
> integrand bub
47.99 s
> span warm_up{integrand.name = bub}
47.99 s
> threshold_status below threshold
47.99 s
> at crates/gammalooprs/src/integrands/process/amplitude/mod.rs:1666
47.99 s
> [18:17:53.345] @gammalooprs::integrands::process::amplitude INFO : overlap structure of group 0: [0: []]
47.99 s
> field value
47.99 s
> span warm_up{integrand.name = bub}
47.99 s
> at crates/gammalooprs/src/integrands/process/amplitude/mod.rs:2015
47.99 s
> [18:17:53.345] @gammalooprs::integrands::process::amplitude INFO : overlap structure of group 1: [0: []]
47.99 s
> field value
47.99 s
> span warm_up{integrand.name = bub}
47.99 s
> at crates/gammalooprs/src/integrands/process/amplitude/mod.rs:2015
47.99 s
> [18:17:53.345] @gammalooprs::integrands::process::amplitude INFO : overlap structure of group 2: [0: []]
47.99 s
> field value
47.99 s
> span warm_up{integrand.name = bub}
47.99 s
> at crates/gammalooprs/src/integrands/process/amplitude/mod.rs:2015
47.99 s
> The application panicked (crashed).
47.99 s
> Message: assertion `left == right` failed: subtracted scalar UV profile failed:
47.99 s
> UVProfilePassFail {
47.99 s
> max_dod: -0.9,
47.99 s
> total: 16,
47.99 s
> failed: 1,
47.99 s
> failures: [
47.99 s
> UVProfileFailure {
47.99 s
> graph_index: 0,
47.99 s
> graph_name: "banana",
47.99 s
> cutkosky_cut: None,
47.99 s
> lmb_index: 1,
47.99 s
> fixed: [
47.99 s
> EdgeIndex(
47.99 s
> 2,
47.99 s
> ),
47.99 s
> EdgeIndex(
47.99 s
> 0,
47.99 s
> ),
47.99 s
> ],
47.99 s
> free: [
47.99 s
> EdgeIndex(
47.99 s
> 3,
47.99 s
> ),
47.99 s
> ],
47.99 s
> orientation_label: None,
47.99 s
> reason: "dod_exceeds_threshold",
47.99 s
> },
47.99 s
> ],
47.99 s
> }
47.99 s
>
47.99 s
> ╭─────────┬────────────┬───────────┬───────┬─────┬──────────┬───────────╮
47.99 s
> │ fixed │ → ∞ │ slope │ r2 │ DOD │ bare DOD │ inspect │
47.99 s
> ├─────────┼────────────┼───────────┼───────┼─────┼──────────┼───────────┤
47.99 s
> │ {e1,e2} │ {e3} │ -0.996752 │ 1.000 │ -1 │ 0 │ arb retry │
47.99 s
> │ {e1,e3} │ {e2} │ -1.065665 │ 0.997 │ -1 │ 0 │ arb retry │
47.99 s
> │ {e1} │ {e2,e3} │ -0.937151 │ 0.943 │ -1 │ 2 │ │
47.99 s
> │ {e2,e3} │ {e1} │ -1.001075 │ 1.000 │ -1 │ 0 │ arb retry │
47.99 s
> │ {e2} │ {e1,e3} │ -0.984146 │ 0.998 │ -1 │ 2 │ │
47.99 s
> │ {e3} │ {e1,e2} │ -1.383911 │ 0.982 │ -1 │ 2 │ arb retry │
47.99 s
> │ {} │ {e1,e2,e3} │ -1.094213 │ 0.258 │ -1 │ 4 │ │
47.99 s
> │ {e2,e0} │ {e3} │ -0.803348 │ 0.861 │ -1 │ 0 │ arb retry │
47.99 s
> │ {e3,e0} │ {e2} │ -0.999257 │ 1.000 │ -1 │ 0 │ │
47.99 s
> │ {e0} │ {e2,e3} │ -1.000893 │ 1.000 │ -1 │ 2 │ │
47.99 s
> │ {e1,e0} │ {e3} │ -0.997860 │ 1.000 │ -1 │ 0 │ │
47.99 s
> ╰─────────┴────────────┴───────────┴───────┴─────┴──────────┴───────────╯
47.99 s
>
47.99 s
> ╭───────┬─────────┬───────────┬───────┬─────┬──────────┬───────────╮
47.99 s
> │ fixed │ → ∞ │ slope │ r2 │ DOD │ bare DOD │ inspect │
47.99 s
> ├───────┼─────────┼───────────┼───────┼─────┼──────────┼───────────┤
47.99 s
> │ {e1} │ {e2} │ -1.005039 │ 1.000 │ -1 │ 0 │ arb retry │
47.99 s
> │ {e2} │ {e1} │ -1.001098 │ 1.000 │ -1 │ 0 │ arb retry │
47.99 s
> │ {} │ {e1,e2} │ -1.011289 │ 1.000 │ -1 │ 2 │ │
47.99 s
> │ {e0} │ {e2} │ -0.998140 │ 1.000 │ -1 │ 0 │ │
47.99 s
> ╰───────┴─────────┴───────────┴───────┴─────┴──────────┴───────────╯
47.99 s
>
47.99 s
> ╭───────┬──────┬───────────┬───────┬─────┬──────────┬─────────╮
47.99 s
> │ fixed │ → ∞ │ slope │ r2 │ DOD │ bare DOD │ inspect │
47.99 s
> ├───────┼──────┼───────────┼───────┼─────┼──────────┼─────────┤
47.99 s
> │ {} │ {e1} │ -0.989949 │ 1.000 │ -1 │ 0 │ │
47.99 s
> ╰───────┴──────┴───────────┴───────┴─────┴──────────┴─────────╯
47.99 s
> left: 1
47.99 s
> right: 0
47.99 s
> Location: crates/gammalooprs/src/uv/tests.rs :259
47.99 s
>
47.99 s
> ━━━━━━━━━━━━━━━━━━━━━━━━━━━━━━━━━━ BACKTRACE ━━━━━━━━━━━━━━━━━━━━━━━━━━━━━━━━━━━
47.99 s
> 1: <color_eyre[51793ea62743adbd]::config::PanicHook>::panic_report <unknown>
47.99 s
> at <unknown source file> :<unknown line>
47.99 s
> 2: <color_eyre[51793ea62743adbd]::config::PanicHook>::into_panic_hook::{closure#0} <unknown>
47.99 s
> at <unknown source file> :<unknown line>
47.99 s
> 3: std[bcb96dfbba0ab899]::panicking::panic_with_hook <unknown>
47.99 s
> at <unknown source file> :<unknown line>
47.99 s
> 4: std[bcb96dfbba0ab899]::panicking::panic_handler::{closure#0} <unknown>
47.99 s
> at <unknown source file> :<unknown line>
47.99 s
> 5: std[bcb96dfbba0ab899]::sys::backtrace::__rust_end_short_backtrace::<std[bcb96dfbba0ab899]::panicking::panic_handler::{closure#0}, !> <unknown>
47.99 s
> at <unknown source file> :<unknown line>
47.99 s
> 6: __rustc[6c289b9f9c454d21]::rust_begin_unwind <unknown>
47.99 s
> at <unknown source file> :<unknown line>
47.99 s
> 7: core[940e698046960fd5]::panicking::panic_fmt <unknown>
47.99 s
> at <unknown source file> :<unknown line>
47.99 s
> 8: core[940e698046960fd5]::panicking::assert_failed_inner <unknown>
47.99 s
> at <unknown source file> :<unknown line>
47.99 s
> 9: core[940e698046960fd5]::panicking::assert_failed::<usize, usize> <unknown>
47.99 s
> at <unknown source file> :<unknown line>
47.99 s
> 10: gammalooprs[972dff90865981f6]::uv::tests::scalars_profile <unknown>
47.99 s
> at <unknown source file> :<unknown line>
47.99 s
> 11: <gammalooprs[972dff90865981f6]::uv::tests::scalars_profile::{closure#0} as core[940e698046960fd5]::ops::function::FnOnce<()>>::call_once <unknown>
47.99 s
> at <unknown source file> :<unknown line>
47.99 s
> 12: test[75d6903177b1d7e9]::__rust_begin_short_backtrace::<core[940e698046960fd5]::result::Result<(), alloc[2ea6bcb46fca0c42]::string::String>, fn() -> core[940e698046960fd5]::result::Result<(), alloc[2ea6bcb46fca0c42]::string::String>> <unknown>
47.99 s
> at <unknown source file> :<unknown line>
47.99 s
> 13: test[75d6903177b1d7e9]::run_test::{closure#0} <unknown>
47.99 s
> at <unknown source file> :<unknown line>
47.99 s
> 14: std[bcb96dfbba0ab899]::sys::backtrace::__rust_begin_short_backtrace::<test[75d6903177b1d7e9]::run_test::{closure#1}, ()> <unknown>
47.99 s
> at <unknown source file> :<unknown line>
47.99 s
> 15: <std[bcb96dfbba0ab899]::thread::lifecycle::spawn_unchecked<test[75d6903177b1d7e9]::run_test::{closure#1}, ()>::{closure#1} as core[940e698046960fd5]::ops::function::FnOnce<()>>::call_once::{shim:vtable#0} <unknown>
47.99 s
> at <unknown source file> :<unknown line>
47.99 s
> 16: <std[bcb96dfbba0ab899]::sys::thread::unix::Thread>::new::thread_start <unknown>
47.99 s
> at <unknown source file> :<unknown line>
47.99 s
> 17: start_thread <unknown>
47.99 s
> at <unknown source file> :<unknown line>
47.99 s
> 18: __clone3 <unknown>
47.99 s
> at <unknown source file> :<unknown line>
47.99 s
>
47.99 s
> Run with COLORBT_SHOW_HIDDEN=1 environment variable to disable frame filtering.
47.99 s
> Run with RUST_BACKTRACE=full to include source snippets.
47.99 s
>
47.99 s
> FAIL [ 11.152s] (559/561) gammalooprs uv::tests :: scalars_profile_new
47.99 s
> stdout ---
47.99 s
>
47.99 s
> running 1 test
47.99 s
> test uv::tests::scalars_profile_new ... FAILED
47.99 s
>
47.99 s
> failures:
47.99 s
>
47.99 s
> failures:
47.99 s
> uv::tests::scalars_profile_new
47.99 s
>
47.99 s
> test result: FAILED. 0 passed; 1 failed; 0 ignored; 0 measured; 611 filtered out; finished in 11.13s
47.99 s
>
47.99 s
> stderr ---
47.99 s
> [18:17:54.561] @gammalooprs::settings::runtime WARNING : No external kinematics were provided; using default-generated external momenta and helicities.
47.99 s
> field value
47.99 s
> span build_integrand{amplitude.name = bub}
47.99 s
> at crates/gammalooprs/src/settings/runtime.rs:131
47.99 s
> [18:17:54.562] @gammalooprs::integrands::process::amplitude INFO : Input is below threshold: 0 existing threshold E-surfaces across 0/3 graph groups
47.99 s
> field value
47.99 s
> existing_esurfaces 0
47.99 s
> group_count 3
47.99 s
> groups_above_threshold 0
47.99 s
> integrand bub
47.99 s
> span warm_up{integrand.name = bub}
47.99 s
> threshold_status below threshold
47.99 s
> at crates/gammalooprs/src/integrands/process/amplitude/mod.rs:1666
47.99 s
> [18:17:54.562] @gammalooprs::integrands::process::amplitude INFO : overlap structure of group 0: [0: []]
47.99 s
> field value
47.99 s
> span warm_up{integrand.name = bub}
47.99 s
> at crates/gammalooprs/src/integrands/process/amplitude/mod.rs:2015
47.99 s
> [18:17:54.562] @gammalooprs::integrands::process::amplitude INFO : overlap structure of group 1: [0: []]
47.99 s
> field value
47.99 s
> span warm_up{integrand.name = bub}
47.99 s
> at crates/gammalooprs/src/integrands/process/amplitude/mod.rs:2015
47.99 s
> [18:17:54.562] @gammalooprs::integrands::process::amplitude INFO : overlap structure of group 2: [0: []]
47.99 s
> field value
47.99 s
> span warm_up{integrand.name = bub}
47.99 s
> at crates/gammalooprs/src/integrands/process/amplitude/mod.rs:2015
47.99 s
> The application panicked (crashed).
47.99 s
> Message: assertion `left == right` failed: subtracted scalar UV profile failed:
47.99 s
> UVProfilePassFail {
47.99 s
> max_dod: -0.9,
47.99 s
> total: 16,
47.99 s
> failed: 1,
47.99 s
> failures: [
47.99 s
> UVProfileFailure {
47.99 s
> graph_index: 0,
47.99 s
> graph_name: "banana",
47.99 s
> cutkosky_cut: None,
47.99 s
> lmb_index: 1,
47.99 s
> fixed: [
47.99 s
> EdgeIndex(
47.99 s
> 2,
47.99 s
> ),
47.99 s
> EdgeIndex(
47.99 s
> 0,
47.99 s
> ),
47.99 s
> ],
47.99 s
> free: [
47.99 s
> EdgeIndex(
47.99 s
> 3,
47.99 s
> ),
47.99 s
> ],
47.99 s
> orientation_label: None,
47.99 s
> reason: "dod_exceeds_threshold",
47.99 s
> },
47.99 s
> ],
47.99 s
> }
47.99 s
>
47.99 s
> ╭─────────┬────────────┬───────────┬───────┬─────┬──────────┬───────────╮
47.99 s
> │ fixed │ → ∞ │ slope │ r2 │ DOD │ bare DOD │ inspect │
47.99 s
> ├─────────┼────────────┼───────────┼───────┼─────┼──────────┼───────────┤
47.99 s
> │ {e1,e2} │ {e3} │ -0.996752 │ 1.000 │ -1 │ 0 │ arb retry │
47.99 s
> │ {e1,e3} │ {e2} │ -1.065665 │ 0.997 │ -1 │ 0 │ arb retry │
47.99 s
> │ {e1} │ {e2,e3} │ -0.937151 │ 0.943 │ -1 │ 2 │ │
47.99 s
> │ {e2,e3} │ {e1} │ -1.001075 │ 1.000 │ -1 │ 0 │ arb retry │
47.99 s
> │ {e2} │ {e1,e3} │ -0.984146 │ 0.998 │ -1 │ 2 │ │
47.99 s
> │ {e3} │ {e1,e2} │ -1.383911 │ 0.982 │ -1 │ 2 │ arb retry │
47.99 s
> │ {} │ {e1,e2,e3} │ -1.094213 │ 0.258 │ -1 │ 4 │ │
47.99 s
> │ {e2,e0} │ {e3} │ -0.803348 │ 0.861 │ -1 │ 0 │ arb retry │
47.99 s
> │ {e3,e0} │ {e2} │ -0.999257 │ 1.000 │ -1 │ 0 │ │
47.99 s
> │ {e0} │ {e2,e3} │ -1.000893 │ 1.000 │ -1 │ 2 │ │
47.99 s
> │ {e1,e0} │ {e3} │ -0.997860 │ 1.000 │ -1 │ 0 │ │
47.99 s
> ╰─────────┴────────────┴───────────┴───────┴─────┴──────────┴───────────╯
47.99 s
>
47.99 s
> ╭───────┬─────────┬───────────┬───────┬─────┬──────────┬───────────╮
47.99 s
> │ fixed │ → ∞ │ slope │ r2 │ DOD │ bare DOD │ inspect │
47.99 s
> ├───────┼─────────┼───────────┼───────┼─────┼──────────┼───────────┤
47.99 s
> │ {e1} │ {e2} │ -1.005039 │ 1.000 │ -1 │ 0 │ arb retry │
47.99 s
> │ {e2} │ {e1} │ -1.001098 │ 1.000 │ -1 │ 0 │ arb retry │
47.99 s
> │ {} │ {e1,e2} │ -1.011289 │ 1.000 │ -1 │ 2 │ │
47.99 s
> │ {e0} │ {e2} │ -0.998140 │ 1.000 │ -1 │ 0 │ │
47.99 s
> ╰───────┴─────────┴───────────┴───────┴─────┴──────────┴───────────╯
47.99 s
>
47.99 s
> ╭───────┬──────┬───────────┬───────┬─────┬──────────┬─────────╮
47.99 s
> │ fixed │ → ∞ │ slope │ r2 │ DOD │ bare DOD │ inspect │
47.99 s
> ├───────┼──────┼───────────┼───────┼─────┼──────────┼─────────┤
47.99 s
> │ {} │ {e1} │ -0.989949 │ 1.000 │ -1 │ 0 │ │
47.99 s
> ╰───────┴──────┴───────────┴───────┴─────┴──────────┴─────────╯
47.99 s
> left: 1
47.99 s
> right: 0
47.99 s
> Location: crates/gammalooprs/src/uv/tests.rs :325
47.99 s
>
47.99 s
> ━━━━━━━━━━━━━━━━━━━━━━━━━━━━━━━━━━ BACKTRACE ━━━━━━━━━━━━━━━━━━━━━━━━━━━━━━━━━━━
47.99 s
> 1: <color_eyre[51793ea62743adbd]::config::PanicHook>::panic_report <unknown>
47.99 s
> at <unknown source file> :<unknown line>
47.99 s
> 2: <color_eyre[51793ea62743adbd]::config::PanicHook>::into_panic_hook::{closure#0} <unknown>
47.99 s
> at <unknown source file> :<unknown line>
47.99 s
> 3: std[bcb96dfbba0ab899]::panicking::panic_with_hook <unknown>
47.99 s
> at <unknown source file> :<unknown line>
47.99 s
> 4: std[bcb96dfbba0ab899]::panicking::panic_handler::{closure#0} <unknown>
47.99 s
> at <unknown source file> :<unknown line>
47.99 s
> 5: std[bcb96dfbba0ab899]::sys::backtrace::__rust_end_short_backtrace::<std[bcb96dfbba0ab899]::panicking::panic_handler::{closure#0}, !> <unknown>
47.99 s
> at <unknown source file> :<unknown line>
47.99 s
> 6: __rustc[6c289b9f9c454d21]::rust_begin_unwind <unknown>
47.99 s
> at <unknown source file> :<unknown line>
47.99 s
> 7: core[940e698046960fd5]::panicking::panic_fmt <unknown>
47.99 s
> at <unknown source file> :<unknown line>
47.99 s
> 8: core[940e698046960fd5]::panicking::assert_failed_inner <unknown>
47.99 s
> at <unknown source file> :<unknown line>
47.99 s
> 9: core[940e698046960fd5]::panicking::assert_failed::<usize, usize> <unknown>
47.99 s
> at <unknown source file> :<unknown line>
47.99 s
> 10: gammalooprs[972dff90865981f6]::uv::tests::scalars_profile_new <unknown>
47.99 s
> at <unknown source file> :<unknown line>
47.99 s
> 11: <gammalooprs[972dff90865981f6]::uv::tests::scalars_profile_new::{closure#0} as core[940e698046960fd5]::ops::function::FnOnce<()>>::call_once <unknown>
47.99 s
> at <unknown source file> :<unknown line>
47.99 s
> 12: test[75d6903177b1d7e9]::__rust_begin_short_backtrace::<core[940e698046960fd5]::result::Result<(), alloc[2ea6bcb46fca0c42]::string::String>, fn() -> core[940e698046960fd5]::result::Result<(), alloc[2ea6bcb46fca0c42]::string::String>> <unknown>
47.99 s
> at <unknown source file> :<unknown line>
47.99 s
> 13: test[75d6903177b1d7e9]::run_test::{closure#0} <unknown>
47.99 s
> at <unknown source file> :<unknown line>
47.99 s
> 14: std[bcb96dfbba0ab899]::sys::backtrace::__rust_begin_short_backtrace::<test[75d6903177b1d7e9]::run_test::{closure#1}, ()> <unknown>
47.99 s
> at <unknown source file> :<unknown line>
47.99 s
> 15: <std[bcb96dfbba0ab899]::thread::lifecycle::spawn_unchecked<test[75d6903177b1d7e9]::run_test::{closure#1}, ()>::{closure#1} as core[940e698046960fd5]::ops::function::FnOnce<()>>::call_once::{shim:vtable#0} <unknown>
47.99 s
> at <unknown source file> :<unknown line>
47.99 s
> 16: <std[bcb96dfbba0ab899]::sys::thread::unix::Thread>::new::thread_start <unknown>
47.99 s
> at <unknown source file> :<unknown line>
47.99 s
> 17: start_thread <unknown>
47.99 s
> at <unknown source file> :<unknown line>
47.99 s
> 18: __clone3 <unknown>
47.99 s
> at <unknown source file> :<unknown line>
47.99 s
>
47.99 s
> Run with COLORBT_SHOW_HIDDEN=1 environment variable to disable frame filtering.
47.99 s
> Run with RUST_BACKTRACE=full to include source snippets.
47.99 s
>
47.99 s
> ------------
47.99 s
> Summary [ 15.540s] 561 tests run: 556 passed , 5 failed , 59 skipped
47.99 s
> FAIL [ 0.168s] ( 53/561) gammalooprs cff::tests :: stored_production_cff_uses_typed_energy_factor_ownership
47.99 s
> stdout ---
47.99 s
>
47.99 s
> running 1 test
47.99 s
> test cff::tests::stored_production_cff_uses_typed_energy_factor_ownership ... FAILED
47.99 s
>
47.99 s
> failures:
47.99 s
>
47.99 s
> failures:
47.99 s
> cff::tests::stored_production_cff_uses_typed_energy_factor_ownership
47.99 s
>
47.99 s
> test result: FAILED. 0 passed; 1 failed; 0 ignored; 0 measured; 611 filtered out; finished in 0.15s
47.99 s
>
47.99 s
> stderr ---
47.99 s
> The application panicked (crashed).
47.99 s
> Message: assertion `left == right` failed
47.99 s
> left: 1
47.99 s
> right: -1
47.99 s
> Location: crates/gammalooprs/src/cff/mod.rs :2721
47.99 s
>
47.99 s
> ━━━━━━━━━━━━━━━━━━━━━━━━━━━━━━━━━━ BACKTRACE ━━━━━━━━━━━━━━━━━━━━━━━━━━━━━━━━━━━
47.99 s
> 1: <color_eyre[51793ea62743adbd]::config::PanicHook>::panic_report <unknown>
47.99 s
> at <unknown source file> :<unknown line>
47.99 s
> 2: <color_eyre[51793ea62743adbd]::config::PanicHook>::into_panic_hook::{closure#0} <unknown>
47.99 s
> at <unknown source file> :<unknown line>
47.99 s
> 3: std[bcb96dfbba0ab899]::panicking::panic_with_hook <unknown>
47.99 s
> at <unknown source file> :<unknown line>
47.99 s
> 4: std[bcb96dfbba0ab899]::panicking::panic_handler::{closure#0} <unknown>
47.99 s
> at <unknown source file> :<unknown line>
47.99 s
> 5: std[bcb96dfbba0ab899]::sys::backtrace::__rust_end_short_backtrace::<std[bcb96dfbba0ab899]::panicking::panic_handler::{closure#0}, !> <unknown>
47.99 s
> at <unknown source file> :<unknown line>
47.99 s
> 6: __rustc[6c289b9f9c454d21]::rust_begin_unwind <unknown>
47.99 s
> at <unknown source file> :<unknown line>
47.99 s
> 7: core[940e698046960fd5]::panicking::panic_fmt <unknown>
47.99 s
> at <unknown source file> :<unknown line>
47.99 s
> 8: core[940e698046960fd5]::panicking::assert_failed_inner <unknown>
47.99 s
> at <unknown source file> :<unknown line>
47.99 s
> 9: core[940e698046960fd5]::panicking::assert_failed::<i64, i64> <unknown>
47.99 s
> at <unknown source file> :<unknown line>
47.99 s
> 10: gammalooprs[972dff90865981f6]::cff::tests::stored_production_cff_uses_typed_energy_factor_ownership <unknown>
47.99 s
> at <unknown source file> :<unknown line>
47.99 s
> 11: <gammalooprs[972dff90865981f6]::cff::tests::stored_production_cff_uses_typed_energy_factor_ownership::{closure#0} as core[940e698046960fd5]::ops::function::FnOnce<()>>::call_once <unknown>
47.99 s
> at <unknown source file> :<unknown line>
47.99 s
> 12: test[75d6903177b1d7e9]::__rust_begin_short_backtrace::<core[940e698046960fd5]::result::Result<(), alloc[2ea6bcb46fca0c42]::string::String>, fn() -> core[940e698046960fd5]::result::Result<(), alloc[2ea6bcb46fca0c42]::string::String>> <unknown>
47.99 s
> at <unknown source file> :<unknown line>
47.99 s
> 13: test[75d6903177b1d7e9]::run_test::{closure#0} <unknown>
47.99 s
> at <unknown source file> :<unknown line>
47.99 s
> 14: std[bcb96dfbba0ab899]::sys::backtrace::__rust_begin_short_backtrace::<test[75d6903177b1d7e9]::run_test::{closure#1}, ()> <unknown>
47.99 s
> at <unknown source file> :<unknown line>
47.99 s
> 15: <std[bcb96dfbba0ab899]::thread::lifecycle::spawn_unchecked<test[75d6903177b1d7e9]::run_test::{closure#1}, ()>::{closure#1} as core[940e698046960fd5]::ops::function::FnOnce<()>>::call_once::{shim:vtable#0} <unknown>
47.99 s
> at <unknown source file> :<unknown line>
47.99 s
> 16: <std[bcb96dfbba0ab899]::sys::thread::unix::Thread>::new::thread_start <unknown>
47.99 s
> at <unknown source file> :<unknown line>
47.99 s
> 17: start_thread <unknown>
47.99 s
> at <unknown source file> :<unknown line>
47.99 s
> 18: __clone3 <unknown>
47.99 s
> at <unknown source file> :<unknown line>
47.99 s
>
47.99 s
> Run with COLORBT_SHOW_HIDDEN=1 environment variable to disable frame filtering.
47.99 s
> Run with RUST_BACKTRACE=full to include source snippets.
47.99 s
>
47.99 s
> FAIL [ 0.108s] (483/561) gammalooprs uv::approx::local_3d::tests :: production_emr_map_cancels_one_powered_denominator
47.99 s
> stdout ---
47.99 s
>
47.99 s
> running 1 test
47.99 s
> test uv::approx::local_3d::tests::production_emr_map_cancels_one_powered_denominator ... FAILED
47.99 s
>
47.99 s
> failures:
47.99 s
>
47.99 s
> failures:
47.99 s
> uv::approx::local_3d::tests::production_emr_map_cancels_one_powered_denominator
47.99 s
>
47.99 s
> test result: FAILED. 0 passed; 1 failed; 0 ignored; 0 measured; 611 filtered out; finished in 0.09s
47.99 s
>
47.99 s
> stderr ---
47.99 s
> The application panicked (crashed).
47.99 s
> Message: summed exact-source powered and selected lower channels differ: powered=-1 𝑖 /8/𝜋^3, lower=1𝑖 /16/𝜋^3, difference=-3𝑖 /16/𝜋^3
47.99 s
> Location: crates/gammalooprs/src/uv/approx/local_3d.rs :2047
47.99 s
>
47.99 s
> ━━━━━━━━━━━━━━━━━━━━━━━━━━━━━━━━━━ BACKTRACE ━━━━━━━━━━━━━━━━━━━━━━━━━━━━━━━━━━━
47.99 s
> 1: <color_eyre[51793ea62743adbd]::config::PanicHook>::panic_report <unknown>
47.99 s
> at <unknown source file> :<unknown line>
47.99 s
> 2: <color_eyre[51793ea62743adbd]::config::PanicHook>::into_panic_hook::{closure#0} <unknown>
47.99 s
> at <unknown source file> :<unknown line>
47.99 s
> 3: std[bcb96dfbba0ab899]::panicking::panic_with_hook <unknown>
47.99 s
> at <unknown source file> :<unknown line>
47.99 s
> 4: std[bcb96dfbba0ab899]::panicking::panic_handler::{closure#0} <unknown>
47.99 s
> at <unknown source file> :<unknown line>
47.99 s
> 5: std[bcb96dfbba0ab899]::sys::backtrace::__rust_end_short_backtrace::<std[bcb96dfbba0ab899]::panicking::panic_handler::{closure#0}, !> <unknown>
47.99 s
> at <unknown source file> :<unknown line>
47.99 s
> 6: __rustc[6c289b9f9c454d21]::rust_begin_unwind <unknown>
47.99 s
> at <unknown source file> :<unknown line>
47.99 s
> 7: core[940e698046960fd5]::panicking::panic_fmt <unknown>
47.99 s
> at <unknown source file> :<unknown line>
47.99 s
> 8: gammalooprs[972dff90865981f6]::uv::approx::local_3d::tests::production_emr_map_cancels_one_powered_denominator <unknown>
47.99 s
> at <unknown source file> :<unknown line>
47.99 s
> 9: <gammalooprs[972dff90865981f6]::uv::approx::local_3d::tests::production_emr_map_cancels_one_powered_denominator::{closure#0} as core[940e698046960fd5]::ops::function::FnOnce<()>>::call_once <unknown>
47.99 s
> at <unknown source file> :<unknown line>
47.99 s
> 10: test[75d6903177b1d7e9]::__rust_begin_short_backtrace::<core[940e698046960fd5]::result::Result<(), alloc[2ea6bcb46fca0c42]::string::String>, fn() -> core[940e698046960fd5]::result::Result<(), alloc[2ea6bcb46fca0c42]::string::String>> <unknown>
47.99 s
> at <unknown source file> :<unknown line>
47.99 s
> 11: test[75d6903177b1d7e9]::run_test::{closure#0} <unknown>
47.99 s
> at <unknown source file> :<unknown line>
47.99 s
> 12: std[bcb96dfbba0ab899]::sys::backtrace::__rust_begin_short_backtrace::<test[75d6903177b1d7e9]::run_test::{closure#1}, ()> <unknown>
47.99 s
> at <unknown source file> :<unknown line>
47.99 s
> 13: <std[bcb96dfbba0ab899]::thread::lifecycle::spawn_unchecked<test[75d6903177b1d7e9]::run_test::{closure#1}, ()>::{closure#1} as core[940e698046960fd5]::ops::function::FnOnce<()>>::call_once::{shim:vtable#0} <unknown>
47.99 s
> at <unknown source file> :<unknown line>
47.99 s
> 14: <std[bcb96dfbba0ab899]::sys::thread::unix::Thread>::new::thread_start <unknown>
47.99 s
> at <unknown source file> :<unknown line>
47.99 s
> 15: start_thread <unknown>
47.99 s
> at <unknown source file> :<unknown line>
47.99 s
> 16: __clone3 <unknown>
47.99 s
> at <unknown source file> :<unknown line>
47.99 s
>
47.99 s
> Run with COLORBT_SHOW_HIDDEN=1 environment variable to disable frame filtering.
47.99 s
> Run with RUST_BACKTRACE=full to include source snippets.
47.99 s
>
47.99 s
> FAIL [ 0.424s] (539/561) gammalooprs uv::hedge_poset::tests :: spectacles_typed_4d_projects_after_local_construction
47.99 s
> stdout ---
47.99 s
>
47.99 s
> running 1 test
47.99 s
> digraph {
47.99 s
> node [shape=circle,height=0.1,label=""];
47.99 s
> overlap = "scale";
47.99 s
> layout = "neato";
47.99 s
> start=2;
47.99 s
> 4 [label="0"];
47.99 s
> 1 [label="zw"];
47.99 s
> 2 [label="F"];
47.99 s
> 0 [label="143"];
47.99 s
> 3 [label="10B"];
47.99 s
> 4:0:s -> 1:1:s [id=0 color="red:blue;0.5" label="zw"];
47.99 s
> 4:2:s -> 2:3:s [id=1 color="red:blue;0.5" label="F"];
47.99 s
> 3:5:s -> 0:4:s [id=2 color="red:blue;0.5" label="143"];
47.99 s
> 4:6:s -> 0:7:s [id=3 color="red:blue;0.5" label="143"];
47.99 s
> 1:8:s -> 3:9:s [id=4 color="red:blue;0.5" label="F"];
47.99 s
> 1:10:s -> 0:11:s [id=5 color="red:blue;0.5" label="143"];
47.99 s
> 2:12:s -> 3:13:s [id=6 color="red:blue;0.5" label="zw"];
47.99 s
> 2:14:s -> 0:15:s [id=7 color="red:blue;0.5" label="143"];
47.99 s
> }
47.99 s
>
47.99 s
> digraph {
47.99 s
> node [shape=circle,height=0.1,label=""];
47.99 s
> overlap = "scale";
47.99 s
> layout = "neato";
47.99 s
> start=2;
47.99 s
> 0 [label="∅"];
47.99 s
> 1 [label="{zw}: Approx(S_zw(0))"];
47.99 s
> 2 [label="{F}: Approx(S_F(1))"];
47.99 s
> 3 [label="{143}: Approx(S_143(3))"];
47.99 s
> 4 [label="{zw,F}: Approx(S_F(4))*Approx(S_zw(0))"];
47.99 s
> 5 [label="{zw} · {143}: Approx((-1*S_zw+S_143(5))*Approx(S_zw(0)))"];
47.99 s
> 6 [label="{F} · {143}: Approx((-1*S_F+S_143(7))*Approx(S_F(1)))"];
47.99 s
> 7 [label="{zw,F} · {143}: Approx((-1*S_10B+S_143(2))*Approx(S_F(4))*Approx(S_zw(0)))"];
47.99 s
> 0:0:s -> 1:1:s [id=0 color="red:blue;0.5"];
47.99 s
> 0:2:s -> 2:3:s [id=1 color="red:blue;0.5"];
47.99 s
> 0:4:s -> 3:5:s [id=2 color="red:blue;0.5"];
47.99 s
> 1:6:s -> 4:7:s [id=3 color="red:blue;0.5"];
47.99 s
> 1:8:s -> 5:9:s [id=4 color="red:blue;0.5"];
47.99 s
> 2:10:s -> 4:11:s [id=5 color="red:blue;0.5"];
47.99 s
> 2:12:s -> 6:13:s [id=6 color="red:blue;0.5"];
47.99 s
> 4:14:s -> 7:15:s [id=7 color="red:blue;0.5"];
47.99 s
> }
47.99 s
>
47.99 s
> test uv::hedge_poset::tests::spectacles_typed_4d_projects_after_local_construction ... FAILED
47.99 s
>
47.99 s
> failures:
47.99 s
>
47.99 s
> failures:
47.99 s
> uv::hedge_poset::tests::spectacles_typed_4d_projects_after_local_construction
47.99 s
>
47.99 s
> test result: FAILED. 0 passed; 1 failed; 0 ignored; 0 measured; 611 filtered out; finished in 0.39s
47.99 s
>
47.99 s
> stderr ---
47.99 s
> Error:
47.99 s
> 0: failed to extract three-dimensional representation graph input: source edge 1 has no unique routing for rewritten exact signature [-1, 0, 0] modulo the factorized opposite-domain loop span
47.99 s
>
47.99 s
> Location:
47.99 s
> crates/gammalooprs/src/uv/approx/local_3d.rs :845
47.99 s
>
47.99 s
> ━━━━━━━━━━━━━━━━━━━━━━━━━━━━━━━━━━ BACKTRACE ━━━━━━━━━━━━━━━━━━━━━━━━━━━━━━━━━━━
47.99 s
> 1: <color_eyre[51793ea62743adbd]::config::EyreHook>::into_eyre_hook::{closure#0} <unknown>
47.99 s
> at <unknown source file> :<unknown line>
47.99 s
> 2: eyre[cb2fd339c0c40fca]::capture_handler <unknown>
47.99 s
> at <unknown source file> :<unknown line>
47.99 s
> 3: <eyre[cb2fd339c0c40fca]::Report>::from_std::<three_dimensional_reps[3cb572ff22d197ac]::graph_io::GraphIoError> <unknown>
47.99 s
> at <unknown source file> :<unknown line>
47.99 s
> 4: <gammalooprs[972dff90865981f6]::uv::approx::local_3d::Localizer>::project_4d <unknown>
47.99 s
> at <unknown source file> :<unknown line>
47.99 s
> 5: gammalooprs[972dff90865981f6]::uv::hedge_poset::tests::spectacles_typed_4d_projects_after_local_construction <unknown>
47.99 s
> at <unknown source file> :<unknown line>
47.99 s
> 6: <gammalooprs[972dff90865981f6]::uv::hedge_poset::tests::spectacles_typed_4d_projects_after_local_construction::{closure#0} as core[940e698046960fd5]::ops::function::FnOnce<()>>::call_once <unknown>
47.99 s
> at <unknown source file> :<unknown line>
47.99 s
> 7: test[75d6903177b1d7e9]::__rust_begin_short_backtrace::<core[940e698046960fd5]::result::Result<(), alloc[2ea6bcb46fca0c42]::string::String>, fn() -> core[940e698046960fd5]::result::Result<(), alloc[2ea6bcb46fca0c42]::string::String>> <unknown>
47.99 s
> at <unknown source file> :<unknown line>
47.99 s
> 8: test[75d6903177b1d7e9]::run_test::{closure#0} <unknown>
47.99 s
> at <unknown source file> :<unknown line>
47.99 s
> 9: std[bcb96dfbba0ab899]::sys::backtrace::__rust_begin_short_backtrace::<test[75d6903177b1d7e9]::run_test::{closure#1}, ()> <unknown>
47.99 s
> at <unknown source file> :<unknown line>
47.99 s
> 10: <std[bcb96dfbba0ab899]::thread::lifecycle::spawn_unchecked<test[75d6903177b1d7e9]::run_test::{closure#1}, ()>::{closure#1} as core[940e698046960fd5]::ops::function::FnOnce<()>>::call_once::{shim:vtable#0} <unknown>
47.99 s
> at <unknown source file> :<unknown line>
47.99 s
> 11: <std[bcb96dfbba0ab899]::sys::thread::unix::Thread>::new::thread_start <unknown>
47.99 s
> at <unknown source file> :<unknown line>
47.99 s
> 12: start_thread <unknown>
47.99 s
> at <unknown source file> :<unknown line>
47.99 s
> 13: __clone3 <unknown>
47.99 s
> at <unknown source file> :<unknown line>
47.99 s
>
47.99 s
> Run with COLORBT_SHOW_HIDDEN=1 environment variable to disable frame filtering.
47.99 s
> Run with RUST_BACKTRACE=full to include source snippets.
47.99 s
>
47.99 s
> FAIL [ 9.979s] (558/561) gammalooprs uv::tests :: scalars_profile
47.99 s
> stdout ---
47.99 s
>
47.99 s
> running 1 test
47.99 s
> test uv::tests::scalars_profile ... FAILED
47.99 s
>
47.99 s
> failures:
47.99 s
>
47.99 s
> failures:
47.99 s
> uv::tests::scalars_profile
47.99 s
>
47.99 s
> test result: FAILED. 0 passed; 1 failed; 0 ignored; 0 measured; 611 filtered out; finished in 9.96s
47.99 s
>
47.99 s
> stderr ---
47.99 s
> [18:17:53.343] @gammalooprs::settings::runtime WARNING : No external kinematics were provided; using default-generated external momenta and helicities.
47.99 s
> field value
47.99 s
> span build_integrand{amplitude.name = bub}
47.99 s
> at crates/gammalooprs/src/settings/runtime.rs:131
47.99 s
> [18:17:53.344] @gammalooprs::integrands::process::amplitude INFO : Input is below threshold: 0 existing threshold E-surfaces across 0/3 graph groups
47.99 s
> field value
47.99 s
> existing_esurfaces 0
47.99 s
> group_count 3
47.99 s
> groups_above_threshold 0
47.99 s
> integrand bub
47.99 s
> span warm_up{integrand.name = bub}
47.99 s
> threshold_status below threshold
47.99 s
> at crates/gammalooprs/src/integrands/process/amplitude/mod.rs:1666
47.99 s
> [18:17:53.345] @gammalooprs::integrands::process::amplitude INFO : overlap structure of group 0: [0: []]
47.99 s
> field value
47.99 s
> span warm_up{integrand.name = bub}
47.99 s
> at crates/gammalooprs/src/integrands/process/amplitude/mod.rs:2015
47.99 s
> [18:17:53.345] @gammalooprs::integrands::process::amplitude INFO : overlap structure of group 1: [0: []]
47.99 s
> field value
47.99 s
> span warm_up{integrand.name = bub}
47.99 s
> at crates/gammalooprs/src/integrands/process/amplitude/mod.rs:2015
47.99 s
> [18:17:53.345] @gammalooprs::integrands::process::amplitude INFO : overlap structure of group 2: [0: []]
47.99 s
> field value
47.99 s
> span warm_up{integrand.name = bub}
47.99 s
> at crates/gammalooprs/src/integrands/process/amplitude/mod.rs:2015
47.99 s
> The application panicked (crashed).
47.99 s
> Message: assertion `left == right` failed: subtracted scalar UV profile failed:
47.99 s
> UVProfilePassFail {
47.99 s
> max_dod: -0.9,
47.99 s
> total: 16,
47.99 s
> failed: 1,
47.99 s
> failures: [
47.99 s
> UVProfileFailure {
47.99 s
> graph_index: 0,
47.99 s
> graph_name: "banana",
47.99 s
> cutkosky_cut: None,
47.99 s
> lmb_index: 1,
47.99 s
> fixed: [
47.99 s
> EdgeIndex(
47.99 s
> 2,
47.99 s
> ),
47.99 s
> EdgeIndex(
47.99 s
> 0,
47.99 s
> ),
47.99 s
> ],
47.99 s
> free: [
47.99 s
> EdgeIndex(
47.99 s
> 3,
47.99 s
> ),
47.99 s
> ],
47.99 s
> orientation_label: None,
47.99 s
> reason: "dod_exceeds_threshold",
47.99 s
> },
47.99 s
> ],
47.99 s
> }
47.99 s
>
47.99 s
> ╭─────────┬────────────┬───────────┬───────┬─────┬──────────┬───────────╮
47.99 s
> │ fixed │ → ∞ │ slope │ r2 │ DOD │ bare DOD │ inspect │
47.99 s
> ├─────────┼────────────┼───────────┼───────┼─────┼──────────┼───────────┤
47.99 s
> │ {e1,e2} │ {e3} │ -0.996752 │ 1.000 │ -1 │ 0 │ arb retry │
47.99 s
> │ {e1,e3} │ {e2} │ -1.065665 │ 0.997 │ -1 │ 0 │ arb retry │
47.99 s
> │ {e1} │ {e2,e3} │ -0.937151 │ 0.943 │ -1 │ 2 │ │
47.99 s
> │ {e2,e3} │ {e1} │ -1.001075 │ 1.000 │ -1 │ 0 │ arb retry │
47.99 s
> │ {e2} │ {e1,e3} │ -0.984146 │ 0.998 │ -1 │ 2 │ │
47.99 s
> │ {e3} │ {e1,e2} │ -1.383911 │ 0.982 │ -1 │ 2 │ arb retry │
47.99 s
> │ {} │ {e1,e2,e3} │ -1.094213 │ 0.258 │ -1 │ 4 │ │
47.99 s
> │ {e2,e0} │ {e3} │ -0.803348 │ 0.861 │ -1 │ 0 │ arb retry │
47.99 s
> │ {e3,e0} │ {e2} │ -0.999257 │ 1.000 │ -1 │ 0 │ │
47.99 s
> │ {e0} │ {e2,e3} │ -1.000893 │ 1.000 │ -1 │ 2 │ │
47.99 s
> │ {e1,e0} │ {e3} │ -0.997860 │ 1.000 │ -1 │ 0 │ │
47.99 s
> ╰─────────┴────────────┴───────────┴───────┴─────┴──────────┴───────────╯
47.99 s
>
47.99 s
> ╭───────┬─────────┬───────────┬───────┬─────┬──────────┬───────────╮
47.99 s
> │ fixed │ → ∞ │ slope │ r2 │ DOD │ bare DOD │ inspect │
47.99 s
> ├───────┼─────────┼───────────┼───────┼─────┼──────────┼───────────┤
47.99 s
> │ {e1} │ {e2} │ -1.005039 │ 1.000 │ -1 │ 0 │ arb retry │
47.99 s
> │ {e2} │ {e1} │ -1.001098 │ 1.000 │ -1 │ 0 │ arb retry │
47.99 s
> │ {} │ {e1,e2} │ -1.011289 │ 1.000 │ -1 │ 2 │ │
47.99 s
> │ {e0} │ {e2} │ -0.998140 │ 1.000 │ -1 │ 0 │ │
47.99 s
> ╰───────┴─────────┴───────────┴───────┴─────┴──────────┴───────────╯
47.99 s
>
47.99 s
> ╭───────┬──────┬───────────┬───────┬─────┬──────────┬─────────╮
47.99 s
> │ fixed │ → ∞ │ slope │ r2 │ DOD │ bare DOD │ inspect │
47.99 s
> ├───────┼──────┼───────────┼───────┼─────┼──────────┼─────────┤
47.99 s
> │ {} │ {e1} │ -0.989949 │ 1.000 │ -1 │ 0 │ │
47.99 s
> ╰───────┴──────┴───────────┴───────┴─────┴──────────┴─────────╯
47.99 s
> left: 1
47.99 s
> right: 0
47.99 s
> Location: crates/gammalooprs/src/uv/tests.rs :259
47.99 s
>
47.99 s
> ━━━━━━━━━━━━━━━━━━━━━━━━━━━━━━━━━━ BACKTRACE ━━━━━━━━━━━━━━━━━━━━━━━━━━━━━━━━━━━
47.99 s
> 1: <color_eyre[51793ea62743adbd]::config::PanicHook>::panic_report <unknown>
47.99 s
> at <unknown source file> :<unknown line>
47.99 s
> 2: <color_eyre[51793ea62743adbd]::config::PanicHook>::into_panic_hook::{closure#0} <unknown>
47.99 s
> at <unknown source file> :<unknown line>
47.99 s
> 3: std[bcb96dfbba0ab899]::panicking::panic_with_hook <unknown>
47.99 s
> at <unknown source file> :<unknown line>
47.99 s
> 4: std[bcb96dfbba0ab899]::panicking::panic_handler::{closure#0} <unknown>
47.99 s
> at <unknown source file> :<unknown line>
47.99 s
> 5: std[bcb96dfbba0ab899]::sys::backtrace::__rust_end_short_backtrace::<std[bcb96dfbba0ab899]::panicking::panic_handler::{closure#0}, !> <unknown>
47.99 s
> at <unknown source file> :<unknown line>
47.99 s
> 6: __rustc[6c289b9f9c454d21]::rust_begin_unwind <unknown>
47.99 s
> at <unknown source file> :<unknown line>
47.99 s
> 7: core[940e698046960fd5]::panicking::panic_fmt <unknown>
47.99 s
> at <unknown source file> :<unknown line>
47.99 s
> 8: core[940e698046960fd5]::panicking::assert_failed_inner <unknown>
47.99 s
> at <unknown source file> :<unknown line>
47.99 s
> 9: core[940e698046960fd5]::panicking::assert_failed::<usize, usize> <unknown>
47.99 s
> at <unknown source file> :<unknown line>
47.99 s
> 10: gammalooprs[972dff90865981f6]::uv::tests::scalars_profile <unknown>
47.99 s
> at <unknown source file> :<unknown line>
47.99 s
> 11: <gammalooprs[972dff90865981f6]::uv::tests::scalars_profile::{closure#0} as core[940e698046960fd5]::ops::function::FnOnce<()>>::call_once <unknown>
47.99 s
> at <unknown source file> :<unknown line>
47.99 s
> 12: test[75d6903177b1d7e9]::__rust_begin_short_backtrace::<core[940e698046960fd5]::result::Result<(), alloc[2ea6bcb46fca0c42]::string::String>, fn() -> core[940e698046960fd5]::result::Result<(), alloc[2ea6bcb46fca0c42]::string::String>> <unknown>
47.99 s
> at <unknown source file> :<unknown line>
47.99 s
> 13: test[75d6903177b1d7e9]::run_test::{closure#0} <unknown>
47.99 s
> at <unknown source file> :<unknown line>
47.99 s
> 14: std[bcb96dfbba0ab899]::sys::backtrace::__rust_begin_short_backtrace::<test[75d6903177b1d7e9]::run_test::{closure#1}, ()> <unknown>
47.99 s
> at <unknown source file> :<unknown line>
47.99 s
> 15: <std[bcb96dfbba0ab899]::thread::lifecycle::spawn_unchecked<test[75d6903177b1d7e9]::run_test::{closure#1}, ()>::{closure#1} as core[940e698046960fd5]::ops::function::FnOnce<()>>::call_once::{shim:vtable#0} <unknown>
47.99 s
> at <unknown source file> :<unknown line>
47.99 s
> 16: <std[bcb96dfbba0ab899]::sys::thread::unix::Thread>::new::thread_start <unknown>
47.99 s
> at <unknown source file> :<unknown line>
47.99 s
> 17: start_thread <unknown>
47.99 s
> at <unknown source file> :<unknown line>
47.99 s
> 18: __clone3 <unknown>
47.99 s
> at <unknown source file> :<unknown line>
47.99 s
>
47.99 s
> Run with COLORBT_SHOW_HIDDEN=1 environment variable to disable frame filtering.
47.99 s
> Run with RUST_BACKTRACE=full to include source snippets.
47.99 s
>
47.99 s
> FAIL [ 11.152s] (559/561) gammalooprs uv::tests :: scalars_profile_new
47.99 s
> stdout ---
47.99 s
>
47.99 s
> running 1 test
47.99 s
> test uv::tests::scalars_profile_new ... FAILED
47.99 s
>
47.99 s
> failures:
47.99 s
>
47.99 s
> failures:
47.99 s
> uv::tests::scalars_profile_new
47.99 s
>
47.99 s
> test result: FAILED. 0 passed; 1 failed; 0 ignored; 0 measured; 611 filtered out; finished in 11.13s
47.99 s
>
47.99 s
> stderr ---
47.99 s
> [18:17:54.561] @gammalooprs::settings::runtime WARNING : No external kinematics were provided; using default-generated external momenta and helicities.
47.99 s
> field value
47.99 s
> span build_integrand{amplitude.name = bub}
47.99 s
> at crates/gammalooprs/src/settings/runtime.rs:131
47.99 s
> [18:17:54.562] @gammalooprs::integrands::process::amplitude INFO : Input is below threshold: 0 existing threshold E-surfaces across 0/3 graph groups
47.99 s
> field value
47.99 s
> existing_esurfaces 0
47.99 s
> group_count 3
47.99 s
> groups_above_threshold 0
47.99 s
> integrand bub
47.99 s
> span warm_up{integrand.name = bub}
47.99 s
> threshold_status below threshold
47.99 s
> at crates/gammalooprs/src/integrands/process/amplitude/mod.rs:1666
47.99 s
> [18:17:54.562] @gammalooprs::integrands::process::amplitude INFO : overlap structure of group 0: [0: []]
47.99 s
> field value
47.99 s
> span warm_up{integrand.name = bub}
47.99 s
> at crates/gammalooprs/src/integrands/process/amplitude/mod.rs:2015
47.99 s
> [18:17:54.562] @gammalooprs::integrands::process::amplitude INFO : overlap structure of group 1: [0: []]
47.99 s
> field value
47.99 s
> span warm_up{integrand.name = bub}
47.99 s
> at crates/gammalooprs/src/integrands/process/amplitude/mod.rs:2015
47.99 s
> [18:17:54.562] @gammalooprs::integrands::process::amplitude INFO : overlap structure of group 2: [0: []]
47.99 s
> field value
47.99 s
> span warm_up{integrand.name = bub}
47.99 s
> at crates/gammalooprs/src/integrands/process/amplitude/mod.rs:2015
47.99 s
> The application panicked (crashed).
47.99 s
> Message: assertion `left == right` failed: subtracted scalar UV profile failed:
47.99 s
> UVProfilePassFail {
47.99 s
> max_dod: -0.9,
47.99 s
> total: 16,
47.99 s
> failed: 1,
47.99 s
> failures: [
47.99 s
> UVProfileFailure {
47.99 s
> graph_index: 0,
47.99 s
> graph_name: "banana",
47.99 s
> cutkosky_cut: None,
47.99 s
> lmb_index: 1,
47.99 s
> fixed: [
47.99 s
> EdgeIndex(
47.99 s
> 2,
47.99 s
> ),
47.99 s
> EdgeIndex(
47.99 s
> 0,
47.99 s
> ),
47.99 s
> ],
47.99 s
> free: [
47.99 s
> EdgeIndex(
47.99 s
> 3,
47.99 s
> ),
47.99 s
> ],
47.99 s
> orientation_label: None,
47.99 s
> reason: "dod_exceeds_threshold",
47.99 s
> },
47.99 s
> ],
47.99 s
> }
47.99 s
>
47.99 s
> ╭─────────┬────────────┬───────────┬───────┬─────┬──────────┬───────────╮
47.99 s
> │ fixed │ → ∞ │ slope │ r2 │ DOD │ bare DOD │ inspect │
47.99 s
> ├─────────┼────────────┼───────────┼───────┼─────┼──────────┼───────────┤
47.99 s
> │ {e1,e2} │ {e3} │ -0.996752 │ 1.000 │ -1 │ 0 │ arb retry │
47.99 s
> │ {e1,e3} │ {e2} │ -1.065665 │ 0.997 │ -1 │ 0 │ arb retry │
47.99 s
> │ {e1} │ {e2,e3} │ -0.937151 │ 0.943 │ -1 │ 2 │ │
47.99 s
> │ {e2,e3} │ {e1} │ -1.001075 │ 1.000 │ -1 │ 0 │ arb retry │
47.99 s
> │ {e2} │ {e1,e3} │ -0.984146 │ 0.998 │ -1 │ 2 │ │
47.99 s
> │ {e3} │ {e1,e2} │ -1.383911 │ 0.982 │ -1 │ 2 │ arb retry │
47.99 s
> │ {} │ {e1,e2,e3} │ -1.094213 │ 0.258 │ -1 │ 4 │ │
47.99 s
> │ {e2,e0} │ {e3} │ -0.803348 │ 0.861 │ -1 │ 0 │ arb retry │
47.99 s
> │ {e3,e0} │ {e2} │ -0.999257 │ 1.000 │ -1 │ 0 │ │
47.99 s
> │ {e0} │ {e2,e3} │ -1.000893 │ 1.000 │ -1 │ 2 │ │
47.99 s
> │ {e1,e0} │ {e3} │ -0.997860 │ 1.000 │ -1 │ 0 │ │
47.99 s
> ╰─────────┴────────────┴───────────┴───────┴─────┴──────────┴───────────╯
47.99 s
>
47.99 s
> ╭───────┬─────────┬───────────┬───────┬─────┬──────────┬───────────╮
47.99 s
> │ fixed │ → ∞ │ slope │ r2 │ DOD │ bare DOD │ inspect │
47.99 s
> ├───────┼─────────┼───────────┼───────┼─────┼──────────┼───────────┤
47.99 s
> │ {e1} │ {e2} │ -1.005039 │ 1.000 │ -1 │ 0 │ arb retry │
47.99 s
> │ {e2} │ {e1} │ -1.001098 │ 1.000 │ -1 │ 0 │ arb retry │
47.99 s
> │ {} │ {e1,e2} │ -1.011289 │ 1.000 │ -1 │ 2 │ │
47.99 s
> │ {e0} │ {e2} │ -0.998140 │ 1.000 │ -1 │ 0 │ │
47.99 s
> ╰───────┴─────────┴───────────┴───────┴─────┴──────────┴───────────╯
47.99 s
>
47.99 s
> ╭───────┬──────┬───────────┬───────┬─────┬──────────┬─────────╮
47.99 s
> │ fixed │ → ∞ │ slope │ r2 │ DOD │ bare DOD │ inspect │
47.99 s
> ├───────┼──────┼───────────┼───────┼─────┼──────────┼─────────┤
47.99 s
> │ {} │ {e1} │ -0.989949 │ 1.000 │ -1 │ 0 │ │
47.99 s
> ╰───────┴──────┴───────────┴───────┴─────┴──────────┴─────────╯
47.99 s
> left: 1
47.99 s
> right: 0
47.99 s
> Location: crates/gammalooprs/src/uv/tests.rs :325
47.99 s
>
47.99 s
> ━━━━━━━━━━━━━━━━━━━━━━━━━━━━━━━━━━ BACKTRACE ━━━━━━━━━━━━━━━━━━━━━━━━━━━━━━━━━━━
47.99 s
> 1: <color_eyre[51793ea62743adbd]::config::PanicHook>::panic_report <unknown>
47.99 s
> at <unknown source file> :<unknown line>
47.99 s
> 2: <color_eyre[51793ea62743adbd]::config::PanicHook>::into_panic_hook::{closure#0} <unknown>
47.99 s
> at <unknown source file> :<unknown line>
47.99 s
> 3: std[bcb96dfbba0ab899]::panicking::panic_with_hook <unknown>
47.99 s
> at <unknown source file> :<unknown line>
47.99 s
> 4: std[bcb96dfbba0ab899]::panicking::panic_handler::{closure#0} <unknown>
47.99 s
> at <unknown source file> :<unknown line>
47.99 s
> 5: std[bcb96dfbba0ab899]::sys::backtrace::__rust_end_short_backtrace::<std[bcb96dfbba0ab899]::panicking::panic_handler::{closure#0}, !> <unknown>
47.99 s
> at <unknown source file> :<unknown line>
47.99 s
> 6: __rustc[6c289b9f9c454d21]::rust_begin_unwind <unknown>
47.99 s
> at <unknown source file> :<unknown line>
47.99 s
> 7: core[940e698046960fd5]::panicking::panic_fmt <unknown>
47.99 s
> at <unknown source file> :<unknown line>
47.99 s
> 8: core[940e698046960fd5]::panicking::assert_failed_inner <unknown>
47.99 s
> at <unknown source file> :<unknown line>
47.99 s
> 9: core[940e698046960fd5]::panicking::assert_failed::<usize, usize> <unknown>
47.99 s
> at <unknown source file> :<unknown line>
47.99 s
> 10: gammalooprs[972dff90865981f6]::uv::tests::scalars_profile_new <unknown>
47.99 s
> at <unknown source file> :<unknown line>
47.99 s
> 11: <gammalooprs[972dff90865981f6]::uv::tests::scalars_profile_new::{closure#0} as core[940e698046960fd5]::ops::function::FnOnce<()>>::call_once <unknown>
47.99 s
> at <unknown source file> :<unknown line>
47.99 s
> 12: test[75d6903177b1d7e9]::__rust_begin_short_backtrace::<core[940e698046960fd5]::result::Result<(), alloc[2ea6bcb46fca0c42]::string::String>, fn() -> core[940e698046960fd5]::result::Result<(), alloc[2ea6bcb46fca0c42]::string::String>> <unknown>
47.99 s
> at <unknown source file> :<unknown line>
47.99 s
> 13: test[75d6903177b1d7e9]::run_test::{closure#0} <unknown>
47.99 s
> at <unknown source file> :<unknown line>
47.99 s
> 14: std[bcb96dfbba0ab899]::sys::backtrace::__rust_begin_short_backtrace::<test[75d6903177b1d7e9]::run_test::{closure#1}, ()> <unknown>
47.99 s
> at <unknown source file> :<unknown line>
47.99 s
> 15: <std[bcb96dfbba0ab899]::thread::lifecycle::spawn_unchecked<test[75d6903177b1d7e9]::run_test::{closure#1}, ()>::{closure#1} as core[940e698046960fd5]::ops::function::FnOnce<()>>::call_once::{shim:vtable#0} <unknown>
47.99 s
> at <unknown source file> :<unknown line>
47.99 s
> 16: <std[bcb96dfbba0ab899]::sys::thread::unix::Thread>::new::thread_start <unknown>
47.99 s
> at <unknown source file> :<unknown line>
47.99 s
> 17: start_thread <unknown>
47.99 s
> at <unknown source file> :<unknown line>
47.99 s
> 18: __clone3 <unknown>
47.99 s
> at <unknown source file> :<unknown line>
47.99 s
>
47.99 s
> Run with COLORBT_SHOW_HIDDEN=1 environment variable to disable frame filtering.
47.99 s
> Run with RUST_BACKTRACE=full to include source snippets.
47.99 s
>
47.99 s
> error : test run failed
47.99 s
>
47.99 s
> ========== nextest test summary ==========
47.99 s
> report: target/nextest/ci_gammaloop/junit.xml
47.99 s
> tests: 561, failures: 5, errors: 0
47.99 s
>
47.99 s
> 1. gammalooprs::cff::tests::stored_production_cff_uses_typed_energy_factor_ownership
47.99 s
> failure: test failure with exit code 101
47.99 s
> system-out
47.99 s
> running 1 test
47.99 s
> test cff::tests::stored_production_cff_uses_typed_energy_factor_ownership ... FAILED
47.99 s
>
47.99 s
> failures:
47.99 s
>
47.99 s
> failures:
47.99 s
> cff::tests::stored_production_cff_uses_typed_energy_factor_ownership
47.99 s
>
47.99 s
> test result: FAILED. 0 passed; 1 failed; 0 ignored; 0 measured; 611 filtered out; finished in 0.15s
47.99 s
> system-err
47.99 s
> The application panicked (crashed).
47.99 s
> Message: assertion `left == right` failed
47.99 s
> left: 1
47.99 s
> right: -1
47.99 s
> Location: crates/gammalooprs/src/cff/mod.rs:2721
47.99 s
>
47.99 s
> ━━━━━━━━━━━━━━━━━━━━━━━━━━━━━━━━━━ BACKTRACE ━━━━━━━━━━━━━━━━━━━━━━━━━━━━━━━━━━━
47.99 s
> 1: <color_eyre[51793ea62743adbd]::config::PanicHook>::panic_report<unknown>
47.99 s
> at <unknown source file>:<unknown line>
47.99 s
> 2: <color_eyre[51793ea62743adbd]::config::PanicHook>::into_panic_hook::{closure#0}<unknown>
47.99 s
> at <unknown source file>:<unknown line>
47.99 s
> 3: std[bcb96dfbba0ab899]::panicking::panic_with_hook<unknown>
47.99 s
> at <unknown source file>:<unknown line>
47.99 s
> 4: std[bcb96dfbba0ab899]::panicking::panic_handler::{closure#0}<unknown>
47.99 s
> at <unknown source file>:<unknown line>
47.99 s
> 5: std[bcb96dfbba0ab899]::sys::backtrace::__rust_end_short_backtrace::<std[bcb96dfbba0ab899]::panicking::panic_handler::{closure#0}, !><unknown>
47.99 s
> at <unknown source file>:<unknown line>
47.99 s
> 6: __rustc[6c289b9f9c454d21]::rust_begin_unwind<unknown>
47.99 s
> at <unknown source file>:<unknown line>
47.99 s
> 7: core[940e698046960fd5]::panicking::panic_fmt<unknown>
47.99 s
> at <unknown source file>:<unknown line>
47.99 s
> 8: core[940e698046960fd5]::panicking::assert_failed_inner<unknown>
47.99 s
> at <unknown source file>:<unknown line>
47.99 s
> 9: core[940e698046960fd5]::panicking::assert_failed::<i64, i64><unknown>
47.99 s
> at <unknown source file>:<unknown line>
47.99 s
> 10: gammalooprs[972dff90865981f6]::cff::tests::stored_production_cff_uses_typed_energy_factor_ownership<unknown>
47.99 s
> at <unknown source file>:<unknown line>
47.99 s
> 11: <gammalooprs[972dff90865981f6]::cff::tests::stored_production_cff_uses_typed_energy_factor_ownership::{closure#0} as core[940e698046960fd5]::ops::function::FnOnce<()>>::call_once<unknown>
47.99 s
> at <unknown source file>:<unknown line>
47.99 s
> 12: test[75d6903177b1d7e9]::__rust_begin_short_backtrace::<core[940e698046960fd5]::result::Result<(), alloc[2ea6bcb46fca0c42]::string::String>, fn() -> core[940e698046960fd5]::result::Result<(), alloc[2ea6bcb46fca0c42]::string::String>><unknown>
47.99 s
> at <unknown source file>:<unknown line>
47.99 s
> 13: test[75d6903177b1d7e9]::run_test::{closure#0}<unknown>
47.99 s
> at <unknown source file>:<unknown line>
47.99 s
> 14: std[bcb96dfbba0ab899]::sys::backtrace::__rust_begin_short_backtrace::<test[75d6903177b1d7e9]::run_test::{closure#1}, ()><unknown>
47.99 s
> at <unknown source file>:<unknown line>
47.99 s
> 15: <std[bcb96dfbba0ab899]::thread::lifecycle::spawn_unchecked<test[75d6903177b1d7e9]::run_test::{closure#1}, ()>::{closure#1} as core[940e698046960fd5]::ops::function::FnOnce<()>>::call_once::{shim:vtable#0}<unknown>
47.99 s
> at <unknown source file>:<unknown line>
47.99 s
> 16: <std[bcb96dfbba0ab899]::sys::thread::unix::Thread>::new::thread_start<unknown>
47.99 s
> at <unknown source file>:<unknown line>
47.99 s
> 17: start_thread<unknown>
47.99 s
> at <unknown source file>:<unknown line>
47.99 s
> 18: __clone3<unknown>
47.99 s
> at <unknown source file>:<unknown line>
47.99 s
>
47.99 s
> Run with COLORBT_SHOW_HIDDEN=1 environment variable to disable frame filtering.
47.99 s
> Run with RUST_BACKTRACE=full to include source snippets.
47.99 s
>
47.99 s
> 2. gammalooprs::uv::approx::local_3d::tests::production_emr_map_cancels_one_powered_denominator
47.99 s
> failure: test failure with exit code 101
47.99 s
> system-out
47.99 s
> running 1 test
47.99 s
> test uv::approx::local_3d::tests::production_emr_map_cancels_one_powered_denominator ... FAILED
47.99 s
>
47.99 s
> failures:
47.99 s
>
47.99 s
> failures:
47.99 s
> uv::approx::local_3d::tests::production_emr_map_cancels_one_powered_denominator
47.99 s
>
47.99 s
> test result: FAILED. 0 passed; 1 failed; 0 ignored; 0 measured; 611 filtered out; finished in 0.09s
47.99 s
> system-err
47.99 s
> The application panicked (crashed).
47.99 s
> Message: summed exact-source powered and selected lower channels differ: powered=-1𝑖/8/𝜋^3, lower=1𝑖/16/𝜋^3, difference=-3𝑖/16/𝜋^3
47.99 s
> Location: crates/gammalooprs/src/uv/approx/local_3d.rs:2047
47.99 s
>
47.99 s
> ━━━━━━━━━━━━━━━━━━━━━━━━━━━━━━━━━━ BACKTRACE ━━━━━━━━━━━━━━━━━━━━━━━━━━━━━━━━━━━
47.99 s
> 1: <color_eyre[51793ea62743adbd]::config::PanicHook>::panic_report<unknown>
47.99 s
> at <unknown source file>:<unknown line>
47.99 s
> 2: <color_eyre[51793ea62743adbd]::config::PanicHook>::into_panic_hook::{closure#0}<unknown>
47.99 s
> at <unknown source file>:<unknown line>
47.99 s
> 3: std[bcb96dfbba0ab899]::panicking::panic_with_hook<unknown>
47.99 s
> at <unknown source file>:<unknown line>
47.99 s
> 4: std[bcb96dfbba0ab899]::panicking::panic_handler::{closure#0}<unknown>
47.99 s
> at <unknown source file>:<unknown line>
47.99 s
> 5: std[bcb96dfbba0ab899]::sys::backtrace::__rust_end_short_backtrace::<std[bcb96dfbba0ab899]::panicking::panic_handler::{closure#0}, !><unknown>
47.99 s
> at <unknown source file>:<unknown line>
47.99 s
> 6: __rustc[6c289b9f9c454d21]::rust_begin_unwind<unknown>
47.99 s
> at <unknown source file>:<unknown line>
47.99 s
> 7: core[940e698046960fd5]::panicking::panic_fmt<unknown>
47.99 s
> at <unknown source file>:<unknown line>
47.99 s
> 8: gammalooprs[972dff90865981f6]::uv::approx::local_3d::tests::production_emr_map_cancels_one_powered_denominator<unknown>
47.99 s
> at <unknown source file>:<unknown line>
47.99 s
> 9: <gammalooprs[972dff90865981f6]::uv::approx::local_3d::tests::production_emr_map_cancels_one_powered_denominator::{closure#0} as core[940e698046960fd5]::ops::function::FnOnce<()>>::call_once<unknown>
47.99 s
> at <unknown source file>:<unknown line>
47.99 s
> 10: test[75d6903177b1d7e9]::__rust_begin_short_backtrace::<core[940e698046960fd5]::result::Result<(), alloc[2ea6bcb46fca0c42]::string::String>, fn() -> core[940e698046960fd5]::result::Result<(), alloc[2ea6bcb46fca0c42]::string::String>><unknown>
47.99 s
> at <unknown source file>:<unknown line>
47.99 s
> 11: test[75d6903177b1d7e9]::run_test::{closure#0}<unknown>
47.99 s
> at <unknown source file>:<unknown line>
47.99 s
> 12: std[bcb96dfbba0ab899]::sys::backtrace::__rust_begin_short_backtrace::<test[75d6903177b1d7e9]::run_test::{closure#1}, ()><unknown>
47.99 s
> at <unknown source file>:<unknown line>
47.99 s
> 13: <std[bcb96dfbba0ab899]::thread::lifecycle::spawn_unchecked<test[75d6903177b1d7e9]::run_test::{closure#1}, ()>::{closure#1} as core[940e698046960fd5]::ops::function::FnOnce<()>>::call_once::{shim:vtable#0}<unknown>
47.99 s
> at <unknown source file>:<unknown line>
47.99 s
> 14: <std[bcb96dfbba0ab899]::sys::thread::unix::Thread>::new::thread_start<unknown>
47.99 s
> at <unknown source file>:<unknown line>
47.99 s
> 15: start_thread<unknown>
47.99 s
> at <unknown source file>:<unknown line>
47.99 s
> 16: __clone3<unknown>
47.99 s
> at <unknown source file>:<unknown line>
47.99 s
>
47.99 s
> Run with COLORBT_SHOW_HIDDEN=1 environment variable to disable frame filtering.
47.99 s
> Run with RUST_BACKTRACE=full to include source snippets.
47.99 s
>
47.99 s
> 3. gammalooprs::uv::hedge_poset::tests::spectacles_typed_4d_projects_after_local_construction
47.99 s
> failure: test failure with exit code 101
47.99 s
> Error:
47.99 s
> 0: failed to extract three-dimensional representation graph input: source edge 1 has no unique routing for rewritten exact signature [-1, 0, 0] modulo the factorized opposite-domain loop span
47.99 s
>
47.99 s
> Location:
47.99 s
> crates/gammalooprs/src/uv/approx/local_3d.rs:845
47.99 s
>
47.99 s
> ━━━━━━━━━━━━━━━━━━━━━━━━━━━━━━━━━━ BACKTRACE ━━━━━━━━━━━━━━━━━━━━━━━━━━━━━━━━━━━
47.99 s
> 1: <color_eyre[51793ea62743adbd]::config::EyreHook>::into_eyre_hook::{closure#0}<unknown>
47.99 s
> at <unknown source file>:<unknown line>
47.99 s
> 2: eyre[cb2fd339c0c40fca]::capture_handler<unknown>
47.99 s
> at <unknown source file>:<unknown line>
47.99 s
> 3: <eyre[cb2fd339c0c40fca]::Report>::from_std::<three_dimensional_reps[3cb572ff22d197ac]::graph_io::GraphIoError><unknown>
47.99 s
> at <unknown source file>:<unknown line>
47.99 s
> 4: <gammalooprs[972dff90865981f6]::uv::approx::local_3d::Localizer>::project_4d<unknown>
47.99 s
> at <unknown source file>:<unknown line>
47.99 s
> 5: gammalooprs[972dff90865981f6]::uv::hedge_poset::tests::spectacles_typed_4d_projects_after_local_construction<unknown>
47.99 s
> at <unknown source file>:<unknown line>
47.99 s
> 6: <gammalooprs[972dff90865981f6]::uv::hedge_poset::tests::spectacles_typed_4d_projects_after_local_construction::{closure#0} as core[940e698046960fd5]::ops::function::FnOnce<()>>::call_once<unknown>
47.99 s
> at <unknown source file>:<unknown line>
47.99 s
> 7: test[75d6903177b1d7e9]::__rust_begin_short_backtrace::<core[940e698046960fd5]::result::Result<(), alloc[2ea6bcb46fca0c42]::string::String>, fn() -> core[940e698046960fd5]::result::Result<(), alloc[2ea6bcb46fca0c42]::string::String>><unknown>
47.99 s
> at <unknown source file>:<unknown line>
47.99 s
> 8: test[75d6903177b1d7e9]::run_test::{closure#0}<unknown>
47.99 s
> at <unknown source file>:<unknown line>
47.99 s
> 9: std[bcb96dfbba0ab899]::sys::backtrace::__rust_begin_short_backtrace::<test[75d6903177b1d7e9]::run_test::{closure#1}, ()><unknown>
47.99 s
> at <unknown source file>:<unknown line>
47.99 s
> 10: <std[bcb96dfbba0ab899]::thread::lifecycle::spawn_unchecked<test[75d6903177b1d7e9]::run_test::{closure#1}, ()>::{closure#1} as core[940e698046960fd5]::ops::function::FnOnce<()>>::call_once::{shim:vtable#0}<unknown>
47.99 s
> at <unknown source file>:<unknown line>
47.99 s
> 11: <std[bcb96dfbba0ab899]::sys::thread::unix::Thread>::new::thread_start<unknown>
47.99 s
> at <unknown source file>:<unknown line>
47.99 s
> 12: start_thread<unknown>
47.99 s
> at <unknown source file>:<unknown line>
47.99 s
> 13: __clone3<unknown>
47.99 s
> at <unknown source file>:<unknown line>
47.99 s
>
47.99 s
> Run with COLORBT_SHOW_HIDDEN=1 environment variable to disable frame filtering.
47.99 s
> Run with RUST_BACKTRACE=full to include source snippets.
47.99 s
> system-out
47.99 s
> running 1 test
47.99 s
> digraph {
47.99 s
> node [shape=circle,height=0.1,label=""];
47.99 s
> overlap = "scale";
47.99 s
> layout = "neato";
47.99 s
> start=2;
47.99 s
> 4 [label="0"];
47.99 s
> 1 [label="zw"];
47.99 s
> 2 [label="F"];
47.99 s
> 0 [label="143"];
47.99 s
> 3 [label="10B"];
47.99 s
> 4:0:s-> 1:1:s [id=0 color="red:blue;0.5" label="zw"];
47.99 s
> 4:2:s-> 2:3:s [id=1 color="red:blue;0.5" label="F"];
47.99 s
> 3:5:s-> 0:4:s [id=2 color="red:blue;0.5" label="143"];
47.99 s
> 4:6:s-> 0:7:s [id=3 color="red:blue;0.5" label="143"];
47.99 s
> 1:8:s-> 3:9:s [id=4 color="red:blue;0.5" label="F"];
47.99 s
> 1:10:s-> 0:11:s [id=5 color="red:blue;0.5" label="143"];
47.99 s
> 2:12:s-> 3:13:s [id=6 color="red:blue;0.5" label="zw"];
47.99 s
> 2:14:s-> 0:15:s [id=7 color="red:blue;0.5" label="143"];
47.99 s
> }
47.99 s
>
47.99 s
> digraph {
47.99 s
> node [shape=circle,height=0.1,label=""];
47.99 s
> overlap = "scale";
47.99 s
> layout = "neato";
47.99 s
> start=2;
47.99 s
> 0 [label="∅"];
47.99 s
> 1 [label="{zw}: Approx(S_zw(0))"];
47.99 s
> 2 [label="{F}: Approx(S_F(1))"];
47.99 s
> 3 [label="{143}: Approx(S_143(3))"];
47.99 s
> 4 [label="{zw,F}: Approx(S_F(4))*Approx(S_zw(0))"];
47.99 s
> 5 [label="{zw} · {143}: Approx((-1*S_zw+S_143(5))*Approx(S_zw(0)))"];
47.99 s
> 6 [label="{F} · {143}: Approx((-1*S_F+S_143(7))*Approx(S_F(1)))"];
47.99 s
> 7 [label="{zw,F} · {143}: Approx((-1*S_10B+S_143(2))*Approx(S_F(4))*Approx(S_zw(0)))"];
47.99 s
> 0:0:s-> 1:1:s [id=0 color="red:blue;0.5"];
47.99 s
> 0:2:s-> 2:3:s [id=1 color="red:blue;0.5"];
47.99 s
> 0:4:s-> 3:5:s [id=2 color="red:blue;0.5"];
47.99 s
> 1:6:s-> 4:7:s [id=3 color="red:blue;0.5"];
47.99 s
> 1:8:s-> 5:9:s [id=4 color="red:blue;0.5"];
47.99 s
> 2:10:s-> 4:11:s [id=5 color="red:blue;0.5"];
47.99 s
> 2:12:s-> 6:13:s [id=6 color="red:blue;0.5"];
47.99 s
> 4:14:s-> 7:15:s [id=7 color="red:blue;0.5"];
47.99 s
> }
47.99 s
>
47.99 s
> test uv::hedge_poset::tests::spectacles_typed_4d_projects_after_local_construction ... FAILED
47.99 s
>
47.99 s
> failures:
47.99 s
>
47.99 s
> failures:
47.99 s
> uv::hedge_poset::tests::spectacles_typed_4d_projects_after_local_construction
47.99 s
>
47.99 s
> test result: FAILED. 0 passed; 1 failed; 0 ignored; 0 measured; 611 filtered out; finished in 0.39s
47.99 s
> system-err
47.99 s
> Error:
47.99 s
> 0: failed to extract three-dimensional representation graph input: source edge 1 has no unique routing for rewritten exact signature [-1, 0, 0] modulo the factorized opposite-domain loop span
47.99 s
>
47.99 s
> Location:
47.99 s
> crates/gammalooprs/src/uv/approx/local_3d.rs:845
47.99 s
>
47.99 s
> ━━━━━━━━━━━━━━━━━━━━━━━━━━━━━━━━━━ BACKTRACE ━━━━━━━━━━━━━━━━━━━━━━━━━━━━━━━━━━━
47.99 s
> 1: <color_eyre[51793ea62743adbd]::config::EyreHook>::into_eyre_hook::{closure#0}<unknown>
47.99 s
> at <unknown source file>:<unknown line>
47.99 s
> 2: eyre[cb2fd339c0c40fca]::capture_handler<unknown>
47.99 s
> at <unknown source file>:<unknown line>
47.99 s
> 3: <eyre[cb2fd339c0c40fca]::Report>::from_std::<three_dimensional_reps[3cb572ff22d197ac]::graph_io::GraphIoError><unknown>
47.99 s
> at <unknown source file>:<unknown line>
47.99 s
> 4: <gammalooprs[972dff90865981f6]::uv::approx::local_3d::Localizer>::project_4d<unknown>
47.99 s
> at <unknown source file>:<unknown line>
47.99 s
> 5: gammalooprs[972dff90865981f6]::uv::hedge_poset::tests::spectacles_typed_4d_projects_after_local_construction<unknown>
47.99 s
> at <unknown source file>:<unknown line>
47.99 s
> 6: <gammalooprs[972dff90865981f6]::uv::hedge_poset::tests::spectacles_typed_4d_projects_after_local_construction::{closure#0} as core[940e698046960fd5]::ops::function::FnOnce<()>>::call_once<unknown>
47.99 s
> at <unknown source file>:<unknown line>
47.99 s
> 7: test[75d6903177b1d7e9]::__rust_begin_short_backtrace::<core[940e698046960fd5]::result::Result<(), alloc[2ea6bcb46fca0c42]::string::String>, fn() -> core[940e698046960fd5]::result::Result<(), alloc[2ea6bcb46fca0c42]::string::String>><unknown>
47.99 s
> at <unknown source file>:<unknown line>
47.99 s
> 8: test[75d6903177b1d7e9]::run_test::{closure#0}<unknown>
47.99 s
> at <unknown source file>:<unknown line>
47.99 s
> 9: std[bcb96dfbba0ab899]::sys::backtrace::__rust_begin_short_backtrace::<test[75d6903177b1d7e9]::run_test::{closure#1}, ()><unknown>
47.99 s
> at <unknown source file>:<unknown line>
47.99 s
> 10: <std[bcb96dfbba0ab899]::thread::lifecycle::spawn_unchecked<test[75d6903177b1d7e9]::run_test::{closure#1}, ()>::{closure#1} as core[940e698046960fd5]::ops::function::FnOnce<()>>::call_once::{shim:vtable#0}<unknown>
47.99 s
> at <unknown source file>:<unknown line>
47.99 s
> 11: <std[bcb96dfbba0ab899]::sys::thread::unix::Thread>::new::thread_start<unknown>
47.99 s
> at <unknown source file>:<unknown line>
47.99 s
> 12: start_thread<unknown>
47.99 s
> at <unknown source file>:<unknown line>
47.99 s
> 13: __clone3<unknown>
47.99 s
> at <unknown source file>:<unknown line>
47.99 s
>
47.99 s
> Run with COLORBT_SHOW_HIDDEN=1 environment variable to disable frame filtering.
47.99 s
> Run with RUST_BACKTRACE=full to include source snippets.
47.99 s
>
47.99 s
> 4. gammalooprs::uv::tests::scalars_profile
47.99 s
> failure: test failure with exit code 101
47.99 s
> system-out
47.99 s
> running 1 test
47.99 s
> test uv::tests::scalars_profile ... FAILED
47.99 s
>
47.99 s
> failures:
47.99 s
>
47.99 s
> failures:
47.99 s
> uv::tests::scalars_profile
47.99 s
>
47.99 s
> test result: FAILED. 0 passed; 1 failed; 0 ignored; 0 measured; 611 filtered out; finished in 9.96s
47.99 s
> system-err
47.99 s
> [18:17:53.343] @gammalooprs::settings::runtime WARNING : No external kinematics were provided; using default-generated external momenta and helicities.
47.99 s
> field value
47.99 s
> span build_integrand{amplitude.name=bub}
47.99 s
> at crates/gammalooprs/src/settings/runtime.rs:131
47.99 s
> [18:17:53.344] @gammalooprs::integrands::process::amplitude INFO : Input is below threshold: 0 existing threshold E-surfaces across 0/3 graph groups
47.99 s
> field value
47.99 s
> existing_esurfaces 0
47.99 s
> group_count 3
47.99 s
> groups_above_threshold 0
47.99 s
> integrand bub
47.99 s
> span warm_up{integrand.name=bub}
47.99 s
> threshold_status below threshold
47.99 s
> at crates/gammalooprs/src/integrands/process/amplitude/mod.rs:1666
47.99 s
> [18:17:53.345] @gammalooprs::integrands::process::amplitude INFO : overlap structure of group 0: [0: []]
47.99 s
> field value
47.99 s
> span warm_up{integrand.name=bub}
47.99 s
> at crates/gammalooprs/src/integrands/process/amplitude/mod.rs:2015
47.99 s
> [18:17:53.345] @gammalooprs::integrands::process::amplitude INFO : overlap structure of group 1: [0: []]
47.99 s
> field value
47.99 s
> span warm_up{integrand.name=bub}
47.99 s
> at crates/gammalooprs/src/integrands/process/amplitude/mod.rs:2015
47.99 s
> [18:17:53.345] @gammalooprs::integrands::process::amplitude INFO : overlap structure of group 2: [0: []]
47.99 s
> field value
47.99 s
> span warm_up{integrand.name=bub}
47.99 s
> at crates/gammalooprs/src/integrands/process/amplitude/mod.rs:2015
47.99 s
> The application panicked (crashed).
47.99 s
> Message: assertion `left == right` failed: subtracted scalar UV profile failed:
47.99 s
> UVProfilePassFail {
47.99 s
> max_dod: -0.9,
47.99 s
> total: 16,
47.99 s
> failed: 1,
47.99 s
> failures: [
47.99 s
> UVProfileFailure {
47.99 s
> graph_index: 0,
47.99 s
> graph_name: "banana",
47.99 s
> cutkosky_cut: None,
47.99 s
> lmb_index: 1,
47.99 s
> fixed: [
47.99 s
> EdgeIndex(
47.99 s
> 2,
47.99 s
> ),
47.99 s
> EdgeIndex(
47.99 s
> 0,
47.99 s
> ),
47.99 s
> ],
47.99 s
> free: [
47.99 s
> EdgeIndex(
47.99 s
> 3,
47.99 s
> ),
47.99 s
> ],
47.99 s
> orientation_label: None,
47.99 s
> reason: "dod_exceeds_threshold",
47.99 s
> },
47.99 s
> ],
47.99 s
> }
47.99 s
>
47.99 s
> ╭─────────┬────────────┬───────────┬───────┬─────┬──────────┬───────────╮
47.99 s
> │ fixed │ → ∞ │ slope │ r2 │ DOD │ bare DOD │ inspect │
47.99 s
> ├─────────┼────────────┼───────────┼───────┼─────┼──────────┼───────────┤
47.99 s
> │ {e1,e2} │ {e3} │ -0.996752 │ 1.000 │ -1 │ 0 │ arb retry │
47.99 s
> │ {e1,e3} │ {e2} │ -1.065665 │ 0.997 │ -1 │ 0 │ arb retry │
47.99 s
> │ {e1} │ {e2,e3} │ -0.937151 │ 0.943 │ -1 │ 2 │ │
47.99 s
> │ {e2,e3} │ {e1} │ -1.001075 │ 1.000 │ -1 │ 0 │ arb retry │
47.99 s
> │ {e2} │ {e1,e3} │ -0.984146 │ 0.998 │ -1 │ 2 │ │
47.99 s
> │ {e3} │ {e1,e2} │ -1.383911 │ 0.982 │ -1 │ 2 │ arb retry │
47.99 s
> │ {} │ {e1,e2,e3} │ -1.094213 │ 0.258 │ -1 │ 4 │ │
47.99 s
> │ {e2,e0} │ {e3} │ -0.803348 │ 0.861 │ -1 │ 0 │ arb retry │
47.99 s
> │ {e3,e0} │ {e2} │ -0.999257 │ 1.000 │ -1 │ 0 │ │
47.99 s
> │ {e0} │ {e2,e3} │ -1.000893 │ 1.000 │ -1 │ 2 │ │
47.99 s
> │ {e1,e0} │ {e3} │ -0.997860 │ 1.000 │ -1 │ 0 │ │
47.99 s
> ╰─────────┴────────────┴───────────┴───────┴─────┴──────────┴───────────╯
47.99 s
>
47.99 s
> ╭───────┬─────────┬───────────┬───────┬─────┬──────────┬───────────╮
47.99 s
> │ fixed │ → ∞ │ slope │ r2 │ DOD │ bare DOD │ inspect │
47.99 s
> ├───────┼─────────┼───────────┼───────┼─────┼──────────┼───────────┤
47.99 s
> │ {e1} │ {e2} │ -1.005039 │ 1.000 │ -1 │ 0 │ arb retry │
47.99 s
> │ {e2} │ {e1} │ -1.001098 │ 1.000 │ -1 │ 0 │ arb retry │
47.99 s
> │ {} │ {e1,e2} │ -1.011289 │ 1.000 │ -1 │ 2 │ │
47.99 s
> │ {e0} │ {e2} │ -0.998140 │ 1.000 │ -1 │ 0 │ │
47.99 s
> ╰───────┴─────────┴───────────┴───────┴─────┴──────────┴───────────╯
47.99 s
>
47.99 s
> ╭───────┬──────┬───────────┬───────┬─────┬──────────┬─────────╮
47.99 s
> │ fixed │ → ∞ │ slope │ r2 │ DOD │ bare DOD │ inspect │
47.99 s
> ├───────┼──────┼───────────┼───────┼─────┼──────────┼─────────┤
47.99 s
> │ {} │ {e1} │ -0.989949 │ 1.000 │ -1 │ 0 │ │
47.99 s
> ╰───────┴──────┴───────────┴───────┴─────┴──────────┴─────────╯
47.99 s
> left: 1
47.99 s
> right: 0
47.99 s
> Location: crates/gammalooprs/src/uv/tests.rs:259
47.99 s
>
47.99 s
> ━━━━━━━━━━━━━━━━━━━━━━━━━━━━━━━━━━ BACKTRACE ━━━━━━━━━━━━━━━━━━━━━━━━━━━━━━━━━━━
47.99 s
> 1: <color_eyre[51793ea62743adbd]::config::PanicHook>::panic_report<unknown>
47.99 s
> at <unknown source file>:<unknown line>
47.99 s
> 2: <color_eyre[51793ea62743adbd]::config::PanicHook>::into_panic_hook::{closure#0}<unknown>
47.99 s
> at <unknown source file>:<unknown line>
47.99 s
> 3: std[bcb96dfbba0ab899]::panicking::panic_with_hook<unknown>
47.99 s
> at <unknown source file>:<unknown line>
47.99 s
> 4: std[bcb96dfbba0ab899]::panicking::panic_handler::{closure#0}<unknown>
47.99 s
> at <unknown source file>:<unknown line>
47.99 s
> 5: std[bcb96dfbba0ab899]::sys::backtrace::__rust_end_short_backtrace::<std[bcb96dfbba0ab899]::panicking::panic_handler::{closure#0}, !><unknown>
47.99 s
> at <unknown source file>:<unknown line>
47.99 s
> 6: __rustc[6c289b9f9c454d21]::rust_begin_unwind<unknown>
47.99 s
> at <unknown source file>:<unknown line>
47.99 s
> 7: core[940e698046960fd5]::panicking::panic_fmt<unknown>
47.99 s
> at <unknown source file>:<unknown line>
47.99 s
> 8: core[940e698046960fd5]::panicking::assert_failed_inner<unknown>
47.99 s
> at <unknown source file>:<unknown line>
47.99 s
> 9: core[940e698046960fd5]::panicking::assert_failed::<usize, usize><unknown>
47.99 s
> at <unknown source file>:<unknown line>
47.99 s
> 10: gammalooprs[972dff90865981f6]::uv::tests::scalars_profile<unknown>
47.99 s
> at <unknown source file>:<unknown line>
47.99 s
> 11: <gammalooprs[972dff90865981f6]::uv::tests::scalars_profile::{closure#0} as core[940e698046960fd5]::ops::function::FnOnce<()>>::call_once<unknown>
47.99 s
> at <unknown source file>:<unknown line>
47.99 s
> 12: test[75d6903177b1d7e9]::__rust_begin_short_backtrace::<core[940e698046960fd5]::result::Result<(), alloc[2ea6bcb46fca0c42]::string::String>, fn() -> core[940e698046960fd5]::result::Result<(), alloc[2ea6bcb46fca0c42]::string::String>><unknown>
47.99 s
> at <unknown source file>:<unknown line>
47.99 s
> 13: test[75d6903177b1d7e9]::run_test::{closure#0}<unknown>
47.99 s
> at <unknown source file>:<unknown line>
47.99 s
> 14: std[bcb96dfbba0ab899]::sys::backtrace::__rust_begin_short_backtrace::<test[75d6903177b1d7e9]::run_test::{closure#1}, ()><unknown>
47.99 s
> at <unknown source file>:<unknown line>
47.99 s
> ... omitted 11 more lines; see full nextest output above
47.99 s
>
47.99 s
> 5. gammalooprs::uv::tests::scalars_profile_new
47.99 s
> failure: test failure with exit code 101
47.99 s
> system-out
47.99 s
> running 1 test
47.99 s
> test uv::tests::scalars_profile_new ... FAILED
47.99 s
>
47.99 s
> failures:
47.99 s
>
47.99 s
> failures:
47.99 s
> uv::tests::scalars_profile_new
47.99 s
>
47.99 s
> test result: FAILED. 0 passed; 1 failed; 0 ignored; 0 measured; 611 filtered out; finished in 11.13s
47.99 s
> system-err
47.99 s
> [18:17:54.561] @gammalooprs::settings::runtime WARNING : No external kinematics were provided; using default-generated external momenta and helicities.
47.99 s
> field value
47.99 s
> span build_integrand{amplitude.name=bub}
47.99 s
> at crates/gammalooprs/src/settings/runtime.rs:131
47.99 s
> [18:17:54.562] @gammalooprs::integrands::process::amplitude INFO : Input is below threshold: 0 existing threshold E-surfaces across 0/3 graph groups
47.99 s
> field value
47.99 s
> existing_esurfaces 0
47.99 s
> group_count 3
47.99 s
> groups_above_threshold 0
47.99 s
> integrand bub
47.99 s
> span warm_up{integrand.name=bub}
47.99 s
> threshold_status below threshold
47.99 s
> at crates/gammalooprs/src/integrands/process/amplitude/mod.rs:1666
47.99 s
> [18:17:54.562] @gammalooprs::integrands::process::amplitude INFO : overlap structure of group 0: [0: []]
47.99 s
> field value
47.99 s
> span warm_up{integrand.name=bub}
47.99 s
> at crates/gammalooprs/src/integrands/process/amplitude/mod.rs:2015
47.99 s
> [18:17:54.562] @gammalooprs::integrands::process::amplitude INFO : overlap structure of group 1: [0: []]
47.99 s
> field value
47.99 s
> span warm_up{integrand.name=bub}
47.99 s
> at crates/gammalooprs/src/integrands/process/amplitude/mod.rs:2015
47.99 s
> [18:17:54.562] @gammalooprs::integrands::process::amplitude INFO : overlap structure of group 2: [0: []]
47.99 s
> field value
47.99 s
> span warm_up{integrand.name=bub}
47.99 s
> at crates/gammalooprs/src/integrands/process/amplitude/mod.rs:2015
47.99 s
> The application panicked (crashed).
47.99 s
> Message: assertion `left == right` failed: subtracted scalar UV profile failed:
47.99 s
> UVProfilePassFail {
47.99 s
> max_dod: -0.9,
47.99 s
> total: 16,
47.99 s
> failed: 1,
47.99 s
> failures: [
47.99 s
> UVProfileFailure {
47.99 s
> graph_index: 0,
47.99 s
> graph_name: "banana",
47.99 s
> cutkosky_cut: None,
47.99 s
> lmb_index: 1,
47.99 s
> fixed: [
47.99 s
> EdgeIndex(
47.99 s
> 2,
47.99 s
> ),
47.99 s
> EdgeIndex(
47.99 s
> 0,
47.99 s
> ),
47.99 s
> ],
47.99 s
> free: [
47.99 s
> EdgeIndex(
47.99 s
> 3,
47.99 s
> ),
47.99 s
> ],
47.99 s
> orientation_label: None,
47.99 s
> reason: "dod_exceeds_threshold",
47.99 s
> },
47.99 s
> ],
47.99 s
> }
47.99 s
>
47.99 s
> ╭─────────┬────────────┬───────────┬───────┬─────┬──────────┬───────────╮
47.99 s
> │ fixed │ → ∞ │ slope │ r2 │ DOD │ bare DOD │ inspect │
47.99 s
> ├─────────┼────────────┼───────────┼───────┼─────┼──────────┼───────────┤
47.99 s
> │ {e1,e2} │ {e3} │ -0.996752 │ 1.000 │ -1 │ 0 │ arb retry │
47.99 s
> │ {e1,e3} │ {e2} │ -1.065665 │ 0.997 │ -1 │ 0 │ arb retry │
47.99 s
> │ {e1} │ {e2,e3} │ -0.937151 │ 0.943 │ -1 │ 2 │ │
47.99 s
> │ {e2,e3} │ {e1} │ -1.001075 │ 1.000 │ -1 │ 0 │ arb retry │
47.99 s
> │ {e2} │ {e1,e3} │ -0.984146 │ 0.998 │ -1 │ 2 │ │
47.99 s
> │ {e3} │ {e1,e2} │ -1.383911 │ 0.982 │ -1 │ 2 │ arb retry │
48.00 s
> │ {} │ {e1,e2,e3} │ -1.094213 │ 0.258 │ -1 │ 4 │ │
48.00 s
> │ {e2,e0} │ {e3} │ -0.803348 │ 0.861 │ -1 │ 0 │ arb retry │
48.00 s
> │ {e3,e0} │ {e2} │ -0.999257 │ 1.000 │ -1 │ 0 │ │
48.00 s
> │ {e0} │ {e2,e3} │ -1.000893 │ 1.000 │ -1 │ 2 │ │
48.00 s
> │ {e1,e0} │ {e3} │ -0.997860 │ 1.000 │ -1 │ 0 │ │
48.00 s
> ╰─────────┴────────────┴───────────┴───────┴─────┴──────────┴───────────╯
48.00 s
>
48.00 s
> ╭───────┬─────────┬───────────┬───────┬─────┬──────────┬───────────╮
48.00 s
> │ fixed │ → ∞ │ slope │ r2 │ DOD │ bare DOD │ inspect │
48.00 s
> ├───────┼─────────┼───────────┼───────┼─────┼──────────┼───────────┤
48.00 s
> │ {e1} │ {e2} │ -1.005039 │ 1.000 │ -1 │ 0 │ arb retry │
48.00 s
> │ {e2} │ {e1} │ -1.001098 │ 1.000 │ -1 │ 0 │ arb retry │
48.00 s
> │ {} │ {e1,e2} │ -1.011289 │ 1.000 │ -1 │ 2 │ │
48.00 s
> │ {e0} │ {e2} │ -0.998140 │ 1.000 │ -1 │ 0 │ │
48.00 s
> ╰───────┴─────────┴───────────┴───────┴─────┴──────────┴───────────╯
48.00 s
>
48.00 s
> ╭───────┬──────┬───────────┬───────┬─────┬──────────┬─────────╮
48.00 s
> │ fixed │ → ∞ │ slope │ r2 │ DOD │ bare DOD │ inspect │
48.00 s
> ├───────┼──────┼───────────┼───────┼─────┼──────────┼─────────┤
48.00 s
> │ {} │ {e1} │ -0.989949 │ 1.000 │ -1 │ 0 │ │
48.00 s
> ╰───────┴──────┴───────────┴───────┴─────┴──────────┴─────────╯
48.00 s
> left: 1
48.00 s
> right: 0
48.00 s
> Location: crates/gammalooprs/src/uv/tests.rs:325
48.00 s
>
48.00 s
> ━━━━━━━━━━━━━━━━━━━━━━━━━━━━━━━━━━ BACKTRACE ━━━━━━━━━━━━━━━━━━━━━━━━━━━━━━━━━━━
48.00 s
> 1: <color_eyre[51793ea62743adbd]::config::PanicHook>::panic_report<unknown>
48.00 s
> at <unknown source file>:<unknown line>
48.00 s
> 2: <color_eyre[51793ea62743adbd]::config::PanicHook>::into_panic_hook::{closure#0}<unknown>
48.00 s
> at <unknown source file>:<unknown line>
48.00 s
> 3: std[bcb96dfbba0ab899]::panicking::panic_with_hook<unknown>
48.00 s
> at <unknown source file>:<unknown line>
48.00 s
> 4: std[bcb96dfbba0ab899]::panicking::panic_handler::{closure#0}<unknown>
48.00 s
> at <unknown source file>:<unknown line>
48.00 s
> 5: std[bcb96dfbba0ab899]::sys::backtrace::__rust_end_short_backtrace::<std[bcb96dfbba0ab899]::panicking::panic_handler::{closure#0}, !><unknown>
48.00 s
> at <unknown source file>:<unknown line>
48.00 s
> 6: __rustc[6c289b9f9c454d21]::rust_begin_unwind<unknown>
48.00 s
> at <unknown source file>:<unknown line>
48.00 s
> 7: core[940e698046960fd5]::panicking::panic_fmt<unknown>
48.00 s
> at <unknown source file>:<unknown line>
48.00 s
> 8: core[940e698046960fd5]::panicking::assert_failed_inner<unknown>
48.00 s
> at <unknown source file>:<unknown line>
48.00 s
> 9: core[940e698046960fd5]::panicking::assert_failed::<usize, usize><unknown>
48.00 s
> at <unknown source file>:<unknown line>
48.00 s
> 10: gammalooprs[972dff90865981f6]::uv::tests::scalars_profile_new<unknown>
48.00 s
> at <unknown source file>:<unknown line>
48.00 s
> 11: <gammalooprs[972dff90865981f6]::uv::tests::scalars_profile_new::{closure#0} as core[940e698046960fd5]::ops::function::FnOnce<()>>::call_once<unknown>
48.00 s
> at <unknown source file>:<unknown line>
48.00 s
> 12: test[75d6903177b1d7e9]::__rust_begin_short_backtrace::<core[940e698046960fd5]::result::Result<(), alloc[2ea6bcb46fca0c42]::string::String>, fn() -> core[940e698046960fd5]::result::Result<(), alloc[2ea6bcb46fca0c42]::string::String>><unknown>
48.00 s
> at <unknown source file>:<unknown line>
48.00 s
> 13: test[75d6903177b1d7e9]::run_test::{closure#0}<unknown>
48.00 s
> at <unknown source file>:<unknown line>
48.00 s
> 14: std[bcb96dfbba0ab899]::sys::backtrace::__rust_begin_short_backtrace::<test[75d6903177b1d7e9]::run_test::{closure#1}, ()><unknown>
48.00 s
> at <unknown source file>:<unknown line>
48.00 s
> ... omitted 11 more lines; see full nextest output above
48.00 s
> =========================================
48.00 s
> Extracting 1 binary, 1 build script output directory, and 1 linked path to /build/nextest-archive-K8VOkI
48.00 s
> Extracted 7 files to /build/nextest-archive-K8VOkI in 0.12s
48.00 s
> ------------
48.00 s
> Nextest run ID 57817a1c-c3ad-4dde-a811-f091efd2dc71 with nextest profile: ci_gammaloop
48.00 s
> Starting 54 tests across 1 binary
48.00 s
> ------------
48.00 s
> Summary [ 0.382s] 54 tests run: 54 passed , 0 skipped
48.00 s
>
48.00 s
> ========== nextest test summary ==========
48.00 s
> report: target/nextest/ci_gammaloop/junit.xml
48.00 s
> tests: 54, failures: 0, errors: 0
48.00 s
> No failing testcases found.
48.00 s
> =========================================
48.00 s
For full logs, run:
48.00 s
nix log /nix/store/xmqryc6f4382yn38pvqdg8lk2i1rvwkl-gammaloop-nextest-core.drv
48.14 s
Run failed.