test packages.x86_64-linux.nix-ci-check-gammaloop-nextest-core

Reproduce this run
Retry Run
  1. 47.18 s gammaloop-nextest-core> Run with RUST_BACKTRACE=full to include source snippets.
  2. 47.18 s gammaloop-nextest-core>
  3. 47.18 s gammaloop-nextest-core> FAIL [ 0.424s] (539/561) gammalooprs uv::hedge_poset::tests::spectacles_typed_4d_projects_after_local_construction
  4. 47.18 s gammaloop-nextest-core> stdout ---
  5. 47.18 s gammaloop-nextest-core>
  6. 47.18 s gammaloop-nextest-core> running 1 test
  7. 47.18 s gammaloop-nextest-core> digraph {
  8. 47.18 s gammaloop-nextest-core> node [shape=circle,height=0.1,label=""];
  9. 47.18 s gammaloop-nextest-core> overlap = "scale";
  10. 47.18 s gammaloop-nextest-core> layout = "neato";
  11. 47.18 s gammaloop-nextest-core> start=2;
  12. 47.18 s gammaloop-nextest-core> 4 [label="0"];
  13. 47.18 s gammaloop-nextest-core> 1 [label="zw"];
  14. 47.18 s gammaloop-nextest-core> 2 [label="F"];
  15. 47.18 s gammaloop-nextest-core> 0 [label="143"];
  16. 47.18 s gammaloop-nextest-core> 3 [label="10B"];
  17. 47.18 s gammaloop-nextest-core> 4:0:s -> 1:1:s [id=0 color="red:blue;0.5" label="zw"];
  18. 47.18 s gammaloop-nextest-core> 4:2:s -> 2:3:s [id=1 color="red:blue;0.5" label="F"];
  19. 47.18 s gammaloop-nextest-core> 3:5:s -> 0:4:s [id=2 color="red:blue;0.5" label="143"];
  20. 47.18 s gammaloop-nextest-core> 4:6:s -> 0:7:s [id=3 color="red:blue;0.5" label="143"];
  21. 47.18 s gammaloop-nextest-core> 1:8:s -> 3:9:s [id=4 color="red:blue;0.5" label="F"];
  22. 47.18 s gammaloop-nextest-core> 1:10:s -> 0:11:s [id=5 color="red:blue;0.5" label="143"];
  23. 47.18 s gammaloop-nextest-core> 2:12:s -> 3:13:s [id=6 color="red:blue;0.5" label="zw"];
  24. 47.18 s gammaloop-nextest-core> 2:14:s -> 0:15:s [id=7 color="red:blue;0.5" label="143"];
  25. 47.18 s gammaloop-nextest-core> }
  26. 47.18 s gammaloop-nextest-core>
  27. 47.18 s gammaloop-nextest-core> digraph {
  28. 47.18 s gammaloop-nextest-core> node [shape=circle,height=0.1,label=""];
  29. 47.18 s gammaloop-nextest-core> overlap = "scale";
  30. 47.18 s gammaloop-nextest-core> layout = "neato";
  31. 47.18 s gammaloop-nextest-core> start=2;
  32. 47.18 s gammaloop-nextest-core> 0 [label="∅"];
  33. 47.18 s gammaloop-nextest-core> 1 [label="{zw}: Approx(S_zw(0))"];
  34. 47.18 s gammaloop-nextest-core> 2 [label="{F}: Approx(S_F(1))"];
  35. 47.18 s gammaloop-nextest-core> 3 [label="{143}: Approx(S_143(3))"];
  36. 47.18 s gammaloop-nextest-core> 4 [label="{zw,F}: Approx(S_F(4))*Approx(S_zw(0))"];
  37. 47.18 s gammaloop-nextest-core> 5 [label="{zw} · {143}: Approx((-1*S_zw+S_143(5))*Approx(S_zw(0)))"];
  38. 47.18 s gammaloop-nextest-core> 6 [label="{F} · {143}: Approx((-1*S_F+S_143(7))*Approx(S_F(1)))"];
  39. 47.18 s gammaloop-nextest-core> 7 [label="{zw,F} · {143}: Approx((-1*S_10B+S_143(2))*Approx(S_F(4))*Approx(S_zw(0)))"];
  40. 47.18 s gammaloop-nextest-core> 0:0:s -> 1:1:s [id=0 color="red:blue;0.5"];
  41. 47.18 s gammaloop-nextest-core> 0:2:s -> 2:3:s [id=1 color="red:blue;0.5"];
  42. 47.18 s gammaloop-nextest-core> 0:4:s -> 3:5:s [id=2 color="red:blue;0.5"];
  43. 47.18 s gammaloop-nextest-core> 1:6:s -> 4:7:s [id=3 color="red:blue;0.5"];
  44. 47.18 s gammaloop-nextest-core> 1:8:s -> 5:9:s [id=4 color="red:blue;0.5"];
  45. 47.18 s gammaloop-nextest-core> 2:10:s -> 4:11:s [id=5 color="red:blue;0.5"];
  46. 47.18 s gammaloop-nextest-core> 2:12:s -> 6:13:s [id=6 color="red:blue;0.5"];
  47. 47.18 s gammaloop-nextest-core> 4:14:s -> 7:15:s [id=7 color="red:blue;0.5"];
  48. 47.18 s gammaloop-nextest-core> }
  49. 47.18 s gammaloop-nextest-core>
  50. 47.18 s gammaloop-nextest-core> test uv::hedge_poset::tests::spectacles_typed_4d_projects_after_local_construction ... FAILED
  51. 47.18 s gammaloop-nextest-core>
  52. 47.18 s gammaloop-nextest-core> failures:
  53. 47.18 s gammaloop-nextest-core>
  54. 47.18 s gammaloop-nextest-core> failures:
  55. 47.18 s gammaloop-nextest-core> uv::hedge_poset::tests::spectacles_typed_4d_projects_after_local_construction
  56. 47.18 s gammaloop-nextest-core>
  57. 47.18 s gammaloop-nextest-core> test result: FAILED. 0 passed; 1 failed; 0 ignored; 0 measured; 611 filtered out; finished in 0.39s
  58. 47.18 s gammaloop-nextest-core>
  59. 47.18 s gammaloop-nextest-core> stderr ---
  60. 47.18 s gammaloop-nextest-core> Error:
  61. 47.18 s gammaloop-nextest-core> 0: failed to extract three-dimensional representation graph input: source edge 1 has no unique routing for rewritten exact signature [-1, 0, 0] modulo the factorized opposite-domain loop span
  62. 47.18 s gammaloop-nextest-core>
  63. 47.18 s gammaloop-nextest-core> Location:
  64. 47.18 s gammaloop-nextest-core> crates/gammalooprs/src/uv/approx/local_3d.rs:845
  65. 47.18 s gammaloop-nextest-core>
  66. 47.18 s gammaloop-nextest-core> ━━━━━━━━━━━━━━━━━━━━━━━━━━━━━━━━━━ BACKTRACE ━━━━━━━━━━━━━━━━━━━━━━━━━━━━━━━━━━━
  67. 47.18 s gammaloop-nextest-core> 1: <color_eyre[51793ea62743adbd]::config::EyreHook>::into_eyre_hook::{closure#0}<unknown>
  68. 47.18 s gammaloop-nextest-core> at <unknown source file>:<unknown line>
  69. 47.18 s gammaloop-nextest-core> 2: eyre[cb2fd339c0c40fca]::capture_handler<unknown>
  70. 47.18 s gammaloop-nextest-core> at <unknown source file>:<unknown line>
  71. 47.18 s gammaloop-nextest-core> 3: <eyre[cb2fd339c0c40fca]::Report>::from_std::<three_dimensional_reps[3cb572ff22d197ac]::graph_io::GraphIoError><unknown>
  72. 47.18 s gammaloop-nextest-core> at <unknown source file>:<unknown line>
  73. 47.18 s gammaloop-nextest-core> 4: <gammalooprs[972dff90865981f6]::uv::approx::local_3d::Localizer>::project_4d<unknown>
  74. 47.18 s gammaloop-nextest-core> at <unknown source file>:<unknown line>
  75. 47.18 s gammaloop-nextest-core> 5: gammalooprs[972dff90865981f6]::uv::hedge_poset::tests::spectacles_typed_4d_projects_after_local_construction<unknown>
  76. 47.18 s gammaloop-nextest-core> at <unknown source file>:<unknown line>
  77. 47.18 s gammaloop-nextest-core> 6: <gammalooprs[972dff90865981f6]::uv::hedge_poset::tests::spectacles_typed_4d_projects_after_local_construction::{closure#0} as core[940e698046960fd5]::ops::function::FnOnce<()>>::call_once<unknown>
  78. 47.18 s gammaloop-nextest-core> at <unknown source file>:<unknown line>
  79. 47.18 s gammaloop-nextest-core> 7: test[75d6903177b1d7e9]::__rust_begin_short_backtrace::<core[940e698046960fd5]::result::Result<(), alloc[2ea6bcb46fca0c42]::string::String>, fn() -> core[940e698046960fd5]::result::Result<(), alloc[2ea6bcb46fca0c42]::string::String>><unknown>
  80. 47.18 s gammaloop-nextest-core> at <unknown source file>:<unknown line>
  81. 47.18 s gammaloop-nextest-core> 8: test[75d6903177b1d7e9]::run_test::{closure#0}<unknown>
  82. 47.18 s gammaloop-nextest-core> at <unknown source file>:<unknown line>
  83. 47.18 s gammaloop-nextest-core> 9: std[bcb96dfbba0ab899]::sys::backtrace::__rust_begin_short_backtrace::<test[75d6903177b1d7e9]::run_test::{closure#1}, ()><unknown>
  84. 47.18 s gammaloop-nextest-core> at <unknown source file>:<unknown line>
  85. 47.18 s gammaloop-nextest-core> 10: <std[bcb96dfbba0ab899]::thread::lifecycle::spawn_unchecked<test[75d6903177b1d7e9]::run_test::{closure#1}, ()>::{closure#1} as core[940e698046960fd5]::ops::function::FnOnce<()>>::call_once::{shim:vtable#0}<unknown>
  86. 47.18 s gammaloop-nextest-core> at <unknown source file>:<unknown line>
  87. 47.18 s gammaloop-nextest-core> 11: <std[bcb96dfbba0ab899]::sys::thread::unix::Thread>::new::thread_start<unknown>
  88. 47.18 s gammaloop-nextest-core> at <unknown source file>:<unknown line>
  89. 47.18 s gammaloop-nextest-core> 12: start_thread<unknown>
  90. 47.18 s gammaloop-nextest-core> at <unknown source file>:<unknown line>
  91. 47.18 s gammaloop-nextest-core> 13: __clone3<unknown>
  92. 47.18 s gammaloop-nextest-core> at <unknown source file>:<unknown line>
  93. 47.18 s gammaloop-nextest-core>
  94. 47.18 s gammaloop-nextest-core> Run with COLORBT_SHOW_HIDDEN=1 environment variable to disable frame filtering.
  95. 47.18 s gammaloop-nextest-core> Run with RUST_BACKTRACE=full to include source snippets.
  96. 47.18 s gammaloop-nextest-core>
  97. 47.18 s gammaloop-nextest-core> FAIL [ 9.979s] (558/561) gammalooprs uv::tests::scalars_profile
  98. 47.18 s gammaloop-nextest-core> stdout ---
  99. 47.18 s gammaloop-nextest-core>
  100. 47.18 s gammaloop-nextest-core> running 1 test
  101. 47.18 s gammaloop-nextest-core> test uv::tests::scalars_profile ... FAILED
  102. 47.18 s gammaloop-nextest-core>
  103. 47.18 s gammaloop-nextest-core> failures:
  104. 47.18 s gammaloop-nextest-core>
  105. 47.18 s gammaloop-nextest-core> failures:
  106. 47.18 s gammaloop-nextest-core> uv::tests::scalars_profile
  107. 47.18 s gammaloop-nextest-core>
  108. 47.18 s gammaloop-nextest-core> test result: FAILED. 0 passed; 1 failed; 0 ignored; 0 measured; 611 filtered out; finished in 9.96s
  109. 47.18 s gammaloop-nextest-core>
  110. 47.18 s gammaloop-nextest-core> stderr ---
  111. 47.18 s gammaloop-nextest-core> [18:17:53.343] @gammalooprs::settings::runtime WARNING : No external kinematics were provided; using default-generated external momenta and helicities.
  112. 47.18 s gammaloop-nextest-core> field value
  113. 47.18 s gammaloop-nextest-core> span build_integrand{amplitude.name=bub}
  114. 47.18 s gammaloop-nextest-core> at crates/gammalooprs/src/settings/runtime.rs:131
  115. 47.18 s gammaloop-nextest-core> [18:17:53.344] @gammalooprs::integrands::process::amplitude INFO : Input is below threshold: 0 existing threshold E-surfaces across 0/3 graph groups
  116. 47.18 s gammaloop-nextest-core> field value
  117. 47.18 s gammaloop-nextest-core> existing_esurfaces 0
  118. 47.18 s gammaloop-nextest-core> group_count 3
  119. 47.18 s gammaloop-nextest-core> groups_above_threshold 0
  120. 47.18 s gammaloop-nextest-core> integrand bub
  121. 47.18 s gammaloop-nextest-core> span warm_up{integrand.name=bub}
  122. 47.18 s gammaloop-nextest-core> threshold_status below threshold
  123. 47.18 s gammaloop-nextest-core> at crates/gammalooprs/src/integrands/process/amplitude/mod.rs:1666
  124. 47.18 s gammaloop-nextest-core> [18:17:53.345] @gammalooprs::integrands::process::amplitude INFO : overlap structure of group 0: [0: []]
  125. 47.18 s gammaloop-nextest-core> field value
  126. 47.18 s gammaloop-nextest-core> span warm_up{integrand.name=bub}
  127. 47.18 s gammaloop-nextest-core> at crates/gammalooprs/src/integrands/process/amplitude/mod.rs:2015
  128. 47.18 s gammaloop-nextest-core> [18:17:53.345] @gammalooprs::integrands::process::amplitude INFO : overlap structure of group 1: [0: []]
  129. 47.18 s gammaloop-nextest-core> field value
  130. 47.18 s gammaloop-nextest-core> span warm_up{integrand.name=bub}
  131. 47.18 s gammaloop-nextest-core> at crates/gammalooprs/src/integrands/process/amplitude/mod.rs:2015
  132. 47.18 s gammaloop-nextest-core> [18:17:53.345] @gammalooprs::integrands::process::amplitude INFO : overlap structure of group 2: [0: []]
  133. 47.18 s gammaloop-nextest-core> field value
  134. 47.18 s gammaloop-nextest-core> span warm_up{integrand.name=bub}
  135. 47.18 s gammaloop-nextest-core> at crates/gammalooprs/src/integrands/process/amplitude/mod.rs:2015
  136. 47.18 s gammaloop-nextest-core> The application panicked (crashed).
  137. 47.18 s gammaloop-nextest-core> Message: assertion `left == right` failed: subtracted scalar UV profile failed:
  138. 47.18 s gammaloop-nextest-core> UVProfilePassFail {
  139. 47.18 s gammaloop-nextest-core> max_dod: -0.9,
  140. 47.18 s gammaloop-nextest-core> total: 16,
  141. 47.18 s gammaloop-nextest-core> failed: 1,
  142. 47.18 s gammaloop-nextest-core> failures: [
  143. 47.18 s gammaloop-nextest-core> UVProfileFailure {
  144. 47.18 s gammaloop-nextest-core> graph_index: 0,
  145. 47.18 s gammaloop-nextest-core> graph_name: "banana",
  146. 47.18 s gammaloop-nextest-core> cutkosky_cut: None,
  147. 47.18 s gammaloop-nextest-core> lmb_index: 1,
  148. 47.18 s gammaloop-nextest-core> fixed: [
  149. 47.18 s gammaloop-nextest-core> EdgeIndex(
  150. 47.18 s gammaloop-nextest-core> 2,
  151. 47.18 s gammaloop-nextest-core> ),
  152. 47.18 s gammaloop-nextest-core> EdgeIndex(
  153. 47.18 s gammaloop-nextest-core> 0,
  154. 47.18 s gammaloop-nextest-core> ),
  155. 47.18 s gammaloop-nextest-core> ],
  156. 47.18 s gammaloop-nextest-core> free: [
  157. 47.18 s gammaloop-nextest-core> EdgeIndex(
  158. 47.18 s gammaloop-nextest-core> 3,
  159. 47.18 s gammaloop-nextest-core> ),
  160. 47.18 s gammaloop-nextest-core> ],
  161. 47.18 s gammaloop-nextest-core> orientation_label: None,
  162. 47.18 s gammaloop-nextest-core> reason: "dod_exceeds_threshold",
  163. 47.18 s gammaloop-nextest-core> },
  164. 47.18 s gammaloop-nextest-core> ],
  165. 47.18 s gammaloop-nextest-core> }
  166. 47.18 s gammaloop-nextest-core>
  167. 47.18 s gammaloop-nextest-core> ╭─────────┬────────────┬───────────┬───────┬─────┬──────────┬───────────╮
  168. 47.18 s gammaloop-nextest-core> │ fixed │ → ∞ │ slope │ r2 │ DOD │ bare DOD │ inspect │
  169. 47.18 s gammaloop-nextest-core> ├─────────┼────────────┼───────────┼───────┼─────┼──────────┼───────────┤
  170. 47.18 s gammaloop-nextest-core> │ {e1,e2} │ {e3} │ -0.996752 │ 1.000 │ -1 │ 0 │ arb retry │
  171. 47.18 s gammaloop-nextest-core> │ {e1,e3} │ {e2} │ -1.065665 │ 0.997 │ -1 │ 0 │ arb retry │
  172. 47.18 s gammaloop-nextest-core> │ {e1} │ {e2,e3} │ -0.937151 │ 0.943 │ -1 │ 2 │ │
  173. 47.18 s gammaloop-nextest-core> │ {e2,e3} │ {e1} │ -1.001075 │ 1.000 │ -1 │ 0 │ arb retry │
  174. 47.18 s gammaloop-nextest-core> │ {e2} │ {e1,e3} │ -0.984146 │ 0.998 │ -1 │ 2 │ │
  175. 47.18 s gammaloop-nextest-core> │ {e3} │ {e1,e2} │ -1.383911 │ 0.982 │ -1 │ 2 │ arb retry │
  176. 47.18 s gammaloop-nextest-core> │ {} │ {e1,e2,e3} │ -1.094213 │ 0.258 │ -1 │ 4 │ │
  177. 47.18 s gammaloop-nextest-core> │ {e2,e0} │ {e3} │ -0.803348 │ 0.861 │ -1 │ 0 │ arb retry │
  178. 47.18 s gammaloop-nextest-core> │ {e3,e0} │ {e2} │ -0.999257 │ 1.000 │ -1 │ 0 │ │
  179. 47.18 s gammaloop-nextest-core> │ {e0} │ {e2,e3} │ -1.000893 │ 1.000 │ -1 │ 2 │ │
  180. 47.18 s gammaloop-nextest-core> │ {e1,e0} │ {e3} │ -0.997860 │ 1.000 │ -1 │ 0 │ │
  181. 47.18 s gammaloop-nextest-core> ╰─────────┴────────────┴───────────┴───────┴─────┴──────────┴───────────╯
  182. 47.18 s gammaloop-nextest-core>
  183. 47.18 s gammaloop-nextest-core> ╭───────┬─────────┬───────────┬───────┬─────┬──────────┬───────────╮
  184. 47.18 s gammaloop-nextest-core> │ fixed │ → ∞ │ slope │ r2 │ DOD │ bare DOD │ inspect │
  185. 47.18 s gammaloop-nextest-core> ├───────┼─────────┼───────────┼───────┼─────┼──────────┼───────────┤
  186. 47.18 s gammaloop-nextest-core> │ {e1} │ {e2} │ -1.005039 │ 1.000 │ -1 │ 0 │ arb retry │
  187. 47.18 s gammaloop-nextest-core> │ {e2} │ {e1} │ -1.001098 │ 1.000 │ -1 │ 0 │ arb retry │
  188. 47.18 s gammaloop-nextest-core> │ {} │ {e1,e2} │ -1.011289 │ 1.000 │ -1 │ 2 │ │
  189. 47.18 s gammaloop-nextest-core> │ {e0} │ {e2} │ -0.998140 │ 1.000 │ -1 │ 0 │ │
  190. 47.18 s gammaloop-nextest-core> ╰───────┴─────────┴───────────┴───────┴─────┴──────────┴───────────╯
  191. 47.18 s gammaloop-nextest-core>
  192. 47.18 s gammaloop-nextest-core> ╭───────┬──────┬───────────┬───────┬─────┬──────────┬─────────╮
  193. 47.18 s gammaloop-nextest-core> │ fixed │ → ∞ │ slope │ r2 │ DOD │ bare DOD │ inspect │
  194. 47.18 s gammaloop-nextest-core> ├───────┼──────┼───────────┼───────┼─────┼──────────┼─────────┤
  195. 47.18 s gammaloop-nextest-core> │ {} │ {e1} │ -0.989949 │ 1.000 │ -1 │ 0 │ │
  196. 47.18 s gammaloop-nextest-core> ╰───────┴──────┴───────────┴───────┴─────┴──────────┴─────────╯
  197. 47.18 s gammaloop-nextest-core> left: 1
  198. 47.18 s gammaloop-nextest-core> right: 0
  199. 47.18 s gammaloop-nextest-core> Location: crates/gammalooprs/src/uv/tests.rs:259
  200. 47.18 s gammaloop-nextest-core>
  201. 47.18 s gammaloop-nextest-core> ━━━━━━━━━━━━━━━━━━━━━━━━━━━━━━━━━━ BACKTRACE ━━━━━━━━━━━━━━━━━━━━━━━━━━━━━━━━━━━
  202. 47.18 s gammaloop-nextest-core> 1: <color_eyre[51793ea62743adbd]::config::PanicHook>::panic_report<unknown>
  203. 47.18 s gammaloop-nextest-core> at <unknown source file>:<unknown line>
  204. 47.18 s gammaloop-nextest-core> 2: <color_eyre[51793ea62743adbd]::config::PanicHook>::into_panic_hook::{closure#0}<unknown>
  205. 47.18 s gammaloop-nextest-core> at <unknown source file>:<unknown line>
  206. 47.18 s gammaloop-nextest-core> 3: std[bcb96dfbba0ab899]::panicking::panic_with_hook<unknown>
  207. 47.18 s gammaloop-nextest-core> at <unknown source file>:<unknown line>
  208. 47.18 s gammaloop-nextest-core> 4: std[bcb96dfbba0ab899]::panicking::panic_handler::{closure#0}<unknown>
  209. 47.18 s gammaloop-nextest-core> at <unknown source file>:<unknown line>
  210. 47.18 s gammaloop-nextest-core> 5: std[bcb96dfbba0ab899]::sys::backtrace::__rust_end_short_backtrace::<std[bcb96dfbba0ab899]::panicking::panic_handler::{closure#0}, !><unknown>
  211. 47.18 s gammaloop-nextest-core> at <unknown source file>:<unknown line>
  212. 47.18 s gammaloop-nextest-core> 6: __rustc[6c289b9f9c454d21]::rust_begin_unwind<unknown>
  213. 47.18 s gammaloop-nextest-core> at <unknown source file>:<unknown line>
  214. 47.18 s gammaloop-nextest-core> 7: core[940e698046960fd5]::panicking::panic_fmt<unknown>
  215. 47.18 s gammaloop-nextest-core> at <unknown source file>:<unknown line>
  216. 47.18 s gammaloop-nextest-core> 8: core[940e698046960fd5]::panicking::assert_failed_inner<unknown>
  217. 47.18 s gammaloop-nextest-core> at <unknown source file>:<unknown line>
  218. 47.18 s gammaloop-nextest-core> 9: core[940e698046960fd5]::panicking::assert_failed::<usize, usize><unknown>
  219. 47.18 s gammaloop-nextest-core> at <unknown source file>:<unknown line>
  220. 47.18 s gammaloop-nextest-core> 10: gammalooprs[972dff90865981f6]::uv::tests::scalars_profile<unknown>
  221. 47.18 s gammaloop-nextest-core> at <unknown source file>:<unknown line>
  222. 47.18 s gammaloop-nextest-core> 11: <gammalooprs[972dff90865981f6]::uv::tests::scalars_profile::{closure#0} as core[940e698046960fd5]::ops::function::FnOnce<()>>::call_once<unknown>
  223. 47.18 s gammaloop-nextest-core> at <unknown source file>:<unknown line>
  224. 47.18 s gammaloop-nextest-core> 12: test[75d6903177b1d7e9]::__rust_begin_short_backtrace::<core[940e698046960fd5]::result::Result<(), alloc[2ea6bcb46fca0c42]::string::String>, fn() -> core[940e698046960fd5]::result::Result<(), alloc[2ea6bcb46fca0c42]::string::String>><unknown>
  225. 47.18 s gammaloop-nextest-core> at <unknown source file>:<unknown line>
  226. 47.18 s gammaloop-nextest-core> 13: test[75d6903177b1d7e9]::run_test::{closure#0}<unknown>
  227. 47.18 s gammaloop-nextest-core> at <unknown source file>:<unknown line>
  228. 47.18 s gammaloop-nextest-core> 14: std[bcb96dfbba0ab899]::sys::backtrace::__rust_begin_short_backtrace::<test[75d6903177b1d7e9]::run_test::{closure#1}, ()><unknown>
  229. 47.18 s gammaloop-nextest-core> at <unknown source file>:<unknown line>
  230. 47.18 s gammaloop-nextest-core> 15: <std[bcb96dfbba0ab899]::thread::lifecycle::spawn_unchecked<test[75d6903177b1d7e9]::run_test::{closure#1}, ()>::{closure#1} as core[940e698046960fd5]::ops::function::FnOnce<()>>::call_once::{shim:vtable#0}<unknown>
  231. 47.18 s gammaloop-nextest-core> at <unknown source file>:<unknown line>
  232. 47.18 s gammaloop-nextest-core> 16: <std[bcb96dfbba0ab899]::sys::thread::unix::Thread>::new::thread_start<unknown>
  233. 47.18 s gammaloop-nextest-core> at <unknown source file>:<unknown line>
  234. 47.18 s gammaloop-nextest-core> 17: start_thread<unknown>
  235. 47.18 s gammaloop-nextest-core> at <unknown source file>:<unknown line>
  236. 47.18 s gammaloop-nextest-core> 18: __clone3<unknown>
  237. 47.18 s gammaloop-nextest-core> at <unknown source file>:<unknown line>
  238. 47.18 s gammaloop-nextest-core>
  239. 47.18 s gammaloop-nextest-core> Run with COLORBT_SHOW_HIDDEN=1 environment variable to disable frame filtering.
  240. 47.18 s gammaloop-nextest-core> Run with RUST_BACKTRACE=full to include source snippets.
  241. 47.18 s gammaloop-nextest-core>
  242. 47.18 s gammaloop-nextest-core> FAIL [ 11.152s] (559/561) gammalooprs uv::tests::scalars_profile_new
  243. 47.18 s gammaloop-nextest-core> stdout ---
  244. 47.18 s gammaloop-nextest-core>
  245. 47.18 s gammaloop-nextest-core> running 1 test
  246. 47.18 s gammaloop-nextest-core> test uv::tests::scalars_profile_new ... FAILED
  247. 47.18 s gammaloop-nextest-core>
  248. 47.18 s gammaloop-nextest-core> failures:
  249. 47.18 s gammaloop-nextest-core>
  250. 47.18 s gammaloop-nextest-core> failures:
  251. 47.18 s gammaloop-nextest-core> uv::tests::scalars_profile_new
  252. 47.18 s gammaloop-nextest-core>
  253. 47.18 s gammaloop-nextest-core> test result: FAILED. 0 passed; 1 failed; 0 ignored; 0 measured; 611 filtered out; finished in 11.13s
  254. 47.18 s gammaloop-nextest-core>
  255. 47.18 s gammaloop-nextest-core> stderr ---
  256. 47.18 s gammaloop-nextest-core> [18:17:54.561] @gammalooprs::settings::runtime WARNING : No external kinematics were provided; using default-generated external momenta and helicities.
  257. 47.18 s gammaloop-nextest-core> field value
  258. 47.18 s gammaloop-nextest-core> span build_integrand{amplitude.name=bub}
  259. 47.18 s gammaloop-nextest-core> at crates/gammalooprs/src/settings/runtime.rs:131
  260. 47.18 s gammaloop-nextest-core> [18:17:54.562] @gammalooprs::integrands::process::amplitude INFO : Input is below threshold: 0 existing threshold E-surfaces across 0/3 graph groups
  261. 47.18 s gammaloop-nextest-core> field value
  262. 47.18 s gammaloop-nextest-core> existing_esurfaces 0
  263. 47.18 s gammaloop-nextest-core> group_count 3
  264. 47.18 s gammaloop-nextest-core> groups_above_threshold 0
  265. 47.18 s gammaloop-nextest-core> integrand bub
  266. 47.18 s gammaloop-nextest-core> span warm_up{integrand.name=bub}
  267. 47.18 s gammaloop-nextest-core> threshold_status below threshold
  268. 47.18 s gammaloop-nextest-core> at crates/gammalooprs/src/integrands/process/amplitude/mod.rs:1666
  269. 47.18 s gammaloop-nextest-core> [18:17:54.562] @gammalooprs::integrands::process::amplitude INFO : overlap structure of group 0: [0: []]
  270. 47.18 s gammaloop-nextest-core> field value
  271. 47.18 s gammaloop-nextest-core> span warm_up{integrand.name=bub}
  272. 47.18 s gammaloop-nextest-core> at crates/gammalooprs/src/integrands/process/amplitude/mod.rs:2015
  273. 47.18 s gammaloop-nextest-core> [18:17:54.562] @gammalooprs::integrands::process::amplitude INFO : overlap structure of group 1: [0: []]
  274. 47.18 s gammaloop-nextest-core> field value
  275. 47.18 s gammaloop-nextest-core> span warm_up{integrand.name=bub}
  276. 47.18 s gammaloop-nextest-core> at crates/gammalooprs/src/integrands/process/amplitude/mod.rs:2015
  277. 47.18 s gammaloop-nextest-core> [18:17:54.562] @gammalooprs::integrands::process::amplitude INFO : overlap structure of group 2: [0: []]
  278. 47.18 s gammaloop-nextest-core> field value
  279. 47.18 s gammaloop-nextest-core> span warm_up{integrand.name=bub}
  280. 47.18 s gammaloop-nextest-core> at crates/gammalooprs/src/integrands/process/amplitude/mod.rs:2015
  281. 47.18 s gammaloop-nextest-core> The application panicked (crashed).
  282. 47.18 s gammaloop-nextest-core> Message: assertion `left == right` failed: subtracted scalar UV profile failed:
  283. 47.18 s gammaloop-nextest-core> UVProfilePassFail {
  284. 47.18 s gammaloop-nextest-core> max_dod: -0.9,
  285. 47.18 s gammaloop-nextest-core> total: 16,
  286. 47.18 s gammaloop-nextest-core> failed: 1,
  287. 47.18 s gammaloop-nextest-core> failures: [
  288. 47.18 s gammaloop-nextest-core> UVProfileFailure {
  289. 47.18 s gammaloop-nextest-core> graph_index: 0,
  290. 47.18 s gammaloop-nextest-core> graph_name: "banana",
  291. 47.18 s gammaloop-nextest-core> cutkosky_cut: None,
  292. 47.18 s gammaloop-nextest-core> lmb_index: 1,
  293. 47.18 s gammaloop-nextest-core> fixed: [
  294. 47.18 s gammaloop-nextest-core> EdgeIndex(
  295. 47.18 s gammaloop-nextest-core> 2,
  296. 47.18 s gammaloop-nextest-core> ),
  297. 47.18 s gammaloop-nextest-core> EdgeIndex(
  298. 47.18 s gammaloop-nextest-core> 0,
  299. 47.18 s gammaloop-nextest-core> ),
  300. 47.18 s gammaloop-nextest-core> ],
  301. 47.18 s gammaloop-nextest-core> free: [
  302. 47.18 s gammaloop-nextest-core> EdgeIndex(
  303. 47.18 s gammaloop-nextest-core> 3,
  304. 47.18 s gammaloop-nextest-core> ),
  305. 47.18 s gammaloop-nextest-core> ],
  306. 47.18 s gammaloop-nextest-core> orientation_label: None,
  307. 47.18 s gammaloop-nextest-core> reason: "dod_exceeds_threshold",
  308. 47.18 s gammaloop-nextest-core> },
  309. 47.18 s gammaloop-nextest-core> ],
  310. 47.18 s gammaloop-nextest-core> }
  311. 47.18 s gammaloop-nextest-core>
  312. 47.18 s gammaloop-nextest-core> ╭─────────┬────────────┬───────────┬───────┬─────┬──────────┬───────────╮
  313. 47.18 s gammaloop-nextest-core> │ fixed │ → ∞ │ slope │ r2 │ DOD │ bare DOD │ inspect │
  314. 47.18 s gammaloop-nextest-core> ├─────────┼────────────┼───────────┼───────┼─────┼──────────┼───────────┤
  315. 47.18 s gammaloop-nextest-core> │ {e1,e2} │ {e3} │ -0.996752 │ 1.000 │ -1 │ 0 │ arb retry │
  316. 47.18 s gammaloop-nextest-core> │ {e1,e3} │ {e2} │ -1.065665 │ 0.997 │ -1 │ 0 │ arb retry │
  317. 47.18 s gammaloop-nextest-core> │ {e1} │ {e2,e3} │ -0.937151 │ 0.943 │ -1 │ 2 │ │
  318. 47.18 s gammaloop-nextest-core> │ {e2,e3} │ {e1} │ -1.001075 │ 1.000 │ -1 │ 0 │ arb retry │
  319. 47.18 s gammaloop-nextest-core> │ {e2} │ {e1,e3} │ -0.984146 │ 0.998 │ -1 │ 2 │ │
  320. 47.18 s gammaloop-nextest-core> │ {e3} │ {e1,e2} │ -1.383911 │ 0.982 │ -1 │ 2 │ arb retry │
  321. 47.18 s gammaloop-nextest-core> │ {} │ {e1,e2,e3} │ -1.094213 │ 0.258 │ -1 │ 4 │ │
  322. 47.18 s gammaloop-nextest-core> │ {e2,e0} │ {e3} │ -0.803348 │ 0.861 │ -1 │ 0 │ arb retry │
  323. 47.18 s gammaloop-nextest-core> │ {e3,e0} │ {e2} │ -0.999257 │ 1.000 │ -1 │ 0 │ │
  324. 47.18 s gammaloop-nextest-core> │ {e0} │ {e2,e3} │ -1.000893 │ 1.000 │ -1 │ 2 │ │
  325. 47.18 s gammaloop-nextest-core> │ {e1,e0} │ {e3} │ -0.997860 │ 1.000 │ -1 │ 0 │ │
  326. 47.18 s gammaloop-nextest-core> ╰─────────┴────────────┴───────────┴───────┴─────┴──────────┴───────────╯
  327. 47.18 s gammaloop-nextest-core>
  328. 47.18 s gammaloop-nextest-core> ╭───────┬─────────┬───────────┬───────┬─────┬──────────┬───────────╮
  329. 47.18 s gammaloop-nextest-core> │ fixed │ → ∞ │ slope │ r2 │ DOD │ bare DOD │ inspect │
  330. 47.18 s gammaloop-nextest-core> ├───────┼─────────┼───────────┼───────┼─────┼──────────┼───────────┤
  331. 47.18 s gammaloop-nextest-core> │ {e1} │ {e2} │ -1.005039 │ 1.000 │ -1 │ 0 │ arb retry │
  332. 47.18 s gammaloop-nextest-core> │ {e2} │ {e1} │ -1.001098 │ 1.000 │ -1 │ 0 │ arb retry │
  333. 47.18 s gammaloop-nextest-core> │ {} │ {e1,e2} │ -1.011289 │ 1.000 │ -1 │ 2 │ │
  334. 47.18 s gammaloop-nextest-core> │ {e0} │ {e2} │ -0.998140 │ 1.000 │ -1 │ 0 │ │
  335. 47.18 s gammaloop-nextest-core> ╰───────┴─────────┴───────────┴───────┴─────┴──────────┴───────────╯
  336. 47.18 s gammaloop-nextest-core>
  337. 47.18 s gammaloop-nextest-core> ╭───────┬──────┬───────────┬───────┬─────┬──────────┬─────────╮
  338. 47.18 s gammaloop-nextest-core> │ fixed │ → ∞ │ slope │ r2 │ DOD │ bare DOD │ inspect │
  339. 47.18 s gammaloop-nextest-core> ├───────┼──────┼───────────┼───────┼─────┼──────────┼─────────┤
  340. 47.18 s gammaloop-nextest-core> │ {} │ {e1} │ -0.989949 │ 1.000 │ -1 │ 0 │ │
  341. 47.18 s gammaloop-nextest-core> ╰───────┴──────┴───────────┴───────┴─────┴──────────┴─────────╯
  342. 47.18 s gammaloop-nextest-core> left: 1
  343. 47.18 s gammaloop-nextest-core> right: 0
  344. 47.18 s gammaloop-nextest-core> Location: crates/gammalooprs/src/uv/tests.rs:325
  345. 47.18 s gammaloop-nextest-core>
  346. 47.18 s gammaloop-nextest-core> ━━━━━━━━━━━━━━━━━━━━━━━━━━━━━━━━━━ BACKTRACE ━━━━━━━━━━━━━━━━━━━━━━━━━━━━━━━━━━━
  347. 47.18 s gammaloop-nextest-core> 1: <color_eyre[51793ea62743adbd]::config::PanicHook>::panic_report<unknown>
  348. 47.18 s gammaloop-nextest-core> at <unknown source file>:<unknown line>
  349. 47.18 s gammaloop-nextest-core> 2: <color_eyre[51793ea62743adbd]::config::PanicHook>::into_panic_hook::{closure#0}<unknown>
  350. 47.18 s gammaloop-nextest-core> at <unknown source file>:<unknown line>
  351. 47.18 s gammaloop-nextest-core> 3: std[bcb96dfbba0ab899]::panicking::panic_with_hook<unknown>
  352. 47.18 s gammaloop-nextest-core> at <unknown source file>:<unknown line>
  353. 47.18 s gammaloop-nextest-core> 4: std[bcb96dfbba0ab899]::panicking::panic_handler::{closure#0}<unknown>
  354. 47.18 s gammaloop-nextest-core> at <unknown source file>:<unknown line>
  355. 47.18 s gammaloop-nextest-core> 5: std[bcb96dfbba0ab899]::sys::backtrace::__rust_end_short_backtrace::<std[bcb96dfbba0ab899]::panicking::panic_handler::{closure#0}, !><unknown>
  356. 47.18 s gammaloop-nextest-core> at <unknown source file>:<unknown line>
  357. 47.18 s gammaloop-nextest-core> 6: __rustc[6c289b9f9c454d21]::rust_begin_unwind<unknown>
  358. 47.18 s gammaloop-nextest-core> at <unknown source file>:<unknown line>
  359. 47.18 s gammaloop-nextest-core> 7: core[940e698046960fd5]::panicking::panic_fmt<unknown>
  360. 47.18 s gammaloop-nextest-core> at <unknown source file>:<unknown line>
  361. 47.18 s gammaloop-nextest-core> 8: core[940e698046960fd5]::panicking::assert_failed_inner<unknown>
  362. 47.18 s gammaloop-nextest-core> at <unknown source file>:<unknown line>
  363. 47.18 s gammaloop-nextest-core> 9: core[940e698046960fd5]::panicking::assert_failed::<usize, usize><unknown>
  364. 47.18 s gammaloop-nextest-core> at <unknown source file>:<unknown line>
  365. 47.18 s gammaloop-nextest-core> 10: gammalooprs[972dff90865981f6]::uv::tests::scalars_profile_new<unknown>
  366. 47.18 s gammaloop-nextest-core> at <unknown source file>:<unknown line>
  367. 47.18 s gammaloop-nextest-core> 11: <gammalooprs[972dff90865981f6]::uv::tests::scalars_profile_new::{closure#0} as core[940e698046960fd5]::ops::function::FnOnce<()>>::call_once<unknown>
  368. 47.18 s gammaloop-nextest-core> at <unknown source file>:<unknown line>
  369. 47.18 s gammaloop-nextest-core> 12: test[75d6903177b1d7e9]::__rust_begin_short_backtrace::<core[940e698046960fd5]::result::Result<(), alloc[2ea6bcb46fca0c42]::string::String>, fn() -> core[940e698046960fd5]::result::Result<(), alloc[2ea6bcb46fca0c42]::string::String>><unknown>
  370. 47.18 s gammaloop-nextest-core> at <unknown source file>:<unknown line>
  371. 47.18 s gammaloop-nextest-core> 13: test[75d6903177b1d7e9]::run_test::{closure#0}<unknown>
  372. 47.18 s gammaloop-nextest-core> at <unknown source file>:<unknown line>
  373. 47.18 s gammaloop-nextest-core> 14: std[bcb96dfbba0ab899]::sys::backtrace::__rust_begin_short_backtrace::<test[75d6903177b1d7e9]::run_test::{closure#1}, ()><unknown>
  374. 47.18 s gammaloop-nextest-core> at <unknown source file>:<unknown line>
  375. 47.18 s gammaloop-nextest-core> 15: <std[bcb96dfbba0ab899]::thread::lifecycle::spawn_unchecked<test[75d6903177b1d7e9]::run_test::{closure#1}, ()>::{closure#1} as core[940e698046960fd5]::ops::function::FnOnce<()>>::call_once::{shim:vtable#0}<unknown>
  376. 47.18 s gammaloop-nextest-core> at <unknown source file>:<unknown line>
  377. 47.18 s gammaloop-nextest-core> 16: <std[bcb96dfbba0ab899]::sys::thread::unix::Thread>::new::thread_start<unknown>
  378. 47.18 s gammaloop-nextest-core> at <unknown source file>:<unknown line>
  379. 47.18 s gammaloop-nextest-core> 17: start_thread<unknown>
  380. 47.18 s gammaloop-nextest-core> at <unknown source file>:<unknown line>
  381. 47.18 s gammaloop-nextest-core> 18: __clone3<unknown>
  382. 47.18 s gammaloop-nextest-core> at <unknown source file>:<unknown line>
  383. 47.18 s gammaloop-nextest-core>
  384. 47.18 s gammaloop-nextest-core> Run with COLORBT_SHOW_HIDDEN=1 environment variable to disable frame filtering.
  385. 47.18 s gammaloop-nextest-core> Run with RUST_BACKTRACE=full to include source snippets.
  386. 47.18 s gammaloop-nextest-core>
  387. 47.29 s gammaloop-nextest-core> error: test run failed
  388. 47.34 s gammaloop-nextest-core>
  389. 47.34 s gammaloop-nextest-core> ========== nextest test summary ==========
  390. 47.34 s gammaloop-nextest-core> report: target/nextest/ci_gammaloop/junit.xml
  391. 47.34 s gammaloop-nextest-core> tests: 561, failures: 5, errors: 0
  392. 47.34 s gammaloop-nextest-core>
  393. 47.34 s gammaloop-nextest-core> 1. gammalooprs::cff::tests::stored_production_cff_uses_typed_energy_factor_ownership
  394. 47.34 s gammaloop-nextest-core> failure: test failure with exit code 101
  395. 47.34 s gammaloop-nextest-core> system-out
  396. 47.34 s gammaloop-nextest-core> running 1 test
  397. 47.34 s gammaloop-nextest-core> test cff::tests::stored_production_cff_uses_typed_energy_factor_ownership ... FAILED
  398. 47.34 s gammaloop-nextest-core>
  399. 47.34 s gammaloop-nextest-core> failures:
  400. 47.34 s gammaloop-nextest-core>
  401. 47.34 s gammaloop-nextest-core> failures:
  402. 47.34 s gammaloop-nextest-core> cff::tests::stored_production_cff_uses_typed_energy_factor_ownership
  403. 47.34 s gammaloop-nextest-core>
  404. 47.34 s gammaloop-nextest-core> test result: FAILED. 0 passed; 1 failed; 0 ignored; 0 measured; 611 filtered out; finished in 0.15s
  405. 47.34 s gammaloop-nextest-core> system-err
  406. 47.34 s gammaloop-nextest-core> The application panicked (crashed).
  407. 47.34 s gammaloop-nextest-core> Message: assertion `left == right` failed
  408. 47.34 s gammaloop-nextest-core> left: 1
  409. 47.34 s gammaloop-nextest-core> right: -1
  410. 47.34 s gammaloop-nextest-core> Location: crates/gammalooprs/src/cff/mod.rs:2721
  411. 47.34 s gammaloop-nextest-core>
  412. 47.34 s gammaloop-nextest-core> ━━━━━━━━━━━━━━━━━━━━━━━━━━━━━━━━━━ BACKTRACE ━━━━━━━━━━━━━━━━━━━━━━━━━━━━━━━━━━━
  413. 47.34 s gammaloop-nextest-core> 1: <color_eyre[51793ea62743adbd]::config::PanicHook>::panic_report<unknown>
  414. 47.34 s gammaloop-nextest-core> at <unknown source file>:<unknown line>
  415. 47.34 s gammaloop-nextest-core> 2: <color_eyre[51793ea62743adbd]::config::PanicHook>::into_panic_hook::{closure#0}<unknown>
  416. 47.34 s gammaloop-nextest-core> at <unknown source file>:<unknown line>
  417. 47.34 s gammaloop-nextest-core> 3: std[bcb96dfbba0ab899]::panicking::panic_with_hook<unknown>
  418. 47.34 s gammaloop-nextest-core> at <unknown source file>:<unknown line>
  419. 47.34 s gammaloop-nextest-core> 4: std[bcb96dfbba0ab899]::panicking::panic_handler::{closure#0}<unknown>
  420. 47.34 s gammaloop-nextest-core> at <unknown source file>:<unknown line>
  421. 47.34 s gammaloop-nextest-core> 5: std[bcb96dfbba0ab899]::sys::backtrace::__rust_end_short_backtrace::<std[bcb96dfbba0ab899]::panicking::panic_handler::{closure#0}, !><unknown>
  422. 47.34 s gammaloop-nextest-core> at <unknown source file>:<unknown line>
  423. 47.34 s gammaloop-nextest-core> 6: __rustc[6c289b9f9c454d21]::rust_begin_unwind<unknown>
  424. 47.34 s gammaloop-nextest-core> at <unknown source file>:<unknown line>
  425. 47.34 s gammaloop-nextest-core> 7: core[940e698046960fd5]::panicking::panic_fmt<unknown>
  426. 47.34 s gammaloop-nextest-core> at <unknown source file>:<unknown line>
  427. 47.34 s gammaloop-nextest-core> 8: core[940e698046960fd5]::panicking::assert_failed_inner<unknown>
  428. 47.34 s gammaloop-nextest-core> at <unknown source file>:<unknown line>
  429. 47.34 s gammaloop-nextest-core> 9: core[940e698046960fd5]::panicking::assert_failed::<i64, i64><unknown>
  430. 47.34 s gammaloop-nextest-core> at <unknown source file>:<unknown line>
  431. 47.34 s gammaloop-nextest-core> 10: gammalooprs[972dff90865981f6]::cff::tests::stored_production_cff_uses_typed_energy_factor_ownership<unknown>
  432. 47.34 s gammaloop-nextest-core> at <unknown source file>:<unknown line>
  433. 47.34 s gammaloop-nextest-core> 11: <gammalooprs[972dff90865981f6]::cff::tests::stored_production_cff_uses_typed_energy_factor_ownership::{closure#0} as core[940e698046960fd5]::ops::function::FnOnce<()>>::call_once<unknown>
  434. 47.34 s gammaloop-nextest-core> at <unknown source file>:<unknown line>
  435. 47.34 s gammaloop-nextest-core> 12: test[75d6903177b1d7e9]::__rust_begin_short_backtrace::<core[940e698046960fd5]::result::Result<(), alloc[2ea6bcb46fca0c42]::string::String>, fn() -> core[940e698046960fd5]::result::Result<(), alloc[2ea6bcb46fca0c42]::string::String>><unknown>
  436. 47.34 s gammaloop-nextest-core> at <unknown source file>:<unknown line>
  437. 47.34 s gammaloop-nextest-core> 13: test[75d6903177b1d7e9]::run_test::{closure#0}<unknown>
  438. 47.34 s gammaloop-nextest-core> at <unknown source file>:<unknown line>
  439. 47.34 s gammaloop-nextest-core> 14: std[bcb96dfbba0ab899]::sys::backtrace::__rust_begin_short_backtrace::<test[75d6903177b1d7e9]::run_test::{closure#1}, ()><unknown>
  440. 47.34 s gammaloop-nextest-core> at <unknown source file>:<unknown line>
  441. 47.34 s gammaloop-nextest-core> 15: <std[bcb96dfbba0ab899]::thread::lifecycle::spawn_unchecked<test[75d6903177b1d7e9]::run_test::{closure#1}, ()>::{closure#1} as core[940e698046960fd5]::ops::function::FnOnce<()>>::call_once::{shim:vtable#0}<unknown>
  442. 47.34 s gammaloop-nextest-core> at <unknown source file>:<unknown line>
  443. 47.34 s gammaloop-nextest-core> 16: <std[bcb96dfbba0ab899]::sys::thread::unix::Thread>::new::thread_start<unknown>
  444. 47.34 s gammaloop-nextest-core> at <unknown source file>:<unknown line>
  445. 47.34 s gammaloop-nextest-core> 17: start_thread<unknown>
  446. 47.34 s gammaloop-nextest-core> at <unknown source file>:<unknown line>
  447. 47.34 s gammaloop-nextest-core> 18: __clone3<unknown>
  448. 47.34 s gammaloop-nextest-core> at <unknown source file>:<unknown line>
  449. 47.34 s gammaloop-nextest-core>
  450. 47.34 s gammaloop-nextest-core> Run with COLORBT_SHOW_HIDDEN=1 environment variable to disable frame filtering.
  451. 47.34 s gammaloop-nextest-core> Run with RUST_BACKTRACE=full to include source snippets.
  452. 47.34 s gammaloop-nextest-core>
  453. 47.34 s gammaloop-nextest-core> 2. gammalooprs::uv::approx::local_3d::tests::production_emr_map_cancels_one_powered_denominator
  454. 47.34 s gammaloop-nextest-core> failure: test failure with exit code 101
  455. 47.34 s gammaloop-nextest-core> system-out
  456. 47.34 s gammaloop-nextest-core> running 1 test
  457. 47.34 s gammaloop-nextest-core> test uv::approx::local_3d::tests::production_emr_map_cancels_one_powered_denominator ... FAILED
  458. 47.34 s gammaloop-nextest-core>
  459. 47.34 s gammaloop-nextest-core> failures:
  460. 47.34 s gammaloop-nextest-core>
  461. 47.34 s gammaloop-nextest-core> failures:
  462. 47.34 s gammaloop-nextest-core> uv::approx::local_3d::tests::production_emr_map_cancels_one_powered_denominator
  463. 47.34 s gammaloop-nextest-core>
  464. 47.34 s gammaloop-nextest-core> test result: FAILED. 0 passed; 1 failed; 0 ignored; 0 measured; 611 filtered out; finished in 0.09s
  465. 47.34 s gammaloop-nextest-core> system-err
  466. 47.34 s gammaloop-nextest-core> The application panicked (crashed).
  467. 47.34 s gammaloop-nextest-core> Message: summed exact-source powered and selected lower channels differ: powered=-1𝑖/8/𝜋^3, lower=1𝑖/16/𝜋^3, difference=-3𝑖/16/𝜋^3
  468. 47.34 s gammaloop-nextest-core> Location: crates/gammalooprs/src/uv/approx/local_3d.rs:2047
  469. 47.34 s gammaloop-nextest-core>
  470. 47.34 s gammaloop-nextest-core> ━━━━━━━━━━━━━━━━━━━━━━━━━━━━━━━━━━ BACKTRACE ━━━━━━━━━━━━━━━━━━━━━━━━━━━━━━━━━━━
  471. 47.34 s gammaloop-nextest-core> 1: <color_eyre[51793ea62743adbd]::config::PanicHook>::panic_report<unknown>
  472. 47.34 s gammaloop-nextest-core> at <unknown source file>:<unknown line>
  473. 47.34 s gammaloop-nextest-core> 2: <color_eyre[51793ea62743adbd]::config::PanicHook>::into_panic_hook::{closure#0}<unknown>
  474. 47.34 s gammaloop-nextest-core> at <unknown source file>:<unknown line>
  475. 47.34 s gammaloop-nextest-core> 3: std[bcb96dfbba0ab899]::panicking::panic_with_hook<unknown>
  476. 47.34 s gammaloop-nextest-core> at <unknown source file>:<unknown line>
  477. 47.34 s gammaloop-nextest-core> 4: std[bcb96dfbba0ab899]::panicking::panic_handler::{closure#0}<unknown>
  478. 47.34 s gammaloop-nextest-core> at <unknown source file>:<unknown line>
  479. 47.34 s gammaloop-nextest-core> 5: std[bcb96dfbba0ab899]::sys::backtrace::__rust_end_short_backtrace::<std[bcb96dfbba0ab899]::panicking::panic_handler::{closure#0}, !><unknown>
  480. 47.34 s gammaloop-nextest-core> at <unknown source file>:<unknown line>
  481. 47.34 s gammaloop-nextest-core> 6: __rustc[6c289b9f9c454d21]::rust_begin_unwind<unknown>
  482. 47.34 s gammaloop-nextest-core> at <unknown source file>:<unknown line>
  483. 47.34 s gammaloop-nextest-core> 7: core[940e698046960fd5]::panicking::panic_fmt<unknown>
  484. 47.34 s gammaloop-nextest-core> at <unknown source file>:<unknown line>
  485. 47.34 s gammaloop-nextest-core> 8: gammalooprs[972dff90865981f6]::uv::approx::local_3d::tests::production_emr_map_cancels_one_powered_denominator<unknown>
  486. 47.34 s gammaloop-nextest-core> at <unknown source file>:<unknown line>
  487. 47.34 s gammaloop-nextest-core> 9: <gammalooprs[972dff90865981f6]::uv::approx::local_3d::tests::production_emr_map_cancels_one_powered_denominator::{closure#0} as core[940e698046960fd5]::ops::function::FnOnce<()>>::call_once<unknown>
  488. 47.34 s gammaloop-nextest-core> at <unknown source file>:<unknown line>
  489. 47.34 s gammaloop-nextest-core> 10: test[75d6903177b1d7e9]::__rust_begin_short_backtrace::<core[940e698046960fd5]::result::Result<(), alloc[2ea6bcb46fca0c42]::string::String>, fn() -> core[940e698046960fd5]::result::Result<(), alloc[2ea6bcb46fca0c42]::string::String>><unknown>
  490. 47.34 s gammaloop-nextest-core> at <unknown source file>:<unknown line>
  491. 47.34 s gammaloop-nextest-core> 11: test[75d6903177b1d7e9]::run_test::{closure#0}<unknown>
  492. 47.34 s gammaloop-nextest-core> at <unknown source file>:<unknown line>
  493. 47.34 s gammaloop-nextest-core> 12: std[bcb96dfbba0ab899]::sys::backtrace::__rust_begin_short_backtrace::<test[75d6903177b1d7e9]::run_test::{closure#1}, ()><unknown>
  494. 47.34 s gammaloop-nextest-core> at <unknown source file>:<unknown line>
  495. 47.34 s gammaloop-nextest-core> 13: <std[bcb96dfbba0ab899]::thread::lifecycle::spawn_unchecked<test[75d6903177b1d7e9]::run_test::{closure#1}, ()>::{closure#1} as core[940e698046960fd5]::ops::function::FnOnce<()>>::call_once::{shim:vtable#0}<unknown>
  496. 47.34 s gammaloop-nextest-core> at <unknown source file>:<unknown line>
  497. 47.34 s gammaloop-nextest-core> 14: <std[bcb96dfbba0ab899]::sys::thread::unix::Thread>::new::thread_start<unknown>
  498. 47.34 s gammaloop-nextest-core> at <unknown source file>:<unknown line>
  499. 47.34 s gammaloop-nextest-core> 15: start_thread<unknown>
  500. 47.34 s gammaloop-nextest-core> at <unknown source file>:<unknown line>
  501. 47.34 s gammaloop-nextest-core> 16: __clone3<unknown>
  502. 47.34 s gammaloop-nextest-core> at <unknown source file>:<unknown line>
  503. 47.34 s gammaloop-nextest-core>
  504. 47.34 s gammaloop-nextest-core> Run with COLORBT_SHOW_HIDDEN=1 environment variable to disable frame filtering.
  505. 47.34 s gammaloop-nextest-core> Run with RUST_BACKTRACE=full to include source snippets.
  506. 47.34 s gammaloop-nextest-core>
  507. 47.34 s gammaloop-nextest-core> 3. gammalooprs::uv::hedge_poset::tests::spectacles_typed_4d_projects_after_local_construction
  508. 47.34 s gammaloop-nextest-core> failure: test failure with exit code 101
  509. 47.34 s gammaloop-nextest-core> Error:
  510. 47.34 s gammaloop-nextest-core> 0: failed to extract three-dimensional representation graph input: source edge 1 has no unique routing for rewritten exact signature [-1, 0, 0] modulo the factorized opposite-domain loop span
  511. 47.34 s gammaloop-nextest-core>
  512. 47.34 s gammaloop-nextest-core> Location:
  513. 47.34 s gammaloop-nextest-core> crates/gammalooprs/src/uv/approx/local_3d.rs:845
  514. 47.34 s gammaloop-nextest-core>
  515. 47.34 s gammaloop-nextest-core> ━━━━━━━━━━━━━━━━━━━━━━━━━━━━━━━━━━ BACKTRACE ━━━━━━━━━━━━━━━━━━━━━━━━━━━━━━━━━━━
  516. 47.34 s gammaloop-nextest-core> 1: <color_eyre[51793ea62743adbd]::config::EyreHook>::into_eyre_hook::{closure#0}<unknown>
  517. 47.34 s gammaloop-nextest-core> at <unknown source file>:<unknown line>
  518. 47.34 s gammaloop-nextest-core> 2: eyre[cb2fd339c0c40fca]::capture_handler<unknown>
  519. 47.34 s gammaloop-nextest-core> at <unknown source file>:<unknown line>
  520. 47.34 s gammaloop-nextest-core> 3: <eyre[cb2fd339c0c40fca]::Report>::from_std::<three_dimensional_reps[3cb572ff22d197ac]::graph_io::GraphIoError><unknown>
  521. 47.34 s gammaloop-nextest-core> at <unknown source file>:<unknown line>
  522. 47.34 s gammaloop-nextest-core> 4: <gammalooprs[972dff90865981f6]::uv::approx::local_3d::Localizer>::project_4d<unknown>
  523. 47.34 s gammaloop-nextest-core> at <unknown source file>:<unknown line>
  524. 47.34 s gammaloop-nextest-core> 5: gammalooprs[972dff90865981f6]::uv::hedge_poset::tests::spectacles_typed_4d_projects_after_local_construction<unknown>
  525. 47.34 s gammaloop-nextest-core> at <unknown source file>:<unknown line>
  526. 47.34 s gammaloop-nextest-core> 6: <gammalooprs[972dff90865981f6]::uv::hedge_poset::tests::spectacles_typed_4d_projects_after_local_construction::{closure#0} as core[940e698046960fd5]::ops::function::FnOnce<()>>::call_once<unknown>
  527. 47.34 s gammaloop-nextest-core> at <unknown source file>:<unknown line>
  528. 47.34 s gammaloop-nextest-core> 7: test[75d6903177b1d7e9]::__rust_begin_short_backtrace::<core[940e698046960fd5]::result::Result<(), alloc[2ea6bcb46fca0c42]::string::String>, fn() -> core[940e698046960fd5]::result::Result<(), alloc[2ea6bcb46fca0c42]::string::String>><unknown>
  529. 47.34 s gammaloop-nextest-core> at <unknown source file>:<unknown line>
  530. 47.34 s gammaloop-nextest-core> 8: test[75d6903177b1d7e9]::run_test::{closure#0}<unknown>
  531. 47.34 s gammaloop-nextest-core> at <unknown source file>:<unknown line>
  532. 47.34 s gammaloop-nextest-core> 9: std[bcb96dfbba0ab899]::sys::backtrace::__rust_begin_short_backtrace::<test[75d6903177b1d7e9]::run_test::{closure#1}, ()><unknown>
  533. 47.34 s gammaloop-nextest-core> at <unknown source file>:<unknown line>
  534. 47.34 s gammaloop-nextest-core> 10: <std[bcb96dfbba0ab899]::thread::lifecycle::spawn_unchecked<test[75d6903177b1d7e9]::run_test::{closure#1}, ()>::{closure#1} as core[940e698046960fd5]::ops::function::FnOnce<()>>::call_once::{shim:vtable#0}<unknown>
  535. 47.34 s gammaloop-nextest-core> at <unknown source file>:<unknown line>
  536. 47.34 s gammaloop-nextest-core> 11: <std[bcb96dfbba0ab899]::sys::thread::unix::Thread>::new::thread_start<unknown>
  537. 47.34 s gammaloop-nextest-core> at <unknown source file>:<unknown line>
  538. 47.34 s gammaloop-nextest-core> 12: start_thread<unknown>
  539. 47.34 s gammaloop-nextest-core> at <unknown source file>:<unknown line>
  540. 47.34 s gammaloop-nextest-core> 13: __clone3<unknown>
  541. 47.34 s gammaloop-nextest-core> at <unknown source file>:<unknown line>
  542. 47.34 s gammaloop-nextest-core>
  543. 47.34 s gammaloop-nextest-core> Run with COLORBT_SHOW_HIDDEN=1 environment variable to disable frame filtering.
  544. 47.34 s gammaloop-nextest-core> Run with RUST_BACKTRACE=full to include source snippets.
  545. 47.34 s gammaloop-nextest-core> system-out
  546. 47.34 s gammaloop-nextest-core> running 1 test
  547. 47.34 s gammaloop-nextest-core> digraph {
  548. 47.34 s gammaloop-nextest-core> node [shape=circle,height=0.1,label=""];
  549. 47.34 s gammaloop-nextest-core> overlap = "scale";
  550. 47.34 s gammaloop-nextest-core> layout = "neato";
  551. 47.34 s gammaloop-nextest-core> start=2;
  552. 47.34 s gammaloop-nextest-core> 4 [label="0"];
  553. 47.34 s gammaloop-nextest-core> 1 [label="zw"];
  554. 47.34 s gammaloop-nextest-core> 2 [label="F"];
  555. 47.34 s gammaloop-nextest-core> 0 [label="143"];
  556. 47.34 s gammaloop-nextest-core> 3 [label="10B"];
  557. 47.34 s gammaloop-nextest-core> 4:0:s-> 1:1:s [id=0 color="red:blue;0.5" label="zw"];
  558. 47.34 s gammaloop-nextest-core> 4:2:s-> 2:3:s [id=1 color="red:blue;0.5" label="F"];
  559. 47.34 s gammaloop-nextest-core> 3:5:s-> 0:4:s [id=2 color="red:blue;0.5" label="143"];
  560. 47.34 s gammaloop-nextest-core> 4:6:s-> 0:7:s [id=3 color="red:blue;0.5" label="143"];
  561. 47.34 s gammaloop-nextest-core> 1:8:s-> 3:9:s [id=4 color="red:blue;0.5" label="F"];
  562. 47.34 s gammaloop-nextest-core> 1:10:s-> 0:11:s [id=5 color="red:blue;0.5" label="143"];
  563. 47.34 s gammaloop-nextest-core> 2:12:s-> 3:13:s [id=6 color="red:blue;0.5" label="zw"];
  564. 47.34 s gammaloop-nextest-core> 2:14:s-> 0:15:s [id=7 color="red:blue;0.5" label="143"];
  565. 47.34 s gammaloop-nextest-core> }
  566. 47.34 s gammaloop-nextest-core>
  567. 47.34 s gammaloop-nextest-core> digraph {
  568. 47.34 s gammaloop-nextest-core> node [shape=circle,height=0.1,label=""];
  569. 47.34 s gammaloop-nextest-core> overlap = "scale";
  570. 47.34 s gammaloop-nextest-core> layout = "neato";
  571. 47.34 s gammaloop-nextest-core> start=2;
  572. 47.34 s gammaloop-nextest-core> 0 [label="∅"];
  573. 47.34 s gammaloop-nextest-core> 1 [label="{zw}: Approx(S_zw(0))"];
  574. 47.34 s gammaloop-nextest-core> 2 [label="{F}: Approx(S_F(1))"];
  575. 47.34 s gammaloop-nextest-core> 3 [label="{143}: Approx(S_143(3))"];
  576. 47.34 s gammaloop-nextest-core> 4 [label="{zw,F}: Approx(S_F(4))*Approx(S_zw(0))"];
  577. 47.34 s gammaloop-nextest-core> 5 [label="{zw} · {143}: Approx((-1*S_zw+S_143(5))*Approx(S_zw(0)))"];
  578. 47.34 s gammaloop-nextest-core> 6 [label="{F} · {143}: Approx((-1*S_F+S_143(7))*Approx(S_F(1)))"];
  579. 47.34 s gammaloop-nextest-core> 7 [label="{zw,F} · {143}: Approx((-1*S_10B+S_143(2))*Approx(S_F(4))*Approx(S_zw(0)))"];
  580. 47.34 s gammaloop-nextest-core> 0:0:s-> 1:1:s [id=0 color="red:blue;0.5"];
  581. 47.34 s gammaloop-nextest-core> 0:2:s-> 2:3:s [id=1 color="red:blue;0.5"];
  582. 47.34 s gammaloop-nextest-core> 0:4:s-> 3:5:s [id=2 color="red:blue;0.5"];
  583. 47.34 s gammaloop-nextest-core> 1:6:s-> 4:7:s [id=3 color="red:blue;0.5"];
  584. 47.34 s gammaloop-nextest-core> 1:8:s-> 5:9:s [id=4 color="red:blue;0.5"];
  585. 47.34 s gammaloop-nextest-core> 2:10:s-> 4:11:s [id=5 color="red:blue;0.5"];
  586. 47.34 s gammaloop-nextest-core> 2:12:s-> 6:13:s [id=6 color="red:blue;0.5"];
  587. 47.34 s gammaloop-nextest-core> 4:14:s-> 7:15:s [id=7 color="red:blue;0.5"];
  588. 47.34 s gammaloop-nextest-core> }
  589. 47.34 s gammaloop-nextest-core>
  590. 47.34 s gammaloop-nextest-core> test uv::hedge_poset::tests::spectacles_typed_4d_projects_after_local_construction ... FAILED
  591. 47.34 s gammaloop-nextest-core>
  592. 47.34 s gammaloop-nextest-core> failures:
  593. 47.34 s gammaloop-nextest-core>
  594. 47.34 s gammaloop-nextest-core> failures:
  595. 47.34 s gammaloop-nextest-core> uv::hedge_poset::tests::spectacles_typed_4d_projects_after_local_construction
  596. 47.34 s gammaloop-nextest-core>
  597. 47.34 s gammaloop-nextest-core> test result: FAILED. 0 passed; 1 failed; 0 ignored; 0 measured; 611 filtered out; finished in 0.39s
  598. 47.34 s gammaloop-nextest-core> system-err
  599. 47.34 s gammaloop-nextest-core> Error:
  600. 47.34 s gammaloop-nextest-core> 0: failed to extract three-dimensional representation graph input: source edge 1 has no unique routing for rewritten exact signature [-1, 0, 0] modulo the factorized opposite-domain loop span
  601. 47.34 s gammaloop-nextest-core>
  602. 47.34 s gammaloop-nextest-core> Location:
  603. 47.34 s gammaloop-nextest-core> crates/gammalooprs/src/uv/approx/local_3d.rs:845
  604. 47.34 s gammaloop-nextest-core>
  605. 47.34 s gammaloop-nextest-core> ━━━━━━━━━━━━━━━━━━━━━━━━━━━━━━━━━━ BACKTRACE ━━━━━━━━━━━━━━━━━━━━━━━━━━━━━━━━━━━
  606. 47.34 s gammaloop-nextest-core> 1: <color_eyre[51793ea62743adbd]::config::EyreHook>::into_eyre_hook::{closure#0}<unknown>
  607. 47.34 s gammaloop-nextest-core> at <unknown source file>:<unknown line>
  608. 47.34 s gammaloop-nextest-core> 2: eyre[cb2fd339c0c40fca]::capture_handler<unknown>
  609. 47.34 s gammaloop-nextest-core> at <unknown source file>:<unknown line>
  610. 47.34 s gammaloop-nextest-core> 3: <eyre[cb2fd339c0c40fca]::Report>::from_std::<three_dimensional_reps[3cb572ff22d197ac]::graph_io::GraphIoError><unknown>
  611. 47.34 s gammaloop-nextest-core> at <unknown source file>:<unknown line>
  612. 47.34 s gammaloop-nextest-core> 4: <gammalooprs[972dff90865981f6]::uv::approx::local_3d::Localizer>::project_4d<unknown>
  613. 47.34 s gammaloop-nextest-core> at <unknown source file>:<unknown line>
  614. 47.34 s gammaloop-nextest-core> 5: gammalooprs[972dff90865981f6]::uv::hedge_poset::tests::spectacles_typed_4d_projects_after_local_construction<unknown>
  615. 47.34 s gammaloop-nextest-core> at <unknown source file>:<unknown line>
  616. 47.34 s gammaloop-nextest-core> 6: <gammalooprs[972dff90865981f6]::uv::hedge_poset::tests::spectacles_typed_4d_projects_after_local_construction::{closure#0} as core[940e698046960fd5]::ops::function::FnOnce<()>>::call_once<unknown>
  617. 47.34 s gammaloop-nextest-core> at <unknown source file>:<unknown line>
  618. 47.34 s gammaloop-nextest-core> 7: test[75d6903177b1d7e9]::__rust_begin_short_backtrace::<core[940e698046960fd5]::result::Result<(), alloc[2ea6bcb46fca0c42]::string::String>, fn() -> core[940e698046960fd5]::result::Result<(), alloc[2ea6bcb46fca0c42]::string::String>><unknown>
  619. 47.34 s gammaloop-nextest-core> at <unknown source file>:<unknown line>
  620. 47.34 s gammaloop-nextest-core> 8: test[75d6903177b1d7e9]::run_test::{closure#0}<unknown>
  621. 47.34 s gammaloop-nextest-core> at <unknown source file>:<unknown line>
  622. 47.34 s gammaloop-nextest-core> 9: std[bcb96dfbba0ab899]::sys::backtrace::__rust_begin_short_backtrace::<test[75d6903177b1d7e9]::run_test::{closure#1}, ()><unknown>
  623. 47.34 s gammaloop-nextest-core> at <unknown source file>:<unknown line>
  624. 47.34 s gammaloop-nextest-core> 10: <std[bcb96dfbba0ab899]::thread::lifecycle::spawn_unchecked<test[75d6903177b1d7e9]::run_test::{closure#1}, ()>::{closure#1} as core[940e698046960fd5]::ops::function::FnOnce<()>>::call_once::{shim:vtable#0}<unknown>
  625. 47.34 s gammaloop-nextest-core> at <unknown source file>:<unknown line>
  626. 47.34 s gammaloop-nextest-core> 11: <std[bcb96dfbba0ab899]::sys::thread::unix::Thread>::new::thread_start<unknown>
  627. 47.34 s gammaloop-nextest-core> at <unknown source file>:<unknown line>
  628. 47.34 s gammaloop-nextest-core> 12: start_thread<unknown>
  629. 47.34 s gammaloop-nextest-core> at <unknown source file>:<unknown line>
  630. 47.34 s gammaloop-nextest-core> 13: __clone3<unknown>
  631. 47.34 s gammaloop-nextest-core> at <unknown source file>:<unknown line>
  632. 47.34 s gammaloop-nextest-core>
  633. 47.34 s gammaloop-nextest-core> Run with COLORBT_SHOW_HIDDEN=1 environment variable to disable frame filtering.
  634. 47.34 s gammaloop-nextest-core> Run with RUST_BACKTRACE=full to include source snippets.
  635. 47.34 s gammaloop-nextest-core>
  636. 47.34 s gammaloop-nextest-core> 4. gammalooprs::uv::tests::scalars_profile
  637. 47.34 s gammaloop-nextest-core> failure: test failure with exit code 101
  638. 47.34 s gammaloop-nextest-core> system-out
  639. 47.34 s gammaloop-nextest-core> running 1 test
  640. 47.34 s gammaloop-nextest-core> test uv::tests::scalars_profile ... FAILED
  641. 47.34 s gammaloop-nextest-core>
  642. 47.34 s gammaloop-nextest-core> failures:
  643. 47.34 s gammaloop-nextest-core>
  644. 47.34 s gammaloop-nextest-core> failures:
  645. 47.34 s gammaloop-nextest-core> uv::tests::scalars_profile
  646. 47.34 s gammaloop-nextest-core>
  647. 47.34 s gammaloop-nextest-core> test result: FAILED. 0 passed; 1 failed; 0 ignored; 0 measured; 611 filtered out; finished in 9.96s
  648. 47.34 s gammaloop-nextest-core> system-err
  649. 47.34 s gammaloop-nextest-core> [18:17:53.343] @gammalooprs::settings::runtime WARNING : No external kinematics were provided; using default-generated external momenta and helicities.
  650. 47.34 s gammaloop-nextest-core> field value
  651. 47.34 s gammaloop-nextest-core> span build_integrand{amplitude.name=bub}
  652. 47.34 s gammaloop-nextest-core> at crates/gammalooprs/src/settings/runtime.rs:131
  653. 47.34 s gammaloop-nextest-core> [18:17:53.344] @gammalooprs::integrands::process::amplitude INFO : Input is below threshold: 0 existing threshold E-surfaces across 0/3 graph groups
  654. 47.34 s gammaloop-nextest-core> field value
  655. 47.34 s gammaloop-nextest-core> existing_esurfaces 0
  656. 47.34 s gammaloop-nextest-core> group_count 3
  657. 47.34 s gammaloop-nextest-core> groups_above_threshold 0
  658. 47.34 s gammaloop-nextest-core> integrand bub
  659. 47.34 s gammaloop-nextest-core> span warm_up{integrand.name=bub}
  660. 47.34 s gammaloop-nextest-core> threshold_status below threshold
  661. 47.34 s gammaloop-nextest-core> at crates/gammalooprs/src/integrands/process/amplitude/mod.rs:1666
  662. 47.34 s gammaloop-nextest-core> [18:17:53.345] @gammalooprs::integrands::process::amplitude INFO : overlap structure of group 0: [0: []]
  663. 47.34 s gammaloop-nextest-core> field value
  664. 47.34 s gammaloop-nextest-core> span warm_up{integrand.name=bub}
  665. 47.34 s gammaloop-nextest-core> at crates/gammalooprs/src/integrands/process/amplitude/mod.rs:2015
  666. 47.34 s gammaloop-nextest-core> [18:17:53.345] @gammalooprs::integrands::process::amplitude INFO : overlap structure of group 1: [0: []]
  667. 47.34 s gammaloop-nextest-core> field value
  668. 47.34 s gammaloop-nextest-core> span warm_up{integrand.name=bub}
  669. 47.34 s gammaloop-nextest-core> at crates/gammalooprs/src/integrands/process/amplitude/mod.rs:2015
  670. 47.34 s gammaloop-nextest-core> [18:17:53.345] @gammalooprs::integrands::process::amplitude INFO : overlap structure of group 2: [0: []]
  671. 47.34 s gammaloop-nextest-core> field value
  672. 47.34 s gammaloop-nextest-core> span warm_up{integrand.name=bub}
  673. 47.34 s gammaloop-nextest-core> at crates/gammalooprs/src/integrands/process/amplitude/mod.rs:2015
  674. 47.34 s gammaloop-nextest-core> The application panicked (crashed).
  675. 47.34 s gammaloop-nextest-core> Message: assertion `left == right` failed: subtracted scalar UV profile failed:
  676. 47.34 s gammaloop-nextest-core> UVProfilePassFail {
  677. 47.34 s gammaloop-nextest-core> max_dod: -0.9,
  678. 47.34 s gammaloop-nextest-core> total: 16,
  679. 47.34 s gammaloop-nextest-core> failed: 1,
  680. 47.34 s gammaloop-nextest-core> failures: [
  681. 47.34 s gammaloop-nextest-core> UVProfileFailure {
  682. 47.34 s gammaloop-nextest-core> graph_index: 0,
  683. 47.34 s gammaloop-nextest-core> graph_name: "banana",
  684. 47.34 s gammaloop-nextest-core> cutkosky_cut: None,
  685. 47.34 s gammaloop-nextest-core> lmb_index: 1,
  686. 47.34 s gammaloop-nextest-core> fixed: [
  687. 47.34 s gammaloop-nextest-core> EdgeIndex(
  688. 47.34 s gammaloop-nextest-core> 2,
  689. 47.34 s gammaloop-nextest-core> ),
  690. 47.34 s gammaloop-nextest-core> EdgeIndex(
  691. 47.34 s gammaloop-nextest-core> 0,
  692. 47.34 s gammaloop-nextest-core> ),
  693. 47.34 s gammaloop-nextest-core> ],
  694. 47.34 s gammaloop-nextest-core> free: [
  695. 47.34 s gammaloop-nextest-core> EdgeIndex(
  696. 47.34 s gammaloop-nextest-core> 3,
  697. 47.34 s gammaloop-nextest-core> ),
  698. 47.34 s gammaloop-nextest-core> ],
  699. 47.34 s gammaloop-nextest-core> orientation_label: None,
  700. 47.34 s gammaloop-nextest-core> reason: "dod_exceeds_threshold",
  701. 47.34 s gammaloop-nextest-core> },
  702. 47.34 s gammaloop-nextest-core> ],
  703. 47.34 s gammaloop-nextest-core> }
  704. 47.34 s gammaloop-nextest-core>
  705. 47.34 s gammaloop-nextest-core> ╭─────────┬────────────┬───────────┬───────┬─────┬──────────┬───────────╮
  706. 47.34 s gammaloop-nextest-core> │ fixed │ → ∞ │ slope │ r2 │ DOD │ bare DOD │ inspect │
  707. 47.34 s gammaloop-nextest-core> ├─────────┼────────────┼───────────┼───────┼─────┼──────────┼───────────┤
  708. 47.34 s gammaloop-nextest-core> │ {e1,e2} │ {e3} │ -0.996752 │ 1.000 │ -1 │ 0 │ arb retry │
  709. 47.34 s gammaloop-nextest-core> │ {e1,e3} │ {e2} │ -1.065665 │ 0.997 │ -1 │ 0 │ arb retry │
  710. 47.34 s gammaloop-nextest-core> │ {e1} │ {e2,e3} │ -0.937151 │ 0.943 │ -1 │ 2 │ │
  711. 47.34 s gammaloop-nextest-core> │ {e2,e3} │ {e1} │ -1.001075 │ 1.000 │ -1 │ 0 │ arb retry │
  712. 47.34 s gammaloop-nextest-core> │ {e2} │ {e1,e3} │ -0.984146 │ 0.998 │ -1 │ 2 │ │
  713. 47.34 s gammaloop-nextest-core> │ {e3} │ {e1,e2} │ -1.383911 │ 0.982 │ -1 │ 2 │ arb retry │
  714. 47.34 s gammaloop-nextest-core> │ {} │ {e1,e2,e3} │ -1.094213 │ 0.258 │ -1 │ 4 │ │
  715. 47.34 s gammaloop-nextest-core> │ {e2,e0} │ {e3} │ -0.803348 │ 0.861 │ -1 │ 0 │ arb retry │
  716. 47.34 s gammaloop-nextest-core> │ {e3,e0} │ {e2} │ -0.999257 │ 1.000 │ -1 │ 0 │ │
  717. 47.34 s gammaloop-nextest-core> │ {e0} │ {e2,e3} │ -1.000893 │ 1.000 │ -1 │ 2 │ │
  718. 47.34 s gammaloop-nextest-core> │ {e1,e0} │ {e3} │ -0.997860 │ 1.000 │ -1 │ 0 │ │
  719. 47.34 s gammaloop-nextest-core> ╰─────────┴────────────┴───────────┴───────┴─────┴──────────┴───────────╯
  720. 47.34 s gammaloop-nextest-core>
  721. 47.34 s gammaloop-nextest-core> ╭───────┬─────────┬───────────┬───────┬─────┬──────────┬───────────╮
  722. 47.34 s gammaloop-nextest-core> │ fixed │ → ∞ │ slope │ r2 │ DOD │ bare DOD │ inspect │
  723. 47.34 s gammaloop-nextest-core> ├───────┼─────────┼───────────┼───────┼─────┼──────────┼───────────┤
  724. 47.34 s gammaloop-nextest-core> │ {e1} │ {e2} │ -1.005039 │ 1.000 │ -1 │ 0 │ arb retry │
  725. 47.34 s gammaloop-nextest-core> │ {e2} │ {e1} │ -1.001098 │ 1.000 │ -1 │ 0 │ arb retry │
  726. 47.34 s gammaloop-nextest-core> │ {} │ {e1,e2} │ -1.011289 │ 1.000 │ -1 │ 2 │ │
  727. 47.34 s gammaloop-nextest-core> │ {e0} │ {e2} │ -0.998140 │ 1.000 │ -1 │ 0 │ │
  728. 47.34 s gammaloop-nextest-core> ╰───────┴─────────┴───────────┴───────┴─────┴──────────┴───────────╯
  729. 47.34 s gammaloop-nextest-core>
  730. 47.34 s gammaloop-nextest-core> ╭───────┬──────┬───────────┬───────┬─────┬──────────┬─────────╮
  731. 47.34 s gammaloop-nextest-core> │ fixed │ → ∞ │ slope │ r2 │ DOD │ bare DOD │ inspect │
  732. 47.34 s gammaloop-nextest-core> ├───────┼──────┼───────────┼───────┼─────┼──────────┼─────────┤
  733. 47.34 s gammaloop-nextest-core> │ {} │ {e1} │ -0.989949 │ 1.000 │ -1 │ 0 │ │
  734. 47.34 s gammaloop-nextest-core> ╰───────┴──────┴───────────┴───────┴─────┴──────────┴─────────╯
  735. 47.34 s gammaloop-nextest-core> left: 1
  736. 47.34 s gammaloop-nextest-core> right: 0
  737. 47.34 s gammaloop-nextest-core> Location: crates/gammalooprs/src/uv/tests.rs:259
  738. 47.34 s gammaloop-nextest-core>
  739. 47.34 s gammaloop-nextest-core> ━━━━━━━━━━━━━━━━━━━━━━━━━━━━━━━━━━ BACKTRACE ━━━━━━━━━━━━━━━━━━━━━━━━━━━━━━━━━━━
  740. 47.34 s gammaloop-nextest-core> 1: <color_eyre[51793ea62743adbd]::config::PanicHook>::panic_report<unknown>
  741. 47.34 s gammaloop-nextest-core> at <unknown source file>:<unknown line>
  742. 47.34 s gammaloop-nextest-core> 2: <color_eyre[51793ea62743adbd]::config::PanicHook>::into_panic_hook::{closure#0}<unknown>
  743. 47.34 s gammaloop-nextest-core> at <unknown source file>:<unknown line>
  744. 47.34 s gammaloop-nextest-core> 3: std[bcb96dfbba0ab899]::panicking::panic_with_hook<unknown>
  745. 47.34 s gammaloop-nextest-core> at <unknown source file>:<unknown line>
  746. 47.34 s gammaloop-nextest-core> 4: std[bcb96dfbba0ab899]::panicking::panic_handler::{closure#0}<unknown>
  747. 47.34 s gammaloop-nextest-core> at <unknown source file>:<unknown line>
  748. 47.34 s gammaloop-nextest-core> 5: std[bcb96dfbba0ab899]::sys::backtrace::__rust_end_short_backtrace::<std[bcb96dfbba0ab899]::panicking::panic_handler::{closure#0}, !><unknown>
  749. 47.34 s gammaloop-nextest-core> at <unknown source file>:<unknown line>
  750. 47.34 s gammaloop-nextest-core> 6: __rustc[6c289b9f9c454d21]::rust_begin_unwind<unknown>
  751. 47.34 s gammaloop-nextest-core> at <unknown source file>:<unknown line>
  752. 47.34 s gammaloop-nextest-core> 7: core[940e698046960fd5]::panicking::panic_fmt<unknown>
  753. 47.34 s gammaloop-nextest-core> at <unknown source file>:<unknown line>
  754. 47.34 s gammaloop-nextest-core> 8: core[940e698046960fd5]::panicking::assert_failed_inner<unknown>
  755. 47.34 s gammaloop-nextest-core> at <unknown source file>:<unknown line>
  756. 47.34 s gammaloop-nextest-core> 9: core[940e698046960fd5]::panicking::assert_failed::<usize, usize><unknown>
  757. 47.34 s gammaloop-nextest-core> at <unknown source file>:<unknown line>
  758. 47.34 s gammaloop-nextest-core> 10: gammalooprs[972dff90865981f6]::uv::tests::scalars_profile<unknown>
  759. 47.34 s gammaloop-nextest-core> at <unknown source file>:<unknown line>
  760. 47.34 s gammaloop-nextest-core> 11: <gammalooprs[972dff90865981f6]::uv::tests::scalars_profile::{closure#0} as core[940e698046960fd5]::ops::function::FnOnce<()>>::call_once<unknown>
  761. 47.34 s gammaloop-nextest-core> at <unknown source file>:<unknown line>
  762. 47.34 s gammaloop-nextest-core> 12: test[75d6903177b1d7e9]::__rust_begin_short_backtrace::<core[940e698046960fd5]::result::Result<(), alloc[2ea6bcb46fca0c42]::string::String>, fn() -> core[940e698046960fd5]::result::Result<(), alloc[2ea6bcb46fca0c42]::string::String>><unknown>
  763. 47.34 s gammaloop-nextest-core> at <unknown source file>:<unknown line>
  764. 47.34 s gammaloop-nextest-core> 13: test[75d6903177b1d7e9]::run_test::{closure#0}<unknown>
  765. 47.34 s gammaloop-nextest-core> at <unknown source file>:<unknown line>
  766. 47.34 s gammaloop-nextest-core> 14: std[bcb96dfbba0ab899]::sys::backtrace::__rust_begin_short_backtrace::<test[75d6903177b1d7e9]::run_test::{closure#1}, ()><unknown>
  767. 47.34 s gammaloop-nextest-core> at <unknown source file>:<unknown line>
  768. 47.34 s gammaloop-nextest-core> ... omitted 11 more lines; see full nextest output above
  769. 47.34 s gammaloop-nextest-core>
  770. 47.34 s gammaloop-nextest-core> 5. gammalooprs::uv::tests::scalars_profile_new
  771. 47.34 s gammaloop-nextest-core> failure: test failure with exit code 101
  772. 47.34 s gammaloop-nextest-core> system-out
  773. 47.34 s gammaloop-nextest-core> running 1 test
  774. 47.34 s gammaloop-nextest-core> test uv::tests::scalars_profile_new ... FAILED
  775. 47.34 s gammaloop-nextest-core>
  776. 47.34 s gammaloop-nextest-core> failures:
  777. 47.34 s gammaloop-nextest-core>
  778. 47.34 s gammaloop-nextest-core> failures:
  779. 47.34 s gammaloop-nextest-core> uv::tests::scalars_profile_new
  780. 47.34 s gammaloop-nextest-core>
  781. 47.34 s gammaloop-nextest-core> test result: FAILED. 0 passed; 1 failed; 0 ignored; 0 measured; 611 filtered out; finished in 11.13s
  782. 47.34 s gammaloop-nextest-core> system-err
  783. 47.34 s gammaloop-nextest-core> [18:17:54.561] @gammalooprs::settings::runtime WARNING : No external kinematics were provided; using default-generated external momenta and helicities.
  784. 47.34 s gammaloop-nextest-core> field value
  785. 47.34 s gammaloop-nextest-core> span build_integrand{amplitude.name=bub}
  786. 47.34 s gammaloop-nextest-core> at crates/gammalooprs/src/settings/runtime.rs:131
  787. 47.34 s gammaloop-nextest-core> [18:17:54.562] @gammalooprs::integrands::process::amplitude INFO : Input is below threshold: 0 existing threshold E-surfaces across 0/3 graph groups
  788. 47.34 s gammaloop-nextest-core> field value
  789. 47.34 s gammaloop-nextest-core> existing_esurfaces 0
  790. 47.34 s gammaloop-nextest-core> group_count 3
  791. 47.34 s gammaloop-nextest-core> groups_above_threshold 0
  792. 47.34 s gammaloop-nextest-core> integrand bub
  793. 47.34 s gammaloop-nextest-core> span warm_up{integrand.name=bub}
  794. 47.34 s gammaloop-nextest-core> threshold_status below threshold
  795. 47.34 s gammaloop-nextest-core> at crates/gammalooprs/src/integrands/process/amplitude/mod.rs:1666
  796. 47.34 s gammaloop-nextest-core> [18:17:54.562] @gammalooprs::integrands::process::amplitude INFO : overlap structure of group 0: [0: []]
  797. 47.34 s gammaloop-nextest-core> field value
  798. 47.34 s gammaloop-nextest-core> span warm_up{integrand.name=bub}
  799. 47.34 s gammaloop-nextest-core> at crates/gammalooprs/src/integrands/process/amplitude/mod.rs:2015
  800. 47.34 s gammaloop-nextest-core> [18:17:54.562] @gammalooprs::integrands::process::amplitude INFO : overlap structure of group 1: [0: []]
  801. 47.34 s gammaloop-nextest-core> field value
  802. 47.34 s gammaloop-nextest-core> span warm_up{integrand.name=bub}
  803. 47.34 s gammaloop-nextest-core> at crates/gammalooprs/src/integrands/process/amplitude/mod.rs:2015
  804. 47.34 s gammaloop-nextest-core> [18:17:54.562] @gammalooprs::integrands::process::amplitude INFO : overlap structure of group 2: [0: []]
  805. 47.34 s gammaloop-nextest-core> field value
  806. 47.34 s gammaloop-nextest-core> span warm_up{integrand.name=bub}
  807. 47.34 s gammaloop-nextest-core> at crates/gammalooprs/src/integrands/process/amplitude/mod.rs:2015
  808. 47.34 s gammaloop-nextest-core> The application panicked (crashed).
  809. 47.34 s gammaloop-nextest-core> Message: assertion `left == right` failed: subtracted scalar UV profile failed:
  810. 47.34 s gammaloop-nextest-core> UVProfilePassFail {
  811. 47.34 s gammaloop-nextest-core> max_dod: -0.9,
  812. 47.34 s gammaloop-nextest-core> total: 16,
  813. 47.34 s gammaloop-nextest-core> failed: 1,
  814. 47.34 s gammaloop-nextest-core> failures: [
  815. 47.34 s gammaloop-nextest-core> UVProfileFailure {
  816. 47.34 s gammaloop-nextest-core> graph_index: 0,
  817. 47.34 s gammaloop-nextest-core> graph_name: "banana",
  818. 47.34 s gammaloop-nextest-core> cutkosky_cut: None,
  819. 47.34 s gammaloop-nextest-core> lmb_index: 1,
  820. 47.34 s gammaloop-nextest-core> fixed: [
  821. 47.34 s gammaloop-nextest-core> EdgeIndex(
  822. 47.34 s gammaloop-nextest-core> 2,
  823. 47.34 s gammaloop-nextest-core> ),
  824. 47.34 s gammaloop-nextest-core> EdgeIndex(
  825. 47.34 s gammaloop-nextest-core> 0,
  826. 47.34 s gammaloop-nextest-core> ),
  827. 47.34 s gammaloop-nextest-core> ],
  828. 47.34 s gammaloop-nextest-core> free: [
  829. 47.34 s gammaloop-nextest-core> EdgeIndex(
  830. 47.35 s gammaloop-nextest-core> 3,
  831. 47.35 s gammaloop-nextest-core> ),
  832. 47.35 s gammaloop-nextest-core> ],
  833. 47.35 s gammaloop-nextest-core> orientation_label: None,
  834. 47.35 s gammaloop-nextest-core> reason: "dod_exceeds_threshold",
  835. 47.35 s gammaloop-nextest-core> },
  836. 47.35 s gammaloop-nextest-core> ],
  837. 47.35 s gammaloop-nextest-core> }
  838. 47.35 s gammaloop-nextest-core>
  839. 47.35 s gammaloop-nextest-core> ╭─────────┬────────────┬───────────┬───────┬─────┬──────────┬───────────╮
  840. 47.35 s gammaloop-nextest-core> │ fixed │ → ∞ │ slope │ r2 │ DOD │ bare DOD │ inspect │
  841. 47.35 s gammaloop-nextest-core> ├─────────┼────────────┼───────────┼───────┼─────┼──────────┼───────────┤
  842. 47.35 s gammaloop-nextest-core> │ {e1,e2} │ {e3} │ -0.996752 │ 1.000 │ -1 │ 0 │ arb retry │
  843. 47.35 s gammaloop-nextest-core> │ {e1,e3} │ {e2} │ -1.065665 │ 0.997 │ -1 │ 0 │ arb retry │
  844. 47.35 s gammaloop-nextest-core> │ {e1} │ {e2,e3} │ -0.937151 │ 0.943 │ -1 │ 2 │ │
  845. 47.35 s gammaloop-nextest-core> │ {e2,e3} │ {e1} │ -1.001075 │ 1.000 │ -1 │ 0 │ arb retry │
  846. 47.35 s gammaloop-nextest-core> │ {e2} │ {e1,e3} │ -0.984146 │ 0.998 │ -1 │ 2 │ │
  847. 47.35 s gammaloop-nextest-core> │ {e3} │ {e1,e2} │ -1.383911 │ 0.982 │ -1 │ 2 │ arb retry │
  848. 47.35 s gammaloop-nextest-core> │ {} │ {e1,e2,e3} │ -1.094213 │ 0.258 │ -1 │ 4 │ │
  849. 47.35 s gammaloop-nextest-core> │ {e2,e0} │ {e3} │ -0.803348 │ 0.861 │ -1 │ 0 │ arb retry │
  850. 47.35 s gammaloop-nextest-core> │ {e3,e0} │ {e2} │ -0.999257 │ 1.000 │ -1 │ 0 │ │
  851. 47.35 s gammaloop-nextest-core> │ {e0} │ {e2,e3} │ -1.000893 │ 1.000 │ -1 │ 2 │ │
  852. 47.35 s gammaloop-nextest-core> │ {e1,e0} │ {e3} │ -0.997860 │ 1.000 │ -1 │ 0 │ │
  853. 47.35 s gammaloop-nextest-core> ╰─────────┴────────────┴───────────┴───────┴─────┴──────────┴───────────╯
  854. 47.35 s gammaloop-nextest-core>
  855. 47.35 s gammaloop-nextest-core> ╭───────┬─────────┬───────────┬───────┬─────┬──────────┬───────────╮
  856. 47.35 s gammaloop-nextest-core> │ fixed │ → ∞ │ slope │ r2 │ DOD │ bare DOD │ inspect │
  857. 47.35 s gammaloop-nextest-core> ├───────┼─────────┼───────────┼───────┼─────┼──────────┼───────────┤
  858. 47.35 s gammaloop-nextest-core> │ {e1} │ {e2} │ -1.005039 │ 1.000 │ -1 │ 0 │ arb retry │
  859. 47.35 s gammaloop-nextest-core> │ {e2} │ {e1} │ -1.001098 │ 1.000 │ -1 │ 0 │ arb retry │
  860. 47.35 s gammaloop-nextest-core> │ {} │ {e1,e2} │ -1.011289 │ 1.000 │ -1 │ 2 │ │
  861. 47.35 s gammaloop-nextest-core> │ {e0} │ {e2} │ -0.998140 │ 1.000 │ -1 │ 0 │ │
  862. 47.35 s gammaloop-nextest-core> ╰───────┴─────────┴───────────┴───────┴─────┴──────────┴───────────╯
  863. 47.35 s gammaloop-nextest-core>
  864. 47.35 s gammaloop-nextest-core> ╭───────┬──────┬───────────┬───────┬─────┬──────────┬─────────╮
  865. 47.35 s gammaloop-nextest-core> │ fixed │ → ∞ │ slope │ r2 │ DOD │ bare DOD │ inspect │
  866. 47.35 s gammaloop-nextest-core> ├───────┼──────┼───────────┼───────┼─────┼──────────┼─────────┤
  867. 47.35 s gammaloop-nextest-core> │ {} │ {e1} │ -0.989949 │ 1.000 │ -1 │ 0 │ │
  868. 47.35 s gammaloop-nextest-core> ╰───────┴──────┴───────────┴───────┴─────┴──────────┴─────────╯
  869. 47.35 s gammaloop-nextest-core> left: 1
  870. 47.35 s gammaloop-nextest-core> right: 0
  871. 47.35 s gammaloop-nextest-core> Location: crates/gammalooprs/src/uv/tests.rs:325
  872. 47.35 s gammaloop-nextest-core>
  873. 47.35 s gammaloop-nextest-core> ━━━━━━━━━━━━━━━━━━━━━━━━━━━━━━━━━━ BACKTRACE ━━━━━━━━━━━━━━━━━━━━━━━━━━━━━━━━━━━
  874. 47.35 s gammaloop-nextest-core> 1: <color_eyre[51793ea62743adbd]::config::PanicHook>::panic_report<unknown>
  875. 47.35 s gammaloop-nextest-core> at <unknown source file>:<unknown line>
  876. 47.35 s gammaloop-nextest-core> 2: <color_eyre[51793ea62743adbd]::config::PanicHook>::into_panic_hook::{closure#0}<unknown>
  877. 47.35 s gammaloop-nextest-core> at <unknown source file>:<unknown line>
  878. 47.35 s gammaloop-nextest-core> 3: std[bcb96dfbba0ab899]::panicking::panic_with_hook<unknown>
  879. 47.35 s gammaloop-nextest-core> at <unknown source file>:<unknown line>
  880. 47.35 s gammaloop-nextest-core> 4: std[bcb96dfbba0ab899]::panicking::panic_handler::{closure#0}<unknown>
  881. 47.35 s gammaloop-nextest-core> at <unknown source file>:<unknown line>
  882. 47.35 s gammaloop-nextest-core> 5: std[bcb96dfbba0ab899]::sys::backtrace::__rust_end_short_backtrace::<std[bcb96dfbba0ab899]::panicking::panic_handler::{closure#0}, !><unknown>
  883. 47.35 s gammaloop-nextest-core> at <unknown source file>:<unknown line>
  884. 47.35 s gammaloop-nextest-core> 6: __rustc[6c289b9f9c454d21]::rust_begin_unwind<unknown>
  885. 47.35 s gammaloop-nextest-core> at <unknown source file>:<unknown line>
  886. 47.35 s gammaloop-nextest-core> 7: core[940e698046960fd5]::panicking::panic_fmt<unknown>
  887. 47.35 s gammaloop-nextest-core> at <unknown source file>:<unknown line>
  888. 47.35 s gammaloop-nextest-core> 8: core[940e698046960fd5]::panicking::assert_failed_inner<unknown>
  889. 47.35 s gammaloop-nextest-core> at <unknown source file>:<unknown line>
  890. 47.35 s gammaloop-nextest-core> 9: core[940e698046960fd5]::panicking::assert_failed::<usize, usize><unknown>
  891. 47.35 s gammaloop-nextest-core> at <unknown source file>:<unknown line>
  892. 47.35 s gammaloop-nextest-core> 10: gammalooprs[972dff90865981f6]::uv::tests::scalars_profile_new<unknown>
  893. 47.35 s gammaloop-nextest-core> at <unknown source file>:<unknown line>
  894. 47.35 s gammaloop-nextest-core> 11: <gammalooprs[972dff90865981f6]::uv::tests::scalars_profile_new::{closure#0} as core[940e698046960fd5]::ops::function::FnOnce<()>>::call_once<unknown>
  895. 47.35 s gammaloop-nextest-core> at <unknown source file>:<unknown line>
  896. 47.35 s gammaloop-nextest-core> 12: test[75d6903177b1d7e9]::__rust_begin_short_backtrace::<core[940e698046960fd5]::result::Result<(), alloc[2ea6bcb46fca0c42]::string::String>, fn() -> core[940e698046960fd5]::result::Result<(), alloc[2ea6bcb46fca0c42]::string::String>><unknown>
  897. 47.35 s gammaloop-nextest-core> at <unknown source file>:<unknown line>
  898. 47.35 s gammaloop-nextest-core> 13: test[75d6903177b1d7e9]::run_test::{closure#0}<unknown>
  899. 47.35 s gammaloop-nextest-core> at <unknown source file>:<unknown line>
  900. 47.35 s gammaloop-nextest-core> 14: std[bcb96dfbba0ab899]::sys::backtrace::__rust_begin_short_backtrace::<test[75d6903177b1d7e9]::run_test::{closure#1}, ()><unknown>
  901. 47.35 s gammaloop-nextest-core> at <unknown source file>:<unknown line>
  902. 47.35 s gammaloop-nextest-core> ... omitted 11 more lines; see full nextest output above
  903. 47.35 s gammaloop-nextest-core> =========================================
  904. 47.36 s gammaloop-nextest-core> Extracting 1 binary, 1 build script output directory, and 1 linked path to /build/nextest-archive-K8VOkI
  905. 47.48 s gammaloop-nextest-core> Extracted 7 files to /build/nextest-archive-K8VOkI in 0.12s
  906. 47.49 s gammaloop-nextest-core> ------------
  907. 47.49 s gammaloop-nextest-core> Nextest run ID 57817a1c-c3ad-4dde-a811-f091efd2dc71 with nextest profile: ci_gammaloop
  908. 47.49 s gammaloop-nextest-core> Starting 54 tests across 1 binary
  909. 47.87 s gammaloop-nextest-core> ------------
  910. 47.87 s gammaloop-nextest-core> Summary [ 0.382s] 54 tests run: 54 passed, 0 skipped
  911. 47.93 s gammaloop-nextest-core>
  912. 47.93 s gammaloop-nextest-core> ========== nextest test summary ==========
  913. 47.93 s gammaloop-nextest-core> report: target/nextest/ci_gammaloop/junit.xml
  914. 47.93 s gammaloop-nextest-core> tests: 54, failures: 0, errors: 0
  915. 47.93 s gammaloop-nextest-core> No failing testcases found.
  916. 47.93 s gammaloop-nextest-core> =========================================
  917. 47.98 s [0 built (1 failed), 0.0error: Cannot build '/nix/store/xmqryc6f4382yn38pvqdg8lk2i1rvwkl-gammaloop-nextest-core.drv'.
  918. 47.98 s Reason: builder failed with exit code 100.
  919. 47.98 s Output paths:
  920. 47.98 s /nix/store/qs56ygvnfbmkl3lbwy1lyz1bkaf3fqsx-gammaloop-nextest-core
  921. 47.98 s Last 1576 log lines:
  922. 47.98 s > Extracting 3 binaries (including 1 non-test binary), 1 build script output directory, and 2 linked paths to /build/nextest-archive-qgiWAu
  923. 47.98 s > Extracted 18 files to /build/nextest-archive-qgiWAu in 0.79s
  924. 47.98 s > ------------
  925. 47.98 s > Nextest run ID cc547a30-6dcc-4cc5-895e-914d68567169 with nextest profile: ci_gammaloop
  926. 47.98 s > Starting 375 tests across 2 binaries
  927. 47.98 s > ------------
  928. 47.98 s > Summary [ 0.844s] 375 tests run: 375 passed, 0 skipped
  929. 47.98 s >
  930. 47.98 s > ========== nextest test summary ==========
  931. 47.98 s > report: target/nextest/ci_gammaloop/junit.xml
  932. 47.98 s > tests: 375, failures: 0, errors: 0
  933. 47.98 s > No failing testcases found.
  934. 47.98 s > =========================================
  935. 47.98 s > Extracting 1 binary and 1 linked path to /build/nextest-archive-9APMuQ
  936. 47.98 s > Extracted 7 files to /build/nextest-archive-9APMuQ in 0.12s
  937. 47.98 s > ------------
  938. 47.98 s > Nextest run ID 2dbca648-db25-4192-ab72-552076e11be5 with nextest profile: ci_gammaloop
  939. 47.98 s > Starting 19 tests across 1 binary
  940. 47.98 s > ------------
  941. 47.98 s > Summary [ 0.018s] 19 tests run: 19 passed, 0 skipped
  942. 47.98 s >
  943. 47.98 s > ========== nextest test summary ==========
  944. 47.98 s > report: target/nextest/ci_gammaloop/junit.xml
  945. 47.98 s > tests: 19, failures: 0, errors: 0
  946. 47.98 s > No failing testcases found.
  947. 47.98 s > =========================================
  948. 47.98 s > Extracting 1 binary to /build/nextest-archive-ryyx3A
  949. 47.98 s > Extracted 4 files to /build/nextest-archive-ryyx3A in 0.04s
  950. 47.98 s > ------------
  951. 47.98 s > Nextest run ID d33c0584-2925-402e-8fb0-8bdefdea3c2a with nextest profile: ci_gammaloop
  952. 47.98 s > Starting 0 tests across 1 binary
  953. 47.98 s > ------------
  954. 47.98 s > Summary [ 0.000s] 0 tests run: 0 passed, 0 skipped
  955. 47.98 s >
  956. 47.98 s > ========== nextest test summary ==========
  957. 47.98 s > report: target/nextest/ci_gammaloop/junit.xml
  958. 47.98 s > tests: 0, failures: 0, errors: 0
  959. 47.98 s > No failing testcases found.
  960. 47.98 s > =========================================
  961. 47.98 s > Extracting 4 binaries, 1 build script output directory, and 2 linked paths to /build/nextest-archive-g8xNrQ
  962. 47.98 s > Extracted 18 files to /build/nextest-archive-g8xNrQ in 0.84s
  963. 47.98 s > ------------
  964. 47.98 s > Nextest run ID 0723af18-d531-4755-b18a-ff4aac75be75 with nextest profile: ci_gammaloop
  965. 47.98 s > Starting 561 tests across 4 binaries (59 tests skipped, including 58 tests via profile.ci_gammaloop.default-filter)
  966. 47.98 s > FAIL [ 0.168s] ( 53/561) gammalooprs cff::tests::stored_production_cff_uses_typed_energy_factor_ownership
  967. 47.98 s > stdout ---
  968. 47.98 s >
  969. 47.98 s > running 1 test
  970. 47.98 s > test cff::tests::stored_production_cff_uses_typed_energy_factor_ownership ... FAILED
  971. 47.98 s >
  972. 47.98 s > failures:
  973. 47.98 s >
  974. 47.98 s > failures:
  975. 47.98 s > cff::tests::stored_production_cff_uses_typed_energy_factor_ownership
  976. 47.98 s >
  977. 47.98 s > test result: FAILED. 0 passed; 1 failed; 0 ignored; 0 measured; 611 filtered out; finished in 0.15s
  978. 47.98 s >
  979. 47.98 s > stderr ---
  980. 47.98 s > The application panicked (crashed).
  981. 47.98 s > Message: assertion `left == right` failed
  982. 47.98 s > left: 1
  983. 47.98 s > right: -1
  984. 47.98 s > Location: crates/gammalooprs/src/cff/mod.rs:2721
  985. 47.98 s >
  986. 47.98 s > ━━━━━━━━━━━━━━━━━━━━━━━━━━━━━━━━━━ BACKTRACE ━━━━━━━━━━━━━━━━━━━━━━━━━━━━━━━━━━━
  987. 47.98 s > 1: <color_eyre[51793ea62743adbd]::config::PanicHook>::panic_report<unknown>
  988. 47.98 s > at <unknown source file>:<unknown line>
  989. 47.98 s > 2: <color_eyre[51793ea62743adbd]::config::PanicHook>::into_panic_hook::{closure#0}<unknown>
  990. 47.98 s > at <unknown source file>:<unknown line>
  991. 47.98 s > 3: std[bcb96dfbba0ab899]::panicking::panic_with_hook<unknown>
  992. 47.98 s > at <unknown source file>:<unknown line>
  993. 47.98 s > 4: std[bcb96dfbba0ab899]::panicking::panic_handler::{closure#0}<unknown>
  994. 47.98 s > at <unknown source file>:<unknown line>
  995. 47.98 s > 5: std[bcb96dfbba0ab899]::sys::backtrace::__rust_end_short_backtrace::<std[bcb96dfbba0ab899]::panicking::panic_handler::{closure#0}, !><unknown>
  996. 47.98 s > at <unknown source file>:<unknown line>
  997. 47.98 s > 6: __rustc[6c289b9f9c454d21]::rust_begin_unwind<unknown>
  998. 47.98 s > at <unknown source file>:<unknown line>
  999. 47.99 s > 7: core[940e698046960fd5]::panicking::panic_fmt<unknown>
  1000. 47.99 s > at <unknown source file>:<unknown line>
  1001. 47.99 s > 8: core[940e698046960fd5]::panicking::assert_failed_inner<unknown>
  1002. 47.99 s > at <unknown source file>:<unknown line>
  1003. 47.99 s > 9: core[940e698046960fd5]::panicking::assert_failed::<i64, i64><unknown>
  1004. 47.99 s > at <unknown source file>:<unknown line>
  1005. 47.99 s > 10: gammalooprs[972dff90865981f6]::cff::tests::stored_production_cff_uses_typed_energy_factor_ownership<unknown>
  1006. 47.99 s > at <unknown source file>:<unknown line>
  1007. 47.99 s > 11: <gammalooprs[972dff90865981f6]::cff::tests::stored_production_cff_uses_typed_energy_factor_ownership::{closure#0} as core[940e698046960fd5]::ops::function::FnOnce<()>>::call_once<unknown>
  1008. 47.99 s > at <unknown source file>:<unknown line>
  1009. 47.99 s > 12: test[75d6903177b1d7e9]::__rust_begin_short_backtrace::<core[940e698046960fd5]::result::Result<(), alloc[2ea6bcb46fca0c42]::string::String>, fn() -> core[940e698046960fd5]::result::Result<(), alloc[2ea6bcb46fca0c42]::string::String>><unknown>
  1010. 47.99 s > at <unknown source file>:<unknown line>
  1011. 47.99 s > 13: test[75d6903177b1d7e9]::run_test::{closure#0}<unknown>
  1012. 47.99 s > at <unknown source file>:<unknown line>
  1013. 47.99 s > 14: std[bcb96dfbba0ab899]::sys::backtrace::__rust_begin_short_backtrace::<test[75d6903177b1d7e9]::run_test::{closure#1}, ()><unknown>
  1014. 47.99 s > at <unknown source file>:<unknown line>
  1015. 47.99 s > 15: <std[bcb96dfbba0ab899]::thread::lifecycle::spawn_unchecked<test[75d6903177b1d7e9]::run_test::{closure#1}, ()>::{closure#1} as core[940e698046960fd5]::ops::function::FnOnce<()>>::call_once::{shim:vtable#0}<unknown>
  1016. 47.99 s > at <unknown source file>:<unknown line>
  1017. 47.99 s > 16: <std[bcb96dfbba0ab899]::sys::thread::unix::Thread>::new::thread_start<unknown>
  1018. 47.99 s > at <unknown source file>:<unknown line>
  1019. 47.99 s > 17: start_thread<unknown>
  1020. 47.99 s > at <unknown source file>:<unknown line>
  1021. 47.99 s > 18: __clone3<unknown>
  1022. 47.99 s > at <unknown source file>:<unknown line>
  1023. 47.99 s >
  1024. 47.99 s > Run with COLORBT_SHOW_HIDDEN=1 environment variable to disable frame filtering.
  1025. 47.99 s > Run with RUST_BACKTRACE=full to include source snippets.
  1026. 47.99 s >
  1027. 47.99 s > FAIL [ 0.108s] (483/561) gammalooprs uv::approx::local_3d::tests::production_emr_map_cancels_one_powered_denominator
  1028. 47.99 s > stdout ---
  1029. 47.99 s >
  1030. 47.99 s > running 1 test
  1031. 47.99 s > test uv::approx::local_3d::tests::production_emr_map_cancels_one_powered_denominator ... FAILED
  1032. 47.99 s >
  1033. 47.99 s > failures:
  1034. 47.99 s >
  1035. 47.99 s > failures:
  1036. 47.99 s > uv::approx::local_3d::tests::production_emr_map_cancels_one_powered_denominator
  1037. 47.99 s >
  1038. 47.99 s > test result: FAILED. 0 passed; 1 failed; 0 ignored; 0 measured; 611 filtered out; finished in 0.09s
  1039. 47.99 s >
  1040. 47.99 s > stderr ---
  1041. 47.99 s > The application panicked (crashed).
  1042. 47.99 s > Message: summed exact-source powered and selected lower channels differ: powered=-1𝑖/8/𝜋^3, lower=1𝑖/16/𝜋^3, difference=-3𝑖/16/𝜋^3
  1043. 47.99 s > Location: crates/gammalooprs/src/uv/approx/local_3d.rs:2047
  1044. 47.99 s >
  1045. 47.99 s > ━━━━━━━━━━━━━━━━━━━━━━━━━━━━━━━━━━ BACKTRACE ━━━━━━━━━━━━━━━━━━━━━━━━━━━━━━━━━━━
  1046. 47.99 s > 1: <color_eyre[51793ea62743adbd]::config::PanicHook>::panic_report<unknown>
  1047. 47.99 s > at <unknown source file>:<unknown line>
  1048. 47.99 s > 2: <color_eyre[51793ea62743adbd]::config::PanicHook>::into_panic_hook::{closure#0}<unknown>
  1049. 47.99 s > at <unknown source file>:<unknown line>
  1050. 47.99 s > 3: std[bcb96dfbba0ab899]::panicking::panic_with_hook<unknown>
  1051. 47.99 s > at <unknown source file>:<unknown line>
  1052. 47.99 s > 4: std[bcb96dfbba0ab899]::panicking::panic_handler::{closure#0}<unknown>
  1053. 47.99 s > at <unknown source file>:<unknown line>
  1054. 47.99 s > 5: std[bcb96dfbba0ab899]::sys::backtrace::__rust_end_short_backtrace::<std[bcb96dfbba0ab899]::panicking::panic_handler::{closure#0}, !><unknown>
  1055. 47.99 s > at <unknown source file>:<unknown line>
  1056. 47.99 s > 6: __rustc[6c289b9f9c454d21]::rust_begin_unwind<unknown>
  1057. 47.99 s > at <unknown source file>:<unknown line>
  1058. 47.99 s > 7: core[940e698046960fd5]::panicking::panic_fmt<unknown>
  1059. 47.99 s > at <unknown source file>:<unknown line>
  1060. 47.99 s > 8: gammalooprs[972dff90865981f6]::uv::approx::local_3d::tests::production_emr_map_cancels_one_powered_denominator<unknown>
  1061. 47.99 s > at <unknown source file>:<unknown line>
  1062. 47.99 s > 9: <gammalooprs[972dff90865981f6]::uv::approx::local_3d::tests::production_emr_map_cancels_one_powered_denominator::{closure#0} as core[940e698046960fd5]::ops::function::FnOnce<()>>::call_once<unknown>
  1063. 47.99 s > at <unknown source file>:<unknown line>
  1064. 47.99 s > 10: test[75d6903177b1d7e9]::__rust_begin_short_backtrace::<core[940e698046960fd5]::result::Result<(), alloc[2ea6bcb46fca0c42]::string::String>, fn() -> core[940e698046960fd5]::result::Result<(), alloc[2ea6bcb46fca0c42]::string::String>><unknown>
  1065. 47.99 s > at <unknown source file>:<unknown line>
  1066. 47.99 s > 11: test[75d6903177b1d7e9]::run_test::{closure#0}<unknown>
  1067. 47.99 s > at <unknown source file>:<unknown line>
  1068. 47.99 s > 12: std[bcb96dfbba0ab899]::sys::backtrace::__rust_begin_short_backtrace::<test[75d6903177b1d7e9]::run_test::{closure#1}, ()><unknown>
  1069. 47.99 s > at <unknown source file>:<unknown line>
  1070. 47.99 s > 13: <std[bcb96dfbba0ab899]::thread::lifecycle::spawn_unchecked<test[75d6903177b1d7e9]::run_test::{closure#1}, ()>::{closure#1} as core[940e698046960fd5]::ops::function::FnOnce<()>>::call_once::{shim:vtable#0}<unknown>
  1071. 47.99 s > at <unknown source file>:<unknown line>
  1072. 47.99 s > 14: <std[bcb96dfbba0ab899]::sys::thread::unix::Thread>::new::thread_start<unknown>
  1073. 47.99 s > at <unknown source file>:<unknown line>
  1074. 47.99 s > 15: start_thread<unknown>
  1075. 47.99 s > at <unknown source file>:<unknown line>
  1076. 47.99 s > 16: __clone3<unknown>
  1077. 47.99 s > at <unknown source file>:<unknown line>
  1078. 47.99 s >
  1079. 47.99 s > Run with COLORBT_SHOW_HIDDEN=1 environment variable to disable frame filtering.
  1080. 47.99 s > Run with RUST_BACKTRACE=full to include source snippets.
  1081. 47.99 s >
  1082. 47.99 s > FAIL [ 0.424s] (539/561) gammalooprs uv::hedge_poset::tests::spectacles_typed_4d_projects_after_local_construction
  1083. 47.99 s > stdout ---
  1084. 47.99 s >
  1085. 47.99 s > running 1 test
  1086. 47.99 s > digraph {
  1087. 47.99 s > node [shape=circle,height=0.1,label=""];
  1088. 47.99 s > overlap = "scale";
  1089. 47.99 s > layout = "neato";
  1090. 47.99 s > start=2;
  1091. 47.99 s > 4 [label="0"];
  1092. 47.99 s > 1 [label="zw"];
  1093. 47.99 s > 2 [label="F"];
  1094. 47.99 s > 0 [label="143"];
  1095. 47.99 s > 3 [label="10B"];
  1096. 47.99 s > 4:0:s -> 1:1:s [id=0 color="red:blue;0.5" label="zw"];
  1097. 47.99 s > 4:2:s -> 2:3:s [id=1 color="red:blue;0.5" label="F"];
  1098. 47.99 s > 3:5:s -> 0:4:s [id=2 color="red:blue;0.5" label="143"];
  1099. 47.99 s > 4:6:s -> 0:7:s [id=3 color="red:blue;0.5" label="143"];
  1100. 47.99 s > 1:8:s -> 3:9:s [id=4 color="red:blue;0.5" label="F"];
  1101. 47.99 s > 1:10:s -> 0:11:s [id=5 color="red:blue;0.5" label="143"];
  1102. 47.99 s > 2:12:s -> 3:13:s [id=6 color="red:blue;0.5" label="zw"];
  1103. 47.99 s > 2:14:s -> 0:15:s [id=7 color="red:blue;0.5" label="143"];
  1104. 47.99 s > }
  1105. 47.99 s >
  1106. 47.99 s > digraph {
  1107. 47.99 s > node [shape=circle,height=0.1,label=""];
  1108. 47.99 s > overlap = "scale";
  1109. 47.99 s > layout = "neato";
  1110. 47.99 s > start=2;
  1111. 47.99 s > 0 [label="∅"];
  1112. 47.99 s > 1 [label="{zw}: Approx(S_zw(0))"];
  1113. 47.99 s > 2 [label="{F}: Approx(S_F(1))"];
  1114. 47.99 s > 3 [label="{143}: Approx(S_143(3))"];
  1115. 47.99 s > 4 [label="{zw,F}: Approx(S_F(4))*Approx(S_zw(0))"];
  1116. 47.99 s > 5 [label="{zw} · {143}: Approx((-1*S_zw+S_143(5))*Approx(S_zw(0)))"];
  1117. 47.99 s > 6 [label="{F} · {143}: Approx((-1*S_F+S_143(7))*Approx(S_F(1)))"];
  1118. 47.99 s > 7 [label="{zw,F} · {143}: Approx((-1*S_10B+S_143(2))*Approx(S_F(4))*Approx(S_zw(0)))"];
  1119. 47.99 s > 0:0:s -> 1:1:s [id=0 color="red:blue;0.5"];
  1120. 47.99 s > 0:2:s -> 2:3:s [id=1 color="red:blue;0.5"];
  1121. 47.99 s > 0:4:s -> 3:5:s [id=2 color="red:blue;0.5"];
  1122. 47.99 s > 1:6:s -> 4:7:s [id=3 color="red:blue;0.5"];
  1123. 47.99 s > 1:8:s -> 5:9:s [id=4 color="red:blue;0.5"];
  1124. 47.99 s > 2:10:s -> 4:11:s [id=5 color="red:blue;0.5"];
  1125. 47.99 s > 2:12:s -> 6:13:s [id=6 color="red:blue;0.5"];
  1126. 47.99 s > 4:14:s -> 7:15:s [id=7 color="red:blue;0.5"];
  1127. 47.99 s > }
  1128. 47.99 s >
  1129. 47.99 s > test uv::hedge_poset::tests::spectacles_typed_4d_projects_after_local_construction ... FAILED
  1130. 47.99 s >
  1131. 47.99 s > failures:
  1132. 47.99 s >
  1133. 47.99 s > failures:
  1134. 47.99 s > uv::hedge_poset::tests::spectacles_typed_4d_projects_after_local_construction
  1135. 47.99 s >
  1136. 47.99 s > test result: FAILED. 0 passed; 1 failed; 0 ignored; 0 measured; 611 filtered out; finished in 0.39s
  1137. 47.99 s >
  1138. 47.99 s > stderr ---
  1139. 47.99 s > Error:
  1140. 47.99 s > 0: failed to extract three-dimensional representation graph input: source edge 1 has no unique routing for rewritten exact signature [-1, 0, 0] modulo the factorized opposite-domain loop span
  1141. 47.99 s >
  1142. 47.99 s > Location:
  1143. 47.99 s > crates/gammalooprs/src/uv/approx/local_3d.rs:845
  1144. 47.99 s >
  1145. 47.99 s > ━━━━━━━━━━━━━━━━━━━━━━━━━━━━━━━━━━ BACKTRACE ━━━━━━━━━━━━━━━━━━━━━━━━━━━━━━━━━━━
  1146. 47.99 s > 1: <color_eyre[51793ea62743adbd]::config::EyreHook>::into_eyre_hook::{closure#0}<unknown>
  1147. 47.99 s > at <unknown source file>:<unknown line>
  1148. 47.99 s > 2: eyre[cb2fd339c0c40fca]::capture_handler<unknown>
  1149. 47.99 s > at <unknown source file>:<unknown line>
  1150. 47.99 s > 3: <eyre[cb2fd339c0c40fca]::Report>::from_std::<three_dimensional_reps[3cb572ff22d197ac]::graph_io::GraphIoError><unknown>
  1151. 47.99 s > at <unknown source file>:<unknown line>
  1152. 47.99 s > 4: <gammalooprs[972dff90865981f6]::uv::approx::local_3d::Localizer>::project_4d<unknown>
  1153. 47.99 s > at <unknown source file>:<unknown line>
  1154. 47.99 s > 5: gammalooprs[972dff90865981f6]::uv::hedge_poset::tests::spectacles_typed_4d_projects_after_local_construction<unknown>
  1155. 47.99 s > at <unknown source file>:<unknown line>
  1156. 47.99 s > 6: <gammalooprs[972dff90865981f6]::uv::hedge_poset::tests::spectacles_typed_4d_projects_after_local_construction::{closure#0} as core[940e698046960fd5]::ops::function::FnOnce<()>>::call_once<unknown>
  1157. 47.99 s > at <unknown source file>:<unknown line>
  1158. 47.99 s > 7: test[75d6903177b1d7e9]::__rust_begin_short_backtrace::<core[940e698046960fd5]::result::Result<(), alloc[2ea6bcb46fca0c42]::string::String>, fn() -> core[940e698046960fd5]::result::Result<(), alloc[2ea6bcb46fca0c42]::string::String>><unknown>
  1159. 47.99 s > at <unknown source file>:<unknown line>
  1160. 47.99 s > 8: test[75d6903177b1d7e9]::run_test::{closure#0}<unknown>
  1161. 47.99 s > at <unknown source file>:<unknown line>
  1162. 47.99 s > 9: std[bcb96dfbba0ab899]::sys::backtrace::__rust_begin_short_backtrace::<test[75d6903177b1d7e9]::run_test::{closure#1}, ()><unknown>
  1163. 47.99 s > at <unknown source file>:<unknown line>
  1164. 47.99 s > 10: <std[bcb96dfbba0ab899]::thread::lifecycle::spawn_unchecked<test[75d6903177b1d7e9]::run_test::{closure#1}, ()>::{closure#1} as core[940e698046960fd5]::ops::function::FnOnce<()>>::call_once::{shim:vtable#0}<unknown>
  1165. 47.99 s > at <unknown source file>:<unknown line>
  1166. 47.99 s > 11: <std[bcb96dfbba0ab899]::sys::thread::unix::Thread>::new::thread_start<unknown>
  1167. 47.99 s > at <unknown source file>:<unknown line>
  1168. 47.99 s > 12: start_thread<unknown>
  1169. 47.99 s > at <unknown source file>:<unknown line>
  1170. 47.99 s > 13: __clone3<unknown>
  1171. 47.99 s > at <unknown source file>:<unknown line>
  1172. 47.99 s >
  1173. 47.99 s > Run with COLORBT_SHOW_HIDDEN=1 environment variable to disable frame filtering.
  1174. 47.99 s > Run with RUST_BACKTRACE=full to include source snippets.
  1175. 47.99 s >
  1176. 47.99 s > FAIL [ 9.979s] (558/561) gammalooprs uv::tests::scalars_profile
  1177. 47.99 s > stdout ---
  1178. 47.99 s >
  1179. 47.99 s > running 1 test
  1180. 47.99 s > test uv::tests::scalars_profile ... FAILED
  1181. 47.99 s >
  1182. 47.99 s > failures:
  1183. 47.99 s >
  1184. 47.99 s > failures:
  1185. 47.99 s > uv::tests::scalars_profile
  1186. 47.99 s >
  1187. 47.99 s > test result: FAILED. 0 passed; 1 failed; 0 ignored; 0 measured; 611 filtered out; finished in 9.96s
  1188. 47.99 s >
  1189. 47.99 s > stderr ---
  1190. 47.99 s > [18:17:53.343] @gammalooprs::settings::runtime WARNING : No external kinematics were provided; using default-generated external momenta and helicities.
  1191. 47.99 s > field value
  1192. 47.99 s > span build_integrand{amplitude.name=bub}
  1193. 47.99 s > at crates/gammalooprs/src/settings/runtime.rs:131
  1194. 47.99 s > [18:17:53.344] @gammalooprs::integrands::process::amplitude INFO : Input is below threshold: 0 existing threshold E-surfaces across 0/3 graph groups
  1195. 47.99 s > field value
  1196. 47.99 s > existing_esurfaces 0
  1197. 47.99 s > group_count 3
  1198. 47.99 s > groups_above_threshold 0
  1199. 47.99 s > integrand bub
  1200. 47.99 s > span warm_up{integrand.name=bub}
  1201. 47.99 s > threshold_status below threshold
  1202. 47.99 s > at crates/gammalooprs/src/integrands/process/amplitude/mod.rs:1666
  1203. 47.99 s > [18:17:53.345] @gammalooprs::integrands::process::amplitude INFO : overlap structure of group 0: [0: []]
  1204. 47.99 s > field value
  1205. 47.99 s > span warm_up{integrand.name=bub}
  1206. 47.99 s > at crates/gammalooprs/src/integrands/process/amplitude/mod.rs:2015
  1207. 47.99 s > [18:17:53.345] @gammalooprs::integrands::process::amplitude INFO : overlap structure of group 1: [0: []]
  1208. 47.99 s > field value
  1209. 47.99 s > span warm_up{integrand.name=bub}
  1210. 47.99 s > at crates/gammalooprs/src/integrands/process/amplitude/mod.rs:2015
  1211. 47.99 s > [18:17:53.345] @gammalooprs::integrands::process::amplitude INFO : overlap structure of group 2: [0: []]
  1212. 47.99 s > field value
  1213. 47.99 s > span warm_up{integrand.name=bub}
  1214. 47.99 s > at crates/gammalooprs/src/integrands/process/amplitude/mod.rs:2015
  1215. 47.99 s > The application panicked (crashed).
  1216. 47.99 s > Message: assertion `left == right` failed: subtracted scalar UV profile failed:
  1217. 47.99 s > UVProfilePassFail {
  1218. 47.99 s > max_dod: -0.9,
  1219. 47.99 s > total: 16,
  1220. 47.99 s > failed: 1,
  1221. 47.99 s > failures: [
  1222. 47.99 s > UVProfileFailure {
  1223. 47.99 s > graph_index: 0,
  1224. 47.99 s > graph_name: "banana",
  1225. 47.99 s > cutkosky_cut: None,
  1226. 47.99 s > lmb_index: 1,
  1227. 47.99 s > fixed: [
  1228. 47.99 s > EdgeIndex(
  1229. 47.99 s > 2,
  1230. 47.99 s > ),
  1231. 47.99 s > EdgeIndex(
  1232. 47.99 s > 0,
  1233. 47.99 s > ),
  1234. 47.99 s > ],
  1235. 47.99 s > free: [
  1236. 47.99 s > EdgeIndex(
  1237. 47.99 s > 3,
  1238. 47.99 s > ),
  1239. 47.99 s > ],
  1240. 47.99 s > orientation_label: None,
  1241. 47.99 s > reason: "dod_exceeds_threshold",
  1242. 47.99 s > },
  1243. 47.99 s > ],
  1244. 47.99 s > }
  1245. 47.99 s >
  1246. 47.99 s > ╭─────────┬────────────┬───────────┬───────┬─────┬──────────┬───────────╮
  1247. 47.99 s > │ fixed │ → ∞ │ slope │ r2 │ DOD │ bare DOD │ inspect │
  1248. 47.99 s > ├─────────┼────────────┼───────────┼───────┼─────┼──────────┼───────────┤
  1249. 47.99 s > │ {e1,e2} │ {e3} │ -0.996752 │ 1.000 │ -1 │ 0 │ arb retry │
  1250. 47.99 s > │ {e1,e3} │ {e2} │ -1.065665 │ 0.997 │ -1 │ 0 │ arb retry │
  1251. 47.99 s > │ {e1} │ {e2,e3} │ -0.937151 │ 0.943 │ -1 │ 2 │ │
  1252. 47.99 s > │ {e2,e3} │ {e1} │ -1.001075 │ 1.000 │ -1 │ 0 │ arb retry │
  1253. 47.99 s > │ {e2} │ {e1,e3} │ -0.984146 │ 0.998 │ -1 │ 2 │ │
  1254. 47.99 s > │ {e3} │ {e1,e2} │ -1.383911 │ 0.982 │ -1 │ 2 │ arb retry │
  1255. 47.99 s > │ {} │ {e1,e2,e3} │ -1.094213 │ 0.258 │ -1 │ 4 │ │
  1256. 47.99 s > │ {e2,e0} │ {e3} │ -0.803348 │ 0.861 │ -1 │ 0 │ arb retry │
  1257. 47.99 s > │ {e3,e0} │ {e2} │ -0.999257 │ 1.000 │ -1 │ 0 │ │
  1258. 47.99 s > │ {e0} │ {e2,e3} │ -1.000893 │ 1.000 │ -1 │ 2 │ │
  1259. 47.99 s > │ {e1,e0} │ {e3} │ -0.997860 │ 1.000 │ -1 │ 0 │ │
  1260. 47.99 s > ╰─────────┴────────────┴───────────┴───────┴─────┴──────────┴───────────╯
  1261. 47.99 s >
  1262. 47.99 s > ╭───────┬─────────┬───────────┬───────┬─────┬──────────┬───────────╮
  1263. 47.99 s > │ fixed │ → ∞ │ slope │ r2 │ DOD │ bare DOD │ inspect │
  1264. 47.99 s > ├───────┼─────────┼───────────┼───────┼─────┼──────────┼───────────┤
  1265. 47.99 s > │ {e1} │ {e2} │ -1.005039 │ 1.000 │ -1 │ 0 │ arb retry │
  1266. 47.99 s > │ {e2} │ {e1} │ -1.001098 │ 1.000 │ -1 │ 0 │ arb retry │
  1267. 47.99 s > │ {} │ {e1,e2} │ -1.011289 │ 1.000 │ -1 │ 2 │ │
  1268. 47.99 s > │ {e0} │ {e2} │ -0.998140 │ 1.000 │ -1 │ 0 │ │
  1269. 47.99 s > ╰───────┴─────────┴───────────┴───────┴─────┴──────────┴───────────╯
  1270. 47.99 s >
  1271. 47.99 s > ╭───────┬──────┬───────────┬───────┬─────┬──────────┬─────────╮
  1272. 47.99 s > │ fixed │ → ∞ │ slope │ r2 │ DOD │ bare DOD │ inspect │
  1273. 47.99 s > ├───────┼──────┼───────────┼───────┼─────┼──────────┼─────────┤
  1274. 47.99 s > │ {} │ {e1} │ -0.989949 │ 1.000 │ -1 │ 0 │ │
  1275. 47.99 s > ╰───────┴──────┴───────────┴───────┴─────┴──────────┴─────────╯
  1276. 47.99 s > left: 1
  1277. 47.99 s > right: 0
  1278. 47.99 s > Location: crates/gammalooprs/src/uv/tests.rs:259
  1279. 47.99 s >
  1280. 47.99 s > ━━━━━━━━━━━━━━━━━━━━━━━━━━━━━━━━━━ BACKTRACE ━━━━━━━━━━━━━━━━━━━━━━━━━━━━━━━━━━━
  1281. 47.99 s > 1: <color_eyre[51793ea62743adbd]::config::PanicHook>::panic_report<unknown>
  1282. 47.99 s > at <unknown source file>:<unknown line>
  1283. 47.99 s > 2: <color_eyre[51793ea62743adbd]::config::PanicHook>::into_panic_hook::{closure#0}<unknown>
  1284. 47.99 s > at <unknown source file>:<unknown line>
  1285. 47.99 s > 3: std[bcb96dfbba0ab899]::panicking::panic_with_hook<unknown>
  1286. 47.99 s > at <unknown source file>:<unknown line>
  1287. 47.99 s > 4: std[bcb96dfbba0ab899]::panicking::panic_handler::{closure#0}<unknown>
  1288. 47.99 s > at <unknown source file>:<unknown line>
  1289. 47.99 s > 5: std[bcb96dfbba0ab899]::sys::backtrace::__rust_end_short_backtrace::<std[bcb96dfbba0ab899]::panicking::panic_handler::{closure#0}, !><unknown>
  1290. 47.99 s > at <unknown source file>:<unknown line>
  1291. 47.99 s > 6: __rustc[6c289b9f9c454d21]::rust_begin_unwind<unknown>
  1292. 47.99 s > at <unknown source file>:<unknown line>
  1293. 47.99 s > 7: core[940e698046960fd5]::panicking::panic_fmt<unknown>
  1294. 47.99 s > at <unknown source file>:<unknown line>
  1295. 47.99 s > 8: core[940e698046960fd5]::panicking::assert_failed_inner<unknown>
  1296. 47.99 s > at <unknown source file>:<unknown line>
  1297. 47.99 s > 9: core[940e698046960fd5]::panicking::assert_failed::<usize, usize><unknown>
  1298. 47.99 s > at <unknown source file>:<unknown line>
  1299. 47.99 s > 10: gammalooprs[972dff90865981f6]::uv::tests::scalars_profile<unknown>
  1300. 47.99 s > at <unknown source file>:<unknown line>
  1301. 47.99 s > 11: <gammalooprs[972dff90865981f6]::uv::tests::scalars_profile::{closure#0} as core[940e698046960fd5]::ops::function::FnOnce<()>>::call_once<unknown>
  1302. 47.99 s > at <unknown source file>:<unknown line>
  1303. 47.99 s > 12: test[75d6903177b1d7e9]::__rust_begin_short_backtrace::<core[940e698046960fd5]::result::Result<(), alloc[2ea6bcb46fca0c42]::string::String>, fn() -> core[940e698046960fd5]::result::Result<(), alloc[2ea6bcb46fca0c42]::string::String>><unknown>
  1304. 47.99 s > at <unknown source file>:<unknown line>
  1305. 47.99 s > 13: test[75d6903177b1d7e9]::run_test::{closure#0}<unknown>
  1306. 47.99 s > at <unknown source file>:<unknown line>
  1307. 47.99 s > 14: std[bcb96dfbba0ab899]::sys::backtrace::__rust_begin_short_backtrace::<test[75d6903177b1d7e9]::run_test::{closure#1}, ()><unknown>
  1308. 47.99 s > at <unknown source file>:<unknown line>
  1309. 47.99 s > 15: <std[bcb96dfbba0ab899]::thread::lifecycle::spawn_unchecked<test[75d6903177b1d7e9]::run_test::{closure#1}, ()>::{closure#1} as core[940e698046960fd5]::ops::function::FnOnce<()>>::call_once::{shim:vtable#0}<unknown>
  1310. 47.99 s > at <unknown source file>:<unknown line>
  1311. 47.99 s > 16: <std[bcb96dfbba0ab899]::sys::thread::unix::Thread>::new::thread_start<unknown>
  1312. 47.99 s > at <unknown source file>:<unknown line>
  1313. 47.99 s > 17: start_thread<unknown>
  1314. 47.99 s > at <unknown source file>:<unknown line>
  1315. 47.99 s > 18: __clone3<unknown>
  1316. 47.99 s > at <unknown source file>:<unknown line>
  1317. 47.99 s >
  1318. 47.99 s > Run with COLORBT_SHOW_HIDDEN=1 environment variable to disable frame filtering.
  1319. 47.99 s > Run with RUST_BACKTRACE=full to include source snippets.
  1320. 47.99 s >
  1321. 47.99 s > FAIL [ 11.152s] (559/561) gammalooprs uv::tests::scalars_profile_new
  1322. 47.99 s > stdout ---
  1323. 47.99 s >
  1324. 47.99 s > running 1 test
  1325. 47.99 s > test uv::tests::scalars_profile_new ... FAILED
  1326. 47.99 s >
  1327. 47.99 s > failures:
  1328. 47.99 s >
  1329. 47.99 s > failures:
  1330. 47.99 s > uv::tests::scalars_profile_new
  1331. 47.99 s >
  1332. 47.99 s > test result: FAILED. 0 passed; 1 failed; 0 ignored; 0 measured; 611 filtered out; finished in 11.13s
  1333. 47.99 s >
  1334. 47.99 s > stderr ---
  1335. 47.99 s > [18:17:54.561] @gammalooprs::settings::runtime WARNING : No external kinematics were provided; using default-generated external momenta and helicities.
  1336. 47.99 s > field value
  1337. 47.99 s > span build_integrand{amplitude.name=bub}
  1338. 47.99 s > at crates/gammalooprs/src/settings/runtime.rs:131
  1339. 47.99 s > [18:17:54.562] @gammalooprs::integrands::process::amplitude INFO : Input is below threshold: 0 existing threshold E-surfaces across 0/3 graph groups
  1340. 47.99 s > field value
  1341. 47.99 s > existing_esurfaces 0
  1342. 47.99 s > group_count 3
  1343. 47.99 s > groups_above_threshold 0
  1344. 47.99 s > integrand bub
  1345. 47.99 s > span warm_up{integrand.name=bub}
  1346. 47.99 s > threshold_status below threshold
  1347. 47.99 s > at crates/gammalooprs/src/integrands/process/amplitude/mod.rs:1666
  1348. 47.99 s > [18:17:54.562] @gammalooprs::integrands::process::amplitude INFO : overlap structure of group 0: [0: []]
  1349. 47.99 s > field value
  1350. 47.99 s > span warm_up{integrand.name=bub}
  1351. 47.99 s > at crates/gammalooprs/src/integrands/process/amplitude/mod.rs:2015
  1352. 47.99 s > [18:17:54.562] @gammalooprs::integrands::process::amplitude INFO : overlap structure of group 1: [0: []]
  1353. 47.99 s > field value
  1354. 47.99 s > span warm_up{integrand.name=bub}
  1355. 47.99 s > at crates/gammalooprs/src/integrands/process/amplitude/mod.rs:2015
  1356. 47.99 s > [18:17:54.562] @gammalooprs::integrands::process::amplitude INFO : overlap structure of group 2: [0: []]
  1357. 47.99 s > field value
  1358. 47.99 s > span warm_up{integrand.name=bub}
  1359. 47.99 s > at crates/gammalooprs/src/integrands/process/amplitude/mod.rs:2015
  1360. 47.99 s > The application panicked (crashed).
  1361. 47.99 s > Message: assertion `left == right` failed: subtracted scalar UV profile failed:
  1362. 47.99 s > UVProfilePassFail {
  1363. 47.99 s > max_dod: -0.9,
  1364. 47.99 s > total: 16,
  1365. 47.99 s > failed: 1,
  1366. 47.99 s > failures: [
  1367. 47.99 s > UVProfileFailure {
  1368. 47.99 s > graph_index: 0,
  1369. 47.99 s > graph_name: "banana",
  1370. 47.99 s > cutkosky_cut: None,
  1371. 47.99 s > lmb_index: 1,
  1372. 47.99 s > fixed: [
  1373. 47.99 s > EdgeIndex(
  1374. 47.99 s > 2,
  1375. 47.99 s > ),
  1376. 47.99 s > EdgeIndex(
  1377. 47.99 s > 0,
  1378. 47.99 s > ),
  1379. 47.99 s > ],
  1380. 47.99 s > free: [
  1381. 47.99 s > EdgeIndex(
  1382. 47.99 s > 3,
  1383. 47.99 s > ),
  1384. 47.99 s > ],
  1385. 47.99 s > orientation_label: None,
  1386. 47.99 s > reason: "dod_exceeds_threshold",
  1387. 47.99 s > },
  1388. 47.99 s > ],
  1389. 47.99 s > }
  1390. 47.99 s >
  1391. 47.99 s > ╭─────────┬────────────┬───────────┬───────┬─────┬──────────┬───────────╮
  1392. 47.99 s > │ fixed │ → ∞ │ slope │ r2 │ DOD │ bare DOD │ inspect │
  1393. 47.99 s > ├─────────┼────────────┼───────────┼───────┼─────┼──────────┼───────────┤
  1394. 47.99 s > │ {e1,e2} │ {e3} │ -0.996752 │ 1.000 │ -1 │ 0 │ arb retry │
  1395. 47.99 s > │ {e1,e3} │ {e2} │ -1.065665 │ 0.997 │ -1 │ 0 │ arb retry │
  1396. 47.99 s > │ {e1} │ {e2,e3} │ -0.937151 │ 0.943 │ -1 │ 2 │ │
  1397. 47.99 s > │ {e2,e3} │ {e1} │ -1.001075 │ 1.000 │ -1 │ 0 │ arb retry │
  1398. 47.99 s > │ {e2} │ {e1,e3} │ -0.984146 │ 0.998 │ -1 │ 2 │ │
  1399. 47.99 s > │ {e3} │ {e1,e2} │ -1.383911 │ 0.982 │ -1 │ 2 │ arb retry │
  1400. 47.99 s > │ {} │ {e1,e2,e3} │ -1.094213 │ 0.258 │ -1 │ 4 │ │
  1401. 47.99 s > │ {e2,e0} │ {e3} │ -0.803348 │ 0.861 │ -1 │ 0 │ arb retry │
  1402. 47.99 s > │ {e3,e0} │ {e2} │ -0.999257 │ 1.000 │ -1 │ 0 │ │
  1403. 47.99 s > │ {e0} │ {e2,e3} │ -1.000893 │ 1.000 │ -1 │ 2 │ │
  1404. 47.99 s > │ {e1,e0} │ {e3} │ -0.997860 │ 1.000 │ -1 │ 0 │ │
  1405. 47.99 s > ╰─────────┴────────────┴───────────┴───────┴─────┴──────────┴───────────╯
  1406. 47.99 s >
  1407. 47.99 s > ╭───────┬─────────┬───────────┬───────┬─────┬──────────┬───────────╮
  1408. 47.99 s > │ fixed │ → ∞ │ slope │ r2 │ DOD │ bare DOD │ inspect │
  1409. 47.99 s > ├───────┼─────────┼───────────┼───────┼─────┼──────────┼───────────┤
  1410. 47.99 s > │ {e1} │ {e2} │ -1.005039 │ 1.000 │ -1 │ 0 │ arb retry │
  1411. 47.99 s > │ {e2} │ {e1} │ -1.001098 │ 1.000 │ -1 │ 0 │ arb retry │
  1412. 47.99 s > │ {} │ {e1,e2} │ -1.011289 │ 1.000 │ -1 │ 2 │ │
  1413. 47.99 s > │ {e0} │ {e2} │ -0.998140 │ 1.000 │ -1 │ 0 │ │
  1414. 47.99 s > ╰───────┴─────────┴───────────┴───────┴─────┴──────────┴───────────╯
  1415. 47.99 s >
  1416. 47.99 s > ╭───────┬──────┬───────────┬───────┬─────┬──────────┬─────────╮
  1417. 47.99 s > │ fixed │ → ∞ │ slope │ r2 │ DOD │ bare DOD │ inspect │
  1418. 47.99 s > ├───────┼──────┼───────────┼───────┼─────┼──────────┼─────────┤
  1419. 47.99 s > │ {} │ {e1} │ -0.989949 │ 1.000 │ -1 │ 0 │ │
  1420. 47.99 s > ╰───────┴──────┴───────────┴───────┴─────┴──────────┴─────────╯
  1421. 47.99 s > left: 1
  1422. 47.99 s > right: 0
  1423. 47.99 s > Location: crates/gammalooprs/src/uv/tests.rs:325
  1424. 47.99 s >
  1425. 47.99 s > ━━━━━━━━━━━━━━━━━━━━━━━━━━━━━━━━━━ BACKTRACE ━━━━━━━━━━━━━━━━━━━━━━━━━━━━━━━━━━━
  1426. 47.99 s > 1: <color_eyre[51793ea62743adbd]::config::PanicHook>::panic_report<unknown>
  1427. 47.99 s > at <unknown source file>:<unknown line>
  1428. 47.99 s > 2: <color_eyre[51793ea62743adbd]::config::PanicHook>::into_panic_hook::{closure#0}<unknown>
  1429. 47.99 s > at <unknown source file>:<unknown line>
  1430. 47.99 s > 3: std[bcb96dfbba0ab899]::panicking::panic_with_hook<unknown>
  1431. 47.99 s > at <unknown source file>:<unknown line>
  1432. 47.99 s > 4: std[bcb96dfbba0ab899]::panicking::panic_handler::{closure#0}<unknown>
  1433. 47.99 s > at <unknown source file>:<unknown line>
  1434. 47.99 s > 5: std[bcb96dfbba0ab899]::sys::backtrace::__rust_end_short_backtrace::<std[bcb96dfbba0ab899]::panicking::panic_handler::{closure#0}, !><unknown>
  1435. 47.99 s > at <unknown source file>:<unknown line>
  1436. 47.99 s > 6: __rustc[6c289b9f9c454d21]::rust_begin_unwind<unknown>
  1437. 47.99 s > at <unknown source file>:<unknown line>
  1438. 47.99 s > 7: core[940e698046960fd5]::panicking::panic_fmt<unknown>
  1439. 47.99 s > at <unknown source file>:<unknown line>
  1440. 47.99 s > 8: core[940e698046960fd5]::panicking::assert_failed_inner<unknown>
  1441. 47.99 s > at <unknown source file>:<unknown line>
  1442. 47.99 s > 9: core[940e698046960fd5]::panicking::assert_failed::<usize, usize><unknown>
  1443. 47.99 s > at <unknown source file>:<unknown line>
  1444. 47.99 s > 10: gammalooprs[972dff90865981f6]::uv::tests::scalars_profile_new<unknown>
  1445. 47.99 s > at <unknown source file>:<unknown line>
  1446. 47.99 s > 11: <gammalooprs[972dff90865981f6]::uv::tests::scalars_profile_new::{closure#0} as core[940e698046960fd5]::ops::function::FnOnce<()>>::call_once<unknown>
  1447. 47.99 s > at <unknown source file>:<unknown line>
  1448. 47.99 s > 12: test[75d6903177b1d7e9]::__rust_begin_short_backtrace::<core[940e698046960fd5]::result::Result<(), alloc[2ea6bcb46fca0c42]::string::String>, fn() -> core[940e698046960fd5]::result::Result<(), alloc[2ea6bcb46fca0c42]::string::String>><unknown>
  1449. 47.99 s > at <unknown source file>:<unknown line>
  1450. 47.99 s > 13: test[75d6903177b1d7e9]::run_test::{closure#0}<unknown>
  1451. 47.99 s > at <unknown source file>:<unknown line>
  1452. 47.99 s > 14: std[bcb96dfbba0ab899]::sys::backtrace::__rust_begin_short_backtrace::<test[75d6903177b1d7e9]::run_test::{closure#1}, ()><unknown>
  1453. 47.99 s > at <unknown source file>:<unknown line>
  1454. 47.99 s > 15: <std[bcb96dfbba0ab899]::thread::lifecycle::spawn_unchecked<test[75d6903177b1d7e9]::run_test::{closure#1}, ()>::{closure#1} as core[940e698046960fd5]::ops::function::FnOnce<()>>::call_once::{shim:vtable#0}<unknown>
  1455. 47.99 s > at <unknown source file>:<unknown line>
  1456. 47.99 s > 16: <std[bcb96dfbba0ab899]::sys::thread::unix::Thread>::new::thread_start<unknown>
  1457. 47.99 s > at <unknown source file>:<unknown line>
  1458. 47.99 s > 17: start_thread<unknown>
  1459. 47.99 s > at <unknown source file>:<unknown line>
  1460. 47.99 s > 18: __clone3<unknown>
  1461. 47.99 s > at <unknown source file>:<unknown line>
  1462. 47.99 s >
  1463. 47.99 s > Run with COLORBT_SHOW_HIDDEN=1 environment variable to disable frame filtering.
  1464. 47.99 s > Run with RUST_BACKTRACE=full to include source snippets.
  1465. 47.99 s >
  1466. 47.99 s > ------------
  1467. 47.99 s > Summary [ 15.540s] 561 tests run: 556 passed, 5 failed, 59 skipped
  1468. 47.99 s > FAIL [ 0.168s] ( 53/561) gammalooprs cff::tests::stored_production_cff_uses_typed_energy_factor_ownership
  1469. 47.99 s > stdout ---
  1470. 47.99 s >
  1471. 47.99 s > running 1 test
  1472. 47.99 s > test cff::tests::stored_production_cff_uses_typed_energy_factor_ownership ... FAILED
  1473. 47.99 s >
  1474. 47.99 s > failures:
  1475. 47.99 s >
  1476. 47.99 s > failures:
  1477. 47.99 s > cff::tests::stored_production_cff_uses_typed_energy_factor_ownership
  1478. 47.99 s >
  1479. 47.99 s > test result: FAILED. 0 passed; 1 failed; 0 ignored; 0 measured; 611 filtered out; finished in 0.15s
  1480. 47.99 s >
  1481. 47.99 s > stderr ---
  1482. 47.99 s > The application panicked (crashed).
  1483. 47.99 s > Message: assertion `left == right` failed
  1484. 47.99 s > left: 1
  1485. 47.99 s > right: -1
  1486. 47.99 s > Location: crates/gammalooprs/src/cff/mod.rs:2721
  1487. 47.99 s >
  1488. 47.99 s > ━━━━━━━━━━━━━━━━━━━━━━━━━━━━━━━━━━ BACKTRACE ━━━━━━━━━━━━━━━━━━━━━━━━━━━━━━━━━━━
  1489. 47.99 s > 1: <color_eyre[51793ea62743adbd]::config::PanicHook>::panic_report<unknown>
  1490. 47.99 s > at <unknown source file>:<unknown line>
  1491. 47.99 s > 2: <color_eyre[51793ea62743adbd]::config::PanicHook>::into_panic_hook::{closure#0}<unknown>
  1492. 47.99 s > at <unknown source file>:<unknown line>
  1493. 47.99 s > 3: std[bcb96dfbba0ab899]::panicking::panic_with_hook<unknown>
  1494. 47.99 s > at <unknown source file>:<unknown line>
  1495. 47.99 s > 4: std[bcb96dfbba0ab899]::panicking::panic_handler::{closure#0}<unknown>
  1496. 47.99 s > at <unknown source file>:<unknown line>
  1497. 47.99 s > 5: std[bcb96dfbba0ab899]::sys::backtrace::__rust_end_short_backtrace::<std[bcb96dfbba0ab899]::panicking::panic_handler::{closure#0}, !><unknown>
  1498. 47.99 s > at <unknown source file>:<unknown line>
  1499. 47.99 s > 6: __rustc[6c289b9f9c454d21]::rust_begin_unwind<unknown>
  1500. 47.99 s > at <unknown source file>:<unknown line>
  1501. 47.99 s > 7: core[940e698046960fd5]::panicking::panic_fmt<unknown>
  1502. 47.99 s > at <unknown source file>:<unknown line>
  1503. 47.99 s > 8: core[940e698046960fd5]::panicking::assert_failed_inner<unknown>
  1504. 47.99 s > at <unknown source file>:<unknown line>
  1505. 47.99 s > 9: core[940e698046960fd5]::panicking::assert_failed::<i64, i64><unknown>
  1506. 47.99 s > at <unknown source file>:<unknown line>
  1507. 47.99 s > 10: gammalooprs[972dff90865981f6]::cff::tests::stored_production_cff_uses_typed_energy_factor_ownership<unknown>
  1508. 47.99 s > at <unknown source file>:<unknown line>
  1509. 47.99 s > 11: <gammalooprs[972dff90865981f6]::cff::tests::stored_production_cff_uses_typed_energy_factor_ownership::{closure#0} as core[940e698046960fd5]::ops::function::FnOnce<()>>::call_once<unknown>
  1510. 47.99 s > at <unknown source file>:<unknown line>
  1511. 47.99 s > 12: test[75d6903177b1d7e9]::__rust_begin_short_backtrace::<core[940e698046960fd5]::result::Result<(), alloc[2ea6bcb46fca0c42]::string::String>, fn() -> core[940e698046960fd5]::result::Result<(), alloc[2ea6bcb46fca0c42]::string::String>><unknown>
  1512. 47.99 s > at <unknown source file>:<unknown line>
  1513. 47.99 s > 13: test[75d6903177b1d7e9]::run_test::{closure#0}<unknown>
  1514. 47.99 s > at <unknown source file>:<unknown line>
  1515. 47.99 s > 14: std[bcb96dfbba0ab899]::sys::backtrace::__rust_begin_short_backtrace::<test[75d6903177b1d7e9]::run_test::{closure#1}, ()><unknown>
  1516. 47.99 s > at <unknown source file>:<unknown line>
  1517. 47.99 s > 15: <std[bcb96dfbba0ab899]::thread::lifecycle::spawn_unchecked<test[75d6903177b1d7e9]::run_test::{closure#1}, ()>::{closure#1} as core[940e698046960fd5]::ops::function::FnOnce<()>>::call_once::{shim:vtable#0}<unknown>
  1518. 47.99 s > at <unknown source file>:<unknown line>
  1519. 47.99 s > 16: <std[bcb96dfbba0ab899]::sys::thread::unix::Thread>::new::thread_start<unknown>
  1520. 47.99 s > at <unknown source file>:<unknown line>
  1521. 47.99 s > 17: start_thread<unknown>
  1522. 47.99 s > at <unknown source file>:<unknown line>
  1523. 47.99 s > 18: __clone3<unknown>
  1524. 47.99 s > at <unknown source file>:<unknown line>
  1525. 47.99 s >
  1526. 47.99 s > Run with COLORBT_SHOW_HIDDEN=1 environment variable to disable frame filtering.
  1527. 47.99 s > Run with RUST_BACKTRACE=full to include source snippets.
  1528. 47.99 s >
  1529. 47.99 s > FAIL [ 0.108s] (483/561) gammalooprs uv::approx::local_3d::tests::production_emr_map_cancels_one_powered_denominator
  1530. 47.99 s > stdout ---
  1531. 47.99 s >
  1532. 47.99 s > running 1 test
  1533. 47.99 s > test uv::approx::local_3d::tests::production_emr_map_cancels_one_powered_denominator ... FAILED
  1534. 47.99 s >
  1535. 47.99 s > failures:
  1536. 47.99 s >
  1537. 47.99 s > failures:
  1538. 47.99 s > uv::approx::local_3d::tests::production_emr_map_cancels_one_powered_denominator
  1539. 47.99 s >
  1540. 47.99 s > test result: FAILED. 0 passed; 1 failed; 0 ignored; 0 measured; 611 filtered out; finished in 0.09s
  1541. 47.99 s >
  1542. 47.99 s > stderr ---
  1543. 47.99 s > The application panicked (crashed).
  1544. 47.99 s > Message: summed exact-source powered and selected lower channels differ: powered=-1𝑖/8/𝜋^3, lower=1𝑖/16/𝜋^3, difference=-3𝑖/16/𝜋^3
  1545. 47.99 s > Location: crates/gammalooprs/src/uv/approx/local_3d.rs:2047
  1546. 47.99 s >
  1547. 47.99 s > ━━━━━━━━━━━━━━━━━━━━━━━━━━━━━━━━━━ BACKTRACE ━━━━━━━━━━━━━━━━━━━━━━━━━━━━━━━━━━━
  1548. 47.99 s > 1: <color_eyre[51793ea62743adbd]::config::PanicHook>::panic_report<unknown>
  1549. 47.99 s > at <unknown source file>:<unknown line>
  1550. 47.99 s > 2: <color_eyre[51793ea62743adbd]::config::PanicHook>::into_panic_hook::{closure#0}<unknown>
  1551. 47.99 s > at <unknown source file>:<unknown line>
  1552. 47.99 s > 3: std[bcb96dfbba0ab899]::panicking::panic_with_hook<unknown>
  1553. 47.99 s > at <unknown source file>:<unknown line>
  1554. 47.99 s > 4: std[bcb96dfbba0ab899]::panicking::panic_handler::{closure#0}<unknown>
  1555. 47.99 s > at <unknown source file>:<unknown line>
  1556. 47.99 s > 5: std[bcb96dfbba0ab899]::sys::backtrace::__rust_end_short_backtrace::<std[bcb96dfbba0ab899]::panicking::panic_handler::{closure#0}, !><unknown>
  1557. 47.99 s > at <unknown source file>:<unknown line>
  1558. 47.99 s > 6: __rustc[6c289b9f9c454d21]::rust_begin_unwind<unknown>
  1559. 47.99 s > at <unknown source file>:<unknown line>
  1560. 47.99 s > 7: core[940e698046960fd5]::panicking::panic_fmt<unknown>
  1561. 47.99 s > at <unknown source file>:<unknown line>
  1562. 47.99 s > 8: gammalooprs[972dff90865981f6]::uv::approx::local_3d::tests::production_emr_map_cancels_one_powered_denominator<unknown>
  1563. 47.99 s > at <unknown source file>:<unknown line>
  1564. 47.99 s > 9: <gammalooprs[972dff90865981f6]::uv::approx::local_3d::tests::production_emr_map_cancels_one_powered_denominator::{closure#0} as core[940e698046960fd5]::ops::function::FnOnce<()>>::call_once<unknown>
  1565. 47.99 s > at <unknown source file>:<unknown line>
  1566. 47.99 s > 10: test[75d6903177b1d7e9]::__rust_begin_short_backtrace::<core[940e698046960fd5]::result::Result<(), alloc[2ea6bcb46fca0c42]::string::String>, fn() -> core[940e698046960fd5]::result::Result<(), alloc[2ea6bcb46fca0c42]::string::String>><unknown>
  1567. 47.99 s > at <unknown source file>:<unknown line>
  1568. 47.99 s > 11: test[75d6903177b1d7e9]::run_test::{closure#0}<unknown>
  1569. 47.99 s > at <unknown source file>:<unknown line>
  1570. 47.99 s > 12: std[bcb96dfbba0ab899]::sys::backtrace::__rust_begin_short_backtrace::<test[75d6903177b1d7e9]::run_test::{closure#1}, ()><unknown>
  1571. 47.99 s > at <unknown source file>:<unknown line>
  1572. 47.99 s > 13: <std[bcb96dfbba0ab899]::thread::lifecycle::spawn_unchecked<test[75d6903177b1d7e9]::run_test::{closure#1}, ()>::{closure#1} as core[940e698046960fd5]::ops::function::FnOnce<()>>::call_once::{shim:vtable#0}<unknown>
  1573. 47.99 s > at <unknown source file>:<unknown line>
  1574. 47.99 s > 14: <std[bcb96dfbba0ab899]::sys::thread::unix::Thread>::new::thread_start<unknown>
  1575. 47.99 s > at <unknown source file>:<unknown line>
  1576. 47.99 s > 15: start_thread<unknown>
  1577. 47.99 s > at <unknown source file>:<unknown line>
  1578. 47.99 s > 16: __clone3<unknown>
  1579. 47.99 s > at <unknown source file>:<unknown line>
  1580. 47.99 s >
  1581. 47.99 s > Run with COLORBT_SHOW_HIDDEN=1 environment variable to disable frame filtering.
  1582. 47.99 s > Run with RUST_BACKTRACE=full to include source snippets.
  1583. 47.99 s >
  1584. 47.99 s > FAIL [ 0.424s] (539/561) gammalooprs uv::hedge_poset::tests::spectacles_typed_4d_projects_after_local_construction
  1585. 47.99 s > stdout ---
  1586. 47.99 s >
  1587. 47.99 s > running 1 test
  1588. 47.99 s > digraph {
  1589. 47.99 s > node [shape=circle,height=0.1,label=""];
  1590. 47.99 s > overlap = "scale";
  1591. 47.99 s > layout = "neato";
  1592. 47.99 s > start=2;
  1593. 47.99 s > 4 [label="0"];
  1594. 47.99 s > 1 [label="zw"];
  1595. 47.99 s > 2 [label="F"];
  1596. 47.99 s > 0 [label="143"];
  1597. 47.99 s > 3 [label="10B"];
  1598. 47.99 s > 4:0:s -> 1:1:s [id=0 color="red:blue;0.5" label="zw"];
  1599. 47.99 s > 4:2:s -> 2:3:s [id=1 color="red:blue;0.5" label="F"];
  1600. 47.99 s > 3:5:s -> 0:4:s [id=2 color="red:blue;0.5" label="143"];
  1601. 47.99 s > 4:6:s -> 0:7:s [id=3 color="red:blue;0.5" label="143"];
  1602. 47.99 s > 1:8:s -> 3:9:s [id=4 color="red:blue;0.5" label="F"];
  1603. 47.99 s > 1:10:s -> 0:11:s [id=5 color="red:blue;0.5" label="143"];
  1604. 47.99 s > 2:12:s -> 3:13:s [id=6 color="red:blue;0.5" label="zw"];
  1605. 47.99 s > 2:14:s -> 0:15:s [id=7 color="red:blue;0.5" label="143"];
  1606. 47.99 s > }
  1607. 47.99 s >
  1608. 47.99 s > digraph {
  1609. 47.99 s > node [shape=circle,height=0.1,label=""];
  1610. 47.99 s > overlap = "scale";
  1611. 47.99 s > layout = "neato";
  1612. 47.99 s > start=2;
  1613. 47.99 s > 0 [label="∅"];
  1614. 47.99 s > 1 [label="{zw}: Approx(S_zw(0))"];
  1615. 47.99 s > 2 [label="{F}: Approx(S_F(1))"];
  1616. 47.99 s > 3 [label="{143}: Approx(S_143(3))"];
  1617. 47.99 s > 4 [label="{zw,F}: Approx(S_F(4))*Approx(S_zw(0))"];
  1618. 47.99 s > 5 [label="{zw} · {143}: Approx((-1*S_zw+S_143(5))*Approx(S_zw(0)))"];
  1619. 47.99 s > 6 [label="{F} · {143}: Approx((-1*S_F+S_143(7))*Approx(S_F(1)))"];
  1620. 47.99 s > 7 [label="{zw,F} · {143}: Approx((-1*S_10B+S_143(2))*Approx(S_F(4))*Approx(S_zw(0)))"];
  1621. 47.99 s > 0:0:s -> 1:1:s [id=0 color="red:blue;0.5"];
  1622. 47.99 s > 0:2:s -> 2:3:s [id=1 color="red:blue;0.5"];
  1623. 47.99 s > 0:4:s -> 3:5:s [id=2 color="red:blue;0.5"];
  1624. 47.99 s > 1:6:s -> 4:7:s [id=3 color="red:blue;0.5"];
  1625. 47.99 s > 1:8:s -> 5:9:s [id=4 color="red:blue;0.5"];
  1626. 47.99 s > 2:10:s -> 4:11:s [id=5 color="red:blue;0.5"];
  1627. 47.99 s > 2:12:s -> 6:13:s [id=6 color="red:blue;0.5"];
  1628. 47.99 s > 4:14:s -> 7:15:s [id=7 color="red:blue;0.5"];
  1629. 47.99 s > }
  1630. 47.99 s >
  1631. 47.99 s > test uv::hedge_poset::tests::spectacles_typed_4d_projects_after_local_construction ... FAILED
  1632. 47.99 s >
  1633. 47.99 s > failures:
  1634. 47.99 s >
  1635. 47.99 s > failures:
  1636. 47.99 s > uv::hedge_poset::tests::spectacles_typed_4d_projects_after_local_construction
  1637. 47.99 s >
  1638. 47.99 s > test result: FAILED. 0 passed; 1 failed; 0 ignored; 0 measured; 611 filtered out; finished in 0.39s
  1639. 47.99 s >
  1640. 47.99 s > stderr ---
  1641. 47.99 s > Error:
  1642. 47.99 s > 0: failed to extract three-dimensional representation graph input: source edge 1 has no unique routing for rewritten exact signature [-1, 0, 0] modulo the factorized opposite-domain loop span
  1643. 47.99 s >
  1644. 47.99 s > Location:
  1645. 47.99 s > crates/gammalooprs/src/uv/approx/local_3d.rs:845
  1646. 47.99 s >
  1647. 47.99 s > ━━━━━━━━━━━━━━━━━━━━━━━━━━━━━━━━━━ BACKTRACE ━━━━━━━━━━━━━━━━━━━━━━━━━━━━━━━━━━━
  1648. 47.99 s > 1: <color_eyre[51793ea62743adbd]::config::EyreHook>::into_eyre_hook::{closure#0}<unknown>
  1649. 47.99 s > at <unknown source file>:<unknown line>
  1650. 47.99 s > 2: eyre[cb2fd339c0c40fca]::capture_handler<unknown>
  1651. 47.99 s > at <unknown source file>:<unknown line>
  1652. 47.99 s > 3: <eyre[cb2fd339c0c40fca]::Report>::from_std::<three_dimensional_reps[3cb572ff22d197ac]::graph_io::GraphIoError><unknown>
  1653. 47.99 s > at <unknown source file>:<unknown line>
  1654. 47.99 s > 4: <gammalooprs[972dff90865981f6]::uv::approx::local_3d::Localizer>::project_4d<unknown>
  1655. 47.99 s > at <unknown source file>:<unknown line>
  1656. 47.99 s > 5: gammalooprs[972dff90865981f6]::uv::hedge_poset::tests::spectacles_typed_4d_projects_after_local_construction<unknown>
  1657. 47.99 s > at <unknown source file>:<unknown line>
  1658. 47.99 s > 6: <gammalooprs[972dff90865981f6]::uv::hedge_poset::tests::spectacles_typed_4d_projects_after_local_construction::{closure#0} as core[940e698046960fd5]::ops::function::FnOnce<()>>::call_once<unknown>
  1659. 47.99 s > at <unknown source file>:<unknown line>
  1660. 47.99 s > 7: test[75d6903177b1d7e9]::__rust_begin_short_backtrace::<core[940e698046960fd5]::result::Result<(), alloc[2ea6bcb46fca0c42]::string::String>, fn() -> core[940e698046960fd5]::result::Result<(), alloc[2ea6bcb46fca0c42]::string::String>><unknown>
  1661. 47.99 s > at <unknown source file>:<unknown line>
  1662. 47.99 s > 8: test[75d6903177b1d7e9]::run_test::{closure#0}<unknown>
  1663. 47.99 s > at <unknown source file>:<unknown line>
  1664. 47.99 s > 9: std[bcb96dfbba0ab899]::sys::backtrace::__rust_begin_short_backtrace::<test[75d6903177b1d7e9]::run_test::{closure#1}, ()><unknown>
  1665. 47.99 s > at <unknown source file>:<unknown line>
  1666. 47.99 s > 10: <std[bcb96dfbba0ab899]::thread::lifecycle::spawn_unchecked<test[75d6903177b1d7e9]::run_test::{closure#1}, ()>::{closure#1} as core[940e698046960fd5]::ops::function::FnOnce<()>>::call_once::{shim:vtable#0}<unknown>
  1667. 47.99 s > at <unknown source file>:<unknown line>
  1668. 47.99 s > 11: <std[bcb96dfbba0ab899]::sys::thread::unix::Thread>::new::thread_start<unknown>
  1669. 47.99 s > at <unknown source file>:<unknown line>
  1670. 47.99 s > 12: start_thread<unknown>
  1671. 47.99 s > at <unknown source file>:<unknown line>
  1672. 47.99 s > 13: __clone3<unknown>
  1673. 47.99 s > at <unknown source file>:<unknown line>
  1674. 47.99 s >
  1675. 47.99 s > Run with COLORBT_SHOW_HIDDEN=1 environment variable to disable frame filtering.
  1676. 47.99 s > Run with RUST_BACKTRACE=full to include source snippets.
  1677. 47.99 s >
  1678. 47.99 s > FAIL [ 9.979s] (558/561) gammalooprs uv::tests::scalars_profile
  1679. 47.99 s > stdout ---
  1680. 47.99 s >
  1681. 47.99 s > running 1 test
  1682. 47.99 s > test uv::tests::scalars_profile ... FAILED
  1683. 47.99 s >
  1684. 47.99 s > failures:
  1685. 47.99 s >
  1686. 47.99 s > failures:
  1687. 47.99 s > uv::tests::scalars_profile
  1688. 47.99 s >
  1689. 47.99 s > test result: FAILED. 0 passed; 1 failed; 0 ignored; 0 measured; 611 filtered out; finished in 9.96s
  1690. 47.99 s >
  1691. 47.99 s > stderr ---
  1692. 47.99 s > [18:17:53.343] @gammalooprs::settings::runtime WARNING : No external kinematics were provided; using default-generated external momenta and helicities.
  1693. 47.99 s > field value
  1694. 47.99 s > span build_integrand{amplitude.name=bub}
  1695. 47.99 s > at crates/gammalooprs/src/settings/runtime.rs:131
  1696. 47.99 s > [18:17:53.344] @gammalooprs::integrands::process::amplitude INFO : Input is below threshold: 0 existing threshold E-surfaces across 0/3 graph groups
  1697. 47.99 s > field value
  1698. 47.99 s > existing_esurfaces 0
  1699. 47.99 s > group_count 3
  1700. 47.99 s > groups_above_threshold 0
  1701. 47.99 s > integrand bub
  1702. 47.99 s > span warm_up{integrand.name=bub}
  1703. 47.99 s > threshold_status below threshold
  1704. 47.99 s > at crates/gammalooprs/src/integrands/process/amplitude/mod.rs:1666
  1705. 47.99 s > [18:17:53.345] @gammalooprs::integrands::process::amplitude INFO : overlap structure of group 0: [0: []]
  1706. 47.99 s > field value
  1707. 47.99 s > span warm_up{integrand.name=bub}
  1708. 47.99 s > at crates/gammalooprs/src/integrands/process/amplitude/mod.rs:2015
  1709. 47.99 s > [18:17:53.345] @gammalooprs::integrands::process::amplitude INFO : overlap structure of group 1: [0: []]
  1710. 47.99 s > field value
  1711. 47.99 s > span warm_up{integrand.name=bub}
  1712. 47.99 s > at crates/gammalooprs/src/integrands/process/amplitude/mod.rs:2015
  1713. 47.99 s > [18:17:53.345] @gammalooprs::integrands::process::amplitude INFO : overlap structure of group 2: [0: []]
  1714. 47.99 s > field value
  1715. 47.99 s > span warm_up{integrand.name=bub}
  1716. 47.99 s > at crates/gammalooprs/src/integrands/process/amplitude/mod.rs:2015
  1717. 47.99 s > The application panicked (crashed).
  1718. 47.99 s > Message: assertion `left == right` failed: subtracted scalar UV profile failed:
  1719. 47.99 s > UVProfilePassFail {
  1720. 47.99 s > max_dod: -0.9,
  1721. 47.99 s > total: 16,
  1722. 47.99 s > failed: 1,
  1723. 47.99 s > failures: [
  1724. 47.99 s > UVProfileFailure {
  1725. 47.99 s > graph_index: 0,
  1726. 47.99 s > graph_name: "banana",
  1727. 47.99 s > cutkosky_cut: None,
  1728. 47.99 s > lmb_index: 1,
  1729. 47.99 s > fixed: [
  1730. 47.99 s > EdgeIndex(
  1731. 47.99 s > 2,
  1732. 47.99 s > ),
  1733. 47.99 s > EdgeIndex(
  1734. 47.99 s > 0,
  1735. 47.99 s > ),
  1736. 47.99 s > ],
  1737. 47.99 s > free: [
  1738. 47.99 s > EdgeIndex(
  1739. 47.99 s > 3,
  1740. 47.99 s > ),
  1741. 47.99 s > ],
  1742. 47.99 s > orientation_label: None,
  1743. 47.99 s > reason: "dod_exceeds_threshold",
  1744. 47.99 s > },
  1745. 47.99 s > ],
  1746. 47.99 s > }
  1747. 47.99 s >
  1748. 47.99 s > ╭─────────┬────────────┬───────────┬───────┬─────┬──────────┬───────────╮
  1749. 47.99 s > │ fixed │ → ∞ │ slope │ r2 │ DOD │ bare DOD │ inspect │
  1750. 47.99 s > ├─────────┼────────────┼───────────┼───────┼─────┼──────────┼───────────┤
  1751. 47.99 s > │ {e1,e2} │ {e3} │ -0.996752 │ 1.000 │ -1 │ 0 │ arb retry │
  1752. 47.99 s > │ {e1,e3} │ {e2} │ -1.065665 │ 0.997 │ -1 │ 0 │ arb retry │
  1753. 47.99 s > │ {e1} │ {e2,e3} │ -0.937151 │ 0.943 │ -1 │ 2 │ │
  1754. 47.99 s > │ {e2,e3} │ {e1} │ -1.001075 │ 1.000 │ -1 │ 0 │ arb retry │
  1755. 47.99 s > │ {e2} │ {e1,e3} │ -0.984146 │ 0.998 │ -1 │ 2 │ │
  1756. 47.99 s > │ {e3} │ {e1,e2} │ -1.383911 │ 0.982 │ -1 │ 2 │ arb retry │
  1757. 47.99 s > │ {} │ {e1,e2,e3} │ -1.094213 │ 0.258 │ -1 │ 4 │ │
  1758. 47.99 s > │ {e2,e0} │ {e3} │ -0.803348 │ 0.861 │ -1 │ 0 │ arb retry │
  1759. 47.99 s > │ {e3,e0} │ {e2} │ -0.999257 │ 1.000 │ -1 │ 0 │ │
  1760. 47.99 s > │ {e0} │ {e2,e3} │ -1.000893 │ 1.000 │ -1 │ 2 │ │
  1761. 47.99 s > │ {e1,e0} │ {e3} │ -0.997860 │ 1.000 │ -1 │ 0 │ │
  1762. 47.99 s > ╰─────────┴────────────┴───────────┴───────┴─────┴──────────┴───────────╯
  1763. 47.99 s >
  1764. 47.99 s > ╭───────┬─────────┬───────────┬───────┬─────┬──────────┬───────────╮
  1765. 47.99 s > │ fixed │ → ∞ │ slope │ r2 │ DOD │ bare DOD │ inspect │
  1766. 47.99 s > ├───────┼─────────┼───────────┼───────┼─────┼──────────┼───────────┤
  1767. 47.99 s > │ {e1} │ {e2} │ -1.005039 │ 1.000 │ -1 │ 0 │ arb retry │
  1768. 47.99 s > │ {e2} │ {e1} │ -1.001098 │ 1.000 │ -1 │ 0 │ arb retry │
  1769. 47.99 s > │ {} │ {e1,e2} │ -1.011289 │ 1.000 │ -1 │ 2 │ │
  1770. 47.99 s > │ {e0} │ {e2} │ -0.998140 │ 1.000 │ -1 │ 0 │ │
  1771. 47.99 s > ╰───────┴─────────┴───────────┴───────┴─────┴──────────┴───────────╯
  1772. 47.99 s >
  1773. 47.99 s > ╭───────┬──────┬───────────┬───────┬─────┬──────────┬─────────╮
  1774. 47.99 s > │ fixed │ → ∞ │ slope │ r2 │ DOD │ bare DOD │ inspect │
  1775. 47.99 s > ├───────┼──────┼───────────┼───────┼─────┼──────────┼─────────┤
  1776. 47.99 s > │ {} │ {e1} │ -0.989949 │ 1.000 │ -1 │ 0 │ │
  1777. 47.99 s > ╰───────┴──────┴───────────┴───────┴─────┴──────────┴─────────╯
  1778. 47.99 s > left: 1
  1779. 47.99 s > right: 0
  1780. 47.99 s > Location: crates/gammalooprs/src/uv/tests.rs:259
  1781. 47.99 s >
  1782. 47.99 s > ━━━━━━━━━━━━━━━━━━━━━━━━━━━━━━━━━━ BACKTRACE ━━━━━━━━━━━━━━━━━━━━━━━━━━━━━━━━━━━
  1783. 47.99 s > 1: <color_eyre[51793ea62743adbd]::config::PanicHook>::panic_report<unknown>
  1784. 47.99 s > at <unknown source file>:<unknown line>
  1785. 47.99 s > 2: <color_eyre[51793ea62743adbd]::config::PanicHook>::into_panic_hook::{closure#0}<unknown>
  1786. 47.99 s > at <unknown source file>:<unknown line>
  1787. 47.99 s > 3: std[bcb96dfbba0ab899]::panicking::panic_with_hook<unknown>
  1788. 47.99 s > at <unknown source file>:<unknown line>
  1789. 47.99 s > 4: std[bcb96dfbba0ab899]::panicking::panic_handler::{closure#0}<unknown>
  1790. 47.99 s > at <unknown source file>:<unknown line>
  1791. 47.99 s > 5: std[bcb96dfbba0ab899]::sys::backtrace::__rust_end_short_backtrace::<std[bcb96dfbba0ab899]::panicking::panic_handler::{closure#0}, !><unknown>
  1792. 47.99 s > at <unknown source file>:<unknown line>
  1793. 47.99 s > 6: __rustc[6c289b9f9c454d21]::rust_begin_unwind<unknown>
  1794. 47.99 s > at <unknown source file>:<unknown line>
  1795. 47.99 s > 7: core[940e698046960fd5]::panicking::panic_fmt<unknown>
  1796. 47.99 s > at <unknown source file>:<unknown line>
  1797. 47.99 s > 8: core[940e698046960fd5]::panicking::assert_failed_inner<unknown>
  1798. 47.99 s > at <unknown source file>:<unknown line>
  1799. 47.99 s > 9: core[940e698046960fd5]::panicking::assert_failed::<usize, usize><unknown>
  1800. 47.99 s > at <unknown source file>:<unknown line>
  1801. 47.99 s > 10: gammalooprs[972dff90865981f6]::uv::tests::scalars_profile<unknown>
  1802. 47.99 s > at <unknown source file>:<unknown line>
  1803. 47.99 s > 11: <gammalooprs[972dff90865981f6]::uv::tests::scalars_profile::{closure#0} as core[940e698046960fd5]::ops::function::FnOnce<()>>::call_once<unknown>
  1804. 47.99 s > at <unknown source file>:<unknown line>
  1805. 47.99 s > 12: test[75d6903177b1d7e9]::__rust_begin_short_backtrace::<core[940e698046960fd5]::result::Result<(), alloc[2ea6bcb46fca0c42]::string::String>, fn() -> core[940e698046960fd5]::result::Result<(), alloc[2ea6bcb46fca0c42]::string::String>><unknown>
  1806. 47.99 s > at <unknown source file>:<unknown line>
  1807. 47.99 s > 13: test[75d6903177b1d7e9]::run_test::{closure#0}<unknown>
  1808. 47.99 s > at <unknown source file>:<unknown line>
  1809. 47.99 s > 14: std[bcb96dfbba0ab899]::sys::backtrace::__rust_begin_short_backtrace::<test[75d6903177b1d7e9]::run_test::{closure#1}, ()><unknown>
  1810. 47.99 s > at <unknown source file>:<unknown line>
  1811. 47.99 s > 15: <std[bcb96dfbba0ab899]::thread::lifecycle::spawn_unchecked<test[75d6903177b1d7e9]::run_test::{closure#1}, ()>::{closure#1} as core[940e698046960fd5]::ops::function::FnOnce<()>>::call_once::{shim:vtable#0}<unknown>
  1812. 47.99 s > at <unknown source file>:<unknown line>
  1813. 47.99 s > 16: <std[bcb96dfbba0ab899]::sys::thread::unix::Thread>::new::thread_start<unknown>
  1814. 47.99 s > at <unknown source file>:<unknown line>
  1815. 47.99 s > 17: start_thread<unknown>
  1816. 47.99 s > at <unknown source file>:<unknown line>
  1817. 47.99 s > 18: __clone3<unknown>
  1818. 47.99 s > at <unknown source file>:<unknown line>
  1819. 47.99 s >
  1820. 47.99 s > Run with COLORBT_SHOW_HIDDEN=1 environment variable to disable frame filtering.
  1821. 47.99 s > Run with RUST_BACKTRACE=full to include source snippets.
  1822. 47.99 s >
  1823. 47.99 s > FAIL [ 11.152s] (559/561) gammalooprs uv::tests::scalars_profile_new
  1824. 47.99 s > stdout ---
  1825. 47.99 s >
  1826. 47.99 s > running 1 test
  1827. 47.99 s > test uv::tests::scalars_profile_new ... FAILED
  1828. 47.99 s >
  1829. 47.99 s > failures:
  1830. 47.99 s >
  1831. 47.99 s > failures:
  1832. 47.99 s > uv::tests::scalars_profile_new
  1833. 47.99 s >
  1834. 47.99 s > test result: FAILED. 0 passed; 1 failed; 0 ignored; 0 measured; 611 filtered out; finished in 11.13s
  1835. 47.99 s >
  1836. 47.99 s > stderr ---
  1837. 47.99 s > [18:17:54.561] @gammalooprs::settings::runtime WARNING : No external kinematics were provided; using default-generated external momenta and helicities.
  1838. 47.99 s > field value
  1839. 47.99 s > span build_integrand{amplitude.name=bub}
  1840. 47.99 s > at crates/gammalooprs/src/settings/runtime.rs:131
  1841. 47.99 s > [18:17:54.562] @gammalooprs::integrands::process::amplitude INFO : Input is below threshold: 0 existing threshold E-surfaces across 0/3 graph groups
  1842. 47.99 s > field value
  1843. 47.99 s > existing_esurfaces 0
  1844. 47.99 s > group_count 3
  1845. 47.99 s > groups_above_threshold 0
  1846. 47.99 s > integrand bub
  1847. 47.99 s > span warm_up{integrand.name=bub}
  1848. 47.99 s > threshold_status below threshold
  1849. 47.99 s > at crates/gammalooprs/src/integrands/process/amplitude/mod.rs:1666
  1850. 47.99 s > [18:17:54.562] @gammalooprs::integrands::process::amplitude INFO : overlap structure of group 0: [0: []]
  1851. 47.99 s > field value
  1852. 47.99 s > span warm_up{integrand.name=bub}
  1853. 47.99 s > at crates/gammalooprs/src/integrands/process/amplitude/mod.rs:2015
  1854. 47.99 s > [18:17:54.562] @gammalooprs::integrands::process::amplitude INFO : overlap structure of group 1: [0: []]
  1855. 47.99 s > field value
  1856. 47.99 s > span warm_up{integrand.name=bub}
  1857. 47.99 s > at crates/gammalooprs/src/integrands/process/amplitude/mod.rs:2015
  1858. 47.99 s > [18:17:54.562] @gammalooprs::integrands::process::amplitude INFO : overlap structure of group 2: [0: []]
  1859. 47.99 s > field value
  1860. 47.99 s > span warm_up{integrand.name=bub}
  1861. 47.99 s > at crates/gammalooprs/src/integrands/process/amplitude/mod.rs:2015
  1862. 47.99 s > The application panicked (crashed).
  1863. 47.99 s > Message: assertion `left == right` failed: subtracted scalar UV profile failed:
  1864. 47.99 s > UVProfilePassFail {
  1865. 47.99 s > max_dod: -0.9,
  1866. 47.99 s > total: 16,
  1867. 47.99 s > failed: 1,
  1868. 47.99 s > failures: [
  1869. 47.99 s > UVProfileFailure {
  1870. 47.99 s > graph_index: 0,
  1871. 47.99 s > graph_name: "banana",
  1872. 47.99 s > cutkosky_cut: None,
  1873. 47.99 s > lmb_index: 1,
  1874. 47.99 s > fixed: [
  1875. 47.99 s > EdgeIndex(
  1876. 47.99 s > 2,
  1877. 47.99 s > ),
  1878. 47.99 s > EdgeIndex(
  1879. 47.99 s > 0,
  1880. 47.99 s > ),
  1881. 47.99 s > ],
  1882. 47.99 s > free: [
  1883. 47.99 s > EdgeIndex(
  1884. 47.99 s > 3,
  1885. 47.99 s > ),
  1886. 47.99 s > ],
  1887. 47.99 s > orientation_label: None,
  1888. 47.99 s > reason: "dod_exceeds_threshold",
  1889. 47.99 s > },
  1890. 47.99 s > ],
  1891. 47.99 s > }
  1892. 47.99 s >
  1893. 47.99 s > ╭─────────┬────────────┬───────────┬───────┬─────┬──────────┬───────────╮
  1894. 47.99 s > │ fixed │ → ∞ │ slope │ r2 │ DOD │ bare DOD │ inspect │
  1895. 47.99 s > ├─────────┼────────────┼───────────┼───────┼─────┼──────────┼───────────┤
  1896. 47.99 s > │ {e1,e2} │ {e3} │ -0.996752 │ 1.000 │ -1 │ 0 │ arb retry │
  1897. 47.99 s > │ {e1,e3} │ {e2} │ -1.065665 │ 0.997 │ -1 │ 0 │ arb retry │
  1898. 47.99 s > │ {e1} │ {e2,e3} │ -0.937151 │ 0.943 │ -1 │ 2 │ │
  1899. 47.99 s > │ {e2,e3} │ {e1} │ -1.001075 │ 1.000 │ -1 │ 0 │ arb retry │
  1900. 47.99 s > │ {e2} │ {e1,e3} │ -0.984146 │ 0.998 │ -1 │ 2 │ │
  1901. 47.99 s > │ {e3} │ {e1,e2} │ -1.383911 │ 0.982 │ -1 │ 2 │ arb retry │
  1902. 47.99 s > │ {} │ {e1,e2,e3} │ -1.094213 │ 0.258 │ -1 │ 4 │ │
  1903. 47.99 s > │ {e2,e0} │ {e3} │ -0.803348 │ 0.861 │ -1 │ 0 │ arb retry │
  1904. 47.99 s > │ {e3,e0} │ {e2} │ -0.999257 │ 1.000 │ -1 │ 0 │ │
  1905. 47.99 s > │ {e0} │ {e2,e3} │ -1.000893 │ 1.000 │ -1 │ 2 │ │
  1906. 47.99 s > │ {e1,e0} │ {e3} │ -0.997860 │ 1.000 │ -1 │ 0 │ │
  1907. 47.99 s > ╰─────────┴────────────┴───────────┴───────┴─────┴──────────┴───────────╯
  1908. 47.99 s >
  1909. 47.99 s > ╭───────┬─────────┬───────────┬───────┬─────┬──────────┬───────────╮
  1910. 47.99 s > │ fixed │ → ∞ │ slope │ r2 │ DOD │ bare DOD │ inspect │
  1911. 47.99 s > ├───────┼─────────┼───────────┼───────┼─────┼──────────┼───────────┤
  1912. 47.99 s > │ {e1} │ {e2} │ -1.005039 │ 1.000 │ -1 │ 0 │ arb retry │
  1913. 47.99 s > │ {e2} │ {e1} │ -1.001098 │ 1.000 │ -1 │ 0 │ arb retry │
  1914. 47.99 s > │ {} │ {e1,e2} │ -1.011289 │ 1.000 │ -1 │ 2 │ │
  1915. 47.99 s > │ {e0} │ {e2} │ -0.998140 │ 1.000 │ -1 │ 0 │ │
  1916. 47.99 s > ╰───────┴─────────┴───────────┴───────┴─────┴──────────┴───────────╯
  1917. 47.99 s >
  1918. 47.99 s > ╭───────┬──────┬───────────┬───────┬─────┬──────────┬─────────╮
  1919. 47.99 s > │ fixed │ → ∞ │ slope │ r2 │ DOD │ bare DOD │ inspect │
  1920. 47.99 s > ├───────┼──────┼───────────┼───────┼─────┼──────────┼─────────┤
  1921. 47.99 s > │ {} │ {e1} │ -0.989949 │ 1.000 │ -1 │ 0 │ │
  1922. 47.99 s > ╰───────┴──────┴───────────┴───────┴─────┴──────────┴─────────╯
  1923. 47.99 s > left: 1
  1924. 47.99 s > right: 0
  1925. 47.99 s > Location: crates/gammalooprs/src/uv/tests.rs:325
  1926. 47.99 s >
  1927. 47.99 s > ━━━━━━━━━━━━━━━━━━━━━━━━━━━━━━━━━━ BACKTRACE ━━━━━━━━━━━━━━━━━━━━━━━━━━━━━━━━━━━
  1928. 47.99 s > 1: <color_eyre[51793ea62743adbd]::config::PanicHook>::panic_report<unknown>
  1929. 47.99 s > at <unknown source file>:<unknown line>
  1930. 47.99 s > 2: <color_eyre[51793ea62743adbd]::config::PanicHook>::into_panic_hook::{closure#0}<unknown>
  1931. 47.99 s > at <unknown source file>:<unknown line>
  1932. 47.99 s > 3: std[bcb96dfbba0ab899]::panicking::panic_with_hook<unknown>
  1933. 47.99 s > at <unknown source file>:<unknown line>
  1934. 47.99 s > 4: std[bcb96dfbba0ab899]::panicking::panic_handler::{closure#0}<unknown>
  1935. 47.99 s > at <unknown source file>:<unknown line>
  1936. 47.99 s > 5: std[bcb96dfbba0ab899]::sys::backtrace::__rust_end_short_backtrace::<std[bcb96dfbba0ab899]::panicking::panic_handler::{closure#0}, !><unknown>
  1937. 47.99 s > at <unknown source file>:<unknown line>
  1938. 47.99 s > 6: __rustc[6c289b9f9c454d21]::rust_begin_unwind<unknown>
  1939. 47.99 s > at <unknown source file>:<unknown line>
  1940. 47.99 s > 7: core[940e698046960fd5]::panicking::panic_fmt<unknown>
  1941. 47.99 s > at <unknown source file>:<unknown line>
  1942. 47.99 s > 8: core[940e698046960fd5]::panicking::assert_failed_inner<unknown>
  1943. 47.99 s > at <unknown source file>:<unknown line>
  1944. 47.99 s > 9: core[940e698046960fd5]::panicking::assert_failed::<usize, usize><unknown>
  1945. 47.99 s > at <unknown source file>:<unknown line>
  1946. 47.99 s > 10: gammalooprs[972dff90865981f6]::uv::tests::scalars_profile_new<unknown>
  1947. 47.99 s > at <unknown source file>:<unknown line>
  1948. 47.99 s > 11: <gammalooprs[972dff90865981f6]::uv::tests::scalars_profile_new::{closure#0} as core[940e698046960fd5]::ops::function::FnOnce<()>>::call_once<unknown>
  1949. 47.99 s > at <unknown source file>:<unknown line>
  1950. 47.99 s > 12: test[75d6903177b1d7e9]::__rust_begin_short_backtrace::<core[940e698046960fd5]::result::Result<(), alloc[2ea6bcb46fca0c42]::string::String>, fn() -> core[940e698046960fd5]::result::Result<(), alloc[2ea6bcb46fca0c42]::string::String>><unknown>
  1951. 47.99 s > at <unknown source file>:<unknown line>
  1952. 47.99 s > 13: test[75d6903177b1d7e9]::run_test::{closure#0}<unknown>
  1953. 47.99 s > at <unknown source file>:<unknown line>
  1954. 47.99 s > 14: std[bcb96dfbba0ab899]::sys::backtrace::__rust_begin_short_backtrace::<test[75d6903177b1d7e9]::run_test::{closure#1}, ()><unknown>
  1955. 47.99 s > at <unknown source file>:<unknown line>
  1956. 47.99 s > 15: <std[bcb96dfbba0ab899]::thread::lifecycle::spawn_unchecked<test[75d6903177b1d7e9]::run_test::{closure#1}, ()>::{closure#1} as core[940e698046960fd5]::ops::function::FnOnce<()>>::call_once::{shim:vtable#0}<unknown>
  1957. 47.99 s > at <unknown source file>:<unknown line>
  1958. 47.99 s > 16: <std[bcb96dfbba0ab899]::sys::thread::unix::Thread>::new::thread_start<unknown>
  1959. 47.99 s > at <unknown source file>:<unknown line>
  1960. 47.99 s > 17: start_thread<unknown>
  1961. 47.99 s > at <unknown source file>:<unknown line>
  1962. 47.99 s > 18: __clone3<unknown>
  1963. 47.99 s > at <unknown source file>:<unknown line>
  1964. 47.99 s >
  1965. 47.99 s > Run with COLORBT_SHOW_HIDDEN=1 environment variable to disable frame filtering.
  1966. 47.99 s > Run with RUST_BACKTRACE=full to include source snippets.
  1967. 47.99 s >
  1968. 47.99 s > error: test run failed
  1969. 47.99 s >
  1970. 47.99 s > ========== nextest test summary ==========
  1971. 47.99 s > report: target/nextest/ci_gammaloop/junit.xml
  1972. 47.99 s > tests: 561, failures: 5, errors: 0
  1973. 47.99 s >
  1974. 47.99 s > 1. gammalooprs::cff::tests::stored_production_cff_uses_typed_energy_factor_ownership
  1975. 47.99 s > failure: test failure with exit code 101
  1976. 47.99 s > system-out
  1977. 47.99 s > running 1 test
  1978. 47.99 s > test cff::tests::stored_production_cff_uses_typed_energy_factor_ownership ... FAILED
  1979. 47.99 s >
  1980. 47.99 s > failures:
  1981. 47.99 s >
  1982. 47.99 s > failures:
  1983. 47.99 s > cff::tests::stored_production_cff_uses_typed_energy_factor_ownership
  1984. 47.99 s >
  1985. 47.99 s > test result: FAILED. 0 passed; 1 failed; 0 ignored; 0 measured; 611 filtered out; finished in 0.15s
  1986. 47.99 s > system-err
  1987. 47.99 s > The application panicked (crashed).
  1988. 47.99 s > Message: assertion `left == right` failed
  1989. 47.99 s > left: 1
  1990. 47.99 s > right: -1
  1991. 47.99 s > Location: crates/gammalooprs/src/cff/mod.rs:2721
  1992. 47.99 s >
  1993. 47.99 s > ━━━━━━━━━━━━━━━━━━━━━━━━━━━━━━━━━━ BACKTRACE ━━━━━━━━━━━━━━━━━━━━━━━━━━━━━━━━━━━
  1994. 47.99 s > 1: <color_eyre[51793ea62743adbd]::config::PanicHook>::panic_report<unknown>
  1995. 47.99 s > at <unknown source file>:<unknown line>
  1996. 47.99 s > 2: <color_eyre[51793ea62743adbd]::config::PanicHook>::into_panic_hook::{closure#0}<unknown>
  1997. 47.99 s > at <unknown source file>:<unknown line>
  1998. 47.99 s > 3: std[bcb96dfbba0ab899]::panicking::panic_with_hook<unknown>
  1999. 47.99 s > at <unknown source file>:<unknown line>
  2000. 47.99 s > 4: std[bcb96dfbba0ab899]::panicking::panic_handler::{closure#0}<unknown>
  2001. 47.99 s > at <unknown source file>:<unknown line>
  2002. 47.99 s > 5: std[bcb96dfbba0ab899]::sys::backtrace::__rust_end_short_backtrace::<std[bcb96dfbba0ab899]::panicking::panic_handler::{closure#0}, !><unknown>
  2003. 47.99 s > at <unknown source file>:<unknown line>
  2004. 47.99 s > 6: __rustc[6c289b9f9c454d21]::rust_begin_unwind<unknown>
  2005. 47.99 s > at <unknown source file>:<unknown line>
  2006. 47.99 s > 7: core[940e698046960fd5]::panicking::panic_fmt<unknown>
  2007. 47.99 s > at <unknown source file>:<unknown line>
  2008. 47.99 s > 8: core[940e698046960fd5]::panicking::assert_failed_inner<unknown>
  2009. 47.99 s > at <unknown source file>:<unknown line>
  2010. 47.99 s > 9: core[940e698046960fd5]::panicking::assert_failed::<i64, i64><unknown>
  2011. 47.99 s > at <unknown source file>:<unknown line>
  2012. 47.99 s > 10: gammalooprs[972dff90865981f6]::cff::tests::stored_production_cff_uses_typed_energy_factor_ownership<unknown>
  2013. 47.99 s > at <unknown source file>:<unknown line>
  2014. 47.99 s > 11: <gammalooprs[972dff90865981f6]::cff::tests::stored_production_cff_uses_typed_energy_factor_ownership::{closure#0} as core[940e698046960fd5]::ops::function::FnOnce<()>>::call_once<unknown>
  2015. 47.99 s > at <unknown source file>:<unknown line>
  2016. 47.99 s > 12: test[75d6903177b1d7e9]::__rust_begin_short_backtrace::<core[940e698046960fd5]::result::Result<(), alloc[2ea6bcb46fca0c42]::string::String>, fn() -> core[940e698046960fd5]::result::Result<(), alloc[2ea6bcb46fca0c42]::string::String>><unknown>
  2017. 47.99 s > at <unknown source file>:<unknown line>
  2018. 47.99 s > 13: test[75d6903177b1d7e9]::run_test::{closure#0}<unknown>
  2019. 47.99 s > at <unknown source file>:<unknown line>
  2020. 47.99 s > 14: std[bcb96dfbba0ab899]::sys::backtrace::__rust_begin_short_backtrace::<test[75d6903177b1d7e9]::run_test::{closure#1}, ()><unknown>
  2021. 47.99 s > at <unknown source file>:<unknown line>
  2022. 47.99 s > 15: <std[bcb96dfbba0ab899]::thread::lifecycle::spawn_unchecked<test[75d6903177b1d7e9]::run_test::{closure#1}, ()>::{closure#1} as core[940e698046960fd5]::ops::function::FnOnce<()>>::call_once::{shim:vtable#0}<unknown>
  2023. 47.99 s > at <unknown source file>:<unknown line>
  2024. 47.99 s > 16: <std[bcb96dfbba0ab899]::sys::thread::unix::Thread>::new::thread_start<unknown>
  2025. 47.99 s > at <unknown source file>:<unknown line>
  2026. 47.99 s > 17: start_thread<unknown>
  2027. 47.99 s > at <unknown source file>:<unknown line>
  2028. 47.99 s > 18: __clone3<unknown>
  2029. 47.99 s > at <unknown source file>:<unknown line>
  2030. 47.99 s >
  2031. 47.99 s > Run with COLORBT_SHOW_HIDDEN=1 environment variable to disable frame filtering.
  2032. 47.99 s > Run with RUST_BACKTRACE=full to include source snippets.
  2033. 47.99 s >
  2034. 47.99 s > 2. gammalooprs::uv::approx::local_3d::tests::production_emr_map_cancels_one_powered_denominator
  2035. 47.99 s > failure: test failure with exit code 101
  2036. 47.99 s > system-out
  2037. 47.99 s > running 1 test
  2038. 47.99 s > test uv::approx::local_3d::tests::production_emr_map_cancels_one_powered_denominator ... FAILED
  2039. 47.99 s >
  2040. 47.99 s > failures:
  2041. 47.99 s >
  2042. 47.99 s > failures:
  2043. 47.99 s > uv::approx::local_3d::tests::production_emr_map_cancels_one_powered_denominator
  2044. 47.99 s >
  2045. 47.99 s > test result: FAILED. 0 passed; 1 failed; 0 ignored; 0 measured; 611 filtered out; finished in 0.09s
  2046. 47.99 s > system-err
  2047. 47.99 s > The application panicked (crashed).
  2048. 47.99 s > Message: summed exact-source powered and selected lower channels differ: powered=-1𝑖/8/𝜋^3, lower=1𝑖/16/𝜋^3, difference=-3𝑖/16/𝜋^3
  2049. 47.99 s > Location: crates/gammalooprs/src/uv/approx/local_3d.rs:2047
  2050. 47.99 s >
  2051. 47.99 s > ━━━━━━━━━━━━━━━━━━━━━━━━━━━━━━━━━━ BACKTRACE ━━━━━━━━━━━━━━━━━━━━━━━━━━━━━━━━━━━
  2052. 47.99 s > 1: <color_eyre[51793ea62743adbd]::config::PanicHook>::panic_report<unknown>
  2053. 47.99 s > at <unknown source file>:<unknown line>
  2054. 47.99 s > 2: <color_eyre[51793ea62743adbd]::config::PanicHook>::into_panic_hook::{closure#0}<unknown>
  2055. 47.99 s > at <unknown source file>:<unknown line>
  2056. 47.99 s > 3: std[bcb96dfbba0ab899]::panicking::panic_with_hook<unknown>
  2057. 47.99 s > at <unknown source file>:<unknown line>
  2058. 47.99 s > 4: std[bcb96dfbba0ab899]::panicking::panic_handler::{closure#0}<unknown>
  2059. 47.99 s > at <unknown source file>:<unknown line>
  2060. 47.99 s > 5: std[bcb96dfbba0ab899]::sys::backtrace::__rust_end_short_backtrace::<std[bcb96dfbba0ab899]::panicking::panic_handler::{closure#0}, !><unknown>
  2061. 47.99 s > at <unknown source file>:<unknown line>
  2062. 47.99 s > 6: __rustc[6c289b9f9c454d21]::rust_begin_unwind<unknown>
  2063. 47.99 s > at <unknown source file>:<unknown line>
  2064. 47.99 s > 7: core[940e698046960fd5]::panicking::panic_fmt<unknown>
  2065. 47.99 s > at <unknown source file>:<unknown line>
  2066. 47.99 s > 8: gammalooprs[972dff90865981f6]::uv::approx::local_3d::tests::production_emr_map_cancels_one_powered_denominator<unknown>
  2067. 47.99 s > at <unknown source file>:<unknown line>
  2068. 47.99 s > 9: <gammalooprs[972dff90865981f6]::uv::approx::local_3d::tests::production_emr_map_cancels_one_powered_denominator::{closure#0} as core[940e698046960fd5]::ops::function::FnOnce<()>>::call_once<unknown>
  2069. 47.99 s > at <unknown source file>:<unknown line>
  2070. 47.99 s > 10: test[75d6903177b1d7e9]::__rust_begin_short_backtrace::<core[940e698046960fd5]::result::Result<(), alloc[2ea6bcb46fca0c42]::string::String>, fn() -> core[940e698046960fd5]::result::Result<(), alloc[2ea6bcb46fca0c42]::string::String>><unknown>
  2071. 47.99 s > at <unknown source file>:<unknown line>
  2072. 47.99 s > 11: test[75d6903177b1d7e9]::run_test::{closure#0}<unknown>
  2073. 47.99 s > at <unknown source file>:<unknown line>
  2074. 47.99 s > 12: std[bcb96dfbba0ab899]::sys::backtrace::__rust_begin_short_backtrace::<test[75d6903177b1d7e9]::run_test::{closure#1}, ()><unknown>
  2075. 47.99 s > at <unknown source file>:<unknown line>
  2076. 47.99 s > 13: <std[bcb96dfbba0ab899]::thread::lifecycle::spawn_unchecked<test[75d6903177b1d7e9]::run_test::{closure#1}, ()>::{closure#1} as core[940e698046960fd5]::ops::function::FnOnce<()>>::call_once::{shim:vtable#0}<unknown>
  2077. 47.99 s > at <unknown source file>:<unknown line>
  2078. 47.99 s > 14: <std[bcb96dfbba0ab899]::sys::thread::unix::Thread>::new::thread_start<unknown>
  2079. 47.99 s > at <unknown source file>:<unknown line>
  2080. 47.99 s > 15: start_thread<unknown>
  2081. 47.99 s > at <unknown source file>:<unknown line>
  2082. 47.99 s > 16: __clone3<unknown>
  2083. 47.99 s > at <unknown source file>:<unknown line>
  2084. 47.99 s >
  2085. 47.99 s > Run with COLORBT_SHOW_HIDDEN=1 environment variable to disable frame filtering.
  2086. 47.99 s > Run with RUST_BACKTRACE=full to include source snippets.
  2087. 47.99 s >
  2088. 47.99 s > 3. gammalooprs::uv::hedge_poset::tests::spectacles_typed_4d_projects_after_local_construction
  2089. 47.99 s > failure: test failure with exit code 101
  2090. 47.99 s > Error:
  2091. 47.99 s > 0: failed to extract three-dimensional representation graph input: source edge 1 has no unique routing for rewritten exact signature [-1, 0, 0] modulo the factorized opposite-domain loop span
  2092. 47.99 s >
  2093. 47.99 s > Location:
  2094. 47.99 s > crates/gammalooprs/src/uv/approx/local_3d.rs:845
  2095. 47.99 s >
  2096. 47.99 s > ━━━━━━━━━━━━━━━━━━━━━━━━━━━━━━━━━━ BACKTRACE ━━━━━━━━━━━━━━━━━━━━━━━━━━━━━━━━━━━
  2097. 47.99 s > 1: <color_eyre[51793ea62743adbd]::config::EyreHook>::into_eyre_hook::{closure#0}<unknown>
  2098. 47.99 s > at <unknown source file>:<unknown line>
  2099. 47.99 s > 2: eyre[cb2fd339c0c40fca]::capture_handler<unknown>
  2100. 47.99 s > at <unknown source file>:<unknown line>
  2101. 47.99 s > 3: <eyre[cb2fd339c0c40fca]::Report>::from_std::<three_dimensional_reps[3cb572ff22d197ac]::graph_io::GraphIoError><unknown>
  2102. 47.99 s > at <unknown source file>:<unknown line>
  2103. 47.99 s > 4: <gammalooprs[972dff90865981f6]::uv::approx::local_3d::Localizer>::project_4d<unknown>
  2104. 47.99 s > at <unknown source file>:<unknown line>
  2105. 47.99 s > 5: gammalooprs[972dff90865981f6]::uv::hedge_poset::tests::spectacles_typed_4d_projects_after_local_construction<unknown>
  2106. 47.99 s > at <unknown source file>:<unknown line>
  2107. 47.99 s > 6: <gammalooprs[972dff90865981f6]::uv::hedge_poset::tests::spectacles_typed_4d_projects_after_local_construction::{closure#0} as core[940e698046960fd5]::ops::function::FnOnce<()>>::call_once<unknown>
  2108. 47.99 s > at <unknown source file>:<unknown line>
  2109. 47.99 s > 7: test[75d6903177b1d7e9]::__rust_begin_short_backtrace::<core[940e698046960fd5]::result::Result<(), alloc[2ea6bcb46fca0c42]::string::String>, fn() -> core[940e698046960fd5]::result::Result<(), alloc[2ea6bcb46fca0c42]::string::String>><unknown>
  2110. 47.99 s > at <unknown source file>:<unknown line>
  2111. 47.99 s > 8: test[75d6903177b1d7e9]::run_test::{closure#0}<unknown>
  2112. 47.99 s > at <unknown source file>:<unknown line>
  2113. 47.99 s > 9: std[bcb96dfbba0ab899]::sys::backtrace::__rust_begin_short_backtrace::<test[75d6903177b1d7e9]::run_test::{closure#1}, ()><unknown>
  2114. 47.99 s > at <unknown source file>:<unknown line>
  2115. 47.99 s > 10: <std[bcb96dfbba0ab899]::thread::lifecycle::spawn_unchecked<test[75d6903177b1d7e9]::run_test::{closure#1}, ()>::{closure#1} as core[940e698046960fd5]::ops::function::FnOnce<()>>::call_once::{shim:vtable#0}<unknown>
  2116. 47.99 s > at <unknown source file>:<unknown line>
  2117. 47.99 s > 11: <std[bcb96dfbba0ab899]::sys::thread::unix::Thread>::new::thread_start<unknown>
  2118. 47.99 s > at <unknown source file>:<unknown line>
  2119. 47.99 s > 12: start_thread<unknown>
  2120. 47.99 s > at <unknown source file>:<unknown line>
  2121. 47.99 s > 13: __clone3<unknown>
  2122. 47.99 s > at <unknown source file>:<unknown line>
  2123. 47.99 s >
  2124. 47.99 s > Run with COLORBT_SHOW_HIDDEN=1 environment variable to disable frame filtering.
  2125. 47.99 s > Run with RUST_BACKTRACE=full to include source snippets.
  2126. 47.99 s > system-out
  2127. 47.99 s > running 1 test
  2128. 47.99 s > digraph {
  2129. 47.99 s > node [shape=circle,height=0.1,label=""];
  2130. 47.99 s > overlap = "scale";
  2131. 47.99 s > layout = "neato";
  2132. 47.99 s > start=2;
  2133. 47.99 s > 4 [label="0"];
  2134. 47.99 s > 1 [label="zw"];
  2135. 47.99 s > 2 [label="F"];
  2136. 47.99 s > 0 [label="143"];
  2137. 47.99 s > 3 [label="10B"];
  2138. 47.99 s > 4:0:s-> 1:1:s [id=0 color="red:blue;0.5" label="zw"];
  2139. 47.99 s > 4:2:s-> 2:3:s [id=1 color="red:blue;0.5" label="F"];
  2140. 47.99 s > 3:5:s-> 0:4:s [id=2 color="red:blue;0.5" label="143"];
  2141. 47.99 s > 4:6:s-> 0:7:s [id=3 color="red:blue;0.5" label="143"];
  2142. 47.99 s > 1:8:s-> 3:9:s [id=4 color="red:blue;0.5" label="F"];
  2143. 47.99 s > 1:10:s-> 0:11:s [id=5 color="red:blue;0.5" label="143"];
  2144. 47.99 s > 2:12:s-> 3:13:s [id=6 color="red:blue;0.5" label="zw"];
  2145. 47.99 s > 2:14:s-> 0:15:s [id=7 color="red:blue;0.5" label="143"];
  2146. 47.99 s > }
  2147. 47.99 s >
  2148. 47.99 s > digraph {
  2149. 47.99 s > node [shape=circle,height=0.1,label=""];
  2150. 47.99 s > overlap = "scale";
  2151. 47.99 s > layout = "neato";
  2152. 47.99 s > start=2;
  2153. 47.99 s > 0 [label="∅"];
  2154. 47.99 s > 1 [label="{zw}: Approx(S_zw(0))"];
  2155. 47.99 s > 2 [label="{F}: Approx(S_F(1))"];
  2156. 47.99 s > 3 [label="{143}: Approx(S_143(3))"];
  2157. 47.99 s > 4 [label="{zw,F}: Approx(S_F(4))*Approx(S_zw(0))"];
  2158. 47.99 s > 5 [label="{zw} · {143}: Approx((-1*S_zw+S_143(5))*Approx(S_zw(0)))"];
  2159. 47.99 s > 6 [label="{F} · {143}: Approx((-1*S_F+S_143(7))*Approx(S_F(1)))"];
  2160. 47.99 s > 7 [label="{zw,F} · {143}: Approx((-1*S_10B+S_143(2))*Approx(S_F(4))*Approx(S_zw(0)))"];
  2161. 47.99 s > 0:0:s-> 1:1:s [id=0 color="red:blue;0.5"];
  2162. 47.99 s > 0:2:s-> 2:3:s [id=1 color="red:blue;0.5"];
  2163. 47.99 s > 0:4:s-> 3:5:s [id=2 color="red:blue;0.5"];
  2164. 47.99 s > 1:6:s-> 4:7:s [id=3 color="red:blue;0.5"];
  2165. 47.99 s > 1:8:s-> 5:9:s [id=4 color="red:blue;0.5"];
  2166. 47.99 s > 2:10:s-> 4:11:s [id=5 color="red:blue;0.5"];
  2167. 47.99 s > 2:12:s-> 6:13:s [id=6 color="red:blue;0.5"];
  2168. 47.99 s > 4:14:s-> 7:15:s [id=7 color="red:blue;0.5"];
  2169. 47.99 s > }
  2170. 47.99 s >
  2171. 47.99 s > test uv::hedge_poset::tests::spectacles_typed_4d_projects_after_local_construction ... FAILED
  2172. 47.99 s >
  2173. 47.99 s > failures:
  2174. 47.99 s >
  2175. 47.99 s > failures:
  2176. 47.99 s > uv::hedge_poset::tests::spectacles_typed_4d_projects_after_local_construction
  2177. 47.99 s >
  2178. 47.99 s > test result: FAILED. 0 passed; 1 failed; 0 ignored; 0 measured; 611 filtered out; finished in 0.39s
  2179. 47.99 s > system-err
  2180. 47.99 s > Error:
  2181. 47.99 s > 0: failed to extract three-dimensional representation graph input: source edge 1 has no unique routing for rewritten exact signature [-1, 0, 0] modulo the factorized opposite-domain loop span
  2182. 47.99 s >
  2183. 47.99 s > Location:
  2184. 47.99 s > crates/gammalooprs/src/uv/approx/local_3d.rs:845
  2185. 47.99 s >
  2186. 47.99 s > ━━━━━━━━━━━━━━━━━━━━━━━━━━━━━━━━━━ BACKTRACE ━━━━━━━━━━━━━━━━━━━━━━━━━━━━━━━━━━━
  2187. 47.99 s > 1: <color_eyre[51793ea62743adbd]::config::EyreHook>::into_eyre_hook::{closure#0}<unknown>
  2188. 47.99 s > at <unknown source file>:<unknown line>
  2189. 47.99 s > 2: eyre[cb2fd339c0c40fca]::capture_handler<unknown>
  2190. 47.99 s > at <unknown source file>:<unknown line>
  2191. 47.99 s > 3: <eyre[cb2fd339c0c40fca]::Report>::from_std::<three_dimensional_reps[3cb572ff22d197ac]::graph_io::GraphIoError><unknown>
  2192. 47.99 s > at <unknown source file>:<unknown line>
  2193. 47.99 s > 4: <gammalooprs[972dff90865981f6]::uv::approx::local_3d::Localizer>::project_4d<unknown>
  2194. 47.99 s > at <unknown source file>:<unknown line>
  2195. 47.99 s > 5: gammalooprs[972dff90865981f6]::uv::hedge_poset::tests::spectacles_typed_4d_projects_after_local_construction<unknown>
  2196. 47.99 s > at <unknown source file>:<unknown line>
  2197. 47.99 s > 6: <gammalooprs[972dff90865981f6]::uv::hedge_poset::tests::spectacles_typed_4d_projects_after_local_construction::{closure#0} as core[940e698046960fd5]::ops::function::FnOnce<()>>::call_once<unknown>
  2198. 47.99 s > at <unknown source file>:<unknown line>
  2199. 47.99 s > 7: test[75d6903177b1d7e9]::__rust_begin_short_backtrace::<core[940e698046960fd5]::result::Result<(), alloc[2ea6bcb46fca0c42]::string::String>, fn() -> core[940e698046960fd5]::result::Result<(), alloc[2ea6bcb46fca0c42]::string::String>><unknown>
  2200. 47.99 s > at <unknown source file>:<unknown line>
  2201. 47.99 s > 8: test[75d6903177b1d7e9]::run_test::{closure#0}<unknown>
  2202. 47.99 s > at <unknown source file>:<unknown line>
  2203. 47.99 s > 9: std[bcb96dfbba0ab899]::sys::backtrace::__rust_begin_short_backtrace::<test[75d6903177b1d7e9]::run_test::{closure#1}, ()><unknown>
  2204. 47.99 s > at <unknown source file>:<unknown line>
  2205. 47.99 s > 10: <std[bcb96dfbba0ab899]::thread::lifecycle::spawn_unchecked<test[75d6903177b1d7e9]::run_test::{closure#1}, ()>::{closure#1} as core[940e698046960fd5]::ops::function::FnOnce<()>>::call_once::{shim:vtable#0}<unknown>
  2206. 47.99 s > at <unknown source file>:<unknown line>
  2207. 47.99 s > 11: <std[bcb96dfbba0ab899]::sys::thread::unix::Thread>::new::thread_start<unknown>
  2208. 47.99 s > at <unknown source file>:<unknown line>
  2209. 47.99 s > 12: start_thread<unknown>
  2210. 47.99 s > at <unknown source file>:<unknown line>
  2211. 47.99 s > 13: __clone3<unknown>
  2212. 47.99 s > at <unknown source file>:<unknown line>
  2213. 47.99 s >
  2214. 47.99 s > Run with COLORBT_SHOW_HIDDEN=1 environment variable to disable frame filtering.
  2215. 47.99 s > Run with RUST_BACKTRACE=full to include source snippets.
  2216. 47.99 s >
  2217. 47.99 s > 4. gammalooprs::uv::tests::scalars_profile
  2218. 47.99 s > failure: test failure with exit code 101
  2219. 47.99 s > system-out
  2220. 47.99 s > running 1 test
  2221. 47.99 s > test uv::tests::scalars_profile ... FAILED
  2222. 47.99 s >
  2223. 47.99 s > failures:
  2224. 47.99 s >
  2225. 47.99 s > failures:
  2226. 47.99 s > uv::tests::scalars_profile
  2227. 47.99 s >
  2228. 47.99 s > test result: FAILED. 0 passed; 1 failed; 0 ignored; 0 measured; 611 filtered out; finished in 9.96s
  2229. 47.99 s > system-err
  2230. 47.99 s > [18:17:53.343] @gammalooprs::settings::runtime WARNING : No external kinematics were provided; using default-generated external momenta and helicities.
  2231. 47.99 s > field value
  2232. 47.99 s > span build_integrand{amplitude.name=bub}
  2233. 47.99 s > at crates/gammalooprs/src/settings/runtime.rs:131
  2234. 47.99 s > [18:17:53.344] @gammalooprs::integrands::process::amplitude INFO : Input is below threshold: 0 existing threshold E-surfaces across 0/3 graph groups
  2235. 47.99 s > field value
  2236. 47.99 s > existing_esurfaces 0
  2237. 47.99 s > group_count 3
  2238. 47.99 s > groups_above_threshold 0
  2239. 47.99 s > integrand bub
  2240. 47.99 s > span warm_up{integrand.name=bub}
  2241. 47.99 s > threshold_status below threshold
  2242. 47.99 s > at crates/gammalooprs/src/integrands/process/amplitude/mod.rs:1666
  2243. 47.99 s > [18:17:53.345] @gammalooprs::integrands::process::amplitude INFO : overlap structure of group 0: [0: []]
  2244. 47.99 s > field value
  2245. 47.99 s > span warm_up{integrand.name=bub}
  2246. 47.99 s > at crates/gammalooprs/src/integrands/process/amplitude/mod.rs:2015
  2247. 47.99 s > [18:17:53.345] @gammalooprs::integrands::process::amplitude INFO : overlap structure of group 1: [0: []]
  2248. 47.99 s > field value
  2249. 47.99 s > span warm_up{integrand.name=bub}
  2250. 47.99 s > at crates/gammalooprs/src/integrands/process/amplitude/mod.rs:2015
  2251. 47.99 s > [18:17:53.345] @gammalooprs::integrands::process::amplitude INFO : overlap structure of group 2: [0: []]
  2252. 47.99 s > field value
  2253. 47.99 s > span warm_up{integrand.name=bub}
  2254. 47.99 s > at crates/gammalooprs/src/integrands/process/amplitude/mod.rs:2015
  2255. 47.99 s > The application panicked (crashed).
  2256. 47.99 s > Message: assertion `left == right` failed: subtracted scalar UV profile failed:
  2257. 47.99 s > UVProfilePassFail {
  2258. 47.99 s > max_dod: -0.9,
  2259. 47.99 s > total: 16,
  2260. 47.99 s > failed: 1,
  2261. 47.99 s > failures: [
  2262. 47.99 s > UVProfileFailure {
  2263. 47.99 s > graph_index: 0,
  2264. 47.99 s > graph_name: "banana",
  2265. 47.99 s > cutkosky_cut: None,
  2266. 47.99 s > lmb_index: 1,
  2267. 47.99 s > fixed: [
  2268. 47.99 s > EdgeIndex(
  2269. 47.99 s > 2,
  2270. 47.99 s > ),
  2271. 47.99 s > EdgeIndex(
  2272. 47.99 s > 0,
  2273. 47.99 s > ),
  2274. 47.99 s > ],
  2275. 47.99 s > free: [
  2276. 47.99 s > EdgeIndex(
  2277. 47.99 s > 3,
  2278. 47.99 s > ),
  2279. 47.99 s > ],
  2280. 47.99 s > orientation_label: None,
  2281. 47.99 s > reason: "dod_exceeds_threshold",
  2282. 47.99 s > },
  2283. 47.99 s > ],
  2284. 47.99 s > }
  2285. 47.99 s >
  2286. 47.99 s > ╭─────────┬────────────┬───────────┬───────┬─────┬──────────┬───────────╮
  2287. 47.99 s > │ fixed │ → ∞ │ slope │ r2 │ DOD │ bare DOD │ inspect │
  2288. 47.99 s > ├─────────┼────────────┼───────────┼───────┼─────┼──────────┼───────────┤
  2289. 47.99 s > │ {e1,e2} │ {e3} │ -0.996752 │ 1.000 │ -1 │ 0 │ arb retry │
  2290. 47.99 s > │ {e1,e3} │ {e2} │ -1.065665 │ 0.997 │ -1 │ 0 │ arb retry │
  2291. 47.99 s > │ {e1} │ {e2,e3} │ -0.937151 │ 0.943 │ -1 │ 2 │ │
  2292. 47.99 s > │ {e2,e3} │ {e1} │ -1.001075 │ 1.000 │ -1 │ 0 │ arb retry │
  2293. 47.99 s > │ {e2} │ {e1,e3} │ -0.984146 │ 0.998 │ -1 │ 2 │ │
  2294. 47.99 s > │ {e3} │ {e1,e2} │ -1.383911 │ 0.982 │ -1 │ 2 │ arb retry │
  2295. 47.99 s > │ {} │ {e1,e2,e3} │ -1.094213 │ 0.258 │ -1 │ 4 │ │
  2296. 47.99 s > │ {e2,e0} │ {e3} │ -0.803348 │ 0.861 │ -1 │ 0 │ arb retry │
  2297. 47.99 s > │ {e3,e0} │ {e2} │ -0.999257 │ 1.000 │ -1 │ 0 │ │
  2298. 47.99 s > │ {e0} │ {e2,e3} │ -1.000893 │ 1.000 │ -1 │ 2 │ │
  2299. 47.99 s > │ {e1,e0} │ {e3} │ -0.997860 │ 1.000 │ -1 │ 0 │ │
  2300. 47.99 s > ╰─────────┴────────────┴───────────┴───────┴─────┴──────────┴───────────╯
  2301. 47.99 s >
  2302. 47.99 s > ╭───────┬─────────┬───────────┬───────┬─────┬──────────┬───────────╮
  2303. 47.99 s > │ fixed │ → ∞ │ slope │ r2 │ DOD │ bare DOD │ inspect │
  2304. 47.99 s > ├───────┼─────────┼───────────┼───────┼─────┼──────────┼───────────┤
  2305. 47.99 s > │ {e1} │ {e2} │ -1.005039 │ 1.000 │ -1 │ 0 │ arb retry │
  2306. 47.99 s > │ {e2} │ {e1} │ -1.001098 │ 1.000 │ -1 │ 0 │ arb retry │
  2307. 47.99 s > │ {} │ {e1,e2} │ -1.011289 │ 1.000 │ -1 │ 2 │ │
  2308. 47.99 s > │ {e0} │ {e2} │ -0.998140 │ 1.000 │ -1 │ 0 │ │
  2309. 47.99 s > ╰───────┴─────────┴───────────┴───────┴─────┴──────────┴───────────╯
  2310. 47.99 s >
  2311. 47.99 s > ╭───────┬──────┬───────────┬───────┬─────┬──────────┬─────────╮
  2312. 47.99 s > │ fixed │ → ∞ │ slope │ r2 │ DOD │ bare DOD │ inspect │
  2313. 47.99 s > ├───────┼──────┼───────────┼───────┼─────┼──────────┼─────────┤
  2314. 47.99 s > │ {} │ {e1} │ -0.989949 │ 1.000 │ -1 │ 0 │ │
  2315. 47.99 s > ╰───────┴──────┴───────────┴───────┴─────┴──────────┴─────────╯
  2316. 47.99 s > left: 1
  2317. 47.99 s > right: 0
  2318. 47.99 s > Location: crates/gammalooprs/src/uv/tests.rs:259
  2319. 47.99 s >
  2320. 47.99 s > ━━━━━━━━━━━━━━━━━━━━━━━━━━━━━━━━━━ BACKTRACE ━━━━━━━━━━━━━━━━━━━━━━━━━━━━━━━━━━━
  2321. 47.99 s > 1: <color_eyre[51793ea62743adbd]::config::PanicHook>::panic_report<unknown>
  2322. 47.99 s > at <unknown source file>:<unknown line>
  2323. 47.99 s > 2: <color_eyre[51793ea62743adbd]::config::PanicHook>::into_panic_hook::{closure#0}<unknown>
  2324. 47.99 s > at <unknown source file>:<unknown line>
  2325. 47.99 s > 3: std[bcb96dfbba0ab899]::panicking::panic_with_hook<unknown>
  2326. 47.99 s > at <unknown source file>:<unknown line>
  2327. 47.99 s > 4: std[bcb96dfbba0ab899]::panicking::panic_handler::{closure#0}<unknown>
  2328. 47.99 s > at <unknown source file>:<unknown line>
  2329. 47.99 s > 5: std[bcb96dfbba0ab899]::sys::backtrace::__rust_end_short_backtrace::<std[bcb96dfbba0ab899]::panicking::panic_handler::{closure#0}, !><unknown>
  2330. 47.99 s > at <unknown source file>:<unknown line>
  2331. 47.99 s > 6: __rustc[6c289b9f9c454d21]::rust_begin_unwind<unknown>
  2332. 47.99 s > at <unknown source file>:<unknown line>
  2333. 47.99 s > 7: core[940e698046960fd5]::panicking::panic_fmt<unknown>
  2334. 47.99 s > at <unknown source file>:<unknown line>
  2335. 47.99 s > 8: core[940e698046960fd5]::panicking::assert_failed_inner<unknown>
  2336. 47.99 s > at <unknown source file>:<unknown line>
  2337. 47.99 s > 9: core[940e698046960fd5]::panicking::assert_failed::<usize, usize><unknown>
  2338. 47.99 s > at <unknown source file>:<unknown line>
  2339. 47.99 s > 10: gammalooprs[972dff90865981f6]::uv::tests::scalars_profile<unknown>
  2340. 47.99 s > at <unknown source file>:<unknown line>
  2341. 47.99 s > 11: <gammalooprs[972dff90865981f6]::uv::tests::scalars_profile::{closure#0} as core[940e698046960fd5]::ops::function::FnOnce<()>>::call_once<unknown>
  2342. 47.99 s > at <unknown source file>:<unknown line>
  2343. 47.99 s > 12: test[75d6903177b1d7e9]::__rust_begin_short_backtrace::<core[940e698046960fd5]::result::Result<(), alloc[2ea6bcb46fca0c42]::string::String>, fn() -> core[940e698046960fd5]::result::Result<(), alloc[2ea6bcb46fca0c42]::string::String>><unknown>
  2344. 47.99 s > at <unknown source file>:<unknown line>
  2345. 47.99 s > 13: test[75d6903177b1d7e9]::run_test::{closure#0}<unknown>
  2346. 47.99 s > at <unknown source file>:<unknown line>
  2347. 47.99 s > 14: std[bcb96dfbba0ab899]::sys::backtrace::__rust_begin_short_backtrace::<test[75d6903177b1d7e9]::run_test::{closure#1}, ()><unknown>
  2348. 47.99 s > at <unknown source file>:<unknown line>
  2349. 47.99 s > ... omitted 11 more lines; see full nextest output above
  2350. 47.99 s >
  2351. 47.99 s > 5. gammalooprs::uv::tests::scalars_profile_new
  2352. 47.99 s > failure: test failure with exit code 101
  2353. 47.99 s > system-out
  2354. 47.99 s > running 1 test
  2355. 47.99 s > test uv::tests::scalars_profile_new ... FAILED
  2356. 47.99 s >
  2357. 47.99 s > failures:
  2358. 47.99 s >
  2359. 47.99 s > failures:
  2360. 47.99 s > uv::tests::scalars_profile_new
  2361. 47.99 s >
  2362. 47.99 s > test result: FAILED. 0 passed; 1 failed; 0 ignored; 0 measured; 611 filtered out; finished in 11.13s
  2363. 47.99 s > system-err
  2364. 47.99 s > [18:17:54.561] @gammalooprs::settings::runtime WARNING : No external kinematics were provided; using default-generated external momenta and helicities.
  2365. 47.99 s > field value
  2366. 47.99 s > span build_integrand{amplitude.name=bub}
  2367. 47.99 s > at crates/gammalooprs/src/settings/runtime.rs:131
  2368. 47.99 s > [18:17:54.562] @gammalooprs::integrands::process::amplitude INFO : Input is below threshold: 0 existing threshold E-surfaces across 0/3 graph groups
  2369. 47.99 s > field value
  2370. 47.99 s > existing_esurfaces 0
  2371. 47.99 s > group_count 3
  2372. 47.99 s > groups_above_threshold 0
  2373. 47.99 s > integrand bub
  2374. 47.99 s > span warm_up{integrand.name=bub}
  2375. 47.99 s > threshold_status below threshold
  2376. 47.99 s > at crates/gammalooprs/src/integrands/process/amplitude/mod.rs:1666
  2377. 47.99 s > [18:17:54.562] @gammalooprs::integrands::process::amplitude INFO : overlap structure of group 0: [0: []]
  2378. 47.99 s > field value
  2379. 47.99 s > span warm_up{integrand.name=bub}
  2380. 47.99 s > at crates/gammalooprs/src/integrands/process/amplitude/mod.rs:2015
  2381. 47.99 s > [18:17:54.562] @gammalooprs::integrands::process::amplitude INFO : overlap structure of group 1: [0: []]
  2382. 47.99 s > field value
  2383. 47.99 s > span warm_up{integrand.name=bub}
  2384. 47.99 s > at crates/gammalooprs/src/integrands/process/amplitude/mod.rs:2015
  2385. 47.99 s > [18:17:54.562] @gammalooprs::integrands::process::amplitude INFO : overlap structure of group 2: [0: []]
  2386. 47.99 s > field value
  2387. 47.99 s > span warm_up{integrand.name=bub}
  2388. 47.99 s > at crates/gammalooprs/src/integrands/process/amplitude/mod.rs:2015
  2389. 47.99 s > The application panicked (crashed).
  2390. 47.99 s > Message: assertion `left == right` failed: subtracted scalar UV profile failed:
  2391. 47.99 s > UVProfilePassFail {
  2392. 47.99 s > max_dod: -0.9,
  2393. 47.99 s > total: 16,
  2394. 47.99 s > failed: 1,
  2395. 47.99 s > failures: [
  2396. 47.99 s > UVProfileFailure {
  2397. 47.99 s > graph_index: 0,
  2398. 47.99 s > graph_name: "banana",
  2399. 47.99 s > cutkosky_cut: None,
  2400. 47.99 s > lmb_index: 1,
  2401. 47.99 s > fixed: [
  2402. 47.99 s > EdgeIndex(
  2403. 47.99 s > 2,
  2404. 47.99 s > ),
  2405. 47.99 s > EdgeIndex(
  2406. 47.99 s > 0,
  2407. 47.99 s > ),
  2408. 47.99 s > ],
  2409. 47.99 s > free: [
  2410. 47.99 s > EdgeIndex(
  2411. 47.99 s > 3,
  2412. 47.99 s > ),
  2413. 47.99 s > ],
  2414. 47.99 s > orientation_label: None,
  2415. 47.99 s > reason: "dod_exceeds_threshold",
  2416. 47.99 s > },
  2417. 47.99 s > ],
  2418. 47.99 s > }
  2419. 47.99 s >
  2420. 47.99 s > ╭─────────┬────────────┬───────────┬───────┬─────┬──────────┬───────────╮
  2421. 47.99 s > │ fixed │ → ∞ │ slope │ r2 │ DOD │ bare DOD │ inspect │
  2422. 47.99 s > ├─────────┼────────────┼───────────┼───────┼─────┼──────────┼───────────┤
  2423. 47.99 s > │ {e1,e2} │ {e3} │ -0.996752 │ 1.000 │ -1 │ 0 │ arb retry │
  2424. 47.99 s > │ {e1,e3} │ {e2} │ -1.065665 │ 0.997 │ -1 │ 0 │ arb retry │
  2425. 47.99 s > │ {e1} │ {e2,e3} │ -0.937151 │ 0.943 │ -1 │ 2 │ │
  2426. 47.99 s > │ {e2,e3} │ {e1} │ -1.001075 │ 1.000 │ -1 │ 0 │ arb retry │
  2427. 47.99 s > │ {e2} │ {e1,e3} │ -0.984146 │ 0.998 │ -1 │ 2 │ │
  2428. 47.99 s > │ {e3} │ {e1,e2} │ -1.383911 │ 0.982 │ -1 │ 2 │ arb retry │
  2429. 48.00 s > │ {} │ {e1,e2,e3} │ -1.094213 │ 0.258 │ -1 │ 4 │ │
  2430. 48.00 s > │ {e2,e0} │ {e3} │ -0.803348 │ 0.861 │ -1 │ 0 │ arb retry │
  2431. 48.00 s > │ {e3,e0} │ {e2} │ -0.999257 │ 1.000 │ -1 │ 0 │ │
  2432. 48.00 s > │ {e0} │ {e2,e3} │ -1.000893 │ 1.000 │ -1 │ 2 │ │
  2433. 48.00 s > │ {e1,e0} │ {e3} │ -0.997860 │ 1.000 │ -1 │ 0 │ │
  2434. 48.00 s > ╰─────────┴────────────┴───────────┴───────┴─────┴──────────┴───────────╯
  2435. 48.00 s >
  2436. 48.00 s > ╭───────┬─────────┬───────────┬───────┬─────┬──────────┬───────────╮
  2437. 48.00 s > │ fixed │ → ∞ │ slope │ r2 │ DOD │ bare DOD │ inspect │
  2438. 48.00 s > ├───────┼─────────┼───────────┼───────┼─────┼──────────┼───────────┤
  2439. 48.00 s > │ {e1} │ {e2} │ -1.005039 │ 1.000 │ -1 │ 0 │ arb retry │
  2440. 48.00 s > │ {e2} │ {e1} │ -1.001098 │ 1.000 │ -1 │ 0 │ arb retry │
  2441. 48.00 s > │ {} │ {e1,e2} │ -1.011289 │ 1.000 │ -1 │ 2 │ │
  2442. 48.00 s > │ {e0} │ {e2} │ -0.998140 │ 1.000 │ -1 │ 0 │ │
  2443. 48.00 s > ╰───────┴─────────┴───────────┴───────┴─────┴──────────┴───────────╯
  2444. 48.00 s >
  2445. 48.00 s > ╭───────┬──────┬───────────┬───────┬─────┬──────────┬─────────╮
  2446. 48.00 s > │ fixed │ → ∞ │ slope │ r2 │ DOD │ bare DOD │ inspect │
  2447. 48.00 s > ├───────┼──────┼───────────┼───────┼─────┼──────────┼─────────┤
  2448. 48.00 s > │ {} │ {e1} │ -0.989949 │ 1.000 │ -1 │ 0 │ │
  2449. 48.00 s > ╰───────┴──────┴───────────┴───────┴─────┴──────────┴─────────╯
  2450. 48.00 s > left: 1
  2451. 48.00 s > right: 0
  2452. 48.00 s > Location: crates/gammalooprs/src/uv/tests.rs:325
  2453. 48.00 s >
  2454. 48.00 s > ━━━━━━━━━━━━━━━━━━━━━━━━━━━━━━━━━━ BACKTRACE ━━━━━━━━━━━━━━━━━━━━━━━━━━━━━━━━━━━
  2455. 48.00 s > 1: <color_eyre[51793ea62743adbd]::config::PanicHook>::panic_report<unknown>
  2456. 48.00 s > at <unknown source file>:<unknown line>
  2457. 48.00 s > 2: <color_eyre[51793ea62743adbd]::config::PanicHook>::into_panic_hook::{closure#0}<unknown>
  2458. 48.00 s > at <unknown source file>:<unknown line>
  2459. 48.00 s > 3: std[bcb96dfbba0ab899]::panicking::panic_with_hook<unknown>
  2460. 48.00 s > at <unknown source file>:<unknown line>
  2461. 48.00 s > 4: std[bcb96dfbba0ab899]::panicking::panic_handler::{closure#0}<unknown>
  2462. 48.00 s > at <unknown source file>:<unknown line>
  2463. 48.00 s > 5: std[bcb96dfbba0ab899]::sys::backtrace::__rust_end_short_backtrace::<std[bcb96dfbba0ab899]::panicking::panic_handler::{closure#0}, !><unknown>
  2464. 48.00 s > at <unknown source file>:<unknown line>
  2465. 48.00 s > 6: __rustc[6c289b9f9c454d21]::rust_begin_unwind<unknown>
  2466. 48.00 s > at <unknown source file>:<unknown line>
  2467. 48.00 s > 7: core[940e698046960fd5]::panicking::panic_fmt<unknown>
  2468. 48.00 s > at <unknown source file>:<unknown line>
  2469. 48.00 s > 8: core[940e698046960fd5]::panicking::assert_failed_inner<unknown>
  2470. 48.00 s > at <unknown source file>:<unknown line>
  2471. 48.00 s > 9: core[940e698046960fd5]::panicking::assert_failed::<usize, usize><unknown>
  2472. 48.00 s > at <unknown source file>:<unknown line>
  2473. 48.00 s > 10: gammalooprs[972dff90865981f6]::uv::tests::scalars_profile_new<unknown>
  2474. 48.00 s > at <unknown source file>:<unknown line>
  2475. 48.00 s > 11: <gammalooprs[972dff90865981f6]::uv::tests::scalars_profile_new::{closure#0} as core[940e698046960fd5]::ops::function::FnOnce<()>>::call_once<unknown>
  2476. 48.00 s > at <unknown source file>:<unknown line>
  2477. 48.00 s > 12: test[75d6903177b1d7e9]::__rust_begin_short_backtrace::<core[940e698046960fd5]::result::Result<(), alloc[2ea6bcb46fca0c42]::string::String>, fn() -> core[940e698046960fd5]::result::Result<(), alloc[2ea6bcb46fca0c42]::string::String>><unknown>
  2478. 48.00 s > at <unknown source file>:<unknown line>
  2479. 48.00 s > 13: test[75d6903177b1d7e9]::run_test::{closure#0}<unknown>
  2480. 48.00 s > at <unknown source file>:<unknown line>
  2481. 48.00 s > 14: std[bcb96dfbba0ab899]::sys::backtrace::__rust_begin_short_backtrace::<test[75d6903177b1d7e9]::run_test::{closure#1}, ()><unknown>
  2482. 48.00 s > at <unknown source file>:<unknown line>
  2483. 48.00 s > ... omitted 11 more lines; see full nextest output above
  2484. 48.00 s > =========================================
  2485. 48.00 s > Extracting 1 binary, 1 build script output directory, and 1 linked path to /build/nextest-archive-K8VOkI
  2486. 48.00 s > Extracted 7 files to /build/nextest-archive-K8VOkI in 0.12s
  2487. 48.00 s > ------------
  2488. 48.00 s > Nextest run ID 57817a1c-c3ad-4dde-a811-f091efd2dc71 with nextest profile: ci_gammaloop
  2489. 48.00 s > Starting 54 tests across 1 binary
  2490. 48.00 s > ------------
  2491. 48.00 s > Summary [ 0.382s] 54 tests run: 54 passed, 0 skipped
  2492. 48.00 s >
  2493. 48.00 s > ========== nextest test summary ==========
  2494. 48.00 s > report: target/nextest/ci_gammaloop/junit.xml
  2495. 48.00 s > tests: 54, failures: 0, errors: 0
  2496. 48.00 s > No failing testcases found.
  2497. 48.00 s > =========================================
  2498. 48.00 s For full logs, run:
  2499. 48.00 s nix log /nix/store/xmqryc6f4382yn38pvqdg8lk2i1rvwkl-gammaloop-nextest-core.drv
  2500. 48.14 s Run failed.