0.92 s
$ /nix/store/9ypz3flqsrl5xl495mm8h645gadjsxi1-coreutils-9.11/bin/timeout --kill-after=15s 7200s /nix/store/23zk8sgzamrbmj1fday15szf7f2279s8-nix-2.34.7/bin/nix --extra-experimental-features nix-command --extra-experimental-features flakes flake clone git+https://github.com/alphal00p/gammaloop --dest /tmp/nix-ci-worker/stable-pwd/repo/
0.95 s
Cloning into '/tmp/nix-ci-worker/stable-pwd/repo'...
0.95 s
remote: Enumerating objects: 64545, done.
0.95 s
remote: Counting objects: 0% (1/9899)
remote: Counting objects: 1% (99/9899)
remote: Counting objects: 2% (198/9899)
remote: Counting objects: 3% (297/9899)
remote: Counting objects: 4% (396/9899)
remote: Counting objects: 5% (495/9899)
remote: Counting objects: 6% (594/9899)
remote: Counting objects: 7% (693/9899)
remote: Counting objects: 8% (792/9899)
remote: Counting objects: 9% (891/9899)
remote: Counting objects: 10% (990/9899)
remote: Counting objects: 11% (1089/9899)
remote: Counting objects: 12% (1188/9899)
remote: Counting objects: 13% (1287/9899)
remote: Counting objects: 14% (1386/9899)
remote: Counting objects: 15% (1485/9899)
remote: Counting objects: 16% (1584/9899)
remote: Counting objects: 17% (1683/9899)
remote: Counting objects: 18% (1782/9899)
remote: Counting objects: 19% (1881/9899)
remote: Counting objects: 20% (1980/9899)
remote: Counting objects: 21% (2079/9899)
remote: Counting objects: 22% (2178/9899)
remote: Counting objects: 23% (2277/9899)
remote: Counting objects: 24% (2376/9899)
remote: Counting objects: 25% (2475/9899)
remote: Counting objects: 26% (2574/9899)
remote: Counting objects: 27% (2673/9899)
remote: Counting objects: 28% (2772/9899)
remote: Counting objects: 29% (2871/9899)
remote: Counting objects: 30% (2970/9899)
remote: Counting objects: 31% (3069/9899)
remote: Counting objects: 32% (3168/9899)
remote: Counting objects: 33% (3267/9899)
remote: Counting objects: 34% (3366/9899)
remote: Counting objects: 35% (3465/9899)
remote: Counting objects: 36% (3564/9899)
remote: Counting objects: 37% (3663/9899)
remote: Counting objects: 38% (3762/9899)
remote: Counting objects: 39% (3861/9899)
remote: Counting objects: 40% (3960/9899)
remote: Counting objects: 41% (4059/9899)
remote: Counting objects: 42% (4158/9899)
remote: Counting objects: 43% (4257/9899)
remote: Counting objects: 44% (4356/9899)
remote: Counting objects: 45% (4455/9899)
remote: Counting objects: 46% (4554/9899)
remote: Counting objects: 47% (4653/9899)
remote: Counting objects: 48% (4752/9899)
remote: Counting objects: 49% (4851/9899)
remote: Counting objects: 50% (4950/9899)
remote: Counting objects: 51% (5049/9899)
remote: Counting objects: 52% (5148/9899)
remote: Counting objects: 53% (5247/9899)
remote: Counting objects: 54% (5346/9899)
remote: Counting objects: 55% (5445/9899)
remote: Counting objects: 56% (5544/9899)
remote: Counting objects: 57% (5643/9899)
remote: Counting objects: 58% (5742/9899)
remote: Counting objects: 59% (5841/9899)
remote: Counting objects: 60% (5940/9899)
remote: Counting objects: 61% (6039/9899)
remote: Counting objects: 62% (6138/9899)
remote: Counting objects: 63% (6237/9899)
remote: Counting objects: 64% (6336/9899)
remote: Counting objects: 65% (6435/9899)
remote: Counting objects: 66% (6534/9899)
remote: Counting objects: 67% (6633/9899)
remote: Counting objects: 68% (6732/9899)
remote: Counting objects: 69% (6831/9899)
remote: Counting objects: 70% (6930/9899)
remote: Counting objects: 71% (7029/9899)
remote: Counting objects: 72% (7128/9899)
remote: Counting objects: 73% (7227/9899)
remote: Counting objects: 74% (7326/9899)
remote: Counting objects: 75% (7425/9899)
remote: Counting objects: 76% (7524/9899)
remote: Counting objects: 77% (7623/9899)
remote: Counting objects: 78% (7722/9899)
remote: Counting objects: 79% (7821/9899)
remote: Counting objects: 80% (7920/9899)
remote: Counting objects: 81% (8019/9899)
remote: Counting objects: 82% (8118/9899)
remote: Counting objects: 83% (8217/9899)
remote: Counting objects: 84% (8316/9899)
remote: Counting objects: 85% (8415/9899)
remote: Counting objects: 86% (8514/9899)
remote: Counting objects: 87% (8613/9899)
remote: Counting objects: 88% (8712/9899)
remote: Counting objects: 89% (8811/9899)
remote: Counting objects: 90% (8910/9899)
remote: Counting objects: 91% (9009/9899)
remote: Counting objects: 92% (9108/9899)
remote: Counting objects: 93% (9207/9899)
remote: Counting objects: 94% (9306/9899)
remote: Counting objects: 95% (9405/9899)
remote: Counting objects: 96% (9504/9899)
remote: Counting objects: 97% (9603/9899)
remote: Counting objects: 98% (9702/9899)
remote: Counting objects: 99% (9801/9899)
remote: Counting objects: 100% (9899/9899)
remote: Counting objects: 100% (9899/9899), done.
3.69 s
remote: Compressing objects: 0% (1/2477)
remote: Compressing objects: 1% (25/2477)
remote: Compressing objects: 2% (50/2477)
remote: Compressing objects: 3% (75/2477)
remote: Compressing objects: 4% (100/2477)
remote: Compressing objects: 5% (124/2477)
remote: Compressing objects: 6% (149/2477)
remote: Compressing objects: 7% (174/2477)
remote: Compressing objects: 8% (199/2477)
remote: Compressing objects: 9% (223/2477)
remote: Compressing objects: 10% (248/2477)
remote: Compressing objects: 11% (273/2477)
remote: Compressing objects: 12% (298/2477)
remote: Compressing objects: 13% (323/2477)
remote: Compressing objects: 14% (347/2477)
remote: Compressing objects: 15% (372/2477)
remote: Compressing objects: 16% (397/2477)
remote: Compressing objects: 17% (422/2477)
remote: Compressing objects: 18% (446/2477)
remote: Compressing objects: 19% (471/2477)
remote: Compressing objects: 20% (496/2477)
remote: Compressing objects: 21% (521/2477)
remote: Compressing objects: 22% (545/2477)
remote: Compressing objects: 23% (570/2477)
remote: Compressing objects: 24% (595/2477)
remote: Compressing objects: 24% (597/2477)
remote: Compressing objects: 25% (620/2477)
remote: Compressing objects: 26% (645/2477)
remote: Compressing objects: 27% (669/2477)
remote: Compressing objects: 28% (694/2477)
remote: Compressing objects: 28% (705/2477)
remote: Compressing objects: 29% (719/2477)
remote: Compressing objects: 30% (744/2477)
remote: Compressing objects: 31% (768/2477)
remote: Compressing objects: 32% (793/2477)
remote: Compressing objects: 33% (818/2477)
remote: Compressing objects: 34% (843/2477)
remote: Compressing objects: 35% (867/2477)
remote: Compressing objects: 36% (892/2477)
remote: Compressing objects: 37% (917/2477)
remote: Compressing objects: 38% (942/2477)
remote: Compressing objects: 39% (967/2477)
remote: Compressing objects: 40% (991/2477)
remote: Compressing objects: 41% (1016/2477)
remote: Compressing objects: 42% (1041/2477)
remote: Compressing objects: 43% (1066/2477)
remote: Compressing objects: 44% (1090/2477)
remote: Compressing objects: 45% (1115/2477)
remote: Compressing objects: 46% (1140/2477)
remote: Compressing objects: 47% (1165/2477)
remote: Compressing objects: 48% (1189/2477)
remote: Compressing objects: 49% (1214/2477)
remote: Compressing objects: 50% (1239/2477)
remote: Compressing objects: 51% (1264/2477)
remote: Compressing objects: 52% (1289/2477)
remote: Compressing objects: 53% (1313/2477)
remote: Compressing objects: 54% (1338/2477)
remote: Compressing objects: 55% (1363/2477)
remote: Compressing objects: 56% (1388/2477)
remote: Compressing objects: 57% (1412/2477)
remote: Compressing objects: 58% (1437/2477)
remote: Compressing objects: 59% (1462/2477)
remote: Compressing objects: 60% (1487/2477)
remote: Compressing objects: 61% (1511/2477)
remote: Compressing objects: 62% (1536/2477)
remote: Compressing objects: 63% (1561/2477)
remote: Compressing objects: 64% (1586/2477)
remote: Compressing objects: 65% (1611/2477)
remote: Compressing objects: 66% (1635/2477)
remote: Compressing objects: 67% (1660/2477)
remote: Compressing objects: 68% (1685/2477)
remote: Compressing objects: 69% (1710/2477)
remote: Compressing objects: 70% (1734/2477)
remote: Compressing objects: 71% (1759/2477)
remote: Compressing objects: 72% (1784/2477)
remote: Compressing objects: 73% (1809/2477)
remote: Compressing objects: 74% (1833/2477)
remote: Compressing objects: 75% (1858/2477)
remote: Compressing objects: 76% (1883/2477)
remote: Compressing objects: 77% (1908/2477)
remote: Compressing objects: 78% (1933/2477)
remote: Compressing objects: 79% (1957/2477)
remote: Compressing objects: 80% (1982/2477)
remote: Compressing objects: 81% (2007/2477)
remote: Compressing objects: 82% (2032/2477)
remote: Compressing objects: 83% (2056/2477)
remote: Compressing objects: 84% (2081/2477)
remote: Compressing objects: 85% (2106/2477)
remote: Compressing objects: 86% (2131/2477)
remote: Compressing objects: 87% (2155/2477)
remote: Compressing objects: 88% (2180/2477)
remote: Compressing objects: 89% (2205/2477)
remote: Compressing objects: 90% (2230/2477)
remote: Compressing objects: 91% (2255/2477)
remote: Compressing objects: 92% (2279/2477)
remote: Compressing objects: 93% (2304/2477)
remote: Compressing objects: 94% (2329/2477)
remote: Compressing objects: 95% (2354/2477)
remote: Compressing objects: 96% (2378/2477)
remote: Compressing objects: 97% (2403/2477)
remote: Compressing objects: 98% (2428/2477)
remote: Compressing objects: 99% (2453/2477)
remote: Compressing objects: 100% (2477/2477)
remote: Compressing objects: 100% (2477/2477), done.
6.96 s
Receiving objects: 0% (1/64545)
Receiving objects: 1% (646/64545)
Receiving objects: 2% (1291/64545)
Receiving objects: 3% (1937/64545)
Receiving objects: 4% (2582/64545)
Receiving objects: 5% (3228/64545)
Receiving objects: 6% (3873/64545)
Receiving objects: 7% (4519/64545)
Receiving objects: 8% (5164/64545)
Receiving objects: 9% (5810/64545)
Receiving objects: 10% (6455/64545)
Receiving objects: 11% (7100/64545), 14.14 MiB | 28.26 MiB/s
Receiving objects: 12% (7746/64545), 14.14 MiB | 28.26 MiB/s
Receiving objects: 13% (8391/64545), 14.14 MiB | 28.26 MiB/s
Receiving objects: 14% (9037/64545), 14.14 MiB | 28.26 MiB/s
Receiving objects: 15% (9682/64545), 14.14 MiB | 28.26 MiB/s
Receiving objects: 16% (10328/64545), 14.14 MiB | 28.26 MiB/s
Receiving objects: 17% (10973/64545), 14.14 MiB | 28.26 MiB/s
Receiving objects: 18% (11619/64545), 14.14 MiB | 28.26 MiB/s
Receiving objects: 19% (12264/64545), 14.14 MiB | 28.26 MiB/s
Receiving objects: 20% (12909/64545), 14.14 MiB | 28.26 MiB/s
Receiving objects: 21% (13555/64545), 14.14 MiB | 28.26 MiB/s
Receiving objects: 22% (14200/64545), 14.14 MiB | 28.26 MiB/s
Receiving objects: 23% (14846/64545), 14.14 MiB | 28.26 MiB/s
Receiving objects: 24% (15491/64545), 14.14 MiB | 28.26 MiB/s
Receiving objects: 25% (16137/64545), 14.14 MiB | 28.26 MiB/s
Receiving objects: 26% (16782/64545), 14.14 MiB | 28.26 MiB/s
Receiving objects: 27% (17428/64545), 14.14 MiB | 28.26 MiB/s
Receiving objects: 28% (18073/64545), 14.14 MiB | 28.26 MiB/s
Receiving objects: 29% (18719/64545), 14.14 MiB | 28.26 MiB/s
Receiving objects: 30% (19364/64545), 14.14 MiB | 28.26 MiB/s
Receiving objects: 31% (20009/64545), 14.14 MiB | 28.26 MiB/s
Receiving objects: 32% (20655/64545), 14.14 MiB | 28.26 MiB/s
Receiving objects: 33% (21300/64545), 14.14 MiB | 28.26 MiB/s
Receiving objects: 34% (21946/64545), 14.14 MiB | 28.26 MiB/s
Receiving objects: 35% (22591/64545), 14.14 MiB | 28.26 MiB/s
Receiving objects: 36% (23237/64545), 14.14 MiB | 28.26 MiB/s
Receiving objects: 37% (23882/64545), 14.14 MiB | 28.26 MiB/s
Receiving objects: 38% (24528/64545), 14.14 MiB | 28.26 MiB/s
Receiving objects: 39% (25173/64545), 14.14 MiB | 28.26 MiB/s
Receiving objects: 40% (25818/64545), 14.14 MiB | 28.26 MiB/s
Receiving objects: 41% (26464/64545), 14.14 MiB | 28.26 MiB/s
Receiving objects: 42% (27109/64545), 14.14 MiB | 28.26 MiB/s
Receiving objects: 43% (27755/64545), 14.14 MiB | 28.26 MiB/s
Receiving objects: 44% (28400/64545), 14.14 MiB | 28.26 MiB/s
Receiving objects: 45% (29046/64545), 14.14 MiB | 28.26 MiB/s
Receiving objects: 46% (29691/64545), 14.14 MiB | 28.26 MiB/s
Receiving objects: 47% (30337/64545), 14.14 MiB | 28.26 MiB/s
Receiving objects: 48% (30982/64545), 14.14 MiB | 28.26 MiB/s
Receiving objects: 49% (31628/64545), 14.14 MiB | 28.26 MiB/s
Receiving objects: 50% (32273/64545), 14.14 MiB | 28.26 MiB/s
Receiving objects: 50% (32893/64545), 14.14 MiB | 28.26 MiB/s
Receiving objects: 51% (32918/64545), 29.88 MiB | 29.90 MiB/s
Receiving objects: 52% (33564/64545), 29.88 MiB | 29.90 MiB/s
Receiving objects: 53% (34209/64545), 29.88 MiB | 29.90 MiB/s
Receiving objects: 54% (34855/64545), 29.88 MiB | 29.90 MiB/s
Receiving objects: 55% (35500/64545), 29.88 MiB | 29.90 MiB/s
Receiving objects: 56% (36146/64545), 29.88 MiB | 29.90 MiB/s
Receiving objects: 57% (36791/64545), 29.88 MiB | 29.90 MiB/s
Receiving objects: 58% (37437/64545), 45.14 MiB | 30.07 MiB/s
Receiving objects: 59% (38082/64545), 45.14 MiB | 30.07 MiB/s
Receiving objects: 60% (38727/64545), 45.14 MiB | 30.07 MiB/s
Receiving objects: 61% (39373/64545), 45.14 MiB | 30.07 MiB/s
Receiving objects: 62% (40018/64545), 45.14 MiB | 30.07 MiB/s
Receiving objects: 63% (40664/64545), 45.14 MiB | 30.07 MiB/s
Receiving objects: 64% (41309/64545), 45.14 MiB | 30.07 MiB/s
Receiving objects: 65% (41955/64545), 45.14 MiB | 30.07 MiB/s
Receiving objects: 66% (42600/64545), 45.14 MiB | 30.07 MiB/s
Receiving objects: 66% (42766/64545), 45.14 MiB | 30.07 MiB/s
Receiving objects: 67% (43246/64545), 60.18 MiB | 30.07 MiB/s
Receiving objects: 68% (43891/64545), 60.18 MiB | 30.07 MiB/s
Receiving objects: 69% (44537/64545), 60.18 MiB | 30.07 MiB/s
Receiving objects: 70% (45182/64545), 60.18 MiB | 30.07 MiB/s
Receiving objects: 71% (45827/64545), 60.18 MiB | 30.07 MiB/s
Receiving objects: 72% (46473/64545), 60.18 MiB | 30.07 MiB/s
Receiving objects: 73% (47118/64545), 60.18 MiB | 30.07 MiB/s
Receiving objects: 74% (47764/64545), 60.18 MiB | 30.07 MiB/s
Receiving objects: 75% (48409/64545), 60.18 MiB | 30.07 MiB/s
Receiving objects: 76% (49055/64545), 60.18 MiB | 30.07 MiB/s
Receiving objects: 77% (49700/64545), 60.18 MiB | 30.07 MiB/s
Receiving objects: 78% (50346/64545), 60.18 MiB | 30.07 MiB/s
Receiving objects: 79% (50991/64545), 60.18 MiB | 30.07 MiB/s
Receiving objects: 80% (51636/64545), 75.52 MiB | 30.19 MiB/s
Receiving objects: 81% (52282/64545), 75.52 MiB | 30.19 MiB/s
Receiving objects: 82% (52927/64545), 75.52 MiB | 30.19 MiB/s
Receiving objects: 83% (53573/64545), 75.52 MiB | 30.19 MiB/s
Receiving objects: 84% (54218/64545), 75.52 MiB | 30.19 MiB/s
Receiving objects: 85% (54864/64545), 75.52 MiB | 30.19 MiB/s
Receiving objects: 86% (55509/64545), 75.52 MiB | 30.19 MiB/s
Receiving objects: 87% (56155/64545), 75.52 MiB | 30.19 MiB/s
Receiving objects: 88% (56800/64545), 75.52 MiB | 30.19 MiB/s
Receiving objects: 89% (57446/64545), 75.52 MiB | 30.19 MiB/s
Receiving objects: 90% (58091/64545), 75.52 MiB | 30.19 MiB/s
Receiving objects: 91% (58736/64545), 75.52 MiB | 30.19 MiB/s
Receiving objects: 92% (59382/64545), 75.52 MiB | 30.19 MiB/s
Receiving objects: 93% (60027/64545), 75.52 MiB | 30.19 MiB/s
Receiving objects: 94% (60673/64545), 75.52 MiB | 30.19 MiB/s
Receiving objects: 95% (61318/64545), 75.52 MiB | 30.19 MiB/s
Receiving objects: 95% (61571/64545), 75.52 MiB | 30.19 MiB/s
Receiving objects: 96% (61964/64545), 90.68 MiB | 30.21 MiB/s
Receiving objects: 97% (62609/64545), 90.68 MiB | 30.21 MiB/s
Receiving objects: 98% (63255/64545), 90.68 MiB | 30.21 MiB/s
Receiving objects: 99% (63900/64545), 90.68 MiB | 30.21 MiB/s
remote: Total 64545 (delta 7628), reused 8035 (delta 6856), pack-reused 54646 (from 3)
6.98 s
Receiving objects: 100% (64545/64545), 90.68 MiB | 30.21 MiB/s
Receiving objects: 100% (64545/64545), 99.02 MiB | 30.29 MiB/s, done.
7.69 s
Resolving deltas: 0% (0/44558)
Resolving deltas: 1% (446/44558)
Resolving deltas: 2% (892/44558)
Resolving deltas: 3% (1338/44558)
Resolving deltas: 4% (1787/44558)
Resolving deltas: 5% (2228/44558)
Resolving deltas: 6% (2674/44558)
Resolving deltas: 7% (3121/44558)
Resolving deltas: 8% (3565/44558)
Resolving deltas: 9% (4011/44558)
Resolving deltas: 10% (4456/44558)
Resolving deltas: 11% (4902/44558)
Resolving deltas: 12% (5347/44558)
Resolving deltas: 13% (5793/44558)
Resolving deltas: 14% (6240/44558)
Resolving deltas: 15% (6688/44558)
Resolving deltas: 16% (7130/44558)
Resolving deltas: 17% (7575/44558)
Resolving deltas: 18% (8021/44558)
Resolving deltas: 19% (8467/44558)
Resolving deltas: 20% (8912/44558)
Resolving deltas: 21% (9358/44558)
Resolving deltas: 22% (9803/44558)
Resolving deltas: 23% (10249/44558)
Resolving deltas: 24% (10695/44558)
Resolving deltas: 25% (11140/44558)
Resolving deltas: 26% (11586/44558)
Resolving deltas: 27% (12031/44558)
Resolving deltas: 28% (12477/44558)
Resolving deltas: 29% (12924/44558)
Resolving deltas: 30% (13368/44558)
Resolving deltas: 31% (13813/44558)
Resolving deltas: 32% (14259/44558)
Resolving deltas: 33% (14705/44558)
Resolving deltas: 34% (15150/44558)
Resolving deltas: 35% (15596/44558)
Resolving deltas: 36% (16041/44558)
Resolving deltas: 37% (16487/44558)
Resolving deltas: 38% (16933/44558)
Resolving deltas: 39% (17378/44558)
Resolving deltas: 40% (17824/44558)
Resolving deltas: 41% (18269/44558)
Resolving deltas: 42% (18715/44558)
Resolving deltas: 43% (19160/44558)
Resolving deltas: 44% (19606/44558)
Resolving deltas: 45% (20052/44558)
Resolving deltas: 46% (20499/44558)
Resolving deltas: 47% (20945/44558)
Resolving deltas: 48% (21388/44558)
Resolving deltas: 49% (21834/44558)
Resolving deltas: 50% (22279/44558)
Resolving deltas: 51% (22725/44558)
Resolving deltas: 52% (23171/44558)
Resolving deltas: 53% (23616/44558)
Resolving deltas: 54% (24062/44558)
Resolving deltas: 55% (24508/44558)
Resolving deltas: 56% (24953/44558)
Resolving deltas: 57% (25399/44558)
Resolving deltas: 58% (25847/44558)
Resolving deltas: 59% (26290/44558)
Resolving deltas: 60% (26735/44558)
Resolving deltas: 61% (27181/44558)
Resolving deltas: 62% (27626/44558)
Resolving deltas: 63% (28072/44558)
Resolving deltas: 64% (28518/44558)
Resolving deltas: 65% (28963/44558)
Resolving deltas: 66% (29409/44558)
Resolving deltas: 67% (29854/44558)
Resolving deltas: 68% (30300/44558)
Resolving deltas: 69% (30746/44558)
Resolving deltas: 70% (31191/44558)
Resolving deltas: 71% (31637/44558)
Resolving deltas: 72% (32084/44558)
Resolving deltas: 73% (32528/44558)
Resolving deltas: 74% (32973/44558)
Resolving deltas: 75% (33419/44558)
Resolving deltas: 76% (33865/44558)
Resolving deltas: 77% (34310/44558)
Resolving deltas: 78% (34756/44558)
Resolving deltas: 79% (35201/44558)
Resolving deltas: 80% (35650/44558)
Resolving deltas: 81% (36092/44558)
Resolving deltas: 82% (36539/44558)
Resolving deltas: 83% (36984/44558)
Resolving deltas: 84% (37429/44558)
Resolving deltas: 85% (37875/44558)
Resolving deltas: 86% (38320/44558)
Resolving deltas: 87% (38766/44558)
Resolving deltas: 88% (39212/44558)
Resolving deltas: 89% (39657/44558)
Resolving deltas: 90% (40103/44558)
Resolving deltas: 91% (40548/44558)
Resolving deltas: 92% (40994/44558)
Resolving deltas: 93% (41439/44558)
Resolving deltas: 94% (41885/44558)
Resolving deltas: 95% (42331/44558)
Resolving deltas: 96% (42776/44558)
Resolving deltas: 97% (43222/44558)
Resolving deltas: 98% (43667/44558)
Resolving deltas: 99% (44113/44558)
Resolving deltas: 100% (44558/44558)
Resolving deltas: 100% (44558/44558), done.
8.01 s
Fetching commit 5c3e7fca0a6881b11af8a1b5285c69bb7fe221d1 for raised_energy_cff_wip ...
8.01 s
$ /nix/store/bcnisk3ydfgv26v2gw3zlky24g00yww2-git-2.54.0/bin/git fetch origin 5c3e7fca0a6881b11af8a1b5285c69bb7fe221d1
8.46 s
From https://github.com/alphal00p/gammaloop
8.46 s
* branch 5c3e7fca0a6881b11af8a1b5285c69bb7fe221d1 -> FETCH_HEAD
8.48 s
$ /nix/store/9ypz3flqsrl5xl495mm8h645gadjsxi1-coreutils-9.11/bin/timeout --kill-after=15s 7200s /nix/store/bcnisk3ydfgv26v2gw3zlky24g00yww2-git-2.54.0/bin/git -c advice.detachedHead=false checkout 5c3e7fca0a6881b11af8a1b5285c69bb7fe221d1
8.67 s
HEAD is now at 5c3e7fca fix(uv): rebuild exact CFF sources from edge provenance
8.68 s
$ /nix/store/9ypz3flqsrl5xl495mm8h645gadjsxi1-coreutils-9.11/bin/timeout --kill-after=15s 7200s /nix/store/23zk8sgzamrbmj1fday15szf7f2279s8-nix-2.34.7/bin/nix --extra-experimental-features nix-command --extra-experimental-features flakes --log-format internal-json run .#packages.x86_64-linux.nix-ci-check-gammaloop-nextest-core --print-build-logs
13.77 s
21.98 s
evaluating derivation 'g
copying '/nix/store/07vg
evaluating derivation 'g
copying '/nix/store/07vg
evaluating derivation 'g
copying '/nix/store/07vg
evaluating derivation 'g
copying '/nix/store/07vg
evaluating derivation 'g
copying '/nix/store/07vg
evaluating derivation 'g
copying '/nix/store/07vg
evaluating derivation 'g
copying '/nix/store/07vg
evaluating derivation 'g
copying '/nix/store/07vg
evaluating derivation 'g
copying '/nix/store/07vg
evaluating derivation 'g
copying '/nix/store/07vg
evaluating derivation 'g
querying gammaloop-nexte
[0 /1 built, 0.0 KiB DL]
[1 /0 /1 built, 0.0 KiB DLgammaloop-nextest-core> Extracting 3 binaries (including 1 non-test binary), 1 build script output directory, and 2 linked paths to /build/nextest-archive-lJgXhe
22.71 s
gammaloop-nextest-core> Extracted 18 files to /build/nextest-archive-lJgXhe in 0.74s
22.73 s
gammaloop-nextest-core> ------------
22.73 s
gammaloop-nextest-core> Nextest run ID 6a252a1e-04c0-4fda-9d62-02d2449c6dec with nextest profile: ci_gammaloop
22.73 s
gammaloop-nextest-core> Starting 375 tests across 2 binaries
23.47 s
gammaloop-nextest-core> ------------
23.47 s
gammaloop-nextest-core> Summary [ 0.745s] 375 tests run: 375 passed , 0 skipped
23.65 s
gammaloop-nextest-core>
23.65 s
gammaloop-nextest-core> ========== nextest test summary ==========
23.65 s
gammaloop-nextest-core> report: target/nextest/ci_gammaloop/junit.xml
23.65 s
gammaloop-nextest-core> tests: 375, failures: 0, errors: 0
23.65 s
gammaloop-nextest-core> No failing testcases found.
23.65 s
gammaloop-nextest-core> =========================================
23.67 s
gammaloop-nextest-core> Extracting 1 binary and 1 linked path to /build/nextest-archive-vkGtcM
23.77 s
gammaloop-nextest-core> Extracted 7 files to /build/nextest-archive-vkGtcM in 0.10s
23.78 s
gammaloop-nextest-core> ------------
23.78 s
gammaloop-nextest-core> Nextest run ID 2698274b-d634-402c-9456-b9f0055796d3 with nextest profile: ci_gammaloop
23.78 s
gammaloop-nextest-core> Starting 19 tests across 1 binary
23.79 s
gammaloop-nextest-core> ------------
23.79 s
gammaloop-nextest-core> Summary [ 0.014s] 19 tests run: 19 passed , 0 skipped
23.85 s
gammaloop-nextest-core>
23.85 s
gammaloop-nextest-core> ========== nextest test summary ==========
23.85 s
gammaloop-nextest-core> report: target/nextest/ci_gammaloop/junit.xml
23.85 s
gammaloop-nextest-core> tests: 19, failures: 0, errors: 0
23.85 s
gammaloop-nextest-core> No failing testcases found.
23.85 s
gammaloop-nextest-core> =========================================
23.87 s
gammaloop-nextest-core> Extracting 1 binary to /build/nextest-archive-vyF8Dt
23.92 s
gammaloop-nextest-core> Extracted 4 files to /build/nextest-archive-vyF8Dt in 0.05s
23.93 s
gammaloop-nextest-core> ------------
23.93 s
gammaloop-nextest-core> Nextest run ID fbcf81d7-936a-4643-abd7-41ab67ddcbab with nextest profile: ci_gammaloop
23.93 s
gammaloop-nextest-core> Starting 0 tests across 1 binary
23.93 s
gammaloop-nextest-core> ------------
23.93 s
gammaloop-nextest-core> Summary [ 0.000s] 0 tests run: 0 passed , 0 skipped
23.99 s
gammaloop-nextest-core>
23.99 s
gammaloop-nextest-core> ========== nextest test summary ==========
23.99 s
gammaloop-nextest-core> report: target/nextest/ci_gammaloop/junit.xml
23.99 s
gammaloop-nextest-core> tests: 0, failures: 0, errors: 0
23.99 s
gammaloop-nextest-core> No failing testcases found.
23.99 s
gammaloop-nextest-core> =========================================
24.01 s
gammaloop-nextest-core> Extracting 4 binaries, 1 build script output directory, and 2 linked paths to /build/nextest-archive-GLFB8I
24.79 s
gammaloop-nextest-core> Extracted 18 files to /build/nextest-archive-GLFB8I in 0.78s
24.81 s
gammaloop-nextest-core> ------------
24.81 s
gammaloop-nextest-core> Nextest run ID 577b96a2-830a-4ee8-b49e-2e3c57a60f09 with nextest profile: ci_gammaloop
24.81 s
gammaloop-nextest-core> Starting 561 tests across 4 binaries (59 tests skipped , including 58 tests via profile.ci_gammaloop.default-filter )
25.04 s
gammaloop-nextest-core> FAIL [ 0.101s] ( 51/561) gammalooprs cff::tests :: stored_production_cff_uses_typed_energy_factor_ownership
25.04 s
gammaloop-nextest-core> stdout ---
25.04 s
gammaloop-nextest-core>
25.04 s
gammaloop-nextest-core> running 1 test
25.04 s
gammaloop-nextest-core> test cff::tests::stored_production_cff_uses_typed_energy_factor_ownership ... FAILED
25.04 s
gammaloop-nextest-core>
25.04 s
gammaloop-nextest-core> failures:
25.04 s
gammaloop-nextest-core>
25.04 s
gammaloop-nextest-core> failures:
25.04 s
gammaloop-nextest-core> cff::tests::stored_production_cff_uses_typed_energy_factor_ownership
25.04 s
gammaloop-nextest-core>
25.04 s
gammaloop-nextest-core> test result: FAILED. 0 passed; 1 failed; 0 ignored; 0 measured; 611 filtered out; finished in 0.09s
25.04 s
gammaloop-nextest-core>
25.04 s
gammaloop-nextest-core> stderr ---
25.04 s
gammaloop-nextest-core> The application panicked (crashed).
25.04 s
gammaloop-nextest-core> Message: assertion `left == right` failed
25.04 s
gammaloop-nextest-core> left: 1
25.04 s
gammaloop-nextest-core> right: -1
25.04 s
gammaloop-nextest-core> Location: crates/gammalooprs/src/cff/mod.rs :2721
25.04 s
gammaloop-nextest-core>
25.04 s
gammaloop-nextest-core> ━━━━━━━━━━━━━━━━━━━━━━━━━━━━━━━━━━ BACKTRACE ━━━━━━━━━━━━━━━━━━━━━━━━━━━━━━━━━━━
25.04 s
gammaloop-nextest-core> 1: <color_eyre[51793ea62743adbd]::config::PanicHook>::panic_report <unknown>
25.04 s
gammaloop-nextest-core> at <unknown source file> :<unknown line>
25.04 s
gammaloop-nextest-core> 2: <color_eyre[51793ea62743adbd]::config::PanicHook>::into_panic_hook::{closure#0} <unknown>
25.04 s
gammaloop-nextest-core> at <unknown source file> :<unknown line>
25.04 s
gammaloop-nextest-core> 3: std[bcb96dfbba0ab899]::panicking::panic_with_hook <unknown>
25.04 s
gammaloop-nextest-core> at <unknown source file> :<unknown line>
25.04 s
gammaloop-nextest-core> 4: std[bcb96dfbba0ab899]::panicking::panic_handler::{closure#0} <unknown>
25.04 s
gammaloop-nextest-core> at <unknown source file> :<unknown line>
25.04 s
gammaloop-nextest-core> 5: std[bcb96dfbba0ab899]::sys::backtrace::__rust_end_short_backtrace::<std[bcb96dfbba0ab899]::panicking::panic_handler::{closure#0}, !> <unknown>
25.04 s
gammaloop-nextest-core> at <unknown source file> :<unknown line>
25.04 s
gammaloop-nextest-core> 6: __rustc[6c289b9f9c454d21]::rust_begin_unwind <unknown>
25.04 s
gammaloop-nextest-core> at <unknown source file> :<unknown line>
25.04 s
gammaloop-nextest-core> 7: core[940e698046960fd5]::panicking::panic_fmt <unknown>
25.04 s
gammaloop-nextest-core> at <unknown source file> :<unknown line>
25.04 s
gammaloop-nextest-core> 8: core[940e698046960fd5]::panicking::assert_failed_inner <unknown>
25.04 s
gammaloop-nextest-core> at <unknown source file> :<unknown line>
25.04 s
gammaloop-nextest-core> 9: core[940e698046960fd5]::panicking::assert_failed::<i64, i64> <unknown>
25.04 s
gammaloop-nextest-core> at <unknown source file> :<unknown line>
25.04 s
gammaloop-nextest-core> 10: gammalooprs[972dff90865981f6]::cff::tests::stored_production_cff_uses_typed_energy_factor_ownership <unknown>
25.04 s
gammaloop-nextest-core> at <unknown source file> :<unknown line>
25.04 s
gammaloop-nextest-core> 11: <gammalooprs[972dff90865981f6]::cff::tests::stored_production_cff_uses_typed_energy_factor_ownership::{closure#0} as core[940e698046960fd5]::ops::function::FnOnce<()>>::call_once <unknown>
25.04 s
gammaloop-nextest-core> at <unknown source file> :<unknown line>
25.04 s
gammaloop-nextest-core> 12: test[75d6903177b1d7e9]::__rust_begin_short_backtrace::<core[940e698046960fd5]::result::Result<(), alloc[2ea6bcb46fca0c42]::string::String>, fn() -> core[940e698046960fd5]::result::Result<(), alloc[2ea6bcb46fca0c42]::string::String>> <unknown>
25.04 s
gammaloop-nextest-core> at <unknown source file> :<unknown line>
25.04 s
gammaloop-nextest-core> 13: test[75d6903177b1d7e9]::run_test::{closure#0} <unknown>
25.04 s
gammaloop-nextest-core> at <unknown source file> :<unknown line>
25.04 s
gammaloop-nextest-core> 14: std[bcb96dfbba0ab899]::sys::backtrace::__rust_begin_short_backtrace::<test[75d6903177b1d7e9]::run_test::{closure#1}, ()> <unknown>
25.04 s
gammaloop-nextest-core> at <unknown source file> :<unknown line>
25.04 s
gammaloop-nextest-core> 15: <std[bcb96dfbba0ab899]::thread::lifecycle::spawn_unchecked<test[75d6903177b1d7e9]::run_test::{closure#1}, ()>::{closure#1} as core[940e698046960fd5]::ops::function::FnOnce<()>>::call_once::{shim:vtable#0} <unknown>
25.04 s
gammaloop-nextest-core> at <unknown source file> :<unknown line>
25.04 s
gammaloop-nextest-core> 16: <std[bcb96dfbba0ab899]::sys::thread::unix::Thread>::new::thread_start <unknown>
25.04 s
gammaloop-nextest-core> at <unknown source file> :<unknown line>
25.04 s
gammaloop-nextest-core> 17: start_thread <unknown>
25.04 s
gammaloop-nextest-core> at <unknown source file> :<unknown line>
25.04 s
gammaloop-nextest-core> 18: __clone3 <unknown>
25.04 s
gammaloop-nextest-core> at <unknown source file> :<unknown line>
25.04 s
gammaloop-nextest-core>
25.04 s
gammaloop-nextest-core> Run with COLORBT_SHOW_HIDDEN=1 environment variable to disable frame filtering.
25.04 s
gammaloop-nextest-core> Run with RUST_BACKTRACE=full to include source snippets.
25.04 s
gammaloop-nextest-core>
26.16 s
gammaloop-nextest-core> FAIL [ 0.115s] (486/561) gammalooprs uv::approx::local_3d::tests :: production_emr_map_cancels_one_powered_denominator
26.16 s
gammaloop-nextest-core> stdout ---
26.16 s
gammaloop-nextest-core>
26.16 s
gammaloop-nextest-core> running 1 test
26.16 s
gammaloop-nextest-core> test uv::approx::local_3d::tests::production_emr_map_cancels_one_powered_denominator ... FAILED
26.16 s
gammaloop-nextest-core>
26.16 s
gammaloop-nextest-core> failures:
26.16 s
gammaloop-nextest-core>
26.16 s
gammaloop-nextest-core> failures:
26.16 s
gammaloop-nextest-core> uv::approx::local_3d::tests::production_emr_map_cancels_one_powered_denominator
26.16 s
gammaloop-nextest-core>
26.16 s
gammaloop-nextest-core> test result: FAILED. 0 passed; 1 failed; 0 ignored; 0 measured; 611 filtered out; finished in 0.10s
26.16 s
gammaloop-nextest-core>
26.16 s
gammaloop-nextest-core> stderr ---
26.16 s
gammaloop-nextest-core> The application panicked (crashed).
26.16 s
gammaloop-nextest-core> Message: summed exact-source powered and selected lower channels differ: powered=-1 𝑖 /8/𝜋^3, lower=1𝑖 /16/𝜋^3, difference=-3𝑖 /16/𝜋^3
26.16 s
gammaloop-nextest-core> Location: crates/gammalooprs/src/uv/approx/local_3d.rs :2047
26.16 s
gammaloop-nextest-core>
26.16 s
gammaloop-nextest-core> ━━━━━━━━━━━━━━━━━━━━━━━━━━━━━━━━━━ BACKTRACE ━━━━━━━━━━━━━━━━━━━━━━━━━━━━━━━━━━━
26.16 s
gammaloop-nextest-core> 1: <color_eyre[51793ea62743adbd]::config::PanicHook>::panic_report <unknown>
26.16 s
gammaloop-nextest-core> at <unknown source file> :<unknown line>
26.16 s
gammaloop-nextest-core> 2: <color_eyre[51793ea62743adbd]::config::PanicHook>::into_panic_hook::{closure#0} <unknown>
26.16 s
gammaloop-nextest-core> at <unknown source file> :<unknown line>
26.16 s
gammaloop-nextest-core> 3: std[bcb96dfbba0ab899]::panicking::panic_with_hook <unknown>
26.16 s
gammaloop-nextest-core> at <unknown source file> :<unknown line>
26.16 s
gammaloop-nextest-core> 4: std[bcb96dfbba0ab899]::panicking::panic_handler::{closure#0} <unknown>
26.16 s
gammaloop-nextest-core> at <unknown source file> :<unknown line>
26.16 s
gammaloop-nextest-core> 5: std[bcb96dfbba0ab899]::sys::backtrace::__rust_end_short_backtrace::<std[bcb96dfbba0ab899]::panicking::panic_handler::{closure#0}, !> <unknown>
26.16 s
gammaloop-nextest-core> at <unknown source file> :<unknown line>
26.16 s
gammaloop-nextest-core> 6: __rustc[6c289b9f9c454d21]::rust_begin_unwind <unknown>
26.16 s
gammaloop-nextest-core> at <unknown source file> :<unknown line>
26.16 s
gammaloop-nextest-core> 7: core[940e698046960fd5]::panicking::panic_fmt <unknown>
26.16 s
gammaloop-nextest-core> at <unknown source file> :<unknown line>
26.16 s
gammaloop-nextest-core> 8: gammalooprs[972dff90865981f6]::uv::approx::local_3d::tests::production_emr_map_cancels_one_powered_denominator <unknown>
26.16 s
gammaloop-nextest-core> at <unknown source file> :<unknown line>
26.16 s
gammaloop-nextest-core> 9: <gammalooprs[972dff90865981f6]::uv::approx::local_3d::tests::production_emr_map_cancels_one_powered_denominator::{closure#0} as core[940e698046960fd5]::ops::function::FnOnce<()>>::call_once <unknown>
26.16 s
gammaloop-nextest-core> at <unknown source file> :<unknown line>
26.16 s
gammaloop-nextest-core> 10: test[75d6903177b1d7e9]::__rust_begin_short_backtrace::<core[940e698046960fd5]::result::Result<(), alloc[2ea6bcb46fca0c42]::string::String>, fn() -> core[940e698046960fd5]::result::Result<(), alloc[2ea6bcb46fca0c42]::string::String>> <unknown>
26.16 s
gammaloop-nextest-core> at <unknown source file> :<unknown line>
26.16 s
gammaloop-nextest-core> 11: test[75d6903177b1d7e9]::run_test::{closure#0} <unknown>
26.16 s
gammaloop-nextest-core> at <unknown source file> :<unknown line>
26.16 s
gammaloop-nextest-core> 12: std[bcb96dfbba0ab899]::sys::backtrace::__rust_begin_short_backtrace::<test[75d6903177b1d7e9]::run_test::{closure#1}, ()> <unknown>
26.16 s
gammaloop-nextest-core> at <unknown source file> :<unknown line>
26.16 s
gammaloop-nextest-core> 13: <std[bcb96dfbba0ab899]::thread::lifecycle::spawn_unchecked<test[75d6903177b1d7e9]::run_test::{closure#1}, ()>::{closure#1} as core[940e698046960fd5]::ops::function::FnOnce<()>>::call_once::{shim:vtable#0} <unknown>
26.16 s
gammaloop-nextest-core> at <unknown source file> :<unknown line>
26.16 s
gammaloop-nextest-core> 14: <std[bcb96dfbba0ab899]::sys::thread::unix::Thread>::new::thread_start <unknown>
26.16 s
gammaloop-nextest-core> at <unknown source file> :<unknown line>
26.16 s
gammaloop-nextest-core> 15: start_thread <unknown>
26.16 s
gammaloop-nextest-core> at <unknown source file> :<unknown line>
26.16 s
gammaloop-nextest-core> 16: __clone3 <unknown>
26.16 s
gammaloop-nextest-core> at <unknown source file> :<unknown line>
26.16 s
gammaloop-nextest-core>
26.16 s
gammaloop-nextest-core> Run with COLORBT_SHOW_HIDDEN=1 environment variable to disable frame filtering.
26.16 s
gammaloop-nextest-core> Run with RUST_BACKTRACE=full to include source snippets.
26.16 s
gammaloop-nextest-core>
26.57 s
gammaloop-nextest-core> FAIL [ 0.224s] (525/561) gammalooprs uv::hedge_poset::tests :: spectacles_typed_4d_projects_after_local_construction
26.57 s
gammaloop-nextest-core> stdout ---
26.57 s
gammaloop-nextest-core>
26.57 s
gammaloop-nextest-core> running 1 test
26.57 s
gammaloop-nextest-core> digraph {
26.57 s
gammaloop-nextest-core> node [shape=circle,height=0.1,label=""];
26.57 s
gammaloop-nextest-core> overlap = "scale";
26.57 s
gammaloop-nextest-core> layout = "neato";
26.57 s
gammaloop-nextest-core> start=2;
26.57 s
gammaloop-nextest-core> 4 [label="0"];
26.57 s
gammaloop-nextest-core> 1 [label="zw"];
26.57 s
gammaloop-nextest-core> 2 [label="F"];
26.57 s
gammaloop-nextest-core> 0 [label="143"];
26.57 s
gammaloop-nextest-core> 3 [label="10B"];
26.57 s
gammaloop-nextest-core> 4:0:s -> 1:1:s [id=0 color="red:blue;0.5" label="zw"];
26.57 s
gammaloop-nextest-core> 4:2:s -> 2:3:s [id=1 color="red:blue;0.5" label="F"];
26.57 s
gammaloop-nextest-core> 3:5:s -> 0:4:s [id=2 color="red:blue;0.5" label="143"];
26.57 s
gammaloop-nextest-core> 4:6:s -> 0:7:s [id=3 color="red:blue;0.5" label="143"];
26.57 s
gammaloop-nextest-core> 1:8:s -> 3:9:s [id=4 color="red:blue;0.5" label="F"];
26.57 s
gammaloop-nextest-core> 1:10:s -> 0:11:s [id=5 color="red:blue;0.5" label="143"];
26.57 s
gammaloop-nextest-core> 2:12:s -> 3:13:s [id=6 color="red:blue;0.5" label="zw"];
26.57 s
gammaloop-nextest-core> 2:14:s -> 0:15:s [id=7 color="red:blue;0.5" label="143"];
26.57 s
gammaloop-nextest-core> }
26.57 s
gammaloop-nextest-core>
26.57 s
gammaloop-nextest-core> digraph {
26.57 s
gammaloop-nextest-core> node [shape=circle,height=0.1,label=""];
26.57 s
gammaloop-nextest-core> overlap = "scale";
26.57 s
gammaloop-nextest-core> layout = "neato";
26.57 s
gammaloop-nextest-core> start=2;
26.57 s
gammaloop-nextest-core> 0 [label="∅"];
26.57 s
gammaloop-nextest-core> 1 [label="{zw}: Approx(S_zw(0))"];
26.57 s
gammaloop-nextest-core> 2 [label="{F}: Approx(S_F(1))"];
26.57 s
gammaloop-nextest-core> 3 [label="{143}: Approx(S_143(3))"];
26.57 s
gammaloop-nextest-core> 4 [label="{zw,F}: Approx(S_F(4))*Approx(S_zw(0))"];
26.57 s
gammaloop-nextest-core> 5 [label="{zw} · {143}: Approx((-1*S_zw+S_143(5))*Approx(S_zw(0)))"];
26.57 s
gammaloop-nextest-core> 6 [label="{F} · {143}: Approx((-1*S_F+S_143(7))*Approx(S_F(1)))"];
26.57 s
gammaloop-nextest-core> 7 [label="{zw,F} · {143}: Approx((-1*S_10B+S_143(2))*Approx(S_F(4))*Approx(S_zw(0)))"];
26.57 s
gammaloop-nextest-core> 0:0:s -> 1:1:s [id=0 color="red:blue;0.5"];
26.57 s
gammaloop-nextest-core> 0:2:s -> 2:3:s [id=1 color="red:blue;0.5"];
26.57 s
gammaloop-nextest-core> 0:4:s -> 3:5:s [id=2 color="red:blue;0.5"];
26.57 s
gammaloop-nextest-core> 1:6:s -> 4:7:s [id=3 color="red:blue;0.5"];
26.57 s
gammaloop-nextest-core> 1:8:s -> 5:9:s [id=4 color="red:blue;0.5"];
26.57 s
gammaloop-nextest-core> 2:10:s -> 4:11:s [id=5 color="red:blue;0.5"];
26.57 s
gammaloop-nextest-core> 2:12:s -> 6:13:s [id=6 color="red:blue;0.5"];
26.57 s
gammaloop-nextest-core> 4:14:s -> 7:15:s [id=7 color="red:blue;0.5"];
26.57 s
gammaloop-nextest-core> }
26.57 s
gammaloop-nextest-core>
26.57 s
gammaloop-nextest-core> test uv::hedge_poset::tests::spectacles_typed_4d_projects_after_local_construction ... FAILED
26.57 s
gammaloop-nextest-core>
26.57 s
gammaloop-nextest-core> failures:
26.57 s
gammaloop-nextest-core>
26.57 s
gammaloop-nextest-core> failures:
26.57 s
gammaloop-nextest-core> uv::hedge_poset::tests::spectacles_typed_4d_projects_after_local_construction
26.57 s
gammaloop-nextest-core>
26.57 s
gammaloop-nextest-core> test result: FAILED. 0 passed; 1 failed; 0 ignored; 0 measured; 611 filtered out; finished in 0.20s
26.57 s
gammaloop-nextest-core>
26.57 s
gammaloop-nextest-core> stderr ---
26.57 s
gammaloop-nextest-core> Error:
26.57 s
gammaloop-nextest-core> 0: failed to extract three-dimensional representation graph input: source edge 1 has no unique routing for rewritten exact signature [-1, 0, 0] modulo the factorized opposite-domain loop span
26.57 s
gammaloop-nextest-core>
26.57 s
gammaloop-nextest-core> Location:
26.57 s
gammaloop-nextest-core> crates/gammalooprs/src/uv/approx/local_3d.rs :845
26.57 s
gammaloop-nextest-core>
26.57 s
gammaloop-nextest-core> ━━━━━━━━━━━━━━━━━━━━━━━━━━━━━━━━━━ BACKTRACE ━━━━━━━━━━━━━━━━━━━━━━━━━━━━━━━━━━━
26.57 s
gammaloop-nextest-core> 1: <color_eyre[51793ea62743adbd]::config::EyreHook>::into_eyre_hook::{closure#0} <unknown>
26.57 s
gammaloop-nextest-core> at <unknown source file> :<unknown line>
26.57 s
gammaloop-nextest-core> 2: eyre[cb2fd339c0c40fca]::capture_handler <unknown>
26.57 s
gammaloop-nextest-core> at <unknown source file> :<unknown line>
26.57 s
gammaloop-nextest-core> 3: <eyre[cb2fd339c0c40fca]::Report>::from_std::<three_dimensional_reps[3cb572ff22d197ac]::graph_io::GraphIoError> <unknown>
26.57 s
gammaloop-nextest-core> at <unknown source file> :<unknown line>
26.57 s
gammaloop-nextest-core> 4: <gammalooprs[972dff90865981f6]::uv::approx::local_3d::Localizer>::project_4d <unknown>
26.57 s
gammaloop-nextest-core> at <unknown source file> :<unknown line>
26.57 s
gammaloop-nextest-core> 5: gammalooprs[972dff90865981f6]::uv::hedge_poset::tests::spectacles_typed_4d_projects_after_local_construction <unknown>
26.57 s
gammaloop-nextest-core> at <unknown source file> :<unknown line>
26.57 s
gammaloop-nextest-core> 6: <gammalooprs[972dff90865981f6]::uv::hedge_poset::tests::spectacles_typed_4d_projects_after_local_construction::{closure#0} as core[940e698046960fd5]::ops::function::FnOnce<()>>::call_once <unknown>
26.57 s
gammaloop-nextest-core> at <unknown source file> :<unknown line>
26.57 s
gammaloop-nextest-core> 7: test[75d6903177b1d7e9]::__rust_begin_short_backtrace::<core[940e698046960fd5]::result::Result<(), alloc[2ea6bcb46fca0c42]::string::String>, fn() -> core[940e698046960fd5]::result::Result<(), alloc[2ea6bcb46fca0c42]::string::String>> <unknown>
26.57 s
gammaloop-nextest-core> at <unknown source file> :<unknown line>
26.57 s
gammaloop-nextest-core> 8: test[75d6903177b1d7e9]::run_test::{closure#0} <unknown>
26.57 s
gammaloop-nextest-core> at <unknown source file> :<unknown line>
26.57 s
gammaloop-nextest-core> 9: std[bcb96dfbba0ab899]::sys::backtrace::__rust_begin_short_backtrace::<test[75d6903177b1d7e9]::run_test::{closure#1}, ()> <unknown>
26.57 s
gammaloop-nextest-core> at <unknown source file> :<unknown line>
26.57 s
gammaloop-nextest-core> 10: <std[bcb96dfbba0ab899]::thread::lifecycle::spawn_unchecked<test[75d6903177b1d7e9]::run_test::{closure#1}, ()>::{closure#1} as core[940e698046960fd5]::ops::function::FnOnce<()>>::call_once::{shim:vtable#0} <unknown>
26.57 s
gammaloop-nextest-core> at <unknown source file> :<unknown line>
26.57 s
gammaloop-nextest-core> 11: <std[bcb96dfbba0ab899]::sys::thread::unix::Thread>::new::thread_start <unknown>
26.57 s
gammaloop-nextest-core> at <unknown source file> :<unknown line>
26.57 s
gammaloop-nextest-core> 12: start_thread <unknown>
26.57 s
gammaloop-nextest-core> at <unknown source file> :<unknown line>
26.57 s
gammaloop-nextest-core> 13: __clone3 <unknown>
26.57 s
gammaloop-nextest-core> at <unknown source file> :<unknown line>
26.57 s
gammaloop-nextest-core>
26.57 s
gammaloop-nextest-core> Run with COLORBT_SHOW_HIDDEN=1 environment variable to disable frame filtering.
26.57 s
gammaloop-nextest-core> Run with RUST_BACKTRACE=full to include source snippets.
26.57 s
gammaloop-nextest-core>
36.95 s
gammaloop-nextest-core> FAIL [ 10.328s] (559/561) gammalooprs uv::tests :: scalars_profile_new
36.98 s
gammaloop-nextest-core> stdout ---
36.98 s
gammaloop-nextest-core>
36.98 s
gammaloop-nextest-core> running 1 test
36.98 s
gammaloop-nextest-core> test uv::tests::scalars_profile_new ... FAILED
36.98 s
gammaloop-nextest-core>
36.98 s
gammaloop-nextest-core> failures:
36.98 s
gammaloop-nextest-core>
36.98 s
gammaloop-nextest-core> failures:
36.98 s
gammaloop-nextest-core> uv::tests::scalars_profile_new
36.98 s
gammaloop-nextest-core>
36.98 s
gammaloop-nextest-core> test result: FAILED. 0 passed; 1 failed; 0 ignored; 0 measured; 611 filtered out; finished in 10.30s
36.98 s
gammaloop-nextest-core>
36.98 s
gammaloop-nextest-core> stderr ---
36.98 s
gammaloop-nextest-core> [18:18:39.444] @gammalooprs::settings::runtime WARNING : No external kinematics were provided; using default-generated external momenta and helicities.
36.98 s
gammaloop-nextest-core> field value
36.98 s
gammaloop-nextest-core> span build_integrand{amplitude.name = bub}
36.98 s
gammaloop-nextest-core> at crates/gammalooprs/src/settings/runtime.rs:131
36.98 s
gammaloop-nextest-core> [18:18:39.445] @gammalooprs::integrands::process::amplitude INFO : Input is below threshold: 0 existing threshold E-surfaces across 0/3 graph groups
36.98 s
gammaloop-nextest-core> field value
36.98 s
gammaloop-nextest-core> existing_esurfaces 0
36.98 s
gammaloop-nextest-core> group_count 3
36.98 s
gammaloop-nextest-core> groups_above_threshold 0
36.98 s
gammaloop-nextest-core> integrand bub
36.98 s
gammaloop-nextest-core> span warm_up{integrand.name = bub}
36.98 s
gammaloop-nextest-core> threshold_status below threshold
36.98 s
gammaloop-nextest-core> at crates/gammalooprs/src/integrands/process/amplitude/mod.rs:1666
36.98 s
gammaloop-nextest-core> [18:18:39.445] @gammalooprs::integrands::process::amplitude INFO : overlap structure of group 0: [0: []]
36.98 s
gammaloop-nextest-core> field value
36.98 s
gammaloop-nextest-core> span warm_up{integrand.name = bub}
36.98 s
gammaloop-nextest-core> at crates/gammalooprs/src/integrands/process/amplitude/mod.rs:2015
36.98 s
gammaloop-nextest-core> [18:18:39.445] @gammalooprs::integrands::process::amplitude INFO : overlap structure of group 1: [0: []]
36.98 s
gammaloop-nextest-core> field value
36.98 s
gammaloop-nextest-core> span warm_up{integrand.name = bub}
36.98 s
gammaloop-nextest-core> at crates/gammalooprs/src/integrands/process/amplitude/mod.rs:2015
36.98 s
gammaloop-nextest-core> [18:18:39.445] @gammalooprs::integrands::process::amplitude INFO : overlap structure of group 2: [0: []]
36.98 s
gammaloop-nextest-core> field value
36.98 s
gammaloop-nextest-core> span warm_up{integrand.name = bub}
36.98 s
gammaloop-nextest-core> at crates/gammalooprs/src/integrands/process/amplitude/mod.rs:2015
36.98 s
gammaloop-nextest-core> The application panicked (crashed).
36.98 s
gammaloop-nextest-core> Message: assertion `left == right` failed: subtracted scalar UV profile failed:
36.98 s
gammaloop-nextest-core> UVProfilePassFail {
36.98 s
gammaloop-nextest-core> max_dod: -0.9,
36.98 s
gammaloop-nextest-core> total: 16,
36.98 s
gammaloop-nextest-core> failed: 1,
36.98 s
gammaloop-nextest-core> failures: [
36.98 s
gammaloop-nextest-core> UVProfileFailure {
36.98 s
gammaloop-nextest-core> graph_index: 0,
36.98 s
gammaloop-nextest-core> graph_name: "banana",
36.98 s
gammaloop-nextest-core> cutkosky_cut: None,
36.98 s
gammaloop-nextest-core> lmb_index: 1,
36.98 s
gammaloop-nextest-core> fixed: [
36.98 s
gammaloop-nextest-core> EdgeIndex(
36.98 s
gammaloop-nextest-core> 2,
36.98 s
gammaloop-nextest-core> ),
36.98 s
gammaloop-nextest-core> EdgeIndex(
36.98 s
gammaloop-nextest-core> 0,
36.98 s
gammaloop-nextest-core> ),
36.98 s
gammaloop-nextest-core> ],
36.98 s
gammaloop-nextest-core> free: [
36.98 s
gammaloop-nextest-core> EdgeIndex(
36.98 s
gammaloop-nextest-core> 3,
36.98 s
gammaloop-nextest-core> ),
36.98 s
gammaloop-nextest-core> ],
36.98 s
gammaloop-nextest-core> orientation_label: None,
36.98 s
gammaloop-nextest-core> reason: "dod_exceeds_threshold",
36.98 s
gammaloop-nextest-core> },
36.98 s
gammaloop-nextest-core> ],
36.98 s
gammaloop-nextest-core> }
36.98 s
gammaloop-nextest-core>
36.98 s
gammaloop-nextest-core> ╭─────────┬────────────┬───────────┬───────┬─────┬──────────┬───────────╮
36.98 s
gammaloop-nextest-core> │ fixed │ → ∞ │ slope │ r2 │ DOD │ bare DOD │ inspect │
36.98 s
gammaloop-nextest-core> ├─────────┼────────────┼───────────┼───────┼─────┼──────────┼───────────┤
36.98 s
gammaloop-nextest-core> │ {e1,e2} │ {e3} │ -0.996752 │ 1.000 │ -1 │ 0 │ arb retry │
36.98 s
gammaloop-nextest-core> │ {e1,e3} │ {e2} │ -1.065665 │ 0.997 │ -1 │ 0 │ arb retry │
36.98 s
gammaloop-nextest-core> │ {e1} │ {e2,e3} │ -0.937151 │ 0.943 │ -1 │ 2 │ │
36.98 s
gammaloop-nextest-core> │ {e2,e3} │ {e1} │ -1.001075 │ 1.000 │ -1 │ 0 │ arb retry │
36.98 s
gammaloop-nextest-core> │ {e2} │ {e1,e3} │ -0.984146 │ 0.998 │ -1 │ 2 │ │
36.98 s
gammaloop-nextest-core> │ {e3} │ {e1,e2} │ -1.383911 │ 0.982 │ -1 │ 2 │ arb retry │
36.98 s
gammaloop-nextest-core> │ {} │ {e1,e2,e3} │ -1.094213 │ 0.258 │ -1 │ 4 │ │
36.98 s
gammaloop-nextest-core> │ {e2,e0} │ {e3} │ -0.803348 │ 0.861 │ -1 │ 0 │ arb retry │
36.98 s
gammaloop-nextest-core> │ {e3,e0} │ {e2} │ -0.999257 │ 1.000 │ -1 │ 0 │ │
36.98 s
gammaloop-nextest-core> │ {e0} │ {e2,e3} │ -1.000893 │ 1.000 │ -1 │ 2 │ │
36.98 s
gammaloop-nextest-core> │ {e1,e0} │ {e3} │ -0.997860 │ 1.000 │ -1 │ 0 │ │
36.98 s
gammaloop-nextest-core> ╰─────────┴────────────┴───────────┴───────┴─────┴──────────┴───────────╯
36.98 s
gammaloop-nextest-core>
36.98 s
gammaloop-nextest-core> ╭───────┬─────────┬───────────┬───────┬─────┬──────────┬───────────╮
36.98 s
gammaloop-nextest-core> │ fixed │ → ∞ │ slope │ r2 │ DOD │ bare DOD │ inspect │
36.98 s
gammaloop-nextest-core> ├───────┼─────────┼───────────┼───────┼─────┼──────────┼───────────┤
36.98 s
gammaloop-nextest-core> │ {e1} │ {e2} │ -1.005039 │ 1.000 │ -1 │ 0 │ arb retry │
36.98 s
gammaloop-nextest-core> │ {e2} │ {e1} │ -1.001098 │ 1.000 │ -1 │ 0 │ arb retry │
36.98 s
gammaloop-nextest-core> │ {} │ {e1,e2} │ -1.011289 │ 1.000 │ -1 │ 2 │ │
36.98 s
gammaloop-nextest-core> │ {e0} │ {e2} │ -0.998140 │ 1.000 │ -1 │ 0 │ │
36.98 s
gammaloop-nextest-core> ╰───────┴─────────┴───────────┴───────┴─────┴──────────┴───────────╯
36.98 s
gammaloop-nextest-core>
36.98 s
gammaloop-nextest-core> ╭───────┬──────┬───────────┬───────┬─────┬──────────┬─────────╮
36.98 s
gammaloop-nextest-core> │ fixed │ → ∞ │ slope │ r2 │ DOD │ bare DOD │ inspect │
36.98 s
gammaloop-nextest-core> ├───────┼──────┼───────────┼───────┼─────┼──────────┼─────────┤
36.98 s
gammaloop-nextest-core> │ {} │ {e1} │ -0.989949 │ 1.000 │ -1 │ 0 │ │
36.98 s
gammaloop-nextest-core> ╰───────┴──────┴───────────┴───────┴─────┴──────────┴─────────╯
36.98 s
gammaloop-nextest-core> left: 1
36.98 s
gammaloop-nextest-core> right: 0
36.98 s
gammaloop-nextest-core> Location: crates/gammalooprs/src/uv/tests.rs :325
36.98 s
gammaloop-nextest-core>
36.98 s
gammaloop-nextest-core> ━━━━━━━━━━━━━━━━━━━━━━━━━━━━━━━━━━ BACKTRACE ━━━━━━━━━━━━━━━━━━━━━━━━━━━━━━━━━━━
36.98 s
gammaloop-nextest-core> 1: <color_eyre[51793ea62743adbd]::config::PanicHook>::panic_report <unknown>
36.98 s
gammaloop-nextest-core> at <unknown source file> :<unknown line>
36.98 s
gammaloop-nextest-core> 2: <color_eyre[51793ea62743adbd]::config::PanicHook>::into_panic_hook::{closure#0} <unknown>
36.98 s
gammaloop-nextest-core> at <unknown source file> :<unknown line>
36.98 s
gammaloop-nextest-core> 3: std[bcb96dfbba0ab899]::panicking::panic_with_hook <unknown>
36.98 s
gammaloop-nextest-core> at <unknown source file> :<unknown line>
36.98 s
gammaloop-nextest-core> 4: std[bcb96dfbba0ab899]::panicking::panic_handler::{closure#0} <unknown>
36.98 s
gammaloop-nextest-core> at <unknown source file> :<unknown line>
36.98 s
gammaloop-nextest-core> 5: std[bcb96dfbba0ab899]::sys::backtrace::__rust_end_short_backtrace::<std[bcb96dfbba0ab899]::panicking::panic_handler::{closure#0}, !> <unknown>
36.98 s
gammaloop-nextest-core> at <unknown source file> :<unknown line>
36.98 s
gammaloop-nextest-core> 6: __rustc[6c289b9f9c454d21]::rust_begin_unwind <unknown>
36.98 s
gammaloop-nextest-core> at <unknown source file> :<unknown line>
36.98 s
gammaloop-nextest-core> 7: core[940e698046960fd5]::panicking::panic_fmt <unknown>
36.98 s
gammaloop-nextest-core> at <unknown source file> :<unknown line>
36.98 s
gammaloop-nextest-core> 8: core[940e698046960fd5]::panicking::assert_failed_inner <unknown>
36.98 s
gammaloop-nextest-core> at <unknown source file> :<unknown line>
36.98 s
gammaloop-nextest-core> 9: core[940e698046960fd5]::panicking::assert_failed::<usize, usize> <unknown>
36.98 s
gammaloop-nextest-core> at <unknown source file> :<unknown line>
36.98 s
gammaloop-nextest-core> 10: gammalooprs[972dff90865981f6]::uv::tests::scalars_profile_new <unknown>
36.98 s
gammaloop-nextest-core> at <unknown source file> :<unknown line>
36.98 s
gammaloop-nextest-core> 11: <gammalooprs[972dff90865981f6]::uv::tests::scalars_profile_new::{closure#0} as core[940e698046960fd5]::ops::function::FnOnce<()>>::call_once <unknown>
36.98 s
gammaloop-nextest-core> at <unknown source file> :<unknown line>
36.98 s
gammaloop-nextest-core> 12: test[75d6903177b1d7e9]::__rust_begin_short_backtrace::<core[940e698046960fd5]::result::Result<(), alloc[2ea6bcb46fca0c42]::string::String>, fn() -> core[940e698046960fd5]::result::Result<(), alloc[2ea6bcb46fca0c42]::string::String>> <unknown>
36.98 s
gammaloop-nextest-core> at <unknown source file> :<unknown line>
36.98 s
gammaloop-nextest-core> 13: test[75d6903177b1d7e9]::run_test::{closure#0} <unknown>
36.98 s
gammaloop-nextest-core> at <unknown source file> :<unknown line>
36.98 s
gammaloop-nextest-core> 14: std[bcb96dfbba0ab899]::sys::backtrace::__rust_begin_short_backtrace::<test[75d6903177b1d7e9]::run_test::{closure#1}, ()> <unknown>
36.98 s
gammaloop-nextest-core> at <unknown source file> :<unknown line>
36.98 s
gammaloop-nextest-core> 15: <std[bcb96dfbba0ab899]::thread::lifecycle::spawn_unchecked<test[75d6903177b1d7e9]::run_test::{closure#1}, ()>::{closure#1} as core[940e698046960fd5]::ops::function::FnOnce<()>>::call_once::{shim:vtable#0} <unknown>
36.98 s
gammaloop-nextest-core> at <unknown source file> :<unknown line>
36.98 s
gammaloop-nextest-core> 16: <std[bcb96dfbba0ab899]::sys::thread::unix::Thread>::new::thread_start <unknown>
36.98 s
gammaloop-nextest-core> at <unknown source file> :<unknown line>
36.98 s
gammaloop-nextest-core> 17: start_thread <unknown>
36.98 s
gammaloop-nextest-core> at <unknown source file> :<unknown line>
36.98 s
gammaloop-nextest-core> 18: __clone3 <unknown>
36.98 s
gammaloop-nextest-core> at <unknown source file> :<unknown line>
36.98 s
gammaloop-nextest-core>
36.98 s
gammaloop-nextest-core> Run with COLORBT_SHOW_HIDDEN=1 environment variable to disable frame filtering.
36.98 s
gammaloop-nextest-core> Run with RUST_BACKTRACE=full to include source snippets.
36.98 s
gammaloop-nextest-core>
36.98 s
gammaloop-nextest-core> FAIL [ 10.344s] (560/561) gammalooprs uv::tests :: scalars_profile
36.98 s
gammaloop-nextest-core> stdout ---
36.98 s
gammaloop-nextest-core>
36.98 s
gammaloop-nextest-core> running 1 test
36.98 s
gammaloop-nextest-core> test uv::tests::scalars_profile ... FAILED
36.98 s
gammaloop-nextest-core>
36.98 s
gammaloop-nextest-core> failures:
36.98 s
gammaloop-nextest-core>
36.98 s
gammaloop-nextest-core> failures:
36.98 s
gammaloop-nextest-core> uv::tests::scalars_profile
36.98 s
gammaloop-nextest-core>
36.98 s
gammaloop-nextest-core> test result: FAILED. 0 passed; 1 failed; 0 ignored; 0 measured; 611 filtered out; finished in 10.32s
36.98 s
gammaloop-nextest-core>
36.98 s
gammaloop-nextest-core> stderr ---
36.98 s
gammaloop-nextest-core> [18:18:39.434] @gammalooprs::settings::runtime WARNING : No external kinematics were provided; using default-generated external momenta and helicities.
36.98 s
gammaloop-nextest-core> field value
36.98 s
gammaloop-nextest-core> span build_integrand{amplitude.name = bub}
36.98 s
gammaloop-nextest-core> at crates/gammalooprs/src/settings/runtime.rs:131
36.98 s
gammaloop-nextest-core> [18:18:39.435] @gammalooprs::integrands::process::amplitude INFO : Input is below threshold: 0 existing threshold E-surfaces across 0/3 graph groups
36.98 s
gammaloop-nextest-core> field value
36.98 s
gammaloop-nextest-core> existing_esurfaces 0
36.98 s
gammaloop-nextest-core> group_count 3
36.98 s
gammaloop-nextest-core> groups_above_threshold 0
36.98 s
gammaloop-nextest-core> integrand bub
36.98 s
gammaloop-nextest-core> span warm_up{integrand.name = bub}
36.98 s
gammaloop-nextest-core> threshold_status below threshold
36.98 s
gammaloop-nextest-core> at crates/gammalooprs/src/integrands/process/amplitude/mod.rs:1666
36.98 s
gammaloop-nextest-core> [18:18:39.435] @gammalooprs::integrands::process::amplitude INFO : overlap structure of group 0: [0: []]
36.98 s
gammaloop-nextest-core> field value
36.98 s
gammaloop-nextest-core> span warm_up{integrand.name = bub}
36.98 s
gammaloop-nextest-core> at crates/gammalooprs/src/integrands/process/amplitude/mod.rs:2015
36.98 s
gammaloop-nextest-core> [18:18:39.435] @gammalooprs::integrands::process::amplitude INFO : overlap structure of group 1: [0: []]
36.98 s
gammaloop-nextest-core> field value
36.98 s
gammaloop-nextest-core> span warm_up{integrand.name = bub}
36.98 s
gammaloop-nextest-core> at crates/gammalooprs/src/integrands/process/amplitude/mod.rs:2015
36.98 s
gammaloop-nextest-core> [18:18:39.435] @gammalooprs::integrands::process::amplitude INFO : overlap structure of group 2: [0: []]
36.98 s
gammaloop-nextest-core> field value
36.98 s
gammaloop-nextest-core> span warm_up{integrand.name = bub}
36.98 s
gammaloop-nextest-core> at crates/gammalooprs/src/integrands/process/amplitude/mod.rs:2015
36.98 s
gammaloop-nextest-core> The application panicked (crashed).
36.98 s
gammaloop-nextest-core> Message: assertion `left == right` failed: subtracted scalar UV profile failed:
36.98 s
gammaloop-nextest-core> UVProfilePassFail {
36.98 s
gammaloop-nextest-core> max_dod: -0.9,
36.98 s
gammaloop-nextest-core> total: 16,
36.98 s
gammaloop-nextest-core> failed: 1,
36.98 s
gammaloop-nextest-core> failures: [
36.98 s
gammaloop-nextest-core> UVProfileFailure {
36.98 s
gammaloop-nextest-core> graph_index: 0,
36.98 s
gammaloop-nextest-core> graph_name: "banana",
36.98 s
gammaloop-nextest-core> cutkosky_cut: None,
36.98 s
gammaloop-nextest-core> lmb_index: 1,
36.98 s
gammaloop-nextest-core> fixed: [
36.98 s
gammaloop-nextest-core> EdgeIndex(
36.98 s
gammaloop-nextest-core> 2,
36.98 s
gammaloop-nextest-core> ),
36.98 s
gammaloop-nextest-core> EdgeIndex(
36.98 s
gammaloop-nextest-core> 0,
36.98 s
gammaloop-nextest-core> ),
36.98 s
gammaloop-nextest-core> ],
36.98 s
gammaloop-nextest-core> free: [
36.98 s
gammaloop-nextest-core> EdgeIndex(
36.98 s
gammaloop-nextest-core> 3,
36.98 s
gammaloop-nextest-core> ),
36.98 s
gammaloop-nextest-core> ],
36.98 s
gammaloop-nextest-core> orientation_label: None,
36.98 s
gammaloop-nextest-core> reason: "dod_exceeds_threshold",
36.98 s
gammaloop-nextest-core> },
36.98 s
gammaloop-nextest-core> ],
36.98 s
gammaloop-nextest-core> }
36.98 s
gammaloop-nextest-core>
36.98 s
gammaloop-nextest-core> ╭─────────┬────────────┬───────────┬───────┬─────┬──────────┬───────────╮
36.98 s
gammaloop-nextest-core> │ fixed │ → ∞ │ slope │ r2 │ DOD │ bare DOD │ inspect │
36.98 s
gammaloop-nextest-core> ├─────────┼────────────┼───────────┼───────┼─────┼──────────┼───────────┤
36.98 s
gammaloop-nextest-core> │ {e1,e2} │ {e3} │ -0.996752 │ 1.000 │ -1 │ 0 │ arb retry │
36.98 s
gammaloop-nextest-core> │ {e1,e3} │ {e2} │ -1.065665 │ 0.997 │ -1 │ 0 │ arb retry │
36.98 s
gammaloop-nextest-core> │ {e1} │ {e2,e3} │ -0.937151 │ 0.943 │ -1 │ 2 │ │
36.98 s
gammaloop-nextest-core> │ {e2,e3} │ {e1} │ -1.001075 │ 1.000 │ -1 │ 0 │ arb retry │
36.98 s
gammaloop-nextest-core> │ {e2} │ {e1,e3} │ -0.984146 │ 0.998 │ -1 │ 2 │ │
36.98 s
gammaloop-nextest-core> │ {e3} │ {e1,e2} │ -1.383911 │ 0.982 │ -1 │ 2 │ arb retry │
36.98 s
gammaloop-nextest-core> │ {} │ {e1,e2,e3} │ -1.094213 │ 0.258 │ -1 │ 4 │ │
36.98 s
gammaloop-nextest-core> │ {e2,e0} │ {e3} │ -0.803348 │ 0.861 │ -1 │ 0 │ arb retry │
36.98 s
gammaloop-nextest-core> │ {e3,e0} │ {e2} │ -0.999257 │ 1.000 │ -1 │ 0 │ │
36.98 s
gammaloop-nextest-core> │ {e0} │ {e2,e3} │ -1.000893 │ 1.000 │ -1 │ 2 │ │
36.98 s
gammaloop-nextest-core> │ {e1,e0} │ {e3} │ -0.997860 │ 1.000 │ -1 │ 0 │ │
36.98 s
gammaloop-nextest-core> ╰─────────┴────────────┴───────────┴───────┴─────┴──────────┴───────────╯
36.98 s
gammaloop-nextest-core>
36.98 s
gammaloop-nextest-core> ╭───────┬─────────┬───────────┬───────┬─────┬──────────┬───────────╮
36.98 s
gammaloop-nextest-core> │ fixed │ → ∞ │ slope │ r2 │ DOD │ bare DOD │ inspect │
36.98 s
gammaloop-nextest-core> ├───────┼─────────┼───────────┼───────┼─────┼──────────┼───────────┤
36.98 s
gammaloop-nextest-core> │ {e1} │ {e2} │ -1.005039 │ 1.000 │ -1 │ 0 │ arb retry │
36.98 s
gammaloop-nextest-core> │ {e2} │ {e1} │ -1.001098 │ 1.000 │ -1 │ 0 │ arb retry │
36.98 s
gammaloop-nextest-core> │ {} │ {e1,e2} │ -1.011289 │ 1.000 │ -1 │ 2 │ │
36.98 s
gammaloop-nextest-core> │ {e0} │ {e2} │ -0.998140 │ 1.000 │ -1 │ 0 │ │
36.98 s
gammaloop-nextest-core> ╰───────┴─────────┴───────────┴───────┴─────┴──────────┴───────────╯
36.98 s
gammaloop-nextest-core>
36.98 s
gammaloop-nextest-core> ╭───────┬──────┬───────────┬───────┬─────┬──────────┬─────────╮
36.98 s
gammaloop-nextest-core> │ fixed │ → ∞ │ slope │ r2 │ DOD │ bare DOD │ inspect │
36.98 s
gammaloop-nextest-core> ├───────┼──────┼───────────┼───────┼─────┼──────────┼─────────┤
36.98 s
gammaloop-nextest-core> │ {} │ {e1} │ -0.989949 │ 1.000 │ -1 │ 0 │ │
36.98 s
gammaloop-nextest-core> ╰───────┴──────┴───────────┴───────┴─────┴──────────┴─────────╯
36.98 s
gammaloop-nextest-core> left: 1
36.98 s
gammaloop-nextest-core> right: 0
36.98 s
gammaloop-nextest-core> Location: crates/gammalooprs/src/uv/tests.rs :259
36.98 s
gammaloop-nextest-core>
36.98 s
gammaloop-nextest-core> ━━━━━━━━━━━━━━━━━━━━━━━━━━━━━━━━━━ BACKTRACE ━━━━━━━━━━━━━━━━━━━━━━━━━━━━━━━━━━━
36.98 s
gammaloop-nextest-core> 1: <color_eyre[51793ea62743adbd]::config::PanicHook>::panic_report <unknown>
36.98 s
gammaloop-nextest-core> at <unknown source file> :<unknown line>
36.98 s
gammaloop-nextest-core> 2: <color_eyre[51793ea62743adbd]::config::PanicHook>::into_panic_hook::{closure#0} <unknown>
36.98 s
gammaloop-nextest-core> at <unknown source file> :<unknown line>
36.98 s
gammaloop-nextest-core> 3: std[bcb96dfbba0ab899]::panicking::panic_with_hook <unknown>
36.98 s
gammaloop-nextest-core> at <unknown source file> :<unknown line>
36.98 s
gammaloop-nextest-core> 4: std[bcb96dfbba0ab899]::panicking::panic_handler::{closure#0} <unknown>
36.98 s
gammaloop-nextest-core> at <unknown source file> :<unknown line>
36.98 s
gammaloop-nextest-core> 5: std[bcb96dfbba0ab899]::sys::backtrace::__rust_end_short_backtrace::<std[bcb96dfbba0ab899]::panicking::panic_handler::{closure#0}, !> <unknown>
36.98 s
gammaloop-nextest-core> at <unknown source file> :<unknown line>
36.98 s
gammaloop-nextest-core> 6: __rustc[6c289b9f9c454d21]::rust_begin_unwind <unknown>
36.98 s
gammaloop-nextest-core> at <unknown source file> :<unknown line>
36.98 s
gammaloop-nextest-core> 7: core[940e698046960fd5]::panicking::panic_fmt <unknown>
36.98 s
gammaloop-nextest-core> at <unknown source file> :<unknown line>
36.98 s
gammaloop-nextest-core> 8: core[940e698046960fd5]::panicking::assert_failed_inner <unknown>
36.98 s
gammaloop-nextest-core> at <unknown source file> :<unknown line>
36.98 s
gammaloop-nextest-core> 9: core[940e698046960fd5]::panicking::assert_failed::<usize, usize> <unknown>
36.98 s
gammaloop-nextest-core> at <unknown source file> :<unknown line>
36.98 s
gammaloop-nextest-core> 10: gammalooprs[972dff90865981f6]::uv::tests::scalars_profile <unknown>
36.98 s
gammaloop-nextest-core> at <unknown source file> :<unknown line>
36.98 s
gammaloop-nextest-core> 11: <gammalooprs[972dff90865981f6]::uv::tests::scalars_profile::{closure#0} as core[940e698046960fd5]::ops::function::FnOnce<()>>::call_once <unknown>
36.98 s
gammaloop-nextest-core> at <unknown source file> :<unknown line>
36.98 s
gammaloop-nextest-core> 12: test[75d6903177b1d7e9]::__rust_begin_short_backtrace::<core[940e698046960fd5]::result::Result<(), alloc[2ea6bcb46fca0c42]::string::String>, fn() -> core[940e698046960fd5]::result::Result<(), alloc[2ea6bcb46fca0c42]::string::String>> <unknown>
36.98 s
gammaloop-nextest-core> at <unknown source file> :<unknown line>
36.98 s
gammaloop-nextest-core> 13: test[75d6903177b1d7e9]::run_test::{closure#0} <unknown>
36.98 s
gammaloop-nextest-core> at <unknown source file> :<unknown line>
36.98 s
gammaloop-nextest-core> 14: std[bcb96dfbba0ab899]::sys::backtrace::__rust_begin_short_backtrace::<test[75d6903177b1d7e9]::run_test::{closure#1}, ()> <unknown>
36.98 s
gammaloop-nextest-core> at <unknown source file> :<unknown line>
36.98 s
gammaloop-nextest-core> 15: <std[bcb96dfbba0ab899]::thread::lifecycle::spawn_unchecked<test[75d6903177b1d7e9]::run_test::{closure#1}, ()>::{closure#1} as core[940e698046960fd5]::ops::function::FnOnce<()>>::call_once::{shim:vtable#0} <unknown>
36.98 s
gammaloop-nextest-core> at <unknown source file> :<unknown line>
36.98 s
gammaloop-nextest-core> 16: <std[bcb96dfbba0ab899]::sys::thread::unix::Thread>::new::thread_start <unknown>
36.98 s
gammaloop-nextest-core> at <unknown source file> :<unknown line>
36.98 s
gammaloop-nextest-core> 17: start_thread <unknown>
36.98 s
gammaloop-nextest-core> at <unknown source file> :<unknown line>
36.98 s
gammaloop-nextest-core> 18: __clone3 <unknown>
36.98 s
gammaloop-nextest-core> at <unknown source file> :<unknown line>
36.98 s
gammaloop-nextest-core>
36.98 s
gammaloop-nextest-core> Run with COLORBT_SHOW_HIDDEN=1 environment variable to disable frame filtering.
36.98 s
gammaloop-nextest-core> Run with RUST_BACKTRACE=full to include source snippets.
36.98 s
gammaloop-nextest-core>
37.73 s
gammaloop-nextest-core> ------------
37.73 s
gammaloop-nextest-core> Summary [ 12.921s] 561 tests run: 556 passed , 5 failed , 59 skipped
37.73 s
gammaloop-nextest-core> FAIL [ 0.101s] ( 51/561) gammalooprs cff::tests :: stored_production_cff_uses_typed_energy_factor_ownership
37.73 s
gammaloop-nextest-core> stdout ---
37.73 s
gammaloop-nextest-core>
37.73 s
gammaloop-nextest-core> running 1 test
37.73 s
gammaloop-nextest-core> test cff::tests::stored_production_cff_uses_typed_energy_factor_ownership ... FAILED
37.73 s
gammaloop-nextest-core>
37.73 s
gammaloop-nextest-core> failures:
37.73 s
gammaloop-nextest-core>
37.73 s
gammaloop-nextest-core> failures:
37.73 s
gammaloop-nextest-core> cff::tests::stored_production_cff_uses_typed_energy_factor_ownership
37.73 s
gammaloop-nextest-core>
37.73 s
gammaloop-nextest-core> test result: FAILED. 0 passed; 1 failed; 0 ignored; 0 measured; 611 filtered out; finished in 0.09s
37.73 s
gammaloop-nextest-core>
37.73 s
gammaloop-nextest-core> stderr ---
37.73 s
gammaloop-nextest-core> The application panicked (crashed).
37.73 s
gammaloop-nextest-core> Message: assertion `left == right` failed
37.73 s
gammaloop-nextest-core> left: 1
37.73 s
gammaloop-nextest-core> right: -1
37.73 s
gammaloop-nextest-core> Location: crates/gammalooprs/src/cff/mod.rs :2721
37.73 s
gammaloop-nextest-core>
37.73 s
gammaloop-nextest-core> ━━━━━━━━━━━━━━━━━━━━━━━━━━━━━━━━━━ BACKTRACE ━━━━━━━━━━━━━━━━━━━━━━━━━━━━━━━━━━━
37.73 s
gammaloop-nextest-core> 1: <color_eyre[51793ea62743adbd]::config::PanicHook>::panic_report <unknown>
37.73 s
gammaloop-nextest-core> at <unknown source file> :<unknown line>
37.73 s
gammaloop-nextest-core> 2: <color_eyre[51793ea62743adbd]::config::PanicHook>::into_panic_hook::{closure#0} <unknown>
37.73 s
gammaloop-nextest-core> at <unknown source file> :<unknown line>
37.73 s
gammaloop-nextest-core> 3: std[bcb96dfbba0ab899]::panicking::panic_with_hook <unknown>
37.73 s
gammaloop-nextest-core> at <unknown source file> :<unknown line>
37.73 s
gammaloop-nextest-core> 4: std[bcb96dfbba0ab899]::panicking::panic_handler::{closure#0} <unknown>
37.73 s
gammaloop-nextest-core> at <unknown source file> :<unknown line>
37.73 s
gammaloop-nextest-core> 5: std[bcb96dfbba0ab899]::sys::backtrace::__rust_end_short_backtrace::<std[bcb96dfbba0ab899]::panicking::panic_handler::{closure#0}, !> <unknown>
37.73 s
gammaloop-nextest-core> at <unknown source file> :<unknown line>
37.73 s
gammaloop-nextest-core> 6: __rustc[6c289b9f9c454d21]::rust_begin_unwind <unknown>
37.73 s
gammaloop-nextest-core> at <unknown source file> :<unknown line>
37.73 s
gammaloop-nextest-core> 7: core[940e698046960fd5]::panicking::panic_fmt <unknown>
37.73 s
gammaloop-nextest-core> at <unknown source file> :<unknown line>
37.73 s
gammaloop-nextest-core> 8: core[940e698046960fd5]::panicking::assert_failed_inner <unknown>
37.73 s
gammaloop-nextest-core> at <unknown source file> :<unknown line>
37.73 s
gammaloop-nextest-core> 9: core[940e698046960fd5]::panicking::assert_failed::<i64, i64> <unknown>
37.73 s
gammaloop-nextest-core> at <unknown source file> :<unknown line>
37.73 s
gammaloop-nextest-core> 10: gammalooprs[972dff90865981f6]::cff::tests::stored_production_cff_uses_typed_energy_factor_ownership <unknown>
37.73 s
gammaloop-nextest-core> at <unknown source file> :<unknown line>
37.73 s
gammaloop-nextest-core> 11: <gammalooprs[972dff90865981f6]::cff::tests::stored_production_cff_uses_typed_energy_factor_ownership::{closure#0} as core[940e698046960fd5]::ops::function::FnOnce<()>>::call_once <unknown>
37.73 s
gammaloop-nextest-core> at <unknown source file> :<unknown line>
37.73 s
gammaloop-nextest-core> 12: test[75d6903177b1d7e9]::__rust_begin_short_backtrace::<core[940e698046960fd5]::result::Result<(), alloc[2ea6bcb46fca0c42]::string::String>, fn() -> core[940e698046960fd5]::result::Result<(), alloc[2ea6bcb46fca0c42]::string::String>> <unknown>
37.73 s
gammaloop-nextest-core> at <unknown source file> :<unknown line>
37.73 s
gammaloop-nextest-core> 13: test[75d6903177b1d7e9]::run_test::{closure#0} <unknown>
37.73 s
gammaloop-nextest-core> at <unknown source file> :<unknown line>
37.73 s
gammaloop-nextest-core> 14: std[bcb96dfbba0ab899]::sys::backtrace::__rust_begin_short_backtrace::<test[75d6903177b1d7e9]::run_test::{closure#1}, ()> <unknown>
37.73 s
gammaloop-nextest-core> at <unknown source file> :<unknown line>
37.73 s
gammaloop-nextest-core> 15: <std[bcb96dfbba0ab899]::thread::lifecycle::spawn_unchecked<test[75d6903177b1d7e9]::run_test::{closure#1}, ()>::{closure#1} as core[940e698046960fd5]::ops::function::FnOnce<()>>::call_once::{shim:vtable#0} <unknown>
37.73 s
gammaloop-nextest-core> at <unknown source file> :<unknown line>
37.73 s
gammaloop-nextest-core> 16: <std[bcb96dfbba0ab899]::sys::thread::unix::Thread>::new::thread_start <unknown>
37.73 s
gammaloop-nextest-core> at <unknown source file> :<unknown line>
37.73 s
gammaloop-nextest-core> 17: start_thread <unknown>
37.73 s
gammaloop-nextest-core> at <unknown source file> :<unknown line>
37.73 s
gammaloop-nextest-core> 18: __clone3 <unknown>
37.73 s
gammaloop-nextest-core> at <unknown source file> :<unknown line>
37.73 s
gammaloop-nextest-core>
37.73 s
gammaloop-nextest-core> Run with COLORBT_SHOW_HIDDEN=1 environment variable to disable frame filtering.
37.73 s
gammaloop-nextest-core> Run with RUST_BACKTRACE=full to include source snippets.
37.73 s
gammaloop-nextest-core>
37.73 s
gammaloop-nextest-core> FAIL [ 0.115s] (486/561) gammalooprs uv::approx::local_3d::tests :: production_emr_map_cancels_one_powered_denominator
37.73 s
gammaloop-nextest-core> stdout ---
37.73 s
gammaloop-nextest-core>
37.73 s
gammaloop-nextest-core> running 1 test
37.73 s
gammaloop-nextest-core> test uv::approx::local_3d::tests::production_emr_map_cancels_one_powered_denominator ... FAILED
37.73 s
gammaloop-nextest-core>
37.73 s
gammaloop-nextest-core> failures:
37.73 s
gammaloop-nextest-core>
37.73 s
gammaloop-nextest-core> failures:
37.73 s
gammaloop-nextest-core> uv::approx::local_3d::tests::production_emr_map_cancels_one_powered_denominator
37.73 s
gammaloop-nextest-core>
37.73 s
gammaloop-nextest-core> test result: FAILED. 0 passed; 1 failed; 0 ignored; 0 measured; 611 filtered out; finished in 0.10s
37.73 s
gammaloop-nextest-core>
37.73 s
gammaloop-nextest-core> stderr ---
37.73 s
gammaloop-nextest-core> The application panicked (crashed).
37.73 s
gammaloop-nextest-core> Message: summed exact-source powered and selected lower channels differ: powered=-1 𝑖 /8/𝜋^3, lower=1𝑖 /16/𝜋^3, difference=-3𝑖 /16/𝜋^3
37.73 s
gammaloop-nextest-core> Location: crates/gammalooprs/src/uv/approx/local_3d.rs :2047
37.73 s
gammaloop-nextest-core>
37.73 s
gammaloop-nextest-core> ━━━━━━━━━━━━━━━━━━━━━━━━━━━━━━━━━━ BACKTRACE ━━━━━━━━━━━━━━━━━━━━━━━━━━━━━━━━━━━
37.73 s
gammaloop-nextest-core> 1: <color_eyre[51793ea62743adbd]::config::PanicHook>::panic_report <unknown>
37.73 s
gammaloop-nextest-core> at <unknown source file> :<unknown line>
37.73 s
gammaloop-nextest-core> 2: <color_eyre[51793ea62743adbd]::config::PanicHook>::into_panic_hook::{closure#0} <unknown>
37.73 s
gammaloop-nextest-core> at <unknown source file> :<unknown line>
37.73 s
gammaloop-nextest-core> 3: std[bcb96dfbba0ab899]::panicking::panic_with_hook <unknown>
37.73 s
gammaloop-nextest-core> at <unknown source file> :<unknown line>
37.73 s
gammaloop-nextest-core> 4: std[bcb96dfbba0ab899]::panicking::panic_handler::{closure#0} <unknown>
37.73 s
gammaloop-nextest-core> at <unknown source file> :<unknown line>
37.73 s
gammaloop-nextest-core> 5: std[bcb96dfbba0ab899]::sys::backtrace::__rust_end_short_backtrace::<std[bcb96dfbba0ab899]::panicking::panic_handler::{closure#0}, !> <unknown>
37.73 s
gammaloop-nextest-core> at <unknown source file> :<unknown line>
37.73 s
gammaloop-nextest-core> 6: __rustc[6c289b9f9c454d21]::rust_begin_unwind <unknown>
37.73 s
gammaloop-nextest-core> at <unknown source file> :<unknown line>
37.73 s
gammaloop-nextest-core> 7: core[940e698046960fd5]::panicking::panic_fmt <unknown>
37.73 s
gammaloop-nextest-core> at <unknown source file> :<unknown line>
37.73 s
gammaloop-nextest-core> 8: gammalooprs[972dff90865981f6]::uv::approx::local_3d::tests::production_emr_map_cancels_one_powered_denominator <unknown>
37.73 s
gammaloop-nextest-core> at <unknown source file> :<unknown line>
37.73 s
gammaloop-nextest-core> 9: <gammalooprs[972dff90865981f6]::uv::approx::local_3d::tests::production_emr_map_cancels_one_powered_denominator::{closure#0} as core[940e698046960fd5]::ops::function::FnOnce<()>>::call_once <unknown>
37.73 s
gammaloop-nextest-core> at <unknown source file> :<unknown line>
37.73 s
gammaloop-nextest-core> 10: test[75d6903177b1d7e9]::__rust_begin_short_backtrace::<core[940e698046960fd5]::result::Result<(), alloc[2ea6bcb46fca0c42]::string::String>, fn() -> core[940e698046960fd5]::result::Result<(), alloc[2ea6bcb46fca0c42]::string::String>> <unknown>
37.73 s
gammaloop-nextest-core> at <unknown source file> :<unknown line>
37.73 s
gammaloop-nextest-core> 11: test[75d6903177b1d7e9]::run_test::{closure#0} <unknown>
37.73 s
gammaloop-nextest-core> at <unknown source file> :<unknown line>
37.73 s
gammaloop-nextest-core> 12: std[bcb96dfbba0ab899]::sys::backtrace::__rust_begin_short_backtrace::<test[75d6903177b1d7e9]::run_test::{closure#1}, ()> <unknown>
37.73 s
gammaloop-nextest-core> at <unknown source file> :<unknown line>
37.73 s
gammaloop-nextest-core> 13: <std[bcb96dfbba0ab899]::thread::lifecycle::spawn_unchecked<test[75d6903177b1d7e9]::run_test::{closure#1}, ()>::{closure#1} as core[940e698046960fd5]::ops::function::FnOnce<()>>::call_once::{shim:vtable#0} <unknown>
37.73 s
gammaloop-nextest-core> at <unknown source file> :<unknown line>
37.73 s
gammaloop-nextest-core> 14: <std[bcb96dfbba0ab899]::sys::thread::unix::Thread>::new::thread_start <unknown>
37.73 s
gammaloop-nextest-core> at <unknown source file> :<unknown line>
37.73 s
gammaloop-nextest-core> 15: start_thread <unknown>
37.73 s
gammaloop-nextest-core> at <unknown source file> :<unknown line>
37.73 s
gammaloop-nextest-core> 16: __clone3 <unknown>
37.73 s
gammaloop-nextest-core> at <unknown source file> :<unknown line>
37.73 s
gammaloop-nextest-core>
37.73 s
gammaloop-nextest-core> Run with COLORBT_SHOW_HIDDEN=1 environment variable to disable frame filtering.
37.73 s
gammaloop-nextest-core> Run with RUST_BACKTRACE=full to include source snippets.
37.73 s
gammaloop-nextest-core>
37.73 s
gammaloop-nextest-core> FAIL [ 0.224s] (525/561) gammalooprs uv::hedge_poset::tests :: spectacles_typed_4d_projects_after_local_construction
37.73 s
gammaloop-nextest-core> stdout ---
37.73 s
gammaloop-nextest-core>
37.73 s
gammaloop-nextest-core> running 1 test
37.73 s
gammaloop-nextest-core> digraph {
37.73 s
gammaloop-nextest-core> node [shape=circle,height=0.1,label=""];
37.73 s
gammaloop-nextest-core> overlap = "scale";
37.73 s
gammaloop-nextest-core> layout = "neato";
37.73 s
gammaloop-nextest-core> start=2;
37.73 s
gammaloop-nextest-core> 4 [label="0"];
37.73 s
gammaloop-nextest-core> 1 [label="zw"];
37.73 s
gammaloop-nextest-core> 2 [label="F"];
37.73 s
gammaloop-nextest-core> 0 [label="143"];
37.73 s
gammaloop-nextest-core> 3 [label="10B"];
37.73 s
gammaloop-nextest-core> 4:0:s -> 1:1:s [id=0 color="red:blue;0.5" label="zw"];
37.73 s
gammaloop-nextest-core> 4:2:s -> 2:3:s [id=1 color="red:blue;0.5" label="F"];
37.73 s
gammaloop-nextest-core> 3:5:s -> 0:4:s [id=2 color="red:blue;0.5" label="143"];
37.73 s
gammaloop-nextest-core> 4:6:s -> 0:7:s [id=3 color="red:blue;0.5" label="143"];
37.73 s
gammaloop-nextest-core> 1:8:s -> 3:9:s [id=4 color="red:blue;0.5" label="F"];
37.73 s
gammaloop-nextest-core> 1:10:s -> 0:11:s [id=5 color="red:blue;0.5" label="143"];
37.73 s
gammaloop-nextest-core> 2:12:s -> 3:13:s [id=6 color="red:blue;0.5" label="zw"];
37.73 s
gammaloop-nextest-core> 2:14:s -> 0:15:s [id=7 color="red:blue;0.5" label="143"];
37.73 s
gammaloop-nextest-core> }
37.73 s
gammaloop-nextest-core>
37.73 s
gammaloop-nextest-core> digraph {
37.73 s
gammaloop-nextest-core> node [shape=circle,height=0.1,label=""];
37.73 s
gammaloop-nextest-core> overlap = "scale";
37.73 s
gammaloop-nextest-core> layout = "neato";
37.73 s
gammaloop-nextest-core> start=2;
37.73 s
gammaloop-nextest-core> 0 [label="∅"];
37.73 s
gammaloop-nextest-core> 1 [label="{zw}: Approx(S_zw(0))"];
37.73 s
gammaloop-nextest-core> 2 [label="{F}: Approx(S_F(1))"];
37.73 s
gammaloop-nextest-core> 3 [label="{143}: Approx(S_143(3))"];
37.73 s
gammaloop-nextest-core> 4 [label="{zw,F}: Approx(S_F(4))*Approx(S_zw(0))"];
37.73 s
gammaloop-nextest-core> 5 [label="{zw} · {143}: Approx((-1*S_zw+S_143(5))*Approx(S_zw(0)))"];
37.73 s
gammaloop-nextest-core> 6 [label="{F} · {143}: Approx((-1*S_F+S_143(7))*Approx(S_F(1)))"];
37.73 s
gammaloop-nextest-core> 7 [label="{zw,F} · {143}: Approx((-1*S_10B+S_143(2))*Approx(S_F(4))*Approx(S_zw(0)))"];
37.73 s
gammaloop-nextest-core> 0:0:s -> 1:1:s [id=0 color="red:blue;0.5"];
37.73 s
gammaloop-nextest-core> 0:2:s -> 2:3:s [id=1 color="red:blue;0.5"];
37.73 s
gammaloop-nextest-core> 0:4:s -> 3:5:s [id=2 color="red:blue;0.5"];
37.73 s
gammaloop-nextest-core> 1:6:s -> 4:7:s [id=3 color="red:blue;0.5"];
37.73 s
gammaloop-nextest-core> 1:8:s -> 5:9:s [id=4 color="red:blue;0.5"];
37.73 s
gammaloop-nextest-core> 2:10:s -> 4:11:s [id=5 color="red:blue;0.5"];
37.73 s
gammaloop-nextest-core> 2:12:s -> 6:13:s [id=6 color="red:blue;0.5"];
37.73 s
gammaloop-nextest-core> 4:14:s -> 7:15:s [id=7 color="red:blue;0.5"];
37.73 s
gammaloop-nextest-core> }
37.73 s
gammaloop-nextest-core>
37.73 s
gammaloop-nextest-core> test uv::hedge_poset::tests::spectacles_typed_4d_projects_after_local_construction ... FAILED
37.73 s
gammaloop-nextest-core>
37.73 s
gammaloop-nextest-core> failures:
37.73 s
gammaloop-nextest-core>
37.73 s
gammaloop-nextest-core> failures:
37.73 s
gammaloop-nextest-core> uv::hedge_poset::tests::spectacles_typed_4d_projects_after_local_construction
37.73 s
gammaloop-nextest-core>
37.73 s
gammaloop-nextest-core> test result: FAILED. 0 passed; 1 failed; 0 ignored; 0 measured; 611 filtered out; finished in 0.20s
37.73 s
gammaloop-nextest-core>
37.73 s
gammaloop-nextest-core> stderr ---
37.73 s
gammaloop-nextest-core> Error:
37.73 s
gammaloop-nextest-core> 0: failed to extract three-dimensional representation graph input: source edge 1 has no unique routing for rewritten exact signature [-1, 0, 0] modulo the factorized opposite-domain loop span
37.73 s
gammaloop-nextest-core>
37.73 s
gammaloop-nextest-core> Location:
37.73 s
gammaloop-nextest-core> crates/gammalooprs/src/uv/approx/local_3d.rs :845
37.73 s
gammaloop-nextest-core>
37.73 s
gammaloop-nextest-core> ━━━━━━━━━━━━━━━━━━━━━━━━━━━━━━━━━━ BACKTRACE ━━━━━━━━━━━━━━━━━━━━━━━━━━━━━━━━━━━
37.73 s
gammaloop-nextest-core> 1: <color_eyre[51793ea62743adbd]::config::EyreHook>::into_eyre_hook::{closure#0} <unknown>
37.73 s
gammaloop-nextest-core> at <unknown source file> :<unknown line>
37.73 s
gammaloop-nextest-core> 2: eyre[cb2fd339c0c40fca]::capture_handler <unknown>
37.73 s
gammaloop-nextest-core> at <unknown source file> :<unknown line>
37.73 s
gammaloop-nextest-core> 3: <eyre[cb2fd339c0c40fca]::Report>::from_std::<three_dimensional_reps[3cb572ff22d197ac]::graph_io::GraphIoError> <unknown>
37.73 s
gammaloop-nextest-core> at <unknown source file> :<unknown line>
37.73 s
gammaloop-nextest-core> 4: <gammalooprs[972dff90865981f6]::uv::approx::local_3d::Localizer>::project_4d <unknown>
37.73 s
gammaloop-nextest-core> at <unknown source file> :<unknown line>
37.73 s
gammaloop-nextest-core> 5: gammalooprs[972dff90865981f6]::uv::hedge_poset::tests::spectacles_typed_4d_projects_after_local_construction <unknown>
37.73 s
gammaloop-nextest-core> at <unknown source file> :<unknown line>
37.73 s
gammaloop-nextest-core> 6: <gammalooprs[972dff90865981f6]::uv::hedge_poset::tests::spectacles_typed_4d_projects_after_local_construction::{closure#0} as core[940e698046960fd5]::ops::function::FnOnce<()>>::call_once <unknown>
37.73 s
gammaloop-nextest-core> at <unknown source file> :<unknown line>
37.73 s
gammaloop-nextest-core> 7: test[75d6903177b1d7e9]::__rust_begin_short_backtrace::<core[940e698046960fd5]::result::Result<(), alloc[2ea6bcb46fca0c42]::string::String>, fn() -> core[940e698046960fd5]::result::Result<(), alloc[2ea6bcb46fca0c42]::string::String>> <unknown>
37.73 s
gammaloop-nextest-core> at <unknown source file> :<unknown line>
37.73 s
gammaloop-nextest-core> 8: test[75d6903177b1d7e9]::run_test::{closure#0} <unknown>
37.73 s
gammaloop-nextest-core> at <unknown source file> :<unknown line>
37.73 s
gammaloop-nextest-core> 9: std[bcb96dfbba0ab899]::sys::backtrace::__rust_begin_short_backtrace::<test[75d6903177b1d7e9]::run_test::{closure#1}, ()> <unknown>
37.73 s
gammaloop-nextest-core> at <unknown source file> :<unknown line>
37.73 s
gammaloop-nextest-core> 10: <std[bcb96dfbba0ab899]::thread::lifecycle::spawn_unchecked<test[75d6903177b1d7e9]::run_test::{closure#1}, ()>::{closure#1} as core[940e698046960fd5]::ops::function::FnOnce<()>>::call_once::{shim:vtable#0} <unknown>
37.73 s
gammaloop-nextest-core> at <unknown source file> :<unknown line>
37.73 s
gammaloop-nextest-core> 11: <std[bcb96dfbba0ab899]::sys::thread::unix::Thread>::new::thread_start <unknown>
37.73 s
gammaloop-nextest-core> at <unknown source file> :<unknown line>
37.73 s
gammaloop-nextest-core> 12: start_thread <unknown>
37.73 s
gammaloop-nextest-core> at <unknown source file> :<unknown line>
37.73 s
gammaloop-nextest-core> 13: __clone3 <unknown>
37.73 s
gammaloop-nextest-core> at <unknown source file> :<unknown line>
37.73 s
gammaloop-nextest-core>
37.73 s
gammaloop-nextest-core> Run with COLORBT_SHOW_HIDDEN=1 environment variable to disable frame filtering.
37.73 s
gammaloop-nextest-core> Run with RUST_BACKTRACE=full to include source snippets.
37.73 s
gammaloop-nextest-core>
37.73 s
gammaloop-nextest-core> FAIL [ 10.328s] (559/561) gammalooprs uv::tests :: scalars_profile_new
37.73 s
gammaloop-nextest-core> stdout ---
37.73 s
gammaloop-nextest-core>
37.73 s
gammaloop-nextest-core> running 1 test
37.73 s
gammaloop-nextest-core> test uv::tests::scalars_profile_new ... FAILED
37.73 s
gammaloop-nextest-core>
37.73 s
gammaloop-nextest-core> failures:
37.73 s
gammaloop-nextest-core>
37.73 s
gammaloop-nextest-core> failures:
37.73 s
gammaloop-nextest-core> uv::tests::scalars_profile_new
37.73 s
gammaloop-nextest-core>
37.73 s
gammaloop-nextest-core> test result: FAILED. 0 passed; 1 failed; 0 ignored; 0 measured; 611 filtered out; finished in 10.30s
37.73 s
gammaloop-nextest-core>
37.73 s
gammaloop-nextest-core> stderr ---
37.73 s
gammaloop-nextest-core> [18:18:39.444] @gammalooprs::settings::runtime WARNING : No external kinematics were provided; using default-generated external momenta and helicities.
37.73 s
gammaloop-nextest-core> field value
37.73 s
gammaloop-nextest-core> span build_integrand{amplitude.name = bub}
37.73 s
gammaloop-nextest-core> at crates/gammalooprs/src/settings/runtime.rs:131
37.73 s
gammaloop-nextest-core> [18:18:39.445] @gammalooprs::integrands::process::amplitude INFO : Input is below threshold: 0 existing threshold E-surfaces across 0/3 graph groups
37.73 s
gammaloop-nextest-core> field value
37.73 s
gammaloop-nextest-core> existing_esurfaces 0
37.73 s
gammaloop-nextest-core> group_count 3
37.73 s
gammaloop-nextest-core> groups_above_threshold 0
37.73 s
gammaloop-nextest-core> integrand bub
37.73 s
gammaloop-nextest-core> span warm_up{integrand.name = bub}
37.73 s
gammaloop-nextest-core> threshold_status below threshold
37.73 s
gammaloop-nextest-core> at crates/gammalooprs/src/integrands/process/amplitude/mod.rs:1666
37.73 s
gammaloop-nextest-core> [18:18:39.445] @gammalooprs::integrands::process::amplitude INFO : overlap structure of group 0: [0: []]
37.73 s
gammaloop-nextest-core> field value
37.73 s
gammaloop-nextest-core> span warm_up{integrand.name = bub}
37.73 s
gammaloop-nextest-core> at crates/gammalooprs/src/integrands/process/amplitude/mod.rs:2015
37.73 s
gammaloop-nextest-core> [18:18:39.445] @gammalooprs::integrands::process::amplitude INFO : overlap structure of group 1: [0: []]
37.73 s
gammaloop-nextest-core> field value
37.73 s
gammaloop-nextest-core> span warm_up{integrand.name = bub}
37.73 s
gammaloop-nextest-core> at crates/gammalooprs/src/integrands/process/amplitude/mod.rs:2015
37.73 s
gammaloop-nextest-core> [18:18:39.445] @gammalooprs::integrands::process::amplitude INFO : overlap structure of group 2: [0: []]
37.73 s
gammaloop-nextest-core> field value
37.73 s
gammaloop-nextest-core> span warm_up{integrand.name = bub}
37.73 s
gammaloop-nextest-core> at crates/gammalooprs/src/integrands/process/amplitude/mod.rs:2015
37.73 s
gammaloop-nextest-core> The application panicked (crashed).
37.73 s
gammaloop-nextest-core> Message: assertion `left == right` failed: subtracted scalar UV profile failed:
37.73 s
gammaloop-nextest-core> UVProfilePassFail {
37.73 s
gammaloop-nextest-core> max_dod: -0.9,
37.73 s
gammaloop-nextest-core> total: 16,
37.73 s
gammaloop-nextest-core> failed: 1,
37.73 s
gammaloop-nextest-core> failures: [
37.73 s
gammaloop-nextest-core> UVProfileFailure {
37.73 s
gammaloop-nextest-core> graph_index: 0,
37.73 s
gammaloop-nextest-core> graph_name: "banana",
37.73 s
gammaloop-nextest-core> cutkosky_cut: None,
37.73 s
gammaloop-nextest-core> lmb_index: 1,
37.73 s
gammaloop-nextest-core> fixed: [
37.73 s
gammaloop-nextest-core> EdgeIndex(
37.73 s
gammaloop-nextest-core> 2,
37.73 s
gammaloop-nextest-core> ),
37.73 s
gammaloop-nextest-core> EdgeIndex(
37.73 s
gammaloop-nextest-core> 0,
37.73 s
gammaloop-nextest-core> ),
37.73 s
gammaloop-nextest-core> ],
37.73 s
gammaloop-nextest-core> free: [
37.73 s
gammaloop-nextest-core> EdgeIndex(
37.73 s
gammaloop-nextest-core> 3,
37.73 s
gammaloop-nextest-core> ),
37.73 s
gammaloop-nextest-core> ],
37.73 s
gammaloop-nextest-core> orientation_label: None,
37.73 s
gammaloop-nextest-core> reason: "dod_exceeds_threshold",
37.73 s
gammaloop-nextest-core> },
37.73 s
gammaloop-nextest-core> ],
37.73 s
gammaloop-nextest-core> }
37.73 s
gammaloop-nextest-core>
37.73 s
gammaloop-nextest-core> ╭─────────┬────────────┬───────────┬───────┬─────┬──────────┬───────────╮
37.73 s
gammaloop-nextest-core> │ fixed │ → ∞ │ slope │ r2 │ DOD │ bare DOD │ inspect │
37.73 s
gammaloop-nextest-core> ├─────────┼────────────┼───────────┼───────┼─────┼──────────┼───────────┤
37.73 s
gammaloop-nextest-core> │ {e1,e2} │ {e3} │ -0.996752 │ 1.000 │ -1 │ 0 │ arb retry │
37.73 s
gammaloop-nextest-core> │ {e1,e3} │ {e2} │ -1.065665 │ 0.997 │ -1 │ 0 │ arb retry │
37.73 s
gammaloop-nextest-core> │ {e1} │ {e2,e3} │ -0.937151 │ 0.943 │ -1 │ 2 │ │
37.73 s
gammaloop-nextest-core> │ {e2,e3} │ {e1} │ -1.001075 │ 1.000 │ -1 │ 0 │ arb retry │
37.73 s
gammaloop-nextest-core> │ {e2} │ {e1,e3} │ -0.984146 │ 0.998 │ -1 │ 2 │ │
37.73 s
gammaloop-nextest-core> │ {e3} │ {e1,e2} │ -1.383911 │ 0.982 │ -1 │ 2 │ arb retry │
37.73 s
gammaloop-nextest-core> │ {} │ {e1,e2,e3} │ -1.094213 │ 0.258 │ -1 │ 4 │ │
37.73 s
gammaloop-nextest-core> │ {e2,e0} │ {e3} │ -0.803348 │ 0.861 │ -1 │ 0 │ arb retry │
37.73 s
gammaloop-nextest-core> │ {e3,e0} │ {e2} │ -0.999257 │ 1.000 │ -1 │ 0 │ │
37.73 s
gammaloop-nextest-core> │ {e0} │ {e2,e3} │ -1.000893 │ 1.000 │ -1 │ 2 │ │
37.73 s
gammaloop-nextest-core> │ {e1,e0} │ {e3} │ -0.997860 │ 1.000 │ -1 │ 0 │ │
37.73 s
gammaloop-nextest-core> ╰─────────┴────────────┴───────────┴───────┴─────┴──────────┴───────────╯
37.73 s
gammaloop-nextest-core>
37.73 s
gammaloop-nextest-core> ╭───────┬─────────┬───────────┬───────┬─────┬──────────┬───────────╮
37.73 s
gammaloop-nextest-core> │ fixed │ → ∞ │ slope │ r2 │ DOD │ bare DOD │ inspect │
37.73 s
gammaloop-nextest-core> ├───────┼─────────┼───────────┼───────┼─────┼──────────┼───────────┤
37.73 s
gammaloop-nextest-core> │ {e1} │ {e2} │ -1.005039 │ 1.000 │ -1 │ 0 │ arb retry │
37.73 s
gammaloop-nextest-core> │ {e2} │ {e1} │ -1.001098 │ 1.000 │ -1 │ 0 │ arb retry │
37.73 s
gammaloop-nextest-core> │ {} │ {e1,e2} │ -1.011289 │ 1.000 │ -1 │ 2 │ │
37.73 s
gammaloop-nextest-core> │ {e0} │ {e2} │ -0.998140 │ 1.000 │ -1 │ 0 │ │
37.73 s
gammaloop-nextest-core> ╰───────┴─────────┴───────────┴───────┴─────┴──────────┴───────────╯
37.73 s
gammaloop-nextest-core>
37.73 s
gammaloop-nextest-core> ╭───────┬──────┬───────────┬───────┬─────┬──────────┬─────────╮
37.73 s
gammaloop-nextest-core> │ fixed │ → ∞ │ slope │ r2 │ DOD │ bare DOD │ inspect │
37.73 s
gammaloop-nextest-core> ├───────┼──────┼───────────┼───────┼─────┼──────────┼─────────┤
37.73 s
gammaloop-nextest-core> │ {} │ {e1} │ -0.989949 │ 1.000 │ -1 │ 0 │ │
37.73 s
gammaloop-nextest-core> ╰───────┴──────┴───────────┴───────┴─────┴──────────┴─────────╯
37.73 s
gammaloop-nextest-core> left: 1
37.73 s
gammaloop-nextest-core> right: 0
37.73 s
gammaloop-nextest-core> Location: crates/gammalooprs/src/uv/tests.rs :325
37.73 s
gammaloop-nextest-core>
37.73 s
gammaloop-nextest-core> ━━━━━━━━━━━━━━━━━━━━━━━━━━━━━━━━━━ BACKTRACE ━━━━━━━━━━━━━━━━━━━━━━━━━━━━━━━━━━━
37.73 s
gammaloop-nextest-core> 1: <color_eyre[51793ea62743adbd]::config::PanicHook>::panic_report <unknown>
37.73 s
gammaloop-nextest-core> at <unknown source file> :<unknown line>
37.73 s
gammaloop-nextest-core> 2: <color_eyre[51793ea62743adbd]::config::PanicHook>::into_panic_hook::{closure#0} <unknown>
37.73 s
gammaloop-nextest-core> at <unknown source file> :<unknown line>
37.73 s
gammaloop-nextest-core> 3: std[bcb96dfbba0ab899]::panicking::panic_with_hook <unknown>
37.73 s
gammaloop-nextest-core> at <unknown source file> :<unknown line>
37.73 s
gammaloop-nextest-core> 4: std[bcb96dfbba0ab899]::panicking::panic_handler::{closure#0} <unknown>
37.73 s
gammaloop-nextest-core> at <unknown source file> :<unknown line>
37.73 s
gammaloop-nextest-core> 5: std[bcb96dfbba0ab899]::sys::backtrace::__rust_end_short_backtrace::<std[bcb96dfbba0ab899]::panicking::panic_handler::{closure#0}, !> <unknown>
37.73 s
gammaloop-nextest-core> at <unknown source file> :<unknown line>
37.73 s
gammaloop-nextest-core> 6: __rustc[6c289b9f9c454d21]::rust_begin_unwind <unknown>
37.73 s
gammaloop-nextest-core> at <unknown source file> :<unknown line>
37.73 s
gammaloop-nextest-core> 7: core[940e698046960fd5]::panicking::panic_fmt <unknown>
37.73 s
gammaloop-nextest-core> at <unknown source file> :<unknown line>
37.73 s
gammaloop-nextest-core> 8: core[940e698046960fd5]::panicking::assert_failed_inner <unknown>
37.73 s
gammaloop-nextest-core> at <unknown source file> :<unknown line>
37.73 s
gammaloop-nextest-core> 9: core[940e698046960fd5]::panicking::assert_failed::<usize, usize> <unknown>
37.73 s
gammaloop-nextest-core> at <unknown source file> :<unknown line>
37.73 s
gammaloop-nextest-core> 10: gammalooprs[972dff90865981f6]::uv::tests::scalars_profile_new <unknown>
37.73 s
gammaloop-nextest-core> at <unknown source file> :<unknown line>
37.73 s
gammaloop-nextest-core> 11: <gammalooprs[972dff90865981f6]::uv::tests::scalars_profile_new::{closure#0} as core[940e698046960fd5]::ops::function::FnOnce<()>>::call_once <unknown>
37.73 s
gammaloop-nextest-core> at <unknown source file> :<unknown line>
37.73 s
gammaloop-nextest-core> 12: test[75d6903177b1d7e9]::__rust_begin_short_backtrace::<core[940e698046960fd5]::result::Result<(), alloc[2ea6bcb46fca0c42]::string::String>, fn() -> core[940e698046960fd5]::result::Result<(), alloc[2ea6bcb46fca0c42]::string::String>> <unknown>
37.73 s
gammaloop-nextest-core> at <unknown source file> :<unknown line>
37.73 s
gammaloop-nextest-core> 13: test[75d6903177b1d7e9]::run_test::{closure#0} <unknown>
37.73 s
gammaloop-nextest-core> at <unknown source file> :<unknown line>
37.73 s
gammaloop-nextest-core> 14: std[bcb96dfbba0ab899]::sys::backtrace::__rust_begin_short_backtrace::<test[75d6903177b1d7e9]::run_test::{closure#1}, ()> <unknown>
37.73 s
gammaloop-nextest-core> at <unknown source file> :<unknown line>
37.73 s
gammaloop-nextest-core> 15: <std[bcb96dfbba0ab899]::thread::lifecycle::spawn_unchecked<test[75d6903177b1d7e9]::run_test::{closure#1}, ()>::{closure#1} as core[940e698046960fd5]::ops::function::FnOnce<()>>::call_once::{shim:vtable#0} <unknown>
37.73 s
gammaloop-nextest-core> at <unknown source file> :<unknown line>
37.73 s
gammaloop-nextest-core> 16: <std[bcb96dfbba0ab899]::sys::thread::unix::Thread>::new::thread_start <unknown>
37.73 s
gammaloop-nextest-core> at <unknown source file> :<unknown line>
37.73 s
gammaloop-nextest-core> 17: start_thread <unknown>
37.73 s
gammaloop-nextest-core> at <unknown source file> :<unknown line>
37.73 s
gammaloop-nextest-core> 18: __clone3 <unknown>
37.73 s
gammaloop-nextest-core> at <unknown source file> :<unknown line>
37.73 s
gammaloop-nextest-core>
37.73 s
gammaloop-nextest-core> Run with COLORBT_SHOW_HIDDEN=1 environment variable to disable frame filtering.
37.73 s
gammaloop-nextest-core> Run with RUST_BACKTRACE=full to include source snippets.
37.73 s
gammaloop-nextest-core>
37.73 s
gammaloop-nextest-core> FAIL [ 10.344s] (560/561) gammalooprs uv::tests :: scalars_profile
37.73 s
gammaloop-nextest-core> stdout ---
37.73 s
gammaloop-nextest-core>
37.73 s
gammaloop-nextest-core> running 1 test
37.73 s
gammaloop-nextest-core> test uv::tests::scalars_profile ... FAILED
37.73 s
gammaloop-nextest-core>
37.73 s
gammaloop-nextest-core> failures:
37.73 s
gammaloop-nextest-core>
37.73 s
gammaloop-nextest-core> failures:
37.73 s
gammaloop-nextest-core> uv::tests::scalars_profile
37.73 s
gammaloop-nextest-core>
37.73 s
gammaloop-nextest-core> test result: FAILED. 0 passed; 1 failed; 0 ignored; 0 measured; 611 filtered out; finished in 10.32s
37.73 s
gammaloop-nextest-core>
37.73 s
gammaloop-nextest-core> stderr ---
37.73 s
gammaloop-nextest-core> [18:18:39.434] @gammalooprs::settings::runtime WARNING : No external kinematics were provided; using default-generated external momenta and helicities.
37.73 s
gammaloop-nextest-core> field value
37.73 s
gammaloop-nextest-core> span build_integrand{amplitude.name = bub}
37.73 s
gammaloop-nextest-core> at crates/gammalooprs/src/settings/runtime.rs:131
37.73 s
gammaloop-nextest-core> [18:18:39.435] @gammalooprs::integrands::process::amplitude INFO : Input is below threshold: 0 existing threshold E-surfaces across 0/3 graph groups
37.73 s
gammaloop-nextest-core> field value
37.73 s
gammaloop-nextest-core> existing_esurfaces 0
37.73 s
gammaloop-nextest-core> group_count 3
37.73 s
gammaloop-nextest-core> groups_above_threshold 0
37.73 s
gammaloop-nextest-core> integrand bub
37.73 s
gammaloop-nextest-core> span warm_up{integrand.name = bub}
37.73 s
gammaloop-nextest-core> threshold_status below threshold
37.73 s
gammaloop-nextest-core> at crates/gammalooprs/src/integrands/process/amplitude/mod.rs:1666
37.73 s
gammaloop-nextest-core> [18:18:39.435] @gammalooprs::integrands::process::amplitude INFO : overlap structure of group 0: [0: []]
37.73 s
gammaloop-nextest-core> field value
37.73 s
gammaloop-nextest-core> span warm_up{integrand.name = bub}
37.73 s
gammaloop-nextest-core> at crates/gammalooprs/src/integrands/process/amplitude/mod.rs:2015
37.73 s
gammaloop-nextest-core> [18:18:39.435] @gammalooprs::integrands::process::amplitude INFO : overlap structure of group 1: [0: []]
37.73 s
gammaloop-nextest-core> field value
37.73 s
gammaloop-nextest-core> span warm_up{integrand.name = bub}
37.73 s
gammaloop-nextest-core> at crates/gammalooprs/src/integrands/process/amplitude/mod.rs:2015
37.73 s
gammaloop-nextest-core> [18:18:39.435] @gammalooprs::integrands::process::amplitude INFO : overlap structure of group 2: [0: []]
37.73 s
gammaloop-nextest-core> field value
37.73 s
gammaloop-nextest-core> span warm_up{integrand.name = bub}
37.73 s
gammaloop-nextest-core> at crates/gammalooprs/src/integrands/process/amplitude/mod.rs:2015
37.73 s
gammaloop-nextest-core> The application panicked (crashed).
37.73 s
gammaloop-nextest-core> Message: assertion `left == right` failed: subtracted scalar UV profile failed:
37.73 s
gammaloop-nextest-core> UVProfilePassFail {
37.73 s
gammaloop-nextest-core> max_dod: -0.9,
37.73 s
gammaloop-nextest-core> total: 16,
37.73 s
gammaloop-nextest-core> failed: 1,
37.73 s
gammaloop-nextest-core> failures: [
37.73 s
gammaloop-nextest-core> UVProfileFailure {
37.73 s
gammaloop-nextest-core> graph_index: 0,
37.73 s
gammaloop-nextest-core> graph_name: "banana",
37.73 s
gammaloop-nextest-core> cutkosky_cut: None,
37.73 s
gammaloop-nextest-core> lmb_index: 1,
37.73 s
gammaloop-nextest-core> fixed: [
37.73 s
gammaloop-nextest-core> EdgeIndex(
37.73 s
gammaloop-nextest-core> 2,
37.73 s
gammaloop-nextest-core> ),
37.73 s
gammaloop-nextest-core> EdgeIndex(
37.73 s
gammaloop-nextest-core> 0,
37.73 s
gammaloop-nextest-core> ),
37.73 s
gammaloop-nextest-core> ],
37.73 s
gammaloop-nextest-core> free: [
37.73 s
gammaloop-nextest-core> EdgeIndex(
37.73 s
gammaloop-nextest-core> 3,
37.73 s
gammaloop-nextest-core> ),
37.73 s
gammaloop-nextest-core> ],
37.73 s
gammaloop-nextest-core> orientation_label: None,
37.73 s
gammaloop-nextest-core> reason: "dod_exceeds_threshold",
37.73 s
gammaloop-nextest-core> },
37.73 s
gammaloop-nextest-core> ],
37.73 s
gammaloop-nextest-core> }
37.73 s
gammaloop-nextest-core>
37.73 s
gammaloop-nextest-core> ╭─────────┬────────────┬───────────┬───────┬─────┬──────────┬───────────╮
37.73 s
gammaloop-nextest-core> │ fixed │ → ∞ │ slope │ r2 │ DOD │ bare DOD │ inspect │
37.73 s
gammaloop-nextest-core> ├─────────┼────────────┼───────────┼───────┼─────┼──────────┼───────────┤
37.73 s
gammaloop-nextest-core> │ {e1,e2} │ {e3} │ -0.996752 │ 1.000 │ -1 │ 0 │ arb retry │
37.73 s
gammaloop-nextest-core> │ {e1,e3} │ {e2} │ -1.065665 │ 0.997 │ -1 │ 0 │ arb retry │
37.73 s
gammaloop-nextest-core> │ {e1} │ {e2,e3} │ -0.937151 │ 0.943 │ -1 │ 2 │ │
37.73 s
gammaloop-nextest-core> │ {e2,e3} │ {e1} │ -1.001075 │ 1.000 │ -1 │ 0 │ arb retry │
37.73 s
gammaloop-nextest-core> │ {e2} │ {e1,e3} │ -0.984146 │ 0.998 │ -1 │ 2 │ │
37.73 s
gammaloop-nextest-core> │ {e3} │ {e1,e2} │ -1.383911 │ 0.982 │ -1 │ 2 │ arb retry │
37.73 s
gammaloop-nextest-core> │ {} │ {e1,e2,e3} │ -1.094213 │ 0.258 │ -1 │ 4 │ │
37.73 s
gammaloop-nextest-core> │ {e2,e0} │ {e3} │ -0.803348 │ 0.861 │ -1 │ 0 │ arb retry │
37.73 s
gammaloop-nextest-core> │ {e3,e0} │ {e2} │ -0.999257 │ 1.000 │ -1 │ 0 │ │
37.73 s
gammaloop-nextest-core> │ {e0} │ {e2,e3} │ -1.000893 │ 1.000 │ -1 │ 2 │ │
37.73 s
gammaloop-nextest-core> │ {e1,e0} │ {e3} │ -0.997860 │ 1.000 │ -1 │ 0 │ │
37.73 s
gammaloop-nextest-core> ╰─────────┴────────────┴───────────┴───────┴─────┴──────────┴───────────╯
37.73 s
gammaloop-nextest-core>
37.73 s
gammaloop-nextest-core> ╭───────┬─────────┬───────────┬───────┬─────┬──────────┬───────────╮
37.73 s
gammaloop-nextest-core> │ fixed │ → ∞ │ slope │ r2 │ DOD │ bare DOD │ inspect │
37.73 s
gammaloop-nextest-core> ├───────┼─────────┼───────────┼───────┼─────┼──────────┼───────────┤
37.73 s
gammaloop-nextest-core> │ {e1} │ {e2} │ -1.005039 │ 1.000 │ -1 │ 0 │ arb retry │
37.73 s
gammaloop-nextest-core> │ {e2} │ {e1} │ -1.001098 │ 1.000 │ -1 │ 0 │ arb retry │
37.73 s
gammaloop-nextest-core> │ {} │ {e1,e2} │ -1.011289 │ 1.000 │ -1 │ 2 │ │
37.73 s
gammaloop-nextest-core> │ {e0} │ {e2} │ -0.998140 │ 1.000 │ -1 │ 0 │ │
37.73 s
gammaloop-nextest-core> ╰───────┴─────────┴───────────┴───────┴─────┴──────────┴───────────╯
37.73 s
gammaloop-nextest-core>
37.73 s
gammaloop-nextest-core> ╭───────┬──────┬───────────┬───────┬─────┬──────────┬─────────╮
37.73 s
gammaloop-nextest-core> │ fixed │ → ∞ │ slope │ r2 │ DOD │ bare DOD │ inspect │
37.73 s
gammaloop-nextest-core> ├───────┼──────┼───────────┼───────┼─────┼──────────┼─────────┤
37.73 s
gammaloop-nextest-core> │ {} │ {e1} │ -0.989949 │ 1.000 │ -1 │ 0 │ │
37.73 s
gammaloop-nextest-core> ╰───────┴──────┴───────────┴───────┴─────┴──────────┴─────────╯
37.73 s
gammaloop-nextest-core> left: 1
37.73 s
gammaloop-nextest-core> right: 0
37.73 s
gammaloop-nextest-core> Location: crates/gammalooprs/src/uv/tests.rs :259
37.73 s
gammaloop-nextest-core>
37.73 s
gammaloop-nextest-core> ━━━━━━━━━━━━━━━━━━━━━━━━━━━━━━━━━━ BACKTRACE ━━━━━━━━━━━━━━━━━━━━━━━━━━━━━━━━━━━
37.73 s
gammaloop-nextest-core> 1: <color_eyre[51793ea62743adbd]::config::PanicHook>::panic_report <unknown>
37.73 s
gammaloop-nextest-core> at <unknown source file> :<unknown line>
37.73 s
gammaloop-nextest-core> 2: <color_eyre[51793ea62743adbd]::config::PanicHook>::into_panic_hook::{closure#0} <unknown>
37.73 s
gammaloop-nextest-core> at <unknown source file> :<unknown line>
37.73 s
gammaloop-nextest-core> 3: std[bcb96dfbba0ab899]::panicking::panic_with_hook <unknown>
37.73 s
gammaloop-nextest-core> at <unknown source file> :<unknown line>
37.73 s
gammaloop-nextest-core> 4: std[bcb96dfbba0ab899]::panicking::panic_handler::{closure#0} <unknown>
37.73 s
gammaloop-nextest-core> at <unknown source file> :<unknown line>
37.73 s
gammaloop-nextest-core> 5: std[bcb96dfbba0ab899]::sys::backtrace::__rust_end_short_backtrace::<std[bcb96dfbba0ab899]::panicking::panic_handler::{closure#0}, !> <unknown>
37.73 s
gammaloop-nextest-core> at <unknown source file> :<unknown line>
37.73 s
gammaloop-nextest-core> 6: __rustc[6c289b9f9c454d21]::rust_begin_unwind <unknown>
37.73 s
gammaloop-nextest-core> at <unknown source file> :<unknown line>
37.73 s
gammaloop-nextest-core> 7: core[940e698046960fd5]::panicking::panic_fmt <unknown>
37.73 s
gammaloop-nextest-core> at <unknown source file> :<unknown line>
37.73 s
gammaloop-nextest-core> 8: core[940e698046960fd5]::panicking::assert_failed_inner <unknown>
37.73 s
gammaloop-nextest-core> at <unknown source file> :<unknown line>
37.73 s
gammaloop-nextest-core> 9: core[940e698046960fd5]::panicking::assert_failed::<usize, usize> <unknown>
37.73 s
gammaloop-nextest-core> at <unknown source file> :<unknown line>
37.73 s
gammaloop-nextest-core> 10: gammalooprs[972dff90865981f6]::uv::tests::scalars_profile <unknown>
37.73 s
gammaloop-nextest-core> at <unknown source file> :<unknown line>
37.73 s
gammaloop-nextest-core> 11: <gammalooprs[972dff90865981f6]::uv::tests::scalars_profile::{closure#0} as core[940e698046960fd5]::ops::function::FnOnce<()>>::call_once <unknown>
37.73 s
gammaloop-nextest-core> at <unknown source file> :<unknown line>
37.73 s
gammaloop-nextest-core> 12: test[75d6903177b1d7e9]::__rust_begin_short_backtrace::<core[940e698046960fd5]::result::Result<(), alloc[2ea6bcb46fca0c42]::string::String>, fn() -> core[940e698046960fd5]::result::Result<(), alloc[2ea6bcb46fca0c42]::string::String>> <unknown>
37.73 s
gammaloop-nextest-core> at <unknown source file> :<unknown line>
37.73 s
gammaloop-nextest-core> 13: test[75d6903177b1d7e9]::run_test::{closure#0} <unknown>
37.73 s
gammaloop-nextest-core> at <unknown source file> :<unknown line>
37.73 s
gammaloop-nextest-core> 14: std[bcb96dfbba0ab899]::sys::backtrace::__rust_begin_short_backtrace::<test[75d6903177b1d7e9]::run_test::{closure#1}, ()> <unknown>
37.73 s
gammaloop-nextest-core> at <unknown source file> :<unknown line>
37.73 s
gammaloop-nextest-core> 15: <std[bcb96dfbba0ab899]::thread::lifecycle::spawn_unchecked<test[75d6903177b1d7e9]::run_test::{closure#1}, ()>::{closure#1} as core[940e698046960fd5]::ops::function::FnOnce<()>>::call_once::{shim:vtable#0} <unknown>
37.73 s
gammaloop-nextest-core> at <unknown source file> :<unknown line>
37.73 s
gammaloop-nextest-core> 16: <std[bcb96dfbba0ab899]::sys::thread::unix::Thread>::new::thread_start <unknown>
37.73 s
gammaloop-nextest-core> at <unknown source file> :<unknown line>
37.73 s
gammaloop-nextest-core> 17: start_thread <unknown>
37.73 s
gammaloop-nextest-core> at <unknown source file> :<unknown line>
37.73 s
gammaloop-nextest-core> 18: __clone3 <unknown>
37.73 s
gammaloop-nextest-core> at <unknown source file> :<unknown line>
37.73 s
gammaloop-nextest-core>
37.73 s
gammaloop-nextest-core> Run with COLORBT_SHOW_HIDDEN=1 environment variable to disable frame filtering.
37.73 s
gammaloop-nextest-core> Run with RUST_BACKTRACE=full to include source snippets.
37.73 s
gammaloop-nextest-core>
37.81 s
gammaloop-nextest-core> error : test run failed
37.84 s
gammaloop-nextest-core>
37.84 s
gammaloop-nextest-core> ========== nextest test summary ==========
37.84 s
gammaloop-nextest-core> report: target/nextest/ci_gammaloop/junit.xml
37.84 s
gammaloop-nextest-core> tests: 561, failures: 5, errors: 0
37.84 s
gammaloop-nextest-core>
37.84 s
gammaloop-nextest-core> 1. gammalooprs::cff::tests::stored_production_cff_uses_typed_energy_factor_ownership
37.84 s
gammaloop-nextest-core> failure: test failure with exit code 101
37.84 s
gammaloop-nextest-core> system-out
37.84 s
gammaloop-nextest-core> running 1 test
37.84 s
gammaloop-nextest-core> test cff::tests::stored_production_cff_uses_typed_energy_factor_ownership ... FAILED
37.84 s
gammaloop-nextest-core>
37.84 s
gammaloop-nextest-core> failures:
37.84 s
gammaloop-nextest-core>
37.84 s
gammaloop-nextest-core> failures:
37.84 s
gammaloop-nextest-core> cff::tests::stored_production_cff_uses_typed_energy_factor_ownership
37.84 s
gammaloop-nextest-core>
37.84 s
gammaloop-nextest-core> test result: FAILED. 0 passed; 1 failed; 0 ignored; 0 measured; 611 filtered out; finished in 0.09s
37.84 s
gammaloop-nextest-core> system-err
37.84 s
gammaloop-nextest-core> The application panicked (crashed).
37.84 s
gammaloop-nextest-core> Message: assertion `left == right` failed
37.84 s
gammaloop-nextest-core> left: 1
37.84 s
gammaloop-nextest-core> right: -1
37.84 s
gammaloop-nextest-core> Location: crates/gammalooprs/src/cff/mod.rs:2721
37.84 s
gammaloop-nextest-core>
37.84 s
gammaloop-nextest-core> ━━━━━━━━━━━━━━━━━━━━━━━━━━━━━━━━━━ BACKTRACE ━━━━━━━━━━━━━━━━━━━━━━━━━━━━━━━━━━━
37.84 s
gammaloop-nextest-core> 1: <color_eyre[51793ea62743adbd]::config::PanicHook>::panic_report<unknown>
37.84 s
gammaloop-nextest-core> at <unknown source file>:<unknown line>
37.84 s
gammaloop-nextest-core> 2: <color_eyre[51793ea62743adbd]::config::PanicHook>::into_panic_hook::{closure#0}<unknown>
37.84 s
gammaloop-nextest-core> at <unknown source file>:<unknown line>
37.84 s
gammaloop-nextest-core> 3: std[bcb96dfbba0ab899]::panicking::panic_with_hook<unknown>
37.84 s
gammaloop-nextest-core> at <unknown source file>:<unknown line>
37.84 s
gammaloop-nextest-core> 4: std[bcb96dfbba0ab899]::panicking::panic_handler::{closure#0}<unknown>
37.84 s
gammaloop-nextest-core> at <unknown source file>:<unknown line>
37.84 s
gammaloop-nextest-core> 5: std[bcb96dfbba0ab899]::sys::backtrace::__rust_end_short_backtrace::<std[bcb96dfbba0ab899]::panicking::panic_handler::{closure#0}, !><unknown>
37.84 s
gammaloop-nextest-core> at <unknown source file>:<unknown line>
37.84 s
gammaloop-nextest-core> 6: __rustc[6c289b9f9c454d21]::rust_begin_unwind<unknown>
37.84 s
gammaloop-nextest-core> at <unknown source file>:<unknown line>
37.84 s
gammaloop-nextest-core> 7: core[940e698046960fd5]::panicking::panic_fmt<unknown>
37.84 s
gammaloop-nextest-core> at <unknown source file>:<unknown line>
37.84 s
gammaloop-nextest-core> 8: core[940e698046960fd5]::panicking::assert_failed_inner<unknown>
37.84 s
gammaloop-nextest-core> at <unknown source file>:<unknown line>
37.84 s
gammaloop-nextest-core> 9: core[940e698046960fd5]::panicking::assert_failed::<i64, i64><unknown>
37.84 s
gammaloop-nextest-core> at <unknown source file>:<unknown line>
37.84 s
gammaloop-nextest-core> 10: gammalooprs[972dff90865981f6]::cff::tests::stored_production_cff_uses_typed_energy_factor_ownership<unknown>
37.84 s
gammaloop-nextest-core> at <unknown source file>:<unknown line>
37.84 s
gammaloop-nextest-core> 11: <gammalooprs[972dff90865981f6]::cff::tests::stored_production_cff_uses_typed_energy_factor_ownership::{closure#0} as core[940e698046960fd5]::ops::function::FnOnce<()>>::call_once<unknown>
37.84 s
gammaloop-nextest-core> at <unknown source file>:<unknown line>
37.84 s
gammaloop-nextest-core> 12: test[75d6903177b1d7e9]::__rust_begin_short_backtrace::<core[940e698046960fd5]::result::Result<(), alloc[2ea6bcb46fca0c42]::string::String>, fn() -> core[940e698046960fd5]::result::Result<(), alloc[2ea6bcb46fca0c42]::string::String>><unknown>
37.84 s
gammaloop-nextest-core> at <unknown source file>:<unknown line>
37.84 s
gammaloop-nextest-core> 13: test[75d6903177b1d7e9]::run_test::{closure#0}<unknown>
37.84 s
gammaloop-nextest-core> at <unknown source file>:<unknown line>
37.84 s
gammaloop-nextest-core> 14: std[bcb96dfbba0ab899]::sys::backtrace::__rust_begin_short_backtrace::<test[75d6903177b1d7e9]::run_test::{closure#1}, ()><unknown>
37.84 s
gammaloop-nextest-core> at <unknown source file>:<unknown line>
37.84 s
gammaloop-nextest-core> 15: <std[bcb96dfbba0ab899]::thread::lifecycle::spawn_unchecked<test[75d6903177b1d7e9]::run_test::{closure#1}, ()>::{closure#1} as core[940e698046960fd5]::ops::function::FnOnce<()>>::call_once::{shim:vtable#0}<unknown>
37.84 s
gammaloop-nextest-core> at <unknown source file>:<unknown line>
37.84 s
gammaloop-nextest-core> 16: <std[bcb96dfbba0ab899]::sys::thread::unix::Thread>::new::thread_start<unknown>
37.84 s
gammaloop-nextest-core> at <unknown source file>:<unknown line>
37.84 s
gammaloop-nextest-core> 17: start_thread<unknown>
37.84 s
gammaloop-nextest-core> at <unknown source file>:<unknown line>
37.84 s
gammaloop-nextest-core> 18: __clone3<unknown>
37.84 s
gammaloop-nextest-core> at <unknown source file>:<unknown line>
37.84 s
gammaloop-nextest-core>
37.84 s
gammaloop-nextest-core> Run with COLORBT_SHOW_HIDDEN=1 environment variable to disable frame filtering.
37.84 s
gammaloop-nextest-core> Run with RUST_BACKTRACE=full to include source snippets.
37.84 s
gammaloop-nextest-core>
37.84 s
gammaloop-nextest-core> 2. gammalooprs::uv::approx::local_3d::tests::production_emr_map_cancels_one_powered_denominator
37.84 s
gammaloop-nextest-core> failure: test failure with exit code 101
37.84 s
gammaloop-nextest-core> system-out
37.84 s
gammaloop-nextest-core> running 1 test
37.84 s
gammaloop-nextest-core> test uv::approx::local_3d::tests::production_emr_map_cancels_one_powered_denominator ... FAILED
37.84 s
gammaloop-nextest-core>
37.84 s
gammaloop-nextest-core> failures:
37.84 s
gammaloop-nextest-core>
37.84 s
gammaloop-nextest-core> failures:
37.84 s
gammaloop-nextest-core> uv::approx::local_3d::tests::production_emr_map_cancels_one_powered_denominator
37.84 s
gammaloop-nextest-core>
37.84 s
gammaloop-nextest-core> test result: FAILED. 0 passed; 1 failed; 0 ignored; 0 measured; 611 filtered out; finished in 0.10s
37.84 s
gammaloop-nextest-core> system-err
37.84 s
gammaloop-nextest-core> The application panicked (crashed).
37.84 s
gammaloop-nextest-core> Message: summed exact-source powered and selected lower channels differ: powered=-1𝑖/8/𝜋^3, lower=1𝑖/16/𝜋^3, difference=-3𝑖/16/𝜋^3
37.84 s
gammaloop-nextest-core> Location: crates/gammalooprs/src/uv/approx/local_3d.rs:2047
37.84 s
gammaloop-nextest-core>
37.84 s
gammaloop-nextest-core> ━━━━━━━━━━━━━━━━━━━━━━━━━━━━━━━━━━ BACKTRACE ━━━━━━━━━━━━━━━━━━━━━━━━━━━━━━━━━━━
37.84 s
gammaloop-nextest-core> 1: <color_eyre[51793ea62743adbd]::config::PanicHook>::panic_report<unknown>
37.84 s
gammaloop-nextest-core> at <unknown source file>:<unknown line>
37.84 s
gammaloop-nextest-core> 2: <color_eyre[51793ea62743adbd]::config::PanicHook>::into_panic_hook::{closure#0}<unknown>
37.84 s
gammaloop-nextest-core> at <unknown source file>:<unknown line>
37.84 s
gammaloop-nextest-core> 3: std[bcb96dfbba0ab899]::panicking::panic_with_hook<unknown>
37.84 s
gammaloop-nextest-core> at <unknown source file>:<unknown line>
37.84 s
gammaloop-nextest-core> 4: std[bcb96dfbba0ab899]::panicking::panic_handler::{closure#0}<unknown>
37.84 s
gammaloop-nextest-core> at <unknown source file>:<unknown line>
37.84 s
gammaloop-nextest-core> 5: std[bcb96dfbba0ab899]::sys::backtrace::__rust_end_short_backtrace::<std[bcb96dfbba0ab899]::panicking::panic_handler::{closure#0}, !><unknown>
37.84 s
gammaloop-nextest-core> at <unknown source file>:<unknown line>
37.84 s
gammaloop-nextest-core> 6: __rustc[6c289b9f9c454d21]::rust_begin_unwind<unknown>
37.84 s
gammaloop-nextest-core> at <unknown source file>:<unknown line>
37.84 s
gammaloop-nextest-core> 7: core[940e698046960fd5]::panicking::panic_fmt<unknown>
37.84 s
gammaloop-nextest-core> at <unknown source file>:<unknown line>
37.84 s
gammaloop-nextest-core> 8: gammalooprs[972dff90865981f6]::uv::approx::local_3d::tests::production_emr_map_cancels_one_powered_denominator<unknown>
37.84 s
gammaloop-nextest-core> at <unknown source file>:<unknown line>
37.84 s
gammaloop-nextest-core> 9: <gammalooprs[972dff90865981f6]::uv::approx::local_3d::tests::production_emr_map_cancels_one_powered_denominator::{closure#0} as core[940e698046960fd5]::ops::function::FnOnce<()>>::call_once<unknown>
37.84 s
gammaloop-nextest-core> at <unknown source file>:<unknown line>
37.84 s
gammaloop-nextest-core> 10: test[75d6903177b1d7e9]::__rust_begin_short_backtrace::<core[940e698046960fd5]::result::Result<(), alloc[2ea6bcb46fca0c42]::string::String>, fn() -> core[940e698046960fd5]::result::Result<(), alloc[2ea6bcb46fca0c42]::string::String>><unknown>
37.84 s
gammaloop-nextest-core> at <unknown source file>:<unknown line>
37.84 s
gammaloop-nextest-core> 11: test[75d6903177b1d7e9]::run_test::{closure#0}<unknown>
37.84 s
gammaloop-nextest-core> at <unknown source file>:<unknown line>
37.84 s
gammaloop-nextest-core> 12: std[bcb96dfbba0ab899]::sys::backtrace::__rust_begin_short_backtrace::<test[75d6903177b1d7e9]::run_test::{closure#1}, ()><unknown>
37.84 s
gammaloop-nextest-core> at <unknown source file>:<unknown line>
37.84 s
gammaloop-nextest-core> 13: <std[bcb96dfbba0ab899]::thread::lifecycle::spawn_unchecked<test[75d6903177b1d7e9]::run_test::{closure#1}, ()>::{closure#1} as core[940e698046960fd5]::ops::function::FnOnce<()>>::call_once::{shim:vtable#0}<unknown>
37.84 s
gammaloop-nextest-core> at <unknown source file>:<unknown line>
37.84 s
gammaloop-nextest-core> 14: <std[bcb96dfbba0ab899]::sys::thread::unix::Thread>::new::thread_start<unknown>
37.84 s
gammaloop-nextest-core> at <unknown source file>:<unknown line>
37.84 s
gammaloop-nextest-core> 15: start_thread<unknown>
37.84 s
gammaloop-nextest-core> at <unknown source file>:<unknown line>
37.84 s
gammaloop-nextest-core> 16: __clone3<unknown>
37.84 s
gammaloop-nextest-core> at <unknown source file>:<unknown line>
37.84 s
gammaloop-nextest-core>
37.84 s
gammaloop-nextest-core> Run with COLORBT_SHOW_HIDDEN=1 environment variable to disable frame filtering.
37.84 s
gammaloop-nextest-core> Run with RUST_BACKTRACE=full to include source snippets.
37.84 s
gammaloop-nextest-core>
37.84 s
gammaloop-nextest-core> 3. gammalooprs::uv::hedge_poset::tests::spectacles_typed_4d_projects_after_local_construction
37.84 s
gammaloop-nextest-core> failure: test failure with exit code 101
37.84 s
gammaloop-nextest-core> Error:
37.84 s
gammaloop-nextest-core> 0: failed to extract three-dimensional representation graph input: source edge 1 has no unique routing for rewritten exact signature [-1, 0, 0] modulo the factorized opposite-domain loop span
37.84 s
gammaloop-nextest-core>
37.84 s
gammaloop-nextest-core> Location:
37.84 s
gammaloop-nextest-core> crates/gammalooprs/src/uv/approx/local_3d.rs:845
37.84 s
gammaloop-nextest-core>
37.84 s
gammaloop-nextest-core> ━━━━━━━━━━━━━━━━━━━━━━━━━━━━━━━━━━ BACKTRACE ━━━━━━━━━━━━━━━━━━━━━━━━━━━━━━━━━━━
37.84 s
gammaloop-nextest-core> 1: <color_eyre[51793ea62743adbd]::config::EyreHook>::into_eyre_hook::{closure#0}<unknown>
37.84 s
gammaloop-nextest-core> at <unknown source file>:<unknown line>
37.84 s
gammaloop-nextest-core> 2: eyre[cb2fd339c0c40fca]::capture_handler<unknown>
37.84 s
gammaloop-nextest-core> at <unknown source file>:<unknown line>
37.84 s
gammaloop-nextest-core> 3: <eyre[cb2fd339c0c40fca]::Report>::from_std::<three_dimensional_reps[3cb572ff22d197ac]::graph_io::GraphIoError><unknown>
37.84 s
gammaloop-nextest-core> at <unknown source file>:<unknown line>
37.84 s
gammaloop-nextest-core> 4: <gammalooprs[972dff90865981f6]::uv::approx::local_3d::Localizer>::project_4d<unknown>
37.84 s
gammaloop-nextest-core> at <unknown source file>:<unknown line>
37.84 s
gammaloop-nextest-core> 5: gammalooprs[972dff90865981f6]::uv::hedge_poset::tests::spectacles_typed_4d_projects_after_local_construction<unknown>
37.84 s
gammaloop-nextest-core> at <unknown source file>:<unknown line>
37.84 s
gammaloop-nextest-core> 6: <gammalooprs[972dff90865981f6]::uv::hedge_poset::tests::spectacles_typed_4d_projects_after_local_construction::{closure#0} as core[940e698046960fd5]::ops::function::FnOnce<()>>::call_once<unknown>
37.84 s
gammaloop-nextest-core> at <unknown source file>:<unknown line>
37.84 s
gammaloop-nextest-core> 7: test[75d6903177b1d7e9]::__rust_begin_short_backtrace::<core[940e698046960fd5]::result::Result<(), alloc[2ea6bcb46fca0c42]::string::String>, fn() -> core[940e698046960fd5]::result::Result<(), alloc[2ea6bcb46fca0c42]::string::String>><unknown>
37.84 s
gammaloop-nextest-core> at <unknown source file>:<unknown line>
37.84 s
gammaloop-nextest-core> 8: test[75d6903177b1d7e9]::run_test::{closure#0}<unknown>
37.84 s
gammaloop-nextest-core> at <unknown source file>:<unknown line>
37.84 s
gammaloop-nextest-core> 9: std[bcb96dfbba0ab899]::sys::backtrace::__rust_begin_short_backtrace::<test[75d6903177b1d7e9]::run_test::{closure#1}, ()><unknown>
37.84 s
gammaloop-nextest-core> at <unknown source file>:<unknown line>
37.84 s
gammaloop-nextest-core> 10: <std[bcb96dfbba0ab899]::thread::lifecycle::spawn_unchecked<test[75d6903177b1d7e9]::run_test::{closure#1}, ()>::{closure#1} as core[940e698046960fd5]::ops::function::FnOnce<()>>::call_once::{shim:vtable#0}<unknown>
37.84 s
gammaloop-nextest-core> at <unknown source file>:<unknown line>
37.84 s
gammaloop-nextest-core> 11: <std[bcb96dfbba0ab899]::sys::thread::unix::Thread>::new::thread_start<unknown>
37.84 s
gammaloop-nextest-core> at <unknown source file>:<unknown line>
37.84 s
gammaloop-nextest-core> 12: start_thread<unknown>
37.84 s
gammaloop-nextest-core> at <unknown source file>:<unknown line>
37.84 s
gammaloop-nextest-core> 13: __clone3<unknown>
37.84 s
gammaloop-nextest-core> at <unknown source file>:<unknown line>
37.84 s
gammaloop-nextest-core>
37.84 s
gammaloop-nextest-core> Run with COLORBT_SHOW_HIDDEN=1 environment variable to disable frame filtering.
37.84 s
gammaloop-nextest-core> Run with RUST_BACKTRACE=full to include source snippets.
37.84 s
gammaloop-nextest-core> system-out
37.84 s
gammaloop-nextest-core> running 1 test
37.84 s
gammaloop-nextest-core> digraph {
37.84 s
gammaloop-nextest-core> node [shape=circle,height=0.1,label=""];
37.84 s
gammaloop-nextest-core> overlap = "scale";
37.84 s
gammaloop-nextest-core> layout = "neato";
37.84 s
gammaloop-nextest-core> start=2;
37.84 s
gammaloop-nextest-core> 4 [label="0"];
37.84 s
gammaloop-nextest-core> 1 [label="zw"];
37.84 s
gammaloop-nextest-core> 2 [label="F"];
37.84 s
gammaloop-nextest-core> 0 [label="143"];
37.84 s
gammaloop-nextest-core> 3 [label="10B"];
37.84 s
gammaloop-nextest-core> 4:0:s-> 1:1:s [id=0 color="red:blue;0.5" label="zw"];
37.84 s
gammaloop-nextest-core> 4:2:s-> 2:3:s [id=1 color="red:blue;0.5" label="F"];
37.84 s
gammaloop-nextest-core> 3:5:s-> 0:4:s [id=2 color="red:blue;0.5" label="143"];
37.84 s
gammaloop-nextest-core> 4:6:s-> 0:7:s [id=3 color="red:blue;0.5" label="143"];
37.84 s
gammaloop-nextest-core> 1:8:s-> 3:9:s [id=4 color="red:blue;0.5" label="F"];
37.84 s
gammaloop-nextest-core> 1:10:s-> 0:11:s [id=5 color="red:blue;0.5" label="143"];
37.84 s
gammaloop-nextest-core> 2:12:s-> 3:13:s [id=6 color="red:blue;0.5" label="zw"];
37.84 s
gammaloop-nextest-core> 2:14:s-> 0:15:s [id=7 color="red:blue;0.5" label="143"];
37.84 s
gammaloop-nextest-core> }
37.84 s
gammaloop-nextest-core>
37.84 s
gammaloop-nextest-core> digraph {
37.84 s
gammaloop-nextest-core> node [shape=circle,height=0.1,label=""];
37.84 s
gammaloop-nextest-core> overlap = "scale";
37.84 s
gammaloop-nextest-core> layout = "neato";
37.84 s
gammaloop-nextest-core> start=2;
37.84 s
gammaloop-nextest-core> 0 [label="∅"];
37.84 s
gammaloop-nextest-core> 1 [label="{zw}: Approx(S_zw(0))"];
37.84 s
gammaloop-nextest-core> 2 [label="{F}: Approx(S_F(1))"];
37.84 s
gammaloop-nextest-core> 3 [label="{143}: Approx(S_143(3))"];
37.84 s
gammaloop-nextest-core> 4 [label="{zw,F}: Approx(S_F(4))*Approx(S_zw(0))"];
37.84 s
gammaloop-nextest-core> 5 [label="{zw} · {143}: Approx((-1*S_zw+S_143(5))*Approx(S_zw(0)))"];
37.84 s
gammaloop-nextest-core> 6 [label="{F} · {143}: Approx((-1*S_F+S_143(7))*Approx(S_F(1)))"];
37.84 s
gammaloop-nextest-core> 7 [label="{zw,F} · {143}: Approx((-1*S_10B+S_143(2))*Approx(S_F(4))*Approx(S_zw(0)))"];
37.84 s
gammaloop-nextest-core> 0:0:s-> 1:1:s [id=0 color="red:blue;0.5"];
37.84 s
gammaloop-nextest-core> 0:2:s-> 2:3:s [id=1 color="red:blue;0.5"];
37.84 s
gammaloop-nextest-core> 0:4:s-> 3:5:s [id=2 color="red:blue;0.5"];
37.84 s
gammaloop-nextest-core> 1:6:s-> 4:7:s [id=3 color="red:blue;0.5"];
37.84 s
gammaloop-nextest-core> 1:8:s-> 5:9:s [id=4 color="red:blue;0.5"];
37.84 s
gammaloop-nextest-core> 2:10:s-> 4:11:s [id=5 color="red:blue;0.5"];
37.84 s
gammaloop-nextest-core> 2:12:s-> 6:13:s [id=6 color="red:blue;0.5"];
37.84 s
gammaloop-nextest-core> 4:14:s-> 7:15:s [id=7 color="red:blue;0.5"];
37.84 s
gammaloop-nextest-core> }
37.84 s
gammaloop-nextest-core>
37.84 s
gammaloop-nextest-core> test uv::hedge_poset::tests::spectacles_typed_4d_projects_after_local_construction ... FAILED
37.84 s
gammaloop-nextest-core>
37.84 s
gammaloop-nextest-core> failures:
37.84 s
gammaloop-nextest-core>
37.84 s
gammaloop-nextest-core> failures:
37.84 s
gammaloop-nextest-core> uv::hedge_poset::tests::spectacles_typed_4d_projects_after_local_construction
37.84 s
gammaloop-nextest-core>
37.84 s
gammaloop-nextest-core> test result: FAILED. 0 passed; 1 failed; 0 ignored; 0 measured; 611 filtered out; finished in 0.20s
37.84 s
gammaloop-nextest-core> system-err
37.84 s
gammaloop-nextest-core> Error:
37.84 s
gammaloop-nextest-core> 0: failed to extract three-dimensional representation graph input: source edge 1 has no unique routing for rewritten exact signature [-1, 0, 0] modulo the factorized opposite-domain loop span
37.84 s
gammaloop-nextest-core>
37.84 s
gammaloop-nextest-core> Location:
37.84 s
gammaloop-nextest-core> crates/gammalooprs/src/uv/approx/local_3d.rs:845
37.84 s
gammaloop-nextest-core>
37.84 s
gammaloop-nextest-core> ━━━━━━━━━━━━━━━━━━━━━━━━━━━━━━━━━━ BACKTRACE ━━━━━━━━━━━━━━━━━━━━━━━━━━━━━━━━━━━
37.84 s
gammaloop-nextest-core> 1: <color_eyre[51793ea62743adbd]::config::EyreHook>::into_eyre_hook::{closure#0}<unknown>
37.84 s
gammaloop-nextest-core> at <unknown source file>:<unknown line>
37.84 s
gammaloop-nextest-core> 2: eyre[cb2fd339c0c40fca]::capture_handler<unknown>
37.84 s
gammaloop-nextest-core> at <unknown source file>:<unknown line>
37.84 s
gammaloop-nextest-core> 3: <eyre[cb2fd339c0c40fca]::Report>::from_std::<three_dimensional_reps[3cb572ff22d197ac]::graph_io::GraphIoError><unknown>
37.84 s
gammaloop-nextest-core> at <unknown source file>:<unknown line>
37.84 s
gammaloop-nextest-core> 4: <gammalooprs[972dff90865981f6]::uv::approx::local_3d::Localizer>::project_4d<unknown>
37.84 s
gammaloop-nextest-core> at <unknown source file>:<unknown line>
37.84 s
gammaloop-nextest-core> 5: gammalooprs[972dff90865981f6]::uv::hedge_poset::tests::spectacles_typed_4d_projects_after_local_construction<unknown>
37.84 s
gammaloop-nextest-core> at <unknown source file>:<unknown line>
37.84 s
gammaloop-nextest-core> 6: <gammalooprs[972dff90865981f6]::uv::hedge_poset::tests::spectacles_typed_4d_projects_after_local_construction::{closure#0} as core[940e698046960fd5]::ops::function::FnOnce<()>>::call_once<unknown>
37.84 s
gammaloop-nextest-core> at <unknown source file>:<unknown line>
37.84 s
gammaloop-nextest-core> 7: test[75d6903177b1d7e9]::__rust_begin_short_backtrace::<core[940e698046960fd5]::result::Result<(), alloc[2ea6bcb46fca0c42]::string::String>, fn() -> core[940e698046960fd5]::result::Result<(), alloc[2ea6bcb46fca0c42]::string::String>><unknown>
37.84 s
gammaloop-nextest-core> at <unknown source file>:<unknown line>
37.84 s
gammaloop-nextest-core> 8: test[75d6903177b1d7e9]::run_test::{closure#0}<unknown>
37.84 s
gammaloop-nextest-core> at <unknown source file>:<unknown line>
37.84 s
gammaloop-nextest-core> 9: std[bcb96dfbba0ab899]::sys::backtrace::__rust_begin_short_backtrace::<test[75d6903177b1d7e9]::run_test::{closure#1}, ()><unknown>
37.84 s
gammaloop-nextest-core> at <unknown source file>:<unknown line>
37.84 s
gammaloop-nextest-core> 10: <std[bcb96dfbba0ab899]::thread::lifecycle::spawn_unchecked<test[75d6903177b1d7e9]::run_test::{closure#1}, ()>::{closure#1} as core[940e698046960fd5]::ops::function::FnOnce<()>>::call_once::{shim:vtable#0}<unknown>
37.84 s
gammaloop-nextest-core> at <unknown source file>:<unknown line>
37.84 s
gammaloop-nextest-core> 11: <std[bcb96dfbba0ab899]::sys::thread::unix::Thread>::new::thread_start<unknown>
37.84 s
gammaloop-nextest-core> at <unknown source file>:<unknown line>
37.84 s
gammaloop-nextest-core> 12: start_thread<unknown>
37.84 s
gammaloop-nextest-core> at <unknown source file>:<unknown line>
37.84 s
gammaloop-nextest-core> 13: __clone3<unknown>
37.84 s
gammaloop-nextest-core> at <unknown source file>:<unknown line>
37.84 s
gammaloop-nextest-core>
37.84 s
gammaloop-nextest-core> Run with COLORBT_SHOW_HIDDEN=1 environment variable to disable frame filtering.
37.84 s
gammaloop-nextest-core> Run with RUST_BACKTRACE=full to include source snippets.
37.84 s
gammaloop-nextest-core>
37.84 s
gammaloop-nextest-core> 4. gammalooprs::uv::tests::scalars_profile_new
37.84 s
gammaloop-nextest-core> failure: test failure with exit code 101
37.84 s
gammaloop-nextest-core> system-out
37.84 s
gammaloop-nextest-core> running 1 test
37.84 s
gammaloop-nextest-core> test uv::tests::scalars_profile_new ... FAILED
37.84 s
gammaloop-nextest-core>
37.84 s
gammaloop-nextest-core> failures:
37.84 s
gammaloop-nextest-core>
37.84 s
gammaloop-nextest-core> failures:
37.84 s
gammaloop-nextest-core> uv::tests::scalars_profile_new
37.84 s
gammaloop-nextest-core>
37.84 s
gammaloop-nextest-core> test result: FAILED. 0 passed; 1 failed; 0 ignored; 0 measured; 611 filtered out; finished in 10.30s
37.84 s
gammaloop-nextest-core> system-err
37.84 s
gammaloop-nextest-core> [18:18:39.444] @gammalooprs::settings::runtime WARNING : No external kinematics were provided; using default-generated external momenta and helicities.
37.84 s
gammaloop-nextest-core> field value
37.84 s
gammaloop-nextest-core> span build_integrand{amplitude.name=bub}
37.84 s
gammaloop-nextest-core> at crates/gammalooprs/src/settings/runtime.rs:131
37.84 s
gammaloop-nextest-core> [18:18:39.445] @gammalooprs::integrands::process::amplitude INFO : Input is below threshold: 0 existing threshold E-surfaces across 0/3 graph groups
37.84 s
gammaloop-nextest-core> field value
37.84 s
gammaloop-nextest-core> existing_esurfaces 0
37.84 s
gammaloop-nextest-core> group_count 3
37.84 s
gammaloop-nextest-core> groups_above_threshold 0
37.84 s
gammaloop-nextest-core> integrand bub
37.84 s
gammaloop-nextest-core> span warm_up{integrand.name=bub}
37.84 s
gammaloop-nextest-core> threshold_status below threshold
37.84 s
gammaloop-nextest-core> at crates/gammalooprs/src/integrands/process/amplitude/mod.rs:1666
37.84 s
gammaloop-nextest-core> [18:18:39.445] @gammalooprs::integrands::process::amplitude INFO : overlap structure of group 0: [0: []]
37.84 s
gammaloop-nextest-core> field value
37.84 s
gammaloop-nextest-core> span warm_up{integrand.name=bub}
37.84 s
gammaloop-nextest-core> at crates/gammalooprs/src/integrands/process/amplitude/mod.rs:2015
37.84 s
gammaloop-nextest-core> [18:18:39.445] @gammalooprs::integrands::process::amplitude INFO : overlap structure of group 1: [0: []]
37.84 s
gammaloop-nextest-core> field value
37.84 s
gammaloop-nextest-core> span warm_up{integrand.name=bub}
37.84 s
gammaloop-nextest-core> at crates/gammalooprs/src/integrands/process/amplitude/mod.rs:2015
37.84 s
gammaloop-nextest-core> [18:18:39.445] @gammalooprs::integrands::process::amplitude INFO : overlap structure of group 2: [0: []]
37.84 s
gammaloop-nextest-core> field value
37.84 s
gammaloop-nextest-core> span warm_up{integrand.name=bub}
37.84 s
gammaloop-nextest-core> at crates/gammalooprs/src/integrands/process/amplitude/mod.rs:2015
37.84 s
gammaloop-nextest-core> The application panicked (crashed).
37.84 s
gammaloop-nextest-core> Message: assertion `left == right` failed: subtracted scalar UV profile failed:
37.84 s
gammaloop-nextest-core> UVProfilePassFail {
37.84 s
gammaloop-nextest-core> max_dod: -0.9,
37.84 s
gammaloop-nextest-core> total: 16,
37.84 s
gammaloop-nextest-core> failed: 1,
37.84 s
gammaloop-nextest-core> failures: [
37.84 s
gammaloop-nextest-core> UVProfileFailure {
37.84 s
gammaloop-nextest-core> graph_index: 0,
37.84 s
gammaloop-nextest-core> graph_name: "banana",
37.84 s
gammaloop-nextest-core> cutkosky_cut: None,
37.84 s
gammaloop-nextest-core> lmb_index: 1,
37.84 s
gammaloop-nextest-core> fixed: [
37.84 s
gammaloop-nextest-core> EdgeIndex(
37.84 s
gammaloop-nextest-core> 2,
37.84 s
gammaloop-nextest-core> ),
37.84 s
gammaloop-nextest-core> EdgeIndex(
37.84 s
gammaloop-nextest-core> 0,
37.84 s
gammaloop-nextest-core> ),
37.84 s
gammaloop-nextest-core> ],
37.84 s
gammaloop-nextest-core> free: [
37.84 s
gammaloop-nextest-core> EdgeIndex(
37.84 s
gammaloop-nextest-core> 3,
37.84 s
gammaloop-nextest-core> ),
37.84 s
gammaloop-nextest-core> ],
37.84 s
gammaloop-nextest-core> orientation_label: None,
37.84 s
gammaloop-nextest-core> reason: "dod_exceeds_threshold",
37.84 s
gammaloop-nextest-core> },
37.84 s
gammaloop-nextest-core> ],
37.84 s
gammaloop-nextest-core> }
37.84 s
gammaloop-nextest-core>
37.84 s
gammaloop-nextest-core> ╭─────────┬────────────┬───────────┬───────┬─────┬──────────┬───────────╮
37.84 s
gammaloop-nextest-core> │ fixed │ → ∞ │ slope │ r2 │ DOD │ bare DOD │ inspect │
37.84 s
gammaloop-nextest-core> ├─────────┼────────────┼───────────┼───────┼─────┼──────────┼───────────┤
37.84 s
gammaloop-nextest-core> │ {e1,e2} │ {e3} │ -0.996752 │ 1.000 │ -1 │ 0 │ arb retry │
37.84 s
gammaloop-nextest-core> │ {e1,e3} │ {e2} │ -1.065665 │ 0.997 │ -1 │ 0 │ arb retry │
37.84 s
gammaloop-nextest-core> │ {e1} │ {e2,e3} │ -0.937151 │ 0.943 │ -1 │ 2 │ │
37.84 s
gammaloop-nextest-core> │ {e2,e3} │ {e1} │ -1.001075 │ 1.000 │ -1 │ 0 │ arb retry │
37.84 s
gammaloop-nextest-core> │ {e2} │ {e1,e3} │ -0.984146 │ 0.998 │ -1 │ 2 │ │
37.84 s
gammaloop-nextest-core> │ {e3} │ {e1,e2} │ -1.383911 │ 0.982 │ -1 │ 2 │ arb retry │
37.84 s
gammaloop-nextest-core> │ {} │ {e1,e2,e3} │ -1.094213 │ 0.258 │ -1 │ 4 │ │
37.84 s
gammaloop-nextest-core> │ {e2,e0} │ {e3} │ -0.803348 │ 0.861 │ -1 │ 0 │ arb retry │
37.84 s
gammaloop-nextest-core> │ {e3,e0} │ {e2} │ -0.999257 │ 1.000 │ -1 │ 0 │ │
37.84 s
gammaloop-nextest-core> │ {e0} │ {e2,e3} │ -1.000893 │ 1.000 │ -1 │ 2 │ │
37.84 s
gammaloop-nextest-core> │ {e1,e0} │ {e3} │ -0.997860 │ 1.000 │ -1 │ 0 │ │
37.84 s
gammaloop-nextest-core> ╰─────────┴────────────┴───────────┴───────┴─────┴──────────┴───────────╯
37.84 s
gammaloop-nextest-core>
37.84 s
gammaloop-nextest-core> ╭───────┬─────────┬───────────┬───────┬─────┬──────────┬───────────╮
37.84 s
gammaloop-nextest-core> │ fixed │ → ∞ │ slope │ r2 │ DOD │ bare DOD │ inspect │
37.84 s
gammaloop-nextest-core> ├───────┼─────────┼───────────┼───────┼─────┼──────────┼───────────┤
37.84 s
gammaloop-nextest-core> │ {e1} │ {e2} │ -1.005039 │ 1.000 │ -1 │ 0 │ arb retry │
37.84 s
gammaloop-nextest-core> │ {e2} │ {e1} │ -1.001098 │ 1.000 │ -1 │ 0 │ arb retry │
37.84 s
gammaloop-nextest-core> │ {} │ {e1,e2} │ -1.011289 │ 1.000 │ -1 │ 2 │ │
37.84 s
gammaloop-nextest-core> │ {e0} │ {e2} │ -0.998140 │ 1.000 │ -1 │ 0 │ │
37.84 s
gammaloop-nextest-core> ╰───────┴─────────┴───────────┴───────┴─────┴──────────┴───────────╯
37.84 s
gammaloop-nextest-core>
37.84 s
gammaloop-nextest-core> ╭───────┬──────┬───────────┬───────┬─────┬──────────┬─────────╮
37.84 s
gammaloop-nextest-core> │ fixed │ → ∞ │ slope │ r2 │ DOD │ bare DOD │ inspect │
37.84 s
gammaloop-nextest-core> ├───────┼──────┼───────────┼───────┼─────┼──────────┼─────────┤
37.84 s
gammaloop-nextest-core> │ {} │ {e1} │ -0.989949 │ 1.000 │ -1 │ 0 │ │
37.84 s
gammaloop-nextest-core> ╰───────┴──────┴───────────┴───────┴─────┴──────────┴─────────╯
37.84 s
gammaloop-nextest-core> left: 1
37.84 s
gammaloop-nextest-core> right: 0
37.84 s
gammaloop-nextest-core> Location: crates/gammalooprs/src/uv/tests.rs:325
37.84 s
gammaloop-nextest-core>
37.84 s
gammaloop-nextest-core> ━━━━━━━━━━━━━━━━━━━━━━━━━━━━━━━━━━ BACKTRACE ━━━━━━━━━━━━━━━━━━━━━━━━━━━━━━━━━━━
37.84 s
gammaloop-nextest-core> 1: <color_eyre[51793ea62743adbd]::config::PanicHook>::panic_report<unknown>
37.84 s
gammaloop-nextest-core> at <unknown source file>:<unknown line>
37.84 s
gammaloop-nextest-core> 2: <color_eyre[51793ea62743adbd]::config::PanicHook>::into_panic_hook::{closure#0}<unknown>
37.84 s
gammaloop-nextest-core> at <unknown source file>:<unknown line>
37.84 s
gammaloop-nextest-core> 3: std[bcb96dfbba0ab899]::panicking::panic_with_hook<unknown>
37.84 s
gammaloop-nextest-core> at <unknown source file>:<unknown line>
37.84 s
gammaloop-nextest-core> 4: std[bcb96dfbba0ab899]::panicking::panic_handler::{closure#0}<unknown>
37.84 s
gammaloop-nextest-core> at <unknown source file>:<unknown line>
37.84 s
gammaloop-nextest-core> 5: std[bcb96dfbba0ab899]::sys::backtrace::__rust_end_short_backtrace::<std[bcb96dfbba0ab899]::panicking::panic_handler::{closure#0}, !><unknown>
37.84 s
gammaloop-nextest-core> at <unknown source file>:<unknown line>
37.84 s
gammaloop-nextest-core> 6: __rustc[6c289b9f9c454d21]::rust_begin_unwind<unknown>
37.84 s
gammaloop-nextest-core> at <unknown source file>:<unknown line>
37.84 s
gammaloop-nextest-core> 7: core[940e698046960fd5]::panicking::panic_fmt<unknown>
37.84 s
gammaloop-nextest-core> at <unknown source file>:<unknown line>
37.84 s
gammaloop-nextest-core> 8: core[940e698046960fd5]::panicking::assert_failed_inner<unknown>
37.84 s
gammaloop-nextest-core> at <unknown source file>:<unknown line>
37.84 s
gammaloop-nextest-core> 9: core[940e698046960fd5]::panicking::assert_failed::<usize, usize><unknown>
37.84 s
gammaloop-nextest-core> at <unknown source file>:<unknown line>
37.84 s
gammaloop-nextest-core> 10: gammalooprs[972dff90865981f6]::uv::tests::scalars_profile_new<unknown>
37.84 s
gammaloop-nextest-core> at <unknown source file>:<unknown line>
37.84 s
gammaloop-nextest-core> 11: <gammalooprs[972dff90865981f6]::uv::tests::scalars_profile_new::{closure#0} as core[940e698046960fd5]::ops::function::FnOnce<()>>::call_once<unknown>
37.84 s
gammaloop-nextest-core> at <unknown source file>:<unknown line>
37.84 s
gammaloop-nextest-core> 12: test[75d6903177b1d7e9]::__rust_begin_short_backtrace::<core[940e698046960fd5]::result::Result<(), alloc[2ea6bcb46fca0c42]::string::String>, fn() -> core[940e698046960fd5]::result::Result<(), alloc[2ea6bcb46fca0c42]::string::String>><unknown>
37.84 s
gammaloop-nextest-core> at <unknown source file>:<unknown line>
37.84 s
gammaloop-nextest-core> 13: test[75d6903177b1d7e9]::run_test::{closure#0}<unknown>
37.84 s
gammaloop-nextest-core> at <unknown source file>:<unknown line>
37.84 s
gammaloop-nextest-core> 14: std[bcb96dfbba0ab899]::sys::backtrace::__rust_begin_short_backtrace::<test[75d6903177b1d7e9]::run_test::{closure#1}, ()><unknown>
37.84 s
gammaloop-nextest-core> at <unknown source file>:<unknown line>
37.84 s
gammaloop-nextest-core> ... omitted 11 more lines; see full nextest output above
37.84 s
gammaloop-nextest-core>
37.84 s
gammaloop-nextest-core> 5. gammalooprs::uv::tests::scalars_profile
37.84 s
gammaloop-nextest-core> failure: test failure with exit code 101
37.84 s
gammaloop-nextest-core> system-out
37.84 s
gammaloop-nextest-core> running 1 test
37.84 s
gammaloop-nextest-core> test uv::tests::scalars_profile ... FAILED
37.84 s
gammaloop-nextest-core>
37.84 s
gammaloop-nextest-core> failures:
37.84 s
gammaloop-nextest-core>
37.84 s
gammaloop-nextest-core> failures:
37.84 s
gammaloop-nextest-core> uv::tests::scalars_profile
37.84 s
gammaloop-nextest-core>
37.84 s
gammaloop-nextest-core> test result: FAILED. 0 passed; 1 failed; 0 ignored; 0 measured; 611 filtered out; finished in 10.32s
37.84 s
gammaloop-nextest-core> system-err
37.84 s
gammaloop-nextest-core> [18:18:39.434] @gammalooprs::settings::runtime WARNING : No external kinematics were provided; using default-generated external momenta and helicities.
37.84 s
gammaloop-nextest-core> field value
37.84 s
gammaloop-nextest-core> span build_integrand{amplitude.name=bub}
37.84 s
gammaloop-nextest-core> at crates/gammalooprs/src/settings/runtime.rs:131
37.84 s
gammaloop-nextest-core> [18:18:39.435] @gammalooprs::integrands::process::amplitude INFO : Input is below threshold: 0 existing threshold E-surfaces across 0/3 graph groups
37.84 s
gammaloop-nextest-core> field value
37.84 s
gammaloop-nextest-core> existing_esurfaces 0
37.84 s
gammaloop-nextest-core> group_count 3
37.84 s
gammaloop-nextest-core> groups_above_threshold 0
37.84 s
gammaloop-nextest-core> integrand bub
37.84 s
gammaloop-nextest-core> span warm_up{integrand.name=bub}
37.84 s
gammaloop-nextest-core> threshold_status below threshold
37.84 s
gammaloop-nextest-core> at crates/gammalooprs/src/integrands/process/amplitude/mod.rs:1666
37.84 s
gammaloop-nextest-core> [18:18:39.435] @gammalooprs::integrands::process::amplitude INFO : overlap structure of group 0: [0: []]
37.84 s
gammaloop-nextest-core> field value
37.84 s
gammaloop-nextest-core> span warm_up{integrand.name=bub}
37.84 s
gammaloop-nextest-core> at crates/gammalooprs/src/integrands/process/amplitude/mod.rs:2015
37.84 s
gammaloop-nextest-core> [18:18:39.435] @gammalooprs::integrands::process::amplitude INFO : overlap structure of group 1: [0: []]
37.84 s
gammaloop-nextest-core> field value
37.84 s
gammaloop-nextest-core> span warm_up{integrand.name=bub}
37.84 s
gammaloop-nextest-core> at crates/gammalooprs/src/integrands/process/amplitude/mod.rs:2015
37.84 s
gammaloop-nextest-core> [18:18:39.435] @gammalooprs::integrands::process::amplitude INFO : overlap structure of group 2: [0: []]
37.84 s
gammaloop-nextest-core> field value
37.84 s
gammaloop-nextest-core> span warm_up{integrand.name=bub}
37.84 s
gammaloop-nextest-core> at crates/gammalooprs/src/integrands/process/amplitude/mod.rs:2015
37.84 s
gammaloop-nextest-core> The application panicked (crashed).
37.84 s
gammaloop-nextest-core> Message: assertion `left == right` failed: subtracted scalar UV profile failed:
37.84 s
gammaloop-nextest-core> UVProfilePassFail {
37.84 s
gammaloop-nextest-core> max_dod: -0.9,
37.84 s
gammaloop-nextest-core> total: 16,
37.84 s
gammaloop-nextest-core> failed: 1,
37.84 s
gammaloop-nextest-core> failures: [
37.84 s
gammaloop-nextest-core> UVProfileFailure {
37.84 s
gammaloop-nextest-core> graph_index: 0,
37.84 s
gammaloop-nextest-core> graph_name: "banana",
37.84 s
gammaloop-nextest-core> cutkosky_cut: None,
37.84 s
gammaloop-nextest-core> lmb_index: 1,
37.84 s
gammaloop-nextest-core> fixed: [
37.84 s
gammaloop-nextest-core> EdgeIndex(
37.84 s
gammaloop-nextest-core> 2,
37.84 s
gammaloop-nextest-core> ),
37.84 s
gammaloop-nextest-core> EdgeIndex(
37.84 s
gammaloop-nextest-core> 0,
37.84 s
gammaloop-nextest-core> ),
37.84 s
gammaloop-nextest-core> ],
37.84 s
gammaloop-nextest-core> free: [
37.84 s
gammaloop-nextest-core> EdgeIndex(
37.84 s
gammaloop-nextest-core> 3,
37.84 s
gammaloop-nextest-core> ),
37.84 s
gammaloop-nextest-core> ],
37.84 s
gammaloop-nextest-core> orientation_label: None,
37.84 s
gammaloop-nextest-core> reason: "dod_exceeds_threshold",
37.84 s
gammaloop-nextest-core> },
37.84 s
gammaloop-nextest-core> ],
37.84 s
gammaloop-nextest-core> }
37.84 s
gammaloop-nextest-core>
37.84 s
gammaloop-nextest-core> ╭─────────┬────────────┬───────────┬───────┬─────┬──────────┬───────────╮
37.84 s
gammaloop-nextest-core> │ fixed │ → ∞ │ slope │ r2 │ DOD │ bare DOD │ inspect │
37.84 s
gammaloop-nextest-core> ├─────────┼────────────┼───────────┼───────┼─────┼──────────┼───────────┤
37.84 s
gammaloop-nextest-core> │ {e1,e2} │ {e3} │ -0.996752 │ 1.000 │ -1 │ 0 │ arb retry │
37.84 s
gammaloop-nextest-core> │ {e1,e3} │ {e2} │ -1.065665 │ 0.997 │ -1 │ 0 │ arb retry │
37.84 s
gammaloop-nextest-core> │ {e1} │ {e2,e3} │ -0.937151 │ 0.943 │ -1 │ 2 │ │
37.84 s
gammaloop-nextest-core> │ {e2,e3} │ {e1} │ -1.001075 │ 1.000 │ -1 │ 0 │ arb retry │
37.84 s
gammaloop-nextest-core> │ {e2} │ {e1,e3} │ -0.984146 │ 0.998 │ -1 │ 2 │ │
37.84 s
gammaloop-nextest-core> │ {e3} │ {e1,e2} │ -1.383911 │ 0.982 │ -1 │ 2 │ arb retry │
37.84 s
gammaloop-nextest-core> │ {} │ {e1,e2,e3} │ -1.094213 │ 0.258 │ -1 │ 4 │ │
37.84 s
gammaloop-nextest-core> │ {e2,e0} │ {e3} │ -0.803348 │ 0.861 │ -1 │ 0 │ arb retry │
37.84 s
gammaloop-nextest-core> │ {e3,e0} │ {e2} │ -0.999257 │ 1.000 │ -1 │ 0 │ │
37.84 s
gammaloop-nextest-core> │ {e0} │ {e2,e3} │ -1.000893 │ 1.000 │ -1 │ 2 │ │
37.84 s
gammaloop-nextest-core> │ {e1,e0} │ {e3} │ -0.997860 │ 1.000 │ -1 │ 0 │ │
37.84 s
gammaloop-nextest-core> ╰─────────┴────────────┴───────────┴───────┴─────┴──────────┴───────────╯
37.84 s
gammaloop-nextest-core>
37.84 s
gammaloop-nextest-core> ╭───────┬─────────┬───────────┬───────┬─────┬──────────┬───────────╮
37.84 s
gammaloop-nextest-core> │ fixed │ → ∞ │ slope │ r2 │ DOD │ bare DOD │ inspect │
37.84 s
gammaloop-nextest-core> ├───────┼─────────┼───────────┼───────┼─────┼──────────┼───────────┤
37.84 s
gammaloop-nextest-core> │ {e1} │ {e2} │ -1.005039 │ 1.000 │ -1 │ 0 │ arb retry │
37.84 s
gammaloop-nextest-core> │ {e2} │ {e1} │ -1.001098 │ 1.000 │ -1 │ 0 │ arb retry │
37.84 s
gammaloop-nextest-core> │ {} │ {e1,e2} │ -1.011289 │ 1.000 │ -1 │ 2 │ │
37.84 s
gammaloop-nextest-core> │ {e0} │ {e2} │ -0.998140 │ 1.000 │ -1 │ 0 │ │
37.84 s
gammaloop-nextest-core> ╰───────┴─────────┴───────────┴───────┴─────┴──────────┴───────────╯
37.84 s
gammaloop-nextest-core>
37.84 s
gammaloop-nextest-core> ╭───────┬──────┬───────────┬───────┬─────┬──────────┬─────────╮
37.84 s
gammaloop-nextest-core> │ fixed │ → ∞ │ slope │ r2 │ DOD │ bare DOD │ inspect │
37.84 s
gammaloop-nextest-core> ├───────┼──────┼───────────┼───────┼─────┼──────────┼─────────┤
37.84 s
gammaloop-nextest-core> │ {} │ {e1} │ -0.989949 │ 1.000 │ -1 │ 0 │ │
37.84 s
gammaloop-nextest-core> ╰───────┴──────┴───────────┴───────┴─────┴──────────┴─────────╯
37.84 s
gammaloop-nextest-core> left: 1
37.84 s
gammaloop-nextest-core> right: 0
37.84 s
gammaloop-nextest-core> Location: crates/gammalooprs/src/uv/tests.rs:259
37.84 s
gammaloop-nextest-core>
37.84 s
gammaloop-nextest-core> ━━━━━━━━━━━━━━━━━━━━━━━━━━━━━━━━━━ BACKTRACE ━━━━━━━━━━━━━━━━━━━━━━━━━━━━━━━━━━━
37.84 s
gammaloop-nextest-core> 1: <color_eyre[51793ea62743adbd]::config::PanicHook>::panic_report<unknown>
37.84 s
gammaloop-nextest-core> at <unknown source file>:<unknown line>
37.84 s
gammaloop-nextest-core> 2: <color_eyre[51793ea62743adbd]::config::PanicHook>::into_panic_hook::{closure#0}<unknown>
37.84 s
gammaloop-nextest-core> at <unknown source file>:<unknown line>
37.84 s
gammaloop-nextest-core> 3: std[bcb96dfbba0ab899]::panicking::panic_with_hook<unknown>
37.84 s
gammaloop-nextest-core> at <unknown source file>:<unknown line>
37.84 s
gammaloop-nextest-core> 4: std[bcb96dfbba0ab899]::panicking::panic_handler::{closure#0}<unknown>
37.84 s
gammaloop-nextest-core> at <unknown source file>:<unknown line>
37.84 s
gammaloop-nextest-core> 5: std[bcb96dfbba0ab899]::sys::backtrace::__rust_end_short_backtrace::<std[bcb96dfbba0ab899]::panicking::panic_handler::{closure#0}, !><unknown>
37.84 s
gammaloop-nextest-core> at <unknown source file>:<unknown line>
37.84 s
gammaloop-nextest-core> 6: __rustc[6c289b9f9c454d21]::rust_begin_unwind<unknown>
37.84 s
gammaloop-nextest-core> at <unknown source file>:<unknown line>
37.84 s
gammaloop-nextest-core> 7: core[940e698046960fd5]::panicking::panic_fmt<unknown>
37.84 s
gammaloop-nextest-core> at <unknown source file>:<unknown line>
37.84 s
gammaloop-nextest-core> 8: core[940e698046960fd5]::panicking::assert_failed_inner<unknown>
37.84 s
gammaloop-nextest-core> at <unknown source file>:<unknown line>
37.84 s
gammaloop-nextest-core> 9: core[940e698046960fd5]::panicking::assert_failed::<usize, usize><unknown>
37.84 s
gammaloop-nextest-core> at <unknown source file>:<unknown line>
37.84 s
gammaloop-nextest-core> 10: gammalooprs[972dff90865981f6]::uv::tests::scalars_profile<unknown>
37.84 s
gammaloop-nextest-core> at <unknown source file>:<unknown line>
37.84 s
gammaloop-nextest-core> 11: <gammalooprs[972dff90865981f6]::uv::tests::scalars_profile::{closure#0} as core[940e698046960fd5]::ops::function::FnOnce<()>>::call_once<unknown>
37.84 s
gammaloop-nextest-core> at <unknown source file>:<unknown line>
37.84 s
gammaloop-nextest-core> 12: test[75d6903177b1d7e9]::__rust_begin_short_backtrace::<core[940e698046960fd5]::result::Result<(), alloc[2ea6bcb46fca0c42]::string::String>, fn() -> core[940e698046960fd5]::result::Result<(), alloc[2ea6bcb46fca0c42]::string::String>><unknown>
37.84 s
gammaloop-nextest-core> at <unknown source file>:<unknown line>
37.84 s
gammaloop-nextest-core> 13: test[75d6903177b1d7e9]::run_test::{closure#0}<unknown>
37.84 s
gammaloop-nextest-core> at <unknown source file>:<unknown line>
37.84 s
gammaloop-nextest-core> 14: std[bcb96dfbba0ab899]::sys::backtrace::__rust_begin_short_backtrace::<test[75d6903177b1d7e9]::run_test::{closure#1}, ()><unknown>
37.84 s
gammaloop-nextest-core> at <unknown source file>:<unknown line>
37.84 s
gammaloop-nextest-core> ... omitted 11 more lines; see full nextest output above
37.84 s
gammaloop-nextest-core> =========================================
37.85 s
gammaloop-nextest-core> Extracting 1 binary, 1 build script output directory, and 1 linked path to /build/nextest-archive-5ht6Sg
37.93 s
gammaloop-nextest-core> Extracted 7 files to /build/nextest-archive-5ht6Sg in 0.07s
37.93 s
gammaloop-nextest-core> ------------
37.93 s
gammaloop-nextest-core> Nextest run ID 149eb2b5-8c00-4cf9-80d5-707c96f72c12 with nextest profile: ci_gammaloop
37.93 s
gammaloop-nextest-core> Starting 54 tests across 1 binary
38.25 s
gammaloop-nextest-core> ------------
38.25 s
gammaloop-nextest-core> Summary [ 0.317s] 54 tests run: 54 passed , 0 skipped
38.29 s
gammaloop-nextest-core>
38.29 s
gammaloop-nextest-core> ========== nextest test summary ==========
38.29 s
gammaloop-nextest-core> report: target/nextest/ci_gammaloop/junit.xml
38.29 s
gammaloop-nextest-core> tests: 54, failures: 0, errors: 0
38.29 s
gammaloop-nextest-core> No failing testcases found.
38.29 s
gammaloop-nextest-core> =========================================
38.34 s
[0 built (1 failed ), 0.0 error: Cannot build '/nix/store/xmqryc6f4382yn38pvqdg8lk2i1rvwkl-gammaloop-nextest-core.drv '.
38.34 s
Reason: builder failed with exit code 100 .
38.34 s
Output paths:
38.34 s
/nix/store/qs56ygvnfbmkl3lbwy1lyz1bkaf3fqsx-gammaloop-nextest-core
38.34 s
Last 1576 log lines:
38.34 s
> Extracting 3 binaries (including 1 non-test binary), 1 build script output directory, and 2 linked paths to /build/nextest-archive-lJgXhe
38.34 s
> Extracted 18 files to /build/nextest-archive-lJgXhe in 0.74s
38.34 s
> ------------
38.34 s
> Nextest run ID 6a252a1e-04c0-4fda-9d62-02d2449c6dec with nextest profile: ci_gammaloop
38.34 s
> Starting 375 tests across 2 binaries
38.34 s
> ------------
38.34 s
> Summary [ 0.745s] 375 tests run: 375 passed , 0 skipped
38.34 s
>
38.34 s
> ========== nextest test summary ==========
38.34 s
> report: target/nextest/ci_gammaloop/junit.xml
38.34 s
> tests: 375, failures: 0, errors: 0
38.34 s
> No failing testcases found.
38.34 s
> =========================================
38.34 s
> Extracting 1 binary and 1 linked path to /build/nextest-archive-vkGtcM
38.34 s
> Extracted 7 files to /build/nextest-archive-vkGtcM in 0.10s
38.34 s
> ------------
38.34 s
> Nextest run ID 2698274b-d634-402c-9456-b9f0055796d3 with nextest profile: ci_gammaloop
38.34 s
> Starting 19 tests across 1 binary
38.34 s
> ------------
38.34 s
> Summary [ 0.014s] 19 tests run: 19 passed , 0 skipped
38.34 s
>
38.34 s
> ========== nextest test summary ==========
38.34 s
> report: target/nextest/ci_gammaloop/junit.xml
38.34 s
> tests: 19, failures: 0, errors: 0
38.34 s
> No failing testcases found.
38.34 s
> =========================================
38.34 s
> Extracting 1 binary to /build/nextest-archive-vyF8Dt
38.34 s
> Extracted 4 files to /build/nextest-archive-vyF8Dt in 0.05s
38.34 s
> ------------
38.34 s
> Nextest run ID fbcf81d7-936a-4643-abd7-41ab67ddcbab with nextest profile: ci_gammaloop
38.34 s
> Starting 0 tests across 1 binary
38.34 s
> ------------
38.34 s
> Summary [ 0.000s] 0 tests run: 0 passed , 0 skipped
38.34 s
>
38.34 s
> ========== nextest test summary ==========
38.34 s
> report: target/nextest/ci_gammaloop/junit.xml
38.34 s
> tests: 0, failures: 0, errors: 0
38.34 s
> No failing testcases found.
38.34 s
> =========================================
38.34 s
> Extracting 4 binaries, 1 build script output directory, and 2 linked paths to /build/nextest-archive-GLFB8I
38.34 s
> Extracted 18 files to /build/nextest-archive-GLFB8I in 0.78s
38.34 s
> ------------
38.34 s
> Nextest run ID 577b96a2-830a-4ee8-b49e-2e3c57a60f09 with nextest profile: ci_gammaloop
38.34 s
> Starting 561 tests across 4 binaries (59 tests skipped , including 58 tests via profile.ci_gammaloop.default-filter )
38.34 s
> FAIL [ 0.101s] ( 51/561) gammalooprs cff::tests :: stored_production_cff_uses_typed_energy_factor_ownership
38.34 s
> stdout ---
38.34 s
>
38.34 s
> running 1 test
38.34 s
> test cff::tests::stored_production_cff_uses_typed_energy_factor_ownership ... FAILED
38.34 s
>
38.34 s
> failures:
38.34 s
>
38.34 s
> failures:
38.34 s
> cff::tests::stored_production_cff_uses_typed_energy_factor_ownership
38.34 s
>
38.34 s
> test result: FAILED. 0 passed; 1 failed; 0 ignored; 0 measured; 611 filtered out; finished in 0.09s
38.34 s
>
38.34 s
> stderr ---
38.34 s
> The application panicked (crashed).
38.34 s
> Message: assertion `left == right` failed
38.34 s
> left: 1
38.34 s
> right: -1
38.34 s
> Location: crates/gammalooprs/src/cff/mod.rs :2721
38.34 s
>
38.34 s
> ━━━━━━━━━━━━━━━━━━━━━━━━━━━━━━━━━━ BACKTRACE ━━━━━━━━━━━━━━━━━━━━━━━━━━━━━━━━━━━
38.34 s
> 1: <color_eyre[51793ea62743adbd]::config::PanicHook>::panic_report <unknown>
38.34 s
> at <unknown source file> :<unknown line>
38.34 s
> 2: <color_eyre[51793ea62743adbd]::config::PanicHook>::into_panic_hook::{closure#0} <unknown>
38.34 s
> at <unknown source file> :<unknown line>
38.34 s
> 3: std[bcb96dfbba0ab899]::panicking::panic_with_hook <unknown>
38.34 s
> at <unknown source file> :<unknown line>
38.34 s
> 4: std[bcb96dfbba0ab899]::panicking::panic_handler::{closure#0} <unknown>
38.34 s
> at <unknown source file> :<unknown line>
38.34 s
> 5: std[bcb96dfbba0ab899]::sys::backtrace::__rust_end_short_backtrace::<std[bcb96dfbba0ab899]::panicking::panic_handler::{closure#0}, !> <unknown>
38.34 s
> at <unknown source file> :<unknown line>
38.34 s
> 6: __rustc[6c289b9f9c454d21]::rust_begin_unwind <unknown>
38.34 s
> at <unknown source file> :<unknown line>
38.34 s
> 7: core[940e698046960fd5]::panicking::panic_fmt <unknown>
38.34 s
> at <unknown source file> :<unknown line>
38.34 s
> 8: core[940e698046960fd5]::panicking::assert_failed_inner <unknown>
38.34 s
> at <unknown source file> :<unknown line>
38.34 s
> 9: core[940e698046960fd5]::panicking::assert_failed::<i64, i64> <unknown>
38.34 s
> at <unknown source file> :<unknown line>
38.34 s
> 10: gammalooprs[972dff90865981f6]::cff::tests::stored_production_cff_uses_typed_energy_factor_ownership <unknown>
38.34 s
> at <unknown source file> :<unknown line>
38.34 s
> 11: <gammalooprs[972dff90865981f6]::cff::tests::stored_production_cff_uses_typed_energy_factor_ownership::{closure#0} as core[940e698046960fd5]::ops::function::FnOnce<()>>::call_once <unknown>
38.34 s
> at <unknown source file> :<unknown line>
38.34 s
> 12: test[75d6903177b1d7e9]::__rust_begin_short_backtrace::<core[940e698046960fd5]::result::Result<(), alloc[2ea6bcb46fca0c42]::string::String>, fn() -> core[940e698046960fd5]::result::Result<(), alloc[2ea6bcb46fca0c42]::string::String>> <unknown>
38.34 s
> at <unknown source file> :<unknown line>
38.34 s
> 13: test[75d6903177b1d7e9]::run_test::{closure#0} <unknown>
38.34 s
> at <unknown source file> :<unknown line>
38.34 s
> 14: std[bcb96dfbba0ab899]::sys::backtrace::__rust_begin_short_backtrace::<test[75d6903177b1d7e9]::run_test::{closure#1}, ()> <unknown>
38.34 s
> at <unknown source file> :<unknown line>
38.34 s
> 15: <std[bcb96dfbba0ab899]::thread::lifecycle::spawn_unchecked<test[75d6903177b1d7e9]::run_test::{closure#1}, ()>::{closure#1} as core[940e698046960fd5]::ops::function::FnOnce<()>>::call_once::{shim:vtable#0} <unknown>
38.34 s
> at <unknown source file> :<unknown line>
38.34 s
> 16: <std[bcb96dfbba0ab899]::sys::thread::unix::Thread>::new::thread_start <unknown>
38.34 s
> at <unknown source file> :<unknown line>
38.34 s
> 17: start_thread <unknown>
38.34 s
> at <unknown source file> :<unknown line>
38.34 s
> 18: __clone3 <unknown>
38.34 s
> at <unknown source file> :<unknown line>
38.34 s
>
38.34 s
> Run with COLORBT_SHOW_HIDDEN=1 environment variable to disable frame filtering.
38.34 s
> Run with RUST_BACKTRACE=full to include source snippets.
38.34 s
>
38.34 s
> FAIL [ 0.115s] (486/561) gammalooprs uv::approx::local_3d::tests :: production_emr_map_cancels_one_powered_denominator
38.34 s
> stdout ---
38.34 s
>
38.34 s
> running 1 test
38.34 s
> test uv::approx::local_3d::tests::production_emr_map_cancels_one_powered_denominator ... FAILED
38.34 s
>
38.34 s
> failures:
38.34 s
>
38.34 s
> failures:
38.34 s
> uv::approx::local_3d::tests::production_emr_map_cancels_one_powered_denominator
38.34 s
>
38.34 s
> test result: FAILED. 0 passed; 1 failed; 0 ignored; 0 measured; 611 filtered out; finished in 0.10s
38.34 s
>
38.34 s
> stderr ---
38.34 s
> The application panicked (crashed).
38.34 s
> Message: summed exact-source powered and selected lower channels differ: powered=-1 𝑖 /8/𝜋^3, lower=1𝑖 /16/𝜋^3, difference=-3𝑖 /16/𝜋^3
38.34 s
> Location: crates/gammalooprs/src/uv/approx/local_3d.rs :2047
38.34 s
>
38.34 s
> ━━━━━━━━━━━━━━━━━━━━━━━━━━━━━━━━━━ BACKTRACE ━━━━━━━━━━━━━━━━━━━━━━━━━━━━━━━━━━━
38.34 s
> 1: <color_eyre[51793ea62743adbd]::config::PanicHook>::panic_report <unknown>
38.34 s
> at <unknown source file> :<unknown line>
38.34 s
> 2: <color_eyre[51793ea62743adbd]::config::PanicHook>::into_panic_hook::{closure#0} <unknown>
38.34 s
> at <unknown source file> :<unknown line>
38.34 s
> 3: std[bcb96dfbba0ab899]::panicking::panic_with_hook <unknown>
38.34 s
> at <unknown source file> :<unknown line>
38.34 s
> 4: std[bcb96dfbba0ab899]::panicking::panic_handler::{closure#0} <unknown>
38.34 s
> at <unknown source file> :<unknown line>
38.34 s
> 5: std[bcb96dfbba0ab899]::sys::backtrace::__rust_end_short_backtrace::<std[bcb96dfbba0ab899]::panicking::panic_handler::{closure#0}, !> <unknown>
38.34 s
> at <unknown source file> :<unknown line>
38.34 s
> 6: __rustc[6c289b9f9c454d21]::rust_begin_unwind <unknown>
38.34 s
> at <unknown source file> :<unknown line>
38.34 s
> 7: core[940e698046960fd5]::panicking::panic_fmt <unknown>
38.34 s
> at <unknown source file> :<unknown line>
38.34 s
> 8: gammalooprs[972dff90865981f6]::uv::approx::local_3d::tests::production_emr_map_cancels_one_powered_denominator <unknown>
38.34 s
> at <unknown source file> :<unknown line>
38.34 s
> 9: <gammalooprs[972dff90865981f6]::uv::approx::local_3d::tests::production_emr_map_cancels_one_powered_denominator::{closure#0} as core[940e698046960fd5]::ops::function::FnOnce<()>>::call_once <unknown>
38.34 s
> at <unknown source file> :<unknown line>
38.34 s
> 10: test[75d6903177b1d7e9]::__rust_begin_short_backtrace::<core[940e698046960fd5]::result::Result<(), alloc[2ea6bcb46fca0c42]::string::String>, fn() -> core[940e698046960fd5]::result::Result<(), alloc[2ea6bcb46fca0c42]::string::String>> <unknown>
38.34 s
> at <unknown source file> :<unknown line>
38.34 s
> 11: test[75d6903177b1d7e9]::run_test::{closure#0} <unknown>
38.34 s
> at <unknown source file> :<unknown line>
38.34 s
> 12: std[bcb96dfbba0ab899]::sys::backtrace::__rust_begin_short_backtrace::<test[75d6903177b1d7e9]::run_test::{closure#1}, ()> <unknown>
38.34 s
> at <unknown source file> :<unknown line>
38.34 s
> 13: <std[bcb96dfbba0ab899]::thread::lifecycle::spawn_unchecked<test[75d6903177b1d7e9]::run_test::{closure#1}, ()>::{closure#1} as core[940e698046960fd5]::ops::function::FnOnce<()>>::call_once::{shim:vtable#0} <unknown>
38.34 s
> at <unknown source file> :<unknown line>
38.34 s
> 14: <std[bcb96dfbba0ab899]::sys::thread::unix::Thread>::new::thread_start <unknown>
38.34 s
> at <unknown source file> :<unknown line>
38.34 s
> 15: start_thread <unknown>
38.34 s
> at <unknown source file> :<unknown line>
38.34 s
> 16: __clone3 <unknown>
38.34 s
> at <unknown source file> :<unknown line>
38.34 s
>
38.34 s
> Run with COLORBT_SHOW_HIDDEN=1 environment variable to disable frame filtering.
38.34 s
> Run with RUST_BACKTRACE=full to include source snippets.
38.34 s
>
38.34 s
> FAIL [ 0.224s] (525/561) gammalooprs uv::hedge_poset::tests :: spectacles_typed_4d_projects_after_local_construction
38.34 s
> stdout ---
38.34 s
>
38.34 s
> running 1 test
38.34 s
> digraph {
38.34 s
> node [shape=circle,height=0.1,label=""];
38.34 s
> overlap = "scale";
38.34 s
> layout = "neato";
38.34 s
> start=2;
38.34 s
> 4 [label="0"];
38.34 s
> 1 [label="zw"];
38.34 s
> 2 [label="F"];
38.34 s
> 0 [label="143"];
38.34 s
> 3 [label="10B"];
38.34 s
> 4:0:s -> 1:1:s [id=0 color="red:blue;0.5" label="zw"];
38.34 s
> 4:2:s -> 2:3:s [id=1 color="red:blue;0.5" label="F"];
38.34 s
> 3:5:s -> 0:4:s [id=2 color="red:blue;0.5" label="143"];
38.34 s
> 4:6:s -> 0:7:s [id=3 color="red:blue;0.5" label="143"];
38.34 s
> 1:8:s -> 3:9:s [id=4 color="red:blue;0.5" label="F"];
38.34 s
> 1:10:s -> 0:11:s [id=5 color="red:blue;0.5" label="143"];
38.34 s
> 2:12:s -> 3:13:s [id=6 color="red:blue;0.5" label="zw"];
38.34 s
> 2:14:s -> 0:15:s [id=7 color="red:blue;0.5" label="143"];
38.34 s
> }
38.34 s
>
38.34 s
> digraph {
38.34 s
> node [shape=circle,height=0.1,label=""];
38.34 s
> overlap = "scale";
38.34 s
> layout = "neato";
38.34 s
> start=2;
38.34 s
> 0 [label="∅"];
38.34 s
> 1 [label="{zw}: Approx(S_zw(0))"];
38.34 s
> 2 [label="{F}: Approx(S_F(1))"];
38.34 s
> 3 [label="{143}: Approx(S_143(3))"];
38.34 s
> 4 [label="{zw,F}: Approx(S_F(4))*Approx(S_zw(0))"];
38.34 s
> 5 [label="{zw} · {143}: Approx((-1*S_zw+S_143(5))*Approx(S_zw(0)))"];
38.34 s
> 6 [label="{F} · {143}: Approx((-1*S_F+S_143(7))*Approx(S_F(1)))"];
38.34 s
> 7 [label="{zw,F} · {143}: Approx((-1*S_10B+S_143(2))*Approx(S_F(4))*Approx(S_zw(0)))"];
38.34 s
> 0:0:s -> 1:1:s [id=0 color="red:blue;0.5"];
38.34 s
> 0:2:s -> 2:3:s [id=1 color="red:blue;0.5"];
38.34 s
> 0:4:s -> 3:5:s [id=2 color="red:blue;0.5"];
38.34 s
> 1:6:s -> 4:7:s [id=3 color="red:blue;0.5"];
38.34 s
> 1:8:s -> 5:9:s [id=4 color="red:blue;0.5"];
38.34 s
> 2:10:s -> 4:11:s [id=5 color="red:blue;0.5"];
38.34 s
> 2:12:s -> 6:13:s [id=6 color="red:blue;0.5"];
38.34 s
> 4:14:s -> 7:15:s [id=7 color="red:blue;0.5"];
38.34 s
> }
38.34 s
>
38.34 s
> test uv::hedge_poset::tests::spectacles_typed_4d_projects_after_local_construction ... FAILED
38.34 s
>
38.34 s
> failures:
38.34 s
>
38.34 s
> failures:
38.34 s
> uv::hedge_poset::tests::spectacles_typed_4d_projects_after_local_construction
38.34 s
>
38.34 s
> test result: FAILED. 0 passed; 1 failed; 0 ignored; 0 measured; 611 filtered out; finished in 0.20s
38.34 s
>
38.34 s
> stderr ---
38.34 s
> Error:
38.34 s
> 0: failed to extract three-dimensional representation graph input: source edge 1 has no unique routing for rewritten exact signature [-1, 0, 0] modulo the factorized opposite-domain loop span
38.34 s
>
38.34 s
> Location:
38.34 s
> crates/gammalooprs/src/uv/approx/local_3d.rs :845
38.34 s
>
38.34 s
> ━━━━━━━━━━━━━━━━━━━━━━━━━━━━━━━━━━ BACKTRACE ━━━━━━━━━━━━━━━━━━━━━━━━━━━━━━━━━━━
38.34 s
> 1: <color_eyre[51793ea62743adbd]::config::EyreHook>::into_eyre_hook::{closure#0} <unknown>
38.34 s
> at <unknown source file> :<unknown line>
38.34 s
> 2: eyre[cb2fd339c0c40fca]::capture_handler <unknown>
38.34 s
> at <unknown source file> :<unknown line>
38.34 s
> 3: <eyre[cb2fd339c0c40fca]::Report>::from_std::<three_dimensional_reps[3cb572ff22d197ac]::graph_io::GraphIoError> <unknown>
38.34 s
> at <unknown source file> :<unknown line>
38.34 s
> 4: <gammalooprs[972dff90865981f6]::uv::approx::local_3d::Localizer>::project_4d <unknown>
38.34 s
> at <unknown source file> :<unknown line>
38.34 s
> 5: gammalooprs[972dff90865981f6]::uv::hedge_poset::tests::spectacles_typed_4d_projects_after_local_construction <unknown>
38.34 s
> at <unknown source file> :<unknown line>
38.34 s
> 6: <gammalooprs[972dff90865981f6]::uv::hedge_poset::tests::spectacles_typed_4d_projects_after_local_construction::{closure#0} as core[940e698046960fd5]::ops::function::FnOnce<()>>::call_once <unknown>
38.34 s
> at <unknown source file> :<unknown line>
38.34 s
> 7: test[75d6903177b1d7e9]::__rust_begin_short_backtrace::<core[940e698046960fd5]::result::Result<(), alloc[2ea6bcb46fca0c42]::string::String>, fn() -> core[940e698046960fd5]::result::Result<(), alloc[2ea6bcb46fca0c42]::string::String>> <unknown>
38.34 s
> at <unknown source file> :<unknown line>
38.34 s
> 8: test[75d6903177b1d7e9]::run_test::{closure#0} <unknown>
38.34 s
> at <unknown source file> :<unknown line>
38.34 s
> 9: std[bcb96dfbba0ab899]::sys::backtrace::__rust_begin_short_backtrace::<test[75d6903177b1d7e9]::run_test::{closure#1}, ()> <unknown>
38.34 s
> at <unknown source file> :<unknown line>
38.34 s
> 10: <std[bcb96dfbba0ab899]::thread::lifecycle::spawn_unchecked<test[75d6903177b1d7e9]::run_test::{closure#1}, ()>::{closure#1} as core[940e698046960fd5]::ops::function::FnOnce<()>>::call_once::{shim:vtable#0} <unknown>
38.34 s
> at <unknown source file> :<unknown line>
38.34 s
> 11: <std[bcb96dfbba0ab899]::sys::thread::unix::Thread>::new::thread_start <unknown>
38.34 s
> at <unknown source file> :<unknown line>
38.34 s
> 12: start_thread <unknown>
38.34 s
> at <unknown source file> :<unknown line>
38.34 s
> 13: __clone3 <unknown>
38.34 s
> at <unknown source file> :<unknown line>
38.34 s
>
38.34 s
> Run with COLORBT_SHOW_HIDDEN=1 environment variable to disable frame filtering.
38.34 s
> Run with RUST_BACKTRACE=full to include source snippets.
38.34 s
>
38.34 s
> FAIL [ 10.328s] (559/561) gammalooprs uv::tests :: scalars_profile_new
38.34 s
> stdout ---
38.34 s
>
38.34 s
> running 1 test
38.34 s
> test uv::tests::scalars_profile_new ... FAILED
38.34 s
>
38.34 s
> failures:
38.34 s
>
38.34 s
> failures:
38.34 s
> uv::tests::scalars_profile_new
38.34 s
>
38.34 s
> test result: FAILED. 0 passed; 1 failed; 0 ignored; 0 measured; 611 filtered out; finished in 10.30s
38.34 s
>
38.34 s
> stderr ---
38.34 s
> [18:18:39.444] @gammalooprs::settings::runtime WARNING : No external kinematics were provided; using default-generated external momenta and helicities.
38.34 s
> field value
38.34 s
> span build_integrand{amplitude.name = bub}
38.34 s
> at crates/gammalooprs/src/settings/runtime.rs:131
38.34 s
> [18:18:39.445] @gammalooprs::integrands::process::amplitude INFO : Input is below threshold: 0 existing threshold E-surfaces across 0/3 graph groups
38.34 s
> field value
38.34 s
> existing_esurfaces 0
38.34 s
> group_count 3
38.34 s
> groups_above_threshold 0
38.34 s
> integrand bub
38.34 s
> span warm_up{integrand.name = bub}
38.34 s
> threshold_status below threshold
38.34 s
> at crates/gammalooprs/src/integrands/process/amplitude/mod.rs:1666
38.34 s
> [18:18:39.445] @gammalooprs::integrands::process::amplitude INFO : overlap structure of group 0: [0: []]
38.34 s
> field value
38.34 s
> span warm_up{integrand.name = bub}
38.34 s
> at crates/gammalooprs/src/integrands/process/amplitude/mod.rs:2015
38.34 s
> [18:18:39.445] @gammalooprs::integrands::process::amplitude INFO : overlap structure of group 1: [0: []]
38.34 s
> field value
38.34 s
> span warm_up{integrand.name = bub}
38.34 s
> at crates/gammalooprs/src/integrands/process/amplitude/mod.rs:2015
38.34 s
> [18:18:39.445] @gammalooprs::integrands::process::amplitude INFO : overlap structure of group 2: [0: []]
38.34 s
> field value
38.34 s
> span warm_up{integrand.name = bub}
38.34 s
> at crates/gammalooprs/src/integrands/process/amplitude/mod.rs:2015
38.34 s
> The application panicked (crashed).
38.34 s
> Message: assertion `left == right` failed: subtracted scalar UV profile failed:
38.34 s
> UVProfilePassFail {
38.34 s
> max_dod: -0.9,
38.34 s
> total: 16,
38.34 s
> failed: 1,
38.34 s
> failures: [
38.34 s
> UVProfileFailure {
38.34 s
> graph_index: 0,
38.34 s
> graph_name: "banana",
38.34 s
> cutkosky_cut: None,
38.34 s
> lmb_index: 1,
38.34 s
> fixed: [
38.34 s
> EdgeIndex(
38.34 s
> 2,
38.34 s
> ),
38.34 s
> EdgeIndex(
38.34 s
> 0,
38.34 s
> ),
38.34 s
> ],
38.34 s
> free: [
38.34 s
> EdgeIndex(
38.34 s
> 3,
38.34 s
> ),
38.34 s
> ],
38.34 s
> orientation_label: None,
38.34 s
> reason: "dod_exceeds_threshold",
38.34 s
> },
38.34 s
> ],
38.34 s
> }
38.34 s
>
38.34 s
> ╭─────────┬────────────┬───────────┬───────┬─────┬──────────┬───────────╮
38.34 s
> │ fixed │ → ∞ │ slope │ r2 │ DOD │ bare DOD │ inspect │
38.34 s
> ├─────────┼────────────┼───────────┼───────┼─────┼──────────┼───────────┤
38.34 s
> │ {e1,e2} │ {e3} │ -0.996752 │ 1.000 │ -1 │ 0 │ arb retry │
38.34 s
> │ {e1,e3} │ {e2} │ -1.065665 │ 0.997 │ -1 │ 0 │ arb retry │
38.34 s
> │ {e1} │ {e2,e3} │ -0.937151 │ 0.943 │ -1 │ 2 │ │
38.34 s
> │ {e2,e3} │ {e1} │ -1.001075 │ 1.000 │ -1 │ 0 │ arb retry │
38.34 s
> │ {e2} │ {e1,e3} │ -0.984146 │ 0.998 │ -1 │ 2 │ │
38.34 s
> │ {e3} │ {e1,e2} │ -1.383911 │ 0.982 │ -1 │ 2 │ arb retry │
38.34 s
> │ {} │ {e1,e2,e3} │ -1.094213 │ 0.258 │ -1 │ 4 │ │
38.34 s
> │ {e2,e0} │ {e3} │ -0.803348 │ 0.861 │ -1 │ 0 │ arb retry │
38.34 s
> │ {e3,e0} │ {e2} │ -0.999257 │ 1.000 │ -1 │ 0 │ │
38.34 s
> │ {e0} │ {e2,e3} │ -1.000893 │ 1.000 │ -1 │ 2 │ │
38.34 s
> │ {e1,e0} │ {e3} │ -0.997860 │ 1.000 │ -1 │ 0 │ │
38.34 s
> ╰─────────┴────────────┴───────────┴───────┴─────┴──────────┴───────────╯
38.34 s
>
38.34 s
> ╭───────┬─────────┬───────────┬───────┬─────┬──────────┬───────────╮
38.34 s
> │ fixed │ → ∞ │ slope │ r2 │ DOD │ bare DOD │ inspect │
38.34 s
> ├───────┼─────────┼───────────┼───────┼─────┼──────────┼───────────┤
38.34 s
> │ {e1} │ {e2} │ -1.005039 │ 1.000 │ -1 │ 0 │ arb retry │
38.34 s
> │ {e2} │ {e1} │ -1.001098 │ 1.000 │ -1 │ 0 │ arb retry │
38.34 s
> │ {} │ {e1,e2} │ -1.011289 │ 1.000 │ -1 │ 2 │ │
38.34 s
> │ {e0} │ {e2} │ -0.998140 │ 1.000 │ -1 │ 0 │ │
38.34 s
> ╰───────┴─────────┴───────────┴───────┴─────┴──────────┴───────────╯
38.34 s
>
38.34 s
> ╭───────┬──────┬───────────┬───────┬─────┬──────────┬─────────╮
38.34 s
> │ fixed │ → ∞ │ slope │ r2 │ DOD │ bare DOD │ inspect │
38.34 s
> ├───────┼──────┼───────────┼───────┼─────┼──────────┼─────────┤
38.34 s
> │ {} │ {e1} │ -0.989949 │ 1.000 │ -1 │ 0 │ │
38.34 s
> ╰───────┴──────┴───────────┴───────┴─────┴──────────┴─────────╯
38.34 s
> left: 1
38.34 s
> right: 0
38.34 s
> Location: crates/gammalooprs/src/uv/tests.rs :325
38.34 s
>
38.34 s
> ━━━━━━━━━━━━━━━━━━━━━━━━━━━━━━━━━━ BACKTRACE ━━━━━━━━━━━━━━━━━━━━━━━━━━━━━━━━━━━
38.34 s
> 1: <color_eyre[51793ea62743adbd]::config::PanicHook>::panic_report <unknown>
38.34 s
> at <unknown source file> :<unknown line>
38.34 s
> 2: <color_eyre[51793ea62743adbd]::config::PanicHook>::into_panic_hook::{closure#0} <unknown>
38.34 s
> at <unknown source file> :<unknown line>
38.34 s
> 3: std[bcb96dfbba0ab899]::panicking::panic_with_hook <unknown>
38.34 s
> at <unknown source file> :<unknown line>
38.34 s
> 4: std[bcb96dfbba0ab899]::panicking::panic_handler::{closure#0} <unknown>
38.34 s
> at <unknown source file> :<unknown line>
38.34 s
> 5: std[bcb96dfbba0ab899]::sys::backtrace::__rust_end_short_backtrace::<std[bcb96dfbba0ab899]::panicking::panic_handler::{closure#0}, !> <unknown>
38.34 s
> at <unknown source file> :<unknown line>
38.34 s
> 6: __rustc[6c289b9f9c454d21]::rust_begin_unwind <unknown>
38.34 s
> at <unknown source file> :<unknown line>
38.34 s
> 7: core[940e698046960fd5]::panicking::panic_fmt <unknown>
38.34 s
> at <unknown source file> :<unknown line>
38.34 s
> 8: core[940e698046960fd5]::panicking::assert_failed_inner <unknown>
38.34 s
> at <unknown source file> :<unknown line>
38.34 s
> 9: core[940e698046960fd5]::panicking::assert_failed::<usize, usize> <unknown>
38.34 s
> at <unknown source file> :<unknown line>
38.34 s
> 10: gammalooprs[972dff90865981f6]::uv::tests::scalars_profile_new <unknown>
38.34 s
> at <unknown source file> :<unknown line>
38.34 s
> 11: <gammalooprs[972dff90865981f6]::uv::tests::scalars_profile_new::{closure#0} as core[940e698046960fd5]::ops::function::FnOnce<()>>::call_once <unknown>
38.34 s
> at <unknown source file> :<unknown line>
38.34 s
> 12: test[75d6903177b1d7e9]::__rust_begin_short_backtrace::<core[940e698046960fd5]::result::Result<(), alloc[2ea6bcb46fca0c42]::string::String>, fn() -> core[940e698046960fd5]::result::Result<(), alloc[2ea6bcb46fca0c42]::string::String>> <unknown>
38.34 s
> at <unknown source file> :<unknown line>
38.34 s
> 13: test[75d6903177b1d7e9]::run_test::{closure#0} <unknown>
38.34 s
> at <unknown source file> :<unknown line>
38.34 s
> 14: std[bcb96dfbba0ab899]::sys::backtrace::__rust_begin_short_backtrace::<test[75d6903177b1d7e9]::run_test::{closure#1}, ()> <unknown>
38.34 s
> at <unknown source file> :<unknown line>
38.34 s
> 15: <std[bcb96dfbba0ab899]::thread::lifecycle::spawn_unchecked<test[75d6903177b1d7e9]::run_test::{closure#1}, ()>::{closure#1} as core[940e698046960fd5]::ops::function::FnOnce<()>>::call_once::{shim:vtable#0} <unknown>
38.34 s
> at <unknown source file> :<unknown line>
38.34 s
> 16: <std[bcb96dfbba0ab899]::sys::thread::unix::Thread>::new::thread_start <unknown>
38.34 s
> at <unknown source file> :<unknown line>
38.34 s
> 17: start_thread <unknown>
38.34 s
> at <unknown source file> :<unknown line>
38.34 s
> 18: __clone3 <unknown>
38.34 s
> at <unknown source file> :<unknown line>
38.34 s
>
38.34 s
> Run with COLORBT_SHOW_HIDDEN=1 environment variable to disable frame filtering.
38.34 s
> Run with RUST_BACKTRACE=full to include source snippets.
38.34 s
>
38.34 s
> FAIL [ 10.344s] (560/561) gammalooprs uv::tests :: scalars_profile
38.34 s
> stdout ---
38.34 s
>
38.34 s
> running 1 test
38.34 s
> test uv::tests::scalars_profile ... FAILED
38.34 s
>
38.34 s
> failures:
38.34 s
>
38.34 s
> failures:
38.34 s
> uv::tests::scalars_profile
38.34 s
>
38.34 s
> test result: FAILED. 0 passed; 1 failed; 0 ignored; 0 measured; 611 filtered out; finished in 10.32s
38.34 s
>
38.34 s
> stderr ---
38.34 s
> [18:18:39.434] @gammalooprs::settings::runtime WARNING : No external kinematics were provided; using default-generated external momenta and helicities.
38.34 s
> field value
38.34 s
> span build_integrand{amplitude.name = bub}
38.34 s
> at crates/gammalooprs/src/settings/runtime.rs:131
38.34 s
> [18:18:39.435] @gammalooprs::integrands::process::amplitude INFO : Input is below threshold: 0 existing threshold E-surfaces across 0/3 graph groups
38.34 s
> field value
38.34 s
> existing_esurfaces 0
38.34 s
> group_count 3
38.34 s
> groups_above_threshold 0
38.34 s
> integrand bub
38.34 s
> span warm_up{integrand.name = bub}
38.34 s
> threshold_status below threshold
38.34 s
> at crates/gammalooprs/src/integrands/process/amplitude/mod.rs:1666
38.34 s
> [18:18:39.435] @gammalooprs::integrands::process::amplitude INFO : overlap structure of group 0: [0: []]
38.34 s
> field value
38.34 s
> span warm_up{integrand.name = bub}
38.34 s
> at crates/gammalooprs/src/integrands/process/amplitude/mod.rs:2015
38.34 s
> [18:18:39.435] @gammalooprs::integrands::process::amplitude INFO : overlap structure of group 1: [0: []]
38.34 s
> field value
38.34 s
> span warm_up{integrand.name = bub}
38.34 s
> at crates/gammalooprs/src/integrands/process/amplitude/mod.rs:2015
38.34 s
> [18:18:39.435] @gammalooprs::integrands::process::amplitude INFO : overlap structure of group 2: [0: []]
38.34 s
> field value
38.34 s
> span warm_up{integrand.name = bub}
38.34 s
> at crates/gammalooprs/src/integrands/process/amplitude/mod.rs:2015
38.34 s
> The application panicked (crashed).
38.34 s
> Message: assertion `left == right` failed: subtracted scalar UV profile failed:
38.34 s
> UVProfilePassFail {
38.34 s
> max_dod: -0.9,
38.34 s
> total: 16,
38.34 s
> failed: 1,
38.34 s
> failures: [
38.34 s
> UVProfileFailure {
38.34 s
> graph_index: 0,
38.34 s
> graph_name: "banana",
38.34 s
> cutkosky_cut: None,
38.34 s
> lmb_index: 1,
38.34 s
> fixed: [
38.34 s
> EdgeIndex(
38.34 s
> 2,
38.34 s
> ),
38.34 s
> EdgeIndex(
38.34 s
> 0,
38.34 s
> ),
38.34 s
> ],
38.34 s
> free: [
38.34 s
> EdgeIndex(
38.34 s
> 3,
38.34 s
> ),
38.34 s
> ],
38.34 s
> orientation_label: None,
38.34 s
> reason: "dod_exceeds_threshold",
38.34 s
> },
38.34 s
> ],
38.34 s
> }
38.34 s
>
38.34 s
> ╭─────────┬────────────┬───────────┬───────┬─────┬──────────┬───────────╮
38.34 s
> │ fixed │ → ∞ │ slope │ r2 │ DOD │ bare DOD │ inspect │
38.34 s
> ├─────────┼────────────┼───────────┼───────┼─────┼──────────┼───────────┤
38.34 s
> │ {e1,e2} │ {e3} │ -0.996752 │ 1.000 │ -1 │ 0 │ arb retry │
38.34 s
> │ {e1,e3} │ {e2} │ -1.065665 │ 0.997 │ -1 │ 0 │ arb retry │
38.34 s
> │ {e1} │ {e2,e3} │ -0.937151 │ 0.943 │ -1 │ 2 │ │
38.34 s
> │ {e2,e3} │ {e1} │ -1.001075 │ 1.000 │ -1 │ 0 │ arb retry │
38.34 s
> │ {e2} │ {e1,e3} │ -0.984146 │ 0.998 │ -1 │ 2 │ │
38.34 s
> │ {e3} │ {e1,e2} │ -1.383911 │ 0.982 │ -1 │ 2 │ arb retry │
38.34 s
> │ {} │ {e1,e2,e3} │ -1.094213 │ 0.258 │ -1 │ 4 │ │
38.34 s
> │ {e2,e0} │ {e3} │ -0.803348 │ 0.861 │ -1 │ 0 │ arb retry │
38.34 s
> │ {e3,e0} │ {e2} │ -0.999257 │ 1.000 │ -1 │ 0 │ │
38.34 s
> │ {e0} │ {e2,e3} │ -1.000893 │ 1.000 │ -1 │ 2 │ │
38.34 s
> │ {e1,e0} │ {e3} │ -0.997860 │ 1.000 │ -1 │ 0 │ │
38.34 s
> ╰─────────┴────────────┴───────────┴───────┴─────┴──────────┴───────────╯
38.34 s
>
38.34 s
> ╭───────┬─────────┬───────────┬───────┬─────┬──────────┬───────────╮
38.34 s
> │ fixed │ → ∞ │ slope │ r2 │ DOD │ bare DOD │ inspect │
38.34 s
> ├───────┼─────────┼───────────┼───────┼─────┼──────────┼───────────┤
38.34 s
> │ {e1} │ {e2} │ -1.005039 │ 1.000 │ -1 │ 0 │ arb retry │
38.34 s
> │ {e2} │ {e1} │ -1.001098 │ 1.000 │ -1 │ 0 │ arb retry │
38.34 s
> │ {} │ {e1,e2} │ -1.011289 │ 1.000 │ -1 │ 2 │ │
38.34 s
> │ {e0} │ {e2} │ -0.998140 │ 1.000 │ -1 │ 0 │ │
38.34 s
> ╰───────┴─────────┴───────────┴───────┴─────┴──────────┴───────────╯
38.34 s
>
38.34 s
> ╭───────┬──────┬───────────┬───────┬─────┬──────────┬─────────╮
38.34 s
> │ fixed │ → ∞ │ slope │ r2 │ DOD │ bare DOD │ inspect │
38.34 s
> ├───────┼──────┼───────────┼───────┼─────┼──────────┼─────────┤
38.34 s
> │ {} │ {e1} │ -0.989949 │ 1.000 │ -1 │ 0 │ │
38.34 s
> ╰───────┴──────┴───────────┴───────┴─────┴──────────┴─────────╯
38.34 s
> left: 1
38.34 s
> right: 0
38.34 s
> Location: crates/gammalooprs/src/uv/tests.rs :259
38.34 s
>
38.34 s
> ━━━━━━━━━━━━━━━━━━━━━━━━━━━━━━━━━━ BACKTRACE ━━━━━━━━━━━━━━━━━━━━━━━━━━━━━━━━━━━
38.34 s
> 1: <color_eyre[51793ea62743adbd]::config::PanicHook>::panic_report <unknown>
38.34 s
> at <unknown source file> :<unknown line>
38.34 s
> 2: <color_eyre[51793ea62743adbd]::config::PanicHook>::into_panic_hook::{closure#0} <unknown>
38.34 s
> at <unknown source file> :<unknown line>
38.34 s
> 3: std[bcb96dfbba0ab899]::panicking::panic_with_hook <unknown>
38.34 s
> at <unknown source file> :<unknown line>
38.34 s
> 4: std[bcb96dfbba0ab899]::panicking::panic_handler::{closure#0} <unknown>
38.34 s
> at <unknown source file> :<unknown line>
38.34 s
> 5: std[bcb96dfbba0ab899]::sys::backtrace::__rust_end_short_backtrace::<std[bcb96dfbba0ab899]::panicking::panic_handler::{closure#0}, !> <unknown>
38.34 s
> at <unknown source file> :<unknown line>
38.34 s
> 6: __rustc[6c289b9f9c454d21]::rust_begin_unwind <unknown>
38.34 s
> at <unknown source file> :<unknown line>
38.34 s
> 7: core[940e698046960fd5]::panicking::panic_fmt <unknown>
38.34 s
> at <unknown source file> :<unknown line>
38.34 s
> 8: core[940e698046960fd5]::panicking::assert_failed_inner <unknown>
38.34 s
> at <unknown source file> :<unknown line>
38.34 s
> 9: core[940e698046960fd5]::panicking::assert_failed::<usize, usize> <unknown>
38.34 s
> at <unknown source file> :<unknown line>
38.34 s
> 10: gammalooprs[972dff90865981f6]::uv::tests::scalars_profile <unknown>
38.34 s
> at <unknown source file> :<unknown line>
38.34 s
> 11: <gammalooprs[972dff90865981f6]::uv::tests::scalars_profile::{closure#0} as core[940e698046960fd5]::ops::function::FnOnce<()>>::call_once <unknown>
38.34 s
> at <unknown source file> :<unknown line>
38.34 s
> 12: test[75d6903177b1d7e9]::__rust_begin_short_backtrace::<core[940e698046960fd5]::result::Result<(), alloc[2ea6bcb46fca0c42]::string::String>, fn() -> core[940e698046960fd5]::result::Result<(), alloc[2ea6bcb46fca0c42]::string::String>> <unknown>
38.34 s
> at <unknown source file> :<unknown line>
38.34 s
> 13: test[75d6903177b1d7e9]::run_test::{closure#0} <unknown>
38.34 s
> at <unknown source file> :<unknown line>
38.34 s
> 14: std[bcb96dfbba0ab899]::sys::backtrace::__rust_begin_short_backtrace::<test[75d6903177b1d7e9]::run_test::{closure#1}, ()> <unknown>
38.34 s
> at <unknown source file> :<unknown line>
38.34 s
> 15: <std[bcb96dfbba0ab899]::thread::lifecycle::spawn_unchecked<test[75d6903177b1d7e9]::run_test::{closure#1}, ()>::{closure#1} as core[940e698046960fd5]::ops::function::FnOnce<()>>::call_once::{shim:vtable#0} <unknown>
38.34 s
> at <unknown source file> :<unknown line>
38.34 s
> 16: <std[bcb96dfbba0ab899]::sys::thread::unix::Thread>::new::thread_start <unknown>
38.34 s
> at <unknown source file> :<unknown line>
38.34 s
> 17: start_thread <unknown>
38.34 s
> at <unknown source file> :<unknown line>
38.34 s
> 18: __clone3 <unknown>
38.34 s
> at <unknown source file> :<unknown line>
38.34 s
>
38.34 s
> Run with COLORBT_SHOW_HIDDEN=1 environment variable to disable frame filtering.
38.34 s
> Run with RUST_BACKTRACE=full to include source snippets.
38.34 s
>
38.34 s
> ------------
38.34 s
> Summary [ 12.921s] 561 tests run: 556 passed , 5 failed , 59 skipped
38.34 s
> FAIL [ 0.101s] ( 51/561) gammalooprs cff::tests :: stored_production_cff_uses_typed_energy_factor_ownership
38.34 s
> stdout ---
38.34 s
>
38.34 s
> running 1 test
38.34 s
> test cff::tests::stored_production_cff_uses_typed_energy_factor_ownership ... FAILED
38.34 s
>
38.34 s
> failures:
38.34 s
>
38.34 s
> failures:
38.34 s
> cff::tests::stored_production_cff_uses_typed_energy_factor_ownership
38.34 s
>
38.34 s
> test result: FAILED. 0 passed; 1 failed; 0 ignored; 0 measured; 611 filtered out; finished in 0.09s
38.34 s
>
38.34 s
> stderr ---
38.34 s
> The application panicked (crashed).
38.34 s
> Message: assertion `left == right` failed
38.34 s
> left: 1
38.34 s
> right: -1
38.34 s
> Location: crates/gammalooprs/src/cff/mod.rs :2721
38.34 s
>
38.34 s
> ━━━━━━━━━━━━━━━━━━━━━━━━━━━━━━━━━━ BACKTRACE ━━━━━━━━━━━━━━━━━━━━━━━━━━━━━━━━━━━
38.34 s
> 1: <color_eyre[51793ea62743adbd]::config::PanicHook>::panic_report <unknown>
38.34 s
> at <unknown source file> :<unknown line>
38.34 s
> 2: <color_eyre[51793ea62743adbd]::config::PanicHook>::into_panic_hook::{closure#0} <unknown>
38.34 s
> at <unknown source file> :<unknown line>
38.34 s
> 3: std[bcb96dfbba0ab899]::panicking::panic_with_hook <unknown>
38.34 s
> at <unknown source file> :<unknown line>
38.34 s
> 4: std[bcb96dfbba0ab899]::panicking::panic_handler::{closure#0} <unknown>
38.34 s
> at <unknown source file> :<unknown line>
38.34 s
> 5: std[bcb96dfbba0ab899]::sys::backtrace::__rust_end_short_backtrace::<std[bcb96dfbba0ab899]::panicking::panic_handler::{closure#0}, !> <unknown>
38.34 s
> at <unknown source file> :<unknown line>
38.34 s
> 6: __rustc[6c289b9f9c454d21]::rust_begin_unwind <unknown>
38.34 s
> at <unknown source file> :<unknown line>
38.34 s
> 7: core[940e698046960fd5]::panicking::panic_fmt <unknown>
38.34 s
> at <unknown source file> :<unknown line>
38.34 s
> 8: core[940e698046960fd5]::panicking::assert_failed_inner <unknown>
38.34 s
> at <unknown source file> :<unknown line>
38.34 s
> 9: core[940e698046960fd5]::panicking::assert_failed::<i64, i64> <unknown>
38.34 s
> at <unknown source file> :<unknown line>
38.34 s
> 10: gammalooprs[972dff90865981f6]::cff::tests::stored_production_cff_uses_typed_energy_factor_ownership <unknown>
38.34 s
> at <unknown source file> :<unknown line>
38.34 s
> 11: <gammalooprs[972dff90865981f6]::cff::tests::stored_production_cff_uses_typed_energy_factor_ownership::{closure#0} as core[940e698046960fd5]::ops::function::FnOnce<()>>::call_once <unknown>
38.34 s
> at <unknown source file> :<unknown line>
38.34 s
> 12: test[75d6903177b1d7e9]::__rust_begin_short_backtrace::<core[940e698046960fd5]::result::Result<(), alloc[2ea6bcb46fca0c42]::string::String>, fn() -> core[940e698046960fd5]::result::Result<(), alloc[2ea6bcb46fca0c42]::string::String>> <unknown>
38.34 s
> at <unknown source file> :<unknown line>
38.34 s
> 13: test[75d6903177b1d7e9]::run_test::{closure#0} <unknown>
38.34 s
> at <unknown source file> :<unknown line>
38.34 s
> 14: std[bcb96dfbba0ab899]::sys::backtrace::__rust_begin_short_backtrace::<test[75d6903177b1d7e9]::run_test::{closure#1}, ()> <unknown>
38.34 s
> at <unknown source file> :<unknown line>
38.34 s
> 15: <std[bcb96dfbba0ab899]::thread::lifecycle::spawn_unchecked<test[75d6903177b1d7e9]::run_test::{closure#1}, ()>::{closure#1} as core[940e698046960fd5]::ops::function::FnOnce<()>>::call_once::{shim:vtable#0} <unknown>
38.34 s
> at <unknown source file> :<unknown line>
38.34 s
> 16: <std[bcb96dfbba0ab899]::sys::thread::unix::Thread>::new::thread_start <unknown>
38.34 s
> at <unknown source file> :<unknown line>
38.34 s
> 17: start_thread <unknown>
38.34 s
> at <unknown source file> :<unknown line>
38.34 s
> 18: __clone3 <unknown>
38.34 s
> at <unknown source file> :<unknown line>
38.34 s
>
38.34 s
> Run with COLORBT_SHOW_HIDDEN=1 environment variable to disable frame filtering.
38.34 s
> Run with RUST_BACKTRACE=full to include source snippets.
38.34 s
>
38.34 s
> FAIL [ 0.115s] (486/561) gammalooprs uv::approx::local_3d::tests :: production_emr_map_cancels_one_powered_denominator
38.34 s
> stdout ---
38.34 s
>
38.34 s
> running 1 test
38.34 s
> test uv::approx::local_3d::tests::production_emr_map_cancels_one_powered_denominator ... FAILED
38.34 s
>
38.34 s
> failures:
38.34 s
>
38.34 s
> failures:
38.34 s
> uv::approx::local_3d::tests::production_emr_map_cancels_one_powered_denominator
38.34 s
>
38.34 s
> test result: FAILED. 0 passed; 1 failed; 0 ignored; 0 measured; 611 filtered out; finished in 0.10s
38.34 s
>
38.34 s
> stderr ---
38.34 s
> The application panicked (crashed).
38.34 s
> Message: summed exact-source powered and selected lower channels differ: powered=-1 𝑖 /8/𝜋^3, lower=1𝑖 /16/𝜋^3, difference=-3𝑖 /16/𝜋^3
38.34 s
> Location: crates/gammalooprs/src/uv/approx/local_3d.rs :2047
38.34 s
>
38.34 s
> ━━━━━━━━━━━━━━━━━━━━━━━━━━━━━━━━━━ BACKTRACE ━━━━━━━━━━━━━━━━━━━━━━━━━━━━━━━━━━━
38.34 s
> 1: <color_eyre[51793ea62743adbd]::config::PanicHook>::panic_report <unknown>
38.34 s
> at <unknown source file> :<unknown line>
38.34 s
> 2: <color_eyre[51793ea62743adbd]::config::PanicHook>::into_panic_hook::{closure#0} <unknown>
38.34 s
> at <unknown source file> :<unknown line>
38.34 s
> 3: std[bcb96dfbba0ab899]::panicking::panic_with_hook <unknown>
38.34 s
> at <unknown source file> :<unknown line>
38.34 s
> 4: std[bcb96dfbba0ab899]::panicking::panic_handler::{closure#0} <unknown>
38.34 s
> at <unknown source file> :<unknown line>
38.34 s
> 5: std[bcb96dfbba0ab899]::sys::backtrace::__rust_end_short_backtrace::<std[bcb96dfbba0ab899]::panicking::panic_handler::{closure#0}, !> <unknown>
38.34 s
> at <unknown source file> :<unknown line>
38.34 s
> 6: __rustc[6c289b9f9c454d21]::rust_begin_unwind <unknown>
38.34 s
> at <unknown source file> :<unknown line>
38.34 s
> 7: core[940e698046960fd5]::panicking::panic_fmt <unknown>
38.34 s
> at <unknown source file> :<unknown line>
38.34 s
> 8: gammalooprs[972dff90865981f6]::uv::approx::local_3d::tests::production_emr_map_cancels_one_powered_denominator <unknown>
38.34 s
> at <unknown source file> :<unknown line>
38.34 s
> 9: <gammalooprs[972dff90865981f6]::uv::approx::local_3d::tests::production_emr_map_cancels_one_powered_denominator::{closure#0} as core[940e698046960fd5]::ops::function::FnOnce<()>>::call_once <unknown>
38.34 s
> at <unknown source file> :<unknown line>
38.34 s
> 10: test[75d6903177b1d7e9]::__rust_begin_short_backtrace::<core[940e698046960fd5]::result::Result<(), alloc[2ea6bcb46fca0c42]::string::String>, fn() -> core[940e698046960fd5]::result::Result<(), alloc[2ea6bcb46fca0c42]::string::String>> <unknown>
38.34 s
> at <unknown source file> :<unknown line>
38.34 s
> 11: test[75d6903177b1d7e9]::run_test::{closure#0} <unknown>
38.34 s
> at <unknown source file> :<unknown line>
38.34 s
> 12: std[bcb96dfbba0ab899]::sys::backtrace::__rust_begin_short_backtrace::<test[75d6903177b1d7e9]::run_test::{closure#1}, ()> <unknown>
38.34 s
> at <unknown source file> :<unknown line>
38.34 s
> 13: <std[bcb96dfbba0ab899]::thread::lifecycle::spawn_unchecked<test[75d6903177b1d7e9]::run_test::{closure#1}, ()>::{closure#1} as core[940e698046960fd5]::ops::function::FnOnce<()>>::call_once::{shim:vtable#0} <unknown>
38.34 s
> at <unknown source file> :<unknown line>
38.34 s
> 14: <std[bcb96dfbba0ab899]::sys::thread::unix::Thread>::new::thread_start <unknown>
38.34 s
> at <unknown source file> :<unknown line>
38.34 s
> 15: start_thread <unknown>
38.34 s
> at <unknown source file> :<unknown line>
38.34 s
> 16: __clone3 <unknown>
38.34 s
> at <unknown source file> :<unknown line>
38.34 s
>
38.34 s
> Run with COLORBT_SHOW_HIDDEN=1 environment variable to disable frame filtering.
38.34 s
> Run with RUST_BACKTRACE=full to include source snippets.
38.34 s
>
38.34 s
> FAIL [ 0.224s] (525/561) gammalooprs uv::hedge_poset::tests :: spectacles_typed_4d_projects_after_local_construction
38.34 s
> stdout ---
38.34 s
>
38.34 s
> running 1 test
38.34 s
> digraph {
38.34 s
> node [shape=circle,height=0.1,label=""];
38.34 s
> overlap = "scale";
38.34 s
> layout = "neato";
38.34 s
> start=2;
38.34 s
> 4 [label="0"];
38.34 s
> 1 [label="zw"];
38.34 s
> 2 [label="F"];
38.34 s
> 0 [label="143"];
38.34 s
> 3 [label="10B"];
38.34 s
> 4:0:s -> 1:1:s [id=0 color="red:blue;0.5" label="zw"];
38.34 s
> 4:2:s -> 2:3:s [id=1 color="red:blue;0.5" label="F"];
38.34 s
> 3:5:s -> 0:4:s [id=2 color="red:blue;0.5" label="143"];
38.34 s
> 4:6:s -> 0:7:s [id=3 color="red:blue;0.5" label="143"];
38.34 s
> 1:8:s -> 3:9:s [id=4 color="red:blue;0.5" label="F"];
38.34 s
> 1:10:s -> 0:11:s [id=5 color="red:blue;0.5" label="143"];
38.34 s
> 2:12:s -> 3:13:s [id=6 color="red:blue;0.5" label="zw"];
38.34 s
> 2:14:s -> 0:15:s [id=7 color="red:blue;0.5" label="143"];
38.34 s
> }
38.34 s
>
38.34 s
> digraph {
38.34 s
> node [shape=circle,height=0.1,label=""];
38.34 s
> overlap = "scale";
38.34 s
> layout = "neato";
38.34 s
> start=2;
38.34 s
> 0 [label="∅"];
38.34 s
> 1 [label="{zw}: Approx(S_zw(0))"];
38.34 s
> 2 [label="{F}: Approx(S_F(1))"];
38.34 s
> 3 [label="{143}: Approx(S_143(3))"];
38.34 s
> 4 [label="{zw,F}: Approx(S_F(4))*Approx(S_zw(0))"];
38.34 s
> 5 [label="{zw} · {143}: Approx((-1*S_zw+S_143(5))*Approx(S_zw(0)))"];
38.34 s
> 6 [label="{F} · {143}: Approx((-1*S_F+S_143(7))*Approx(S_F(1)))"];
38.34 s
> 7 [label="{zw,F} · {143}: Approx((-1*S_10B+S_143(2))*Approx(S_F(4))*Approx(S_zw(0)))"];
38.34 s
> 0:0:s -> 1:1:s [id=0 color="red:blue;0.5"];
38.34 s
> 0:2:s -> 2:3:s [id=1 color="red:blue;0.5"];
38.34 s
> 0:4:s -> 3:5:s [id=2 color="red:blue;0.5"];
38.34 s
> 1:6:s -> 4:7:s [id=3 color="red:blue;0.5"];
38.34 s
> 1:8:s -> 5:9:s [id=4 color="red:blue;0.5"];
38.34 s
> 2:10:s -> 4:11:s [id=5 color="red:blue;0.5"];
38.34 s
> 2:12:s -> 6:13:s [id=6 color="red:blue;0.5"];
38.34 s
> 4:14:s -> 7:15:s [id=7 color="red:blue;0.5"];
38.34 s
> }
38.34 s
>
38.34 s
> test uv::hedge_poset::tests::spectacles_typed_4d_projects_after_local_construction ... FAILED
38.34 s
>
38.34 s
> failures:
38.34 s
>
38.34 s
> failures:
38.34 s
> uv::hedge_poset::tests::spectacles_typed_4d_projects_after_local_construction
38.34 s
>
38.34 s
> test result: FAILED. 0 passed; 1 failed; 0 ignored; 0 measured; 611 filtered out; finished in 0.20s
38.34 s
>
38.34 s
> stderr ---
38.34 s
> Error:
38.34 s
> 0: failed to extract three-dimensional representation graph input: source edge 1 has no unique routing for rewritten exact signature [-1, 0, 0] modulo the factorized opposite-domain loop span
38.34 s
>
38.34 s
> Location:
38.34 s
> crates/gammalooprs/src/uv/approx/local_3d.rs :845
38.34 s
>
38.34 s
> ━━━━━━━━━━━━━━━━━━━━━━━━━━━━━━━━━━ BACKTRACE ━━━━━━━━━━━━━━━━━━━━━━━━━━━━━━━━━━━
38.34 s
> 1: <color_eyre[51793ea62743adbd]::config::EyreHook>::into_eyre_hook::{closure#0} <unknown>
38.34 s
> at <unknown source file> :<unknown line>
38.34 s
> 2: eyre[cb2fd339c0c40fca]::capture_handler <unknown>
38.34 s
> at <unknown source file> :<unknown line>
38.34 s
> 3: <eyre[cb2fd339c0c40fca]::Report>::from_std::<three_dimensional_reps[3cb572ff22d197ac]::graph_io::GraphIoError> <unknown>
38.34 s
> at <unknown source file> :<unknown line>
38.34 s
> 4: <gammalooprs[972dff90865981f6]::uv::approx::local_3d::Localizer>::project_4d <unknown>
38.34 s
> at <unknown source file> :<unknown line>
38.34 s
> 5: gammalooprs[972dff90865981f6]::uv::hedge_poset::tests::spectacles_typed_4d_projects_after_local_construction <unknown>
38.34 s
> at <unknown source file> :<unknown line>
38.34 s
> 6: <gammalooprs[972dff90865981f6]::uv::hedge_poset::tests::spectacles_typed_4d_projects_after_local_construction::{closure#0} as core[940e698046960fd5]::ops::function::FnOnce<()>>::call_once <unknown>
38.34 s
> at <unknown source file> :<unknown line>
38.34 s
> 7: test[75d6903177b1d7e9]::__rust_begin_short_backtrace::<core[940e698046960fd5]::result::Result<(), alloc[2ea6bcb46fca0c42]::string::String>, fn() -> core[940e698046960fd5]::result::Result<(), alloc[2ea6bcb46fca0c42]::string::String>> <unknown>
38.34 s
> at <unknown source file> :<unknown line>
38.34 s
> 8: test[75d6903177b1d7e9]::run_test::{closure#0} <unknown>
38.34 s
> at <unknown source file> :<unknown line>
38.34 s
> 9: std[bcb96dfbba0ab899]::sys::backtrace::__rust_begin_short_backtrace::<test[75d6903177b1d7e9]::run_test::{closure#1}, ()> <unknown>
38.34 s
> at <unknown source file> :<unknown line>
38.34 s
> 10: <std[bcb96dfbba0ab899]::thread::lifecycle::spawn_unchecked<test[75d6903177b1d7e9]::run_test::{closure#1}, ()>::{closure#1} as core[940e698046960fd5]::ops::function::FnOnce<()>>::call_once::{shim:vtable#0} <unknown>
38.34 s
> at <unknown source file> :<unknown line>
38.34 s
> 11: <std[bcb96dfbba0ab899]::sys::thread::unix::Thread>::new::thread_start <unknown>
38.34 s
> at <unknown source file> :<unknown line>
38.34 s
> 12: start_thread <unknown>
38.34 s
> at <unknown source file> :<unknown line>
38.34 s
> 13: __clone3 <unknown>
38.34 s
> at <unknown source file> :<unknown line>
38.34 s
>
38.34 s
> Run with COLORBT_SHOW_HIDDEN=1 environment variable to disable frame filtering.
38.34 s
> Run with RUST_BACKTRACE=full to include source snippets.
38.34 s
>
38.34 s
> FAIL [ 10.328s] (559/561) gammalooprs uv::tests :: scalars_profile_new
38.34 s
> stdout ---
38.34 s
>
38.34 s
> running 1 test
38.34 s
> test uv::tests::scalars_profile_new ... FAILED
38.34 s
>
38.34 s
> failures:
38.34 s
>
38.34 s
> failures:
38.34 s
> uv::tests::scalars_profile_new
38.34 s
>
38.34 s
> test result: FAILED. 0 passed; 1 failed; 0 ignored; 0 measured; 611 filtered out; finished in 10.30s
38.34 s
>
38.34 s
> stderr ---
38.34 s
> [18:18:39.444] @gammalooprs::settings::runtime WARNING : No external kinematics were provided; using default-generated external momenta and helicities.
38.34 s
> field value
38.34 s
> span build_integrand{amplitude.name = bub}
38.34 s
> at crates/gammalooprs/src/settings/runtime.rs:131
38.34 s
> [18:18:39.445] @gammalooprs::integrands::process::amplitude INFO : Input is below threshold: 0 existing threshold E-surfaces across 0/3 graph groups
38.34 s
> field value
38.34 s
> existing_esurfaces 0
38.34 s
> group_count 3
38.34 s
> groups_above_threshold 0
38.34 s
> integrand bub
38.34 s
> span warm_up{integrand.name = bub}
38.34 s
> threshold_status below threshold
38.34 s
> at crates/gammalooprs/src/integrands/process/amplitude/mod.rs:1666
38.34 s
> [18:18:39.445] @gammalooprs::integrands::process::amplitude INFO : overlap structure of group 0: [0: []]
38.34 s
> field value
38.34 s
> span warm_up{integrand.name = bub}
38.34 s
> at crates/gammalooprs/src/integrands/process/amplitude/mod.rs:2015
38.34 s
> [18:18:39.445] @gammalooprs::integrands::process::amplitude INFO : overlap structure of group 1: [0: []]
38.34 s
> field value
38.34 s
> span warm_up{integrand.name = bub}
38.34 s
> at crates/gammalooprs/src/integrands/process/amplitude/mod.rs:2015
38.34 s
> [18:18:39.445] @gammalooprs::integrands::process::amplitude INFO : overlap structure of group 2: [0: []]
38.34 s
> field value
38.34 s
> span warm_up{integrand.name = bub}
38.34 s
> at crates/gammalooprs/src/integrands/process/amplitude/mod.rs:2015
38.34 s
> The application panicked (crashed).
38.34 s
> Message: assertion `left == right` failed: subtracted scalar UV profile failed:
38.34 s
> UVProfilePassFail {
38.34 s
> max_dod: -0.9,
38.34 s
> total: 16,
38.34 s
> failed: 1,
38.34 s
> failures: [
38.34 s
> UVProfileFailure {
38.34 s
> graph_index: 0,
38.34 s
> graph_name: "banana",
38.34 s
> cutkosky_cut: None,
38.34 s
> lmb_index: 1,
38.34 s
> fixed: [
38.34 s
> EdgeIndex(
38.34 s
> 2,
38.34 s
> ),
38.34 s
> EdgeIndex(
38.34 s
> 0,
38.34 s
> ),
38.34 s
> ],
38.34 s
> free: [
38.34 s
> EdgeIndex(
38.34 s
> 3,
38.34 s
> ),
38.34 s
> ],
38.34 s
> orientation_label: None,
38.34 s
> reason: "dod_exceeds_threshold",
38.34 s
> },
38.34 s
> ],
38.34 s
> }
38.34 s
>
38.34 s
> ╭─────────┬────────────┬───────────┬───────┬─────┬──────────┬───────────╮
38.34 s
> │ fixed │ → ∞ │ slope │ r2 │ DOD │ bare DOD │ inspect │
38.34 s
> ├─────────┼────────────┼───────────┼───────┼─────┼──────────┼───────────┤
38.34 s
> │ {e1,e2} │ {e3} │ -0.996752 │ 1.000 │ -1 │ 0 │ arb retry │
38.34 s
> │ {e1,e3} │ {e2} │ -1.065665 │ 0.997 │ -1 │ 0 │ arb retry │
38.34 s
> │ {e1} │ {e2,e3} │ -0.937151 │ 0.943 │ -1 │ 2 │ │
38.34 s
> │ {e2,e3} │ {e1} │ -1.001075 │ 1.000 │ -1 │ 0 │ arb retry │
38.34 s
> │ {e2} │ {e1,e3} │ -0.984146 │ 0.998 │ -1 │ 2 │ │
38.34 s
> │ {e3} │ {e1,e2} │ -1.383911 │ 0.982 │ -1 │ 2 │ arb retry │
38.34 s
> │ {} │ {e1,e2,e3} │ -1.094213 │ 0.258 │ -1 │ 4 │ │
38.34 s
> │ {e2,e0} │ {e3} │ -0.803348 │ 0.861 │ -1 │ 0 │ arb retry │
38.34 s
> │ {e3,e0} │ {e2} │ -0.999257 │ 1.000 │ -1 │ 0 │ │
38.34 s
> │ {e0} │ {e2,e3} │ -1.000893 │ 1.000 │ -1 │ 2 │ │
38.34 s
> │ {e1,e0} │ {e3} │ -0.997860 │ 1.000 │ -1 │ 0 │ │
38.34 s
> ╰─────────┴────────────┴───────────┴───────┴─────┴──────────┴───────────╯
38.34 s
>
38.34 s
> ╭───────┬─────────┬───────────┬───────┬─────┬──────────┬───────────╮
38.34 s
> │ fixed │ → ∞ │ slope │ r2 │ DOD │ bare DOD │ inspect │
38.34 s
> ├───────┼─────────┼───────────┼───────┼─────┼──────────┼───────────┤
38.34 s
> │ {e1} │ {e2} │ -1.005039 │ 1.000 │ -1 │ 0 │ arb retry │
38.34 s
> │ {e2} │ {e1} │ -1.001098 │ 1.000 │ -1 │ 0 │ arb retry │
38.34 s
> │ {} │ {e1,e2} │ -1.011289 │ 1.000 │ -1 │ 2 │ │
38.34 s
> │ {e0} │ {e2} │ -0.998140 │ 1.000 │ -1 │ 0 │ │
38.34 s
> ╰───────┴─────────┴───────────┴───────┴─────┴──────────┴───────────╯
38.34 s
>
38.34 s
> ╭───────┬──────┬───────────┬───────┬─────┬──────────┬─────────╮
38.34 s
> │ fixed │ → ∞ │ slope │ r2 │ DOD │ bare DOD │ inspect │
38.34 s
> ├───────┼──────┼───────────┼───────┼─────┼──────────┼─────────┤
38.34 s
> │ {} │ {e1} │ -0.989949 │ 1.000 │ -1 │ 0 │ │
38.34 s
> ╰───────┴──────┴───────────┴───────┴─────┴──────────┴─────────╯
38.34 s
> left: 1
38.34 s
> right: 0
38.34 s
> Location: crates/gammalooprs/src/uv/tests.rs :325
38.34 s
>
38.34 s
> ━━━━━━━━━━━━━━━━━━━━━━━━━━━━━━━━━━ BACKTRACE ━━━━━━━━━━━━━━━━━━━━━━━━━━━━━━━━━━━
38.34 s
> 1: <color_eyre[51793ea62743adbd]::config::PanicHook>::panic_report <unknown>
38.34 s
> at <unknown source file> :<unknown line>
38.34 s
> 2: <color_eyre[51793ea62743adbd]::config::PanicHook>::into_panic_hook::{closure#0} <unknown>
38.34 s
> at <unknown source file> :<unknown line>
38.34 s
> 3: std[bcb96dfbba0ab899]::panicking::panic_with_hook <unknown>
38.34 s
> at <unknown source file> :<unknown line>
38.34 s
> 4: std[bcb96dfbba0ab899]::panicking::panic_handler::{closure#0} <unknown>
38.34 s
> at <unknown source file> :<unknown line>
38.34 s
> 5: std[bcb96dfbba0ab899]::sys::backtrace::__rust_end_short_backtrace::<std[bcb96dfbba0ab899]::panicking::panic_handler::{closure#0}, !> <unknown>
38.34 s
> at <unknown source file> :<unknown line>
38.34 s
> 6: __rustc[6c289b9f9c454d21]::rust_begin_unwind <unknown>
38.34 s
> at <unknown source file> :<unknown line>
38.34 s
> 7: core[940e698046960fd5]::panicking::panic_fmt <unknown>
38.34 s
> at <unknown source file> :<unknown line>
38.34 s
> 8: core[940e698046960fd5]::panicking::assert_failed_inner <unknown>
38.34 s
> at <unknown source file> :<unknown line>
38.34 s
> 9: core[940e698046960fd5]::panicking::assert_failed::<usize, usize> <unknown>
38.34 s
> at <unknown source file> :<unknown line>
38.34 s
> 10: gammalooprs[972dff90865981f6]::uv::tests::scalars_profile_new <unknown>
38.34 s
> at <unknown source file> :<unknown line>
38.34 s
> 11: <gammalooprs[972dff90865981f6]::uv::tests::scalars_profile_new::{closure#0} as core[940e698046960fd5]::ops::function::FnOnce<()>>::call_once <unknown>
38.34 s
> at <unknown source file> :<unknown line>
38.34 s
> 12: test[75d6903177b1d7e9]::__rust_begin_short_backtrace::<core[940e698046960fd5]::result::Result<(), alloc[2ea6bcb46fca0c42]::string::String>, fn() -> core[940e698046960fd5]::result::Result<(), alloc[2ea6bcb46fca0c42]::string::String>> <unknown>
38.34 s
> at <unknown source file> :<unknown line>
38.34 s
> 13: test[75d6903177b1d7e9]::run_test::{closure#0} <unknown>
38.34 s
> at <unknown source file> :<unknown line>
38.34 s
> 14: std[bcb96dfbba0ab899]::sys::backtrace::__rust_begin_short_backtrace::<test[75d6903177b1d7e9]::run_test::{closure#1}, ()> <unknown>
38.34 s
> at <unknown source file> :<unknown line>
38.34 s
> 15: <std[bcb96dfbba0ab899]::thread::lifecycle::spawn_unchecked<test[75d6903177b1d7e9]::run_test::{closure#1}, ()>::{closure#1} as core[940e698046960fd5]::ops::function::FnOnce<()>>::call_once::{shim:vtable#0} <unknown>
38.34 s
> at <unknown source file> :<unknown line>
38.34 s
> 16: <std[bcb96dfbba0ab899]::sys::thread::unix::Thread>::new::thread_start <unknown>
38.34 s
> at <unknown source file> :<unknown line>
38.34 s
> 17: start_thread <unknown>
38.34 s
> at <unknown source file> :<unknown line>
38.34 s
> 18: __clone3 <unknown>
38.34 s
> at <unknown source file> :<unknown line>
38.34 s
>
38.34 s
> Run with COLORBT_SHOW_HIDDEN=1 environment variable to disable frame filtering.
38.34 s
> Run with RUST_BACKTRACE=full to include source snippets.
38.34 s
>
38.34 s
> FAIL [ 10.344s] (560/561) gammalooprs uv::tests :: scalars_profile
38.34 s
> stdout ---
38.34 s
>
38.34 s
> running 1 test
38.34 s
> test uv::tests::scalars_profile ... FAILED
38.34 s
>
38.34 s
> failures:
38.34 s
>
38.34 s
> failures:
38.34 s
> uv::tests::scalars_profile
38.34 s
>
38.34 s
> test result: FAILED. 0 passed; 1 failed; 0 ignored; 0 measured; 611 filtered out; finished in 10.32s
38.34 s
>
38.34 s
> stderr ---
38.34 s
> [18:18:39.434] @gammalooprs::settings::runtime WARNING : No external kinematics were provided; using default-generated external momenta and helicities.
38.34 s
> field value
38.34 s
> span build_integrand{amplitude.name = bub}
38.34 s
> at crates/gammalooprs/src/settings/runtime.rs:131
38.34 s
> [18:18:39.435] @gammalooprs::integrands::process::amplitude INFO : Input is below threshold: 0 existing threshold E-surfaces across 0/3 graph groups
38.34 s
> field value
38.34 s
> existing_esurfaces 0
38.34 s
> group_count 3
38.34 s
> groups_above_threshold 0
38.34 s
> integrand bub
38.34 s
> span warm_up{integrand.name = bub}
38.34 s
> threshold_status below threshold
38.34 s
> at crates/gammalooprs/src/integrands/process/amplitude/mod.rs:1666
38.34 s
> [18:18:39.435] @gammalooprs::integrands::process::amplitude INFO : overlap structure of group 0: [0: []]
38.34 s
> field value
38.34 s
> span warm_up{integrand.name = bub}
38.34 s
> at crates/gammalooprs/src/integrands/process/amplitude/mod.rs:2015
38.34 s
> [18:18:39.435] @gammalooprs::integrands::process::amplitude INFO : overlap structure of group 1: [0: []]
38.34 s
> field value
38.34 s
> span warm_up{integrand.name = bub}
38.34 s
> at crates/gammalooprs/src/integrands/process/amplitude/mod.rs:2015
38.34 s
> [18:18:39.435] @gammalooprs::integrands::process::amplitude INFO : overlap structure of group 2: [0: []]
38.34 s
> field value
38.34 s
> span warm_up{integrand.name = bub}
38.34 s
> at crates/gammalooprs/src/integrands/process/amplitude/mod.rs:2015
38.34 s
> The application panicked (crashed).
38.34 s
> Message: assertion `left == right` failed: subtracted scalar UV profile failed:
38.34 s
> UVProfilePassFail {
38.34 s
> max_dod: -0.9,
38.34 s
> total: 16,
38.34 s
> failed: 1,
38.34 s
> failures: [
38.34 s
> UVProfileFailure {
38.34 s
> graph_index: 0,
38.34 s
> graph_name: "banana",
38.34 s
> cutkosky_cut: None,
38.34 s
> lmb_index: 1,
38.34 s
> fixed: [
38.34 s
> EdgeIndex(
38.34 s
> 2,
38.34 s
> ),
38.34 s
> EdgeIndex(
38.34 s
> 0,
38.34 s
> ),
38.34 s
> ],
38.34 s
> free: [
38.34 s
> EdgeIndex(
38.34 s
> 3,
38.34 s
> ),
38.34 s
> ],
38.34 s
> orientation_label: None,
38.34 s
> reason: "dod_exceeds_threshold",
38.34 s
> },
38.34 s
> ],
38.34 s
> }
38.34 s
>
38.34 s
> ╭─────────┬────────────┬───────────┬───────┬─────┬──────────┬───────────╮
38.34 s
> │ fixed │ → ∞ │ slope │ r2 │ DOD │ bare DOD │ inspect │
38.34 s
> ├─────────┼────────────┼───────────┼───────┼─────┼──────────┼───────────┤
38.34 s
> │ {e1,e2} │ {e3} │ -0.996752 │ 1.000 │ -1 │ 0 │ arb retry │
38.34 s
> │ {e1,e3} │ {e2} │ -1.065665 │ 0.997 │ -1 │ 0 │ arb retry │
38.34 s
> │ {e1} │ {e2,e3} │ -0.937151 │ 0.943 │ -1 │ 2 │ │
38.34 s
> │ {e2,e3} │ {e1} │ -1.001075 │ 1.000 │ -1 │ 0 │ arb retry │
38.34 s
> │ {e2} │ {e1,e3} │ -0.984146 │ 0.998 │ -1 │ 2 │ │
38.34 s
> │ {e3} │ {e1,e2} │ -1.383911 │ 0.982 │ -1 │ 2 │ arb retry │
38.34 s
> │ {} │ {e1,e2,e3} │ -1.094213 │ 0.258 │ -1 │ 4 │ │
38.34 s
> │ {e2,e0} │ {e3} │ -0.803348 │ 0.861 │ -1 │ 0 │ arb retry │
38.34 s
> │ {e3,e0} │ {e2} │ -0.999257 │ 1.000 │ -1 │ 0 │ │
38.34 s
> │ {e0} │ {e2,e3} │ -1.000893 │ 1.000 │ -1 │ 2 │ │
38.34 s
> │ {e1,e0} │ {e3} │ -0.997860 │ 1.000 │ -1 │ 0 │ │
38.34 s
> ╰─────────┴────────────┴───────────┴───────┴─────┴──────────┴───────────╯
38.34 s
>
38.34 s
> ╭───────┬─────────┬───────────┬───────┬─────┬──────────┬───────────╮
38.34 s
> │ fixed │ → ∞ │ slope │ r2 │ DOD │ bare DOD │ inspect │
38.34 s
> ├───────┼─────────┼───────────┼───────┼─────┼──────────┼───────────┤
38.34 s
> │ {e1} │ {e2} │ -1.005039 │ 1.000 │ -1 │ 0 │ arb retry │
38.34 s
> │ {e2} │ {e1} │ -1.001098 │ 1.000 │ -1 │ 0 │ arb retry │
38.34 s
> │ {} │ {e1,e2} │ -1.011289 │ 1.000 │ -1 │ 2 │ │
38.34 s
> │ {e0} │ {e2} │ -0.998140 │ 1.000 │ -1 │ 0 │ │
38.34 s
> ╰───────┴─────────┴───────────┴───────┴─────┴──────────┴───────────╯
38.34 s
>
38.34 s
> ╭───────┬──────┬───────────┬───────┬─────┬──────────┬─────────╮
38.34 s
> │ fixed │ → ∞ │ slope │ r2 │ DOD │ bare DOD │ inspect │
38.34 s
> ├───────┼──────┼───────────┼───────┼─────┼──────────┼─────────┤
38.34 s
> │ {} │ {e1} │ -0.989949 │ 1.000 │ -1 │ 0 │ │
38.34 s
> ╰───────┴──────┴───────────┴───────┴─────┴──────────┴─────────╯
38.34 s
> left: 1
38.34 s
> right: 0
38.34 s
> Location: crates/gammalooprs/src/uv/tests.rs :259
38.34 s
>
38.34 s
> ━━━━━━━━━━━━━━━━━━━━━━━━━━━━━━━━━━ BACKTRACE ━━━━━━━━━━━━━━━━━━━━━━━━━━━━━━━━━━━
38.34 s
> 1: <color_eyre[51793ea62743adbd]::config::PanicHook>::panic_report <unknown>
38.34 s
> at <unknown source file> :<unknown line>
38.34 s
> 2: <color_eyre[51793ea62743adbd]::config::PanicHook>::into_panic_hook::{closure#0} <unknown>
38.34 s
> at <unknown source file> :<unknown line>
38.34 s
> 3: std[bcb96dfbba0ab899]::panicking::panic_with_hook <unknown>
38.34 s
> at <unknown source file> :<unknown line>
38.34 s
> 4: std[bcb96dfbba0ab899]::panicking::panic_handler::{closure#0} <unknown>
38.34 s
> at <unknown source file> :<unknown line>
38.34 s
> 5: std[bcb96dfbba0ab899]::sys::backtrace::__rust_end_short_backtrace::<std[bcb96dfbba0ab899]::panicking::panic_handler::{closure#0}, !> <unknown>
38.34 s
> at <unknown source file> :<unknown line>
38.34 s
> 6: __rustc[6c289b9f9c454d21]::rust_begin_unwind <unknown>
38.34 s
> at <unknown source file> :<unknown line>
38.34 s
> 7: core[940e698046960fd5]::panicking::panic_fmt <unknown>
38.34 s
> at <unknown source file> :<unknown line>
38.34 s
> 8: core[940e698046960fd5]::panicking::assert_failed_inner <unknown>
38.34 s
> at <unknown source file> :<unknown line>
38.34 s
> 9: core[940e698046960fd5]::panicking::assert_failed::<usize, usize> <unknown>
38.34 s
> at <unknown source file> :<unknown line>
38.34 s
> 10: gammalooprs[972dff90865981f6]::uv::tests::scalars_profile <unknown>
38.34 s
> at <unknown source file> :<unknown line>
38.34 s
> 11: <gammalooprs[972dff90865981f6]::uv::tests::scalars_profile::{closure#0} as core[940e698046960fd5]::ops::function::FnOnce<()>>::call_once <unknown>
38.34 s
> at <unknown source file> :<unknown line>
38.34 s
> 12: test[75d6903177b1d7e9]::__rust_begin_short_backtrace::<core[940e698046960fd5]::result::Result<(), alloc[2ea6bcb46fca0c42]::string::String>, fn() -> core[940e698046960fd5]::result::Result<(), alloc[2ea6bcb46fca0c42]::string::String>> <unknown>
38.34 s
> at <unknown source file> :<unknown line>
38.34 s
> 13: test[75d6903177b1d7e9]::run_test::{closure#0} <unknown>
38.34 s
> at <unknown source file> :<unknown line>
38.34 s
> 14: std[bcb96dfbba0ab899]::sys::backtrace::__rust_begin_short_backtrace::<test[75d6903177b1d7e9]::run_test::{closure#1}, ()> <unknown>
38.34 s
> at <unknown source file> :<unknown line>
38.34 s
> 15: <std[bcb96dfbba0ab899]::thread::lifecycle::spawn_unchecked<test[75d6903177b1d7e9]::run_test::{closure#1}, ()>::{closure#1} as core[940e698046960fd5]::ops::function::FnOnce<()>>::call_once::{shim:vtable#0} <unknown>
38.34 s
> at <unknown source file> :<unknown line>
38.34 s
> 16: <std[bcb96dfbba0ab899]::sys::thread::unix::Thread>::new::thread_start <unknown>
38.34 s
> at <unknown source file> :<unknown line>
38.34 s
> 17: start_thread <unknown>
38.34 s
> at <unknown source file> :<unknown line>
38.34 s
> 18: __clone3 <unknown>
38.34 s
> at <unknown source file> :<unknown line>
38.34 s
>
38.34 s
> Run with COLORBT_SHOW_HIDDEN=1 environment variable to disable frame filtering.
38.34 s
> Run with RUST_BACKTRACE=full to include source snippets.
38.34 s
>
38.34 s
> error : test run failed
38.34 s
>
38.34 s
> ========== nextest test summary ==========
38.34 s
> report: target/nextest/ci_gammaloop/junit.xml
38.35 s
> tests: 561, failures: 5, errors: 0
38.35 s
>
38.35 s
> 1. gammalooprs::cff::tests::stored_production_cff_uses_typed_energy_factor_ownership
38.35 s
> failure: test failure with exit code 101
38.35 s
> system-out
38.35 s
> running 1 test
38.35 s
> test cff::tests::stored_production_cff_uses_typed_energy_factor_ownership ... FAILED
38.35 s
>
38.35 s
> failures:
38.35 s
>
38.35 s
> failures:
38.35 s
> cff::tests::stored_production_cff_uses_typed_energy_factor_ownership
38.35 s
>
38.35 s
> test result: FAILED. 0 passed; 1 failed; 0 ignored; 0 measured; 611 filtered out; finished in 0.09s
38.35 s
> system-err
38.35 s
> The application panicked (crashed).
38.35 s
> Message: assertion `left == right` failed
38.35 s
> left: 1
38.35 s
> right: -1
38.35 s
> Location: crates/gammalooprs/src/cff/mod.rs:2721
38.35 s
>
38.35 s
> ━━━━━━━━━━━━━━━━━━━━━━━━━━━━━━━━━━ BACKTRACE ━━━━━━━━━━━━━━━━━━━━━━━━━━━━━━━━━━━
38.35 s
> 1: <color_eyre[51793ea62743adbd]::config::PanicHook>::panic_report<unknown>
38.35 s
> at <unknown source file>:<unknown line>
38.35 s
> 2: <color_eyre[51793ea62743adbd]::config::PanicHook>::into_panic_hook::{closure#0}<unknown>
38.35 s
> at <unknown source file>:<unknown line>
38.35 s
> 3: std[bcb96dfbba0ab899]::panicking::panic_with_hook<unknown>
38.35 s
> at <unknown source file>:<unknown line>
38.35 s
> 4: std[bcb96dfbba0ab899]::panicking::panic_handler::{closure#0}<unknown>
38.35 s
> at <unknown source file>:<unknown line>
38.35 s
> 5: std[bcb96dfbba0ab899]::sys::backtrace::__rust_end_short_backtrace::<std[bcb96dfbba0ab899]::panicking::panic_handler::{closure#0}, !><unknown>
38.35 s
> at <unknown source file>:<unknown line>
38.35 s
> 6: __rustc[6c289b9f9c454d21]::rust_begin_unwind<unknown>
38.35 s
> at <unknown source file>:<unknown line>
38.35 s
> 7: core[940e698046960fd5]::panicking::panic_fmt<unknown>
38.35 s
> at <unknown source file>:<unknown line>
38.35 s
> 8: core[940e698046960fd5]::panicking::assert_failed_inner<unknown>
38.35 s
> at <unknown source file>:<unknown line>
38.35 s
> 9: core[940e698046960fd5]::panicking::assert_failed::<i64, i64><unknown>
38.35 s
> at <unknown source file>:<unknown line>
38.35 s
> 10: gammalooprs[972dff90865981f6]::cff::tests::stored_production_cff_uses_typed_energy_factor_ownership<unknown>
38.35 s
> at <unknown source file>:<unknown line>
38.35 s
> 11: <gammalooprs[972dff90865981f6]::cff::tests::stored_production_cff_uses_typed_energy_factor_ownership::{closure#0} as core[940e698046960fd5]::ops::function::FnOnce<()>>::call_once<unknown>
38.35 s
> at <unknown source file>:<unknown line>
38.35 s
> 12: test[75d6903177b1d7e9]::__rust_begin_short_backtrace::<core[940e698046960fd5]::result::Result<(), alloc[2ea6bcb46fca0c42]::string::String>, fn() -> core[940e698046960fd5]::result::Result<(), alloc[2ea6bcb46fca0c42]::string::String>><unknown>
38.35 s
> at <unknown source file>:<unknown line>
38.35 s
> 13: test[75d6903177b1d7e9]::run_test::{closure#0}<unknown>
38.35 s
> at <unknown source file>:<unknown line>
38.35 s
> 14: std[bcb96dfbba0ab899]::sys::backtrace::__rust_begin_short_backtrace::<test[75d6903177b1d7e9]::run_test::{closure#1}, ()><unknown>
38.35 s
> at <unknown source file>:<unknown line>
38.35 s
> 15: <std[bcb96dfbba0ab899]::thread::lifecycle::spawn_unchecked<test[75d6903177b1d7e9]::run_test::{closure#1}, ()>::{closure#1} as core[940e698046960fd5]::ops::function::FnOnce<()>>::call_once::{shim:vtable#0}<unknown>
38.35 s
> at <unknown source file>:<unknown line>
38.35 s
> 16: <std[bcb96dfbba0ab899]::sys::thread::unix::Thread>::new::thread_start<unknown>
38.35 s
> at <unknown source file>:<unknown line>
38.35 s
> 17: start_thread<unknown>
38.35 s
> at <unknown source file>:<unknown line>
38.35 s
> 18: __clone3<unknown>
38.35 s
> at <unknown source file>:<unknown line>
38.35 s
>
38.35 s
> Run with COLORBT_SHOW_HIDDEN=1 environment variable to disable frame filtering.
38.35 s
> Run with RUST_BACKTRACE=full to include source snippets.
38.35 s
>
38.35 s
> 2. gammalooprs::uv::approx::local_3d::tests::production_emr_map_cancels_one_powered_denominator
38.35 s
> failure: test failure with exit code 101
38.35 s
> system-out
38.35 s
> running 1 test
38.35 s
> test uv::approx::local_3d::tests::production_emr_map_cancels_one_powered_denominator ... FAILED
38.35 s
>
38.35 s
> failures:
38.35 s
>
38.35 s
> failures:
38.35 s
> uv::approx::local_3d::tests::production_emr_map_cancels_one_powered_denominator
38.35 s
>
38.35 s
> test result: FAILED. 0 passed; 1 failed; 0 ignored; 0 measured; 611 filtered out; finished in 0.10s
38.35 s
> system-err
38.35 s
> The application panicked (crashed).
38.35 s
> Message: summed exact-source powered and selected lower channels differ: powered=-1𝑖/8/𝜋^3, lower=1𝑖/16/𝜋^3, difference=-3𝑖/16/𝜋^3
38.35 s
> Location: crates/gammalooprs/src/uv/approx/local_3d.rs:2047
38.35 s
>
38.35 s
> ━━━━━━━━━━━━━━━━━━━━━━━━━━━━━━━━━━ BACKTRACE ━━━━━━━━━━━━━━━━━━━━━━━━━━━━━━━━━━━
38.35 s
> 1: <color_eyre[51793ea62743adbd]::config::PanicHook>::panic_report<unknown>
38.35 s
> at <unknown source file>:<unknown line>
38.35 s
> 2: <color_eyre[51793ea62743adbd]::config::PanicHook>::into_panic_hook::{closure#0}<unknown>
38.35 s
> at <unknown source file>:<unknown line>
38.35 s
> 3: std[bcb96dfbba0ab899]::panicking::panic_with_hook<unknown>
38.35 s
> at <unknown source file>:<unknown line>
38.35 s
> 4: std[bcb96dfbba0ab899]::panicking::panic_handler::{closure#0}<unknown>
38.35 s
> at <unknown source file>:<unknown line>
38.35 s
> 5: std[bcb96dfbba0ab899]::sys::backtrace::__rust_end_short_backtrace::<std[bcb96dfbba0ab899]::panicking::panic_handler::{closure#0}, !><unknown>
38.35 s
> at <unknown source file>:<unknown line>
38.35 s
> 6: __rustc[6c289b9f9c454d21]::rust_begin_unwind<unknown>
38.35 s
> at <unknown source file>:<unknown line>
38.35 s
> 7: core[940e698046960fd5]::panicking::panic_fmt<unknown>
38.35 s
> at <unknown source file>:<unknown line>
38.35 s
> 8: gammalooprs[972dff90865981f6]::uv::approx::local_3d::tests::production_emr_map_cancels_one_powered_denominator<unknown>
38.35 s
> at <unknown source file>:<unknown line>
38.35 s
> 9: <gammalooprs[972dff90865981f6]::uv::approx::local_3d::tests::production_emr_map_cancels_one_powered_denominator::{closure#0} as core[940e698046960fd5]::ops::function::FnOnce<()>>::call_once<unknown>
38.35 s
> at <unknown source file>:<unknown line>
38.35 s
> 10: test[75d6903177b1d7e9]::__rust_begin_short_backtrace::<core[940e698046960fd5]::result::Result<(), alloc[2ea6bcb46fca0c42]::string::String>, fn() -> core[940e698046960fd5]::result::Result<(), alloc[2ea6bcb46fca0c42]::string::String>><unknown>
38.35 s
> at <unknown source file>:<unknown line>
38.35 s
> 11: test[75d6903177b1d7e9]::run_test::{closure#0}<unknown>
38.35 s
> at <unknown source file>:<unknown line>
38.35 s
> 12: std[bcb96dfbba0ab899]::sys::backtrace::__rust_begin_short_backtrace::<test[75d6903177b1d7e9]::run_test::{closure#1}, ()><unknown>
38.35 s
> at <unknown source file>:<unknown line>
38.35 s
> 13: <std[bcb96dfbba0ab899]::thread::lifecycle::spawn_unchecked<test[75d6903177b1d7e9]::run_test::{closure#1}, ()>::{closure#1} as core[940e698046960fd5]::ops::function::FnOnce<()>>::call_once::{shim:vtable#0}<unknown>
38.35 s
> at <unknown source file>:<unknown line>
38.35 s
> 14: <std[bcb96dfbba0ab899]::sys::thread::unix::Thread>::new::thread_start<unknown>
38.35 s
> at <unknown source file>:<unknown line>
38.35 s
> 15: start_thread<unknown>
38.35 s
> at <unknown source file>:<unknown line>
38.35 s
> 16: __clone3<unknown>
38.35 s
> at <unknown source file>:<unknown line>
38.35 s
>
38.35 s
> Run with COLORBT_SHOW_HIDDEN=1 environment variable to disable frame filtering.
38.35 s
> Run with RUST_BACKTRACE=full to include source snippets.
38.35 s
>
38.35 s
> 3. gammalooprs::uv::hedge_poset::tests::spectacles_typed_4d_projects_after_local_construction
38.35 s
> failure: test failure with exit code 101
38.35 s
> Error:
38.35 s
> 0: failed to extract three-dimensional representation graph input: source edge 1 has no unique routing for rewritten exact signature [-1, 0, 0] modulo the factorized opposite-domain loop span
38.35 s
>
38.35 s
> Location:
38.35 s
> crates/gammalooprs/src/uv/approx/local_3d.rs:845
38.35 s
>
38.35 s
> ━━━━━━━━━━━━━━━━━━━━━━━━━━━━━━━━━━ BACKTRACE ━━━━━━━━━━━━━━━━━━━━━━━━━━━━━━━━━━━
38.35 s
> 1: <color_eyre[51793ea62743adbd]::config::EyreHook>::into_eyre_hook::{closure#0}<unknown>
38.35 s
> at <unknown source file>:<unknown line>
38.35 s
> 2: eyre[cb2fd339c0c40fca]::capture_handler<unknown>
38.35 s
> at <unknown source file>:<unknown line>
38.35 s
> 3: <eyre[cb2fd339c0c40fca]::Report>::from_std::<three_dimensional_reps[3cb572ff22d197ac]::graph_io::GraphIoError><unknown>
38.35 s
> at <unknown source file>:<unknown line>
38.35 s
> 4: <gammalooprs[972dff90865981f6]::uv::approx::local_3d::Localizer>::project_4d<unknown>
38.35 s
> at <unknown source file>:<unknown line>
38.35 s
> 5: gammalooprs[972dff90865981f6]::uv::hedge_poset::tests::spectacles_typed_4d_projects_after_local_construction<unknown>
38.35 s
> at <unknown source file>:<unknown line>
38.35 s
> 6: <gammalooprs[972dff90865981f6]::uv::hedge_poset::tests::spectacles_typed_4d_projects_after_local_construction::{closure#0} as core[940e698046960fd5]::ops::function::FnOnce<()>>::call_once<unknown>
38.35 s
> at <unknown source file>:<unknown line>
38.35 s
> 7: test[75d6903177b1d7e9]::__rust_begin_short_backtrace::<core[940e698046960fd5]::result::Result<(), alloc[2ea6bcb46fca0c42]::string::String>, fn() -> core[940e698046960fd5]::result::Result<(), alloc[2ea6bcb46fca0c42]::string::String>><unknown>
38.35 s
> at <unknown source file>:<unknown line>
38.35 s
> 8: test[75d6903177b1d7e9]::run_test::{closure#0}<unknown>
38.35 s
> at <unknown source file>:<unknown line>
38.35 s
> 9: std[bcb96dfbba0ab899]::sys::backtrace::__rust_begin_short_backtrace::<test[75d6903177b1d7e9]::run_test::{closure#1}, ()><unknown>
38.35 s
> at <unknown source file>:<unknown line>
38.35 s
> 10: <std[bcb96dfbba0ab899]::thread::lifecycle::spawn_unchecked<test[75d6903177b1d7e9]::run_test::{closure#1}, ()>::{closure#1} as core[940e698046960fd5]::ops::function::FnOnce<()>>::call_once::{shim:vtable#0}<unknown>
38.35 s
> at <unknown source file>:<unknown line>
38.35 s
> 11: <std[bcb96dfbba0ab899]::sys::thread::unix::Thread>::new::thread_start<unknown>
38.35 s
> at <unknown source file>:<unknown line>
38.35 s
> 12: start_thread<unknown>
38.35 s
> at <unknown source file>:<unknown line>
38.35 s
> 13: __clone3<unknown>
38.35 s
> at <unknown source file>:<unknown line>
38.35 s
>
38.35 s
> Run with COLORBT_SHOW_HIDDEN=1 environment variable to disable frame filtering.
38.35 s
> Run with RUST_BACKTRACE=full to include source snippets.
38.35 s
> system-out
38.35 s
> running 1 test
38.35 s
> digraph {
38.35 s
> node [shape=circle,height=0.1,label=""];
38.35 s
> overlap = "scale";
38.35 s
> layout = "neato";
38.35 s
> start=2;
38.35 s
> 4 [label="0"];
38.35 s
> 1 [label="zw"];
38.35 s
> 2 [label="F"];
38.35 s
> 0 [label="143"];
38.35 s
> 3 [label="10B"];
38.35 s
> 4:0:s-> 1:1:s [id=0 color="red:blue;0.5" label="zw"];
38.35 s
> 4:2:s-> 2:3:s [id=1 color="red:blue;0.5" label="F"];
38.35 s
> 3:5:s-> 0:4:s [id=2 color="red:blue;0.5" label="143"];
38.35 s
> 4:6:s-> 0:7:s [id=3 color="red:blue;0.5" label="143"];
38.35 s
> 1:8:s-> 3:9:s [id=4 color="red:blue;0.5" label="F"];
38.35 s
> 1:10:s-> 0:11:s [id=5 color="red:blue;0.5" label="143"];
38.35 s
> 2:12:s-> 3:13:s [id=6 color="red:blue;0.5" label="zw"];
38.35 s
> 2:14:s-> 0:15:s [id=7 color="red:blue;0.5" label="143"];
38.35 s
> }
38.35 s
>
38.35 s
> digraph {
38.35 s
> node [shape=circle,height=0.1,label=""];
38.35 s
> overlap = "scale";
38.35 s
> layout = "neato";
38.35 s
> start=2;
38.35 s
> 0 [label="∅"];
38.35 s
> 1 [label="{zw}: Approx(S_zw(0))"];
38.35 s
> 2 [label="{F}: Approx(S_F(1))"];
38.35 s
> 3 [label="{143}: Approx(S_143(3))"];
38.35 s
> 4 [label="{zw,F}: Approx(S_F(4))*Approx(S_zw(0))"];
38.35 s
> 5 [label="{zw} · {143}: Approx((-1*S_zw+S_143(5))*Approx(S_zw(0)))"];
38.35 s
> 6 [label="{F} · {143}: Approx((-1*S_F+S_143(7))*Approx(S_F(1)))"];
38.35 s
> 7 [label="{zw,F} · {143}: Approx((-1*S_10B+S_143(2))*Approx(S_F(4))*Approx(S_zw(0)))"];
38.35 s
> 0:0:s-> 1:1:s [id=0 color="red:blue;0.5"];
38.35 s
> 0:2:s-> 2:3:s [id=1 color="red:blue;0.5"];
38.35 s
> 0:4:s-> 3:5:s [id=2 color="red:blue;0.5"];
38.35 s
> 1:6:s-> 4:7:s [id=3 color="red:blue;0.5"];
38.35 s
> 1:8:s-> 5:9:s [id=4 color="red:blue;0.5"];
38.35 s
> 2:10:s-> 4:11:s [id=5 color="red:blue;0.5"];
38.35 s
> 2:12:s-> 6:13:s [id=6 color="red:blue;0.5"];
38.35 s
> 4:14:s-> 7:15:s [id=7 color="red:blue;0.5"];
38.35 s
> }
38.35 s
>
38.35 s
> test uv::hedge_poset::tests::spectacles_typed_4d_projects_after_local_construction ... FAILED
38.35 s
>
38.35 s
> failures:
38.35 s
>
38.35 s
> failures:
38.35 s
> uv::hedge_poset::tests::spectacles_typed_4d_projects_after_local_construction
38.35 s
>
38.35 s
> test result: FAILED. 0 passed; 1 failed; 0 ignored; 0 measured; 611 filtered out; finished in 0.20s
38.35 s
> system-err
38.35 s
> Error:
38.35 s
> 0: failed to extract three-dimensional representation graph input: source edge 1 has no unique routing for rewritten exact signature [-1, 0, 0] modulo the factorized opposite-domain loop span
38.35 s
>
38.35 s
> Location:
38.35 s
> crates/gammalooprs/src/uv/approx/local_3d.rs:845
38.35 s
>
38.35 s
> ━━━━━━━━━━━━━━━━━━━━━━━━━━━━━━━━━━ BACKTRACE ━━━━━━━━━━━━━━━━━━━━━━━━━━━━━━━━━━━
38.35 s
> 1: <color_eyre[51793ea62743adbd]::config::EyreHook>::into_eyre_hook::{closure#0}<unknown>
38.35 s
> at <unknown source file>:<unknown line>
38.35 s
> 2: eyre[cb2fd339c0c40fca]::capture_handler<unknown>
38.35 s
> at <unknown source file>:<unknown line>
38.35 s
> 3: <eyre[cb2fd339c0c40fca]::Report>::from_std::<three_dimensional_reps[3cb572ff22d197ac]::graph_io::GraphIoError><unknown>
38.35 s
> at <unknown source file>:<unknown line>
38.35 s
> 4: <gammalooprs[972dff90865981f6]::uv::approx::local_3d::Localizer>::project_4d<unknown>
38.35 s
> at <unknown source file>:<unknown line>
38.35 s
> 5: gammalooprs[972dff90865981f6]::uv::hedge_poset::tests::spectacles_typed_4d_projects_after_local_construction<unknown>
38.35 s
> at <unknown source file>:<unknown line>
38.35 s
> 6: <gammalooprs[972dff90865981f6]::uv::hedge_poset::tests::spectacles_typed_4d_projects_after_local_construction::{closure#0} as core[940e698046960fd5]::ops::function::FnOnce<()>>::call_once<unknown>
38.35 s
> at <unknown source file>:<unknown line>
38.35 s
> 7: test[75d6903177b1d7e9]::__rust_begin_short_backtrace::<core[940e698046960fd5]::result::Result<(), alloc[2ea6bcb46fca0c42]::string::String>, fn() -> core[940e698046960fd5]::result::Result<(), alloc[2ea6bcb46fca0c42]::string::String>><unknown>
38.35 s
> at <unknown source file>:<unknown line>
38.35 s
> 8: test[75d6903177b1d7e9]::run_test::{closure#0}<unknown>
38.35 s
> at <unknown source file>:<unknown line>
38.35 s
> 9: std[bcb96dfbba0ab899]::sys::backtrace::__rust_begin_short_backtrace::<test[75d6903177b1d7e9]::run_test::{closure#1}, ()><unknown>
38.35 s
> at <unknown source file>:<unknown line>
38.35 s
> 10: <std[bcb96dfbba0ab899]::thread::lifecycle::spawn_unchecked<test[75d6903177b1d7e9]::run_test::{closure#1}, ()>::{closure#1} as core[940e698046960fd5]::ops::function::FnOnce<()>>::call_once::{shim:vtable#0}<unknown>
38.35 s
> at <unknown source file>:<unknown line>
38.35 s
> 11: <std[bcb96dfbba0ab899]::sys::thread::unix::Thread>::new::thread_start<unknown>
38.35 s
> at <unknown source file>:<unknown line>
38.35 s
> 12: start_thread<unknown>
38.35 s
> at <unknown source file>:<unknown line>
38.35 s
> 13: __clone3<unknown>
38.35 s
> at <unknown source file>:<unknown line>
38.35 s
>
38.35 s
> Run with COLORBT_SHOW_HIDDEN=1 environment variable to disable frame filtering.
38.35 s
> Run with RUST_BACKTRACE=full to include source snippets.
38.35 s
>
38.35 s
> 4. gammalooprs::uv::tests::scalars_profile_new
38.35 s
> failure: test failure with exit code 101
38.35 s
> system-out
38.35 s
> running 1 test
38.35 s
> test uv::tests::scalars_profile_new ... FAILED
38.35 s
>
38.35 s
> failures:
38.35 s
>
38.35 s
> failures:
38.35 s
> uv::tests::scalars_profile_new
38.35 s
>
38.35 s
> test result: FAILED. 0 passed; 1 failed; 0 ignored; 0 measured; 611 filtered out; finished in 10.30s
38.35 s
> system-err
38.35 s
> [18:18:39.444] @gammalooprs::settings::runtime WARNING : No external kinematics were provided; using default-generated external momenta and helicities.
38.35 s
> field value
38.35 s
> span build_integrand{amplitude.name=bub}
38.35 s
> at crates/gammalooprs/src/settings/runtime.rs:131
38.35 s
> [18:18:39.445] @gammalooprs::integrands::process::amplitude INFO : Input is below threshold: 0 existing threshold E-surfaces across 0/3 graph groups
38.35 s
> field value
38.35 s
> existing_esurfaces 0
38.35 s
> group_count 3
38.35 s
> groups_above_threshold 0
38.35 s
> integrand bub
38.35 s
> span warm_up{integrand.name=bub}
38.35 s
> threshold_status below threshold
38.35 s
> at crates/gammalooprs/src/integrands/process/amplitude/mod.rs:1666
38.35 s
> [18:18:39.445] @gammalooprs::integrands::process::amplitude INFO : overlap structure of group 0: [0: []]
38.35 s
> field value
38.35 s
> span warm_up{integrand.name=bub}
38.35 s
> at crates/gammalooprs/src/integrands/process/amplitude/mod.rs:2015
38.35 s
> [18:18:39.445] @gammalooprs::integrands::process::amplitude INFO : overlap structure of group 1: [0: []]
38.35 s
> field value
38.35 s
> span warm_up{integrand.name=bub}
38.35 s
> at crates/gammalooprs/src/integrands/process/amplitude/mod.rs:2015
38.35 s
> [18:18:39.445] @gammalooprs::integrands::process::amplitude INFO : overlap structure of group 2: [0: []]
38.35 s
> field value
38.35 s
> span warm_up{integrand.name=bub}
38.35 s
> at crates/gammalooprs/src/integrands/process/amplitude/mod.rs:2015
38.35 s
> The application panicked (crashed).
38.35 s
> Message: assertion `left == right` failed: subtracted scalar UV profile failed:
38.35 s
> UVProfilePassFail {
38.35 s
> max_dod: -0.9,
38.35 s
> total: 16,
38.35 s
> failed: 1,
38.35 s
> failures: [
38.35 s
> UVProfileFailure {
38.35 s
> graph_index: 0,
38.35 s
> graph_name: "banana",
38.35 s
> cutkosky_cut: None,
38.35 s
> lmb_index: 1,
38.35 s
> fixed: [
38.35 s
> EdgeIndex(
38.35 s
> 2,
38.35 s
> ),
38.35 s
> EdgeIndex(
38.35 s
> 0,
38.35 s
> ),
38.35 s
> ],
38.35 s
> free: [
38.35 s
> EdgeIndex(
38.35 s
> 3,
38.35 s
> ),
38.35 s
> ],
38.35 s
> orientation_label: None,
38.35 s
> reason: "dod_exceeds_threshold",
38.35 s
> },
38.35 s
> ],
38.35 s
> }
38.35 s
>
38.35 s
> ╭─────────┬────────────┬───────────┬───────┬─────┬──────────┬───────────╮
38.35 s
> │ fixed │ → ∞ │ slope │ r2 │ DOD │ bare DOD │ inspect │
38.35 s
> ├─────────┼────────────┼───────────┼───────┼─────┼──────────┼───────────┤
38.35 s
> │ {e1,e2} │ {e3} │ -0.996752 │ 1.000 │ -1 │ 0 │ arb retry │
38.35 s
> │ {e1,e3} │ {e2} │ -1.065665 │ 0.997 │ -1 │ 0 │ arb retry │
38.35 s
> │ {e1} │ {e2,e3} │ -0.937151 │ 0.943 │ -1 │ 2 │ │
38.35 s
> │ {e2,e3} │ {e1} │ -1.001075 │ 1.000 │ -1 │ 0 │ arb retry │
38.35 s
> │ {e2} │ {e1,e3} │ -0.984146 │ 0.998 │ -1 │ 2 │ │
38.35 s
> │ {e3} │ {e1,e2} │ -1.383911 │ 0.982 │ -1 │ 2 │ arb retry │
38.35 s
> │ {} │ {e1,e2,e3} │ -1.094213 │ 0.258 │ -1 │ 4 │ │
38.35 s
> │ {e2,e0} │ {e3} │ -0.803348 │ 0.861 │ -1 │ 0 │ arb retry │
38.35 s
> │ {e3,e0} │ {e2} │ -0.999257 │ 1.000 │ -1 │ 0 │ │
38.35 s
> │ {e0} │ {e2,e3} │ -1.000893 │ 1.000 │ -1 │ 2 │ │
38.35 s
> │ {e1,e0} │ {e3} │ -0.997860 │ 1.000 │ -1 │ 0 │ │
38.35 s
> ╰─────────┴────────────┴───────────┴───────┴─────┴──────────┴───────────╯
38.35 s
>
38.35 s
> ╭───────┬─────────┬───────────┬───────┬─────┬──────────┬───────────╮
38.35 s
> │ fixed │ → ∞ │ slope │ r2 │ DOD │ bare DOD │ inspect │
38.35 s
> ├───────┼─────────┼───────────┼───────┼─────┼──────────┼───────────┤
38.35 s
> │ {e1} │ {e2} │ -1.005039 │ 1.000 │ -1 │ 0 │ arb retry │
38.35 s
> │ {e2} │ {e1} │ -1.001098 │ 1.000 │ -1 │ 0 │ arb retry │
38.35 s
> │ {} │ {e1,e2} │ -1.011289 │ 1.000 │ -1 │ 2 │ │
38.35 s
> │ {e0} │ {e2} │ -0.998140 │ 1.000 │ -1 │ 0 │ │
38.35 s
> ╰───────┴─────────┴───────────┴───────┴─────┴──────────┴───────────╯
38.35 s
>
38.35 s
> ╭───────┬──────┬───────────┬───────┬─────┬──────────┬─────────╮
38.35 s
> │ fixed │ → ∞ │ slope │ r2 │ DOD │ bare DOD │ inspect │
38.35 s
> ├───────┼──────┼───────────┼───────┼─────┼──────────┼─────────┤
38.35 s
> │ {} │ {e1} │ -0.989949 │ 1.000 │ -1 │ 0 │ │
38.35 s
> ╰───────┴──────┴───────────┴───────┴─────┴──────────┴─────────╯
38.35 s
> left: 1
38.35 s
> right: 0
38.35 s
> Location: crates/gammalooprs/src/uv/tests.rs:325
38.35 s
>
38.35 s
> ━━━━━━━━━━━━━━━━━━━━━━━━━━━━━━━━━━ BACKTRACE ━━━━━━━━━━━━━━━━━━━━━━━━━━━━━━━━━━━
38.35 s
> 1: <color_eyre[51793ea62743adbd]::config::PanicHook>::panic_report<unknown>
38.35 s
> at <unknown source file>:<unknown line>
38.35 s
> 2: <color_eyre[51793ea62743adbd]::config::PanicHook>::into_panic_hook::{closure#0}<unknown>
38.35 s
> at <unknown source file>:<unknown line>
38.35 s
> 3: std[bcb96dfbba0ab899]::panicking::panic_with_hook<unknown>
38.35 s
> at <unknown source file>:<unknown line>
38.35 s
> 4: std[bcb96dfbba0ab899]::panicking::panic_handler::{closure#0}<unknown>
38.35 s
> at <unknown source file>:<unknown line>
38.35 s
> 5: std[bcb96dfbba0ab899]::sys::backtrace::__rust_end_short_backtrace::<std[bcb96dfbba0ab899]::panicking::panic_handler::{closure#0}, !><unknown>
38.35 s
> at <unknown source file>:<unknown line>
38.35 s
> 6: __rustc[6c289b9f9c454d21]::rust_begin_unwind<unknown>
38.35 s
> at <unknown source file>:<unknown line>
38.35 s
> 7: core[940e698046960fd5]::panicking::panic_fmt<unknown>
38.35 s
> at <unknown source file>:<unknown line>
38.35 s
> 8: core[940e698046960fd5]::panicking::assert_failed_inner<unknown>
38.35 s
> at <unknown source file>:<unknown line>
38.35 s
> 9: core[940e698046960fd5]::panicking::assert_failed::<usize, usize><unknown>
38.35 s
> at <unknown source file>:<unknown line>
38.35 s
> 10: gammalooprs[972dff90865981f6]::uv::tests::scalars_profile_new<unknown>
38.35 s
> at <unknown source file>:<unknown line>
38.35 s
> 11: <gammalooprs[972dff90865981f6]::uv::tests::scalars_profile_new::{closure#0} as core[940e698046960fd5]::ops::function::FnOnce<()>>::call_once<unknown>
38.35 s
> at <unknown source file>:<unknown line>
38.35 s
> 12: test[75d6903177b1d7e9]::__rust_begin_short_backtrace::<core[940e698046960fd5]::result::Result<(), alloc[2ea6bcb46fca0c42]::string::String>, fn() -> core[940e698046960fd5]::result::Result<(), alloc[2ea6bcb46fca0c42]::string::String>><unknown>
38.35 s
> at <unknown source file>:<unknown line>
38.35 s
> 13: test[75d6903177b1d7e9]::run_test::{closure#0}<unknown>
38.35 s
> at <unknown source file>:<unknown line>
38.35 s
> 14: std[bcb96dfbba0ab899]::sys::backtrace::__rust_begin_short_backtrace::<test[75d6903177b1d7e9]::run_test::{closure#1}, ()><unknown>
38.35 s
> at <unknown source file>:<unknown line>
38.35 s
> ... omitted 11 more lines; see full nextest output above
38.35 s
>
38.35 s
> 5. gammalooprs::uv::tests::scalars_profile
38.35 s
> failure: test failure with exit code 101
38.35 s
> system-out
38.35 s
> running 1 test
38.35 s
> test uv::tests::scalars_profile ... FAILED
38.35 s
>
38.35 s
> failures:
38.35 s
>
38.35 s
> failures:
38.35 s
> uv::tests::scalars_profile
38.35 s
>
38.35 s
> test result: FAILED. 0 passed; 1 failed; 0 ignored; 0 measured; 611 filtered out; finished in 10.32s
38.35 s
> system-err
38.35 s
> [18:18:39.434] @gammalooprs::settings::runtime WARNING : No external kinematics were provided; using default-generated external momenta and helicities.
38.35 s
> field value
38.35 s
> span build_integrand{amplitude.name=bub}
38.35 s
> at crates/gammalooprs/src/settings/runtime.rs:131
38.35 s
> [18:18:39.435] @gammalooprs::integrands::process::amplitude INFO : Input is below threshold: 0 existing threshold E-surfaces across 0/3 graph groups
38.35 s
> field value
38.35 s
> existing_esurfaces 0
38.35 s
> group_count 3
38.35 s
> groups_above_threshold 0
38.35 s
> integrand bub
38.35 s
> span warm_up{integrand.name=bub}
38.35 s
> threshold_status below threshold
38.35 s
> at crates/gammalooprs/src/integrands/process/amplitude/mod.rs:1666
38.35 s
> [18:18:39.435] @gammalooprs::integrands::process::amplitude INFO : overlap structure of group 0: [0: []]
38.35 s
> field value
38.35 s
> span warm_up{integrand.name=bub}
38.35 s
> at crates/gammalooprs/src/integrands/process/amplitude/mod.rs:2015
38.35 s
> [18:18:39.435] @gammalooprs::integrands::process::amplitude INFO : overlap structure of group 1: [0: []]
38.35 s
> field value
38.35 s
> span warm_up{integrand.name=bub}
38.35 s
> at crates/gammalooprs/src/integrands/process/amplitude/mod.rs:2015
38.35 s
> [18:18:39.435] @gammalooprs::integrands::process::amplitude INFO : overlap structure of group 2: [0: []]
38.35 s
> field value
38.35 s
> span warm_up{integrand.name=bub}
38.35 s
> at crates/gammalooprs/src/integrands/process/amplitude/mod.rs:2015
38.35 s
> The application panicked (crashed).
38.35 s
> Message: assertion `left == right` failed: subtracted scalar UV profile failed:
38.35 s
> UVProfilePassFail {
38.35 s
> max_dod: -0.9,
38.35 s
> total: 16,
38.35 s
> failed: 1,
38.35 s
> failures: [
38.35 s
> UVProfileFailure {
38.35 s
> graph_index: 0,
38.35 s
> graph_name: "banana",
38.35 s
> cutkosky_cut: None,
38.35 s
> lmb_index: 1,
38.35 s
> fixed: [
38.35 s
> EdgeIndex(
38.35 s
> 2,
38.35 s
> ),
38.35 s
> EdgeIndex(
38.35 s
> 0,
38.35 s
> ),
38.35 s
> ],
38.35 s
> free: [
38.35 s
> EdgeIndex(
38.35 s
> 3,
38.35 s
> ),
38.35 s
> ],
38.35 s
> orientation_label: None,
38.35 s
> reason: "dod_exceeds_threshold",
38.35 s
> },
38.35 s
> ],
38.35 s
> }
38.35 s
>
38.35 s
> ╭─────────┬────────────┬───────────┬───────┬─────┬──────────┬───────────╮
38.35 s
> │ fixed │ → ∞ │ slope │ r2 │ DOD │ bare DOD │ inspect │
38.35 s
> ├─────────┼────────────┼───────────┼───────┼─────┼──────────┼───────────┤
38.35 s
> │ {e1,e2} │ {e3} │ -0.996752 │ 1.000 │ -1 │ 0 │ arb retry │
38.35 s
> │ {e1,e3} │ {e2} │ -1.065665 │ 0.997 │ -1 │ 0 │ arb retry │
38.35 s
> │ {e1} │ {e2,e3} │ -0.937151 │ 0.943 │ -1 │ 2 │ │
38.35 s
> │ {e2,e3} │ {e1} │ -1.001075 │ 1.000 │ -1 │ 0 │ arb retry │
38.35 s
> │ {e2} │ {e1,e3} │ -0.984146 │ 0.998 │ -1 │ 2 │ │
38.35 s
> │ {e3} │ {e1,e2} │ -1.383911 │ 0.982 │ -1 │ 2 │ arb retry │
38.35 s
> │ {} │ {e1,e2,e3} │ -1.094213 │ 0.258 │ -1 │ 4 │ │
38.35 s
> │ {e2,e0} │ {e3} │ -0.803348 │ 0.861 │ -1 │ 0 │ arb retry │
38.35 s
> │ {e3,e0} │ {e2} │ -0.999257 │ 1.000 │ -1 │ 0 │ │
38.35 s
> │ {e0} │ {e2,e3} │ -1.000893 │ 1.000 │ -1 │ 2 │ │
38.35 s
> │ {e1,e0} │ {e3} │ -0.997860 │ 1.000 │ -1 │ 0 │ │
38.35 s
> ╰─────────┴────────────┴───────────┴───────┴─────┴──────────┴───────────╯
38.35 s
>
38.35 s
> ╭───────┬─────────┬───────────┬───────┬─────┬──────────┬───────────╮
38.35 s
> │ fixed │ → ∞ │ slope │ r2 │ DOD │ bare DOD │ inspect │
38.35 s
> ├───────┼─────────┼───────────┼───────┼─────┼──────────┼───────────┤
38.35 s
> │ {e1} │ {e2} │ -1.005039 │ 1.000 │ -1 │ 0 │ arb retry │
38.35 s
> │ {e2} │ {e1} │ -1.001098 │ 1.000 │ -1 │ 0 │ arb retry │
38.35 s
> │ {} │ {e1,e2} │ -1.011289 │ 1.000 │ -1 │ 2 │ │
38.35 s
> │ {e0} │ {e2} │ -0.998140 │ 1.000 │ -1 │ 0 │ │
38.35 s
> ╰───────┴─────────┴───────────┴───────┴─────┴──────────┴───────────╯
38.35 s
>
38.35 s
> ╭───────┬──────┬───────────┬───────┬─────┬──────────┬─────────╮
38.35 s
> │ fixed │ → ∞ │ slope │ r2 │ DOD │ bare DOD │ inspect │
38.35 s
> ├───────┼──────┼───────────┼───────┼─────┼──────────┼─────────┤
38.35 s
> │ {} │ {e1} │ -0.989949 │ 1.000 │ -1 │ 0 │ │
38.35 s
> ╰───────┴──────┴───────────┴───────┴─────┴──────────┴─────────╯
38.35 s
> left: 1
38.35 s
> right: 0
38.35 s
> Location: crates/gammalooprs/src/uv/tests.rs:259
38.35 s
>
38.35 s
> ━━━━━━━━━━━━━━━━━━━━━━━━━━━━━━━━━━ BACKTRACE ━━━━━━━━━━━━━━━━━━━━━━━━━━━━━━━━━━━
38.35 s
> 1: <color_eyre[51793ea62743adbd]::config::PanicHook>::panic_report<unknown>
38.35 s
> at <unknown source file>:<unknown line>
38.35 s
> 2: <color_eyre[51793ea62743adbd]::config::PanicHook>::into_panic_hook::{closure#0}<unknown>
38.35 s
> at <unknown source file>:<unknown line>
38.35 s
> 3: std[bcb96dfbba0ab899]::panicking::panic_with_hook<unknown>
38.35 s
> at <unknown source file>:<unknown line>
38.35 s
> 4: std[bcb96dfbba0ab899]::panicking::panic_handler::{closure#0}<unknown>
38.35 s
> at <unknown source file>:<unknown line>
38.35 s
> 5: std[bcb96dfbba0ab899]::sys::backtrace::__rust_end_short_backtrace::<std[bcb96dfbba0ab899]::panicking::panic_handler::{closure#0}, !><unknown>
38.35 s
> at <unknown source file>:<unknown line>
38.35 s
> 6: __rustc[6c289b9f9c454d21]::rust_begin_unwind<unknown>
38.35 s
> at <unknown source file>:<unknown line>
38.35 s
> 7: core[940e698046960fd5]::panicking::panic_fmt<unknown>
38.35 s
> at <unknown source file>:<unknown line>
38.35 s
> 8: core[940e698046960fd5]::panicking::assert_failed_inner<unknown>
38.35 s
> at <unknown source file>:<unknown line>
38.35 s
> 9: core[940e698046960fd5]::panicking::assert_failed::<usize, usize><unknown>
38.35 s
> at <unknown source file>:<unknown line>
38.35 s
> 10: gammalooprs[972dff90865981f6]::uv::tests::scalars_profile<unknown>
38.35 s
> at <unknown source file>:<unknown line>
38.35 s
> 11: <gammalooprs[972dff90865981f6]::uv::tests::scalars_profile::{closure#0} as core[940e698046960fd5]::ops::function::FnOnce<()>>::call_once<unknown>
38.35 s
> at <unknown source file>:<unknown line>
38.35 s
> 12: test[75d6903177b1d7e9]::__rust_begin_short_backtrace::<core[940e698046960fd5]::result::Result<(), alloc[2ea6bcb46fca0c42]::string::String>, fn() -> core[940e698046960fd5]::result::Result<(), alloc[2ea6bcb46fca0c42]::string::String>><unknown>
38.35 s
> at <unknown source file>:<unknown line>
38.35 s
> 13: test[75d6903177b1d7e9]::run_test::{closure#0}<unknown>
38.35 s
> at <unknown source file>:<unknown line>
38.35 s
> 14: std[bcb96dfbba0ab899]::sys::backtrace::__rust_begin_short_backtrace::<test[75d6903177b1d7e9]::run_test::{closure#1}, ()><unknown>
38.35 s
> at <unknown source file>:<unknown line>
38.35 s
> ... omitted 11 more lines; see full nextest output above
38.35 s
> =========================================
38.35 s
> Extracting 1 binary, 1 build script output directory, and 1 linked path to /build/nextest-archive-5ht6Sg
38.35 s
> Extracted 7 files to /build/nextest-archive-5ht6Sg in 0.07s
38.35 s
> ------------
38.35 s
> Nextest run ID 149eb2b5-8c00-4cf9-80d5-707c96f72c12 with nextest profile: ci_gammaloop
38.35 s
> Starting 54 tests across 1 binary
38.35 s
> ------------
38.35 s
> Summary [ 0.317s] 54 tests run: 54 passed , 0 skipped
38.35 s
>
38.35 s
> ========== nextest test summary ==========
38.35 s
> report: target/nextest/ci_gammaloop/junit.xml
38.35 s
> tests: 54, failures: 0, errors: 0
38.35 s
> No failing testcases found.
38.35 s
> =========================================
38.35 s
For full logs, run:
38.35 s
nix log /nix/store/xmqryc6f4382yn38pvqdg8lk2i1rvwkl-gammaloop-nextest-core.drv
38.47 s
Run failed.