test packages.x86_64-linux.nix-ci-check-gammaloop-nextest-core

Reproduce this run
Original Run
  1. 37.73 s gammaloop-nextest-core> Run with RUST_BACKTRACE=full to include source snippets.
  2. 37.73 s gammaloop-nextest-core>
  3. 37.73 s gammaloop-nextest-core> FAIL [ 0.224s] (525/561) gammalooprs uv::hedge_poset::tests::spectacles_typed_4d_projects_after_local_construction
  4. 37.73 s gammaloop-nextest-core> stdout ---
  5. 37.73 s gammaloop-nextest-core>
  6. 37.73 s gammaloop-nextest-core> running 1 test
  7. 37.73 s gammaloop-nextest-core> digraph {
  8. 37.73 s gammaloop-nextest-core> node [shape=circle,height=0.1,label=""];
  9. 37.73 s gammaloop-nextest-core> overlap = "scale";
  10. 37.73 s gammaloop-nextest-core> layout = "neato";
  11. 37.73 s gammaloop-nextest-core> start=2;
  12. 37.73 s gammaloop-nextest-core> 4 [label="0"];
  13. 37.73 s gammaloop-nextest-core> 1 [label="zw"];
  14. 37.73 s gammaloop-nextest-core> 2 [label="F"];
  15. 37.73 s gammaloop-nextest-core> 0 [label="143"];
  16. 37.73 s gammaloop-nextest-core> 3 [label="10B"];
  17. 37.73 s gammaloop-nextest-core> 4:0:s -> 1:1:s [id=0 color="red:blue;0.5" label="zw"];
  18. 37.73 s gammaloop-nextest-core> 4:2:s -> 2:3:s [id=1 color="red:blue;0.5" label="F"];
  19. 37.73 s gammaloop-nextest-core> 3:5:s -> 0:4:s [id=2 color="red:blue;0.5" label="143"];
  20. 37.73 s gammaloop-nextest-core> 4:6:s -> 0:7:s [id=3 color="red:blue;0.5" label="143"];
  21. 37.73 s gammaloop-nextest-core> 1:8:s -> 3:9:s [id=4 color="red:blue;0.5" label="F"];
  22. 37.73 s gammaloop-nextest-core> 1:10:s -> 0:11:s [id=5 color="red:blue;0.5" label="143"];
  23. 37.73 s gammaloop-nextest-core> 2:12:s -> 3:13:s [id=6 color="red:blue;0.5" label="zw"];
  24. 37.73 s gammaloop-nextest-core> 2:14:s -> 0:15:s [id=7 color="red:blue;0.5" label="143"];
  25. 37.73 s gammaloop-nextest-core> }
  26. 37.73 s gammaloop-nextest-core>
  27. 37.73 s gammaloop-nextest-core> digraph {
  28. 37.73 s gammaloop-nextest-core> node [shape=circle,height=0.1,label=""];
  29. 37.73 s gammaloop-nextest-core> overlap = "scale";
  30. 37.73 s gammaloop-nextest-core> layout = "neato";
  31. 37.73 s gammaloop-nextest-core> start=2;
  32. 37.73 s gammaloop-nextest-core> 0 [label="∅"];
  33. 37.73 s gammaloop-nextest-core> 1 [label="{zw}: Approx(S_zw(0))"];
  34. 37.73 s gammaloop-nextest-core> 2 [label="{F}: Approx(S_F(1))"];
  35. 37.73 s gammaloop-nextest-core> 3 [label="{143}: Approx(S_143(3))"];
  36. 37.73 s gammaloop-nextest-core> 4 [label="{zw,F}: Approx(S_F(4))*Approx(S_zw(0))"];
  37. 37.73 s gammaloop-nextest-core> 5 [label="{zw} · {143}: Approx((-1*S_zw+S_143(5))*Approx(S_zw(0)))"];
  38. 37.73 s gammaloop-nextest-core> 6 [label="{F} · {143}: Approx((-1*S_F+S_143(7))*Approx(S_F(1)))"];
  39. 37.73 s gammaloop-nextest-core> 7 [label="{zw,F} · {143}: Approx((-1*S_10B+S_143(2))*Approx(S_F(4))*Approx(S_zw(0)))"];
  40. 37.73 s gammaloop-nextest-core> 0:0:s -> 1:1:s [id=0 color="red:blue;0.5"];
  41. 37.73 s gammaloop-nextest-core> 0:2:s -> 2:3:s [id=1 color="red:blue;0.5"];
  42. 37.73 s gammaloop-nextest-core> 0:4:s -> 3:5:s [id=2 color="red:blue;0.5"];
  43. 37.73 s gammaloop-nextest-core> 1:6:s -> 4:7:s [id=3 color="red:blue;0.5"];
  44. 37.73 s gammaloop-nextest-core> 1:8:s -> 5:9:s [id=4 color="red:blue;0.5"];
  45. 37.73 s gammaloop-nextest-core> 2:10:s -> 4:11:s [id=5 color="red:blue;0.5"];
  46. 37.73 s gammaloop-nextest-core> 2:12:s -> 6:13:s [id=6 color="red:blue;0.5"];
  47. 37.73 s gammaloop-nextest-core> 4:14:s -> 7:15:s [id=7 color="red:blue;0.5"];
  48. 37.73 s gammaloop-nextest-core> }
  49. 37.73 s gammaloop-nextest-core>
  50. 37.73 s gammaloop-nextest-core> test uv::hedge_poset::tests::spectacles_typed_4d_projects_after_local_construction ... FAILED
  51. 37.73 s gammaloop-nextest-core>
  52. 37.73 s gammaloop-nextest-core> failures:
  53. 37.73 s gammaloop-nextest-core>
  54. 37.73 s gammaloop-nextest-core> failures:
  55. 37.73 s gammaloop-nextest-core> uv::hedge_poset::tests::spectacles_typed_4d_projects_after_local_construction
  56. 37.73 s gammaloop-nextest-core>
  57. 37.73 s gammaloop-nextest-core> test result: FAILED. 0 passed; 1 failed; 0 ignored; 0 measured; 611 filtered out; finished in 0.20s
  58. 37.73 s gammaloop-nextest-core>
  59. 37.73 s gammaloop-nextest-core> stderr ---
  60. 37.73 s gammaloop-nextest-core> Error:
  61. 37.73 s gammaloop-nextest-core> 0: failed to extract three-dimensional representation graph input: source edge 1 has no unique routing for rewritten exact signature [-1, 0, 0] modulo the factorized opposite-domain loop span
  62. 37.73 s gammaloop-nextest-core>
  63. 37.73 s gammaloop-nextest-core> Location:
  64. 37.73 s gammaloop-nextest-core> crates/gammalooprs/src/uv/approx/local_3d.rs:845
  65. 37.73 s gammaloop-nextest-core>
  66. 37.73 s gammaloop-nextest-core> ━━━━━━━━━━━━━━━━━━━━━━━━━━━━━━━━━━ BACKTRACE ━━━━━━━━━━━━━━━━━━━━━━━━━━━━━━━━━━━
  67. 37.73 s gammaloop-nextest-core> 1: <color_eyre[51793ea62743adbd]::config::EyreHook>::into_eyre_hook::{closure#0}<unknown>
  68. 37.73 s gammaloop-nextest-core> at <unknown source file>:<unknown line>
  69. 37.73 s gammaloop-nextest-core> 2: eyre[cb2fd339c0c40fca]::capture_handler<unknown>
  70. 37.73 s gammaloop-nextest-core> at <unknown source file>:<unknown line>
  71. 37.73 s gammaloop-nextest-core> 3: <eyre[cb2fd339c0c40fca]::Report>::from_std::<three_dimensional_reps[3cb572ff22d197ac]::graph_io::GraphIoError><unknown>
  72. 37.73 s gammaloop-nextest-core> at <unknown source file>:<unknown line>
  73. 37.73 s gammaloop-nextest-core> 4: <gammalooprs[972dff90865981f6]::uv::approx::local_3d::Localizer>::project_4d<unknown>
  74. 37.73 s gammaloop-nextest-core> at <unknown source file>:<unknown line>
  75. 37.73 s gammaloop-nextest-core> 5: gammalooprs[972dff90865981f6]::uv::hedge_poset::tests::spectacles_typed_4d_projects_after_local_construction<unknown>
  76. 37.73 s gammaloop-nextest-core> at <unknown source file>:<unknown line>
  77. 37.73 s gammaloop-nextest-core> 6: <gammalooprs[972dff90865981f6]::uv::hedge_poset::tests::spectacles_typed_4d_projects_after_local_construction::{closure#0} as core[940e698046960fd5]::ops::function::FnOnce<()>>::call_once<unknown>
  78. 37.73 s gammaloop-nextest-core> at <unknown source file>:<unknown line>
  79. 37.73 s gammaloop-nextest-core> 7: test[75d6903177b1d7e9]::__rust_begin_short_backtrace::<core[940e698046960fd5]::result::Result<(), alloc[2ea6bcb46fca0c42]::string::String>, fn() -> core[940e698046960fd5]::result::Result<(), alloc[2ea6bcb46fca0c42]::string::String>><unknown>
  80. 37.73 s gammaloop-nextest-core> at <unknown source file>:<unknown line>
  81. 37.73 s gammaloop-nextest-core> 8: test[75d6903177b1d7e9]::run_test::{closure#0}<unknown>
  82. 37.73 s gammaloop-nextest-core> at <unknown source file>:<unknown line>
  83. 37.73 s gammaloop-nextest-core> 9: std[bcb96dfbba0ab899]::sys::backtrace::__rust_begin_short_backtrace::<test[75d6903177b1d7e9]::run_test::{closure#1}, ()><unknown>
  84. 37.73 s gammaloop-nextest-core> at <unknown source file>:<unknown line>
  85. 37.73 s gammaloop-nextest-core> 10: <std[bcb96dfbba0ab899]::thread::lifecycle::spawn_unchecked<test[75d6903177b1d7e9]::run_test::{closure#1}, ()>::{closure#1} as core[940e698046960fd5]::ops::function::FnOnce<()>>::call_once::{shim:vtable#0}<unknown>
  86. 37.73 s gammaloop-nextest-core> at <unknown source file>:<unknown line>
  87. 37.73 s gammaloop-nextest-core> 11: <std[bcb96dfbba0ab899]::sys::thread::unix::Thread>::new::thread_start<unknown>
  88. 37.73 s gammaloop-nextest-core> at <unknown source file>:<unknown line>
  89. 37.73 s gammaloop-nextest-core> 12: start_thread<unknown>
  90. 37.73 s gammaloop-nextest-core> at <unknown source file>:<unknown line>
  91. 37.73 s gammaloop-nextest-core> 13: __clone3<unknown>
  92. 37.73 s gammaloop-nextest-core> at <unknown source file>:<unknown line>
  93. 37.73 s gammaloop-nextest-core>
  94. 37.73 s gammaloop-nextest-core> Run with COLORBT_SHOW_HIDDEN=1 environment variable to disable frame filtering.
  95. 37.73 s gammaloop-nextest-core> Run with RUST_BACKTRACE=full to include source snippets.
  96. 37.73 s gammaloop-nextest-core>
  97. 37.73 s gammaloop-nextest-core> FAIL [ 10.328s] (559/561) gammalooprs uv::tests::scalars_profile_new
  98. 37.73 s gammaloop-nextest-core> stdout ---
  99. 37.73 s gammaloop-nextest-core>
  100. 37.73 s gammaloop-nextest-core> running 1 test
  101. 37.73 s gammaloop-nextest-core> test uv::tests::scalars_profile_new ... FAILED
  102. 37.73 s gammaloop-nextest-core>
  103. 37.73 s gammaloop-nextest-core> failures:
  104. 37.73 s gammaloop-nextest-core>
  105. 37.73 s gammaloop-nextest-core> failures:
  106. 37.73 s gammaloop-nextest-core> uv::tests::scalars_profile_new
  107. 37.73 s gammaloop-nextest-core>
  108. 37.73 s gammaloop-nextest-core> test result: FAILED. 0 passed; 1 failed; 0 ignored; 0 measured; 611 filtered out; finished in 10.30s
  109. 37.73 s gammaloop-nextest-core>
  110. 37.73 s gammaloop-nextest-core> stderr ---
  111. 37.73 s gammaloop-nextest-core> [18:18:39.444] @gammalooprs::settings::runtime WARNING : No external kinematics were provided; using default-generated external momenta and helicities.
  112. 37.73 s gammaloop-nextest-core> field value
  113. 37.73 s gammaloop-nextest-core> span build_integrand{amplitude.name=bub}
  114. 37.73 s gammaloop-nextest-core> at crates/gammalooprs/src/settings/runtime.rs:131
  115. 37.73 s gammaloop-nextest-core> [18:18:39.445] @gammalooprs::integrands::process::amplitude INFO : Input is below threshold: 0 existing threshold E-surfaces across 0/3 graph groups
  116. 37.73 s gammaloop-nextest-core> field value
  117. 37.73 s gammaloop-nextest-core> existing_esurfaces 0
  118. 37.73 s gammaloop-nextest-core> group_count 3
  119. 37.73 s gammaloop-nextest-core> groups_above_threshold 0
  120. 37.73 s gammaloop-nextest-core> integrand bub
  121. 37.73 s gammaloop-nextest-core> span warm_up{integrand.name=bub}
  122. 37.73 s gammaloop-nextest-core> threshold_status below threshold
  123. 37.73 s gammaloop-nextest-core> at crates/gammalooprs/src/integrands/process/amplitude/mod.rs:1666
  124. 37.73 s gammaloop-nextest-core> [18:18:39.445] @gammalooprs::integrands::process::amplitude INFO : overlap structure of group 0: [0: []]
  125. 37.73 s gammaloop-nextest-core> field value
  126. 37.73 s gammaloop-nextest-core> span warm_up{integrand.name=bub}
  127. 37.73 s gammaloop-nextest-core> at crates/gammalooprs/src/integrands/process/amplitude/mod.rs:2015
  128. 37.73 s gammaloop-nextest-core> [18:18:39.445] @gammalooprs::integrands::process::amplitude INFO : overlap structure of group 1: [0: []]
  129. 37.73 s gammaloop-nextest-core> field value
  130. 37.73 s gammaloop-nextest-core> span warm_up{integrand.name=bub}
  131. 37.73 s gammaloop-nextest-core> at crates/gammalooprs/src/integrands/process/amplitude/mod.rs:2015
  132. 37.73 s gammaloop-nextest-core> [18:18:39.445] @gammalooprs::integrands::process::amplitude INFO : overlap structure of group 2: [0: []]
  133. 37.73 s gammaloop-nextest-core> field value
  134. 37.73 s gammaloop-nextest-core> span warm_up{integrand.name=bub}
  135. 37.73 s gammaloop-nextest-core> at crates/gammalooprs/src/integrands/process/amplitude/mod.rs:2015
  136. 37.73 s gammaloop-nextest-core> The application panicked (crashed).
  137. 37.73 s gammaloop-nextest-core> Message: assertion `left == right` failed: subtracted scalar UV profile failed:
  138. 37.73 s gammaloop-nextest-core> UVProfilePassFail {
  139. 37.73 s gammaloop-nextest-core> max_dod: -0.9,
  140. 37.73 s gammaloop-nextest-core> total: 16,
  141. 37.73 s gammaloop-nextest-core> failed: 1,
  142. 37.73 s gammaloop-nextest-core> failures: [
  143. 37.73 s gammaloop-nextest-core> UVProfileFailure {
  144. 37.73 s gammaloop-nextest-core> graph_index: 0,
  145. 37.73 s gammaloop-nextest-core> graph_name: "banana",
  146. 37.73 s gammaloop-nextest-core> cutkosky_cut: None,
  147. 37.73 s gammaloop-nextest-core> lmb_index: 1,
  148. 37.73 s gammaloop-nextest-core> fixed: [
  149. 37.73 s gammaloop-nextest-core> EdgeIndex(
  150. 37.73 s gammaloop-nextest-core> 2,
  151. 37.73 s gammaloop-nextest-core> ),
  152. 37.73 s gammaloop-nextest-core> EdgeIndex(
  153. 37.73 s gammaloop-nextest-core> 0,
  154. 37.73 s gammaloop-nextest-core> ),
  155. 37.73 s gammaloop-nextest-core> ],
  156. 37.73 s gammaloop-nextest-core> free: [
  157. 37.73 s gammaloop-nextest-core> EdgeIndex(
  158. 37.73 s gammaloop-nextest-core> 3,
  159. 37.73 s gammaloop-nextest-core> ),
  160. 37.73 s gammaloop-nextest-core> ],
  161. 37.73 s gammaloop-nextest-core> orientation_label: None,
  162. 37.73 s gammaloop-nextest-core> reason: "dod_exceeds_threshold",
  163. 37.73 s gammaloop-nextest-core> },
  164. 37.73 s gammaloop-nextest-core> ],
  165. 37.73 s gammaloop-nextest-core> }
  166. 37.73 s gammaloop-nextest-core>
  167. 37.73 s gammaloop-nextest-core> ╭─────────┬────────────┬───────────┬───────┬─────┬──────────┬───────────╮
  168. 37.73 s gammaloop-nextest-core> │ fixed │ → ∞ │ slope │ r2 │ DOD │ bare DOD │ inspect │
  169. 37.73 s gammaloop-nextest-core> ├─────────┼────────────┼───────────┼───────┼─────┼──────────┼───────────┤
  170. 37.73 s gammaloop-nextest-core> │ {e1,e2} │ {e3} │ -0.996752 │ 1.000 │ -1 │ 0 │ arb retry │
  171. 37.73 s gammaloop-nextest-core> │ {e1,e3} │ {e2} │ -1.065665 │ 0.997 │ -1 │ 0 │ arb retry │
  172. 37.73 s gammaloop-nextest-core> │ {e1} │ {e2,e3} │ -0.937151 │ 0.943 │ -1 │ 2 │ │
  173. 37.73 s gammaloop-nextest-core> │ {e2,e3} │ {e1} │ -1.001075 │ 1.000 │ -1 │ 0 │ arb retry │
  174. 37.73 s gammaloop-nextest-core> │ {e2} │ {e1,e3} │ -0.984146 │ 0.998 │ -1 │ 2 │ │
  175. 37.73 s gammaloop-nextest-core> │ {e3} │ {e1,e2} │ -1.383911 │ 0.982 │ -1 │ 2 │ arb retry │
  176. 37.73 s gammaloop-nextest-core> │ {} │ {e1,e2,e3} │ -1.094213 │ 0.258 │ -1 │ 4 │ │
  177. 37.73 s gammaloop-nextest-core> │ {e2,e0} │ {e3} │ -0.803348 │ 0.861 │ -1 │ 0 │ arb retry │
  178. 37.73 s gammaloop-nextest-core> │ {e3,e0} │ {e2} │ -0.999257 │ 1.000 │ -1 │ 0 │ │
  179. 37.73 s gammaloop-nextest-core> │ {e0} │ {e2,e3} │ -1.000893 │ 1.000 │ -1 │ 2 │ │
  180. 37.73 s gammaloop-nextest-core> │ {e1,e0} │ {e3} │ -0.997860 │ 1.000 │ -1 │ 0 │ │
  181. 37.73 s gammaloop-nextest-core> ╰─────────┴────────────┴───────────┴───────┴─────┴──────────┴───────────╯
  182. 37.73 s gammaloop-nextest-core>
  183. 37.73 s gammaloop-nextest-core> ╭───────┬─────────┬───────────┬───────┬─────┬──────────┬───────────╮
  184. 37.73 s gammaloop-nextest-core> │ fixed │ → ∞ │ slope │ r2 │ DOD │ bare DOD │ inspect │
  185. 37.73 s gammaloop-nextest-core> ├───────┼─────────┼───────────┼───────┼─────┼──────────┼───────────┤
  186. 37.73 s gammaloop-nextest-core> │ {e1} │ {e2} │ -1.005039 │ 1.000 │ -1 │ 0 │ arb retry │
  187. 37.73 s gammaloop-nextest-core> │ {e2} │ {e1} │ -1.001098 │ 1.000 │ -1 │ 0 │ arb retry │
  188. 37.73 s gammaloop-nextest-core> │ {} │ {e1,e2} │ -1.011289 │ 1.000 │ -1 │ 2 │ │
  189. 37.73 s gammaloop-nextest-core> │ {e0} │ {e2} │ -0.998140 │ 1.000 │ -1 │ 0 │ │
  190. 37.73 s gammaloop-nextest-core> ╰───────┴─────────┴───────────┴───────┴─────┴──────────┴───────────╯
  191. 37.73 s gammaloop-nextest-core>
  192. 37.73 s gammaloop-nextest-core> ╭───────┬──────┬───────────┬───────┬─────┬──────────┬─────────╮
  193. 37.73 s gammaloop-nextest-core> │ fixed │ → ∞ │ slope │ r2 │ DOD │ bare DOD │ inspect │
  194. 37.73 s gammaloop-nextest-core> ├───────┼──────┼───────────┼───────┼─────┼──────────┼─────────┤
  195. 37.73 s gammaloop-nextest-core> │ {} │ {e1} │ -0.989949 │ 1.000 │ -1 │ 0 │ │
  196. 37.73 s gammaloop-nextest-core> ╰───────┴──────┴───────────┴───────┴─────┴──────────┴─────────╯
  197. 37.73 s gammaloop-nextest-core> left: 1
  198. 37.73 s gammaloop-nextest-core> right: 0
  199. 37.73 s gammaloop-nextest-core> Location: crates/gammalooprs/src/uv/tests.rs:325
  200. 37.73 s gammaloop-nextest-core>
  201. 37.73 s gammaloop-nextest-core> ━━━━━━━━━━━━━━━━━━━━━━━━━━━━━━━━━━ BACKTRACE ━━━━━━━━━━━━━━━━━━━━━━━━━━━━━━━━━━━
  202. 37.73 s gammaloop-nextest-core> 1: <color_eyre[51793ea62743adbd]::config::PanicHook>::panic_report<unknown>
  203. 37.73 s gammaloop-nextest-core> at <unknown source file>:<unknown line>
  204. 37.73 s gammaloop-nextest-core> 2: <color_eyre[51793ea62743adbd]::config::PanicHook>::into_panic_hook::{closure#0}<unknown>
  205. 37.73 s gammaloop-nextest-core> at <unknown source file>:<unknown line>
  206. 37.73 s gammaloop-nextest-core> 3: std[bcb96dfbba0ab899]::panicking::panic_with_hook<unknown>
  207. 37.73 s gammaloop-nextest-core> at <unknown source file>:<unknown line>
  208. 37.73 s gammaloop-nextest-core> 4: std[bcb96dfbba0ab899]::panicking::panic_handler::{closure#0}<unknown>
  209. 37.73 s gammaloop-nextest-core> at <unknown source file>:<unknown line>
  210. 37.73 s gammaloop-nextest-core> 5: std[bcb96dfbba0ab899]::sys::backtrace::__rust_end_short_backtrace::<std[bcb96dfbba0ab899]::panicking::panic_handler::{closure#0}, !><unknown>
  211. 37.73 s gammaloop-nextest-core> at <unknown source file>:<unknown line>
  212. 37.73 s gammaloop-nextest-core> 6: __rustc[6c289b9f9c454d21]::rust_begin_unwind<unknown>
  213. 37.73 s gammaloop-nextest-core> at <unknown source file>:<unknown line>
  214. 37.73 s gammaloop-nextest-core> 7: core[940e698046960fd5]::panicking::panic_fmt<unknown>
  215. 37.73 s gammaloop-nextest-core> at <unknown source file>:<unknown line>
  216. 37.73 s gammaloop-nextest-core> 8: core[940e698046960fd5]::panicking::assert_failed_inner<unknown>
  217. 37.73 s gammaloop-nextest-core> at <unknown source file>:<unknown line>
  218. 37.73 s gammaloop-nextest-core> 9: core[940e698046960fd5]::panicking::assert_failed::<usize, usize><unknown>
  219. 37.73 s gammaloop-nextest-core> at <unknown source file>:<unknown line>
  220. 37.73 s gammaloop-nextest-core> 10: gammalooprs[972dff90865981f6]::uv::tests::scalars_profile_new<unknown>
  221. 37.73 s gammaloop-nextest-core> at <unknown source file>:<unknown line>
  222. 37.73 s gammaloop-nextest-core> 11: <gammalooprs[972dff90865981f6]::uv::tests::scalars_profile_new::{closure#0} as core[940e698046960fd5]::ops::function::FnOnce<()>>::call_once<unknown>
  223. 37.73 s gammaloop-nextest-core> at <unknown source file>:<unknown line>
  224. 37.73 s gammaloop-nextest-core> 12: test[75d6903177b1d7e9]::__rust_begin_short_backtrace::<core[940e698046960fd5]::result::Result<(), alloc[2ea6bcb46fca0c42]::string::String>, fn() -> core[940e698046960fd5]::result::Result<(), alloc[2ea6bcb46fca0c42]::string::String>><unknown>
  225. 37.73 s gammaloop-nextest-core> at <unknown source file>:<unknown line>
  226. 37.73 s gammaloop-nextest-core> 13: test[75d6903177b1d7e9]::run_test::{closure#0}<unknown>
  227. 37.73 s gammaloop-nextest-core> at <unknown source file>:<unknown line>
  228. 37.73 s gammaloop-nextest-core> 14: std[bcb96dfbba0ab899]::sys::backtrace::__rust_begin_short_backtrace::<test[75d6903177b1d7e9]::run_test::{closure#1}, ()><unknown>
  229. 37.73 s gammaloop-nextest-core> at <unknown source file>:<unknown line>
  230. 37.73 s gammaloop-nextest-core> 15: <std[bcb96dfbba0ab899]::thread::lifecycle::spawn_unchecked<test[75d6903177b1d7e9]::run_test::{closure#1}, ()>::{closure#1} as core[940e698046960fd5]::ops::function::FnOnce<()>>::call_once::{shim:vtable#0}<unknown>
  231. 37.73 s gammaloop-nextest-core> at <unknown source file>:<unknown line>
  232. 37.73 s gammaloop-nextest-core> 16: <std[bcb96dfbba0ab899]::sys::thread::unix::Thread>::new::thread_start<unknown>
  233. 37.73 s gammaloop-nextest-core> at <unknown source file>:<unknown line>
  234. 37.73 s gammaloop-nextest-core> 17: start_thread<unknown>
  235. 37.73 s gammaloop-nextest-core> at <unknown source file>:<unknown line>
  236. 37.73 s gammaloop-nextest-core> 18: __clone3<unknown>
  237. 37.73 s gammaloop-nextest-core> at <unknown source file>:<unknown line>
  238. 37.73 s gammaloop-nextest-core>
  239. 37.73 s gammaloop-nextest-core> Run with COLORBT_SHOW_HIDDEN=1 environment variable to disable frame filtering.
  240. 37.73 s gammaloop-nextest-core> Run with RUST_BACKTRACE=full to include source snippets.
  241. 37.73 s gammaloop-nextest-core>
  242. 37.73 s gammaloop-nextest-core> FAIL [ 10.344s] (560/561) gammalooprs uv::tests::scalars_profile
  243. 37.73 s gammaloop-nextest-core> stdout ---
  244. 37.73 s gammaloop-nextest-core>
  245. 37.73 s gammaloop-nextest-core> running 1 test
  246. 37.73 s gammaloop-nextest-core> test uv::tests::scalars_profile ... FAILED
  247. 37.73 s gammaloop-nextest-core>
  248. 37.73 s gammaloop-nextest-core> failures:
  249. 37.73 s gammaloop-nextest-core>
  250. 37.73 s gammaloop-nextest-core> failures:
  251. 37.73 s gammaloop-nextest-core> uv::tests::scalars_profile
  252. 37.73 s gammaloop-nextest-core>
  253. 37.73 s gammaloop-nextest-core> test result: FAILED. 0 passed; 1 failed; 0 ignored; 0 measured; 611 filtered out; finished in 10.32s
  254. 37.73 s gammaloop-nextest-core>
  255. 37.73 s gammaloop-nextest-core> stderr ---
  256. 37.73 s gammaloop-nextest-core> [18:18:39.434] @gammalooprs::settings::runtime WARNING : No external kinematics were provided; using default-generated external momenta and helicities.
  257. 37.73 s gammaloop-nextest-core> field value
  258. 37.73 s gammaloop-nextest-core> span build_integrand{amplitude.name=bub}
  259. 37.73 s gammaloop-nextest-core> at crates/gammalooprs/src/settings/runtime.rs:131
  260. 37.73 s gammaloop-nextest-core> [18:18:39.435] @gammalooprs::integrands::process::amplitude INFO : Input is below threshold: 0 existing threshold E-surfaces across 0/3 graph groups
  261. 37.73 s gammaloop-nextest-core> field value
  262. 37.73 s gammaloop-nextest-core> existing_esurfaces 0
  263. 37.73 s gammaloop-nextest-core> group_count 3
  264. 37.73 s gammaloop-nextest-core> groups_above_threshold 0
  265. 37.73 s gammaloop-nextest-core> integrand bub
  266. 37.73 s gammaloop-nextest-core> span warm_up{integrand.name=bub}
  267. 37.73 s gammaloop-nextest-core> threshold_status below threshold
  268. 37.73 s gammaloop-nextest-core> at crates/gammalooprs/src/integrands/process/amplitude/mod.rs:1666
  269. 37.73 s gammaloop-nextest-core> [18:18:39.435] @gammalooprs::integrands::process::amplitude INFO : overlap structure of group 0: [0: []]
  270. 37.73 s gammaloop-nextest-core> field value
  271. 37.73 s gammaloop-nextest-core> span warm_up{integrand.name=bub}
  272. 37.73 s gammaloop-nextest-core> at crates/gammalooprs/src/integrands/process/amplitude/mod.rs:2015
  273. 37.73 s gammaloop-nextest-core> [18:18:39.435] @gammalooprs::integrands::process::amplitude INFO : overlap structure of group 1: [0: []]
  274. 37.73 s gammaloop-nextest-core> field value
  275. 37.73 s gammaloop-nextest-core> span warm_up{integrand.name=bub}
  276. 37.73 s gammaloop-nextest-core> at crates/gammalooprs/src/integrands/process/amplitude/mod.rs:2015
  277. 37.73 s gammaloop-nextest-core> [18:18:39.435] @gammalooprs::integrands::process::amplitude INFO : overlap structure of group 2: [0: []]
  278. 37.73 s gammaloop-nextest-core> field value
  279. 37.73 s gammaloop-nextest-core> span warm_up{integrand.name=bub}
  280. 37.73 s gammaloop-nextest-core> at crates/gammalooprs/src/integrands/process/amplitude/mod.rs:2015
  281. 37.73 s gammaloop-nextest-core> The application panicked (crashed).
  282. 37.73 s gammaloop-nextest-core> Message: assertion `left == right` failed: subtracted scalar UV profile failed:
  283. 37.73 s gammaloop-nextest-core> UVProfilePassFail {
  284. 37.73 s gammaloop-nextest-core> max_dod: -0.9,
  285. 37.73 s gammaloop-nextest-core> total: 16,
  286. 37.73 s gammaloop-nextest-core> failed: 1,
  287. 37.73 s gammaloop-nextest-core> failures: [
  288. 37.73 s gammaloop-nextest-core> UVProfileFailure {
  289. 37.73 s gammaloop-nextest-core> graph_index: 0,
  290. 37.73 s gammaloop-nextest-core> graph_name: "banana",
  291. 37.73 s gammaloop-nextest-core> cutkosky_cut: None,
  292. 37.73 s gammaloop-nextest-core> lmb_index: 1,
  293. 37.73 s gammaloop-nextest-core> fixed: [
  294. 37.73 s gammaloop-nextest-core> EdgeIndex(
  295. 37.73 s gammaloop-nextest-core> 2,
  296. 37.73 s gammaloop-nextest-core> ),
  297. 37.73 s gammaloop-nextest-core> EdgeIndex(
  298. 37.73 s gammaloop-nextest-core> 0,
  299. 37.73 s gammaloop-nextest-core> ),
  300. 37.73 s gammaloop-nextest-core> ],
  301. 37.73 s gammaloop-nextest-core> free: [
  302. 37.73 s gammaloop-nextest-core> EdgeIndex(
  303. 37.73 s gammaloop-nextest-core> 3,
  304. 37.73 s gammaloop-nextest-core> ),
  305. 37.73 s gammaloop-nextest-core> ],
  306. 37.73 s gammaloop-nextest-core> orientation_label: None,
  307. 37.73 s gammaloop-nextest-core> reason: "dod_exceeds_threshold",
  308. 37.73 s gammaloop-nextest-core> },
  309. 37.73 s gammaloop-nextest-core> ],
  310. 37.73 s gammaloop-nextest-core> }
  311. 37.73 s gammaloop-nextest-core>
  312. 37.73 s gammaloop-nextest-core> ╭─────────┬────────────┬───────────┬───────┬─────┬──────────┬───────────╮
  313. 37.73 s gammaloop-nextest-core> │ fixed │ → ∞ │ slope │ r2 │ DOD │ bare DOD │ inspect │
  314. 37.73 s gammaloop-nextest-core> ├─────────┼────────────┼───────────┼───────┼─────┼──────────┼───────────┤
  315. 37.73 s gammaloop-nextest-core> │ {e1,e2} │ {e3} │ -0.996752 │ 1.000 │ -1 │ 0 │ arb retry │
  316. 37.73 s gammaloop-nextest-core> │ {e1,e3} │ {e2} │ -1.065665 │ 0.997 │ -1 │ 0 │ arb retry │
  317. 37.73 s gammaloop-nextest-core> │ {e1} │ {e2,e3} │ -0.937151 │ 0.943 │ -1 │ 2 │ │
  318. 37.73 s gammaloop-nextest-core> │ {e2,e3} │ {e1} │ -1.001075 │ 1.000 │ -1 │ 0 │ arb retry │
  319. 37.73 s gammaloop-nextest-core> │ {e2} │ {e1,e3} │ -0.984146 │ 0.998 │ -1 │ 2 │ │
  320. 37.73 s gammaloop-nextest-core> │ {e3} │ {e1,e2} │ -1.383911 │ 0.982 │ -1 │ 2 │ arb retry │
  321. 37.73 s gammaloop-nextest-core> │ {} │ {e1,e2,e3} │ -1.094213 │ 0.258 │ -1 │ 4 │ │
  322. 37.73 s gammaloop-nextest-core> │ {e2,e0} │ {e3} │ -0.803348 │ 0.861 │ -1 │ 0 │ arb retry │
  323. 37.73 s gammaloop-nextest-core> │ {e3,e0} │ {e2} │ -0.999257 │ 1.000 │ -1 │ 0 │ │
  324. 37.73 s gammaloop-nextest-core> │ {e0} │ {e2,e3} │ -1.000893 │ 1.000 │ -1 │ 2 │ │
  325. 37.73 s gammaloop-nextest-core> │ {e1,e0} │ {e3} │ -0.997860 │ 1.000 │ -1 │ 0 │ │
  326. 37.73 s gammaloop-nextest-core> ╰─────────┴────────────┴───────────┴───────┴─────┴──────────┴───────────╯
  327. 37.73 s gammaloop-nextest-core>
  328. 37.73 s gammaloop-nextest-core> ╭───────┬─────────┬───────────┬───────┬─────┬──────────┬───────────╮
  329. 37.73 s gammaloop-nextest-core> │ fixed │ → ∞ │ slope │ r2 │ DOD │ bare DOD │ inspect │
  330. 37.73 s gammaloop-nextest-core> ├───────┼─────────┼───────────┼───────┼─────┼──────────┼───────────┤
  331. 37.73 s gammaloop-nextest-core> │ {e1} │ {e2} │ -1.005039 │ 1.000 │ -1 │ 0 │ arb retry │
  332. 37.73 s gammaloop-nextest-core> │ {e2} │ {e1} │ -1.001098 │ 1.000 │ -1 │ 0 │ arb retry │
  333. 37.73 s gammaloop-nextest-core> │ {} │ {e1,e2} │ -1.011289 │ 1.000 │ -1 │ 2 │ │
  334. 37.73 s gammaloop-nextest-core> │ {e0} │ {e2} │ -0.998140 │ 1.000 │ -1 │ 0 │ │
  335. 37.73 s gammaloop-nextest-core> ╰───────┴─────────┴───────────┴───────┴─────┴──────────┴───────────╯
  336. 37.73 s gammaloop-nextest-core>
  337. 37.73 s gammaloop-nextest-core> ╭───────┬──────┬───────────┬───────┬─────┬──────────┬─────────╮
  338. 37.73 s gammaloop-nextest-core> │ fixed │ → ∞ │ slope │ r2 │ DOD │ bare DOD │ inspect │
  339. 37.73 s gammaloop-nextest-core> ├───────┼──────┼───────────┼───────┼─────┼──────────┼─────────┤
  340. 37.73 s gammaloop-nextest-core> │ {} │ {e1} │ -0.989949 │ 1.000 │ -1 │ 0 │ │
  341. 37.73 s gammaloop-nextest-core> ╰───────┴──────┴───────────┴───────┴─────┴──────────┴─────────╯
  342. 37.73 s gammaloop-nextest-core> left: 1
  343. 37.73 s gammaloop-nextest-core> right: 0
  344. 37.73 s gammaloop-nextest-core> Location: crates/gammalooprs/src/uv/tests.rs:259
  345. 37.73 s gammaloop-nextest-core>
  346. 37.73 s gammaloop-nextest-core> ━━━━━━━━━━━━━━━━━━━━━━━━━━━━━━━━━━ BACKTRACE ━━━━━━━━━━━━━━━━━━━━━━━━━━━━━━━━━━━
  347. 37.73 s gammaloop-nextest-core> 1: <color_eyre[51793ea62743adbd]::config::PanicHook>::panic_report<unknown>
  348. 37.73 s gammaloop-nextest-core> at <unknown source file>:<unknown line>
  349. 37.73 s gammaloop-nextest-core> 2: <color_eyre[51793ea62743adbd]::config::PanicHook>::into_panic_hook::{closure#0}<unknown>
  350. 37.73 s gammaloop-nextest-core> at <unknown source file>:<unknown line>
  351. 37.73 s gammaloop-nextest-core> 3: std[bcb96dfbba0ab899]::panicking::panic_with_hook<unknown>
  352. 37.73 s gammaloop-nextest-core> at <unknown source file>:<unknown line>
  353. 37.73 s gammaloop-nextest-core> 4: std[bcb96dfbba0ab899]::panicking::panic_handler::{closure#0}<unknown>
  354. 37.73 s gammaloop-nextest-core> at <unknown source file>:<unknown line>
  355. 37.73 s gammaloop-nextest-core> 5: std[bcb96dfbba0ab899]::sys::backtrace::__rust_end_short_backtrace::<std[bcb96dfbba0ab899]::panicking::panic_handler::{closure#0}, !><unknown>
  356. 37.73 s gammaloop-nextest-core> at <unknown source file>:<unknown line>
  357. 37.73 s gammaloop-nextest-core> 6: __rustc[6c289b9f9c454d21]::rust_begin_unwind<unknown>
  358. 37.73 s gammaloop-nextest-core> at <unknown source file>:<unknown line>
  359. 37.73 s gammaloop-nextest-core> 7: core[940e698046960fd5]::panicking::panic_fmt<unknown>
  360. 37.73 s gammaloop-nextest-core> at <unknown source file>:<unknown line>
  361. 37.73 s gammaloop-nextest-core> 8: core[940e698046960fd5]::panicking::assert_failed_inner<unknown>
  362. 37.73 s gammaloop-nextest-core> at <unknown source file>:<unknown line>
  363. 37.73 s gammaloop-nextest-core> 9: core[940e698046960fd5]::panicking::assert_failed::<usize, usize><unknown>
  364. 37.73 s gammaloop-nextest-core> at <unknown source file>:<unknown line>
  365. 37.73 s gammaloop-nextest-core> 10: gammalooprs[972dff90865981f6]::uv::tests::scalars_profile<unknown>
  366. 37.73 s gammaloop-nextest-core> at <unknown source file>:<unknown line>
  367. 37.73 s gammaloop-nextest-core> 11: <gammalooprs[972dff90865981f6]::uv::tests::scalars_profile::{closure#0} as core[940e698046960fd5]::ops::function::FnOnce<()>>::call_once<unknown>
  368. 37.73 s gammaloop-nextest-core> at <unknown source file>:<unknown line>
  369. 37.73 s gammaloop-nextest-core> 12: test[75d6903177b1d7e9]::__rust_begin_short_backtrace::<core[940e698046960fd5]::result::Result<(), alloc[2ea6bcb46fca0c42]::string::String>, fn() -> core[940e698046960fd5]::result::Result<(), alloc[2ea6bcb46fca0c42]::string::String>><unknown>
  370. 37.73 s gammaloop-nextest-core> at <unknown source file>:<unknown line>
  371. 37.73 s gammaloop-nextest-core> 13: test[75d6903177b1d7e9]::run_test::{closure#0}<unknown>
  372. 37.73 s gammaloop-nextest-core> at <unknown source file>:<unknown line>
  373. 37.73 s gammaloop-nextest-core> 14: std[bcb96dfbba0ab899]::sys::backtrace::__rust_begin_short_backtrace::<test[75d6903177b1d7e9]::run_test::{closure#1}, ()><unknown>
  374. 37.73 s gammaloop-nextest-core> at <unknown source file>:<unknown line>
  375. 37.73 s gammaloop-nextest-core> 15: <std[bcb96dfbba0ab899]::thread::lifecycle::spawn_unchecked<test[75d6903177b1d7e9]::run_test::{closure#1}, ()>::{closure#1} as core[940e698046960fd5]::ops::function::FnOnce<()>>::call_once::{shim:vtable#0}<unknown>
  376. 37.73 s gammaloop-nextest-core> at <unknown source file>:<unknown line>
  377. 37.73 s gammaloop-nextest-core> 16: <std[bcb96dfbba0ab899]::sys::thread::unix::Thread>::new::thread_start<unknown>
  378. 37.73 s gammaloop-nextest-core> at <unknown source file>:<unknown line>
  379. 37.73 s gammaloop-nextest-core> 17: start_thread<unknown>
  380. 37.73 s gammaloop-nextest-core> at <unknown source file>:<unknown line>
  381. 37.73 s gammaloop-nextest-core> 18: __clone3<unknown>
  382. 37.73 s gammaloop-nextest-core> at <unknown source file>:<unknown line>
  383. 37.73 s gammaloop-nextest-core>
  384. 37.73 s gammaloop-nextest-core> Run with COLORBT_SHOW_HIDDEN=1 environment variable to disable frame filtering.
  385. 37.73 s gammaloop-nextest-core> Run with RUST_BACKTRACE=full to include source snippets.
  386. 37.73 s gammaloop-nextest-core>
  387. 37.81 s gammaloop-nextest-core> error: test run failed
  388. 37.84 s gammaloop-nextest-core>
  389. 37.84 s gammaloop-nextest-core> ========== nextest test summary ==========
  390. 37.84 s gammaloop-nextest-core> report: target/nextest/ci_gammaloop/junit.xml
  391. 37.84 s gammaloop-nextest-core> tests: 561, failures: 5, errors: 0
  392. 37.84 s gammaloop-nextest-core>
  393. 37.84 s gammaloop-nextest-core> 1. gammalooprs::cff::tests::stored_production_cff_uses_typed_energy_factor_ownership
  394. 37.84 s gammaloop-nextest-core> failure: test failure with exit code 101
  395. 37.84 s gammaloop-nextest-core> system-out
  396. 37.84 s gammaloop-nextest-core> running 1 test
  397. 37.84 s gammaloop-nextest-core> test cff::tests::stored_production_cff_uses_typed_energy_factor_ownership ... FAILED
  398. 37.84 s gammaloop-nextest-core>
  399. 37.84 s gammaloop-nextest-core> failures:
  400. 37.84 s gammaloop-nextest-core>
  401. 37.84 s gammaloop-nextest-core> failures:
  402. 37.84 s gammaloop-nextest-core> cff::tests::stored_production_cff_uses_typed_energy_factor_ownership
  403. 37.84 s gammaloop-nextest-core>
  404. 37.84 s gammaloop-nextest-core> test result: FAILED. 0 passed; 1 failed; 0 ignored; 0 measured; 611 filtered out; finished in 0.09s
  405. 37.84 s gammaloop-nextest-core> system-err
  406. 37.84 s gammaloop-nextest-core> The application panicked (crashed).
  407. 37.84 s gammaloop-nextest-core> Message: assertion `left == right` failed
  408. 37.84 s gammaloop-nextest-core> left: 1
  409. 37.84 s gammaloop-nextest-core> right: -1
  410. 37.84 s gammaloop-nextest-core> Location: crates/gammalooprs/src/cff/mod.rs:2721
  411. 37.84 s gammaloop-nextest-core>
  412. 37.84 s gammaloop-nextest-core> ━━━━━━━━━━━━━━━━━━━━━━━━━━━━━━━━━━ BACKTRACE ━━━━━━━━━━━━━━━━━━━━━━━━━━━━━━━━━━━
  413. 37.84 s gammaloop-nextest-core> 1: <color_eyre[51793ea62743adbd]::config::PanicHook>::panic_report<unknown>
  414. 37.84 s gammaloop-nextest-core> at <unknown source file>:<unknown line>
  415. 37.84 s gammaloop-nextest-core> 2: <color_eyre[51793ea62743adbd]::config::PanicHook>::into_panic_hook::{closure#0}<unknown>
  416. 37.84 s gammaloop-nextest-core> at <unknown source file>:<unknown line>
  417. 37.84 s gammaloop-nextest-core> 3: std[bcb96dfbba0ab899]::panicking::panic_with_hook<unknown>
  418. 37.84 s gammaloop-nextest-core> at <unknown source file>:<unknown line>
  419. 37.84 s gammaloop-nextest-core> 4: std[bcb96dfbba0ab899]::panicking::panic_handler::{closure#0}<unknown>
  420. 37.84 s gammaloop-nextest-core> at <unknown source file>:<unknown line>
  421. 37.84 s gammaloop-nextest-core> 5: std[bcb96dfbba0ab899]::sys::backtrace::__rust_end_short_backtrace::<std[bcb96dfbba0ab899]::panicking::panic_handler::{closure#0}, !><unknown>
  422. 37.84 s gammaloop-nextest-core> at <unknown source file>:<unknown line>
  423. 37.84 s gammaloop-nextest-core> 6: __rustc[6c289b9f9c454d21]::rust_begin_unwind<unknown>
  424. 37.84 s gammaloop-nextest-core> at <unknown source file>:<unknown line>
  425. 37.84 s gammaloop-nextest-core> 7: core[940e698046960fd5]::panicking::panic_fmt<unknown>
  426. 37.84 s gammaloop-nextest-core> at <unknown source file>:<unknown line>
  427. 37.84 s gammaloop-nextest-core> 8: core[940e698046960fd5]::panicking::assert_failed_inner<unknown>
  428. 37.84 s gammaloop-nextest-core> at <unknown source file>:<unknown line>
  429. 37.84 s gammaloop-nextest-core> 9: core[940e698046960fd5]::panicking::assert_failed::<i64, i64><unknown>
  430. 37.84 s gammaloop-nextest-core> at <unknown source file>:<unknown line>
  431. 37.84 s gammaloop-nextest-core> 10: gammalooprs[972dff90865981f6]::cff::tests::stored_production_cff_uses_typed_energy_factor_ownership<unknown>
  432. 37.84 s gammaloop-nextest-core> at <unknown source file>:<unknown line>
  433. 37.84 s gammaloop-nextest-core> 11: <gammalooprs[972dff90865981f6]::cff::tests::stored_production_cff_uses_typed_energy_factor_ownership::{closure#0} as core[940e698046960fd5]::ops::function::FnOnce<()>>::call_once<unknown>
  434. 37.84 s gammaloop-nextest-core> at <unknown source file>:<unknown line>
  435. 37.84 s gammaloop-nextest-core> 12: test[75d6903177b1d7e9]::__rust_begin_short_backtrace::<core[940e698046960fd5]::result::Result<(), alloc[2ea6bcb46fca0c42]::string::String>, fn() -> core[940e698046960fd5]::result::Result<(), alloc[2ea6bcb46fca0c42]::string::String>><unknown>
  436. 37.84 s gammaloop-nextest-core> at <unknown source file>:<unknown line>
  437. 37.84 s gammaloop-nextest-core> 13: test[75d6903177b1d7e9]::run_test::{closure#0}<unknown>
  438. 37.84 s gammaloop-nextest-core> at <unknown source file>:<unknown line>
  439. 37.84 s gammaloop-nextest-core> 14: std[bcb96dfbba0ab899]::sys::backtrace::__rust_begin_short_backtrace::<test[75d6903177b1d7e9]::run_test::{closure#1}, ()><unknown>
  440. 37.84 s gammaloop-nextest-core> at <unknown source file>:<unknown line>
  441. 37.84 s gammaloop-nextest-core> 15: <std[bcb96dfbba0ab899]::thread::lifecycle::spawn_unchecked<test[75d6903177b1d7e9]::run_test::{closure#1}, ()>::{closure#1} as core[940e698046960fd5]::ops::function::FnOnce<()>>::call_once::{shim:vtable#0}<unknown>
  442. 37.84 s gammaloop-nextest-core> at <unknown source file>:<unknown line>
  443. 37.84 s gammaloop-nextest-core> 16: <std[bcb96dfbba0ab899]::sys::thread::unix::Thread>::new::thread_start<unknown>
  444. 37.84 s gammaloop-nextest-core> at <unknown source file>:<unknown line>
  445. 37.84 s gammaloop-nextest-core> 17: start_thread<unknown>
  446. 37.84 s gammaloop-nextest-core> at <unknown source file>:<unknown line>
  447. 37.84 s gammaloop-nextest-core> 18: __clone3<unknown>
  448. 37.84 s gammaloop-nextest-core> at <unknown source file>:<unknown line>
  449. 37.84 s gammaloop-nextest-core>
  450. 37.84 s gammaloop-nextest-core> Run with COLORBT_SHOW_HIDDEN=1 environment variable to disable frame filtering.
  451. 37.84 s gammaloop-nextest-core> Run with RUST_BACKTRACE=full to include source snippets.
  452. 37.84 s gammaloop-nextest-core>
  453. 37.84 s gammaloop-nextest-core> 2. gammalooprs::uv::approx::local_3d::tests::production_emr_map_cancels_one_powered_denominator
  454. 37.84 s gammaloop-nextest-core> failure: test failure with exit code 101
  455. 37.84 s gammaloop-nextest-core> system-out
  456. 37.84 s gammaloop-nextest-core> running 1 test
  457. 37.84 s gammaloop-nextest-core> test uv::approx::local_3d::tests::production_emr_map_cancels_one_powered_denominator ... FAILED
  458. 37.84 s gammaloop-nextest-core>
  459. 37.84 s gammaloop-nextest-core> failures:
  460. 37.84 s gammaloop-nextest-core>
  461. 37.84 s gammaloop-nextest-core> failures:
  462. 37.84 s gammaloop-nextest-core> uv::approx::local_3d::tests::production_emr_map_cancels_one_powered_denominator
  463. 37.84 s gammaloop-nextest-core>
  464. 37.84 s gammaloop-nextest-core> test result: FAILED. 0 passed; 1 failed; 0 ignored; 0 measured; 611 filtered out; finished in 0.10s
  465. 37.84 s gammaloop-nextest-core> system-err
  466. 37.84 s gammaloop-nextest-core> The application panicked (crashed).
  467. 37.84 s gammaloop-nextest-core> Message: summed exact-source powered and selected lower channels differ: powered=-1𝑖/8/𝜋^3, lower=1𝑖/16/𝜋^3, difference=-3𝑖/16/𝜋^3
  468. 37.84 s gammaloop-nextest-core> Location: crates/gammalooprs/src/uv/approx/local_3d.rs:2047
  469. 37.84 s gammaloop-nextest-core>
  470. 37.84 s gammaloop-nextest-core> ━━━━━━━━━━━━━━━━━━━━━━━━━━━━━━━━━━ BACKTRACE ━━━━━━━━━━━━━━━━━━━━━━━━━━━━━━━━━━━
  471. 37.84 s gammaloop-nextest-core> 1: <color_eyre[51793ea62743adbd]::config::PanicHook>::panic_report<unknown>
  472. 37.84 s gammaloop-nextest-core> at <unknown source file>:<unknown line>
  473. 37.84 s gammaloop-nextest-core> 2: <color_eyre[51793ea62743adbd]::config::PanicHook>::into_panic_hook::{closure#0}<unknown>
  474. 37.84 s gammaloop-nextest-core> at <unknown source file>:<unknown line>
  475. 37.84 s gammaloop-nextest-core> 3: std[bcb96dfbba0ab899]::panicking::panic_with_hook<unknown>
  476. 37.84 s gammaloop-nextest-core> at <unknown source file>:<unknown line>
  477. 37.84 s gammaloop-nextest-core> 4: std[bcb96dfbba0ab899]::panicking::panic_handler::{closure#0}<unknown>
  478. 37.84 s gammaloop-nextest-core> at <unknown source file>:<unknown line>
  479. 37.84 s gammaloop-nextest-core> 5: std[bcb96dfbba0ab899]::sys::backtrace::__rust_end_short_backtrace::<std[bcb96dfbba0ab899]::panicking::panic_handler::{closure#0}, !><unknown>
  480. 37.84 s gammaloop-nextest-core> at <unknown source file>:<unknown line>
  481. 37.84 s gammaloop-nextest-core> 6: __rustc[6c289b9f9c454d21]::rust_begin_unwind<unknown>
  482. 37.84 s gammaloop-nextest-core> at <unknown source file>:<unknown line>
  483. 37.84 s gammaloop-nextest-core> 7: core[940e698046960fd5]::panicking::panic_fmt<unknown>
  484. 37.84 s gammaloop-nextest-core> at <unknown source file>:<unknown line>
  485. 37.84 s gammaloop-nextest-core> 8: gammalooprs[972dff90865981f6]::uv::approx::local_3d::tests::production_emr_map_cancels_one_powered_denominator<unknown>
  486. 37.84 s gammaloop-nextest-core> at <unknown source file>:<unknown line>
  487. 37.84 s gammaloop-nextest-core> 9: <gammalooprs[972dff90865981f6]::uv::approx::local_3d::tests::production_emr_map_cancels_one_powered_denominator::{closure#0} as core[940e698046960fd5]::ops::function::FnOnce<()>>::call_once<unknown>
  488. 37.84 s gammaloop-nextest-core> at <unknown source file>:<unknown line>
  489. 37.84 s gammaloop-nextest-core> 10: test[75d6903177b1d7e9]::__rust_begin_short_backtrace::<core[940e698046960fd5]::result::Result<(), alloc[2ea6bcb46fca0c42]::string::String>, fn() -> core[940e698046960fd5]::result::Result<(), alloc[2ea6bcb46fca0c42]::string::String>><unknown>
  490. 37.84 s gammaloop-nextest-core> at <unknown source file>:<unknown line>
  491. 37.84 s gammaloop-nextest-core> 11: test[75d6903177b1d7e9]::run_test::{closure#0}<unknown>
  492. 37.84 s gammaloop-nextest-core> at <unknown source file>:<unknown line>
  493. 37.84 s gammaloop-nextest-core> 12: std[bcb96dfbba0ab899]::sys::backtrace::__rust_begin_short_backtrace::<test[75d6903177b1d7e9]::run_test::{closure#1}, ()><unknown>
  494. 37.84 s gammaloop-nextest-core> at <unknown source file>:<unknown line>
  495. 37.84 s gammaloop-nextest-core> 13: <std[bcb96dfbba0ab899]::thread::lifecycle::spawn_unchecked<test[75d6903177b1d7e9]::run_test::{closure#1}, ()>::{closure#1} as core[940e698046960fd5]::ops::function::FnOnce<()>>::call_once::{shim:vtable#0}<unknown>
  496. 37.84 s gammaloop-nextest-core> at <unknown source file>:<unknown line>
  497. 37.84 s gammaloop-nextest-core> 14: <std[bcb96dfbba0ab899]::sys::thread::unix::Thread>::new::thread_start<unknown>
  498. 37.84 s gammaloop-nextest-core> at <unknown source file>:<unknown line>
  499. 37.84 s gammaloop-nextest-core> 15: start_thread<unknown>
  500. 37.84 s gammaloop-nextest-core> at <unknown source file>:<unknown line>
  501. 37.84 s gammaloop-nextest-core> 16: __clone3<unknown>
  502. 37.84 s gammaloop-nextest-core> at <unknown source file>:<unknown line>
  503. 37.84 s gammaloop-nextest-core>
  504. 37.84 s gammaloop-nextest-core> Run with COLORBT_SHOW_HIDDEN=1 environment variable to disable frame filtering.
  505. 37.84 s gammaloop-nextest-core> Run with RUST_BACKTRACE=full to include source snippets.
  506. 37.84 s gammaloop-nextest-core>
  507. 37.84 s gammaloop-nextest-core> 3. gammalooprs::uv::hedge_poset::tests::spectacles_typed_4d_projects_after_local_construction
  508. 37.84 s gammaloop-nextest-core> failure: test failure with exit code 101
  509. 37.84 s gammaloop-nextest-core> Error:
  510. 37.84 s gammaloop-nextest-core> 0: failed to extract three-dimensional representation graph input: source edge 1 has no unique routing for rewritten exact signature [-1, 0, 0] modulo the factorized opposite-domain loop span
  511. 37.84 s gammaloop-nextest-core>
  512. 37.84 s gammaloop-nextest-core> Location:
  513. 37.84 s gammaloop-nextest-core> crates/gammalooprs/src/uv/approx/local_3d.rs:845
  514. 37.84 s gammaloop-nextest-core>
  515. 37.84 s gammaloop-nextest-core> ━━━━━━━━━━━━━━━━━━━━━━━━━━━━━━━━━━ BACKTRACE ━━━━━━━━━━━━━━━━━━━━━━━━━━━━━━━━━━━
  516. 37.84 s gammaloop-nextest-core> 1: <color_eyre[51793ea62743adbd]::config::EyreHook>::into_eyre_hook::{closure#0}<unknown>
  517. 37.84 s gammaloop-nextest-core> at <unknown source file>:<unknown line>
  518. 37.84 s gammaloop-nextest-core> 2: eyre[cb2fd339c0c40fca]::capture_handler<unknown>
  519. 37.84 s gammaloop-nextest-core> at <unknown source file>:<unknown line>
  520. 37.84 s gammaloop-nextest-core> 3: <eyre[cb2fd339c0c40fca]::Report>::from_std::<three_dimensional_reps[3cb572ff22d197ac]::graph_io::GraphIoError><unknown>
  521. 37.84 s gammaloop-nextest-core> at <unknown source file>:<unknown line>
  522. 37.84 s gammaloop-nextest-core> 4: <gammalooprs[972dff90865981f6]::uv::approx::local_3d::Localizer>::project_4d<unknown>
  523. 37.84 s gammaloop-nextest-core> at <unknown source file>:<unknown line>
  524. 37.84 s gammaloop-nextest-core> 5: gammalooprs[972dff90865981f6]::uv::hedge_poset::tests::spectacles_typed_4d_projects_after_local_construction<unknown>
  525. 37.84 s gammaloop-nextest-core> at <unknown source file>:<unknown line>
  526. 37.84 s gammaloop-nextest-core> 6: <gammalooprs[972dff90865981f6]::uv::hedge_poset::tests::spectacles_typed_4d_projects_after_local_construction::{closure#0} as core[940e698046960fd5]::ops::function::FnOnce<()>>::call_once<unknown>
  527. 37.84 s gammaloop-nextest-core> at <unknown source file>:<unknown line>
  528. 37.84 s gammaloop-nextest-core> 7: test[75d6903177b1d7e9]::__rust_begin_short_backtrace::<core[940e698046960fd5]::result::Result<(), alloc[2ea6bcb46fca0c42]::string::String>, fn() -> core[940e698046960fd5]::result::Result<(), alloc[2ea6bcb46fca0c42]::string::String>><unknown>
  529. 37.84 s gammaloop-nextest-core> at <unknown source file>:<unknown line>
  530. 37.84 s gammaloop-nextest-core> 8: test[75d6903177b1d7e9]::run_test::{closure#0}<unknown>
  531. 37.84 s gammaloop-nextest-core> at <unknown source file>:<unknown line>
  532. 37.84 s gammaloop-nextest-core> 9: std[bcb96dfbba0ab899]::sys::backtrace::__rust_begin_short_backtrace::<test[75d6903177b1d7e9]::run_test::{closure#1}, ()><unknown>
  533. 37.84 s gammaloop-nextest-core> at <unknown source file>:<unknown line>
  534. 37.84 s gammaloop-nextest-core> 10: <std[bcb96dfbba0ab899]::thread::lifecycle::spawn_unchecked<test[75d6903177b1d7e9]::run_test::{closure#1}, ()>::{closure#1} as core[940e698046960fd5]::ops::function::FnOnce<()>>::call_once::{shim:vtable#0}<unknown>
  535. 37.84 s gammaloop-nextest-core> at <unknown source file>:<unknown line>
  536. 37.84 s gammaloop-nextest-core> 11: <std[bcb96dfbba0ab899]::sys::thread::unix::Thread>::new::thread_start<unknown>
  537. 37.84 s gammaloop-nextest-core> at <unknown source file>:<unknown line>
  538. 37.84 s gammaloop-nextest-core> 12: start_thread<unknown>
  539. 37.84 s gammaloop-nextest-core> at <unknown source file>:<unknown line>
  540. 37.84 s gammaloop-nextest-core> 13: __clone3<unknown>
  541. 37.84 s gammaloop-nextest-core> at <unknown source file>:<unknown line>
  542. 37.84 s gammaloop-nextest-core>
  543. 37.84 s gammaloop-nextest-core> Run with COLORBT_SHOW_HIDDEN=1 environment variable to disable frame filtering.
  544. 37.84 s gammaloop-nextest-core> Run with RUST_BACKTRACE=full to include source snippets.
  545. 37.84 s gammaloop-nextest-core> system-out
  546. 37.84 s gammaloop-nextest-core> running 1 test
  547. 37.84 s gammaloop-nextest-core> digraph {
  548. 37.84 s gammaloop-nextest-core> node [shape=circle,height=0.1,label=""];
  549. 37.84 s gammaloop-nextest-core> overlap = "scale";
  550. 37.84 s gammaloop-nextest-core> layout = "neato";
  551. 37.84 s gammaloop-nextest-core> start=2;
  552. 37.84 s gammaloop-nextest-core> 4 [label="0"];
  553. 37.84 s gammaloop-nextest-core> 1 [label="zw"];
  554. 37.84 s gammaloop-nextest-core> 2 [label="F"];
  555. 37.84 s gammaloop-nextest-core> 0 [label="143"];
  556. 37.84 s gammaloop-nextest-core> 3 [label="10B"];
  557. 37.84 s gammaloop-nextest-core> 4:0:s-> 1:1:s [id=0 color="red:blue;0.5" label="zw"];
  558. 37.84 s gammaloop-nextest-core> 4:2:s-> 2:3:s [id=1 color="red:blue;0.5" label="F"];
  559. 37.84 s gammaloop-nextest-core> 3:5:s-> 0:4:s [id=2 color="red:blue;0.5" label="143"];
  560. 37.84 s gammaloop-nextest-core> 4:6:s-> 0:7:s [id=3 color="red:blue;0.5" label="143"];
  561. 37.84 s gammaloop-nextest-core> 1:8:s-> 3:9:s [id=4 color="red:blue;0.5" label="F"];
  562. 37.84 s gammaloop-nextest-core> 1:10:s-> 0:11:s [id=5 color="red:blue;0.5" label="143"];
  563. 37.84 s gammaloop-nextest-core> 2:12:s-> 3:13:s [id=6 color="red:blue;0.5" label="zw"];
  564. 37.84 s gammaloop-nextest-core> 2:14:s-> 0:15:s [id=7 color="red:blue;0.5" label="143"];
  565. 37.84 s gammaloop-nextest-core> }
  566. 37.84 s gammaloop-nextest-core>
  567. 37.84 s gammaloop-nextest-core> digraph {
  568. 37.84 s gammaloop-nextest-core> node [shape=circle,height=0.1,label=""];
  569. 37.84 s gammaloop-nextest-core> overlap = "scale";
  570. 37.84 s gammaloop-nextest-core> layout = "neato";
  571. 37.84 s gammaloop-nextest-core> start=2;
  572. 37.84 s gammaloop-nextest-core> 0 [label="∅"];
  573. 37.84 s gammaloop-nextest-core> 1 [label="{zw}: Approx(S_zw(0))"];
  574. 37.84 s gammaloop-nextest-core> 2 [label="{F}: Approx(S_F(1))"];
  575. 37.84 s gammaloop-nextest-core> 3 [label="{143}: Approx(S_143(3))"];
  576. 37.84 s gammaloop-nextest-core> 4 [label="{zw,F}: Approx(S_F(4))*Approx(S_zw(0))"];
  577. 37.84 s gammaloop-nextest-core> 5 [label="{zw} · {143}: Approx((-1*S_zw+S_143(5))*Approx(S_zw(0)))"];
  578. 37.84 s gammaloop-nextest-core> 6 [label="{F} · {143}: Approx((-1*S_F+S_143(7))*Approx(S_F(1)))"];
  579. 37.84 s gammaloop-nextest-core> 7 [label="{zw,F} · {143}: Approx((-1*S_10B+S_143(2))*Approx(S_F(4))*Approx(S_zw(0)))"];
  580. 37.84 s gammaloop-nextest-core> 0:0:s-> 1:1:s [id=0 color="red:blue;0.5"];
  581. 37.84 s gammaloop-nextest-core> 0:2:s-> 2:3:s [id=1 color="red:blue;0.5"];
  582. 37.84 s gammaloop-nextest-core> 0:4:s-> 3:5:s [id=2 color="red:blue;0.5"];
  583. 37.84 s gammaloop-nextest-core> 1:6:s-> 4:7:s [id=3 color="red:blue;0.5"];
  584. 37.84 s gammaloop-nextest-core> 1:8:s-> 5:9:s [id=4 color="red:blue;0.5"];
  585. 37.84 s gammaloop-nextest-core> 2:10:s-> 4:11:s [id=5 color="red:blue;0.5"];
  586. 37.84 s gammaloop-nextest-core> 2:12:s-> 6:13:s [id=6 color="red:blue;0.5"];
  587. 37.84 s gammaloop-nextest-core> 4:14:s-> 7:15:s [id=7 color="red:blue;0.5"];
  588. 37.84 s gammaloop-nextest-core> }
  589. 37.84 s gammaloop-nextest-core>
  590. 37.84 s gammaloop-nextest-core> test uv::hedge_poset::tests::spectacles_typed_4d_projects_after_local_construction ... FAILED
  591. 37.84 s gammaloop-nextest-core>
  592. 37.84 s gammaloop-nextest-core> failures:
  593. 37.84 s gammaloop-nextest-core>
  594. 37.84 s gammaloop-nextest-core> failures:
  595. 37.84 s gammaloop-nextest-core> uv::hedge_poset::tests::spectacles_typed_4d_projects_after_local_construction
  596. 37.84 s gammaloop-nextest-core>
  597. 37.84 s gammaloop-nextest-core> test result: FAILED. 0 passed; 1 failed; 0 ignored; 0 measured; 611 filtered out; finished in 0.20s
  598. 37.84 s gammaloop-nextest-core> system-err
  599. 37.84 s gammaloop-nextest-core> Error:
  600. 37.84 s gammaloop-nextest-core> 0: failed to extract three-dimensional representation graph input: source edge 1 has no unique routing for rewritten exact signature [-1, 0, 0] modulo the factorized opposite-domain loop span
  601. 37.84 s gammaloop-nextest-core>
  602. 37.84 s gammaloop-nextest-core> Location:
  603. 37.84 s gammaloop-nextest-core> crates/gammalooprs/src/uv/approx/local_3d.rs:845
  604. 37.84 s gammaloop-nextest-core>
  605. 37.84 s gammaloop-nextest-core> ━━━━━━━━━━━━━━━━━━━━━━━━━━━━━━━━━━ BACKTRACE ━━━━━━━━━━━━━━━━━━━━━━━━━━━━━━━━━━━
  606. 37.84 s gammaloop-nextest-core> 1: <color_eyre[51793ea62743adbd]::config::EyreHook>::into_eyre_hook::{closure#0}<unknown>
  607. 37.84 s gammaloop-nextest-core> at <unknown source file>:<unknown line>
  608. 37.84 s gammaloop-nextest-core> 2: eyre[cb2fd339c0c40fca]::capture_handler<unknown>
  609. 37.84 s gammaloop-nextest-core> at <unknown source file>:<unknown line>
  610. 37.84 s gammaloop-nextest-core> 3: <eyre[cb2fd339c0c40fca]::Report>::from_std::<three_dimensional_reps[3cb572ff22d197ac]::graph_io::GraphIoError><unknown>
  611. 37.84 s gammaloop-nextest-core> at <unknown source file>:<unknown line>
  612. 37.84 s gammaloop-nextest-core> 4: <gammalooprs[972dff90865981f6]::uv::approx::local_3d::Localizer>::project_4d<unknown>
  613. 37.84 s gammaloop-nextest-core> at <unknown source file>:<unknown line>
  614. 37.84 s gammaloop-nextest-core> 5: gammalooprs[972dff90865981f6]::uv::hedge_poset::tests::spectacles_typed_4d_projects_after_local_construction<unknown>
  615. 37.84 s gammaloop-nextest-core> at <unknown source file>:<unknown line>
  616. 37.84 s gammaloop-nextest-core> 6: <gammalooprs[972dff90865981f6]::uv::hedge_poset::tests::spectacles_typed_4d_projects_after_local_construction::{closure#0} as core[940e698046960fd5]::ops::function::FnOnce<()>>::call_once<unknown>
  617. 37.84 s gammaloop-nextest-core> at <unknown source file>:<unknown line>
  618. 37.84 s gammaloop-nextest-core> 7: test[75d6903177b1d7e9]::__rust_begin_short_backtrace::<core[940e698046960fd5]::result::Result<(), alloc[2ea6bcb46fca0c42]::string::String>, fn() -> core[940e698046960fd5]::result::Result<(), alloc[2ea6bcb46fca0c42]::string::String>><unknown>
  619. 37.84 s gammaloop-nextest-core> at <unknown source file>:<unknown line>
  620. 37.84 s gammaloop-nextest-core> 8: test[75d6903177b1d7e9]::run_test::{closure#0}<unknown>
  621. 37.84 s gammaloop-nextest-core> at <unknown source file>:<unknown line>
  622. 37.84 s gammaloop-nextest-core> 9: std[bcb96dfbba0ab899]::sys::backtrace::__rust_begin_short_backtrace::<test[75d6903177b1d7e9]::run_test::{closure#1}, ()><unknown>
  623. 37.84 s gammaloop-nextest-core> at <unknown source file>:<unknown line>
  624. 37.84 s gammaloop-nextest-core> 10: <std[bcb96dfbba0ab899]::thread::lifecycle::spawn_unchecked<test[75d6903177b1d7e9]::run_test::{closure#1}, ()>::{closure#1} as core[940e698046960fd5]::ops::function::FnOnce<()>>::call_once::{shim:vtable#0}<unknown>
  625. 37.84 s gammaloop-nextest-core> at <unknown source file>:<unknown line>
  626. 37.84 s gammaloop-nextest-core> 11: <std[bcb96dfbba0ab899]::sys::thread::unix::Thread>::new::thread_start<unknown>
  627. 37.84 s gammaloop-nextest-core> at <unknown source file>:<unknown line>
  628. 37.84 s gammaloop-nextest-core> 12: start_thread<unknown>
  629. 37.84 s gammaloop-nextest-core> at <unknown source file>:<unknown line>
  630. 37.84 s gammaloop-nextest-core> 13: __clone3<unknown>
  631. 37.84 s gammaloop-nextest-core> at <unknown source file>:<unknown line>
  632. 37.84 s gammaloop-nextest-core>
  633. 37.84 s gammaloop-nextest-core> Run with COLORBT_SHOW_HIDDEN=1 environment variable to disable frame filtering.
  634. 37.84 s gammaloop-nextest-core> Run with RUST_BACKTRACE=full to include source snippets.
  635. 37.84 s gammaloop-nextest-core>
  636. 37.84 s gammaloop-nextest-core> 4. gammalooprs::uv::tests::scalars_profile_new
  637. 37.84 s gammaloop-nextest-core> failure: test failure with exit code 101
  638. 37.84 s gammaloop-nextest-core> system-out
  639. 37.84 s gammaloop-nextest-core> running 1 test
  640. 37.84 s gammaloop-nextest-core> test uv::tests::scalars_profile_new ... FAILED
  641. 37.84 s gammaloop-nextest-core>
  642. 37.84 s gammaloop-nextest-core> failures:
  643. 37.84 s gammaloop-nextest-core>
  644. 37.84 s gammaloop-nextest-core> failures:
  645. 37.84 s gammaloop-nextest-core> uv::tests::scalars_profile_new
  646. 37.84 s gammaloop-nextest-core>
  647. 37.84 s gammaloop-nextest-core> test result: FAILED. 0 passed; 1 failed; 0 ignored; 0 measured; 611 filtered out; finished in 10.30s
  648. 37.84 s gammaloop-nextest-core> system-err
  649. 37.84 s gammaloop-nextest-core> [18:18:39.444] @gammalooprs::settings::runtime WARNING : No external kinematics were provided; using default-generated external momenta and helicities.
  650. 37.84 s gammaloop-nextest-core> field value
  651. 37.84 s gammaloop-nextest-core> span build_integrand{amplitude.name=bub}
  652. 37.84 s gammaloop-nextest-core> at crates/gammalooprs/src/settings/runtime.rs:131
  653. 37.84 s gammaloop-nextest-core> [18:18:39.445] @gammalooprs::integrands::process::amplitude INFO : Input is below threshold: 0 existing threshold E-surfaces across 0/3 graph groups
  654. 37.84 s gammaloop-nextest-core> field value
  655. 37.84 s gammaloop-nextest-core> existing_esurfaces 0
  656. 37.84 s gammaloop-nextest-core> group_count 3
  657. 37.84 s gammaloop-nextest-core> groups_above_threshold 0
  658. 37.84 s gammaloop-nextest-core> integrand bub
  659. 37.84 s gammaloop-nextest-core> span warm_up{integrand.name=bub}
  660. 37.84 s gammaloop-nextest-core> threshold_status below threshold
  661. 37.84 s gammaloop-nextest-core> at crates/gammalooprs/src/integrands/process/amplitude/mod.rs:1666
  662. 37.84 s gammaloop-nextest-core> [18:18:39.445] @gammalooprs::integrands::process::amplitude INFO : overlap structure of group 0: [0: []]
  663. 37.84 s gammaloop-nextest-core> field value
  664. 37.84 s gammaloop-nextest-core> span warm_up{integrand.name=bub}
  665. 37.84 s gammaloop-nextest-core> at crates/gammalooprs/src/integrands/process/amplitude/mod.rs:2015
  666. 37.84 s gammaloop-nextest-core> [18:18:39.445] @gammalooprs::integrands::process::amplitude INFO : overlap structure of group 1: [0: []]
  667. 37.84 s gammaloop-nextest-core> field value
  668. 37.84 s gammaloop-nextest-core> span warm_up{integrand.name=bub}
  669. 37.84 s gammaloop-nextest-core> at crates/gammalooprs/src/integrands/process/amplitude/mod.rs:2015
  670. 37.84 s gammaloop-nextest-core> [18:18:39.445] @gammalooprs::integrands::process::amplitude INFO : overlap structure of group 2: [0: []]
  671. 37.84 s gammaloop-nextest-core> field value
  672. 37.84 s gammaloop-nextest-core> span warm_up{integrand.name=bub}
  673. 37.84 s gammaloop-nextest-core> at crates/gammalooprs/src/integrands/process/amplitude/mod.rs:2015
  674. 37.84 s gammaloop-nextest-core> The application panicked (crashed).
  675. 37.84 s gammaloop-nextest-core> Message: assertion `left == right` failed: subtracted scalar UV profile failed:
  676. 37.84 s gammaloop-nextest-core> UVProfilePassFail {
  677. 37.84 s gammaloop-nextest-core> max_dod: -0.9,
  678. 37.84 s gammaloop-nextest-core> total: 16,
  679. 37.84 s gammaloop-nextest-core> failed: 1,
  680. 37.84 s gammaloop-nextest-core> failures: [
  681. 37.84 s gammaloop-nextest-core> UVProfileFailure {
  682. 37.84 s gammaloop-nextest-core> graph_index: 0,
  683. 37.84 s gammaloop-nextest-core> graph_name: "banana",
  684. 37.84 s gammaloop-nextest-core> cutkosky_cut: None,
  685. 37.84 s gammaloop-nextest-core> lmb_index: 1,
  686. 37.84 s gammaloop-nextest-core> fixed: [
  687. 37.84 s gammaloop-nextest-core> EdgeIndex(
  688. 37.84 s gammaloop-nextest-core> 2,
  689. 37.84 s gammaloop-nextest-core> ),
  690. 37.84 s gammaloop-nextest-core> EdgeIndex(
  691. 37.84 s gammaloop-nextest-core> 0,
  692. 37.84 s gammaloop-nextest-core> ),
  693. 37.84 s gammaloop-nextest-core> ],
  694. 37.84 s gammaloop-nextest-core> free: [
  695. 37.84 s gammaloop-nextest-core> EdgeIndex(
  696. 37.84 s gammaloop-nextest-core> 3,
  697. 37.84 s gammaloop-nextest-core> ),
  698. 37.84 s gammaloop-nextest-core> ],
  699. 37.84 s gammaloop-nextest-core> orientation_label: None,
  700. 37.84 s gammaloop-nextest-core> reason: "dod_exceeds_threshold",
  701. 37.84 s gammaloop-nextest-core> },
  702. 37.84 s gammaloop-nextest-core> ],
  703. 37.84 s gammaloop-nextest-core> }
  704. 37.84 s gammaloop-nextest-core>
  705. 37.84 s gammaloop-nextest-core> ╭─────────┬────────────┬───────────┬───────┬─────┬──────────┬───────────╮
  706. 37.84 s gammaloop-nextest-core> │ fixed │ → ∞ │ slope │ r2 │ DOD │ bare DOD │ inspect │
  707. 37.84 s gammaloop-nextest-core> ├─────────┼────────────┼───────────┼───────┼─────┼──────────┼───────────┤
  708. 37.84 s gammaloop-nextest-core> │ {e1,e2} │ {e3} │ -0.996752 │ 1.000 │ -1 │ 0 │ arb retry │
  709. 37.84 s gammaloop-nextest-core> │ {e1,e3} │ {e2} │ -1.065665 │ 0.997 │ -1 │ 0 │ arb retry │
  710. 37.84 s gammaloop-nextest-core> │ {e1} │ {e2,e3} │ -0.937151 │ 0.943 │ -1 │ 2 │ │
  711. 37.84 s gammaloop-nextest-core> │ {e2,e3} │ {e1} │ -1.001075 │ 1.000 │ -1 │ 0 │ arb retry │
  712. 37.84 s gammaloop-nextest-core> │ {e2} │ {e1,e3} │ -0.984146 │ 0.998 │ -1 │ 2 │ │
  713. 37.84 s gammaloop-nextest-core> │ {e3} │ {e1,e2} │ -1.383911 │ 0.982 │ -1 │ 2 │ arb retry │
  714. 37.84 s gammaloop-nextest-core> │ {} │ {e1,e2,e3} │ -1.094213 │ 0.258 │ -1 │ 4 │ │
  715. 37.84 s gammaloop-nextest-core> │ {e2,e0} │ {e3} │ -0.803348 │ 0.861 │ -1 │ 0 │ arb retry │
  716. 37.84 s gammaloop-nextest-core> │ {e3,e0} │ {e2} │ -0.999257 │ 1.000 │ -1 │ 0 │ │
  717. 37.84 s gammaloop-nextest-core> │ {e0} │ {e2,e3} │ -1.000893 │ 1.000 │ -1 │ 2 │ │
  718. 37.84 s gammaloop-nextest-core> │ {e1,e0} │ {e3} │ -0.997860 │ 1.000 │ -1 │ 0 │ │
  719. 37.84 s gammaloop-nextest-core> ╰─────────┴────────────┴───────────┴───────┴─────┴──────────┴───────────╯
  720. 37.84 s gammaloop-nextest-core>
  721. 37.84 s gammaloop-nextest-core> ╭───────┬─────────┬───────────┬───────┬─────┬──────────┬───────────╮
  722. 37.84 s gammaloop-nextest-core> │ fixed │ → ∞ │ slope │ r2 │ DOD │ bare DOD │ inspect │
  723. 37.84 s gammaloop-nextest-core> ├───────┼─────────┼───────────┼───────┼─────┼──────────┼───────────┤
  724. 37.84 s gammaloop-nextest-core> │ {e1} │ {e2} │ -1.005039 │ 1.000 │ -1 │ 0 │ arb retry │
  725. 37.84 s gammaloop-nextest-core> │ {e2} │ {e1} │ -1.001098 │ 1.000 │ -1 │ 0 │ arb retry │
  726. 37.84 s gammaloop-nextest-core> │ {} │ {e1,e2} │ -1.011289 │ 1.000 │ -1 │ 2 │ │
  727. 37.84 s gammaloop-nextest-core> │ {e0} │ {e2} │ -0.998140 │ 1.000 │ -1 │ 0 │ │
  728. 37.84 s gammaloop-nextest-core> ╰───────┴─────────┴───────────┴───────┴─────┴──────────┴───────────╯
  729. 37.84 s gammaloop-nextest-core>
  730. 37.84 s gammaloop-nextest-core> ╭───────┬──────┬───────────┬───────┬─────┬──────────┬─────────╮
  731. 37.84 s gammaloop-nextest-core> │ fixed │ → ∞ │ slope │ r2 │ DOD │ bare DOD │ inspect │
  732. 37.84 s gammaloop-nextest-core> ├───────┼──────┼───────────┼───────┼─────┼──────────┼─────────┤
  733. 37.84 s gammaloop-nextest-core> │ {} │ {e1} │ -0.989949 │ 1.000 │ -1 │ 0 │ │
  734. 37.84 s gammaloop-nextest-core> ╰───────┴──────┴───────────┴───────┴─────┴──────────┴─────────╯
  735. 37.84 s gammaloop-nextest-core> left: 1
  736. 37.84 s gammaloop-nextest-core> right: 0
  737. 37.84 s gammaloop-nextest-core> Location: crates/gammalooprs/src/uv/tests.rs:325
  738. 37.84 s gammaloop-nextest-core>
  739. 37.84 s gammaloop-nextest-core> ━━━━━━━━━━━━━━━━━━━━━━━━━━━━━━━━━━ BACKTRACE ━━━━━━━━━━━━━━━━━━━━━━━━━━━━━━━━━━━
  740. 37.84 s gammaloop-nextest-core> 1: <color_eyre[51793ea62743adbd]::config::PanicHook>::panic_report<unknown>
  741. 37.84 s gammaloop-nextest-core> at <unknown source file>:<unknown line>
  742. 37.84 s gammaloop-nextest-core> 2: <color_eyre[51793ea62743adbd]::config::PanicHook>::into_panic_hook::{closure#0}<unknown>
  743. 37.84 s gammaloop-nextest-core> at <unknown source file>:<unknown line>
  744. 37.84 s gammaloop-nextest-core> 3: std[bcb96dfbba0ab899]::panicking::panic_with_hook<unknown>
  745. 37.84 s gammaloop-nextest-core> at <unknown source file>:<unknown line>
  746. 37.84 s gammaloop-nextest-core> 4: std[bcb96dfbba0ab899]::panicking::panic_handler::{closure#0}<unknown>
  747. 37.84 s gammaloop-nextest-core> at <unknown source file>:<unknown line>
  748. 37.84 s gammaloop-nextest-core> 5: std[bcb96dfbba0ab899]::sys::backtrace::__rust_end_short_backtrace::<std[bcb96dfbba0ab899]::panicking::panic_handler::{closure#0}, !><unknown>
  749. 37.84 s gammaloop-nextest-core> at <unknown source file>:<unknown line>
  750. 37.84 s gammaloop-nextest-core> 6: __rustc[6c289b9f9c454d21]::rust_begin_unwind<unknown>
  751. 37.84 s gammaloop-nextest-core> at <unknown source file>:<unknown line>
  752. 37.84 s gammaloop-nextest-core> 7: core[940e698046960fd5]::panicking::panic_fmt<unknown>
  753. 37.84 s gammaloop-nextest-core> at <unknown source file>:<unknown line>
  754. 37.84 s gammaloop-nextest-core> 8: core[940e698046960fd5]::panicking::assert_failed_inner<unknown>
  755. 37.84 s gammaloop-nextest-core> at <unknown source file>:<unknown line>
  756. 37.84 s gammaloop-nextest-core> 9: core[940e698046960fd5]::panicking::assert_failed::<usize, usize><unknown>
  757. 37.84 s gammaloop-nextest-core> at <unknown source file>:<unknown line>
  758. 37.84 s gammaloop-nextest-core> 10: gammalooprs[972dff90865981f6]::uv::tests::scalars_profile_new<unknown>
  759. 37.84 s gammaloop-nextest-core> at <unknown source file>:<unknown line>
  760. 37.84 s gammaloop-nextest-core> 11: <gammalooprs[972dff90865981f6]::uv::tests::scalars_profile_new::{closure#0} as core[940e698046960fd5]::ops::function::FnOnce<()>>::call_once<unknown>
  761. 37.84 s gammaloop-nextest-core> at <unknown source file>:<unknown line>
  762. 37.84 s gammaloop-nextest-core> 12: test[75d6903177b1d7e9]::__rust_begin_short_backtrace::<core[940e698046960fd5]::result::Result<(), alloc[2ea6bcb46fca0c42]::string::String>, fn() -> core[940e698046960fd5]::result::Result<(), alloc[2ea6bcb46fca0c42]::string::String>><unknown>
  763. 37.84 s gammaloop-nextest-core> at <unknown source file>:<unknown line>
  764. 37.84 s gammaloop-nextest-core> 13: test[75d6903177b1d7e9]::run_test::{closure#0}<unknown>
  765. 37.84 s gammaloop-nextest-core> at <unknown source file>:<unknown line>
  766. 37.84 s gammaloop-nextest-core> 14: std[bcb96dfbba0ab899]::sys::backtrace::__rust_begin_short_backtrace::<test[75d6903177b1d7e9]::run_test::{closure#1}, ()><unknown>
  767. 37.84 s gammaloop-nextest-core> at <unknown source file>:<unknown line>
  768. 37.84 s gammaloop-nextest-core> ... omitted 11 more lines; see full nextest output above
  769. 37.84 s gammaloop-nextest-core>
  770. 37.84 s gammaloop-nextest-core> 5. gammalooprs::uv::tests::scalars_profile
  771. 37.84 s gammaloop-nextest-core> failure: test failure with exit code 101
  772. 37.84 s gammaloop-nextest-core> system-out
  773. 37.84 s gammaloop-nextest-core> running 1 test
  774. 37.84 s gammaloop-nextest-core> test uv::tests::scalars_profile ... FAILED
  775. 37.84 s gammaloop-nextest-core>
  776. 37.84 s gammaloop-nextest-core> failures:
  777. 37.84 s gammaloop-nextest-core>
  778. 37.84 s gammaloop-nextest-core> failures:
  779. 37.84 s gammaloop-nextest-core> uv::tests::scalars_profile
  780. 37.84 s gammaloop-nextest-core>
  781. 37.84 s gammaloop-nextest-core> test result: FAILED. 0 passed; 1 failed; 0 ignored; 0 measured; 611 filtered out; finished in 10.32s
  782. 37.84 s gammaloop-nextest-core> system-err
  783. 37.84 s gammaloop-nextest-core> [18:18:39.434] @gammalooprs::settings::runtime WARNING : No external kinematics were provided; using default-generated external momenta and helicities.
  784. 37.84 s gammaloop-nextest-core> field value
  785. 37.84 s gammaloop-nextest-core> span build_integrand{amplitude.name=bub}
  786. 37.84 s gammaloop-nextest-core> at crates/gammalooprs/src/settings/runtime.rs:131
  787. 37.84 s gammaloop-nextest-core> [18:18:39.435] @gammalooprs::integrands::process::amplitude INFO : Input is below threshold: 0 existing threshold E-surfaces across 0/3 graph groups
  788. 37.84 s gammaloop-nextest-core> field value
  789. 37.84 s gammaloop-nextest-core> existing_esurfaces 0
  790. 37.84 s gammaloop-nextest-core> group_count 3
  791. 37.84 s gammaloop-nextest-core> groups_above_threshold 0
  792. 37.84 s gammaloop-nextest-core> integrand bub
  793. 37.84 s gammaloop-nextest-core> span warm_up{integrand.name=bub}
  794. 37.84 s gammaloop-nextest-core> threshold_status below threshold
  795. 37.84 s gammaloop-nextest-core> at crates/gammalooprs/src/integrands/process/amplitude/mod.rs:1666
  796. 37.84 s gammaloop-nextest-core> [18:18:39.435] @gammalooprs::integrands::process::amplitude INFO : overlap structure of group 0: [0: []]
  797. 37.84 s gammaloop-nextest-core> field value
  798. 37.84 s gammaloop-nextest-core> span warm_up{integrand.name=bub}
  799. 37.84 s gammaloop-nextest-core> at crates/gammalooprs/src/integrands/process/amplitude/mod.rs:2015
  800. 37.84 s gammaloop-nextest-core> [18:18:39.435] @gammalooprs::integrands::process::amplitude INFO : overlap structure of group 1: [0: []]
  801. 37.84 s gammaloop-nextest-core> field value
  802. 37.84 s gammaloop-nextest-core> span warm_up{integrand.name=bub}
  803. 37.84 s gammaloop-nextest-core> at crates/gammalooprs/src/integrands/process/amplitude/mod.rs:2015
  804. 37.84 s gammaloop-nextest-core> [18:18:39.435] @gammalooprs::integrands::process::amplitude INFO : overlap structure of group 2: [0: []]
  805. 37.84 s gammaloop-nextest-core> field value
  806. 37.84 s gammaloop-nextest-core> span warm_up{integrand.name=bub}
  807. 37.84 s gammaloop-nextest-core> at crates/gammalooprs/src/integrands/process/amplitude/mod.rs:2015
  808. 37.84 s gammaloop-nextest-core> The application panicked (crashed).
  809. 37.84 s gammaloop-nextest-core> Message: assertion `left == right` failed: subtracted scalar UV profile failed:
  810. 37.84 s gammaloop-nextest-core> UVProfilePassFail {
  811. 37.84 s gammaloop-nextest-core> max_dod: -0.9,
  812. 37.84 s gammaloop-nextest-core> total: 16,
  813. 37.84 s gammaloop-nextest-core> failed: 1,
  814. 37.84 s gammaloop-nextest-core> failures: [
  815. 37.84 s gammaloop-nextest-core> UVProfileFailure {
  816. 37.84 s gammaloop-nextest-core> graph_index: 0,
  817. 37.84 s gammaloop-nextest-core> graph_name: "banana",
  818. 37.84 s gammaloop-nextest-core> cutkosky_cut: None,
  819. 37.84 s gammaloop-nextest-core> lmb_index: 1,
  820. 37.84 s gammaloop-nextest-core> fixed: [
  821. 37.84 s gammaloop-nextest-core> EdgeIndex(
  822. 37.84 s gammaloop-nextest-core> 2,
  823. 37.84 s gammaloop-nextest-core> ),
  824. 37.84 s gammaloop-nextest-core> EdgeIndex(
  825. 37.84 s gammaloop-nextest-core> 0,
  826. 37.84 s gammaloop-nextest-core> ),
  827. 37.84 s gammaloop-nextest-core> ],
  828. 37.84 s gammaloop-nextest-core> free: [
  829. 37.84 s gammaloop-nextest-core> EdgeIndex(
  830. 37.84 s gammaloop-nextest-core> 3,
  831. 37.84 s gammaloop-nextest-core> ),
  832. 37.84 s gammaloop-nextest-core> ],
  833. 37.84 s gammaloop-nextest-core> orientation_label: None,
  834. 37.84 s gammaloop-nextest-core> reason: "dod_exceeds_threshold",
  835. 37.84 s gammaloop-nextest-core> },
  836. 37.84 s gammaloop-nextest-core> ],
  837. 37.84 s gammaloop-nextest-core> }
  838. 37.84 s gammaloop-nextest-core>
  839. 37.84 s gammaloop-nextest-core> ╭─────────┬────────────┬───────────┬───────┬─────┬──────────┬───────────╮
  840. 37.84 s gammaloop-nextest-core> │ fixed │ → ∞ │ slope │ r2 │ DOD │ bare DOD │ inspect │
  841. 37.84 s gammaloop-nextest-core> ├─────────┼────────────┼───────────┼───────┼─────┼──────────┼───────────┤
  842. 37.84 s gammaloop-nextest-core> │ {e1,e2} │ {e3} │ -0.996752 │ 1.000 │ -1 │ 0 │ arb retry │
  843. 37.84 s gammaloop-nextest-core> │ {e1,e3} │ {e2} │ -1.065665 │ 0.997 │ -1 │ 0 │ arb retry │
  844. 37.84 s gammaloop-nextest-core> │ {e1} │ {e2,e3} │ -0.937151 │ 0.943 │ -1 │ 2 │ │
  845. 37.84 s gammaloop-nextest-core> │ {e2,e3} │ {e1} │ -1.001075 │ 1.000 │ -1 │ 0 │ arb retry │
  846. 37.84 s gammaloop-nextest-core> │ {e2} │ {e1,e3} │ -0.984146 │ 0.998 │ -1 │ 2 │ │
  847. 37.84 s gammaloop-nextest-core> │ {e3} │ {e1,e2} │ -1.383911 │ 0.982 │ -1 │ 2 │ arb retry │
  848. 37.84 s gammaloop-nextest-core> │ {} │ {e1,e2,e3} │ -1.094213 │ 0.258 │ -1 │ 4 │ │
  849. 37.84 s gammaloop-nextest-core> │ {e2,e0} │ {e3} │ -0.803348 │ 0.861 │ -1 │ 0 │ arb retry │
  850. 37.84 s gammaloop-nextest-core> │ {e3,e0} │ {e2} │ -0.999257 │ 1.000 │ -1 │ 0 │ │
  851. 37.84 s gammaloop-nextest-core> │ {e0} │ {e2,e3} │ -1.000893 │ 1.000 │ -1 │ 2 │ │
  852. 37.84 s gammaloop-nextest-core> │ {e1,e0} │ {e3} │ -0.997860 │ 1.000 │ -1 │ 0 │ │
  853. 37.84 s gammaloop-nextest-core> ╰─────────┴────────────┴───────────┴───────┴─────┴──────────┴───────────╯
  854. 37.84 s gammaloop-nextest-core>
  855. 37.84 s gammaloop-nextest-core> ╭───────┬─────────┬───────────┬───────┬─────┬──────────┬───────────╮
  856. 37.84 s gammaloop-nextest-core> │ fixed │ → ∞ │ slope │ r2 │ DOD │ bare DOD │ inspect │
  857. 37.84 s gammaloop-nextest-core> ├───────┼─────────┼───────────┼───────┼─────┼──────────┼───────────┤
  858. 37.84 s gammaloop-nextest-core> │ {e1} │ {e2} │ -1.005039 │ 1.000 │ -1 │ 0 │ arb retry │
  859. 37.84 s gammaloop-nextest-core> │ {e2} │ {e1} │ -1.001098 │ 1.000 │ -1 │ 0 │ arb retry │
  860. 37.84 s gammaloop-nextest-core> │ {} │ {e1,e2} │ -1.011289 │ 1.000 │ -1 │ 2 │ │
  861. 37.84 s gammaloop-nextest-core> │ {e0} │ {e2} │ -0.998140 │ 1.000 │ -1 │ 0 │ │
  862. 37.84 s gammaloop-nextest-core> ╰───────┴─────────┴───────────┴───────┴─────┴──────────┴───────────╯
  863. 37.84 s gammaloop-nextest-core>
  864. 37.84 s gammaloop-nextest-core> ╭───────┬──────┬───────────┬───────┬─────┬──────────┬─────────╮
  865. 37.84 s gammaloop-nextest-core> │ fixed │ → ∞ │ slope │ r2 │ DOD │ bare DOD │ inspect │
  866. 37.84 s gammaloop-nextest-core> ├───────┼──────┼───────────┼───────┼─────┼──────────┼─────────┤
  867. 37.84 s gammaloop-nextest-core> │ {} │ {e1} │ -0.989949 │ 1.000 │ -1 │ 0 │ │
  868. 37.84 s gammaloop-nextest-core> ╰───────┴──────┴───────────┴───────┴─────┴──────────┴─────────╯
  869. 37.84 s gammaloop-nextest-core> left: 1
  870. 37.84 s gammaloop-nextest-core> right: 0
  871. 37.84 s gammaloop-nextest-core> Location: crates/gammalooprs/src/uv/tests.rs:259
  872. 37.84 s gammaloop-nextest-core>
  873. 37.84 s gammaloop-nextest-core> ━━━━━━━━━━━━━━━━━━━━━━━━━━━━━━━━━━ BACKTRACE ━━━━━━━━━━━━━━━━━━━━━━━━━━━━━━━━━━━
  874. 37.84 s gammaloop-nextest-core> 1: <color_eyre[51793ea62743adbd]::config::PanicHook>::panic_report<unknown>
  875. 37.84 s gammaloop-nextest-core> at <unknown source file>:<unknown line>
  876. 37.84 s gammaloop-nextest-core> 2: <color_eyre[51793ea62743adbd]::config::PanicHook>::into_panic_hook::{closure#0}<unknown>
  877. 37.84 s gammaloop-nextest-core> at <unknown source file>:<unknown line>
  878. 37.84 s gammaloop-nextest-core> 3: std[bcb96dfbba0ab899]::panicking::panic_with_hook<unknown>
  879. 37.84 s gammaloop-nextest-core> at <unknown source file>:<unknown line>
  880. 37.84 s gammaloop-nextest-core> 4: std[bcb96dfbba0ab899]::panicking::panic_handler::{closure#0}<unknown>
  881. 37.84 s gammaloop-nextest-core> at <unknown source file>:<unknown line>
  882. 37.84 s gammaloop-nextest-core> 5: std[bcb96dfbba0ab899]::sys::backtrace::__rust_end_short_backtrace::<std[bcb96dfbba0ab899]::panicking::panic_handler::{closure#0}, !><unknown>
  883. 37.84 s gammaloop-nextest-core> at <unknown source file>:<unknown line>
  884. 37.84 s gammaloop-nextest-core> 6: __rustc[6c289b9f9c454d21]::rust_begin_unwind<unknown>
  885. 37.84 s gammaloop-nextest-core> at <unknown source file>:<unknown line>
  886. 37.84 s gammaloop-nextest-core> 7: core[940e698046960fd5]::panicking::panic_fmt<unknown>
  887. 37.84 s gammaloop-nextest-core> at <unknown source file>:<unknown line>
  888. 37.84 s gammaloop-nextest-core> 8: core[940e698046960fd5]::panicking::assert_failed_inner<unknown>
  889. 37.84 s gammaloop-nextest-core> at <unknown source file>:<unknown line>
  890. 37.84 s gammaloop-nextest-core> 9: core[940e698046960fd5]::panicking::assert_failed::<usize, usize><unknown>
  891. 37.84 s gammaloop-nextest-core> at <unknown source file>:<unknown line>
  892. 37.84 s gammaloop-nextest-core> 10: gammalooprs[972dff90865981f6]::uv::tests::scalars_profile<unknown>
  893. 37.84 s gammaloop-nextest-core> at <unknown source file>:<unknown line>
  894. 37.84 s gammaloop-nextest-core> 11: <gammalooprs[972dff90865981f6]::uv::tests::scalars_profile::{closure#0} as core[940e698046960fd5]::ops::function::FnOnce<()>>::call_once<unknown>
  895. 37.84 s gammaloop-nextest-core> at <unknown source file>:<unknown line>
  896. 37.84 s gammaloop-nextest-core> 12: test[75d6903177b1d7e9]::__rust_begin_short_backtrace::<core[940e698046960fd5]::result::Result<(), alloc[2ea6bcb46fca0c42]::string::String>, fn() -> core[940e698046960fd5]::result::Result<(), alloc[2ea6bcb46fca0c42]::string::String>><unknown>
  897. 37.84 s gammaloop-nextest-core> at <unknown source file>:<unknown line>
  898. 37.84 s gammaloop-nextest-core> 13: test[75d6903177b1d7e9]::run_test::{closure#0}<unknown>
  899. 37.84 s gammaloop-nextest-core> at <unknown source file>:<unknown line>
  900. 37.84 s gammaloop-nextest-core> 14: std[bcb96dfbba0ab899]::sys::backtrace::__rust_begin_short_backtrace::<test[75d6903177b1d7e9]::run_test::{closure#1}, ()><unknown>
  901. 37.84 s gammaloop-nextest-core> at <unknown source file>:<unknown line>
  902. 37.84 s gammaloop-nextest-core> ... omitted 11 more lines; see full nextest output above
  903. 37.84 s gammaloop-nextest-core> =========================================
  904. 37.85 s gammaloop-nextest-core> Extracting 1 binary, 1 build script output directory, and 1 linked path to /build/nextest-archive-5ht6Sg
  905. 37.93 s gammaloop-nextest-core> Extracted 7 files to /build/nextest-archive-5ht6Sg in 0.07s
  906. 37.93 s gammaloop-nextest-core> ------------
  907. 37.93 s gammaloop-nextest-core> Nextest run ID 149eb2b5-8c00-4cf9-80d5-707c96f72c12 with nextest profile: ci_gammaloop
  908. 37.93 s gammaloop-nextest-core> Starting 54 tests across 1 binary
  909. 38.25 s gammaloop-nextest-core> ------------
  910. 38.25 s gammaloop-nextest-core> Summary [ 0.317s] 54 tests run: 54 passed, 0 skipped
  911. 38.29 s gammaloop-nextest-core>
  912. 38.29 s gammaloop-nextest-core> ========== nextest test summary ==========
  913. 38.29 s gammaloop-nextest-core> report: target/nextest/ci_gammaloop/junit.xml
  914. 38.29 s gammaloop-nextest-core> tests: 54, failures: 0, errors: 0
  915. 38.29 s gammaloop-nextest-core> No failing testcases found.
  916. 38.29 s gammaloop-nextest-core> =========================================
  917. 38.34 s [0 built (1 failed), 0.0error: Cannot build '/nix/store/xmqryc6f4382yn38pvqdg8lk2i1rvwkl-gammaloop-nextest-core.drv'.
  918. 38.34 s Reason: builder failed with exit code 100.
  919. 38.34 s Output paths:
  920. 38.34 s /nix/store/qs56ygvnfbmkl3lbwy1lyz1bkaf3fqsx-gammaloop-nextest-core
  921. 38.34 s Last 1576 log lines:
  922. 38.34 s > Extracting 3 binaries (including 1 non-test binary), 1 build script output directory, and 2 linked paths to /build/nextest-archive-lJgXhe
  923. 38.34 s > Extracted 18 files to /build/nextest-archive-lJgXhe in 0.74s
  924. 38.34 s > ------------
  925. 38.34 s > Nextest run ID 6a252a1e-04c0-4fda-9d62-02d2449c6dec with nextest profile: ci_gammaloop
  926. 38.34 s > Starting 375 tests across 2 binaries
  927. 38.34 s > ------------
  928. 38.34 s > Summary [ 0.745s] 375 tests run: 375 passed, 0 skipped
  929. 38.34 s >
  930. 38.34 s > ========== nextest test summary ==========
  931. 38.34 s > report: target/nextest/ci_gammaloop/junit.xml
  932. 38.34 s > tests: 375, failures: 0, errors: 0
  933. 38.34 s > No failing testcases found.
  934. 38.34 s > =========================================
  935. 38.34 s > Extracting 1 binary and 1 linked path to /build/nextest-archive-vkGtcM
  936. 38.34 s > Extracted 7 files to /build/nextest-archive-vkGtcM in 0.10s
  937. 38.34 s > ------------
  938. 38.34 s > Nextest run ID 2698274b-d634-402c-9456-b9f0055796d3 with nextest profile: ci_gammaloop
  939. 38.34 s > Starting 19 tests across 1 binary
  940. 38.34 s > ------------
  941. 38.34 s > Summary [ 0.014s] 19 tests run: 19 passed, 0 skipped
  942. 38.34 s >
  943. 38.34 s > ========== nextest test summary ==========
  944. 38.34 s > report: target/nextest/ci_gammaloop/junit.xml
  945. 38.34 s > tests: 19, failures: 0, errors: 0
  946. 38.34 s > No failing testcases found.
  947. 38.34 s > =========================================
  948. 38.34 s > Extracting 1 binary to /build/nextest-archive-vyF8Dt
  949. 38.34 s > Extracted 4 files to /build/nextest-archive-vyF8Dt in 0.05s
  950. 38.34 s > ------------
  951. 38.34 s > Nextest run ID fbcf81d7-936a-4643-abd7-41ab67ddcbab with nextest profile: ci_gammaloop
  952. 38.34 s > Starting 0 tests across 1 binary
  953. 38.34 s > ------------
  954. 38.34 s > Summary [ 0.000s] 0 tests run: 0 passed, 0 skipped
  955. 38.34 s >
  956. 38.34 s > ========== nextest test summary ==========
  957. 38.34 s > report: target/nextest/ci_gammaloop/junit.xml
  958. 38.34 s > tests: 0, failures: 0, errors: 0
  959. 38.34 s > No failing testcases found.
  960. 38.34 s > =========================================
  961. 38.34 s > Extracting 4 binaries, 1 build script output directory, and 2 linked paths to /build/nextest-archive-GLFB8I
  962. 38.34 s > Extracted 18 files to /build/nextest-archive-GLFB8I in 0.78s
  963. 38.34 s > ------------
  964. 38.34 s > Nextest run ID 577b96a2-830a-4ee8-b49e-2e3c57a60f09 with nextest profile: ci_gammaloop
  965. 38.34 s > Starting 561 tests across 4 binaries (59 tests skipped, including 58 tests via profile.ci_gammaloop.default-filter)
  966. 38.34 s > FAIL [ 0.101s] ( 51/561) gammalooprs cff::tests::stored_production_cff_uses_typed_energy_factor_ownership
  967. 38.34 s > stdout ---
  968. 38.34 s >
  969. 38.34 s > running 1 test
  970. 38.34 s > test cff::tests::stored_production_cff_uses_typed_energy_factor_ownership ... FAILED
  971. 38.34 s >
  972. 38.34 s > failures:
  973. 38.34 s >
  974. 38.34 s > failures:
  975. 38.34 s > cff::tests::stored_production_cff_uses_typed_energy_factor_ownership
  976. 38.34 s >
  977. 38.34 s > test result: FAILED. 0 passed; 1 failed; 0 ignored; 0 measured; 611 filtered out; finished in 0.09s
  978. 38.34 s >
  979. 38.34 s > stderr ---
  980. 38.34 s > The application panicked (crashed).
  981. 38.34 s > Message: assertion `left == right` failed
  982. 38.34 s > left: 1
  983. 38.34 s > right: -1
  984. 38.34 s > Location: crates/gammalooprs/src/cff/mod.rs:2721
  985. 38.34 s >
  986. 38.34 s > ━━━━━━━━━━━━━━━━━━━━━━━━━━━━━━━━━━ BACKTRACE ━━━━━━━━━━━━━━━━━━━━━━━━━━━━━━━━━━━
  987. 38.34 s > 1: <color_eyre[51793ea62743adbd]::config::PanicHook>::panic_report<unknown>
  988. 38.34 s > at <unknown source file>:<unknown line>
  989. 38.34 s > 2: <color_eyre[51793ea62743adbd]::config::PanicHook>::into_panic_hook::{closure#0}<unknown>
  990. 38.34 s > at <unknown source file>:<unknown line>
  991. 38.34 s > 3: std[bcb96dfbba0ab899]::panicking::panic_with_hook<unknown>
  992. 38.34 s > at <unknown source file>:<unknown line>
  993. 38.34 s > 4: std[bcb96dfbba0ab899]::panicking::panic_handler::{closure#0}<unknown>
  994. 38.34 s > at <unknown source file>:<unknown line>
  995. 38.34 s > 5: std[bcb96dfbba0ab899]::sys::backtrace::__rust_end_short_backtrace::<std[bcb96dfbba0ab899]::panicking::panic_handler::{closure#0}, !><unknown>
  996. 38.34 s > at <unknown source file>:<unknown line>
  997. 38.34 s > 6: __rustc[6c289b9f9c454d21]::rust_begin_unwind<unknown>
  998. 38.34 s > at <unknown source file>:<unknown line>
  999. 38.34 s > 7: core[940e698046960fd5]::panicking::panic_fmt<unknown>
  1000. 38.34 s > at <unknown source file>:<unknown line>
  1001. 38.34 s > 8: core[940e698046960fd5]::panicking::assert_failed_inner<unknown>
  1002. 38.34 s > at <unknown source file>:<unknown line>
  1003. 38.34 s > 9: core[940e698046960fd5]::panicking::assert_failed::<i64, i64><unknown>
  1004. 38.34 s > at <unknown source file>:<unknown line>
  1005. 38.34 s > 10: gammalooprs[972dff90865981f6]::cff::tests::stored_production_cff_uses_typed_energy_factor_ownership<unknown>
  1006. 38.34 s > at <unknown source file>:<unknown line>
  1007. 38.34 s > 11: <gammalooprs[972dff90865981f6]::cff::tests::stored_production_cff_uses_typed_energy_factor_ownership::{closure#0} as core[940e698046960fd5]::ops::function::FnOnce<()>>::call_once<unknown>
  1008. 38.34 s > at <unknown source file>:<unknown line>
  1009. 38.34 s > 12: test[75d6903177b1d7e9]::__rust_begin_short_backtrace::<core[940e698046960fd5]::result::Result<(), alloc[2ea6bcb46fca0c42]::string::String>, fn() -> core[940e698046960fd5]::result::Result<(), alloc[2ea6bcb46fca0c42]::string::String>><unknown>
  1010. 38.34 s > at <unknown source file>:<unknown line>
  1011. 38.34 s > 13: test[75d6903177b1d7e9]::run_test::{closure#0}<unknown>
  1012. 38.34 s > at <unknown source file>:<unknown line>
  1013. 38.34 s > 14: std[bcb96dfbba0ab899]::sys::backtrace::__rust_begin_short_backtrace::<test[75d6903177b1d7e9]::run_test::{closure#1}, ()><unknown>
  1014. 38.34 s > at <unknown source file>:<unknown line>
  1015. 38.34 s > 15: <std[bcb96dfbba0ab899]::thread::lifecycle::spawn_unchecked<test[75d6903177b1d7e9]::run_test::{closure#1}, ()>::{closure#1} as core[940e698046960fd5]::ops::function::FnOnce<()>>::call_once::{shim:vtable#0}<unknown>
  1016. 38.34 s > at <unknown source file>:<unknown line>
  1017. 38.34 s > 16: <std[bcb96dfbba0ab899]::sys::thread::unix::Thread>::new::thread_start<unknown>
  1018. 38.34 s > at <unknown source file>:<unknown line>
  1019. 38.34 s > 17: start_thread<unknown>
  1020. 38.34 s > at <unknown source file>:<unknown line>
  1021. 38.34 s > 18: __clone3<unknown>
  1022. 38.34 s > at <unknown source file>:<unknown line>
  1023. 38.34 s >
  1024. 38.34 s > Run with COLORBT_SHOW_HIDDEN=1 environment variable to disable frame filtering.
  1025. 38.34 s > Run with RUST_BACKTRACE=full to include source snippets.
  1026. 38.34 s >
  1027. 38.34 s > FAIL [ 0.115s] (486/561) gammalooprs uv::approx::local_3d::tests::production_emr_map_cancels_one_powered_denominator
  1028. 38.34 s > stdout ---
  1029. 38.34 s >
  1030. 38.34 s > running 1 test
  1031. 38.34 s > test uv::approx::local_3d::tests::production_emr_map_cancels_one_powered_denominator ... FAILED
  1032. 38.34 s >
  1033. 38.34 s > failures:
  1034. 38.34 s >
  1035. 38.34 s > failures:
  1036. 38.34 s > uv::approx::local_3d::tests::production_emr_map_cancels_one_powered_denominator
  1037. 38.34 s >
  1038. 38.34 s > test result: FAILED. 0 passed; 1 failed; 0 ignored; 0 measured; 611 filtered out; finished in 0.10s
  1039. 38.34 s >
  1040. 38.34 s > stderr ---
  1041. 38.34 s > The application panicked (crashed).
  1042. 38.34 s > Message: summed exact-source powered and selected lower channels differ: powered=-1𝑖/8/𝜋^3, lower=1𝑖/16/𝜋^3, difference=-3𝑖/16/𝜋^3
  1043. 38.34 s > Location: crates/gammalooprs/src/uv/approx/local_3d.rs:2047
  1044. 38.34 s >
  1045. 38.34 s > ━━━━━━━━━━━━━━━━━━━━━━━━━━━━━━━━━━ BACKTRACE ━━━━━━━━━━━━━━━━━━━━━━━━━━━━━━━━━━━
  1046. 38.34 s > 1: <color_eyre[51793ea62743adbd]::config::PanicHook>::panic_report<unknown>
  1047. 38.34 s > at <unknown source file>:<unknown line>
  1048. 38.34 s > 2: <color_eyre[51793ea62743adbd]::config::PanicHook>::into_panic_hook::{closure#0}<unknown>
  1049. 38.34 s > at <unknown source file>:<unknown line>
  1050. 38.34 s > 3: std[bcb96dfbba0ab899]::panicking::panic_with_hook<unknown>
  1051. 38.34 s > at <unknown source file>:<unknown line>
  1052. 38.34 s > 4: std[bcb96dfbba0ab899]::panicking::panic_handler::{closure#0}<unknown>
  1053. 38.34 s > at <unknown source file>:<unknown line>
  1054. 38.34 s > 5: std[bcb96dfbba0ab899]::sys::backtrace::__rust_end_short_backtrace::<std[bcb96dfbba0ab899]::panicking::panic_handler::{closure#0}, !><unknown>
  1055. 38.34 s > at <unknown source file>:<unknown line>
  1056. 38.34 s > 6: __rustc[6c289b9f9c454d21]::rust_begin_unwind<unknown>
  1057. 38.34 s > at <unknown source file>:<unknown line>
  1058. 38.34 s > 7: core[940e698046960fd5]::panicking::panic_fmt<unknown>
  1059. 38.34 s > at <unknown source file>:<unknown line>
  1060. 38.34 s > 8: gammalooprs[972dff90865981f6]::uv::approx::local_3d::tests::production_emr_map_cancels_one_powered_denominator<unknown>
  1061. 38.34 s > at <unknown source file>:<unknown line>
  1062. 38.34 s > 9: <gammalooprs[972dff90865981f6]::uv::approx::local_3d::tests::production_emr_map_cancels_one_powered_denominator::{closure#0} as core[940e698046960fd5]::ops::function::FnOnce<()>>::call_once<unknown>
  1063. 38.34 s > at <unknown source file>:<unknown line>
  1064. 38.34 s > 10: test[75d6903177b1d7e9]::__rust_begin_short_backtrace::<core[940e698046960fd5]::result::Result<(), alloc[2ea6bcb46fca0c42]::string::String>, fn() -> core[940e698046960fd5]::result::Result<(), alloc[2ea6bcb46fca0c42]::string::String>><unknown>
  1065. 38.34 s > at <unknown source file>:<unknown line>
  1066. 38.34 s > 11: test[75d6903177b1d7e9]::run_test::{closure#0}<unknown>
  1067. 38.34 s > at <unknown source file>:<unknown line>
  1068. 38.34 s > 12: std[bcb96dfbba0ab899]::sys::backtrace::__rust_begin_short_backtrace::<test[75d6903177b1d7e9]::run_test::{closure#1}, ()><unknown>
  1069. 38.34 s > at <unknown source file>:<unknown line>
  1070. 38.34 s > 13: <std[bcb96dfbba0ab899]::thread::lifecycle::spawn_unchecked<test[75d6903177b1d7e9]::run_test::{closure#1}, ()>::{closure#1} as core[940e698046960fd5]::ops::function::FnOnce<()>>::call_once::{shim:vtable#0}<unknown>
  1071. 38.34 s > at <unknown source file>:<unknown line>
  1072. 38.34 s > 14: <std[bcb96dfbba0ab899]::sys::thread::unix::Thread>::new::thread_start<unknown>
  1073. 38.34 s > at <unknown source file>:<unknown line>
  1074. 38.34 s > 15: start_thread<unknown>
  1075. 38.34 s > at <unknown source file>:<unknown line>
  1076. 38.34 s > 16: __clone3<unknown>
  1077. 38.34 s > at <unknown source file>:<unknown line>
  1078. 38.34 s >
  1079. 38.34 s > Run with COLORBT_SHOW_HIDDEN=1 environment variable to disable frame filtering.
  1080. 38.34 s > Run with RUST_BACKTRACE=full to include source snippets.
  1081. 38.34 s >
  1082. 38.34 s > FAIL [ 0.224s] (525/561) gammalooprs uv::hedge_poset::tests::spectacles_typed_4d_projects_after_local_construction
  1083. 38.34 s > stdout ---
  1084. 38.34 s >
  1085. 38.34 s > running 1 test
  1086. 38.34 s > digraph {
  1087. 38.34 s > node [shape=circle,height=0.1,label=""];
  1088. 38.34 s > overlap = "scale";
  1089. 38.34 s > layout = "neato";
  1090. 38.34 s > start=2;
  1091. 38.34 s > 4 [label="0"];
  1092. 38.34 s > 1 [label="zw"];
  1093. 38.34 s > 2 [label="F"];
  1094. 38.34 s > 0 [label="143"];
  1095. 38.34 s > 3 [label="10B"];
  1096. 38.34 s > 4:0:s -> 1:1:s [id=0 color="red:blue;0.5" label="zw"];
  1097. 38.34 s > 4:2:s -> 2:3:s [id=1 color="red:blue;0.5" label="F"];
  1098. 38.34 s > 3:5:s -> 0:4:s [id=2 color="red:blue;0.5" label="143"];
  1099. 38.34 s > 4:6:s -> 0:7:s [id=3 color="red:blue;0.5" label="143"];
  1100. 38.34 s > 1:8:s -> 3:9:s [id=4 color="red:blue;0.5" label="F"];
  1101. 38.34 s > 1:10:s -> 0:11:s [id=5 color="red:blue;0.5" label="143"];
  1102. 38.34 s > 2:12:s -> 3:13:s [id=6 color="red:blue;0.5" label="zw"];
  1103. 38.34 s > 2:14:s -> 0:15:s [id=7 color="red:blue;0.5" label="143"];
  1104. 38.34 s > }
  1105. 38.34 s >
  1106. 38.34 s > digraph {
  1107. 38.34 s > node [shape=circle,height=0.1,label=""];
  1108. 38.34 s > overlap = "scale";
  1109. 38.34 s > layout = "neato";
  1110. 38.34 s > start=2;
  1111. 38.34 s > 0 [label="∅"];
  1112. 38.34 s > 1 [label="{zw}: Approx(S_zw(0))"];
  1113. 38.34 s > 2 [label="{F}: Approx(S_F(1))"];
  1114. 38.34 s > 3 [label="{143}: Approx(S_143(3))"];
  1115. 38.34 s > 4 [label="{zw,F}: Approx(S_F(4))*Approx(S_zw(0))"];
  1116. 38.34 s > 5 [label="{zw} · {143}: Approx((-1*S_zw+S_143(5))*Approx(S_zw(0)))"];
  1117. 38.34 s > 6 [label="{F} · {143}: Approx((-1*S_F+S_143(7))*Approx(S_F(1)))"];
  1118. 38.34 s > 7 [label="{zw,F} · {143}: Approx((-1*S_10B+S_143(2))*Approx(S_F(4))*Approx(S_zw(0)))"];
  1119. 38.34 s > 0:0:s -> 1:1:s [id=0 color="red:blue;0.5"];
  1120. 38.34 s > 0:2:s -> 2:3:s [id=1 color="red:blue;0.5"];
  1121. 38.34 s > 0:4:s -> 3:5:s [id=2 color="red:blue;0.5"];
  1122. 38.34 s > 1:6:s -> 4:7:s [id=3 color="red:blue;0.5"];
  1123. 38.34 s > 1:8:s -> 5:9:s [id=4 color="red:blue;0.5"];
  1124. 38.34 s > 2:10:s -> 4:11:s [id=5 color="red:blue;0.5"];
  1125. 38.34 s > 2:12:s -> 6:13:s [id=6 color="red:blue;0.5"];
  1126. 38.34 s > 4:14:s -> 7:15:s [id=7 color="red:blue;0.5"];
  1127. 38.34 s > }
  1128. 38.34 s >
  1129. 38.34 s > test uv::hedge_poset::tests::spectacles_typed_4d_projects_after_local_construction ... FAILED
  1130. 38.34 s >
  1131. 38.34 s > failures:
  1132. 38.34 s >
  1133. 38.34 s > failures:
  1134. 38.34 s > uv::hedge_poset::tests::spectacles_typed_4d_projects_after_local_construction
  1135. 38.34 s >
  1136. 38.34 s > test result: FAILED. 0 passed; 1 failed; 0 ignored; 0 measured; 611 filtered out; finished in 0.20s
  1137. 38.34 s >
  1138. 38.34 s > stderr ---
  1139. 38.34 s > Error:
  1140. 38.34 s > 0: failed to extract three-dimensional representation graph input: source edge 1 has no unique routing for rewritten exact signature [-1, 0, 0] modulo the factorized opposite-domain loop span
  1141. 38.34 s >
  1142. 38.34 s > Location:
  1143. 38.34 s > crates/gammalooprs/src/uv/approx/local_3d.rs:845
  1144. 38.34 s >
  1145. 38.34 s > ━━━━━━━━━━━━━━━━━━━━━━━━━━━━━━━━━━ BACKTRACE ━━━━━━━━━━━━━━━━━━━━━━━━━━━━━━━━━━━
  1146. 38.34 s > 1: <color_eyre[51793ea62743adbd]::config::EyreHook>::into_eyre_hook::{closure#0}<unknown>
  1147. 38.34 s > at <unknown source file>:<unknown line>
  1148. 38.34 s > 2: eyre[cb2fd339c0c40fca]::capture_handler<unknown>
  1149. 38.34 s > at <unknown source file>:<unknown line>
  1150. 38.34 s > 3: <eyre[cb2fd339c0c40fca]::Report>::from_std::<three_dimensional_reps[3cb572ff22d197ac]::graph_io::GraphIoError><unknown>
  1151. 38.34 s > at <unknown source file>:<unknown line>
  1152. 38.34 s > 4: <gammalooprs[972dff90865981f6]::uv::approx::local_3d::Localizer>::project_4d<unknown>
  1153. 38.34 s > at <unknown source file>:<unknown line>
  1154. 38.34 s > 5: gammalooprs[972dff90865981f6]::uv::hedge_poset::tests::spectacles_typed_4d_projects_after_local_construction<unknown>
  1155. 38.34 s > at <unknown source file>:<unknown line>
  1156. 38.34 s > 6: <gammalooprs[972dff90865981f6]::uv::hedge_poset::tests::spectacles_typed_4d_projects_after_local_construction::{closure#0} as core[940e698046960fd5]::ops::function::FnOnce<()>>::call_once<unknown>
  1157. 38.34 s > at <unknown source file>:<unknown line>
  1158. 38.34 s > 7: test[75d6903177b1d7e9]::__rust_begin_short_backtrace::<core[940e698046960fd5]::result::Result<(), alloc[2ea6bcb46fca0c42]::string::String>, fn() -> core[940e698046960fd5]::result::Result<(), alloc[2ea6bcb46fca0c42]::string::String>><unknown>
  1159. 38.34 s > at <unknown source file>:<unknown line>
  1160. 38.34 s > 8: test[75d6903177b1d7e9]::run_test::{closure#0}<unknown>
  1161. 38.34 s > at <unknown source file>:<unknown line>
  1162. 38.34 s > 9: std[bcb96dfbba0ab899]::sys::backtrace::__rust_begin_short_backtrace::<test[75d6903177b1d7e9]::run_test::{closure#1}, ()><unknown>
  1163. 38.34 s > at <unknown source file>:<unknown line>
  1164. 38.34 s > 10: <std[bcb96dfbba0ab899]::thread::lifecycle::spawn_unchecked<test[75d6903177b1d7e9]::run_test::{closure#1}, ()>::{closure#1} as core[940e698046960fd5]::ops::function::FnOnce<()>>::call_once::{shim:vtable#0}<unknown>
  1165. 38.34 s > at <unknown source file>:<unknown line>
  1166. 38.34 s > 11: <std[bcb96dfbba0ab899]::sys::thread::unix::Thread>::new::thread_start<unknown>
  1167. 38.34 s > at <unknown source file>:<unknown line>
  1168. 38.34 s > 12: start_thread<unknown>
  1169. 38.34 s > at <unknown source file>:<unknown line>
  1170. 38.34 s > 13: __clone3<unknown>
  1171. 38.34 s > at <unknown source file>:<unknown line>
  1172. 38.34 s >
  1173. 38.34 s > Run with COLORBT_SHOW_HIDDEN=1 environment variable to disable frame filtering.
  1174. 38.34 s > Run with RUST_BACKTRACE=full to include source snippets.
  1175. 38.34 s >
  1176. 38.34 s > FAIL [ 10.328s] (559/561) gammalooprs uv::tests::scalars_profile_new
  1177. 38.34 s > stdout ---
  1178. 38.34 s >
  1179. 38.34 s > running 1 test
  1180. 38.34 s > test uv::tests::scalars_profile_new ... FAILED
  1181. 38.34 s >
  1182. 38.34 s > failures:
  1183. 38.34 s >
  1184. 38.34 s > failures:
  1185. 38.34 s > uv::tests::scalars_profile_new
  1186. 38.34 s >
  1187. 38.34 s > test result: FAILED. 0 passed; 1 failed; 0 ignored; 0 measured; 611 filtered out; finished in 10.30s
  1188. 38.34 s >
  1189. 38.34 s > stderr ---
  1190. 38.34 s > [18:18:39.444] @gammalooprs::settings::runtime WARNING : No external kinematics were provided; using default-generated external momenta and helicities.
  1191. 38.34 s > field value
  1192. 38.34 s > span build_integrand{amplitude.name=bub}
  1193. 38.34 s > at crates/gammalooprs/src/settings/runtime.rs:131
  1194. 38.34 s > [18:18:39.445] @gammalooprs::integrands::process::amplitude INFO : Input is below threshold: 0 existing threshold E-surfaces across 0/3 graph groups
  1195. 38.34 s > field value
  1196. 38.34 s > existing_esurfaces 0
  1197. 38.34 s > group_count 3
  1198. 38.34 s > groups_above_threshold 0
  1199. 38.34 s > integrand bub
  1200. 38.34 s > span warm_up{integrand.name=bub}
  1201. 38.34 s > threshold_status below threshold
  1202. 38.34 s > at crates/gammalooprs/src/integrands/process/amplitude/mod.rs:1666
  1203. 38.34 s > [18:18:39.445] @gammalooprs::integrands::process::amplitude INFO : overlap structure of group 0: [0: []]
  1204. 38.34 s > field value
  1205. 38.34 s > span warm_up{integrand.name=bub}
  1206. 38.34 s > at crates/gammalooprs/src/integrands/process/amplitude/mod.rs:2015
  1207. 38.34 s > [18:18:39.445] @gammalooprs::integrands::process::amplitude INFO : overlap structure of group 1: [0: []]
  1208. 38.34 s > field value
  1209. 38.34 s > span warm_up{integrand.name=bub}
  1210. 38.34 s > at crates/gammalooprs/src/integrands/process/amplitude/mod.rs:2015
  1211. 38.34 s > [18:18:39.445] @gammalooprs::integrands::process::amplitude INFO : overlap structure of group 2: [0: []]
  1212. 38.34 s > field value
  1213. 38.34 s > span warm_up{integrand.name=bub}
  1214. 38.34 s > at crates/gammalooprs/src/integrands/process/amplitude/mod.rs:2015
  1215. 38.34 s > The application panicked (crashed).
  1216. 38.34 s > Message: assertion `left == right` failed: subtracted scalar UV profile failed:
  1217. 38.34 s > UVProfilePassFail {
  1218. 38.34 s > max_dod: -0.9,
  1219. 38.34 s > total: 16,
  1220. 38.34 s > failed: 1,
  1221. 38.34 s > failures: [
  1222. 38.34 s > UVProfileFailure {
  1223. 38.34 s > graph_index: 0,
  1224. 38.34 s > graph_name: "banana",
  1225. 38.34 s > cutkosky_cut: None,
  1226. 38.34 s > lmb_index: 1,
  1227. 38.34 s > fixed: [
  1228. 38.34 s > EdgeIndex(
  1229. 38.34 s > 2,
  1230. 38.34 s > ),
  1231. 38.34 s > EdgeIndex(
  1232. 38.34 s > 0,
  1233. 38.34 s > ),
  1234. 38.34 s > ],
  1235. 38.34 s > free: [
  1236. 38.34 s > EdgeIndex(
  1237. 38.34 s > 3,
  1238. 38.34 s > ),
  1239. 38.34 s > ],
  1240. 38.34 s > orientation_label: None,
  1241. 38.34 s > reason: "dod_exceeds_threshold",
  1242. 38.34 s > },
  1243. 38.34 s > ],
  1244. 38.34 s > }
  1245. 38.34 s >
  1246. 38.34 s > ╭─────────┬────────────┬───────────┬───────┬─────┬──────────┬───────────╮
  1247. 38.34 s > │ fixed │ → ∞ │ slope │ r2 │ DOD │ bare DOD │ inspect │
  1248. 38.34 s > ├─────────┼────────────┼───────────┼───────┼─────┼──────────┼───────────┤
  1249. 38.34 s > │ {e1,e2} │ {e3} │ -0.996752 │ 1.000 │ -1 │ 0 │ arb retry │
  1250. 38.34 s > │ {e1,e3} │ {e2} │ -1.065665 │ 0.997 │ -1 │ 0 │ arb retry │
  1251. 38.34 s > │ {e1} │ {e2,e3} │ -0.937151 │ 0.943 │ -1 │ 2 │ │
  1252. 38.34 s > │ {e2,e3} │ {e1} │ -1.001075 │ 1.000 │ -1 │ 0 │ arb retry │
  1253. 38.34 s > │ {e2} │ {e1,e3} │ -0.984146 │ 0.998 │ -1 │ 2 │ │
  1254. 38.34 s > │ {e3} │ {e1,e2} │ -1.383911 │ 0.982 │ -1 │ 2 │ arb retry │
  1255. 38.34 s > │ {} │ {e1,e2,e3} │ -1.094213 │ 0.258 │ -1 │ 4 │ │
  1256. 38.34 s > │ {e2,e0} │ {e3} │ -0.803348 │ 0.861 │ -1 │ 0 │ arb retry │
  1257. 38.34 s > │ {e3,e0} │ {e2} │ -0.999257 │ 1.000 │ -1 │ 0 │ │
  1258. 38.34 s > │ {e0} │ {e2,e3} │ -1.000893 │ 1.000 │ -1 │ 2 │ │
  1259. 38.34 s > │ {e1,e0} │ {e3} │ -0.997860 │ 1.000 │ -1 │ 0 │ │
  1260. 38.34 s > ╰─────────┴────────────┴───────────┴───────┴─────┴──────────┴───────────╯
  1261. 38.34 s >
  1262. 38.34 s > ╭───────┬─────────┬───────────┬───────┬─────┬──────────┬───────────╮
  1263. 38.34 s > │ fixed │ → ∞ │ slope │ r2 │ DOD │ bare DOD │ inspect │
  1264. 38.34 s > ├───────┼─────────┼───────────┼───────┼─────┼──────────┼───────────┤
  1265. 38.34 s > │ {e1} │ {e2} │ -1.005039 │ 1.000 │ -1 │ 0 │ arb retry │
  1266. 38.34 s > │ {e2} │ {e1} │ -1.001098 │ 1.000 │ -1 │ 0 │ arb retry │
  1267. 38.34 s > │ {} │ {e1,e2} │ -1.011289 │ 1.000 │ -1 │ 2 │ │
  1268. 38.34 s > │ {e0} │ {e2} │ -0.998140 │ 1.000 │ -1 │ 0 │ │
  1269. 38.34 s > ╰───────┴─────────┴───────────┴───────┴─────┴──────────┴───────────╯
  1270. 38.34 s >
  1271. 38.34 s > ╭───────┬──────┬───────────┬───────┬─────┬──────────┬─────────╮
  1272. 38.34 s > │ fixed │ → ∞ │ slope │ r2 │ DOD │ bare DOD │ inspect │
  1273. 38.34 s > ├───────┼──────┼───────────┼───────┼─────┼──────────┼─────────┤
  1274. 38.34 s > │ {} │ {e1} │ -0.989949 │ 1.000 │ -1 │ 0 │ │
  1275. 38.34 s > ╰───────┴──────┴───────────┴───────┴─────┴──────────┴─────────╯
  1276. 38.34 s > left: 1
  1277. 38.34 s > right: 0
  1278. 38.34 s > Location: crates/gammalooprs/src/uv/tests.rs:325
  1279. 38.34 s >
  1280. 38.34 s > ━━━━━━━━━━━━━━━━━━━━━━━━━━━━━━━━━━ BACKTRACE ━━━━━━━━━━━━━━━━━━━━━━━━━━━━━━━━━━━
  1281. 38.34 s > 1: <color_eyre[51793ea62743adbd]::config::PanicHook>::panic_report<unknown>
  1282. 38.34 s > at <unknown source file>:<unknown line>
  1283. 38.34 s > 2: <color_eyre[51793ea62743adbd]::config::PanicHook>::into_panic_hook::{closure#0}<unknown>
  1284. 38.34 s > at <unknown source file>:<unknown line>
  1285. 38.34 s > 3: std[bcb96dfbba0ab899]::panicking::panic_with_hook<unknown>
  1286. 38.34 s > at <unknown source file>:<unknown line>
  1287. 38.34 s > 4: std[bcb96dfbba0ab899]::panicking::panic_handler::{closure#0}<unknown>
  1288. 38.34 s > at <unknown source file>:<unknown line>
  1289. 38.34 s > 5: std[bcb96dfbba0ab899]::sys::backtrace::__rust_end_short_backtrace::<std[bcb96dfbba0ab899]::panicking::panic_handler::{closure#0}, !><unknown>
  1290. 38.34 s > at <unknown source file>:<unknown line>
  1291. 38.34 s > 6: __rustc[6c289b9f9c454d21]::rust_begin_unwind<unknown>
  1292. 38.34 s > at <unknown source file>:<unknown line>
  1293. 38.34 s > 7: core[940e698046960fd5]::panicking::panic_fmt<unknown>
  1294. 38.34 s > at <unknown source file>:<unknown line>
  1295. 38.34 s > 8: core[940e698046960fd5]::panicking::assert_failed_inner<unknown>
  1296. 38.34 s > at <unknown source file>:<unknown line>
  1297. 38.34 s > 9: core[940e698046960fd5]::panicking::assert_failed::<usize, usize><unknown>
  1298. 38.34 s > at <unknown source file>:<unknown line>
  1299. 38.34 s > 10: gammalooprs[972dff90865981f6]::uv::tests::scalars_profile_new<unknown>
  1300. 38.34 s > at <unknown source file>:<unknown line>
  1301. 38.34 s > 11: <gammalooprs[972dff90865981f6]::uv::tests::scalars_profile_new::{closure#0} as core[940e698046960fd5]::ops::function::FnOnce<()>>::call_once<unknown>
  1302. 38.34 s > at <unknown source file>:<unknown line>
  1303. 38.34 s > 12: test[75d6903177b1d7e9]::__rust_begin_short_backtrace::<core[940e698046960fd5]::result::Result<(), alloc[2ea6bcb46fca0c42]::string::String>, fn() -> core[940e698046960fd5]::result::Result<(), alloc[2ea6bcb46fca0c42]::string::String>><unknown>
  1304. 38.34 s > at <unknown source file>:<unknown line>
  1305. 38.34 s > 13: test[75d6903177b1d7e9]::run_test::{closure#0}<unknown>
  1306. 38.34 s > at <unknown source file>:<unknown line>
  1307. 38.34 s > 14: std[bcb96dfbba0ab899]::sys::backtrace::__rust_begin_short_backtrace::<test[75d6903177b1d7e9]::run_test::{closure#1}, ()><unknown>
  1308. 38.34 s > at <unknown source file>:<unknown line>
  1309. 38.34 s > 15: <std[bcb96dfbba0ab899]::thread::lifecycle::spawn_unchecked<test[75d6903177b1d7e9]::run_test::{closure#1}, ()>::{closure#1} as core[940e698046960fd5]::ops::function::FnOnce<()>>::call_once::{shim:vtable#0}<unknown>
  1310. 38.34 s > at <unknown source file>:<unknown line>
  1311. 38.34 s > 16: <std[bcb96dfbba0ab899]::sys::thread::unix::Thread>::new::thread_start<unknown>
  1312. 38.34 s > at <unknown source file>:<unknown line>
  1313. 38.34 s > 17: start_thread<unknown>
  1314. 38.34 s > at <unknown source file>:<unknown line>
  1315. 38.34 s > 18: __clone3<unknown>
  1316. 38.34 s > at <unknown source file>:<unknown line>
  1317. 38.34 s >
  1318. 38.34 s > Run with COLORBT_SHOW_HIDDEN=1 environment variable to disable frame filtering.
  1319. 38.34 s > Run with RUST_BACKTRACE=full to include source snippets.
  1320. 38.34 s >
  1321. 38.34 s > FAIL [ 10.344s] (560/561) gammalooprs uv::tests::scalars_profile
  1322. 38.34 s > stdout ---
  1323. 38.34 s >
  1324. 38.34 s > running 1 test
  1325. 38.34 s > test uv::tests::scalars_profile ... FAILED
  1326. 38.34 s >
  1327. 38.34 s > failures:
  1328. 38.34 s >
  1329. 38.34 s > failures:
  1330. 38.34 s > uv::tests::scalars_profile
  1331. 38.34 s >
  1332. 38.34 s > test result: FAILED. 0 passed; 1 failed; 0 ignored; 0 measured; 611 filtered out; finished in 10.32s
  1333. 38.34 s >
  1334. 38.34 s > stderr ---
  1335. 38.34 s > [18:18:39.434] @gammalooprs::settings::runtime WARNING : No external kinematics were provided; using default-generated external momenta and helicities.
  1336. 38.34 s > field value
  1337. 38.34 s > span build_integrand{amplitude.name=bub}
  1338. 38.34 s > at crates/gammalooprs/src/settings/runtime.rs:131
  1339. 38.34 s > [18:18:39.435] @gammalooprs::integrands::process::amplitude INFO : Input is below threshold: 0 existing threshold E-surfaces across 0/3 graph groups
  1340. 38.34 s > field value
  1341. 38.34 s > existing_esurfaces 0
  1342. 38.34 s > group_count 3
  1343. 38.34 s > groups_above_threshold 0
  1344. 38.34 s > integrand bub
  1345. 38.34 s > span warm_up{integrand.name=bub}
  1346. 38.34 s > threshold_status below threshold
  1347. 38.34 s > at crates/gammalooprs/src/integrands/process/amplitude/mod.rs:1666
  1348. 38.34 s > [18:18:39.435] @gammalooprs::integrands::process::amplitude INFO : overlap structure of group 0: [0: []]
  1349. 38.34 s > field value
  1350. 38.34 s > span warm_up{integrand.name=bub}
  1351. 38.34 s > at crates/gammalooprs/src/integrands/process/amplitude/mod.rs:2015
  1352. 38.34 s > [18:18:39.435] @gammalooprs::integrands::process::amplitude INFO : overlap structure of group 1: [0: []]
  1353. 38.34 s > field value
  1354. 38.34 s > span warm_up{integrand.name=bub}
  1355. 38.34 s > at crates/gammalooprs/src/integrands/process/amplitude/mod.rs:2015
  1356. 38.34 s > [18:18:39.435] @gammalooprs::integrands::process::amplitude INFO : overlap structure of group 2: [0: []]
  1357. 38.34 s > field value
  1358. 38.34 s > span warm_up{integrand.name=bub}
  1359. 38.34 s > at crates/gammalooprs/src/integrands/process/amplitude/mod.rs:2015
  1360. 38.34 s > The application panicked (crashed).
  1361. 38.34 s > Message: assertion `left == right` failed: subtracted scalar UV profile failed:
  1362. 38.34 s > UVProfilePassFail {
  1363. 38.34 s > max_dod: -0.9,
  1364. 38.34 s > total: 16,
  1365. 38.34 s > failed: 1,
  1366. 38.34 s > failures: [
  1367. 38.34 s > UVProfileFailure {
  1368. 38.34 s > graph_index: 0,
  1369. 38.34 s > graph_name: "banana",
  1370. 38.34 s > cutkosky_cut: None,
  1371. 38.34 s > lmb_index: 1,
  1372. 38.34 s > fixed: [
  1373. 38.34 s > EdgeIndex(
  1374. 38.34 s > 2,
  1375. 38.34 s > ),
  1376. 38.34 s > EdgeIndex(
  1377. 38.34 s > 0,
  1378. 38.34 s > ),
  1379. 38.34 s > ],
  1380. 38.34 s > free: [
  1381. 38.34 s > EdgeIndex(
  1382. 38.34 s > 3,
  1383. 38.34 s > ),
  1384. 38.34 s > ],
  1385. 38.34 s > orientation_label: None,
  1386. 38.34 s > reason: "dod_exceeds_threshold",
  1387. 38.34 s > },
  1388. 38.34 s > ],
  1389. 38.34 s > }
  1390. 38.34 s >
  1391. 38.34 s > ╭─────────┬────────────┬───────────┬───────┬─────┬──────────┬───────────╮
  1392. 38.34 s > │ fixed │ → ∞ │ slope │ r2 │ DOD │ bare DOD │ inspect │
  1393. 38.34 s > ├─────────┼────────────┼───────────┼───────┼─────┼──────────┼───────────┤
  1394. 38.34 s > │ {e1,e2} │ {e3} │ -0.996752 │ 1.000 │ -1 │ 0 │ arb retry │
  1395. 38.34 s > │ {e1,e3} │ {e2} │ -1.065665 │ 0.997 │ -1 │ 0 │ arb retry │
  1396. 38.34 s > │ {e1} │ {e2,e3} │ -0.937151 │ 0.943 │ -1 │ 2 │ │
  1397. 38.34 s > │ {e2,e3} │ {e1} │ -1.001075 │ 1.000 │ -1 │ 0 │ arb retry │
  1398. 38.34 s > │ {e2} │ {e1,e3} │ -0.984146 │ 0.998 │ -1 │ 2 │ │
  1399. 38.34 s > │ {e3} │ {e1,e2} │ -1.383911 │ 0.982 │ -1 │ 2 │ arb retry │
  1400. 38.34 s > │ {} │ {e1,e2,e3} │ -1.094213 │ 0.258 │ -1 │ 4 │ │
  1401. 38.34 s > │ {e2,e0} │ {e3} │ -0.803348 │ 0.861 │ -1 │ 0 │ arb retry │
  1402. 38.34 s > │ {e3,e0} │ {e2} │ -0.999257 │ 1.000 │ -1 │ 0 │ │
  1403. 38.34 s > │ {e0} │ {e2,e3} │ -1.000893 │ 1.000 │ -1 │ 2 │ │
  1404. 38.34 s > │ {e1,e0} │ {e3} │ -0.997860 │ 1.000 │ -1 │ 0 │ │
  1405. 38.34 s > ╰─────────┴────────────┴───────────┴───────┴─────┴──────────┴───────────╯
  1406. 38.34 s >
  1407. 38.34 s > ╭───────┬─────────┬───────────┬───────┬─────┬──────────┬───────────╮
  1408. 38.34 s > │ fixed │ → ∞ │ slope │ r2 │ DOD │ bare DOD │ inspect │
  1409. 38.34 s > ├───────┼─────────┼───────────┼───────┼─────┼──────────┼───────────┤
  1410. 38.34 s > │ {e1} │ {e2} │ -1.005039 │ 1.000 │ -1 │ 0 │ arb retry │
  1411. 38.34 s > │ {e2} │ {e1} │ -1.001098 │ 1.000 │ -1 │ 0 │ arb retry │
  1412. 38.34 s > │ {} │ {e1,e2} │ -1.011289 │ 1.000 │ -1 │ 2 │ │
  1413. 38.34 s > │ {e0} │ {e2} │ -0.998140 │ 1.000 │ -1 │ 0 │ │
  1414. 38.34 s > ╰───────┴─────────┴───────────┴───────┴─────┴──────────┴───────────╯
  1415. 38.34 s >
  1416. 38.34 s > ╭───────┬──────┬───────────┬───────┬─────┬──────────┬─────────╮
  1417. 38.34 s > │ fixed │ → ∞ │ slope │ r2 │ DOD │ bare DOD │ inspect │
  1418. 38.34 s > ├───────┼──────┼───────────┼───────┼─────┼──────────┼─────────┤
  1419. 38.34 s > │ {} │ {e1} │ -0.989949 │ 1.000 │ -1 │ 0 │ │
  1420. 38.34 s > ╰───────┴──────┴───────────┴───────┴─────┴──────────┴─────────╯
  1421. 38.34 s > left: 1
  1422. 38.34 s > right: 0
  1423. 38.34 s > Location: crates/gammalooprs/src/uv/tests.rs:259
  1424. 38.34 s >
  1425. 38.34 s > ━━━━━━━━━━━━━━━━━━━━━━━━━━━━━━━━━━ BACKTRACE ━━━━━━━━━━━━━━━━━━━━━━━━━━━━━━━━━━━
  1426. 38.34 s > 1: <color_eyre[51793ea62743adbd]::config::PanicHook>::panic_report<unknown>
  1427. 38.34 s > at <unknown source file>:<unknown line>
  1428. 38.34 s > 2: <color_eyre[51793ea62743adbd]::config::PanicHook>::into_panic_hook::{closure#0}<unknown>
  1429. 38.34 s > at <unknown source file>:<unknown line>
  1430. 38.34 s > 3: std[bcb96dfbba0ab899]::panicking::panic_with_hook<unknown>
  1431. 38.34 s > at <unknown source file>:<unknown line>
  1432. 38.34 s > 4: std[bcb96dfbba0ab899]::panicking::panic_handler::{closure#0}<unknown>
  1433. 38.34 s > at <unknown source file>:<unknown line>
  1434. 38.34 s > 5: std[bcb96dfbba0ab899]::sys::backtrace::__rust_end_short_backtrace::<std[bcb96dfbba0ab899]::panicking::panic_handler::{closure#0}, !><unknown>
  1435. 38.34 s > at <unknown source file>:<unknown line>
  1436. 38.34 s > 6: __rustc[6c289b9f9c454d21]::rust_begin_unwind<unknown>
  1437. 38.34 s > at <unknown source file>:<unknown line>
  1438. 38.34 s > 7: core[940e698046960fd5]::panicking::panic_fmt<unknown>
  1439. 38.34 s > at <unknown source file>:<unknown line>
  1440. 38.34 s > 8: core[940e698046960fd5]::panicking::assert_failed_inner<unknown>
  1441. 38.34 s > at <unknown source file>:<unknown line>
  1442. 38.34 s > 9: core[940e698046960fd5]::panicking::assert_failed::<usize, usize><unknown>
  1443. 38.34 s > at <unknown source file>:<unknown line>
  1444. 38.34 s > 10: gammalooprs[972dff90865981f6]::uv::tests::scalars_profile<unknown>
  1445. 38.34 s > at <unknown source file>:<unknown line>
  1446. 38.34 s > 11: <gammalooprs[972dff90865981f6]::uv::tests::scalars_profile::{closure#0} as core[940e698046960fd5]::ops::function::FnOnce<()>>::call_once<unknown>
  1447. 38.34 s > at <unknown source file>:<unknown line>
  1448. 38.34 s > 12: test[75d6903177b1d7e9]::__rust_begin_short_backtrace::<core[940e698046960fd5]::result::Result<(), alloc[2ea6bcb46fca0c42]::string::String>, fn() -> core[940e698046960fd5]::result::Result<(), alloc[2ea6bcb46fca0c42]::string::String>><unknown>
  1449. 38.34 s > at <unknown source file>:<unknown line>
  1450. 38.34 s > 13: test[75d6903177b1d7e9]::run_test::{closure#0}<unknown>
  1451. 38.34 s > at <unknown source file>:<unknown line>
  1452. 38.34 s > 14: std[bcb96dfbba0ab899]::sys::backtrace::__rust_begin_short_backtrace::<test[75d6903177b1d7e9]::run_test::{closure#1}, ()><unknown>
  1453. 38.34 s > at <unknown source file>:<unknown line>
  1454. 38.34 s > 15: <std[bcb96dfbba0ab899]::thread::lifecycle::spawn_unchecked<test[75d6903177b1d7e9]::run_test::{closure#1}, ()>::{closure#1} as core[940e698046960fd5]::ops::function::FnOnce<()>>::call_once::{shim:vtable#0}<unknown>
  1455. 38.34 s > at <unknown source file>:<unknown line>
  1456. 38.34 s > 16: <std[bcb96dfbba0ab899]::sys::thread::unix::Thread>::new::thread_start<unknown>
  1457. 38.34 s > at <unknown source file>:<unknown line>
  1458. 38.34 s > 17: start_thread<unknown>
  1459. 38.34 s > at <unknown source file>:<unknown line>
  1460. 38.34 s > 18: __clone3<unknown>
  1461. 38.34 s > at <unknown source file>:<unknown line>
  1462. 38.34 s >
  1463. 38.34 s > Run with COLORBT_SHOW_HIDDEN=1 environment variable to disable frame filtering.
  1464. 38.34 s > Run with RUST_BACKTRACE=full to include source snippets.
  1465. 38.34 s >
  1466. 38.34 s > ------------
  1467. 38.34 s > Summary [ 12.921s] 561 tests run: 556 passed, 5 failed, 59 skipped
  1468. 38.34 s > FAIL [ 0.101s] ( 51/561) gammalooprs cff::tests::stored_production_cff_uses_typed_energy_factor_ownership
  1469. 38.34 s > stdout ---
  1470. 38.34 s >
  1471. 38.34 s > running 1 test
  1472. 38.34 s > test cff::tests::stored_production_cff_uses_typed_energy_factor_ownership ... FAILED
  1473. 38.34 s >
  1474. 38.34 s > failures:
  1475. 38.34 s >
  1476. 38.34 s > failures:
  1477. 38.34 s > cff::tests::stored_production_cff_uses_typed_energy_factor_ownership
  1478. 38.34 s >
  1479. 38.34 s > test result: FAILED. 0 passed; 1 failed; 0 ignored; 0 measured; 611 filtered out; finished in 0.09s
  1480. 38.34 s >
  1481. 38.34 s > stderr ---
  1482. 38.34 s > The application panicked (crashed).
  1483. 38.34 s > Message: assertion `left == right` failed
  1484. 38.34 s > left: 1
  1485. 38.34 s > right: -1
  1486. 38.34 s > Location: crates/gammalooprs/src/cff/mod.rs:2721
  1487. 38.34 s >
  1488. 38.34 s > ━━━━━━━━━━━━━━━━━━━━━━━━━━━━━━━━━━ BACKTRACE ━━━━━━━━━━━━━━━━━━━━━━━━━━━━━━━━━━━
  1489. 38.34 s > 1: <color_eyre[51793ea62743adbd]::config::PanicHook>::panic_report<unknown>
  1490. 38.34 s > at <unknown source file>:<unknown line>
  1491. 38.34 s > 2: <color_eyre[51793ea62743adbd]::config::PanicHook>::into_panic_hook::{closure#0}<unknown>
  1492. 38.34 s > at <unknown source file>:<unknown line>
  1493. 38.34 s > 3: std[bcb96dfbba0ab899]::panicking::panic_with_hook<unknown>
  1494. 38.34 s > at <unknown source file>:<unknown line>
  1495. 38.34 s > 4: std[bcb96dfbba0ab899]::panicking::panic_handler::{closure#0}<unknown>
  1496. 38.34 s > at <unknown source file>:<unknown line>
  1497. 38.34 s > 5: std[bcb96dfbba0ab899]::sys::backtrace::__rust_end_short_backtrace::<std[bcb96dfbba0ab899]::panicking::panic_handler::{closure#0}, !><unknown>
  1498. 38.34 s > at <unknown source file>:<unknown line>
  1499. 38.34 s > 6: __rustc[6c289b9f9c454d21]::rust_begin_unwind<unknown>
  1500. 38.34 s > at <unknown source file>:<unknown line>
  1501. 38.34 s > 7: core[940e698046960fd5]::panicking::panic_fmt<unknown>
  1502. 38.34 s > at <unknown source file>:<unknown line>
  1503. 38.34 s > 8: core[940e698046960fd5]::panicking::assert_failed_inner<unknown>
  1504. 38.34 s > at <unknown source file>:<unknown line>
  1505. 38.34 s > 9: core[940e698046960fd5]::panicking::assert_failed::<i64, i64><unknown>
  1506. 38.34 s > at <unknown source file>:<unknown line>
  1507. 38.34 s > 10: gammalooprs[972dff90865981f6]::cff::tests::stored_production_cff_uses_typed_energy_factor_ownership<unknown>
  1508. 38.34 s > at <unknown source file>:<unknown line>
  1509. 38.34 s > 11: <gammalooprs[972dff90865981f6]::cff::tests::stored_production_cff_uses_typed_energy_factor_ownership::{closure#0} as core[940e698046960fd5]::ops::function::FnOnce<()>>::call_once<unknown>
  1510. 38.34 s > at <unknown source file>:<unknown line>
  1511. 38.34 s > 12: test[75d6903177b1d7e9]::__rust_begin_short_backtrace::<core[940e698046960fd5]::result::Result<(), alloc[2ea6bcb46fca0c42]::string::String>, fn() -> core[940e698046960fd5]::result::Result<(), alloc[2ea6bcb46fca0c42]::string::String>><unknown>
  1512. 38.34 s > at <unknown source file>:<unknown line>
  1513. 38.34 s > 13: test[75d6903177b1d7e9]::run_test::{closure#0}<unknown>
  1514. 38.34 s > at <unknown source file>:<unknown line>
  1515. 38.34 s > 14: std[bcb96dfbba0ab899]::sys::backtrace::__rust_begin_short_backtrace::<test[75d6903177b1d7e9]::run_test::{closure#1}, ()><unknown>
  1516. 38.34 s > at <unknown source file>:<unknown line>
  1517. 38.34 s > 15: <std[bcb96dfbba0ab899]::thread::lifecycle::spawn_unchecked<test[75d6903177b1d7e9]::run_test::{closure#1}, ()>::{closure#1} as core[940e698046960fd5]::ops::function::FnOnce<()>>::call_once::{shim:vtable#0}<unknown>
  1518. 38.34 s > at <unknown source file>:<unknown line>
  1519. 38.34 s > 16: <std[bcb96dfbba0ab899]::sys::thread::unix::Thread>::new::thread_start<unknown>
  1520. 38.34 s > at <unknown source file>:<unknown line>
  1521. 38.34 s > 17: start_thread<unknown>
  1522. 38.34 s > at <unknown source file>:<unknown line>
  1523. 38.34 s > 18: __clone3<unknown>
  1524. 38.34 s > at <unknown source file>:<unknown line>
  1525. 38.34 s >
  1526. 38.34 s > Run with COLORBT_SHOW_HIDDEN=1 environment variable to disable frame filtering.
  1527. 38.34 s > Run with RUST_BACKTRACE=full to include source snippets.
  1528. 38.34 s >
  1529. 38.34 s > FAIL [ 0.115s] (486/561) gammalooprs uv::approx::local_3d::tests::production_emr_map_cancels_one_powered_denominator
  1530. 38.34 s > stdout ---
  1531. 38.34 s >
  1532. 38.34 s > running 1 test
  1533. 38.34 s > test uv::approx::local_3d::tests::production_emr_map_cancels_one_powered_denominator ... FAILED
  1534. 38.34 s >
  1535. 38.34 s > failures:
  1536. 38.34 s >
  1537. 38.34 s > failures:
  1538. 38.34 s > uv::approx::local_3d::tests::production_emr_map_cancels_one_powered_denominator
  1539. 38.34 s >
  1540. 38.34 s > test result: FAILED. 0 passed; 1 failed; 0 ignored; 0 measured; 611 filtered out; finished in 0.10s
  1541. 38.34 s >
  1542. 38.34 s > stderr ---
  1543. 38.34 s > The application panicked (crashed).
  1544. 38.34 s > Message: summed exact-source powered and selected lower channels differ: powered=-1𝑖/8/𝜋^3, lower=1𝑖/16/𝜋^3, difference=-3𝑖/16/𝜋^3
  1545. 38.34 s > Location: crates/gammalooprs/src/uv/approx/local_3d.rs:2047
  1546. 38.34 s >
  1547. 38.34 s > ━━━━━━━━━━━━━━━━━━━━━━━━━━━━━━━━━━ BACKTRACE ━━━━━━━━━━━━━━━━━━━━━━━━━━━━━━━━━━━
  1548. 38.34 s > 1: <color_eyre[51793ea62743adbd]::config::PanicHook>::panic_report<unknown>
  1549. 38.34 s > at <unknown source file>:<unknown line>
  1550. 38.34 s > 2: <color_eyre[51793ea62743adbd]::config::PanicHook>::into_panic_hook::{closure#0}<unknown>
  1551. 38.34 s > at <unknown source file>:<unknown line>
  1552. 38.34 s > 3: std[bcb96dfbba0ab899]::panicking::panic_with_hook<unknown>
  1553. 38.34 s > at <unknown source file>:<unknown line>
  1554. 38.34 s > 4: std[bcb96dfbba0ab899]::panicking::panic_handler::{closure#0}<unknown>
  1555. 38.34 s > at <unknown source file>:<unknown line>
  1556. 38.34 s > 5: std[bcb96dfbba0ab899]::sys::backtrace::__rust_end_short_backtrace::<std[bcb96dfbba0ab899]::panicking::panic_handler::{closure#0}, !><unknown>
  1557. 38.34 s > at <unknown source file>:<unknown line>
  1558. 38.34 s > 6: __rustc[6c289b9f9c454d21]::rust_begin_unwind<unknown>
  1559. 38.34 s > at <unknown source file>:<unknown line>
  1560. 38.34 s > 7: core[940e698046960fd5]::panicking::panic_fmt<unknown>
  1561. 38.34 s > at <unknown source file>:<unknown line>
  1562. 38.34 s > 8: gammalooprs[972dff90865981f6]::uv::approx::local_3d::tests::production_emr_map_cancels_one_powered_denominator<unknown>
  1563. 38.34 s > at <unknown source file>:<unknown line>
  1564. 38.34 s > 9: <gammalooprs[972dff90865981f6]::uv::approx::local_3d::tests::production_emr_map_cancels_one_powered_denominator::{closure#0} as core[940e698046960fd5]::ops::function::FnOnce<()>>::call_once<unknown>
  1565. 38.34 s > at <unknown source file>:<unknown line>
  1566. 38.34 s > 10: test[75d6903177b1d7e9]::__rust_begin_short_backtrace::<core[940e698046960fd5]::result::Result<(), alloc[2ea6bcb46fca0c42]::string::String>, fn() -> core[940e698046960fd5]::result::Result<(), alloc[2ea6bcb46fca0c42]::string::String>><unknown>
  1567. 38.34 s > at <unknown source file>:<unknown line>
  1568. 38.34 s > 11: test[75d6903177b1d7e9]::run_test::{closure#0}<unknown>
  1569. 38.34 s > at <unknown source file>:<unknown line>
  1570. 38.34 s > 12: std[bcb96dfbba0ab899]::sys::backtrace::__rust_begin_short_backtrace::<test[75d6903177b1d7e9]::run_test::{closure#1}, ()><unknown>
  1571. 38.34 s > at <unknown source file>:<unknown line>
  1572. 38.34 s > 13: <std[bcb96dfbba0ab899]::thread::lifecycle::spawn_unchecked<test[75d6903177b1d7e9]::run_test::{closure#1}, ()>::{closure#1} as core[940e698046960fd5]::ops::function::FnOnce<()>>::call_once::{shim:vtable#0}<unknown>
  1573. 38.34 s > at <unknown source file>:<unknown line>
  1574. 38.34 s > 14: <std[bcb96dfbba0ab899]::sys::thread::unix::Thread>::new::thread_start<unknown>
  1575. 38.34 s > at <unknown source file>:<unknown line>
  1576. 38.34 s > 15: start_thread<unknown>
  1577. 38.34 s > at <unknown source file>:<unknown line>
  1578. 38.34 s > 16: __clone3<unknown>
  1579. 38.34 s > at <unknown source file>:<unknown line>
  1580. 38.34 s >
  1581. 38.34 s > Run with COLORBT_SHOW_HIDDEN=1 environment variable to disable frame filtering.
  1582. 38.34 s > Run with RUST_BACKTRACE=full to include source snippets.
  1583. 38.34 s >
  1584. 38.34 s > FAIL [ 0.224s] (525/561) gammalooprs uv::hedge_poset::tests::spectacles_typed_4d_projects_after_local_construction
  1585. 38.34 s > stdout ---
  1586. 38.34 s >
  1587. 38.34 s > running 1 test
  1588. 38.34 s > digraph {
  1589. 38.34 s > node [shape=circle,height=0.1,label=""];
  1590. 38.34 s > overlap = "scale";
  1591. 38.34 s > layout = "neato";
  1592. 38.34 s > start=2;
  1593. 38.34 s > 4 [label="0"];
  1594. 38.34 s > 1 [label="zw"];
  1595. 38.34 s > 2 [label="F"];
  1596. 38.34 s > 0 [label="143"];
  1597. 38.34 s > 3 [label="10B"];
  1598. 38.34 s > 4:0:s -> 1:1:s [id=0 color="red:blue;0.5" label="zw"];
  1599. 38.34 s > 4:2:s -> 2:3:s [id=1 color="red:blue;0.5" label="F"];
  1600. 38.34 s > 3:5:s -> 0:4:s [id=2 color="red:blue;0.5" label="143"];
  1601. 38.34 s > 4:6:s -> 0:7:s [id=3 color="red:blue;0.5" label="143"];
  1602. 38.34 s > 1:8:s -> 3:9:s [id=4 color="red:blue;0.5" label="F"];
  1603. 38.34 s > 1:10:s -> 0:11:s [id=5 color="red:blue;0.5" label="143"];
  1604. 38.34 s > 2:12:s -> 3:13:s [id=6 color="red:blue;0.5" label="zw"];
  1605. 38.34 s > 2:14:s -> 0:15:s [id=7 color="red:blue;0.5" label="143"];
  1606. 38.34 s > }
  1607. 38.34 s >
  1608. 38.34 s > digraph {
  1609. 38.34 s > node [shape=circle,height=0.1,label=""];
  1610. 38.34 s > overlap = "scale";
  1611. 38.34 s > layout = "neato";
  1612. 38.34 s > start=2;
  1613. 38.34 s > 0 [label="∅"];
  1614. 38.34 s > 1 [label="{zw}: Approx(S_zw(0))"];
  1615. 38.34 s > 2 [label="{F}: Approx(S_F(1))"];
  1616. 38.34 s > 3 [label="{143}: Approx(S_143(3))"];
  1617. 38.34 s > 4 [label="{zw,F}: Approx(S_F(4))*Approx(S_zw(0))"];
  1618. 38.34 s > 5 [label="{zw} · {143}: Approx((-1*S_zw+S_143(5))*Approx(S_zw(0)))"];
  1619. 38.34 s > 6 [label="{F} · {143}: Approx((-1*S_F+S_143(7))*Approx(S_F(1)))"];
  1620. 38.34 s > 7 [label="{zw,F} · {143}: Approx((-1*S_10B+S_143(2))*Approx(S_F(4))*Approx(S_zw(0)))"];
  1621. 38.34 s > 0:0:s -> 1:1:s [id=0 color="red:blue;0.5"];
  1622. 38.34 s > 0:2:s -> 2:3:s [id=1 color="red:blue;0.5"];
  1623. 38.34 s > 0:4:s -> 3:5:s [id=2 color="red:blue;0.5"];
  1624. 38.34 s > 1:6:s -> 4:7:s [id=3 color="red:blue;0.5"];
  1625. 38.34 s > 1:8:s -> 5:9:s [id=4 color="red:blue;0.5"];
  1626. 38.34 s > 2:10:s -> 4:11:s [id=5 color="red:blue;0.5"];
  1627. 38.34 s > 2:12:s -> 6:13:s [id=6 color="red:blue;0.5"];
  1628. 38.34 s > 4:14:s -> 7:15:s [id=7 color="red:blue;0.5"];
  1629. 38.34 s > }
  1630. 38.34 s >
  1631. 38.34 s > test uv::hedge_poset::tests::spectacles_typed_4d_projects_after_local_construction ... FAILED
  1632. 38.34 s >
  1633. 38.34 s > failures:
  1634. 38.34 s >
  1635. 38.34 s > failures:
  1636. 38.34 s > uv::hedge_poset::tests::spectacles_typed_4d_projects_after_local_construction
  1637. 38.34 s >
  1638. 38.34 s > test result: FAILED. 0 passed; 1 failed; 0 ignored; 0 measured; 611 filtered out; finished in 0.20s
  1639. 38.34 s >
  1640. 38.34 s > stderr ---
  1641. 38.34 s > Error:
  1642. 38.34 s > 0: failed to extract three-dimensional representation graph input: source edge 1 has no unique routing for rewritten exact signature [-1, 0, 0] modulo the factorized opposite-domain loop span
  1643. 38.34 s >
  1644. 38.34 s > Location:
  1645. 38.34 s > crates/gammalooprs/src/uv/approx/local_3d.rs:845
  1646. 38.34 s >
  1647. 38.34 s > ━━━━━━━━━━━━━━━━━━━━━━━━━━━━━━━━━━ BACKTRACE ━━━━━━━━━━━━━━━━━━━━━━━━━━━━━━━━━━━
  1648. 38.34 s > 1: <color_eyre[51793ea62743adbd]::config::EyreHook>::into_eyre_hook::{closure#0}<unknown>
  1649. 38.34 s > at <unknown source file>:<unknown line>
  1650. 38.34 s > 2: eyre[cb2fd339c0c40fca]::capture_handler<unknown>
  1651. 38.34 s > at <unknown source file>:<unknown line>
  1652. 38.34 s > 3: <eyre[cb2fd339c0c40fca]::Report>::from_std::<three_dimensional_reps[3cb572ff22d197ac]::graph_io::GraphIoError><unknown>
  1653. 38.34 s > at <unknown source file>:<unknown line>
  1654. 38.34 s > 4: <gammalooprs[972dff90865981f6]::uv::approx::local_3d::Localizer>::project_4d<unknown>
  1655. 38.34 s > at <unknown source file>:<unknown line>
  1656. 38.34 s > 5: gammalooprs[972dff90865981f6]::uv::hedge_poset::tests::spectacles_typed_4d_projects_after_local_construction<unknown>
  1657. 38.34 s > at <unknown source file>:<unknown line>
  1658. 38.34 s > 6: <gammalooprs[972dff90865981f6]::uv::hedge_poset::tests::spectacles_typed_4d_projects_after_local_construction::{closure#0} as core[940e698046960fd5]::ops::function::FnOnce<()>>::call_once<unknown>
  1659. 38.34 s > at <unknown source file>:<unknown line>
  1660. 38.34 s > 7: test[75d6903177b1d7e9]::__rust_begin_short_backtrace::<core[940e698046960fd5]::result::Result<(), alloc[2ea6bcb46fca0c42]::string::String>, fn() -> core[940e698046960fd5]::result::Result<(), alloc[2ea6bcb46fca0c42]::string::String>><unknown>
  1661. 38.34 s > at <unknown source file>:<unknown line>
  1662. 38.34 s > 8: test[75d6903177b1d7e9]::run_test::{closure#0}<unknown>
  1663. 38.34 s > at <unknown source file>:<unknown line>
  1664. 38.34 s > 9: std[bcb96dfbba0ab899]::sys::backtrace::__rust_begin_short_backtrace::<test[75d6903177b1d7e9]::run_test::{closure#1}, ()><unknown>
  1665. 38.34 s > at <unknown source file>:<unknown line>
  1666. 38.34 s > 10: <std[bcb96dfbba0ab899]::thread::lifecycle::spawn_unchecked<test[75d6903177b1d7e9]::run_test::{closure#1}, ()>::{closure#1} as core[940e698046960fd5]::ops::function::FnOnce<()>>::call_once::{shim:vtable#0}<unknown>
  1667. 38.34 s > at <unknown source file>:<unknown line>
  1668. 38.34 s > 11: <std[bcb96dfbba0ab899]::sys::thread::unix::Thread>::new::thread_start<unknown>
  1669. 38.34 s > at <unknown source file>:<unknown line>
  1670. 38.34 s > 12: start_thread<unknown>
  1671. 38.34 s > at <unknown source file>:<unknown line>
  1672. 38.34 s > 13: __clone3<unknown>
  1673. 38.34 s > at <unknown source file>:<unknown line>
  1674. 38.34 s >
  1675. 38.34 s > Run with COLORBT_SHOW_HIDDEN=1 environment variable to disable frame filtering.
  1676. 38.34 s > Run with RUST_BACKTRACE=full to include source snippets.
  1677. 38.34 s >
  1678. 38.34 s > FAIL [ 10.328s] (559/561) gammalooprs uv::tests::scalars_profile_new
  1679. 38.34 s > stdout ---
  1680. 38.34 s >
  1681. 38.34 s > running 1 test
  1682. 38.34 s > test uv::tests::scalars_profile_new ... FAILED
  1683. 38.34 s >
  1684. 38.34 s > failures:
  1685. 38.34 s >
  1686. 38.34 s > failures:
  1687. 38.34 s > uv::tests::scalars_profile_new
  1688. 38.34 s >
  1689. 38.34 s > test result: FAILED. 0 passed; 1 failed; 0 ignored; 0 measured; 611 filtered out; finished in 10.30s
  1690. 38.34 s >
  1691. 38.34 s > stderr ---
  1692. 38.34 s > [18:18:39.444] @gammalooprs::settings::runtime WARNING : No external kinematics were provided; using default-generated external momenta and helicities.
  1693. 38.34 s > field value
  1694. 38.34 s > span build_integrand{amplitude.name=bub}
  1695. 38.34 s > at crates/gammalooprs/src/settings/runtime.rs:131
  1696. 38.34 s > [18:18:39.445] @gammalooprs::integrands::process::amplitude INFO : Input is below threshold: 0 existing threshold E-surfaces across 0/3 graph groups
  1697. 38.34 s > field value
  1698. 38.34 s > existing_esurfaces 0
  1699. 38.34 s > group_count 3
  1700. 38.34 s > groups_above_threshold 0
  1701. 38.34 s > integrand bub
  1702. 38.34 s > span warm_up{integrand.name=bub}
  1703. 38.34 s > threshold_status below threshold
  1704. 38.34 s > at crates/gammalooprs/src/integrands/process/amplitude/mod.rs:1666
  1705. 38.34 s > [18:18:39.445] @gammalooprs::integrands::process::amplitude INFO : overlap structure of group 0: [0: []]
  1706. 38.34 s > field value
  1707. 38.34 s > span warm_up{integrand.name=bub}
  1708. 38.34 s > at crates/gammalooprs/src/integrands/process/amplitude/mod.rs:2015
  1709. 38.34 s > [18:18:39.445] @gammalooprs::integrands::process::amplitude INFO : overlap structure of group 1: [0: []]
  1710. 38.34 s > field value
  1711. 38.34 s > span warm_up{integrand.name=bub}
  1712. 38.34 s > at crates/gammalooprs/src/integrands/process/amplitude/mod.rs:2015
  1713. 38.34 s > [18:18:39.445] @gammalooprs::integrands::process::amplitude INFO : overlap structure of group 2: [0: []]
  1714. 38.34 s > field value
  1715. 38.34 s > span warm_up{integrand.name=bub}
  1716. 38.34 s > at crates/gammalooprs/src/integrands/process/amplitude/mod.rs:2015
  1717. 38.34 s > The application panicked (crashed).
  1718. 38.34 s > Message: assertion `left == right` failed: subtracted scalar UV profile failed:
  1719. 38.34 s > UVProfilePassFail {
  1720. 38.34 s > max_dod: -0.9,
  1721. 38.34 s > total: 16,
  1722. 38.34 s > failed: 1,
  1723. 38.34 s > failures: [
  1724. 38.34 s > UVProfileFailure {
  1725. 38.34 s > graph_index: 0,
  1726. 38.34 s > graph_name: "banana",
  1727. 38.34 s > cutkosky_cut: None,
  1728. 38.34 s > lmb_index: 1,
  1729. 38.34 s > fixed: [
  1730. 38.34 s > EdgeIndex(
  1731. 38.34 s > 2,
  1732. 38.34 s > ),
  1733. 38.34 s > EdgeIndex(
  1734. 38.34 s > 0,
  1735. 38.34 s > ),
  1736. 38.34 s > ],
  1737. 38.34 s > free: [
  1738. 38.34 s > EdgeIndex(
  1739. 38.34 s > 3,
  1740. 38.34 s > ),
  1741. 38.34 s > ],
  1742. 38.34 s > orientation_label: None,
  1743. 38.34 s > reason: "dod_exceeds_threshold",
  1744. 38.34 s > },
  1745. 38.34 s > ],
  1746. 38.34 s > }
  1747. 38.34 s >
  1748. 38.34 s > ╭─────────┬────────────┬───────────┬───────┬─────┬──────────┬───────────╮
  1749. 38.34 s > │ fixed │ → ∞ │ slope │ r2 │ DOD │ bare DOD │ inspect │
  1750. 38.34 s > ├─────────┼────────────┼───────────┼───────┼─────┼──────────┼───────────┤
  1751. 38.34 s > │ {e1,e2} │ {e3} │ -0.996752 │ 1.000 │ -1 │ 0 │ arb retry │
  1752. 38.34 s > │ {e1,e3} │ {e2} │ -1.065665 │ 0.997 │ -1 │ 0 │ arb retry │
  1753. 38.34 s > │ {e1} │ {e2,e3} │ -0.937151 │ 0.943 │ -1 │ 2 │ │
  1754. 38.34 s > │ {e2,e3} │ {e1} │ -1.001075 │ 1.000 │ -1 │ 0 │ arb retry │
  1755. 38.34 s > │ {e2} │ {e1,e3} │ -0.984146 │ 0.998 │ -1 │ 2 │ │
  1756. 38.34 s > │ {e3} │ {e1,e2} │ -1.383911 │ 0.982 │ -1 │ 2 │ arb retry │
  1757. 38.34 s > │ {} │ {e1,e2,e3} │ -1.094213 │ 0.258 │ -1 │ 4 │ │
  1758. 38.34 s > │ {e2,e0} │ {e3} │ -0.803348 │ 0.861 │ -1 │ 0 │ arb retry │
  1759. 38.34 s > │ {e3,e0} │ {e2} │ -0.999257 │ 1.000 │ -1 │ 0 │ │
  1760. 38.34 s > │ {e0} │ {e2,e3} │ -1.000893 │ 1.000 │ -1 │ 2 │ │
  1761. 38.34 s > │ {e1,e0} │ {e3} │ -0.997860 │ 1.000 │ -1 │ 0 │ │
  1762. 38.34 s > ╰─────────┴────────────┴───────────┴───────┴─────┴──────────┴───────────╯
  1763. 38.34 s >
  1764. 38.34 s > ╭───────┬─────────┬───────────┬───────┬─────┬──────────┬───────────╮
  1765. 38.34 s > │ fixed │ → ∞ │ slope │ r2 │ DOD │ bare DOD │ inspect │
  1766. 38.34 s > ├───────┼─────────┼───────────┼───────┼─────┼──────────┼───────────┤
  1767. 38.34 s > │ {e1} │ {e2} │ -1.005039 │ 1.000 │ -1 │ 0 │ arb retry │
  1768. 38.34 s > │ {e2} │ {e1} │ -1.001098 │ 1.000 │ -1 │ 0 │ arb retry │
  1769. 38.34 s > │ {} │ {e1,e2} │ -1.011289 │ 1.000 │ -1 │ 2 │ │
  1770. 38.34 s > │ {e0} │ {e2} │ -0.998140 │ 1.000 │ -1 │ 0 │ │
  1771. 38.34 s > ╰───────┴─────────┴───────────┴───────┴─────┴──────────┴───────────╯
  1772. 38.34 s >
  1773. 38.34 s > ╭───────┬──────┬───────────┬───────┬─────┬──────────┬─────────╮
  1774. 38.34 s > │ fixed │ → ∞ │ slope │ r2 │ DOD │ bare DOD │ inspect │
  1775. 38.34 s > ├───────┼──────┼───────────┼───────┼─────┼──────────┼─────────┤
  1776. 38.34 s > │ {} │ {e1} │ -0.989949 │ 1.000 │ -1 │ 0 │ │
  1777. 38.34 s > ╰───────┴──────┴───────────┴───────┴─────┴──────────┴─────────╯
  1778. 38.34 s > left: 1
  1779. 38.34 s > right: 0
  1780. 38.34 s > Location: crates/gammalooprs/src/uv/tests.rs:325
  1781. 38.34 s >
  1782. 38.34 s > ━━━━━━━━━━━━━━━━━━━━━━━━━━━━━━━━━━ BACKTRACE ━━━━━━━━━━━━━━━━━━━━━━━━━━━━━━━━━━━
  1783. 38.34 s > 1: <color_eyre[51793ea62743adbd]::config::PanicHook>::panic_report<unknown>
  1784. 38.34 s > at <unknown source file>:<unknown line>
  1785. 38.34 s > 2: <color_eyre[51793ea62743adbd]::config::PanicHook>::into_panic_hook::{closure#0}<unknown>
  1786. 38.34 s > at <unknown source file>:<unknown line>
  1787. 38.34 s > 3: std[bcb96dfbba0ab899]::panicking::panic_with_hook<unknown>
  1788. 38.34 s > at <unknown source file>:<unknown line>
  1789. 38.34 s > 4: std[bcb96dfbba0ab899]::panicking::panic_handler::{closure#0}<unknown>
  1790. 38.34 s > at <unknown source file>:<unknown line>
  1791. 38.34 s > 5: std[bcb96dfbba0ab899]::sys::backtrace::__rust_end_short_backtrace::<std[bcb96dfbba0ab899]::panicking::panic_handler::{closure#0}, !><unknown>
  1792. 38.34 s > at <unknown source file>:<unknown line>
  1793. 38.34 s > 6: __rustc[6c289b9f9c454d21]::rust_begin_unwind<unknown>
  1794. 38.34 s > at <unknown source file>:<unknown line>
  1795. 38.34 s > 7: core[940e698046960fd5]::panicking::panic_fmt<unknown>
  1796. 38.34 s > at <unknown source file>:<unknown line>
  1797. 38.34 s > 8: core[940e698046960fd5]::panicking::assert_failed_inner<unknown>
  1798. 38.34 s > at <unknown source file>:<unknown line>
  1799. 38.34 s > 9: core[940e698046960fd5]::panicking::assert_failed::<usize, usize><unknown>
  1800. 38.34 s > at <unknown source file>:<unknown line>
  1801. 38.34 s > 10: gammalooprs[972dff90865981f6]::uv::tests::scalars_profile_new<unknown>
  1802. 38.34 s > at <unknown source file>:<unknown line>
  1803. 38.34 s > 11: <gammalooprs[972dff90865981f6]::uv::tests::scalars_profile_new::{closure#0} as core[940e698046960fd5]::ops::function::FnOnce<()>>::call_once<unknown>
  1804. 38.34 s > at <unknown source file>:<unknown line>
  1805. 38.34 s > 12: test[75d6903177b1d7e9]::__rust_begin_short_backtrace::<core[940e698046960fd5]::result::Result<(), alloc[2ea6bcb46fca0c42]::string::String>, fn() -> core[940e698046960fd5]::result::Result<(), alloc[2ea6bcb46fca0c42]::string::String>><unknown>
  1806. 38.34 s > at <unknown source file>:<unknown line>
  1807. 38.34 s > 13: test[75d6903177b1d7e9]::run_test::{closure#0}<unknown>
  1808. 38.34 s > at <unknown source file>:<unknown line>
  1809. 38.34 s > 14: std[bcb96dfbba0ab899]::sys::backtrace::__rust_begin_short_backtrace::<test[75d6903177b1d7e9]::run_test::{closure#1}, ()><unknown>
  1810. 38.34 s > at <unknown source file>:<unknown line>
  1811. 38.34 s > 15: <std[bcb96dfbba0ab899]::thread::lifecycle::spawn_unchecked<test[75d6903177b1d7e9]::run_test::{closure#1}, ()>::{closure#1} as core[940e698046960fd5]::ops::function::FnOnce<()>>::call_once::{shim:vtable#0}<unknown>
  1812. 38.34 s > at <unknown source file>:<unknown line>
  1813. 38.34 s > 16: <std[bcb96dfbba0ab899]::sys::thread::unix::Thread>::new::thread_start<unknown>
  1814. 38.34 s > at <unknown source file>:<unknown line>
  1815. 38.34 s > 17: start_thread<unknown>
  1816. 38.34 s > at <unknown source file>:<unknown line>
  1817. 38.34 s > 18: __clone3<unknown>
  1818. 38.34 s > at <unknown source file>:<unknown line>
  1819. 38.34 s >
  1820. 38.34 s > Run with COLORBT_SHOW_HIDDEN=1 environment variable to disable frame filtering.
  1821. 38.34 s > Run with RUST_BACKTRACE=full to include source snippets.
  1822. 38.34 s >
  1823. 38.34 s > FAIL [ 10.344s] (560/561) gammalooprs uv::tests::scalars_profile
  1824. 38.34 s > stdout ---
  1825. 38.34 s >
  1826. 38.34 s > running 1 test
  1827. 38.34 s > test uv::tests::scalars_profile ... FAILED
  1828. 38.34 s >
  1829. 38.34 s > failures:
  1830. 38.34 s >
  1831. 38.34 s > failures:
  1832. 38.34 s > uv::tests::scalars_profile
  1833. 38.34 s >
  1834. 38.34 s > test result: FAILED. 0 passed; 1 failed; 0 ignored; 0 measured; 611 filtered out; finished in 10.32s
  1835. 38.34 s >
  1836. 38.34 s > stderr ---
  1837. 38.34 s > [18:18:39.434] @gammalooprs::settings::runtime WARNING : No external kinematics were provided; using default-generated external momenta and helicities.
  1838. 38.34 s > field value
  1839. 38.34 s > span build_integrand{amplitude.name=bub}
  1840. 38.34 s > at crates/gammalooprs/src/settings/runtime.rs:131
  1841. 38.34 s > [18:18:39.435] @gammalooprs::integrands::process::amplitude INFO : Input is below threshold: 0 existing threshold E-surfaces across 0/3 graph groups
  1842. 38.34 s > field value
  1843. 38.34 s > existing_esurfaces 0
  1844. 38.34 s > group_count 3
  1845. 38.34 s > groups_above_threshold 0
  1846. 38.34 s > integrand bub
  1847. 38.34 s > span warm_up{integrand.name=bub}
  1848. 38.34 s > threshold_status below threshold
  1849. 38.34 s > at crates/gammalooprs/src/integrands/process/amplitude/mod.rs:1666
  1850. 38.34 s > [18:18:39.435] @gammalooprs::integrands::process::amplitude INFO : overlap structure of group 0: [0: []]
  1851. 38.34 s > field value
  1852. 38.34 s > span warm_up{integrand.name=bub}
  1853. 38.34 s > at crates/gammalooprs/src/integrands/process/amplitude/mod.rs:2015
  1854. 38.34 s > [18:18:39.435] @gammalooprs::integrands::process::amplitude INFO : overlap structure of group 1: [0: []]
  1855. 38.34 s > field value
  1856. 38.34 s > span warm_up{integrand.name=bub}
  1857. 38.34 s > at crates/gammalooprs/src/integrands/process/amplitude/mod.rs:2015
  1858. 38.34 s > [18:18:39.435] @gammalooprs::integrands::process::amplitude INFO : overlap structure of group 2: [0: []]
  1859. 38.34 s > field value
  1860. 38.34 s > span warm_up{integrand.name=bub}
  1861. 38.34 s > at crates/gammalooprs/src/integrands/process/amplitude/mod.rs:2015
  1862. 38.34 s > The application panicked (crashed).
  1863. 38.34 s > Message: assertion `left == right` failed: subtracted scalar UV profile failed:
  1864. 38.34 s > UVProfilePassFail {
  1865. 38.34 s > max_dod: -0.9,
  1866. 38.34 s > total: 16,
  1867. 38.34 s > failed: 1,
  1868. 38.34 s > failures: [
  1869. 38.34 s > UVProfileFailure {
  1870. 38.34 s > graph_index: 0,
  1871. 38.34 s > graph_name: "banana",
  1872. 38.34 s > cutkosky_cut: None,
  1873. 38.34 s > lmb_index: 1,
  1874. 38.34 s > fixed: [
  1875. 38.34 s > EdgeIndex(
  1876. 38.34 s > 2,
  1877. 38.34 s > ),
  1878. 38.34 s > EdgeIndex(
  1879. 38.34 s > 0,
  1880. 38.34 s > ),
  1881. 38.34 s > ],
  1882. 38.34 s > free: [
  1883. 38.34 s > EdgeIndex(
  1884. 38.34 s > 3,
  1885. 38.34 s > ),
  1886. 38.34 s > ],
  1887. 38.34 s > orientation_label: None,
  1888. 38.34 s > reason: "dod_exceeds_threshold",
  1889. 38.34 s > },
  1890. 38.34 s > ],
  1891. 38.34 s > }
  1892. 38.34 s >
  1893. 38.34 s > ╭─────────┬────────────┬───────────┬───────┬─────┬──────────┬───────────╮
  1894. 38.34 s > │ fixed │ → ∞ │ slope │ r2 │ DOD │ bare DOD │ inspect │
  1895. 38.34 s > ├─────────┼────────────┼───────────┼───────┼─────┼──────────┼───────────┤
  1896. 38.34 s > │ {e1,e2} │ {e3} │ -0.996752 │ 1.000 │ -1 │ 0 │ arb retry │
  1897. 38.34 s > │ {e1,e3} │ {e2} │ -1.065665 │ 0.997 │ -1 │ 0 │ arb retry │
  1898. 38.34 s > │ {e1} │ {e2,e3} │ -0.937151 │ 0.943 │ -1 │ 2 │ │
  1899. 38.34 s > │ {e2,e3} │ {e1} │ -1.001075 │ 1.000 │ -1 │ 0 │ arb retry │
  1900. 38.34 s > │ {e2} │ {e1,e3} │ -0.984146 │ 0.998 │ -1 │ 2 │ │
  1901. 38.34 s > │ {e3} │ {e1,e2} │ -1.383911 │ 0.982 │ -1 │ 2 │ arb retry │
  1902. 38.34 s > │ {} │ {e1,e2,e3} │ -1.094213 │ 0.258 │ -1 │ 4 │ │
  1903. 38.34 s > │ {e2,e0} │ {e3} │ -0.803348 │ 0.861 │ -1 │ 0 │ arb retry │
  1904. 38.34 s > │ {e3,e0} │ {e2} │ -0.999257 │ 1.000 │ -1 │ 0 │ │
  1905. 38.34 s > │ {e0} │ {e2,e3} │ -1.000893 │ 1.000 │ -1 │ 2 │ │
  1906. 38.34 s > │ {e1,e0} │ {e3} │ -0.997860 │ 1.000 │ -1 │ 0 │ │
  1907. 38.34 s > ╰─────────┴────────────┴───────────┴───────┴─────┴──────────┴───────────╯
  1908. 38.34 s >
  1909. 38.34 s > ╭───────┬─────────┬───────────┬───────┬─────┬──────────┬───────────╮
  1910. 38.34 s > │ fixed │ → ∞ │ slope │ r2 │ DOD │ bare DOD │ inspect │
  1911. 38.34 s > ├───────┼─────────┼───────────┼───────┼─────┼──────────┼───────────┤
  1912. 38.34 s > │ {e1} │ {e2} │ -1.005039 │ 1.000 │ -1 │ 0 │ arb retry │
  1913. 38.34 s > │ {e2} │ {e1} │ -1.001098 │ 1.000 │ -1 │ 0 │ arb retry │
  1914. 38.34 s > │ {} │ {e1,e2} │ -1.011289 │ 1.000 │ -1 │ 2 │ │
  1915. 38.34 s > │ {e0} │ {e2} │ -0.998140 │ 1.000 │ -1 │ 0 │ │
  1916. 38.34 s > ╰───────┴─────────┴───────────┴───────┴─────┴──────────┴───────────╯
  1917. 38.34 s >
  1918. 38.34 s > ╭───────┬──────┬───────────┬───────┬─────┬──────────┬─────────╮
  1919. 38.34 s > │ fixed │ → ∞ │ slope │ r2 │ DOD │ bare DOD │ inspect │
  1920. 38.34 s > ├───────┼──────┼───────────┼───────┼─────┼──────────┼─────────┤
  1921. 38.34 s > │ {} │ {e1} │ -0.989949 │ 1.000 │ -1 │ 0 │ │
  1922. 38.34 s > ╰───────┴──────┴───────────┴───────┴─────┴──────────┴─────────╯
  1923. 38.34 s > left: 1
  1924. 38.34 s > right: 0
  1925. 38.34 s > Location: crates/gammalooprs/src/uv/tests.rs:259
  1926. 38.34 s >
  1927. 38.34 s > ━━━━━━━━━━━━━━━━━━━━━━━━━━━━━━━━━━ BACKTRACE ━━━━━━━━━━━━━━━━━━━━━━━━━━━━━━━━━━━
  1928. 38.34 s > 1: <color_eyre[51793ea62743adbd]::config::PanicHook>::panic_report<unknown>
  1929. 38.34 s > at <unknown source file>:<unknown line>
  1930. 38.34 s > 2: <color_eyre[51793ea62743adbd]::config::PanicHook>::into_panic_hook::{closure#0}<unknown>
  1931. 38.34 s > at <unknown source file>:<unknown line>
  1932. 38.34 s > 3: std[bcb96dfbba0ab899]::panicking::panic_with_hook<unknown>
  1933. 38.34 s > at <unknown source file>:<unknown line>
  1934. 38.34 s > 4: std[bcb96dfbba0ab899]::panicking::panic_handler::{closure#0}<unknown>
  1935. 38.34 s > at <unknown source file>:<unknown line>
  1936. 38.34 s > 5: std[bcb96dfbba0ab899]::sys::backtrace::__rust_end_short_backtrace::<std[bcb96dfbba0ab899]::panicking::panic_handler::{closure#0}, !><unknown>
  1937. 38.34 s > at <unknown source file>:<unknown line>
  1938. 38.34 s > 6: __rustc[6c289b9f9c454d21]::rust_begin_unwind<unknown>
  1939. 38.34 s > at <unknown source file>:<unknown line>
  1940. 38.34 s > 7: core[940e698046960fd5]::panicking::panic_fmt<unknown>
  1941. 38.34 s > at <unknown source file>:<unknown line>
  1942. 38.34 s > 8: core[940e698046960fd5]::panicking::assert_failed_inner<unknown>
  1943. 38.34 s > at <unknown source file>:<unknown line>
  1944. 38.34 s > 9: core[940e698046960fd5]::panicking::assert_failed::<usize, usize><unknown>
  1945. 38.34 s > at <unknown source file>:<unknown line>
  1946. 38.34 s > 10: gammalooprs[972dff90865981f6]::uv::tests::scalars_profile<unknown>
  1947. 38.34 s > at <unknown source file>:<unknown line>
  1948. 38.34 s > 11: <gammalooprs[972dff90865981f6]::uv::tests::scalars_profile::{closure#0} as core[940e698046960fd5]::ops::function::FnOnce<()>>::call_once<unknown>
  1949. 38.34 s > at <unknown source file>:<unknown line>
  1950. 38.34 s > 12: test[75d6903177b1d7e9]::__rust_begin_short_backtrace::<core[940e698046960fd5]::result::Result<(), alloc[2ea6bcb46fca0c42]::string::String>, fn() -> core[940e698046960fd5]::result::Result<(), alloc[2ea6bcb46fca0c42]::string::String>><unknown>
  1951. 38.34 s > at <unknown source file>:<unknown line>
  1952. 38.34 s > 13: test[75d6903177b1d7e9]::run_test::{closure#0}<unknown>
  1953. 38.34 s > at <unknown source file>:<unknown line>
  1954. 38.34 s > 14: std[bcb96dfbba0ab899]::sys::backtrace::__rust_begin_short_backtrace::<test[75d6903177b1d7e9]::run_test::{closure#1}, ()><unknown>
  1955. 38.34 s > at <unknown source file>:<unknown line>
  1956. 38.34 s > 15: <std[bcb96dfbba0ab899]::thread::lifecycle::spawn_unchecked<test[75d6903177b1d7e9]::run_test::{closure#1}, ()>::{closure#1} as core[940e698046960fd5]::ops::function::FnOnce<()>>::call_once::{shim:vtable#0}<unknown>
  1957. 38.34 s > at <unknown source file>:<unknown line>
  1958. 38.34 s > 16: <std[bcb96dfbba0ab899]::sys::thread::unix::Thread>::new::thread_start<unknown>
  1959. 38.34 s > at <unknown source file>:<unknown line>
  1960. 38.34 s > 17: start_thread<unknown>
  1961. 38.34 s > at <unknown source file>:<unknown line>
  1962. 38.34 s > 18: __clone3<unknown>
  1963. 38.34 s > at <unknown source file>:<unknown line>
  1964. 38.34 s >
  1965. 38.34 s > Run with COLORBT_SHOW_HIDDEN=1 environment variable to disable frame filtering.
  1966. 38.34 s > Run with RUST_BACKTRACE=full to include source snippets.
  1967. 38.34 s >
  1968. 38.34 s > error: test run failed
  1969. 38.34 s >
  1970. 38.34 s > ========== nextest test summary ==========
  1971. 38.34 s > report: target/nextest/ci_gammaloop/junit.xml
  1972. 38.35 s > tests: 561, failures: 5, errors: 0
  1973. 38.35 s >
  1974. 38.35 s > 1. gammalooprs::cff::tests::stored_production_cff_uses_typed_energy_factor_ownership
  1975. 38.35 s > failure: test failure with exit code 101
  1976. 38.35 s > system-out
  1977. 38.35 s > running 1 test
  1978. 38.35 s > test cff::tests::stored_production_cff_uses_typed_energy_factor_ownership ... FAILED
  1979. 38.35 s >
  1980. 38.35 s > failures:
  1981. 38.35 s >
  1982. 38.35 s > failures:
  1983. 38.35 s > cff::tests::stored_production_cff_uses_typed_energy_factor_ownership
  1984. 38.35 s >
  1985. 38.35 s > test result: FAILED. 0 passed; 1 failed; 0 ignored; 0 measured; 611 filtered out; finished in 0.09s
  1986. 38.35 s > system-err
  1987. 38.35 s > The application panicked (crashed).
  1988. 38.35 s > Message: assertion `left == right` failed
  1989. 38.35 s > left: 1
  1990. 38.35 s > right: -1
  1991. 38.35 s > Location: crates/gammalooprs/src/cff/mod.rs:2721
  1992. 38.35 s >
  1993. 38.35 s > ━━━━━━━━━━━━━━━━━━━━━━━━━━━━━━━━━━ BACKTRACE ━━━━━━━━━━━━━━━━━━━━━━━━━━━━━━━━━━━
  1994. 38.35 s > 1: <color_eyre[51793ea62743adbd]::config::PanicHook>::panic_report<unknown>
  1995. 38.35 s > at <unknown source file>:<unknown line>
  1996. 38.35 s > 2: <color_eyre[51793ea62743adbd]::config::PanicHook>::into_panic_hook::{closure#0}<unknown>
  1997. 38.35 s > at <unknown source file>:<unknown line>
  1998. 38.35 s > 3: std[bcb96dfbba0ab899]::panicking::panic_with_hook<unknown>
  1999. 38.35 s > at <unknown source file>:<unknown line>
  2000. 38.35 s > 4: std[bcb96dfbba0ab899]::panicking::panic_handler::{closure#0}<unknown>
  2001. 38.35 s > at <unknown source file>:<unknown line>
  2002. 38.35 s > 5: std[bcb96dfbba0ab899]::sys::backtrace::__rust_end_short_backtrace::<std[bcb96dfbba0ab899]::panicking::panic_handler::{closure#0}, !><unknown>
  2003. 38.35 s > at <unknown source file>:<unknown line>
  2004. 38.35 s > 6: __rustc[6c289b9f9c454d21]::rust_begin_unwind<unknown>
  2005. 38.35 s > at <unknown source file>:<unknown line>
  2006. 38.35 s > 7: core[940e698046960fd5]::panicking::panic_fmt<unknown>
  2007. 38.35 s > at <unknown source file>:<unknown line>
  2008. 38.35 s > 8: core[940e698046960fd5]::panicking::assert_failed_inner<unknown>
  2009. 38.35 s > at <unknown source file>:<unknown line>
  2010. 38.35 s > 9: core[940e698046960fd5]::panicking::assert_failed::<i64, i64><unknown>
  2011. 38.35 s > at <unknown source file>:<unknown line>
  2012. 38.35 s > 10: gammalooprs[972dff90865981f6]::cff::tests::stored_production_cff_uses_typed_energy_factor_ownership<unknown>
  2013. 38.35 s > at <unknown source file>:<unknown line>
  2014. 38.35 s > 11: <gammalooprs[972dff90865981f6]::cff::tests::stored_production_cff_uses_typed_energy_factor_ownership::{closure#0} as core[940e698046960fd5]::ops::function::FnOnce<()>>::call_once<unknown>
  2015. 38.35 s > at <unknown source file>:<unknown line>
  2016. 38.35 s > 12: test[75d6903177b1d7e9]::__rust_begin_short_backtrace::<core[940e698046960fd5]::result::Result<(), alloc[2ea6bcb46fca0c42]::string::String>, fn() -> core[940e698046960fd5]::result::Result<(), alloc[2ea6bcb46fca0c42]::string::String>><unknown>
  2017. 38.35 s > at <unknown source file>:<unknown line>
  2018. 38.35 s > 13: test[75d6903177b1d7e9]::run_test::{closure#0}<unknown>
  2019. 38.35 s > at <unknown source file>:<unknown line>
  2020. 38.35 s > 14: std[bcb96dfbba0ab899]::sys::backtrace::__rust_begin_short_backtrace::<test[75d6903177b1d7e9]::run_test::{closure#1}, ()><unknown>
  2021. 38.35 s > at <unknown source file>:<unknown line>
  2022. 38.35 s > 15: <std[bcb96dfbba0ab899]::thread::lifecycle::spawn_unchecked<test[75d6903177b1d7e9]::run_test::{closure#1}, ()>::{closure#1} as core[940e698046960fd5]::ops::function::FnOnce<()>>::call_once::{shim:vtable#0}<unknown>
  2023. 38.35 s > at <unknown source file>:<unknown line>
  2024. 38.35 s > 16: <std[bcb96dfbba0ab899]::sys::thread::unix::Thread>::new::thread_start<unknown>
  2025. 38.35 s > at <unknown source file>:<unknown line>
  2026. 38.35 s > 17: start_thread<unknown>
  2027. 38.35 s > at <unknown source file>:<unknown line>
  2028. 38.35 s > 18: __clone3<unknown>
  2029. 38.35 s > at <unknown source file>:<unknown line>
  2030. 38.35 s >
  2031. 38.35 s > Run with COLORBT_SHOW_HIDDEN=1 environment variable to disable frame filtering.
  2032. 38.35 s > Run with RUST_BACKTRACE=full to include source snippets.
  2033. 38.35 s >
  2034. 38.35 s > 2. gammalooprs::uv::approx::local_3d::tests::production_emr_map_cancels_one_powered_denominator
  2035. 38.35 s > failure: test failure with exit code 101
  2036. 38.35 s > system-out
  2037. 38.35 s > running 1 test
  2038. 38.35 s > test uv::approx::local_3d::tests::production_emr_map_cancels_one_powered_denominator ... FAILED
  2039. 38.35 s >
  2040. 38.35 s > failures:
  2041. 38.35 s >
  2042. 38.35 s > failures:
  2043. 38.35 s > uv::approx::local_3d::tests::production_emr_map_cancels_one_powered_denominator
  2044. 38.35 s >
  2045. 38.35 s > test result: FAILED. 0 passed; 1 failed; 0 ignored; 0 measured; 611 filtered out; finished in 0.10s
  2046. 38.35 s > system-err
  2047. 38.35 s > The application panicked (crashed).
  2048. 38.35 s > Message: summed exact-source powered and selected lower channels differ: powered=-1𝑖/8/𝜋^3, lower=1𝑖/16/𝜋^3, difference=-3𝑖/16/𝜋^3
  2049. 38.35 s > Location: crates/gammalooprs/src/uv/approx/local_3d.rs:2047
  2050. 38.35 s >
  2051. 38.35 s > ━━━━━━━━━━━━━━━━━━━━━━━━━━━━━━━━━━ BACKTRACE ━━━━━━━━━━━━━━━━━━━━━━━━━━━━━━━━━━━
  2052. 38.35 s > 1: <color_eyre[51793ea62743adbd]::config::PanicHook>::panic_report<unknown>
  2053. 38.35 s > at <unknown source file>:<unknown line>
  2054. 38.35 s > 2: <color_eyre[51793ea62743adbd]::config::PanicHook>::into_panic_hook::{closure#0}<unknown>
  2055. 38.35 s > at <unknown source file>:<unknown line>
  2056. 38.35 s > 3: std[bcb96dfbba0ab899]::panicking::panic_with_hook<unknown>
  2057. 38.35 s > at <unknown source file>:<unknown line>
  2058. 38.35 s > 4: std[bcb96dfbba0ab899]::panicking::panic_handler::{closure#0}<unknown>
  2059. 38.35 s > at <unknown source file>:<unknown line>
  2060. 38.35 s > 5: std[bcb96dfbba0ab899]::sys::backtrace::__rust_end_short_backtrace::<std[bcb96dfbba0ab899]::panicking::panic_handler::{closure#0}, !><unknown>
  2061. 38.35 s > at <unknown source file>:<unknown line>
  2062. 38.35 s > 6: __rustc[6c289b9f9c454d21]::rust_begin_unwind<unknown>
  2063. 38.35 s > at <unknown source file>:<unknown line>
  2064. 38.35 s > 7: core[940e698046960fd5]::panicking::panic_fmt<unknown>
  2065. 38.35 s > at <unknown source file>:<unknown line>
  2066. 38.35 s > 8: gammalooprs[972dff90865981f6]::uv::approx::local_3d::tests::production_emr_map_cancels_one_powered_denominator<unknown>
  2067. 38.35 s > at <unknown source file>:<unknown line>
  2068. 38.35 s > 9: <gammalooprs[972dff90865981f6]::uv::approx::local_3d::tests::production_emr_map_cancels_one_powered_denominator::{closure#0} as core[940e698046960fd5]::ops::function::FnOnce<()>>::call_once<unknown>
  2069. 38.35 s > at <unknown source file>:<unknown line>
  2070. 38.35 s > 10: test[75d6903177b1d7e9]::__rust_begin_short_backtrace::<core[940e698046960fd5]::result::Result<(), alloc[2ea6bcb46fca0c42]::string::String>, fn() -> core[940e698046960fd5]::result::Result<(), alloc[2ea6bcb46fca0c42]::string::String>><unknown>
  2071. 38.35 s > at <unknown source file>:<unknown line>
  2072. 38.35 s > 11: test[75d6903177b1d7e9]::run_test::{closure#0}<unknown>
  2073. 38.35 s > at <unknown source file>:<unknown line>
  2074. 38.35 s > 12: std[bcb96dfbba0ab899]::sys::backtrace::__rust_begin_short_backtrace::<test[75d6903177b1d7e9]::run_test::{closure#1}, ()><unknown>
  2075. 38.35 s > at <unknown source file>:<unknown line>
  2076. 38.35 s > 13: <std[bcb96dfbba0ab899]::thread::lifecycle::spawn_unchecked<test[75d6903177b1d7e9]::run_test::{closure#1}, ()>::{closure#1} as core[940e698046960fd5]::ops::function::FnOnce<()>>::call_once::{shim:vtable#0}<unknown>
  2077. 38.35 s > at <unknown source file>:<unknown line>
  2078. 38.35 s > 14: <std[bcb96dfbba0ab899]::sys::thread::unix::Thread>::new::thread_start<unknown>
  2079. 38.35 s > at <unknown source file>:<unknown line>
  2080. 38.35 s > 15: start_thread<unknown>
  2081. 38.35 s > at <unknown source file>:<unknown line>
  2082. 38.35 s > 16: __clone3<unknown>
  2083. 38.35 s > at <unknown source file>:<unknown line>
  2084. 38.35 s >
  2085. 38.35 s > Run with COLORBT_SHOW_HIDDEN=1 environment variable to disable frame filtering.
  2086. 38.35 s > Run with RUST_BACKTRACE=full to include source snippets.
  2087. 38.35 s >
  2088. 38.35 s > 3. gammalooprs::uv::hedge_poset::tests::spectacles_typed_4d_projects_after_local_construction
  2089. 38.35 s > failure: test failure with exit code 101
  2090. 38.35 s > Error:
  2091. 38.35 s > 0: failed to extract three-dimensional representation graph input: source edge 1 has no unique routing for rewritten exact signature [-1, 0, 0] modulo the factorized opposite-domain loop span
  2092. 38.35 s >
  2093. 38.35 s > Location:
  2094. 38.35 s > crates/gammalooprs/src/uv/approx/local_3d.rs:845
  2095. 38.35 s >
  2096. 38.35 s > ━━━━━━━━━━━━━━━━━━━━━━━━━━━━━━━━━━ BACKTRACE ━━━━━━━━━━━━━━━━━━━━━━━━━━━━━━━━━━━
  2097. 38.35 s > 1: <color_eyre[51793ea62743adbd]::config::EyreHook>::into_eyre_hook::{closure#0}<unknown>
  2098. 38.35 s > at <unknown source file>:<unknown line>
  2099. 38.35 s > 2: eyre[cb2fd339c0c40fca]::capture_handler<unknown>
  2100. 38.35 s > at <unknown source file>:<unknown line>
  2101. 38.35 s > 3: <eyre[cb2fd339c0c40fca]::Report>::from_std::<three_dimensional_reps[3cb572ff22d197ac]::graph_io::GraphIoError><unknown>
  2102. 38.35 s > at <unknown source file>:<unknown line>
  2103. 38.35 s > 4: <gammalooprs[972dff90865981f6]::uv::approx::local_3d::Localizer>::project_4d<unknown>
  2104. 38.35 s > at <unknown source file>:<unknown line>
  2105. 38.35 s > 5: gammalooprs[972dff90865981f6]::uv::hedge_poset::tests::spectacles_typed_4d_projects_after_local_construction<unknown>
  2106. 38.35 s > at <unknown source file>:<unknown line>
  2107. 38.35 s > 6: <gammalooprs[972dff90865981f6]::uv::hedge_poset::tests::spectacles_typed_4d_projects_after_local_construction::{closure#0} as core[940e698046960fd5]::ops::function::FnOnce<()>>::call_once<unknown>
  2108. 38.35 s > at <unknown source file>:<unknown line>
  2109. 38.35 s > 7: test[75d6903177b1d7e9]::__rust_begin_short_backtrace::<core[940e698046960fd5]::result::Result<(), alloc[2ea6bcb46fca0c42]::string::String>, fn() -> core[940e698046960fd5]::result::Result<(), alloc[2ea6bcb46fca0c42]::string::String>><unknown>
  2110. 38.35 s > at <unknown source file>:<unknown line>
  2111. 38.35 s > 8: test[75d6903177b1d7e9]::run_test::{closure#0}<unknown>
  2112. 38.35 s > at <unknown source file>:<unknown line>
  2113. 38.35 s > 9: std[bcb96dfbba0ab899]::sys::backtrace::__rust_begin_short_backtrace::<test[75d6903177b1d7e9]::run_test::{closure#1}, ()><unknown>
  2114. 38.35 s > at <unknown source file>:<unknown line>
  2115. 38.35 s > 10: <std[bcb96dfbba0ab899]::thread::lifecycle::spawn_unchecked<test[75d6903177b1d7e9]::run_test::{closure#1}, ()>::{closure#1} as core[940e698046960fd5]::ops::function::FnOnce<()>>::call_once::{shim:vtable#0}<unknown>
  2116. 38.35 s > at <unknown source file>:<unknown line>
  2117. 38.35 s > 11: <std[bcb96dfbba0ab899]::sys::thread::unix::Thread>::new::thread_start<unknown>
  2118. 38.35 s > at <unknown source file>:<unknown line>
  2119. 38.35 s > 12: start_thread<unknown>
  2120. 38.35 s > at <unknown source file>:<unknown line>
  2121. 38.35 s > 13: __clone3<unknown>
  2122. 38.35 s > at <unknown source file>:<unknown line>
  2123. 38.35 s >
  2124. 38.35 s > Run with COLORBT_SHOW_HIDDEN=1 environment variable to disable frame filtering.
  2125. 38.35 s > Run with RUST_BACKTRACE=full to include source snippets.
  2126. 38.35 s > system-out
  2127. 38.35 s > running 1 test
  2128. 38.35 s > digraph {
  2129. 38.35 s > node [shape=circle,height=0.1,label=""];
  2130. 38.35 s > overlap = "scale";
  2131. 38.35 s > layout = "neato";
  2132. 38.35 s > start=2;
  2133. 38.35 s > 4 [label="0"];
  2134. 38.35 s > 1 [label="zw"];
  2135. 38.35 s > 2 [label="F"];
  2136. 38.35 s > 0 [label="143"];
  2137. 38.35 s > 3 [label="10B"];
  2138. 38.35 s > 4:0:s-> 1:1:s [id=0 color="red:blue;0.5" label="zw"];
  2139. 38.35 s > 4:2:s-> 2:3:s [id=1 color="red:blue;0.5" label="F"];
  2140. 38.35 s > 3:5:s-> 0:4:s [id=2 color="red:blue;0.5" label="143"];
  2141. 38.35 s > 4:6:s-> 0:7:s [id=3 color="red:blue;0.5" label="143"];
  2142. 38.35 s > 1:8:s-> 3:9:s [id=4 color="red:blue;0.5" label="F"];
  2143. 38.35 s > 1:10:s-> 0:11:s [id=5 color="red:blue;0.5" label="143"];
  2144. 38.35 s > 2:12:s-> 3:13:s [id=6 color="red:blue;0.5" label="zw"];
  2145. 38.35 s > 2:14:s-> 0:15:s [id=7 color="red:blue;0.5" label="143"];
  2146. 38.35 s > }
  2147. 38.35 s >
  2148. 38.35 s > digraph {
  2149. 38.35 s > node [shape=circle,height=0.1,label=""];
  2150. 38.35 s > overlap = "scale";
  2151. 38.35 s > layout = "neato";
  2152. 38.35 s > start=2;
  2153. 38.35 s > 0 [label="∅"];
  2154. 38.35 s > 1 [label="{zw}: Approx(S_zw(0))"];
  2155. 38.35 s > 2 [label="{F}: Approx(S_F(1))"];
  2156. 38.35 s > 3 [label="{143}: Approx(S_143(3))"];
  2157. 38.35 s > 4 [label="{zw,F}: Approx(S_F(4))*Approx(S_zw(0))"];
  2158. 38.35 s > 5 [label="{zw} · {143}: Approx((-1*S_zw+S_143(5))*Approx(S_zw(0)))"];
  2159. 38.35 s > 6 [label="{F} · {143}: Approx((-1*S_F+S_143(7))*Approx(S_F(1)))"];
  2160. 38.35 s > 7 [label="{zw,F} · {143}: Approx((-1*S_10B+S_143(2))*Approx(S_F(4))*Approx(S_zw(0)))"];
  2161. 38.35 s > 0:0:s-> 1:1:s [id=0 color="red:blue;0.5"];
  2162. 38.35 s > 0:2:s-> 2:3:s [id=1 color="red:blue;0.5"];
  2163. 38.35 s > 0:4:s-> 3:5:s [id=2 color="red:blue;0.5"];
  2164. 38.35 s > 1:6:s-> 4:7:s [id=3 color="red:blue;0.5"];
  2165. 38.35 s > 1:8:s-> 5:9:s [id=4 color="red:blue;0.5"];
  2166. 38.35 s > 2:10:s-> 4:11:s [id=5 color="red:blue;0.5"];
  2167. 38.35 s > 2:12:s-> 6:13:s [id=6 color="red:blue;0.5"];
  2168. 38.35 s > 4:14:s-> 7:15:s [id=7 color="red:blue;0.5"];
  2169. 38.35 s > }
  2170. 38.35 s >
  2171. 38.35 s > test uv::hedge_poset::tests::spectacles_typed_4d_projects_after_local_construction ... FAILED
  2172. 38.35 s >
  2173. 38.35 s > failures:
  2174. 38.35 s >
  2175. 38.35 s > failures:
  2176. 38.35 s > uv::hedge_poset::tests::spectacles_typed_4d_projects_after_local_construction
  2177. 38.35 s >
  2178. 38.35 s > test result: FAILED. 0 passed; 1 failed; 0 ignored; 0 measured; 611 filtered out; finished in 0.20s
  2179. 38.35 s > system-err
  2180. 38.35 s > Error:
  2181. 38.35 s > 0: failed to extract three-dimensional representation graph input: source edge 1 has no unique routing for rewritten exact signature [-1, 0, 0] modulo the factorized opposite-domain loop span
  2182. 38.35 s >
  2183. 38.35 s > Location:
  2184. 38.35 s > crates/gammalooprs/src/uv/approx/local_3d.rs:845
  2185. 38.35 s >
  2186. 38.35 s > ━━━━━━━━━━━━━━━━━━━━━━━━━━━━━━━━━━ BACKTRACE ━━━━━━━━━━━━━━━━━━━━━━━━━━━━━━━━━━━
  2187. 38.35 s > 1: <color_eyre[51793ea62743adbd]::config::EyreHook>::into_eyre_hook::{closure#0}<unknown>
  2188. 38.35 s > at <unknown source file>:<unknown line>
  2189. 38.35 s > 2: eyre[cb2fd339c0c40fca]::capture_handler<unknown>
  2190. 38.35 s > at <unknown source file>:<unknown line>
  2191. 38.35 s > 3: <eyre[cb2fd339c0c40fca]::Report>::from_std::<three_dimensional_reps[3cb572ff22d197ac]::graph_io::GraphIoError><unknown>
  2192. 38.35 s > at <unknown source file>:<unknown line>
  2193. 38.35 s > 4: <gammalooprs[972dff90865981f6]::uv::approx::local_3d::Localizer>::project_4d<unknown>
  2194. 38.35 s > at <unknown source file>:<unknown line>
  2195. 38.35 s > 5: gammalooprs[972dff90865981f6]::uv::hedge_poset::tests::spectacles_typed_4d_projects_after_local_construction<unknown>
  2196. 38.35 s > at <unknown source file>:<unknown line>
  2197. 38.35 s > 6: <gammalooprs[972dff90865981f6]::uv::hedge_poset::tests::spectacles_typed_4d_projects_after_local_construction::{closure#0} as core[940e698046960fd5]::ops::function::FnOnce<()>>::call_once<unknown>
  2198. 38.35 s > at <unknown source file>:<unknown line>
  2199. 38.35 s > 7: test[75d6903177b1d7e9]::__rust_begin_short_backtrace::<core[940e698046960fd5]::result::Result<(), alloc[2ea6bcb46fca0c42]::string::String>, fn() -> core[940e698046960fd5]::result::Result<(), alloc[2ea6bcb46fca0c42]::string::String>><unknown>
  2200. 38.35 s > at <unknown source file>:<unknown line>
  2201. 38.35 s > 8: test[75d6903177b1d7e9]::run_test::{closure#0}<unknown>
  2202. 38.35 s > at <unknown source file>:<unknown line>
  2203. 38.35 s > 9: std[bcb96dfbba0ab899]::sys::backtrace::__rust_begin_short_backtrace::<test[75d6903177b1d7e9]::run_test::{closure#1}, ()><unknown>
  2204. 38.35 s > at <unknown source file>:<unknown line>
  2205. 38.35 s > 10: <std[bcb96dfbba0ab899]::thread::lifecycle::spawn_unchecked<test[75d6903177b1d7e9]::run_test::{closure#1}, ()>::{closure#1} as core[940e698046960fd5]::ops::function::FnOnce<()>>::call_once::{shim:vtable#0}<unknown>
  2206. 38.35 s > at <unknown source file>:<unknown line>
  2207. 38.35 s > 11: <std[bcb96dfbba0ab899]::sys::thread::unix::Thread>::new::thread_start<unknown>
  2208. 38.35 s > at <unknown source file>:<unknown line>
  2209. 38.35 s > 12: start_thread<unknown>
  2210. 38.35 s > at <unknown source file>:<unknown line>
  2211. 38.35 s > 13: __clone3<unknown>
  2212. 38.35 s > at <unknown source file>:<unknown line>
  2213. 38.35 s >
  2214. 38.35 s > Run with COLORBT_SHOW_HIDDEN=1 environment variable to disable frame filtering.
  2215. 38.35 s > Run with RUST_BACKTRACE=full to include source snippets.
  2216. 38.35 s >
  2217. 38.35 s > 4. gammalooprs::uv::tests::scalars_profile_new
  2218. 38.35 s > failure: test failure with exit code 101
  2219. 38.35 s > system-out
  2220. 38.35 s > running 1 test
  2221. 38.35 s > test uv::tests::scalars_profile_new ... FAILED
  2222. 38.35 s >
  2223. 38.35 s > failures:
  2224. 38.35 s >
  2225. 38.35 s > failures:
  2226. 38.35 s > uv::tests::scalars_profile_new
  2227. 38.35 s >
  2228. 38.35 s > test result: FAILED. 0 passed; 1 failed; 0 ignored; 0 measured; 611 filtered out; finished in 10.30s
  2229. 38.35 s > system-err
  2230. 38.35 s > [18:18:39.444] @gammalooprs::settings::runtime WARNING : No external kinematics were provided; using default-generated external momenta and helicities.
  2231. 38.35 s > field value
  2232. 38.35 s > span build_integrand{amplitude.name=bub}
  2233. 38.35 s > at crates/gammalooprs/src/settings/runtime.rs:131
  2234. 38.35 s > [18:18:39.445] @gammalooprs::integrands::process::amplitude INFO : Input is below threshold: 0 existing threshold E-surfaces across 0/3 graph groups
  2235. 38.35 s > field value
  2236. 38.35 s > existing_esurfaces 0
  2237. 38.35 s > group_count 3
  2238. 38.35 s > groups_above_threshold 0
  2239. 38.35 s > integrand bub
  2240. 38.35 s > span warm_up{integrand.name=bub}
  2241. 38.35 s > threshold_status below threshold
  2242. 38.35 s > at crates/gammalooprs/src/integrands/process/amplitude/mod.rs:1666
  2243. 38.35 s > [18:18:39.445] @gammalooprs::integrands::process::amplitude INFO : overlap structure of group 0: [0: []]
  2244. 38.35 s > field value
  2245. 38.35 s > span warm_up{integrand.name=bub}
  2246. 38.35 s > at crates/gammalooprs/src/integrands/process/amplitude/mod.rs:2015
  2247. 38.35 s > [18:18:39.445] @gammalooprs::integrands::process::amplitude INFO : overlap structure of group 1: [0: []]
  2248. 38.35 s > field value
  2249. 38.35 s > span warm_up{integrand.name=bub}
  2250. 38.35 s > at crates/gammalooprs/src/integrands/process/amplitude/mod.rs:2015
  2251. 38.35 s > [18:18:39.445] @gammalooprs::integrands::process::amplitude INFO : overlap structure of group 2: [0: []]
  2252. 38.35 s > field value
  2253. 38.35 s > span warm_up{integrand.name=bub}
  2254. 38.35 s > at crates/gammalooprs/src/integrands/process/amplitude/mod.rs:2015
  2255. 38.35 s > The application panicked (crashed).
  2256. 38.35 s > Message: assertion `left == right` failed: subtracted scalar UV profile failed:
  2257. 38.35 s > UVProfilePassFail {
  2258. 38.35 s > max_dod: -0.9,
  2259. 38.35 s > total: 16,
  2260. 38.35 s > failed: 1,
  2261. 38.35 s > failures: [
  2262. 38.35 s > UVProfileFailure {
  2263. 38.35 s > graph_index: 0,
  2264. 38.35 s > graph_name: "banana",
  2265. 38.35 s > cutkosky_cut: None,
  2266. 38.35 s > lmb_index: 1,
  2267. 38.35 s > fixed: [
  2268. 38.35 s > EdgeIndex(
  2269. 38.35 s > 2,
  2270. 38.35 s > ),
  2271. 38.35 s > EdgeIndex(
  2272. 38.35 s > 0,
  2273. 38.35 s > ),
  2274. 38.35 s > ],
  2275. 38.35 s > free: [
  2276. 38.35 s > EdgeIndex(
  2277. 38.35 s > 3,
  2278. 38.35 s > ),
  2279. 38.35 s > ],
  2280. 38.35 s > orientation_label: None,
  2281. 38.35 s > reason: "dod_exceeds_threshold",
  2282. 38.35 s > },
  2283. 38.35 s > ],
  2284. 38.35 s > }
  2285. 38.35 s >
  2286. 38.35 s > ╭─────────┬────────────┬───────────┬───────┬─────┬──────────┬───────────╮
  2287. 38.35 s > │ fixed │ → ∞ │ slope │ r2 │ DOD │ bare DOD │ inspect │
  2288. 38.35 s > ├─────────┼────────────┼───────────┼───────┼─────┼──────────┼───────────┤
  2289. 38.35 s > │ {e1,e2} │ {e3} │ -0.996752 │ 1.000 │ -1 │ 0 │ arb retry │
  2290. 38.35 s > │ {e1,e3} │ {e2} │ -1.065665 │ 0.997 │ -1 │ 0 │ arb retry │
  2291. 38.35 s > │ {e1} │ {e2,e3} │ -0.937151 │ 0.943 │ -1 │ 2 │ │
  2292. 38.35 s > │ {e2,e3} │ {e1} │ -1.001075 │ 1.000 │ -1 │ 0 │ arb retry │
  2293. 38.35 s > │ {e2} │ {e1,e3} │ -0.984146 │ 0.998 │ -1 │ 2 │ │
  2294. 38.35 s > │ {e3} │ {e1,e2} │ -1.383911 │ 0.982 │ -1 │ 2 │ arb retry │
  2295. 38.35 s > │ {} │ {e1,e2,e3} │ -1.094213 │ 0.258 │ -1 │ 4 │ │
  2296. 38.35 s > │ {e2,e0} │ {e3} │ -0.803348 │ 0.861 │ -1 │ 0 │ arb retry │
  2297. 38.35 s > │ {e3,e0} │ {e2} │ -0.999257 │ 1.000 │ -1 │ 0 │ │
  2298. 38.35 s > │ {e0} │ {e2,e3} │ -1.000893 │ 1.000 │ -1 │ 2 │ │
  2299. 38.35 s > │ {e1,e0} │ {e3} │ -0.997860 │ 1.000 │ -1 │ 0 │ │
  2300. 38.35 s > ╰─────────┴────────────┴───────────┴───────┴─────┴──────────┴───────────╯
  2301. 38.35 s >
  2302. 38.35 s > ╭───────┬─────────┬───────────┬───────┬─────┬──────────┬───────────╮
  2303. 38.35 s > │ fixed │ → ∞ │ slope │ r2 │ DOD │ bare DOD │ inspect │
  2304. 38.35 s > ├───────┼─────────┼───────────┼───────┼─────┼──────────┼───────────┤
  2305. 38.35 s > │ {e1} │ {e2} │ -1.005039 │ 1.000 │ -1 │ 0 │ arb retry │
  2306. 38.35 s > │ {e2} │ {e1} │ -1.001098 │ 1.000 │ -1 │ 0 │ arb retry │
  2307. 38.35 s > │ {} │ {e1,e2} │ -1.011289 │ 1.000 │ -1 │ 2 │ │
  2308. 38.35 s > │ {e0} │ {e2} │ -0.998140 │ 1.000 │ -1 │ 0 │ │
  2309. 38.35 s > ╰───────┴─────────┴───────────┴───────┴─────┴──────────┴───────────╯
  2310. 38.35 s >
  2311. 38.35 s > ╭───────┬──────┬───────────┬───────┬─────┬──────────┬─────────╮
  2312. 38.35 s > │ fixed │ → ∞ │ slope │ r2 │ DOD │ bare DOD │ inspect │
  2313. 38.35 s > ├───────┼──────┼───────────┼───────┼─────┼──────────┼─────────┤
  2314. 38.35 s > │ {} │ {e1} │ -0.989949 │ 1.000 │ -1 │ 0 │ │
  2315. 38.35 s > ╰───────┴──────┴───────────┴───────┴─────┴──────────┴─────────╯
  2316. 38.35 s > left: 1
  2317. 38.35 s > right: 0
  2318. 38.35 s > Location: crates/gammalooprs/src/uv/tests.rs:325
  2319. 38.35 s >
  2320. 38.35 s > ━━━━━━━━━━━━━━━━━━━━━━━━━━━━━━━━━━ BACKTRACE ━━━━━━━━━━━━━━━━━━━━━━━━━━━━━━━━━━━
  2321. 38.35 s > 1: <color_eyre[51793ea62743adbd]::config::PanicHook>::panic_report<unknown>
  2322. 38.35 s > at <unknown source file>:<unknown line>
  2323. 38.35 s > 2: <color_eyre[51793ea62743adbd]::config::PanicHook>::into_panic_hook::{closure#0}<unknown>
  2324. 38.35 s > at <unknown source file>:<unknown line>
  2325. 38.35 s > 3: std[bcb96dfbba0ab899]::panicking::panic_with_hook<unknown>
  2326. 38.35 s > at <unknown source file>:<unknown line>
  2327. 38.35 s > 4: std[bcb96dfbba0ab899]::panicking::panic_handler::{closure#0}<unknown>
  2328. 38.35 s > at <unknown source file>:<unknown line>
  2329. 38.35 s > 5: std[bcb96dfbba0ab899]::sys::backtrace::__rust_end_short_backtrace::<std[bcb96dfbba0ab899]::panicking::panic_handler::{closure#0}, !><unknown>
  2330. 38.35 s > at <unknown source file>:<unknown line>
  2331. 38.35 s > 6: __rustc[6c289b9f9c454d21]::rust_begin_unwind<unknown>
  2332. 38.35 s > at <unknown source file>:<unknown line>
  2333. 38.35 s > 7: core[940e698046960fd5]::panicking::panic_fmt<unknown>
  2334. 38.35 s > at <unknown source file>:<unknown line>
  2335. 38.35 s > 8: core[940e698046960fd5]::panicking::assert_failed_inner<unknown>
  2336. 38.35 s > at <unknown source file>:<unknown line>
  2337. 38.35 s > 9: core[940e698046960fd5]::panicking::assert_failed::<usize, usize><unknown>
  2338. 38.35 s > at <unknown source file>:<unknown line>
  2339. 38.35 s > 10: gammalooprs[972dff90865981f6]::uv::tests::scalars_profile_new<unknown>
  2340. 38.35 s > at <unknown source file>:<unknown line>
  2341. 38.35 s > 11: <gammalooprs[972dff90865981f6]::uv::tests::scalars_profile_new::{closure#0} as core[940e698046960fd5]::ops::function::FnOnce<()>>::call_once<unknown>
  2342. 38.35 s > at <unknown source file>:<unknown line>
  2343. 38.35 s > 12: test[75d6903177b1d7e9]::__rust_begin_short_backtrace::<core[940e698046960fd5]::result::Result<(), alloc[2ea6bcb46fca0c42]::string::String>, fn() -> core[940e698046960fd5]::result::Result<(), alloc[2ea6bcb46fca0c42]::string::String>><unknown>
  2344. 38.35 s > at <unknown source file>:<unknown line>
  2345. 38.35 s > 13: test[75d6903177b1d7e9]::run_test::{closure#0}<unknown>
  2346. 38.35 s > at <unknown source file>:<unknown line>
  2347. 38.35 s > 14: std[bcb96dfbba0ab899]::sys::backtrace::__rust_begin_short_backtrace::<test[75d6903177b1d7e9]::run_test::{closure#1}, ()><unknown>
  2348. 38.35 s > at <unknown source file>:<unknown line>
  2349. 38.35 s > ... omitted 11 more lines; see full nextest output above
  2350. 38.35 s >
  2351. 38.35 s > 5. gammalooprs::uv::tests::scalars_profile
  2352. 38.35 s > failure: test failure with exit code 101
  2353. 38.35 s > system-out
  2354. 38.35 s > running 1 test
  2355. 38.35 s > test uv::tests::scalars_profile ... FAILED
  2356. 38.35 s >
  2357. 38.35 s > failures:
  2358. 38.35 s >
  2359. 38.35 s > failures:
  2360. 38.35 s > uv::tests::scalars_profile
  2361. 38.35 s >
  2362. 38.35 s > test result: FAILED. 0 passed; 1 failed; 0 ignored; 0 measured; 611 filtered out; finished in 10.32s
  2363. 38.35 s > system-err
  2364. 38.35 s > [18:18:39.434] @gammalooprs::settings::runtime WARNING : No external kinematics were provided; using default-generated external momenta and helicities.
  2365. 38.35 s > field value
  2366. 38.35 s > span build_integrand{amplitude.name=bub}
  2367. 38.35 s > at crates/gammalooprs/src/settings/runtime.rs:131
  2368. 38.35 s > [18:18:39.435] @gammalooprs::integrands::process::amplitude INFO : Input is below threshold: 0 existing threshold E-surfaces across 0/3 graph groups
  2369. 38.35 s > field value
  2370. 38.35 s > existing_esurfaces 0
  2371. 38.35 s > group_count 3
  2372. 38.35 s > groups_above_threshold 0
  2373. 38.35 s > integrand bub
  2374. 38.35 s > span warm_up{integrand.name=bub}
  2375. 38.35 s > threshold_status below threshold
  2376. 38.35 s > at crates/gammalooprs/src/integrands/process/amplitude/mod.rs:1666
  2377. 38.35 s > [18:18:39.435] @gammalooprs::integrands::process::amplitude INFO : overlap structure of group 0: [0: []]
  2378. 38.35 s > field value
  2379. 38.35 s > span warm_up{integrand.name=bub}
  2380. 38.35 s > at crates/gammalooprs/src/integrands/process/amplitude/mod.rs:2015
  2381. 38.35 s > [18:18:39.435] @gammalooprs::integrands::process::amplitude INFO : overlap structure of group 1: [0: []]
  2382. 38.35 s > field value
  2383. 38.35 s > span warm_up{integrand.name=bub}
  2384. 38.35 s > at crates/gammalooprs/src/integrands/process/amplitude/mod.rs:2015
  2385. 38.35 s > [18:18:39.435] @gammalooprs::integrands::process::amplitude INFO : overlap structure of group 2: [0: []]
  2386. 38.35 s > field value
  2387. 38.35 s > span warm_up{integrand.name=bub}
  2388. 38.35 s > at crates/gammalooprs/src/integrands/process/amplitude/mod.rs:2015
  2389. 38.35 s > The application panicked (crashed).
  2390. 38.35 s > Message: assertion `left == right` failed: subtracted scalar UV profile failed:
  2391. 38.35 s > UVProfilePassFail {
  2392. 38.35 s > max_dod: -0.9,
  2393. 38.35 s > total: 16,
  2394. 38.35 s > failed: 1,
  2395. 38.35 s > failures: [
  2396. 38.35 s > UVProfileFailure {
  2397. 38.35 s > graph_index: 0,
  2398. 38.35 s > graph_name: "banana",
  2399. 38.35 s > cutkosky_cut: None,
  2400. 38.35 s > lmb_index: 1,
  2401. 38.35 s > fixed: [
  2402. 38.35 s > EdgeIndex(
  2403. 38.35 s > 2,
  2404. 38.35 s > ),
  2405. 38.35 s > EdgeIndex(
  2406. 38.35 s > 0,
  2407. 38.35 s > ),
  2408. 38.35 s > ],
  2409. 38.35 s > free: [
  2410. 38.35 s > EdgeIndex(
  2411. 38.35 s > 3,
  2412. 38.35 s > ),
  2413. 38.35 s > ],
  2414. 38.35 s > orientation_label: None,
  2415. 38.35 s > reason: "dod_exceeds_threshold",
  2416. 38.35 s > },
  2417. 38.35 s > ],
  2418. 38.35 s > }
  2419. 38.35 s >
  2420. 38.35 s > ╭─────────┬────────────┬───────────┬───────┬─────┬──────────┬───────────╮
  2421. 38.35 s > │ fixed │ → ∞ │ slope │ r2 │ DOD │ bare DOD │ inspect │
  2422. 38.35 s > ├─────────┼────────────┼───────────┼───────┼─────┼──────────┼───────────┤
  2423. 38.35 s > │ {e1,e2} │ {e3} │ -0.996752 │ 1.000 │ -1 │ 0 │ arb retry │
  2424. 38.35 s > │ {e1,e3} │ {e2} │ -1.065665 │ 0.997 │ -1 │ 0 │ arb retry │
  2425. 38.35 s > │ {e1} │ {e2,e3} │ -0.937151 │ 0.943 │ -1 │ 2 │ │
  2426. 38.35 s > │ {e2,e3} │ {e1} │ -1.001075 │ 1.000 │ -1 │ 0 │ arb retry │
  2427. 38.35 s > │ {e2} │ {e1,e3} │ -0.984146 │ 0.998 │ -1 │ 2 │ │
  2428. 38.35 s > │ {e3} │ {e1,e2} │ -1.383911 │ 0.982 │ -1 │ 2 │ arb retry │
  2429. 38.35 s > │ {} │ {e1,e2,e3} │ -1.094213 │ 0.258 │ -1 │ 4 │ │
  2430. 38.35 s > │ {e2,e0} │ {e3} │ -0.803348 │ 0.861 │ -1 │ 0 │ arb retry │
  2431. 38.35 s > │ {e3,e0} │ {e2} │ -0.999257 │ 1.000 │ -1 │ 0 │ │
  2432. 38.35 s > │ {e0} │ {e2,e3} │ -1.000893 │ 1.000 │ -1 │ 2 │ │
  2433. 38.35 s > │ {e1,e0} │ {e3} │ -0.997860 │ 1.000 │ -1 │ 0 │ │
  2434. 38.35 s > ╰─────────┴────────────┴───────────┴───────┴─────┴──────────┴───────────╯
  2435. 38.35 s >
  2436. 38.35 s > ╭───────┬─────────┬───────────┬───────┬─────┬──────────┬───────────╮
  2437. 38.35 s > │ fixed │ → ∞ │ slope │ r2 │ DOD │ bare DOD │ inspect │
  2438. 38.35 s > ├───────┼─────────┼───────────┼───────┼─────┼──────────┼───────────┤
  2439. 38.35 s > │ {e1} │ {e2} │ -1.005039 │ 1.000 │ -1 │ 0 │ arb retry │
  2440. 38.35 s > │ {e2} │ {e1} │ -1.001098 │ 1.000 │ -1 │ 0 │ arb retry │
  2441. 38.35 s > │ {} │ {e1,e2} │ -1.011289 │ 1.000 │ -1 │ 2 │ │
  2442. 38.35 s > │ {e0} │ {e2} │ -0.998140 │ 1.000 │ -1 │ 0 │ │
  2443. 38.35 s > ╰───────┴─────────┴───────────┴───────┴─────┴──────────┴───────────╯
  2444. 38.35 s >
  2445. 38.35 s > ╭───────┬──────┬───────────┬───────┬─────┬──────────┬─────────╮
  2446. 38.35 s > │ fixed │ → ∞ │ slope │ r2 │ DOD │ bare DOD │ inspect │
  2447. 38.35 s > ├───────┼──────┼───────────┼───────┼─────┼──────────┼─────────┤
  2448. 38.35 s > │ {} │ {e1} │ -0.989949 │ 1.000 │ -1 │ 0 │ │
  2449. 38.35 s > ╰───────┴──────┴───────────┴───────┴─────┴──────────┴─────────╯
  2450. 38.35 s > left: 1
  2451. 38.35 s > right: 0
  2452. 38.35 s > Location: crates/gammalooprs/src/uv/tests.rs:259
  2453. 38.35 s >
  2454. 38.35 s > ━━━━━━━━━━━━━━━━━━━━━━━━━━━━━━━━━━ BACKTRACE ━━━━━━━━━━━━━━━━━━━━━━━━━━━━━━━━━━━
  2455. 38.35 s > 1: <color_eyre[51793ea62743adbd]::config::PanicHook>::panic_report<unknown>
  2456. 38.35 s > at <unknown source file>:<unknown line>
  2457. 38.35 s > 2: <color_eyre[51793ea62743adbd]::config::PanicHook>::into_panic_hook::{closure#0}<unknown>
  2458. 38.35 s > at <unknown source file>:<unknown line>
  2459. 38.35 s > 3: std[bcb96dfbba0ab899]::panicking::panic_with_hook<unknown>
  2460. 38.35 s > at <unknown source file>:<unknown line>
  2461. 38.35 s > 4: std[bcb96dfbba0ab899]::panicking::panic_handler::{closure#0}<unknown>
  2462. 38.35 s > at <unknown source file>:<unknown line>
  2463. 38.35 s > 5: std[bcb96dfbba0ab899]::sys::backtrace::__rust_end_short_backtrace::<std[bcb96dfbba0ab899]::panicking::panic_handler::{closure#0}, !><unknown>
  2464. 38.35 s > at <unknown source file>:<unknown line>
  2465. 38.35 s > 6: __rustc[6c289b9f9c454d21]::rust_begin_unwind<unknown>
  2466. 38.35 s > at <unknown source file>:<unknown line>
  2467. 38.35 s > 7: core[940e698046960fd5]::panicking::panic_fmt<unknown>
  2468. 38.35 s > at <unknown source file>:<unknown line>
  2469. 38.35 s > 8: core[940e698046960fd5]::panicking::assert_failed_inner<unknown>
  2470. 38.35 s > at <unknown source file>:<unknown line>
  2471. 38.35 s > 9: core[940e698046960fd5]::panicking::assert_failed::<usize, usize><unknown>
  2472. 38.35 s > at <unknown source file>:<unknown line>
  2473. 38.35 s > 10: gammalooprs[972dff90865981f6]::uv::tests::scalars_profile<unknown>
  2474. 38.35 s > at <unknown source file>:<unknown line>
  2475. 38.35 s > 11: <gammalooprs[972dff90865981f6]::uv::tests::scalars_profile::{closure#0} as core[940e698046960fd5]::ops::function::FnOnce<()>>::call_once<unknown>
  2476. 38.35 s > at <unknown source file>:<unknown line>
  2477. 38.35 s > 12: test[75d6903177b1d7e9]::__rust_begin_short_backtrace::<core[940e698046960fd5]::result::Result<(), alloc[2ea6bcb46fca0c42]::string::String>, fn() -> core[940e698046960fd5]::result::Result<(), alloc[2ea6bcb46fca0c42]::string::String>><unknown>
  2478. 38.35 s > at <unknown source file>:<unknown line>
  2479. 38.35 s > 13: test[75d6903177b1d7e9]::run_test::{closure#0}<unknown>
  2480. 38.35 s > at <unknown source file>:<unknown line>
  2481. 38.35 s > 14: std[bcb96dfbba0ab899]::sys::backtrace::__rust_begin_short_backtrace::<test[75d6903177b1d7e9]::run_test::{closure#1}, ()><unknown>
  2482. 38.35 s > at <unknown source file>:<unknown line>
  2483. 38.35 s > ... omitted 11 more lines; see full nextest output above
  2484. 38.35 s > =========================================
  2485. 38.35 s > Extracting 1 binary, 1 build script output directory, and 1 linked path to /build/nextest-archive-5ht6Sg
  2486. 38.35 s > Extracted 7 files to /build/nextest-archive-5ht6Sg in 0.07s
  2487. 38.35 s > ------------
  2488. 38.35 s > Nextest run ID 149eb2b5-8c00-4cf9-80d5-707c96f72c12 with nextest profile: ci_gammaloop
  2489. 38.35 s > Starting 54 tests across 1 binary
  2490. 38.35 s > ------------
  2491. 38.35 s > Summary [ 0.317s] 54 tests run: 54 passed, 0 skipped
  2492. 38.35 s >
  2493. 38.35 s > ========== nextest test summary ==========
  2494. 38.35 s > report: target/nextest/ci_gammaloop/junit.xml
  2495. 38.35 s > tests: 54, failures: 0, errors: 0
  2496. 38.35 s > No failing testcases found.
  2497. 38.35 s > =========================================
  2498. 38.35 s For full logs, run:
  2499. 38.35 s nix log /nix/store/xmqryc6f4382yn38pvqdg8lk2i1rvwkl-gammaloop-nextest-core.drv
  2500. 38.47 s Run failed.