build packages.x86_64-linux.crate-test-binaries-three-dimensional-reps
0.00 s
$ /nix/store/9ypz3flqsrl5xl495mm8h645gadjsxi1-coreutils-9.11/bin/timeout --kill-after=15s 7200s /nix/store/23zk8sgzamrbmj1fday15szf7f2279s8-nix-2.34.7/bin/nix --extra-experimental-features nix-command --extra-experimental-features flakes --log-format internal-json build --no-link --print-out-paths git+https://github.com/alphal00p/gammaloop?ref=raised_energy_cff_wip&rev=89a52f17698621bf30dda0fb3d143a0fe6be4ba6&shallow=1#packages.x86_64-linux.crate-test-binaries-three-dimensional-reps --print-build-logs
1.07 s
error (ignored): SQLite database '/var/cache/nix-ci-worker/eval-cache-v6/febf65cebb124b41fa341daa40dd6a01e21e6de99ae6a887cbbc318825bc2de8.sqlite ' is busy
4.25 s
5.91 s
Building /nix/store/a7vgascj2khj5w2bmd7mjjn1614pfyfz-gammaloop-crate-test-binaries-three-dimensional-reps-50150770f831b638-deps-0.1.0.drv
6.13 s
[gammaloop-crate-test-binaries-three-dimensional-reps-50150770f831b638-deps] Phase: unpackPhase
6.14 s
[gammaloop-crate-test-binaries-three-dimensional-reps-50150770f831b638-deps] unpacking source archive /nix/store/78hj0zga692a2q922cw28xhn5c6pic94-source
6.33 s
[gammaloop-crate-test-binaries-three-dimensional-reps-50150770f831b638-deps] source root is source
6.36 s
[gammaloop-crate-test-binaries-three-dimensional-reps-50150770f831b638-deps] Phase: patchPhase
6.84 s
[gammaloop-crate-test-binaries-three-dimensional-reps-50150770f831b638-deps] Executing configureCargoCommonVars
6.85 s
[gammaloop-crate-test-binaries-three-dimensional-reps-50150770f831b638-deps] copying cargo artifacts from /nix/store/fgh2l3z56pmcypaz8sm5lgiicyijyiz4-gammaloop-crate-test-binaries-three-dimensional-reps-50150770f831b638-inputs/target to target
6.85 s
[gammaloop-crate-test-binaries-three-dimensional-reps-50150770f831b638-deps] will deep copy artifacts (instead of symlinking) as requested
17.00 s
[gammaloop-crate-test-binaries-three-dimensional-reps-50150770f831b638-deps] Phase: updateAutotoolsGnuConfigScriptsPhase
17.07 s
[gammaloop-crate-test-binaries-three-dimensional-reps-50150770f831b638-deps] Phase: configurePhase
17.07 s
[gammaloop-crate-test-binaries-three-dimensional-reps-50150770f831b638-deps] will append /build/source/.cargo-home/config.toml with contents of /nix/store/1sigmg52bb61pfngmk9k8wq5fz9r7bf1-vendor-cargo-deps/config.toml
17.08 s
[gammaloop-crate-test-binaries-three-dimensional-reps-50150770f831b638-deps] default configurePhase, nothing to do
17.09 s
[gammaloop-crate-test-binaries-three-dimensional-reps-50150770f831b638-deps] Phase: buildPhase
17.10 s
[gammaloop-crate-test-binaries-three-dimensional-reps-50150770f831b638-deps] +++ command cargo --version
17.11 s
[gammaloop-crate-test-binaries-three-dimensional-reps-50150770f831b638-deps] cargo 1.97.0 (c980f4866 2026-06-30)
17.12 s
[gammaloop-crate-test-binaries-three-dimensional-reps-50150770f831b638-deps] +++ command cargo test --profile ci-optim --no-run --offline -p three-dimensional-reps --features three-dimensional-reps/serde
17.81 s
[gammaloop-crate-test-binaries-three-dimensional-reps-50150770f831b638-deps] Compiling three-dimensional-reps v0.1.0 (/build/source/crates/three-dimensional-reps)
18.19 s
[gammaloop-crate-test-binaries-three-dimensional-reps-50150770f831b638-deps] error[E0433] : cannot find `eval` in `crate`
18.19 s
[gammaloop-crate-test-binaries-three-dimensional-reps-50150770f831b638-deps] --> crates/three-dimensional-reps/src/generation.rs:7255:28
18.19 s
[gammaloop-crate-test-binaries-three-dimensional-reps-50150770f831b638-deps] |
18.19 s
[gammaloop-crate-test-binaries-three-dimensional-reps-50150770f831b638-deps] 7255 | let input = crate::eval::EvaluationInput {
18.19 s
[gammaloop-crate-test-binaries-three-dimensional-reps-50150770f831b638-deps] | ^^^^ could not find `eval` in the crate root
18.19 s
[gammaloop-crate-test-binaries-three-dimensional-reps-50150770f831b638-deps] |
18.19 s
[gammaloop-crate-test-binaries-three-dimensional-reps-50150770f831b638-deps] note : found an item that was configured out
18.19 s
[gammaloop-crate-test-binaries-three-dimensional-reps-50150770f831b638-deps] --> crates/three-dimensional-reps/src/lib.rs:7:9
18.19 s
[gammaloop-crate-test-binaries-three-dimensional-reps-50150770f831b638-deps] |
18.19 s
[gammaloop-crate-test-binaries-three-dimensional-reps-50150770f831b638-deps] 6 | #[cfg(feature = "eval")]
18.19 s
[gammaloop-crate-test-binaries-three-dimensional-reps-50150770f831b638-deps] | ---------------- the item is gated behind the `eval` feature
18.19 s
[gammaloop-crate-test-binaries-three-dimensional-reps-50150770f831b638-deps] 7 | pub mod eval;
18.19 s
[gammaloop-crate-test-binaries-three-dimensional-reps-50150770f831b638-deps] | ^^^^
18.19 s
[gammaloop-crate-test-binaries-three-dimensional-reps-50150770f831b638-deps]
18.20 s
[gammaloop-crate-test-binaries-three-dimensional-reps-50150770f831b638-deps] error[E0433] : cannot find `eval` in `crate`
18.20 s
[gammaloop-crate-test-binaries-three-dimensional-reps-50150770f831b638-deps] --> crates/three-dimensional-reps/src/generation.rs:7262:30
18.20 s
[gammaloop-crate-test-binaries-three-dimensional-reps-50150770f831b638-deps] |
18.20 s
[gammaloop-crate-test-binaries-three-dimensional-reps-50150770f831b638-deps] 7262 | let contact = crate::eval::evaluate_expression(
18.20 s
[gammaloop-crate-test-binaries-three-dimensional-reps-50150770f831b638-deps] | ^^^^ could not find `eval` in the crate root
18.20 s
[gammaloop-crate-test-binaries-three-dimensional-reps-50150770f831b638-deps] |
18.20 s
[gammaloop-crate-test-binaries-three-dimensional-reps-50150770f831b638-deps] note : found an item that was configured out
18.20 s
[gammaloop-crate-test-binaries-three-dimensional-reps-50150770f831b638-deps] --> crates/three-dimensional-reps/src/lib.rs:7:9
18.20 s
[gammaloop-crate-test-binaries-three-dimensional-reps-50150770f831b638-deps] |
18.20 s
[gammaloop-crate-test-binaries-three-dimensional-reps-50150770f831b638-deps] 6 | #[cfg(feature = "eval")]
18.20 s
[gammaloop-crate-test-binaries-three-dimensional-reps-50150770f831b638-deps] | ---------------- the item is gated behind the `eval` feature
18.20 s
[gammaloop-crate-test-binaries-three-dimensional-reps-50150770f831b638-deps] 7 | pub mod eval;
18.20 s
[gammaloop-crate-test-binaries-three-dimensional-reps-50150770f831b638-deps] | ^^^^
18.20 s
[gammaloop-crate-test-binaries-three-dimensional-reps-50150770f831b638-deps]
18.22 s
[gammaloop-crate-test-binaries-three-dimensional-reps-50150770f831b638-deps] error[E0433] : cannot find `eval` in `crate`
18.22 s
[gammaloop-crate-test-binaries-three-dimensional-reps-50150770f831b638-deps] --> crates/three-dimensional-reps/src/generation.rs:7270:32
18.22 s
[gammaloop-crate-test-binaries-three-dimensional-reps-50150770f831b638-deps] |
18.22 s
[gammaloop-crate-test-binaries-three-dimensional-reps-50150770f831b638-deps] 7270 | let remainder = crate::eval::evaluate_expression(
18.22 s
[gammaloop-crate-test-binaries-three-dimensional-reps-50150770f831b638-deps] | ^^^^ could not find `eval` in the crate root
18.22 s
[gammaloop-crate-test-binaries-three-dimensional-reps-50150770f831b638-deps] |
18.22 s
[gammaloop-crate-test-binaries-three-dimensional-reps-50150770f831b638-deps] note : found an item that was configured out
18.22 s
[gammaloop-crate-test-binaries-three-dimensional-reps-50150770f831b638-deps] --> crates/three-dimensional-reps/src/lib.rs:7:9
18.22 s
[gammaloop-crate-test-binaries-three-dimensional-reps-50150770f831b638-deps] |
18.22 s
[gammaloop-crate-test-binaries-three-dimensional-reps-50150770f831b638-deps] 6 | #[cfg(feature = "eval")]
18.22 s
[gammaloop-crate-test-binaries-three-dimensional-reps-50150770f831b638-deps] | ---------------- the item is gated behind the `eval` feature
18.22 s
[gammaloop-crate-test-binaries-three-dimensional-reps-50150770f831b638-deps] 7 | pub mod eval;
18.22 s
[gammaloop-crate-test-binaries-three-dimensional-reps-50150770f831b638-deps] | ^^^^
18.22 s
[gammaloop-crate-test-binaries-three-dimensional-reps-50150770f831b638-deps]
18.23 s
[gammaloop-crate-test-binaries-three-dimensional-reps-50150770f831b638-deps] error[E0433] : cannot find `eval` in `crate`
18.23 s
[gammaloop-crate-test-binaries-three-dimensional-reps-50150770f831b638-deps] --> crates/three-dimensional-reps/src/generation.rs:7278:28
18.23 s
[gammaloop-crate-test-binaries-three-dimensional-reps-50150770f831b638-deps] |
18.23 s
[gammaloop-crate-test-binaries-three-dimensional-reps-50150770f831b638-deps] 7278 | let total = crate::eval::evaluate_expression(&powered, &expression, numerator, &input)
18.23 s
[gammaloop-crate-test-binaries-three-dimensional-reps-50150770f831b638-deps] | ^^^^ could not find `eval` in the crate root
18.23 s
[gammaloop-crate-test-binaries-three-dimensional-reps-50150770f831b638-deps] |
18.23 s
[gammaloop-crate-test-binaries-three-dimensional-reps-50150770f831b638-deps] note : found an item that was configured out
18.23 s
[gammaloop-crate-test-binaries-three-dimensional-reps-50150770f831b638-deps] --> crates/three-dimensional-reps/src/lib.rs:7:9
18.23 s
[gammaloop-crate-test-binaries-three-dimensional-reps-50150770f831b638-deps] |
18.23 s
[gammaloop-crate-test-binaries-three-dimensional-reps-50150770f831b638-deps] 6 | #[cfg(feature = "eval")]
18.23 s
[gammaloop-crate-test-binaries-three-dimensional-reps-50150770f831b638-deps] | ---------------- the item is gated behind the `eval` feature
18.23 s
[gammaloop-crate-test-binaries-three-dimensional-reps-50150770f831b638-deps] 7 | pub mod eval;
18.23 s
[gammaloop-crate-test-binaries-three-dimensional-reps-50150770f831b638-deps] | ^^^^
18.23 s
[gammaloop-crate-test-binaries-three-dimensional-reps-50150770f831b638-deps]
22.02 s
[gammaloop-crate-test-binaries-three-dimensional-reps-50150770f831b638-deps] For more information about this error, try `rustc --explain E0433`.
22.06 s
[gammaloop-crate-test-binaries-three-dimensional-reps-50150770f831b638-deps] error : could not compile `three-dimensional-reps` (lib test) due to 4 previous errors
22.56 s
Progress: 0 of 2 built (1 failed)
22.56 s
Failed to build gammaloop-crate-test-binaries-three-dimensional-reps-50150770f831b638-deps after 16.6s
22.57 s
error: Cannot build '/nix/store/a7vgascj2khj5w2bmd7mjjn1614pfyfz-gammaloop-crate-test-binaries-three-dimensional-reps-50150770f831b638-deps-0.1.0.drv '.
22.57 s
Reason: builder failed with exit code 101 .
22.57 s
Output paths:
22.57 s
/nix/store/a34ri5gifn73ay8schaga92mdazmbvv5-gammaloop-crate-test-binaries-three-dimensional-reps-50150770f831b638-deps-0.1.0
22.57 s
Last 74 log lines:
22.57 s
> Running phase: unpackPhase
22.57 s
> unpacking source archive /nix/store/78hj0zga692a2q922cw28xhn5c6pic94-source
22.57 s
> source root is source
22.57 s
> Running phase: patchPhase
22.57 s
> Executing configureCargoCommonVars
22.57 s
> copying cargo artifacts from /nix/store/fgh2l3z56pmcypaz8sm5lgiicyijyiz4-gammaloop-crate-test-binaries-three-dimensional-reps-50150770f831b638-inputs/target to target
22.57 s
> will deep copy artifacts (instead of symlinking) as requested
22.57 s
> Running phase: updateAutotoolsGnuConfigScriptsPhase
22.57 s
> Running phase: configurePhase
22.57 s
> will append /build/source/.cargo-home/config.toml with contents of /nix/store/1sigmg52bb61pfngmk9k8wq5fz9r7bf1-vendor-cargo-deps/config.toml
22.57 s
> default configurePhase, nothing to do
22.57 s
> Running phase: buildPhase
22.57 s
> +++ command cargo --version
22.57 s
> cargo 1.97.0 (c980f4866 2026-06-30)
22.57 s
> +++ command cargo test --profile ci-optim --no-run --offline -p three-dimensional-reps --features three-dimensional-reps/serde
22.57 s
> Compiling three-dimensional-reps v0.1.0 (/build/source/crates/three-dimensional-reps)
22.57 s
> error[E0433] : cannot find `eval` in `crate`
22.57 s
> --> crates/three-dimensional-reps/src/generation.rs:7255:28
22.57 s
> |
22.57 s
> 7255 | let input = crate::eval::EvaluationInput {
22.57 s
> | ^^^^ could not find `eval` in the crate root
22.57 s
> |
22.57 s
> note : found an item that was configured out
22.57 s
> --> crates/three-dimensional-reps/src/lib.rs:7:9
22.57 s
> |
22.57 s
> 6 | #[cfg(feature = "eval")]
22.57 s
> | ---------------- the item is gated behind the `eval` feature
22.57 s
> 7 | pub mod eval;
22.57 s
> | ^^^^
22.57 s
>
22.57 s
> error[E0433] : cannot find `eval` in `crate`
22.57 s
> --> crates/three-dimensional-reps/src/generation.rs:7262:30
22.57 s
> |
22.57 s
> 7262 | let contact = crate::eval::evaluate_expression(
22.57 s
> | ^^^^ could not find `eval` in the crate root
22.57 s
> |
22.57 s
> note : found an item that was configured out
22.57 s
> --> crates/three-dimensional-reps/src/lib.rs:7:9
22.57 s
> |
22.57 s
> 6 | #[cfg(feature = "eval")]
22.57 s
> | ---------------- the item is gated behind the `eval` feature
22.57 s
> 7 | pub mod eval;
22.57 s
> | ^^^^
22.57 s
>
22.57 s
> error[E0433] : cannot find `eval` in `crate`
22.57 s
> --> crates/three-dimensional-reps/src/generation.rs:7270:32
22.57 s
> |
22.57 s
> 7270 | let remainder = crate::eval::evaluate_expression(
22.57 s
> | ^^^^ could not find `eval` in the crate root
22.57 s
> |
22.57 s
> note : found an item that was configured out
22.57 s
> --> crates/three-dimensional-reps/src/lib.rs:7:9
22.57 s
> |
22.57 s
> 6 | #[cfg(feature = "eval")]
22.57 s
> | ---------------- the item is gated behind the `eval` feature
22.57 s
> 7 | pub mod eval;
22.57 s
> | ^^^^
22.57 s
>
22.57 s
> error[E0433] : cannot find `eval` in `crate`
22.57 s
> --> crates/three-dimensional-reps/src/generation.rs:7278:28
22.57 s
> |
22.57 s
> 7278 | let total = crate::eval::evaluate_expression(&powered, &expression, numerator, &input)
22.57 s
> | ^^^^ could not find `eval` in the crate root
22.57 s
> |
22.57 s
> note : found an item that was configured out
22.57 s
> --> crates/three-dimensional-reps/src/lib.rs:7:9
22.57 s
> |
22.57 s
> 6 | #[cfg(feature = "eval")]
22.57 s
> | ---------------- the item is gated behind the `eval` feature
22.57 s
> 7 | pub mod eval;
22.57 s
> | ^^^^
22.57 s
>
22.57 s
> For more information about this error, try `rustc --explain E0433`.
22.57 s
> error : could not compile `three-dimensional-reps` (lib test) due to 4 previous errors
22.57 s
For full logs, run:
22.57 s
nix log /nix/store/a7vgascj2khj5w2bmd7mjjn1614pfyfz-gammaloop-crate-test-binaries-three-dimensional-reps-50150770f831b638-deps-0.1.0.drv
22.57 s
error: Cannot build '/nix/store/61i0g621afx7rsdmqqppj2iydl84cs4j-nix-ci-artifact-barrier-crate-test-binaries-three-dimensional-reps.drv '.
22.57 s
Reason: 1 dependency failed .
22.57 s
Output paths:
22.57 s
/nix/store/czz1z0z8p58nh1k0h2xhdbz9yj37vrvb-nix-ci-artifact-barrier-crate-test-binaries-three-dimensional-reps
22.58 s
Build failed due to failed dependency
22.81 s
Build failed.