build packages.x86_64-linux.crate-test-binaries-three-dimensional-reps

Reproduce this run
Retry Run
  1. 0.01 s $ /nix/store/9ypz3flqsrl5xl495mm8h645gadjsxi1-coreutils-9.11/bin/timeout --kill-after=15s 7200s /nix/store/23zk8sgzamrbmj1fday15szf7f2279s8-nix-2.34.7/bin/nix --extra-experimental-features nix-command --extra-experimental-features flakes --log-format internal-json build --no-link --print-out-paths git+https://github.com/alphal00p/gammaloop?ref=raised_energy_cff_wip&rev=89a52f17698621bf30dda0fb3d143a0fe6be4ba6&shallow=1#packages.x86_64-linux.crate-test-binaries-three-dimensional-reps --print-build-logs
  2. 0.49 s error (ignored): SQLite database '/var/cache/nix-ci-worker/eval-cache-v6/febf65cebb124b41fa341daa40dd6a01e21e6de99ae6a887cbbc318825bc2de8.sqlite' is busy
  3. 4.91 s
  4. 6.07 s Downloading cached gammaloop-ci-test-binary-dependencies-50150770f831b638-Cargo.toml from https://cache.nix-ci.com
  5. 6.09 s Downloading cached gammaloop-workspace-deps-deps from https://cache.nix-ci.com
  6. 6.10 s Downloaded cached gammaloop-ci-test-binary-dependencies-50150770f831b638-Cargo.toml (584 B) in 29ms
  7. 6.21 s Building /nix/store/620cg4lxjsln105525v3nij0sy75ni31-gammaloop-ci-test-binary-dependencies-50150770f831b638-three-dimensional-reps-dev-dependency.toml.drv
  8. 6.29 s Downloading cached gammaloop-crate-gammaloop-workspace-hack-deps from https://cache.nix-ci.com
  9. 6.38 s Building /nix/store/jxvw34bgxdnn9bkva90k3g1kdb1h3z69-gammaloop-ci-test-dependencies-50150770f831b638-Cargo.toml.drv
  10. 6.38 s Progress: 0 of 9 built (2 building), 1 of 7 downloaded from cache (2 downloading)
  11. 6.56 s [gammaloop-ci-test-binary-dependencies-50150770f831b638-three-dimensional-reps-dev-dependency.toml:post-build] Uploading to the NixCI cache: /nix/store/nkd9p6h639pp1ya2nb2yngjw7qb80nfg-gammaloop-ci-test-binary-dependencies-50150770f831b638-three-dimensional-reps-dev-dependency.toml
  12. 7.22 s [gammaloop-ci-test-binary-dependencies-50150770f831b638-three-dimensional-reps-dev-dependency.toml:post-build] warning: 'warn-short-path-literals' is deprecated, use 'lint-short-path-literals = ignore' instead
  13. 7.36 s [gammaloop-ci-test-binary-dependencies-50150770f831b638-three-dimensional-reps-dev-dependency.toml:post-build] copying 0 paths...
  14. 8.11 s [gammaloop-ci-test-binary-dependencies-50150770f831b638-three-dimensional-reps-dev-dependency.toml:post-build] warning: 'warn-short-path-literals' is deprecated, use 'lint-short-path-literals = ignore' instead
  15. 8.36 s [gammaloop-ci-test-binary-dependencies-50150770f831b638-three-dimensional-reps-dev-dependency.toml:post-build] copying 0 paths...
  16. 8.61 s Uploaded gammaloop-ci-test-binary-dependencies-50150770f831b638-three-dimensional-reps-dev-dependency.toml in 2.1s
  17. 8.61 s Progress: 1 of 9 built (1 building), 1 of 7 downloaded from cache (2 downloading)
  18. 8.61 s Built gammaloop-ci-test-binary-dependencies-50150770f831b638-three-dimensional-reps-dev-dependency.toml in 2.3s
  19. 8.71 s [gammaloop-ci-test-dependencies-50150770f831b638-Cargo.toml:post-build] Uploading to the NixCI cache: /nix/store/l910djsa81d33bspw74vkisyvzi8c7k4-gammaloop-ci-test-dependencies-50150770f831b638-Cargo.toml
  20. 9.20 s [gammaloop-ci-test-dependencies-50150770f831b638-Cargo.toml:post-build] warning: 'warn-short-path-literals' is deprecated, use 'lint-short-path-literals = ignore' instead
  21. 9.35 s [gammaloop-ci-test-dependencies-50150770f831b638-Cargo.toml:post-build] copying 0 paths...
  22. 10.24 s [gammaloop-ci-test-dependencies-50150770f831b638-Cargo.toml:post-build] warning: 'warn-short-path-literals' is deprecated, use 'lint-short-path-literals = ignore' instead
  23. 10.45 s [gammaloop-ci-test-dependencies-50150770f831b638-Cargo.toml:post-build] copying 0 paths...
  24. 10.66 s Uploaded gammaloop-ci-test-dependencies-50150770f831b638-Cargo.toml in 2.0s
  25. 10.66 s Progress: 2 of 9 built, 1 of 7 downloaded from cache (2 downloading)
  26. 10.66 s Built gammaloop-ci-test-dependencies-50150770f831b638-Cargo.toml in 4.2s
  27. 11.54 s Downloaded cached gammaloop-workspace-deps-deps (306 MiB) in 5.4s
  28. 11.54 s Progress: 2 of 8 built, 2 of 7 downloaded from cache (1 downloading)
  29. 465.17 s Downloaded cached gammaloop-crate-gammaloop-workspace-hack-deps (186.1 MiB) in 7m38s
  30. 465.17 s Progress: 2 of 7 built, 3 of 7 downloaded from cache
  31. 465.17 s Downloading cached gammaloop-crate-gammaloop-workspace-hack-build from https://cache.nix-ci.com
  32. 465.17 s Downloaded cached gammaloop-crate-gammaloop-workspace-hack-build in 0ms
  33. 465.17 s Progress: 2 of 7 built, 4 of 7 downloaded from cache
  34. 465.17 s Downloading cached gammaloop-crate-test-dependencies-78814cb8a1862b52-inputs from https://cache.nix-ci.com
  35. 475.82 s Downloaded cached gammaloop-crate-test-dependencies-78814cb8a1862b52-inputs (1.1 GiB) in 10.6s
  36. 475.82 s Progress: 2 of 7 built, 5 of 7 downloaded from cache
  37. 475.83 s Downloading cached gammaloop-crate-test-dependencies-78814cb8a1862b52-deps from https://cache.nix-ci.com
  38. 485.02 s Downloaded cached gammaloop-crate-test-dependencies-78814cb8a1862b52-deps (60.8 MiB) in 9.1s
  39. 485.02 s Progress: 2 of 7 built, 6 of 7 downloaded from cache
  40. 485.03 s Downloading cached gammaloop-crate-test-dependencies-50150770f831b638-inputs from https://cache.nix-ci.com
  41. 499.29 s Downloaded cached gammaloop-crate-test-dependencies-50150770f831b638-inputs (1.4 GiB) in 14.2s
  42. 499.30 s Progress: 2 of 7 built, 7 of 7 downloaded from cache
  43. 500.20 s Building /nix/store/a54825mqvzdgw9fdbwal3gwwsy7s5q0h-gammaloop-crate-test-dependencies-50150770f831b638-deps-0.1.0.drv
  44. 500.38 s [gammaloop-crate-test-dependencies-50150770f831b638-deps] Phase: unpackPhase
  45. 500.39 s [gammaloop-crate-test-dependencies-50150770f831b638-deps] unpacking source archive /nix/store/78hj0zga692a2q922cw28xhn5c6pic94-source
  46. 500.68 s [gammaloop-crate-test-dependencies-50150770f831b638-deps] source root is source
  47. 500.72 s [gammaloop-crate-test-dependencies-50150770f831b638-deps] Phase: patchPhase
  48. 501.16 s [gammaloop-crate-test-dependencies-50150770f831b638-deps] Executing configureCargoCommonVars
  49. 501.17 s [gammaloop-crate-test-dependencies-50150770f831b638-deps] copying cargo artifacts from /nix/store/5gj697jm6yvaw1hf5bgq663azg3kafrr-gammaloop-crate-test-dependencies-50150770f831b638-inputs/target to target
  50. 501.17 s [gammaloop-crate-test-dependencies-50150770f831b638-deps] will deep copy artifacts (instead of symlinking) as requested
  51. 502.97 s [gammaloop-crate-test-dependencies-50150770f831b638-deps] Phase: updateAutotoolsGnuConfigScriptsPhase
  52. 503.26 s [gammaloop-crate-test-dependencies-50150770f831b638-deps] Phase: configurePhase
  53. 503.27 s [gammaloop-crate-test-dependencies-50150770f831b638-deps] will append /build/source/.cargo-home/config.toml with contents of /nix/store/1sigmg52bb61pfngmk9k8wq5fz9r7bf1-vendor-cargo-deps/config.toml
  54. 503.28 s [gammaloop-crate-test-dependencies-50150770f831b638-deps] default configurePhase, nothing to do
  55. 503.29 s [gammaloop-crate-test-dependencies-50150770f831b638-deps] Phase: buildPhase
  56. 503.31 s [gammaloop-crate-test-dependencies-50150770f831b638-deps] +++ command cargo --version
  57. 503.31 s [gammaloop-crate-test-dependencies-50150770f831b638-deps] cargo 1.97.0 (c980f4866 2026-06-30)
  58. 503.32 s [gammaloop-crate-test-dependencies-50150770f831b638-deps] +++ command cargo build --profile ci-optim --offline -p gammaloop-ci-test-dependencies-50150770f831b638 -p gammaloop-workspace-hack --features linnet/bincode,linnet/drawing,linnet/serde,linnet/symbolica,symbolica/tracing_max_level_info,three-dimensional-reps/serde --lib
  59. 504.43 s [gammaloop-crate-test-dependencies-50150770f831b638-deps] Compiling three-dimensional-reps v0.1.0 (/build/source/crates/three-dimensional-reps)
  60. 504.43 s [gammaloop-crate-test-dependencies-50150770f831b638-deps] Compiling linnet v0.17.0 (/build/source/crates/linnet)
  61. 520.90 s [gammaloop-crate-test-dependencies-50150770f831b638-deps] Compiling gammaloop-ci-test-dependencies-50150770f831b638 v0.1.0 (/build/source/crates/gammaloop-ci-test-dependencies-50150770f831b638)
  62. 537.73 s [gammaloop-crate-test-dependencies-50150770f831b638-deps] Finished `ci-optim` profile [optimized] target(s) in 34.39s
  63. 538.05 s [gammaloop-crate-test-dependencies-50150770f831b638-deps] warning: the following packages contain code that will be rejected by a future version of Rust: proc-macro-error2 v2.0.1
  64. 538.05 s [gammaloop-crate-test-dependencies-50150770f831b638-deps] note: to see what the problems were, use the option `--future-incompat-report`, or run `cargo report future-incompatibilities --id 1`
  65. 538.18 s [gammaloop-crate-test-dependencies-50150770f831b638-deps] +++ command cargo build --profile ci-optim --offline -p gammaloop-ci-test-binary-dependencies-50150770f831b638 -p three-dimensional-reps --features linnet/bincode,linnet/drawing,linnet/serde,linnet/symbolica,symbolica/tracing_max_level_info,three-dimensional-reps/serde --lib
  66. 538.67 s [gammaloop-crate-test-dependencies-50150770f831b638-deps] Compiling linnet v0.17.0 (/build/source/crates/linnet)
  67. 548.46 s [gammaloop-crate-test-dependencies-50150770f831b638-deps] Compiling three-dimensional-reps v0.1.0 (/build/source/crates/three-dimensional-reps)
  68. 548.46 s [gammaloop-crate-test-dependencies-50150770f831b638-deps] Compiling gammaloop-ci-test-binary-dependencies-50150770f831b638 v0.1.0 (/build/source/crates/gammaloop-ci-test-binary-dependencies-50150770f831b638)
  69. 573.79 s [gammaloop-crate-test-dependencies-50150770f831b638-deps] Finished `ci-optim` profile [optimized] target(s) in 35.58s
  70. 574.03 s [gammaloop-crate-test-dependencies-50150770f831b638-deps] warning: the following packages contain code that will be rejected by a future version of Rust: proc-macro-error2 v2.0.1
  71. 574.03 s [gammaloop-crate-test-dependencies-50150770f831b638-deps] note: to see what the problems were, use the option `--future-incompat-report`, or run `cargo report future-incompatibilities --id 1`
  72. 574.13 s [gammaloop-crate-test-dependencies-50150770f831b638-deps] buildPhase completed in 1 minutes 10 seconds
  73. 574.13 s [gammaloop-crate-test-dependencies-50150770f831b638-deps] Phase: installPhase
  74. 574.18 s [gammaloop-crate-test-dependencies-50150770f831b638-deps] linking previous artifacts /nix/store/5gj697jm6yvaw1hf5bgq663azg3kafrr-gammaloop-crate-test-dependencies-50150770f831b638-inputs to /nix/store/4mafk3lbdlmjljz2jpqp1d2np9qqc0sj-gammaloop-crate-test-dependencies-50150770f831b638-deps-0.1.0/target.tar.zst
  75. 574.84 s [gammaloop-crate-test-dependencies-50150770f831b638-deps] /*stdin*\ : 30.92% ( 66.3 MiB => 20.5 MiB, /nix/store/4mafk3lbdlmjljz2jpqp1d2np9qqc0sj-gammaloop-crate-test-dependencies-50150770f831b638-deps-0.1.0/target.tar.zst)
  76. 574.89 s [gammaloop-crate-test-dependencies-50150770f831b638-deps] Phase: fixupPhase
  77. 574.94 s [gammaloop-crate-test-dependencies-50150770f831b638-deps] shrinking RPATHs of ELF executables and libraries in /nix/store/4mafk3lbdlmjljz2jpqp1d2np9qqc0sj-gammaloop-crate-test-dependencies-50150770f831b638-deps-0.1.0
  78. 574.95 s [gammaloop-crate-test-dependencies-50150770f831b638-deps] checking for references to /build/ in /nix/store/4mafk3lbdlmjljz2jpqp1d2np9qqc0sj-gammaloop-crate-test-dependencies-50150770f831b638-deps-0.1.0...
  79. 574.97 s [gammaloop-crate-test-dependencies-50150770f831b638-deps] patching script interpreter paths in /nix/store/4mafk3lbdlmjljz2jpqp1d2np9qqc0sj-gammaloop-crate-test-dependencies-50150770f831b638-deps-0.1.0
  80. 575.66 s [gammaloop-crate-test-dependencies-50150770f831b638-deps:post-build] Uploading to the NixCI cache: /nix/store/4mafk3lbdlmjljz2jpqp1d2np9qqc0sj-gammaloop-crate-test-dependencies-50150770f831b638-deps-0.1.0
  81. 576.11 s [gammaloop-crate-test-dependencies-50150770f831b638-deps:post-build] warning: 'warn-short-path-literals' is deprecated, use 'lint-short-path-literals = ignore' instead
  82. 576.28 s [gammaloop-crate-test-dependencies-50150770f831b638-deps:post-build] copying 1 paths...
  83. 576.28 s [gammaloop-crate-test-dependencies-50150770f831b638-deps:post-build] copying path '/nix/store/4mafk3lbdlmjljz2jpqp1d2np9qqc0sj-gammaloop-crate-test-dependencies-50150770f831b638-deps-0.1.0' to 'https://cache.nix-ci.com'...
  84. 593.61 s [gammaloop-crate-test-dependencies-50150770f831b638-deps:post-build] warning: 'warn-short-path-literals' is deprecated, use 'lint-short-path-literals = ignore' instead
  85. 594.14 s [gammaloop-crate-test-dependencies-50150770f831b638-deps:post-build] copying 0 paths...
  86. 594.40 s Uploaded gammaloop-crate-test-dependencies-50150770f831b638-deps in 18.8s
  87. 594.41 s Progress: 3 of 7 built, 7 of 7 downloaded from cache
  88. 594.41 s Built gammaloop-crate-test-dependencies-50150770f831b638-deps in 1m34s
  89. 594.55 s Building /nix/store/s3dds1mnw8gwd3jzgjg7agy3cvrn3ahq-gammaloop-crate-test-binaries-three-dimensional-reps-50150770f831b638-inputs.drv
  90. 604.20 s [gammaloop-crate-test-binaries-three-dimensional-reps-50150770f831b638-inputs:post-build] Uploading to the NixCI cache: /nix/store/fgh2l3z56pmcypaz8sm5lgiicyijyiz4-gammaloop-crate-test-binaries-three-dimensional-reps-50150770f831b638-inputs
  91. 604.76 s [gammaloop-crate-test-binaries-three-dimensional-reps-50150770f831b638-inputs:post-build] warning: 'warn-short-path-literals' is deprecated, use 'lint-short-path-literals = ignore' instead
  92. 604.87 s [gammaloop-crate-test-binaries-three-dimensional-reps-50150770f831b638-inputs:post-build] copying 1 paths...
  93. 604.87 s [gammaloop-crate-test-binaries-three-dimensional-reps-50150770f831b638-inputs:post-build] copying path '/nix/store/fgh2l3z56pmcypaz8sm5lgiicyijyiz4-gammaloop-crate-test-binaries-three-dimensional-reps-50150770f831b638-inputs' to 'https://cache.nix-ci.com'...
  94. 837.46 s [gammaloop-crate-test-binaries-three-dimensional-reps-50150770f831b638-inputs:post-build] warning: 'warn-short-path-literals' is deprecated, use 'lint-short-path-literals = ignore' instead
  95. 838.17 s [gammaloop-crate-test-binaries-three-dimensional-reps-50150770f831b638-inputs:post-build] copying 1 paths...
  96. 838.18 s [gammaloop-crate-test-binaries-three-dimensional-reps-50150770f831b638-inputs:post-build] copying path '/nix/store/s3dds1mnw8gwd3jzgjg7agy3cvrn3ahq-gammaloop-crate-test-binaries-three-dimensional-reps-50150770f831b638-inputs.drv' to 'https://cache.nix-ci.com'...
  97. 839.36 s Uploaded gammaloop-crate-test-binaries-three-dimensional-reps-50150770f831b638-inputs in 3m55s
  98. 839.36 s Progress: 4 of 7 built, 7 of 7 downloaded from cache
  99. 839.36 s Built gammaloop-crate-test-binaries-three-dimensional-reps-50150770f831b638-inputs in 4m04s
  100. 839.60 s Building /nix/store/a7vgascj2khj5w2bmd7mjjn1614pfyfz-gammaloop-crate-test-binaries-three-dimensional-reps-50150770f831b638-deps-0.1.0.drv
  101. 839.86 s [gammaloop-crate-test-binaries-three-dimensional-reps-50150770f831b638-deps] Phase: unpackPhase
  102. 839.89 s [gammaloop-crate-test-binaries-three-dimensional-reps-50150770f831b638-deps] unpacking source archive /nix/store/78hj0zga692a2q922cw28xhn5c6pic94-source
  103. 840.21 s [gammaloop-crate-test-binaries-three-dimensional-reps-50150770f831b638-deps] source root is source
  104. 840.26 s [gammaloop-crate-test-binaries-three-dimensional-reps-50150770f831b638-deps] Phase: patchPhase
  105. 840.77 s [gammaloop-crate-test-binaries-three-dimensional-reps-50150770f831b638-deps] Executing configureCargoCommonVars
  106. 840.78 s [gammaloop-crate-test-binaries-three-dimensional-reps-50150770f831b638-deps] copying cargo artifacts from /nix/store/fgh2l3z56pmcypaz8sm5lgiicyijyiz4-gammaloop-crate-test-binaries-three-dimensional-reps-50150770f831b638-inputs/target to target
  107. 840.78 s [gammaloop-crate-test-binaries-three-dimensional-reps-50150770f831b638-deps] will deep copy artifacts (instead of symlinking) as requested
  108. 854.36 s [gammaloop-crate-test-binaries-three-dimensional-reps-50150770f831b638-deps] Phase: updateAutotoolsGnuConfigScriptsPhase
  109. 854.41 s [gammaloop-crate-test-binaries-three-dimensional-reps-50150770f831b638-deps] Phase: configurePhase
  110. 854.42 s [gammaloop-crate-test-binaries-three-dimensional-reps-50150770f831b638-deps] will append /build/source/.cargo-home/config.toml with contents of /nix/store/1sigmg52bb61pfngmk9k8wq5fz9r7bf1-vendor-cargo-deps/config.toml
  111. 854.43 s [gammaloop-crate-test-binaries-three-dimensional-reps-50150770f831b638-deps] default configurePhase, nothing to do
  112. 854.43 s [gammaloop-crate-test-binaries-three-dimensional-reps-50150770f831b638-deps] Phase: buildPhase
  113. 854.45 s [gammaloop-crate-test-binaries-three-dimensional-reps-50150770f831b638-deps] +++ command cargo --version
  114. 854.45 s [gammaloop-crate-test-binaries-three-dimensional-reps-50150770f831b638-deps] cargo 1.97.0 (c980f4866 2026-06-30)
  115. 854.46 s [gammaloop-crate-test-binaries-three-dimensional-reps-50150770f831b638-deps] +++ command cargo test --profile ci-optim --no-run --offline -p three-dimensional-reps --features three-dimensional-reps/serde
  116. 855.22 s [gammaloop-crate-test-binaries-three-dimensional-reps-50150770f831b638-deps] Compiling three-dimensional-reps v0.1.0 (/build/source/crates/three-dimensional-reps)
  117. 855.67 s [gammaloop-crate-test-binaries-three-dimensional-reps-50150770f831b638-deps] error[E0433]: cannot find `eval` in `crate`
  118. 855.67 s [gammaloop-crate-test-binaries-three-dimensional-reps-50150770f831b638-deps] --> crates/three-dimensional-reps/src/generation.rs:7255:28
  119. 855.67 s [gammaloop-crate-test-binaries-three-dimensional-reps-50150770f831b638-deps] |
  120. 855.67 s [gammaloop-crate-test-binaries-three-dimensional-reps-50150770f831b638-deps] 7255 | let input = crate::eval::EvaluationInput {
  121. 855.67 s [gammaloop-crate-test-binaries-three-dimensional-reps-50150770f831b638-deps] | ^^^^ could not find `eval` in the crate root
  122. 855.67 s [gammaloop-crate-test-binaries-three-dimensional-reps-50150770f831b638-deps] |
  123. 855.67 s [gammaloop-crate-test-binaries-three-dimensional-reps-50150770f831b638-deps] note: found an item that was configured out
  124. 855.67 s [gammaloop-crate-test-binaries-three-dimensional-reps-50150770f831b638-deps] --> crates/three-dimensional-reps/src/lib.rs:7:9
  125. 855.67 s [gammaloop-crate-test-binaries-three-dimensional-reps-50150770f831b638-deps] |
  126. 855.67 s [gammaloop-crate-test-binaries-three-dimensional-reps-50150770f831b638-deps] 6 | #[cfg(feature = "eval")]
  127. 855.67 s [gammaloop-crate-test-binaries-three-dimensional-reps-50150770f831b638-deps] | ---------------- the item is gated behind the `eval` feature
  128. 855.67 s [gammaloop-crate-test-binaries-three-dimensional-reps-50150770f831b638-deps] 7 | pub mod eval;
  129. 855.67 s [gammaloop-crate-test-binaries-three-dimensional-reps-50150770f831b638-deps] | ^^^^
  130. 855.67 s [gammaloop-crate-test-binaries-three-dimensional-reps-50150770f831b638-deps]
  131. 855.69 s [gammaloop-crate-test-binaries-three-dimensional-reps-50150770f831b638-deps] error[E0433]: cannot find `eval` in `crate`
  132. 855.69 s [gammaloop-crate-test-binaries-three-dimensional-reps-50150770f831b638-deps] --> crates/three-dimensional-reps/src/generation.rs:7262:30
  133. 855.69 s [gammaloop-crate-test-binaries-three-dimensional-reps-50150770f831b638-deps] |
  134. 855.69 s [gammaloop-crate-test-binaries-three-dimensional-reps-50150770f831b638-deps] 7262 | let contact = crate::eval::evaluate_expression(
  135. 855.69 s [gammaloop-crate-test-binaries-three-dimensional-reps-50150770f831b638-deps] | ^^^^ could not find `eval` in the crate root
  136. 855.69 s [gammaloop-crate-test-binaries-three-dimensional-reps-50150770f831b638-deps] |
  137. 855.69 s [gammaloop-crate-test-binaries-three-dimensional-reps-50150770f831b638-deps] note: found an item that was configured out
  138. 855.69 s [gammaloop-crate-test-binaries-three-dimensional-reps-50150770f831b638-deps] --> crates/three-dimensional-reps/src/lib.rs:7:9
  139. 855.69 s [gammaloop-crate-test-binaries-three-dimensional-reps-50150770f831b638-deps] |
  140. 855.69 s [gammaloop-crate-test-binaries-three-dimensional-reps-50150770f831b638-deps] 6 | #[cfg(feature = "eval")]
  141. 855.69 s [gammaloop-crate-test-binaries-three-dimensional-reps-50150770f831b638-deps] | ---------------- the item is gated behind the `eval` feature
  142. 855.69 s [gammaloop-crate-test-binaries-three-dimensional-reps-50150770f831b638-deps] 7 | pub mod eval;
  143. 855.69 s [gammaloop-crate-test-binaries-three-dimensional-reps-50150770f831b638-deps] | ^^^^
  144. 855.69 s [gammaloop-crate-test-binaries-three-dimensional-reps-50150770f831b638-deps]
  145. 855.71 s [gammaloop-crate-test-binaries-three-dimensional-reps-50150770f831b638-deps] error[E0433]: cannot find `eval` in `crate`
  146. 855.71 s [gammaloop-crate-test-binaries-three-dimensional-reps-50150770f831b638-deps] --> crates/three-dimensional-reps/src/generation.rs:7270:32
  147. 855.71 s [gammaloop-crate-test-binaries-three-dimensional-reps-50150770f831b638-deps] |
  148. 855.71 s [gammaloop-crate-test-binaries-three-dimensional-reps-50150770f831b638-deps] 7270 | let remainder = crate::eval::evaluate_expression(
  149. 855.71 s [gammaloop-crate-test-binaries-three-dimensional-reps-50150770f831b638-deps] | ^^^^ could not find `eval` in the crate root
  150. 855.71 s [gammaloop-crate-test-binaries-three-dimensional-reps-50150770f831b638-deps] |
  151. 855.71 s [gammaloop-crate-test-binaries-three-dimensional-reps-50150770f831b638-deps] note: found an item that was configured out
  152. 855.71 s [gammaloop-crate-test-binaries-three-dimensional-reps-50150770f831b638-deps] --> crates/three-dimensional-reps/src/lib.rs:7:9
  153. 855.71 s [gammaloop-crate-test-binaries-three-dimensional-reps-50150770f831b638-deps] |
  154. 855.71 s [gammaloop-crate-test-binaries-three-dimensional-reps-50150770f831b638-deps] 6 | #[cfg(feature = "eval")]
  155. 855.71 s [gammaloop-crate-test-binaries-three-dimensional-reps-50150770f831b638-deps] | ---------------- the item is gated behind the `eval` feature
  156. 855.71 s [gammaloop-crate-test-binaries-three-dimensional-reps-50150770f831b638-deps] 7 | pub mod eval;
  157. 855.71 s [gammaloop-crate-test-binaries-three-dimensional-reps-50150770f831b638-deps] | ^^^^
  158. 855.71 s [gammaloop-crate-test-binaries-three-dimensional-reps-50150770f831b638-deps]
  159. 855.72 s [gammaloop-crate-test-binaries-three-dimensional-reps-50150770f831b638-deps] error[E0433]: cannot find `eval` in `crate`
  160. 855.72 s [gammaloop-crate-test-binaries-three-dimensional-reps-50150770f831b638-deps] --> crates/three-dimensional-reps/src/generation.rs:7278:28
  161. 855.72 s [gammaloop-crate-test-binaries-three-dimensional-reps-50150770f831b638-deps] |
  162. 855.72 s [gammaloop-crate-test-binaries-three-dimensional-reps-50150770f831b638-deps] 7278 | let total = crate::eval::evaluate_expression(&powered, &expression, numerator, &input)
  163. 855.72 s [gammaloop-crate-test-binaries-three-dimensional-reps-50150770f831b638-deps] | ^^^^ could not find `eval` in the crate root
  164. 855.72 s [gammaloop-crate-test-binaries-three-dimensional-reps-50150770f831b638-deps] |
  165. 855.72 s [gammaloop-crate-test-binaries-three-dimensional-reps-50150770f831b638-deps] note: found an item that was configured out
  166. 855.72 s [gammaloop-crate-test-binaries-three-dimensional-reps-50150770f831b638-deps] --> crates/three-dimensional-reps/src/lib.rs:7:9
  167. 855.72 s [gammaloop-crate-test-binaries-three-dimensional-reps-50150770f831b638-deps] |
  168. 855.72 s [gammaloop-crate-test-binaries-three-dimensional-reps-50150770f831b638-deps] 6 | #[cfg(feature = "eval")]
  169. 855.72 s [gammaloop-crate-test-binaries-three-dimensional-reps-50150770f831b638-deps] | ---------------- the item is gated behind the `eval` feature
  170. 855.72 s [gammaloop-crate-test-binaries-three-dimensional-reps-50150770f831b638-deps] 7 | pub mod eval;
  171. 855.72 s [gammaloop-crate-test-binaries-three-dimensional-reps-50150770f831b638-deps] | ^^^^
  172. 855.72 s [gammaloop-crate-test-binaries-three-dimensional-reps-50150770f831b638-deps]
  173. 859.22 s [gammaloop-crate-test-binaries-three-dimensional-reps-50150770f831b638-deps] For more information about this error, try `rustc --explain E0433`.
  174. 859.26 s [gammaloop-crate-test-binaries-three-dimensional-reps-50150770f831b638-deps] error: could not compile `three-dimensional-reps` (lib test) due to 4 previous errors
  175. 859.77 s Progress: 4 of 6 built (1 failed), 7 of 7 downloaded from cache
  176. 859.78 s Failed to build gammaloop-crate-test-binaries-three-dimensional-reps-50150770f831b638-deps after 20.1s
  177. 859.78 s error: Cannot build '/nix/store/a7vgascj2khj5w2bmd7mjjn1614pfyfz-gammaloop-crate-test-binaries-three-dimensional-reps-50150770f831b638-deps-0.1.0.drv'.
  178. 859.78 s Reason: builder failed with exit code 101.
  179. 859.78 s Output paths:
  180. 859.78 s /nix/store/a34ri5gifn73ay8schaga92mdazmbvv5-gammaloop-crate-test-binaries-three-dimensional-reps-50150770f831b638-deps-0.1.0
  181. 859.78 s Last 74 log lines:
  182. 859.78 s > Running phase: unpackPhase
  183. 859.78 s > unpacking source archive /nix/store/78hj0zga692a2q922cw28xhn5c6pic94-source
  184. 859.78 s > source root is source
  185. 859.78 s > Running phase: patchPhase
  186. 859.78 s > Executing configureCargoCommonVars
  187. 859.78 s > copying cargo artifacts from /nix/store/fgh2l3z56pmcypaz8sm5lgiicyijyiz4-gammaloop-crate-test-binaries-three-dimensional-reps-50150770f831b638-inputs/target to target
  188. 859.78 s > will deep copy artifacts (instead of symlinking) as requested
  189. 859.78 s > Running phase: updateAutotoolsGnuConfigScriptsPhase
  190. 859.78 s > Running phase: configurePhase
  191. 859.78 s > will append /build/source/.cargo-home/config.toml with contents of /nix/store/1sigmg52bb61pfngmk9k8wq5fz9r7bf1-vendor-cargo-deps/config.toml
  192. 859.78 s > default configurePhase, nothing to do
  193. 859.78 s > Running phase: buildPhase
  194. 859.78 s > +++ command cargo --version
  195. 859.78 s > cargo 1.97.0 (c980f4866 2026-06-30)
  196. 859.78 s > +++ command cargo test --profile ci-optim --no-run --offline -p three-dimensional-reps --features three-dimensional-reps/serde
  197. 859.78 s > Compiling three-dimensional-reps v0.1.0 (/build/source/crates/three-dimensional-reps)
  198. 859.78 s > error[E0433]: cannot find `eval` in `crate`
  199. 859.78 s > --> crates/three-dimensional-reps/src/generation.rs:7255:28
  200. 859.78 s > |
  201. 859.78 s > 7255 | let input = crate::eval::EvaluationInput {
  202. 859.78 s > | ^^^^ could not find `eval` in the crate root
  203. 859.78 s > |
  204. 859.78 s > note: found an item that was configured out
  205. 859.78 s > --> crates/three-dimensional-reps/src/lib.rs:7:9
  206. 859.78 s > |
  207. 859.78 s > 6 | #[cfg(feature = "eval")]
  208. 859.78 s > | ---------------- the item is gated behind the `eval` feature
  209. 859.78 s > 7 | pub mod eval;
  210. 859.78 s > | ^^^^
  211. 859.78 s >
  212. 859.78 s > error[E0433]: cannot find `eval` in `crate`
  213. 859.78 s > --> crates/three-dimensional-reps/src/generation.rs:7262:30
  214. 859.78 s > |
  215. 859.78 s > 7262 | let contact = crate::eval::evaluate_expression(
  216. 859.78 s > | ^^^^ could not find `eval` in the crate root
  217. 859.78 s > |
  218. 859.78 s > note: found an item that was configured out
  219. 859.78 s > --> crates/three-dimensional-reps/src/lib.rs:7:9
  220. 859.78 s > |
  221. 859.78 s > 6 | #[cfg(feature = "eval")]
  222. 859.78 s > | ---------------- the item is gated behind the `eval` feature
  223. 859.78 s > 7 | pub mod eval;
  224. 859.78 s > | ^^^^
  225. 859.78 s >
  226. 859.78 s > error[E0433]: cannot find `eval` in `crate`
  227. 859.78 s > --> crates/three-dimensional-reps/src/generation.rs:7270:32
  228. 859.78 s > |
  229. 859.78 s > 7270 | let remainder = crate::eval::evaluate_expression(
  230. 859.78 s > | ^^^^ could not find `eval` in the crate root
  231. 859.78 s > |
  232. 859.78 s > note: found an item that was configured out
  233. 859.78 s > --> crates/three-dimensional-reps/src/lib.rs:7:9
  234. 859.78 s > |
  235. 859.78 s > 6 | #[cfg(feature = "eval")]
  236. 859.78 s > | ---------------- the item is gated behind the `eval` feature
  237. 859.78 s > 7 | pub mod eval;
  238. 859.78 s > | ^^^^
  239. 859.78 s >
  240. 859.78 s > error[E0433]: cannot find `eval` in `crate`
  241. 859.78 s > --> crates/three-dimensional-reps/src/generation.rs:7278:28
  242. 859.78 s > |
  243. 859.78 s > 7278 | let total = crate::eval::evaluate_expression(&powered, &expression, numerator, &input)
  244. 859.78 s > | ^^^^ could not find `eval` in the crate root
  245. 859.78 s > |
  246. 859.78 s > note: found an item that was configured out
  247. 859.78 s > --> crates/three-dimensional-reps/src/lib.rs:7:9
  248. 859.78 s > |
  249. 859.78 s > 6 | #[cfg(feature = "eval")]
  250. 859.78 s > | ---------------- the item is gated behind the `eval` feature
  251. 859.78 s > 7 | pub mod eval;
  252. 859.78 s > | ^^^^
  253. 859.78 s >
  254. 859.78 s > For more information about this error, try `rustc --explain E0433`.
  255. 859.78 s > error: could not compile `three-dimensional-reps` (lib test) due to 4 previous errors
  256. 859.78 s For full logs, run:
  257. 859.78 s nix log /nix/store/a7vgascj2khj5w2bmd7mjjn1614pfyfz-gammaloop-crate-test-binaries-three-dimensional-reps-50150770f831b638-deps-0.1.0.drv
  258. 859.78 s error: Cannot build '/nix/store/61i0g621afx7rsdmqqppj2iydl84cs4j-nix-ci-artifact-barrier-crate-test-binaries-three-dimensional-reps.drv'.
  259. 859.78 s Reason: 1 dependency failed.
  260. 859.78 s Output paths:
  261. 859.78 s /nix/store/czz1z0z8p58nh1k0h2xhdbz9yj37vrvb-nix-ci-artifact-barrier-crate-test-binaries-three-dimensional-reps
  262. 859.79 s Build failed due to failed dependency
  263. 859.92 s Build failed.