1. 0.00 s $ /nix/store/9ypz3flqsrl5xl495mm8h645gadjsxi1-coreutils-9.11/bin/timeout --kill-after=15s 7200s /nix/store/23zk8sgzamrbmj1fday15szf7f2279s8-nix-2.34.7/bin/nix --extra-experimental-features nix-command --extra-experimental-features flakes flake clone git+https://github.com/alphal00p/gammaloop --dest /tmp/nix-ci-worker/stable-pwd/repo/
  2. 0.08 s Cloning into '/tmp/nix-ci-worker/stable-pwd/repo'...
  3. 0.97 s remote: Enumerating objects: 78084, done.
  4. 1.09 s remote: Counting objects: 0% (1/13906) remote: Counting objects: 1% (140/13906) remote: Counting objects: 2% (279/13906) remote: Counting objects: 3% (418/13906) remote: Counting objects: 4% (557/13906) remote: Counting objects: 5% (696/13906) remote: Counting objects: 6% (835/13906) remote: Counting objects: 7% (974/13906) remote: Counting objects: 8% (1113/13906) remote: Counting objects: 9% (1252/13906) remote: Counting objects: 10% (1391/13906) remote: Counting objects: 11% (1530/13906) remote: Counting objects: 12% (1669/13906) remote: Counting objects: 13% (1808/13906) remote: Counting objects: 14% (1947/13906) remote: Counting objects: 15% (2086/13906) remote: Counting objects: 16% (2225/13906) remote: Counting objects: 17% (2365/13906) remote: Counting objects: 18% (2504/13906) remote: Counting objects: 19% (2643/13906) remote: Counting objects: 20% (2782/13906) remote: Counting objects: 21% (2921/13906) remote: Counting objects: 22% (3060/13906) remote: Counting objects: 23% (3199/13906) remote: Counting objects: 24% (3338/13906) remote: Counting objects: 25% (3477/13906) remote: Counting objects: 26% (3616/13906) remote: Counting objects: 27% (3755/13906) remote: Counting objects: 28% (3894/13906) remote: Counting objects: 29% (4033/13906) remote: Counting objects: 30% (4172/13906) remote: Counting objects: 31% (4311/13906) remote: Counting objects: 32% (4450/13906) remote: Counting objects: 33% (4589/13906) remote: Counting objects: 34% (4729/13906) remote: Counting objects: 35% (4868/13906) remote: Counting objects: 36% (5007/13906) remote: Counting objects: 37% (5146/13906) remote: Counting objects: 38% (5285/13906) remote: Counting objects: 39% (5424/13906) remote: Counting objects: 40% (5563/13906) remote: Counting objects: 41% (5702/13906) remote: Counting objects: 42% (5841/13906) remote: Counting objects: 43% (5980/13906) remote: Counting objects: 44% (6119/13906) remote: Counting objects: 45% (6258/13906) remote: Counting objects: 46% (6397/13906) remote: Counting objects: 47% (6536/13906) remote: Counting objects: 48% (6675/13906) remote: Counting objects: 49% (6814/13906) remote: Counting objects: 50% (6953/13906) remote: Counting objects: 51% (7093/13906) remote: Counting objects: 52% (7232/13906) remote: Counting objects: 53% (7371/13906) remote: Counting objects: 54% (7510/13906) remote: Counting objects: 55% (7649/13906) remote: Counting objects: 56% (7788/13906) remote: Counting objects: 57% (7927/13906) remote: Counting objects: 58% (8066/13906) remote: Counting objects: 59% (8205/13906) remote: Counting objects: 60% (8344/13906) remote: Counting objects: 61% (8483/13906) remote: Counting objects: 62% (8622/13906) remote: Counting objects: 63% (8761/13906) remote: Counting objects: 64% (8900/13906) remote: Counting objects: 65% (9039/13906) remote: Counting objects: 66% (9178/13906) remote: Counting objects: 67% (9318/13906) remote: Counting objects: 68% (9457/13906) remote: Counting objects: 69% (9596/13906) remote: Counting objects: 70% (9735/13906) remote: Counting objects: 71% (9874/13906) remote: Counting objects: 72% (10013/13906) remote: Counting objects: 73% (10152/13906) remote: Counting objects: 74% (10291/13906) remote: Counting objects: 75% (10430/13906) remote: Counting objects: 76% (10569/13906) remote: Counting objects: 77% (10708/13906) remote: Counting objects: 78% (10847/13906) remote: Counting objects: 79% (10986/13906) remote: Counting objects: 80% (11125/13906) remote: Counting objects: 81% (11264/13906) remote: Counting objects: 82% (11403/13906) remote: Counting objects: 83% (11542/13906) remote: Counting objects: 84% (11682/13906) remote: Counting objects: 85% (11821/13906) remote: Counting objects: 86% (11960/13906) remote: Counting objects: 87% (12099/13906) remote: Counting objects: 88% (12238/13906) remote: Counting objects: 89% (12377/13906) remote: Counting objects: 90% (12516/13906) remote: Counting objects: 91% (12655/13906) remote: Counting objects: 92% (12794/13906) remote: Counting objects: 93% (12933/13906) remote: Counting objects: 94% (13072/13906) remote: Counting objects: 95% (13211/13906) remote: Counting objects: 96% (13350/13906) remote: Counting objects: 97% (13489/13906) remote: Counting objects: 98% (13628/13906) remote: Counting objects: 99% (13767/13906) remote: Counting objects: 100% (13906/13906) remote: Counting objects: 100% (13906/13906), done.
  5. 3.91 s remote: Compressing objects: 0% (1/3095) remote: Compressing objects: 1% (31/3095) remote: Compressing objects: 2% (62/3095) remote: Compressing objects: 3% (93/3095) remote: Compressing objects: 4% (124/3095) remote: Compressing objects: 5% (155/3095) remote: Compressing objects: 6% (186/3095) remote: Compressing objects: 7% (217/3095) remote: Compressing objects: 8% (248/3095) remote: Compressing objects: 9% (279/3095) remote: Compressing objects: 10% (310/3095) remote: Compressing objects: 11% (341/3095) remote: Compressing objects: 12% (372/3095) remote: Compressing objects: 13% (403/3095) remote: Compressing objects: 14% (434/3095) remote: Compressing objects: 15% (465/3095) remote: Compressing objects: 16% (496/3095) remote: Compressing objects: 17% (527/3095) remote: Compressing objects: 18% (558/3095) remote: Compressing objects: 19% (589/3095) remote: Compressing objects: 20% (619/3095) remote: Compressing objects: 21% (650/3095) remote: Compressing objects: 22% (681/3095) remote: Compressing objects: 23% (712/3095) remote: Compressing objects: 24% (743/3095) remote: Compressing objects: 24% (771/3095) remote: Compressing objects: 25% (774/3095) remote: Compressing objects: 26% (805/3095) remote: Compressing objects: 27% (836/3095) remote: Compressing objects: 28% (867/3095) remote: Compressing objects: 28% (881/3095) remote: Compressing objects: 29% (898/3095) remote: Compressing objects: 30% (929/3095) remote: Compressing objects: 31% (960/3095) remote: Compressing objects: 32% (991/3095) remote: Compressing objects: 33% (1022/3095) remote: Compressing objects: 34% (1053/3095) remote: Compressing objects: 35% (1084/3095) remote: Compressing objects: 36% (1115/3095) remote: Compressing objects: 37% (1146/3095) remote: Compressing objects: 38% (1177/3095) remote: Compressing objects: 39% (1208/3095) remote: Compressing objects: 40% (1238/3095) remote: Compressing objects: 41% (1269/3095) remote: Compressing objects: 42% (1300/3095) remote: Compressing objects: 43% (1331/3095) remote: Compressing objects: 44% (1362/3095) remote: Compressing objects: 45% (1393/3095) remote: Compressing objects: 46% (1424/3095) remote: Compressing objects: 47% (1455/3095) remote: Compressing objects: 48% (1486/3095) remote: Compressing objects: 49% (1517/3095) remote: Compressing objects: 50% (1548/3095) remote: Compressing objects: 51% (1579/3095) remote: Compressing objects: 52% (1610/3095) remote: Compressing objects: 53% (1641/3095) remote: Compressing objects: 54% (1672/3095) remote: Compressing objects: 55% (1703/3095) remote: Compressing objects: 56% (1734/3095) remote: Compressing objects: 57% (1765/3095) remote: Compressing objects: 58% (1796/3095) remote: Compressing objects: 59% (1827/3095) remote: Compressing objects: 60% (1857/3095) remote: Compressing objects: 61% (1888/3095) remote: Compressing objects: 62% (1919/3095) remote: Compressing objects: 63% (1950/3095) remote: Compressing objects: 64% (1981/3095) remote: Compressing objects: 65% (2012/3095) remote: Compressing objects: 66% (2043/3095) remote: Compressing objects: 67% (2074/3095) remote: Compressing objects: 68% (2105/3095) remote: Compressing objects: 69% (2136/3095) remote: Compressing objects: 70% (2167/3095) remote: Compressing objects: 71% (2198/3095) remote: Compressing objects: 72% (2229/3095) remote: Compressing objects: 73% (2260/3095) remote: Compressing objects: 74% (2291/3095) remote: Compressing objects: 75% (2322/3095) remote: Compressing objects: 76% (2353/3095) remote: Compressing objects: 77% (2384/3095) remote: Compressing objects: 78% (2415/3095) remote: Compressing objects: 79% (2446/3095) remote: Compressing objects: 80% (2476/3095) remote: Compressing objects: 81% (2507/3095) remote: Compressing objects: 82% (2538/3095) remote: Compressing objects: 83% (2569/3095) remote: Compressing objects: 84% (2600/3095) remote: Compressing objects: 85% (2631/3095) remote: Compressing objects: 86% (2662/3095) remote: Compressing objects: 87% (2693/3095) remote: Compressing objects: 88% (2724/3095) remote: Compressing objects: 89% (2755/3095) remote: Compressing objects: 90% (2786/3095) remote: Compressing objects: 91% (2817/3095) remote: Compressing objects: 92% (2848/3095) remote: Compressing objects: 93% (2879/3095) remote: Compressing objects: 94% (2910/3095) remote: Compressing objects: 95% (2941/3095) remote: Compressing objects: 96% (2972/3095) remote: Compressing objects: 97% (3003/3095) remote: Compressing objects: 98% (3034/3095) remote: Compressing objects: 99% (3065/3095) remote: Compressing objects: 100% (3095/3095) remote: Compressing objects: 100% (3095/3095), done.
  6. 7.74 s Receiving objects: 0% (1/78084) Receiving objects: 1% (781/78084) Receiving objects: 2% (1562/78084) Receiving objects: 3% (2343/78084) Receiving objects: 4% (3124/78084) Receiving objects: 5% (3905/78084) Receiving objects: 6% (4686/78084) Receiving objects: 7% (5466/78084) Receiving objects: 8% (6247/78084) Receiving objects: 9% (7028/78084), 10.15 MiB | 20.32 MiB/s Receiving objects: 10% (7809/78084), 10.15 MiB | 20.32 MiB/s Receiving objects: 11% (8590/78084), 10.15 MiB | 20.32 MiB/s Receiving objects: 12% (9371/78084), 10.15 MiB | 20.32 MiB/s Receiving objects: 13% (10151/78084), 10.15 MiB | 20.32 MiB/s Receiving objects: 14% (10932/78084), 10.15 MiB | 20.32 MiB/s Receiving objects: 15% (11713/78084), 10.15 MiB | 20.32 MiB/s Receiving objects: 16% (12494/78084), 10.15 MiB | 20.32 MiB/s Receiving objects: 17% (13275/78084), 10.15 MiB | 20.32 MiB/s Receiving objects: 18% (14056/78084), 10.15 MiB | 20.32 MiB/s Receiving objects: 19% (14836/78084), 10.15 MiB | 20.32 MiB/s Receiving objects: 20% (15617/78084), 10.15 MiB | 20.32 MiB/s Receiving objects: 21% (16398/78084), 10.15 MiB | 20.32 MiB/s Receiving objects: 22% (17179/78084), 10.15 MiB | 20.32 MiB/s Receiving objects: 23% (17960/78084), 10.15 MiB | 20.32 MiB/s Receiving objects: 24% (18741/78084), 10.15 MiB | 20.32 MiB/s Receiving objects: 25% (19521/78084), 10.15 MiB | 20.32 MiB/s Receiving objects: 26% (20302/78084), 10.15 MiB | 20.32 MiB/s Receiving objects: 27% (21083/78084), 10.15 MiB | 20.32 MiB/s Receiving objects: 28% (21864/78084), 10.15 MiB | 20.32 MiB/s Receiving objects: 29% (22645/78084), 10.15 MiB | 20.32 MiB/s Receiving objects: 30% (23426/78084), 10.15 MiB | 20.32 MiB/s Receiving objects: 31% (24207/78084), 10.15 MiB | 20.32 MiB/s Receiving objects: 32% (24987/78084), 10.15 MiB | 20.32 MiB/s Receiving objects: 33% (25768/78084), 10.15 MiB | 20.32 MiB/s Receiving objects: 34% (26549/78084), 10.15 MiB | 20.32 MiB/s Receiving objects: 35% (27330/78084), 10.15 MiB | 20.32 MiB/s Receiving objects: 36% (28111/78084), 10.15 MiB | 20.32 MiB/s Receiving objects: 37% (28892/78084), 10.15 MiB | 20.32 MiB/s Receiving objects: 38% (29672/78084), 10.15 MiB | 20.32 MiB/s Receiving objects: 39% (30453/78084), 10.15 MiB | 20.32 MiB/s Receiving objects: 40% (31234/78084), 10.15 MiB | 20.32 MiB/s Receiving objects: 40% (31549/78084), 28.82 MiB | 28.78 MiB/s Receiving objects: 41% (32015/78084), 28.82 MiB | 28.78 MiB/s Receiving objects: 42% (32796/78084), 28.82 MiB | 28.78 MiB/s Receiving objects: 43% (33577/78084), 28.82 MiB | 28.78 MiB/s Receiving objects: 44% (34357/78084), 28.82 MiB | 28.78 MiB/s Receiving objects: 45% (35138/78084), 28.82 MiB | 28.78 MiB/s Receiving objects: 46% (35919/78084), 28.82 MiB | 28.78 MiB/s Receiving objects: 47% (36700/78084), 28.82 MiB | 28.78 MiB/s Receiving objects: 48% (37481/78084), 28.82 MiB | 28.78 MiB/s Receiving objects: 49% (38262/78084), 28.82 MiB | 28.78 MiB/s Receiving objects: 50% (39042/78084), 28.82 MiB | 28.78 MiB/s Receiving objects: 51% (39823/78084), 44.63 MiB | 29.59 MiB/s Receiving objects: 52% (40604/78084), 44.63 MiB | 29.59 MiB/s Receiving objects: 53% (41385/78084), 44.63 MiB | 29.59 MiB/s Receiving objects: 54% (42166/78084), 44.63 MiB | 29.59 MiB/s Receiving objects: 55% (42947/78084), 44.63 MiB | 29.59 MiB/s Receiving objects: 56% (43728/78084), 44.63 MiB | 29.59 MiB/s Receiving objects: 57% (44508/78084), 44.63 MiB | 29.59 MiB/s Receiving objects: 58% (45289/78084), 44.63 MiB | 29.59 MiB/s Receiving objects: 59% (46070/78084), 44.63 MiB | 29.59 MiB/s Receiving objects: 60% (46851/78084), 44.63 MiB | 29.59 MiB/s Receiving objects: 61% (47632/78084), 44.63 MiB | 29.59 MiB/s Receiving objects: 61% (48033/78084), 44.63 MiB | 29.59 MiB/s Receiving objects: 62% (48413/78084), 60.77 MiB | 30.26 MiB/s Receiving objects: 63% (49193/78084), 60.77 MiB | 30.26 MiB/s Receiving objects: 64% (49974/78084), 60.77 MiB | 30.26 MiB/s Receiving objects: 65% (50755/78084), 60.77 MiB | 30.26 MiB/s Receiving objects: 66% (51536/78084), 60.77 MiB | 30.26 MiB/s Receiving objects: 67% (52317/78084), 60.77 MiB | 30.26 MiB/s Receiving objects: 68% (53098/78084), 60.77 MiB | 30.26 MiB/s Receiving objects: 69% (53878/78084), 60.77 MiB | 30.26 MiB/s Receiving objects: 70% (54659/78084), 77.65 MiB | 30.96 MiB/s Receiving objects: 71% (55440/78084), 77.65 MiB | 30.96 MiB/s Receiving objects: 72% (56221/78084), 77.65 MiB | 30.96 MiB/s Receiving objects: 73% (57002/78084), 77.65 MiB | 30.96 MiB/s Receiving objects: 74% (57783/78084), 77.65 MiB | 30.96 MiB/s Receiving objects: 75% (58563/78084), 77.65 MiB | 30.96 MiB/s Receiving objects: 76% (59344/78084), 77.65 MiB | 30.96 MiB/s Receiving objects: 77% (60125/78084), 77.65 MiB | 30.96 MiB/s Receiving objects: 78% (60906/78084), 77.65 MiB | 30.96 MiB/s Receiving objects: 79% (61687/78084), 77.65 MiB | 30.96 MiB/s Receiving objects: 80% (62468/78084), 77.65 MiB | 30.96 MiB/s Receiving objects: 80% (62629/78084), 77.65 MiB | 30.96 MiB/s Receiving objects: 81% (63249/78084), 94.45 MiB | 31.05 MiB/s Receiving objects: 82% (64029/78084), 94.45 MiB | 31.05 MiB/s Receiving objects: 83% (64810/78084), 94.45 MiB | 31.05 MiB/s Receiving objects: 84% (65591/78084), 94.45 MiB | 31.05 MiB/s Receiving objects: 85% (66372/78084), 94.45 MiB | 31.05 MiB/s Receiving objects: 86% (67153/78084), 94.45 MiB | 31.05 MiB/s Receiving objects: 87% (67934/78084), 94.45 MiB | 31.05 MiB/s Receiving objects: 88% (68714/78084), 110.70 MiB | 31.23 MiB/s Receiving objects: 89% (69495/78084), 110.70 MiB | 31.23 MiB/s Receiving objects: 90% (70276/78084), 110.70 MiB | 31.23 MiB/s Receiving objects: 91% (71057/78084), 110.70 MiB | 31.23 MiB/s Receiving objects: 92% (71838/78084), 110.70 MiB | 31.23 MiB/s Receiving objects: 93% (72619/78084), 110.70 MiB | 31.23 MiB/s Receiving objects: 94% (73399/78084), 110.70 MiB | 31.23 MiB/s Receiving objects: 95% (74180/78084), 110.70 MiB | 31.23 MiB/s Receiving objects: 96% (74961/78084), 110.70 MiB | 31.23 MiB/s Receiving objects: 97% (75742/78084), 110.70 MiB | 31.23 MiB/s Receiving objects: 98% (76523/78084), 110.70 MiB | 31.23 MiB/s Receiving objects: 99% (77304/78084), 110.70 MiB | 31.23 MiB/s remote: Total 78084 (delta 9811), reused 11671 (delta 8715), pack-reused 64178 (from 2)
  7. 7.74 s Receiving objects: 100% (78084/78084), 110.70 MiB | 31.23 MiB/s Receiving objects: 100% (78084/78084), 120.79 MiB | 31.48 MiB/s, done.
  8. 8.77 s Resolving deltas: 0% (0/53130) Resolving deltas: 1% (532/53130) Resolving deltas: 2% (1064/53130) Resolving deltas: 3% (1594/53130) Resolving deltas: 4% (2126/53130) Resolving deltas: 5% (2657/53130) Resolving deltas: 6% (3188/53130) Resolving deltas: 7% (3721/53130) Resolving deltas: 8% (4251/53130) Resolving deltas: 9% (4782/53130) Resolving deltas: 10% (5313/53130) Resolving deltas: 11% (5846/53130) Resolving deltas: 12% (6376/53130) Resolving deltas: 13% (6907/53130) Resolving deltas: 14% (7439/53130) Resolving deltas: 15% (7970/53130) Resolving deltas: 16% (8501/53130) Resolving deltas: 17% (9033/53130) Resolving deltas: 18% (9565/53130) Resolving deltas: 19% (10095/53130) Resolving deltas: 20% (10626/53130) Resolving deltas: 21% (11158/53130) Resolving deltas: 22% (11690/53130) Resolving deltas: 23% (12220/53130) Resolving deltas: 24% (12753/53130) Resolving deltas: 25% (13283/53130) Resolving deltas: 26% (13814/53130) Resolving deltas: 27% (14346/53130) Resolving deltas: 28% (14877/53130) Resolving deltas: 29% (15408/53130) Resolving deltas: 30% (15939/53130) Resolving deltas: 31% (16473/53130) Resolving deltas: 32% (17002/53130) Resolving deltas: 33% (17534/53130) Resolving deltas: 34% (18065/53130) Resolving deltas: 35% (18596/53130) Resolving deltas: 36% (19127/53130) Resolving deltas: 37% (19659/53130) Resolving deltas: 38% (20191/53130) Resolving deltas: 39% (20721/53130) Resolving deltas: 40% (21252/53130) Resolving deltas: 41% (21788/53130) Resolving deltas: 42% (22315/53130) Resolving deltas: 43% (22846/53130) Resolving deltas: 44% (23379/53130) Resolving deltas: 45% (23910/53130) Resolving deltas: 46% (24440/53130) Resolving deltas: 47% (24972/53130) Resolving deltas: 48% (25504/53130) Resolving deltas: 49% (26034/53130) Resolving deltas: 50% (26565/53130) Resolving deltas: 51% (27097/53130) Resolving deltas: 52% (27630/53130) Resolving deltas: 53% (28162/53130) Resolving deltas: 54% (28692/53130) Resolving deltas: 55% (29222/53130) Resolving deltas: 56% (29753/53130) Resolving deltas: 57% (30285/53130) Resolving deltas: 58% (30816/53130) Resolving deltas: 59% (31347/53130) Resolving deltas: 60% (31879/53130) Resolving deltas: 61% (32410/53130) Resolving deltas: 62% (32941/53130) Resolving deltas: 63% (33472/53130) Resolving deltas: 64% (34004/53130) Resolving deltas: 65% (34535/53130) Resolving deltas: 66% (35066/53130) Resolving deltas: 67% (35598/53130) Resolving deltas: 68% (36129/53130) Resolving deltas: 69% (36660/53130) Resolving deltas: 70% (37191/53130) Resolving deltas: 71% (37723/53130) Resolving deltas: 72% (38254/53130) Resolving deltas: 73% (38785/53130) Resolving deltas: 74% (39317/53130) Resolving deltas: 75% (39848/53130) Resolving deltas: 76% (40379/53130) Resolving deltas: 77% (40912/53130) Resolving deltas: 78% (41442/53130) Resolving deltas: 79% (41973/53130) Resolving deltas: 80% (42505/53130) Resolving deltas: 81% (43036/53130) Resolving deltas: 82% (43567/53130) Resolving deltas: 83% (44098/53130) Resolving deltas: 84% (44630/53130) Resolving deltas: 85% (45161/53130) Resolving deltas: 86% (45692/53130) Resolving deltas: 87% (46224/53130) Resolving deltas: 88% (46755/53130) Resolving deltas: 89% (47288/53130) Resolving deltas: 90% (47817/53130) Resolving deltas: 91% (48349/53130) Resolving deltas: 92% (48880/53130) Resolving deltas: 93% (49411/53130) Resolving deltas: 94% (49944/53130) Resolving deltas: 95% (50474/53130) Resolving deltas: 96% (51006/53130) Resolving deltas: 97% (51537/53130) Resolving deltas: 98% (52068/53130) Resolving deltas: 99% (52599/53130) Resolving deltas: 99% (52933/53130) Resolving deltas: 100% (53130/53130) Resolving deltas: 100% (53130/53130), done.
  9. 9.17 s Fetching commit 8a197b8cad2f920e58f5fdc82a046a3afcd7e1fd for raised_energy_cff_wip ...
  10. 9.17 s $ /nix/store/bcnisk3ydfgv26v2gw3zlky24g00yww2-git-2.54.0/bin/git fetch origin 8a197b8cad2f920e58f5fdc82a046a3afcd7e1fd
  11. 9.64 s From https://github.com/alphal00p/gammaloop
  12. 9.64 s * branch 8a197b8cad2f920e58f5fdc82a046a3afcd7e1fd -> FETCH_HEAD
  13. 9.65 s $ /nix/store/9ypz3flqsrl5xl495mm8h645gadjsxi1-coreutils-9.11/bin/timeout --kill-after=15s 7200s /nix/store/bcnisk3ydfgv26v2gw3zlky24g00yww2-git-2.54.0/bin/git -c advice.detachedHead=false checkout 8a197b8cad2f920e58f5fdc82a046a3afcd7e1fd
  14. 9.84 s HEAD is now at 8a197b8ca preserve separate UV Taylor denominator topologies
  15. 9.84 s $ /nix/store/9ypz3flqsrl5xl495mm8h645gadjsxi1-coreutils-9.11/bin/timeout --kill-after=15s 7200s /nix/store/23zk8sgzamrbmj1fday15szf7f2279s8-nix-2.34.7/bin/nix --extra-experimental-features nix-command --extra-experimental-features flakes --log-format internal-json run .#packages.x86_64-linux.nix-ci-check-gammaloop-nextest-core --print-build-logs
  16. 14.18 s
  17. 14.29 s Downloading cached nix-ci-check-gammaloop-nextest-core from https://cache.nix-ci.com
  18. 14.33 s Downloaded cached nix-ci-check-gammaloop-nextest-core (1016 B) in 38ms
  19. 14.33 s Progress: 0 of 1 built, 1 of 1 downloaded from cache
  20. 18.94 s evaluating derivation 'g copying '/nix/store/qv5p evaluating derivation 'g copying '/nix/store/qv5p evaluating derivation 'g copying '/nix/store/qv5p evaluating derivation 'g copying '/nix/store/qv5p evaluating derivation 'g copying '/nix/store/qv5p evaluating derivation 'g copying '/nix/store/qv5p evaluating derivation 'g querying gammaloop-nexte [0.0 KiB DL] querying in [0/2 built, 1/0/1 copied [0/1 built, 1 copied (4. [1/0/1 built, 1 copied (gammaloop-nextest-core> Extracting 4 binaries (including 1 non-test binary), 1 build script output directory, and 2 linked paths to /build/nextest-archive-1WMVsf
  21. 19.60 s gammaloop-nextest-core> Extracted 20 files to /build/nextest-archive-1WMVsf in 0.66s
  22. 19.61 s gammaloop-nextest-core> ------------
  23. 19.61 s gammaloop-nextest-core> Nextest run ID e9ccbace-fcc8-4cd6-83d4-8e42930ad43b with nextest profile: ci_gammaloop
  24. 19.61 s gammaloop-nextest-core> Starting 377 tests across 3 binaries
  25. 20.83 s gammaloop-nextest-core> ------------
  26. 20.83 s gammaloop-nextest-core> Summary [ 1.222s] 377 tests run: 377 passed, 0 skipped
  27. 20.95 s gammaloop-nextest-core>
  28. 20.95 s gammaloop-nextest-core> ========== nextest test summary ==========
  29. 20.95 s gammaloop-nextest-core> report: target/nextest/ci_gammaloop/junit.xml
  30. 20.95 s gammaloop-nextest-core> tests: 377, failures: 0, errors: 0
  31. 20.95 s gammaloop-nextest-core> No failing testcases found.
  32. 20.95 s gammaloop-nextest-core> =========================================
  33. 20.96 s gammaloop-nextest-core> Extracting 1 binary and 1 linked path to /build/nextest-archive-Jm2tCT
  34. 21.02 s gammaloop-nextest-core> Extracted 7 files to /build/nextest-archive-Jm2tCT in 0.06s
  35. 21.03 s gammaloop-nextest-core> ------------
  36. 21.03 s gammaloop-nextest-core> Nextest run ID 5bbcc898-c823-4d8d-bec8-5c3ab7ed262e with nextest profile: ci_gammaloop
  37. 21.03 s gammaloop-nextest-core> Starting 19 tests across 1 binary
  38. 21.04 s gammaloop-nextest-core> ------------
  39. 21.04 s gammaloop-nextest-core> Summary [ 0.010s] 19 tests run: 19 passed, 0 skipped
  40. 21.07 s gammaloop-nextest-core>
  41. 21.07 s gammaloop-nextest-core> ========== nextest test summary ==========
  42. 21.07 s gammaloop-nextest-core> report: target/nextest/ci_gammaloop/junit.xml
  43. 21.07 s gammaloop-nextest-core> tests: 19, failures: 0, errors: 0
  44. 21.07 s gammaloop-nextest-core> No failing testcases found.
  45. 21.07 s gammaloop-nextest-core> =========================================
  46. 21.09 s gammaloop-nextest-core> Extracting 1 binary to /build/nextest-archive-emB78B
  47. 21.12 s gammaloop-nextest-core> Extracted 4 files to /build/nextest-archive-emB78B in 0.03s
  48. 21.12 s gammaloop-nextest-core> ------------
  49. 21.12 s gammaloop-nextest-core> Nextest run ID 42ec92e2-bfc3-45f1-8d9f-72bbb8ab861f with nextest profile: ci_gammaloop
  50. 21.12 s gammaloop-nextest-core> Starting 0 tests across 1 binary
  51. 21.12 s gammaloop-nextest-core> ------------
  52. 21.12 s gammaloop-nextest-core> Summary [ 0.000s] 0 tests run: 0 passed, 0 skipped
  53. 21.15 s gammaloop-nextest-core>
  54. 21.15 s gammaloop-nextest-core> ========== nextest test summary ==========
  55. 21.15 s gammaloop-nextest-core> report: target/nextest/ci_gammaloop/junit.xml
  56. 21.15 s gammaloop-nextest-core> tests: 0, failures: 0, errors: 0
  57. 21.15 s gammaloop-nextest-core> No failing testcases found.
  58. 21.15 s gammaloop-nextest-core> =========================================
  59. 21.16 s gammaloop-nextest-core> Extracting 4 binaries, 1 build script output directory, and 2 linked paths to /build/nextest-archive-wM1TvL
  60. 21.59 s gammaloop-nextest-core> Extracted 18 files to /build/nextest-archive-wM1TvL in 0.43s
  61. 21.60 s gammaloop-nextest-core> ------------
  62. 21.60 s gammaloop-nextest-core> Nextest run ID 72bf24a3-3629-4554-a369-b0ce45f6f568 with nextest profile: ci_gammaloop
  63. 21.60 s gammaloop-nextest-core> Starting 645 tests across 4 binaries (59 tests skipped, including 58 tests via profile.ci_gammaloop.default-filter)
  64. 22.74 s gammaloop-nextest-core> FAIL [ 0.081s] (555/645) gammalooprs uv::approx::local_4d::tests::dod_one_triangle_keeps_separate_denominator_topologies
  65. 22.74 s gammaloop-nextest-core> stdout ---
  66. 22.74 s gammaloop-nextest-core>
  67. 22.74 s gammaloop-nextest-core> running 1 test
  68. 22.74 s gammaloop-nextest-core> test uv::approx::local_4d::tests::dod_one_triangle_keeps_separate_denominator_topologies ... FAILED
  69. 22.74 s gammaloop-nextest-core>
  70. 22.74 s gammaloop-nextest-core> failures:
  71. 22.74 s gammaloop-nextest-core>
  72. 22.74 s gammaloop-nextest-core> failures:
  73. 22.74 s gammaloop-nextest-core> uv::approx::local_4d::tests::dod_one_triangle_keeps_separate_denominator_topologies
  74. 22.74 s gammaloop-nextest-core>
  75. 22.74 s gammaloop-nextest-core> test result: FAILED. 0 passed; 1 failed; 0 ignored; 0 measured; 695 filtered out; finished in 0.07s
  76. 22.74 s gammaloop-nextest-core>
  77. 22.74 s gammaloop-nextest-core> stderr ---
  78. 22.74 s gammaloop-nextest-core> The application panicked (crashed).
  79. 22.74 s gammaloop-nextest-core> Message: assertion `left == right` failed
  80. 22.74 s gammaloop-nextest-core> left: [[1, 1, 1], [1, 1, 1], [1, 1, 2], [2, 1, 1]]
  81. 22.74 s gammaloop-nextest-core> right: [[1, 1, 1], [1, 1, 2], [2, 1, 1]]
  82. 22.74 s gammaloop-nextest-core> Location: crates/gammalooprs/src/uv/approx/local_4d.rs:1992
  83. 22.74 s gammaloop-nextest-core>
  84. 22.74 s gammaloop-nextest-core> ━━━━━━━━━━━━━━━━━━━━━━━━━━━━━━━━━━ BACKTRACE ━━━━━━━━━━━━━━━━━━━━━━━━━━━━━━━━━━━
  85. 22.74 s gammaloop-nextest-core> 1: <color_eyre[51793ea62743adbd]::config::PanicHook>::panic_report<unknown>
  86. 22.74 s gammaloop-nextest-core> at <unknown source file>:<unknown line>
  87. 22.74 s gammaloop-nextest-core> 2: <color_eyre[51793ea62743adbd]::config::PanicHook>::into_panic_hook::{closure#0}<unknown>
  88. 22.74 s gammaloop-nextest-core> at <unknown source file>:<unknown line>
  89. 22.74 s gammaloop-nextest-core> 3: std[bcb96dfbba0ab899]::panicking::panic_with_hook<unknown>
  90. 22.74 s gammaloop-nextest-core> at <unknown source file>:<unknown line>
  91. 22.74 s gammaloop-nextest-core> 4: std[bcb96dfbba0ab899]::panicking::panic_handler::{closure#0}<unknown>
  92. 22.74 s gammaloop-nextest-core> at <unknown source file>:<unknown line>
  93. 22.74 s gammaloop-nextest-core> 5: std[bcb96dfbba0ab899]::sys::backtrace::__rust_end_short_backtrace::<std[bcb96dfbba0ab899]::panicking::panic_handler::{closure#0}, !><unknown>
  94. 22.74 s gammaloop-nextest-core> at <unknown source file>:<unknown line>
  95. 22.74 s gammaloop-nextest-core> 6: __rustc[6c289b9f9c454d21]::rust_begin_unwind<unknown>
  96. 22.74 s gammaloop-nextest-core> at <unknown source file>:<unknown line>
  97. 22.74 s gammaloop-nextest-core> 7: core[940e698046960fd5]::panicking::panic_fmt<unknown>
  98. 22.74 s gammaloop-nextest-core> at <unknown source file>:<unknown line>
  99. 22.74 s gammaloop-nextest-core> 8: core[940e698046960fd5]::panicking::assert_failed_inner<unknown>
  100. 22.74 s gammaloop-nextest-core> at <unknown source file>:<unknown line>
  101. 22.74 s gammaloop-nextest-core> 9: core[940e698046960fd5]::panicking::assert_failed::<alloc[2ea6bcb46fca0c42]::vec::Vec<[usize; 3usize]>, alloc[2ea6bcb46fca0c42]::vec::Vec<[usize; 3usize]>><unknown>
  102. 22.74 s gammaloop-nextest-core> at <unknown source file>:<unknown line>
  103. 22.74 s gammaloop-nextest-core> 10: gammalooprs[8af0a922d9a4c82d]::uv::approx::local_4d::tests::dod_one_triangle_keeps_separate_denominator_topologies<unknown>
  104. 22.74 s gammaloop-nextest-core> at <unknown source file>:<unknown line>
  105. 22.74 s gammaloop-nextest-core> 11: <gammalooprs[8af0a922d9a4c82d]::uv::approx::local_4d::tests::dod_one_triangle_keeps_separate_denominator_topologies::{closure#0} as core[940e698046960fd5]::ops::function::FnOnce<()>>::call_once<unknown>
  106. 22.74 s gammaloop-nextest-core> at <unknown source file>:<unknown line>
  107. 22.74 s gammaloop-nextest-core> 12: test[75d6903177b1d7e9]::__rust_begin_short_backtrace::<core[940e698046960fd5]::result::Result<(), alloc[2ea6bcb46fca0c42]::string::String>, fn() -> core[940e698046960fd5]::result::Result<(), alloc[2ea6bcb46fca0c42]::string::String>><unknown>
  108. 22.74 s gammaloop-nextest-core> at <unknown source file>:<unknown line>
  109. 22.74 s gammaloop-nextest-core> 13: test[75d6903177b1d7e9]::run_test::{closure#0}<unknown>
  110. 22.74 s gammaloop-nextest-core> at <unknown source file>:<unknown line>
  111. 22.74 s gammaloop-nextest-core> 14: std[bcb96dfbba0ab899]::sys::backtrace::__rust_begin_short_backtrace::<test[75d6903177b1d7e9]::run_test::{closure#1}, ()><unknown>
  112. 22.74 s gammaloop-nextest-core> at <unknown source file>:<unknown line>
  113. 22.74 s gammaloop-nextest-core> 15: <std[bcb96dfbba0ab899]::thread::lifecycle::spawn_unchecked<test[75d6903177b1d7e9]::run_test::{closure#1}, ()>::{closure#1} as core[940e698046960fd5]::ops::function::FnOnce<()>>::call_once::{shim:vtable#0}<unknown>
  114. 22.74 s gammaloop-nextest-core> at <unknown source file>:<unknown line>
  115. 22.74 s gammaloop-nextest-core> 16: <std[bcb96dfbba0ab899]::sys::thread::unix::Thread>::new::thread_start<unknown>
  116. 22.74 s gammaloop-nextest-core> at <unknown source file>:<unknown line>
  117. 22.74 s gammaloop-nextest-core> 17: start_thread<unknown>
  118. 22.74 s gammaloop-nextest-core> at <unknown source file>:<unknown line>
  119. 22.74 s gammaloop-nextest-core> 18: __clone3<unknown>
  120. 22.74 s gammaloop-nextest-core> at <unknown source file>:<unknown line>
  121. 22.74 s gammaloop-nextest-core>
  122. 22.74 s gammaloop-nextest-core> Run with COLORBT_SHOW_HIDDEN=1 environment variable to disable frame filtering.
  123. 22.74 s gammaloop-nextest-core> Run with RUST_BACKTRACE=full to include source snippets.
  124. 22.74 s gammaloop-nextest-core>
  125. 22.95 s gammaloop-nextest-core> FAIL [ 0.225s] (572/645) gammalooprs uv::approx::tests::factorized_owned_dot_child_cff_matches_direct_3d_for_uncut_self_energy
  126. 22.95 s gammaloop-nextest-core> stdout ---
  127. 22.95 s gammaloop-nextest-core>
  128. 22.95 s gammaloop-nextest-core> running 1 test
  129. 22.95 s gammaloop-nextest-core> test uv::approx::tests::factorized_owned_dot_child_cff_matches_direct_3d_for_uncut_self_energy ... FAILED
  130. 22.95 s gammaloop-nextest-core>
  131. 22.95 s gammaloop-nextest-core> failures:
  132. 22.95 s gammaloop-nextest-core>
  133. 22.95 s gammaloop-nextest-core> failures:
  134. 22.95 s gammaloop-nextest-core> uv::approx::tests::factorized_owned_dot_child_cff_matches_direct_3d_for_uncut_self_energy
  135. 22.95 s gammaloop-nextest-core>
  136. 22.95 s gammaloop-nextest-core> test result: FAILED. 0 passed; 1 failed; 0 ignored; 0 measured; 695 filtered out; finished in 0.22s
  137. 22.95 s gammaloop-nextest-core>
  138. 22.95 s gammaloop-nextest-core> stderr ---
  139. 22.95 s gammaloop-nextest-core> The application panicked (crashed).
  140. 22.95 s gammaloop-nextest-core> Message: assertion `left == right` failed
  141. 22.95 s gammaloop-nextest-core> left: [[1, 1, 2], [1, 2], [2, 2, 1], [2, 1], [2, 1], [2, 2, 1], [2, 2, 2, 1], [2, 2, 1]]
  142. 22.95 s gammaloop-nextest-core> right: [[1, 1, 2, 2, 2]]
  143. 22.95 s gammaloop-nextest-core> Location: crates/gammalooprs/src/uv/approx/mod.rs:1471
  144. 22.95 s gammaloop-nextest-core>
  145. 22.95 s gammaloop-nextest-core> ━━━━━━━━━━━━━━━━━━━━━━━━━━━━━━━━━━ BACKTRACE ━━━━━━━━━━━━━━━━━━━━━━━━━━━━━━━━━━━
  146. 22.95 s gammaloop-nextest-core> 1: <color_eyre[51793ea62743adbd]::config::PanicHook>::panic_report<unknown>
  147. 22.95 s gammaloop-nextest-core> at <unknown source file>:<unknown line>
  148. 22.95 s gammaloop-nextest-core> 2: <color_eyre[51793ea62743adbd]::config::PanicHook>::into_panic_hook::{closure#0}<unknown>
  149. 22.95 s gammaloop-nextest-core> at <unknown source file>:<unknown line>
  150. 22.95 s gammaloop-nextest-core> 3: std[bcb96dfbba0ab899]::panicking::panic_with_hook<unknown>
  151. 22.95 s gammaloop-nextest-core> at <unknown source file>:<unknown line>
  152. 22.95 s gammaloop-nextest-core> 4: std[bcb96dfbba0ab899]::panicking::panic_handler::{closure#0}<unknown>
  153. 22.95 s gammaloop-nextest-core> at <unknown source file>:<unknown line>
  154. 22.95 s gammaloop-nextest-core> 5: std[bcb96dfbba0ab899]::sys::backtrace::__rust_end_short_backtrace::<std[bcb96dfbba0ab899]::panicking::panic_handler::{closure#0}, !><unknown>
  155. 22.95 s gammaloop-nextest-core> at <unknown source file>:<unknown line>
  156. 22.95 s gammaloop-nextest-core> 6: __rustc[6c289b9f9c454d21]::rust_begin_unwind<unknown>
  157. 22.95 s gammaloop-nextest-core> at <unknown source file>:<unknown line>
  158. 22.95 s gammaloop-nextest-core> 7: core[940e698046960fd5]::panicking::panic_fmt<unknown>
  159. 22.95 s gammaloop-nextest-core> at <unknown source file>:<unknown line>
  160. 22.95 s gammaloop-nextest-core> 8: core[940e698046960fd5]::panicking::assert_failed_inner<unknown>
  161. 22.95 s gammaloop-nextest-core> at <unknown source file>:<unknown line>
  162. 22.95 s gammaloop-nextest-core> 9: core[940e698046960fd5]::panicking::assert_failed::<alloc[2ea6bcb46fca0c42]::vec::Vec<alloc[2ea6bcb46fca0c42]::vec::Vec<usize>>, alloc[2ea6bcb46fca0c42]::vec::Vec<alloc[2ea6bcb46fca0c42]::vec::Vec<usize>>><unknown>
  163. 22.95 s gammaloop-nextest-core> at <unknown source file>:<unknown line>
  164. 22.95 s gammaloop-nextest-core> 10: gammalooprs[8af0a922d9a4c82d]::uv::approx::tests::factorized_owned_dot_child_cff_matches_direct_3d_for_uncut_self_energy<unknown>
  165. 22.95 s gammaloop-nextest-core> at <unknown source file>:<unknown line>
  166. 22.95 s gammaloop-nextest-core> 11: <gammalooprs[8af0a922d9a4c82d]::uv::approx::tests::factorized_owned_dot_child_cff_matches_direct_3d_for_uncut_self_energy::{closure#0} as core[940e698046960fd5]::ops::function::FnOnce<()>>::call_once<unknown>
  167. 22.95 s gammaloop-nextest-core> at <unknown source file>:<unknown line>
  168. 22.95 s gammaloop-nextest-core> 12: test[75d6903177b1d7e9]::__rust_begin_short_backtrace::<core[940e698046960fd5]::result::Result<(), alloc[2ea6bcb46fca0c42]::string::String>, fn() -> core[940e698046960fd5]::result::Result<(), alloc[2ea6bcb46fca0c42]::string::String>><unknown>
  169. 22.95 s gammaloop-nextest-core> at <unknown source file>:<unknown line>
  170. 22.95 s gammaloop-nextest-core> 13: test[75d6903177b1d7e9]::run_test::{closure#0}<unknown>
  171. 22.95 s gammaloop-nextest-core> at <unknown source file>:<unknown line>
  172. 22.95 s gammaloop-nextest-core> 14: std[bcb96dfbba0ab899]::sys::backtrace::__rust_begin_short_backtrace::<test[75d6903177b1d7e9]::run_test::{closure#1}, ()><unknown>
  173. 22.96 s gammaloop-nextest-core> at <unknown source file>:<unknown line>
  174. 22.96 s gammaloop-nextest-core> 15: <std[bcb96dfbba0ab899]::thread::lifecycle::spawn_unchecked<test[75d6903177b1d7e9]::run_test::{closure#1}, ()>::{closure#1} as core[940e698046960fd5]::ops::function::FnOnce<()>>::call_once::{shim:vtable#0}<unknown>
  175. 22.96 s gammaloop-nextest-core> at <unknown source file>:<unknown line>
  176. 22.96 s gammaloop-nextest-core> 16: <std[bcb96dfbba0ab899]::sys::thread::unix::Thread>::new::thread_start<unknown>
  177. 22.96 s gammaloop-nextest-core> at <unknown source file>:<unknown line>
  178. 22.96 s gammaloop-nextest-core> 17: start_thread<unknown>
  179. 22.96 s gammaloop-nextest-core> at <unknown source file>:<unknown line>
  180. 22.96 s gammaloop-nextest-core> 18: __clone3<unknown>
  181. 22.96 s gammaloop-nextest-core> at <unknown source file>:<unknown line>
  182. 22.96 s gammaloop-nextest-core>
  183. 22.96 s gammaloop-nextest-core> Run with COLORBT_SHOW_HIDDEN=1 environment variable to disable frame filtering.
  184. 22.96 s gammaloop-nextest-core> Run with RUST_BACKTRACE=full to include source snippets.
  185. 22.96 s gammaloop-nextest-core>
  186. 30.55 s gammaloop-nextest-core> ------------
  187. 30.55 s gammaloop-nextest-core> Summary [ 8.952s] 645 tests run: 643 passed, 2 failed, 59 skipped
  188. 30.55 s gammaloop-nextest-core> FAIL [ 0.081s] (555/645) gammalooprs uv::approx::local_4d::tests::dod_one_triangle_keeps_separate_denominator_topologies
  189. 30.55 s gammaloop-nextest-core> stdout ---
  190. 30.55 s gammaloop-nextest-core>
  191. 30.55 s gammaloop-nextest-core> running 1 test
  192. 30.55 s gammaloop-nextest-core> test uv::approx::local_4d::tests::dod_one_triangle_keeps_separate_denominator_topologies ... FAILED
  193. 30.55 s gammaloop-nextest-core>
  194. 30.55 s gammaloop-nextest-core> failures:
  195. 30.55 s gammaloop-nextest-core>
  196. 30.55 s gammaloop-nextest-core> failures:
  197. 30.55 s gammaloop-nextest-core> uv::approx::local_4d::tests::dod_one_triangle_keeps_separate_denominator_topologies
  198. 30.55 s gammaloop-nextest-core>
  199. 30.55 s gammaloop-nextest-core> test result: FAILED. 0 passed; 1 failed; 0 ignored; 0 measured; 695 filtered out; finished in 0.07s
  200. 30.55 s gammaloop-nextest-core>
  201. 30.55 s gammaloop-nextest-core> stderr ---
  202. 30.55 s gammaloop-nextest-core> The application panicked (crashed).
  203. 30.55 s gammaloop-nextest-core> Message: assertion `left == right` failed
  204. 30.55 s gammaloop-nextest-core> left: [[1, 1, 1], [1, 1, 1], [1, 1, 2], [2, 1, 1]]
  205. 30.55 s gammaloop-nextest-core> right: [[1, 1, 1], [1, 1, 2], [2, 1, 1]]
  206. 30.55 s gammaloop-nextest-core> Location: crates/gammalooprs/src/uv/approx/local_4d.rs:1992
  207. 30.55 s gammaloop-nextest-core>
  208. 30.55 s gammaloop-nextest-core> ━━━━━━━━━━━━━━━━━━━━━━━━━━━━━━━━━━ BACKTRACE ━━━━━━━━━━━━━━━━━━━━━━━━━━━━━━━━━━━
  209. 30.55 s gammaloop-nextest-core> 1: <color_eyre[51793ea62743adbd]::config::PanicHook>::panic_report<unknown>
  210. 30.55 s gammaloop-nextest-core> at <unknown source file>:<unknown line>
  211. 30.55 s gammaloop-nextest-core> 2: <color_eyre[51793ea62743adbd]::config::PanicHook>::into_panic_hook::{closure#0}<unknown>
  212. 30.55 s gammaloop-nextest-core> at <unknown source file>:<unknown line>
  213. 30.55 s gammaloop-nextest-core> 3: std[bcb96dfbba0ab899]::panicking::panic_with_hook<unknown>
  214. 30.55 s gammaloop-nextest-core> at <unknown source file>:<unknown line>
  215. 30.55 s gammaloop-nextest-core> 4: std[bcb96dfbba0ab899]::panicking::panic_handler::{closure#0}<unknown>
  216. 30.55 s gammaloop-nextest-core> at <unknown source file>:<unknown line>
  217. 30.55 s gammaloop-nextest-core> 5: std[bcb96dfbba0ab899]::sys::backtrace::__rust_end_short_backtrace::<std[bcb96dfbba0ab899]::panicking::panic_handler::{closure#0}, !><unknown>
  218. 30.55 s gammaloop-nextest-core> at <unknown source file>:<unknown line>
  219. 30.55 s gammaloop-nextest-core> 6: __rustc[6c289b9f9c454d21]::rust_begin_unwind<unknown>
  220. 30.55 s gammaloop-nextest-core> at <unknown source file>:<unknown line>
  221. 30.55 s gammaloop-nextest-core> 7: core[940e698046960fd5]::panicking::panic_fmt<unknown>
  222. 30.55 s gammaloop-nextest-core> at <unknown source file>:<unknown line>
  223. 30.55 s gammaloop-nextest-core> 8: core[940e698046960fd5]::panicking::assert_failed_inner<unknown>
  224. 30.55 s gammaloop-nextest-core> at <unknown source file>:<unknown line>
  225. 30.55 s gammaloop-nextest-core> 9: core[940e698046960fd5]::panicking::assert_failed::<alloc[2ea6bcb46fca0c42]::vec::Vec<[usize; 3usize]>, alloc[2ea6bcb46fca0c42]::vec::Vec<[usize; 3usize]>><unknown>
  226. 30.55 s gammaloop-nextest-core> at <unknown source file>:<unknown line>
  227. 30.55 s gammaloop-nextest-core> 10: gammalooprs[8af0a922d9a4c82d]::uv::approx::local_4d::tests::dod_one_triangle_keeps_separate_denominator_topologies<unknown>
  228. 30.55 s gammaloop-nextest-core> at <unknown source file>:<unknown line>
  229. 30.55 s gammaloop-nextest-core> 11: <gammalooprs[8af0a922d9a4c82d]::uv::approx::local_4d::tests::dod_one_triangle_keeps_separate_denominator_topologies::{closure#0} as core[940e698046960fd5]::ops::function::FnOnce<()>>::call_once<unknown>
  230. 30.55 s gammaloop-nextest-core> at <unknown source file>:<unknown line>
  231. 30.55 s gammaloop-nextest-core> 12: test[75d6903177b1d7e9]::__rust_begin_short_backtrace::<core[940e698046960fd5]::result::Result<(), alloc[2ea6bcb46fca0c42]::string::String>, fn() -> core[940e698046960fd5]::result::Result<(), alloc[2ea6bcb46fca0c42]::string::String>><unknown>
  232. 30.55 s gammaloop-nextest-core> at <unknown source file>:<unknown line>
  233. 30.55 s gammaloop-nextest-core> 13: test[75d6903177b1d7e9]::run_test::{closure#0}<unknown>
  234. 30.55 s gammaloop-nextest-core> at <unknown source file>:<unknown line>
  235. 30.55 s gammaloop-nextest-core> 14: std[bcb96dfbba0ab899]::sys::backtrace::__rust_begin_short_backtrace::<test[75d6903177b1d7e9]::run_test::{closure#1}, ()><unknown>
  236. 30.55 s gammaloop-nextest-core> at <unknown source file>:<unknown line>
  237. 30.55 s gammaloop-nextest-core> 15: <std[bcb96dfbba0ab899]::thread::lifecycle::spawn_unchecked<test[75d6903177b1d7e9]::run_test::{closure#1}, ()>::{closure#1} as core[940e698046960fd5]::ops::function::FnOnce<()>>::call_once::{shim:vtable#0}<unknown>
  238. 30.55 s gammaloop-nextest-core> at <unknown source file>:<unknown line>
  239. 30.55 s gammaloop-nextest-core> 16: <std[bcb96dfbba0ab899]::sys::thread::unix::Thread>::new::thread_start<unknown>
  240. 30.55 s gammaloop-nextest-core> at <unknown source file>:<unknown line>
  241. 30.55 s gammaloop-nextest-core> 17: start_thread<unknown>
  242. 30.55 s gammaloop-nextest-core> at <unknown source file>:<unknown line>
  243. 30.55 s gammaloop-nextest-core> 18: __clone3<unknown>
  244. 30.55 s gammaloop-nextest-core> at <unknown source file>:<unknown line>
  245. 30.55 s gammaloop-nextest-core>
  246. 30.55 s gammaloop-nextest-core> Run with COLORBT_SHOW_HIDDEN=1 environment variable to disable frame filtering.
  247. 30.55 s gammaloop-nextest-core> Run with RUST_BACKTRACE=full to include source snippets.
  248. 30.55 s gammaloop-nextest-core>
  249. 30.55 s gammaloop-nextest-core> FAIL [ 0.225s] (572/645) gammalooprs uv::approx::tests::factorized_owned_dot_child_cff_matches_direct_3d_for_uncut_self_energy
  250. 30.55 s gammaloop-nextest-core> stdout ---
  251. 30.55 s gammaloop-nextest-core>
  252. 30.55 s gammaloop-nextest-core> running 1 test
  253. 30.55 s gammaloop-nextest-core> test uv::approx::tests::factorized_owned_dot_child_cff_matches_direct_3d_for_uncut_self_energy ... FAILED
  254. 30.55 s gammaloop-nextest-core>
  255. 30.55 s gammaloop-nextest-core> failures:
  256. 30.55 s gammaloop-nextest-core>
  257. 30.55 s gammaloop-nextest-core> failures:
  258. 30.55 s gammaloop-nextest-core> uv::approx::tests::factorized_owned_dot_child_cff_matches_direct_3d_for_uncut_self_energy
  259. 30.55 s gammaloop-nextest-core>
  260. 30.55 s gammaloop-nextest-core> test result: FAILED. 0 passed; 1 failed; 0 ignored; 0 measured; 695 filtered out; finished in 0.22s
  261. 30.55 s gammaloop-nextest-core>
  262. 30.55 s gammaloop-nextest-core> stderr ---
  263. 30.55 s gammaloop-nextest-core> The application panicked (crashed).
  264. 30.55 s gammaloop-nextest-core> Message: assertion `left == right` failed
  265. 30.55 s gammaloop-nextest-core> left: [[1, 1, 2], [1, 2], [2, 2, 1], [2, 1], [2, 1], [2, 2, 1], [2, 2, 2, 1], [2, 2, 1]]
  266. 30.55 s gammaloop-nextest-core> right: [[1, 1, 2, 2, 2]]
  267. 30.55 s gammaloop-nextest-core> Location: crates/gammalooprs/src/uv/approx/mod.rs:1471
  268. 30.55 s gammaloop-nextest-core>
  269. 30.55 s gammaloop-nextest-core> ━━━━━━━━━━━━━━━━━━━━━━━━━━━━━━━━━━ BACKTRACE ━━━━━━━━━━━━━━━━━━━━━━━━━━━━━━━━━━━
  270. 30.55 s gammaloop-nextest-core> 1: <color_eyre[51793ea62743adbd]::config::PanicHook>::panic_report<unknown>
  271. 30.55 s gammaloop-nextest-core> at <unknown source file>:<unknown line>
  272. 30.55 s gammaloop-nextest-core> 2: <color_eyre[51793ea62743adbd]::config::PanicHook>::into_panic_hook::{closure#0}<unknown>
  273. 30.55 s gammaloop-nextest-core> at <unknown source file>:<unknown line>
  274. 30.55 s gammaloop-nextest-core> 3: std[bcb96dfbba0ab899]::panicking::panic_with_hook<unknown>
  275. 30.55 s gammaloop-nextest-core> at <unknown source file>:<unknown line>
  276. 30.55 s gammaloop-nextest-core> 4: std[bcb96dfbba0ab899]::panicking::panic_handler::{closure#0}<unknown>
  277. 30.55 s gammaloop-nextest-core> at <unknown source file>:<unknown line>
  278. 30.55 s gammaloop-nextest-core> 5: std[bcb96dfbba0ab899]::sys::backtrace::__rust_end_short_backtrace::<std[bcb96dfbba0ab899]::panicking::panic_handler::{closure#0}, !><unknown>
  279. 30.55 s gammaloop-nextest-core> at <unknown source file>:<unknown line>
  280. 30.55 s gammaloop-nextest-core> 6: __rustc[6c289b9f9c454d21]::rust_begin_unwind<unknown>
  281. 30.55 s gammaloop-nextest-core> at <unknown source file>:<unknown line>
  282. 30.55 s gammaloop-nextest-core> 7: core[940e698046960fd5]::panicking::panic_fmt<unknown>
  283. 30.55 s gammaloop-nextest-core> at <unknown source file>:<unknown line>
  284. 30.55 s gammaloop-nextest-core> 8: core[940e698046960fd5]::panicking::assert_failed_inner<unknown>
  285. 30.55 s gammaloop-nextest-core> at <unknown source file>:<unknown line>
  286. 30.55 s gammaloop-nextest-core> 9: core[940e698046960fd5]::panicking::assert_failed::<alloc[2ea6bcb46fca0c42]::vec::Vec<alloc[2ea6bcb46fca0c42]::vec::Vec<usize>>, alloc[2ea6bcb46fca0c42]::vec::Vec<alloc[2ea6bcb46fca0c42]::vec::Vec<usize>>><unknown>
  287. 30.55 s gammaloop-nextest-core> at <unknown source file>:<unknown line>
  288. 30.55 s gammaloop-nextest-core> 10: gammalooprs[8af0a922d9a4c82d]::uv::approx::tests::factorized_owned_dot_child_cff_matches_direct_3d_for_uncut_self_energy<unknown>
  289. 30.55 s gammaloop-nextest-core> at <unknown source file>:<unknown line>
  290. 30.55 s gammaloop-nextest-core> 11: <gammalooprs[8af0a922d9a4c82d]::uv::approx::tests::factorized_owned_dot_child_cff_matches_direct_3d_for_uncut_self_energy::{closure#0} as core[940e698046960fd5]::ops::function::FnOnce<()>>::call_once<unknown>
  291. 30.55 s gammaloop-nextest-core> at <unknown source file>:<unknown line>
  292. 30.55 s gammaloop-nextest-core> 12: test[75d6903177b1d7e9]::__rust_begin_short_backtrace::<core[940e698046960fd5]::result::Result<(), alloc[2ea6bcb46fca0c42]::string::String>, fn() -> core[940e698046960fd5]::result::Result<(), alloc[2ea6bcb46fca0c42]::string::String>><unknown>
  293. 30.55 s gammaloop-nextest-core> at <unknown source file>:<unknown line>
  294. 30.55 s gammaloop-nextest-core> 13: test[75d6903177b1d7e9]::run_test::{closure#0}<unknown>
  295. 30.55 s gammaloop-nextest-core> at <unknown source file>:<unknown line>
  296. 30.55 s gammaloop-nextest-core> 14: std[bcb96dfbba0ab899]::sys::backtrace::__rust_begin_short_backtrace::<test[75d6903177b1d7e9]::run_test::{closure#1}, ()><unknown>
  297. 30.55 s gammaloop-nextest-core> at <unknown source file>:<unknown line>
  298. 30.55 s gammaloop-nextest-core> 15: <std[bcb96dfbba0ab899]::thread::lifecycle::spawn_unchecked<test[75d6903177b1d7e9]::run_test::{closure#1}, ()>::{closure#1} as core[940e698046960fd5]::ops::function::FnOnce<()>>::call_once::{shim:vtable#0}<unknown>
  299. 30.55 s gammaloop-nextest-core> at <unknown source file>:<unknown line>
  300. 30.55 s gammaloop-nextest-core> 16: <std[bcb96dfbba0ab899]::sys::thread::unix::Thread>::new::thread_start<unknown>
  301. 30.55 s gammaloop-nextest-core> at <unknown source file>:<unknown line>
  302. 30.55 s gammaloop-nextest-core> 17: start_thread<unknown>
  303. 30.55 s gammaloop-nextest-core> at <unknown source file>:<unknown line>
  304. 30.55 s gammaloop-nextest-core> 18: __clone3<unknown>
  305. 30.55 s gammaloop-nextest-core> at <unknown source file>:<unknown line>
  306. 30.55 s gammaloop-nextest-core>
  307. 30.55 s gammaloop-nextest-core> Run with COLORBT_SHOW_HIDDEN=1 environment variable to disable frame filtering.
  308. 30.55 s gammaloop-nextest-core> Run with RUST_BACKTRACE=full to include source snippets.
  309. 30.55 s gammaloop-nextest-core>
  310. 30.62 s gammaloop-nextest-core> error: test run failed
  311. 30.64 s gammaloop-nextest-core>
  312. 30.64 s gammaloop-nextest-core> ========== nextest test summary ==========
  313. 30.64 s gammaloop-nextest-core> report: target/nextest/ci_gammaloop/junit.xml
  314. 30.64 s gammaloop-nextest-core> tests: 645, failures: 2, errors: 0
  315. 30.64 s gammaloop-nextest-core>
  316. 30.64 s gammaloop-nextest-core> 1. gammalooprs::uv::approx::local_4d::tests::dod_one_triangle_keeps_separate_denominator_topologies
  317. 30.64 s gammaloop-nextest-core> failure: test failure with exit code 101
  318. 30.64 s gammaloop-nextest-core> system-out
  319. 30.64 s gammaloop-nextest-core> running 1 test
  320. 30.64 s gammaloop-nextest-core> test uv::approx::local_4d::tests::dod_one_triangle_keeps_separate_denominator_topologies ... FAILED
  321. 30.64 s gammaloop-nextest-core>
  322. 30.64 s gammaloop-nextest-core> failures:
  323. 30.64 s gammaloop-nextest-core>
  324. 30.64 s gammaloop-nextest-core> failures:
  325. 30.64 s gammaloop-nextest-core> uv::approx::local_4d::tests::dod_one_triangle_keeps_separate_denominator_topologies
  326. 30.64 s gammaloop-nextest-core>
  327. 30.64 s gammaloop-nextest-core> test result: FAILED. 0 passed; 1 failed; 0 ignored; 0 measured; 695 filtered out; finished in 0.07s
  328. 30.64 s gammaloop-nextest-core> system-err
  329. 30.64 s gammaloop-nextest-core> The application panicked (crashed).
  330. 30.64 s gammaloop-nextest-core> Message: assertion `left == right` failed
  331. 30.64 s gammaloop-nextest-core> left: [[1, 1, 1], [1, 1, 1], [1, 1, 2], [2, 1, 1]]
  332. 30.64 s gammaloop-nextest-core> right: [[1, 1, 1], [1, 1, 2], [2, 1, 1]]
  333. 30.64 s gammaloop-nextest-core> Location: crates/gammalooprs/src/uv/approx/local_4d.rs:1992
  334. 30.64 s gammaloop-nextest-core>
  335. 30.64 s gammaloop-nextest-core> ━━━━━━━━━━━━━━━━━━━━━━━━━━━━━━━━━━ BACKTRACE ━━━━━━━━━━━━━━━━━━━━━━━━━━━━━━━━━━━
  336. 30.64 s gammaloop-nextest-core> 1: <color_eyre[51793ea62743adbd]::config::PanicHook>::panic_report<unknown>
  337. 30.64 s gammaloop-nextest-core> at <unknown source file>:<unknown line>
  338. 30.64 s gammaloop-nextest-core> 2: <color_eyre[51793ea62743adbd]::config::PanicHook>::into_panic_hook::{closure#0}<unknown>
  339. 30.64 s gammaloop-nextest-core> at <unknown source file>:<unknown line>
  340. 30.64 s gammaloop-nextest-core> 3: std[bcb96dfbba0ab899]::panicking::panic_with_hook<unknown>
  341. 30.64 s gammaloop-nextest-core> at <unknown source file>:<unknown line>
  342. 30.64 s gammaloop-nextest-core> 4: std[bcb96dfbba0ab899]::panicking::panic_handler::{closure#0}<unknown>
  343. 30.64 s gammaloop-nextest-core> at <unknown source file>:<unknown line>
  344. 30.64 s gammaloop-nextest-core> 5: std[bcb96dfbba0ab899]::sys::backtrace::__rust_end_short_backtrace::<std[bcb96dfbba0ab899]::panicking::panic_handler::{closure#0}, !><unknown>
  345. 30.64 s gammaloop-nextest-core> at <unknown source file>:<unknown line>
  346. 30.64 s gammaloop-nextest-core> 6: __rustc[6c289b9f9c454d21]::rust_begin_unwind<unknown>
  347. 30.65 s gammaloop-nextest-core> at <unknown source file>:<unknown line>
  348. 30.65 s gammaloop-nextest-core> 7: core[940e698046960fd5]::panicking::panic_fmt<unknown>
  349. 30.65 s gammaloop-nextest-core> at <unknown source file>:<unknown line>
  350. 30.65 s gammaloop-nextest-core> 8: core[940e698046960fd5]::panicking::assert_failed_inner<unknown>
  351. 30.65 s gammaloop-nextest-core> at <unknown source file>:<unknown line>
  352. 30.65 s gammaloop-nextest-core> 9: core[940e698046960fd5]::panicking::assert_failed::<alloc[2ea6bcb46fca0c42]::vec::Vec<[usize; 3usize]>, alloc[2ea6bcb46fca0c42]::vec::Vec<[usize; 3usize]>><unknown>
  353. 30.65 s gammaloop-nextest-core> at <unknown source file>:<unknown line>
  354. 30.65 s gammaloop-nextest-core> 10: gammalooprs[8af0a922d9a4c82d]::uv::approx::local_4d::tests::dod_one_triangle_keeps_separate_denominator_topologies<unknown>
  355. 30.65 s gammaloop-nextest-core> at <unknown source file>:<unknown line>
  356. 30.65 s gammaloop-nextest-core> 11: <gammalooprs[8af0a922d9a4c82d]::uv::approx::local_4d::tests::dod_one_triangle_keeps_separate_denominator_topologies::{closure#0} as core[940e698046960fd5]::ops::function::FnOnce<()>>::call_once<unknown>
  357. 30.65 s gammaloop-nextest-core> at <unknown source file>:<unknown line>
  358. 30.65 s gammaloop-nextest-core> 12: test[75d6903177b1d7e9]::__rust_begin_short_backtrace::<core[940e698046960fd5]::result::Result<(), alloc[2ea6bcb46fca0c42]::string::String>, fn() -> core[940e698046960fd5]::result::Result<(), alloc[2ea6bcb46fca0c42]::string::String>><unknown>
  359. 30.65 s gammaloop-nextest-core> at <unknown source file>:<unknown line>
  360. 30.65 s gammaloop-nextest-core> 13: test[75d6903177b1d7e9]::run_test::{closure#0}<unknown>
  361. 30.65 s gammaloop-nextest-core> at <unknown source file>:<unknown line>
  362. 30.65 s gammaloop-nextest-core> 14: std[bcb96dfbba0ab899]::sys::backtrace::__rust_begin_short_backtrace::<test[75d6903177b1d7e9]::run_test::{closure#1}, ()><unknown>
  363. 30.65 s gammaloop-nextest-core> at <unknown source file>:<unknown line>
  364. 30.65 s gammaloop-nextest-core> 15: <std[bcb96dfbba0ab899]::thread::lifecycle::spawn_unchecked<test[75d6903177b1d7e9]::run_test::{closure#1}, ()>::{closure#1} as core[940e698046960fd5]::ops::function::FnOnce<()>>::call_once::{shim:vtable#0}<unknown>
  365. 30.65 s gammaloop-nextest-core> at <unknown source file>:<unknown line>
  366. 30.65 s gammaloop-nextest-core> 16: <std[bcb96dfbba0ab899]::sys::thread::unix::Thread>::new::thread_start<unknown>
  367. 30.65 s gammaloop-nextest-core> at <unknown source file>:<unknown line>
  368. 30.65 s gammaloop-nextest-core> 17: start_thread<unknown>
  369. 30.65 s gammaloop-nextest-core> at <unknown source file>:<unknown line>
  370. 30.65 s gammaloop-nextest-core> 18: __clone3<unknown>
  371. 30.65 s gammaloop-nextest-core> at <unknown source file>:<unknown line>
  372. 30.65 s gammaloop-nextest-core>
  373. 30.65 s gammaloop-nextest-core> Run with COLORBT_SHOW_HIDDEN=1 environment variable to disable frame filtering.
  374. 30.65 s gammaloop-nextest-core> Run with RUST_BACKTRACE=full to include source snippets.
  375. 30.65 s gammaloop-nextest-core>
  376. 30.65 s gammaloop-nextest-core> 2. gammalooprs::uv::approx::tests::factorized_owned_dot_child_cff_matches_direct_3d_for_uncut_self_energy
  377. 30.65 s gammaloop-nextest-core> failure: test failure with exit code 101
  378. 30.65 s gammaloop-nextest-core> system-out
  379. 30.65 s gammaloop-nextest-core> running 1 test
  380. 30.65 s gammaloop-nextest-core> test uv::approx::tests::factorized_owned_dot_child_cff_matches_direct_3d_for_uncut_self_energy ... FAILED
  381. 30.65 s gammaloop-nextest-core>
  382. 30.65 s gammaloop-nextest-core> failures:
  383. 30.65 s gammaloop-nextest-core>
  384. 30.65 s gammaloop-nextest-core> failures:
  385. 30.65 s gammaloop-nextest-core> uv::approx::tests::factorized_owned_dot_child_cff_matches_direct_3d_for_uncut_self_energy
  386. 30.65 s gammaloop-nextest-core>
  387. 30.65 s gammaloop-nextest-core> test result: FAILED. 0 passed; 1 failed; 0 ignored; 0 measured; 695 filtered out; finished in 0.22s
  388. 30.65 s gammaloop-nextest-core> system-err
  389. 30.65 s gammaloop-nextest-core> The application panicked (crashed).
  390. 30.65 s gammaloop-nextest-core> Message: assertion `left == right` failed
  391. 30.65 s gammaloop-nextest-core> left: [[1, 1, 2], [1, 2], [2, 2, 1], [2, 1], [2, 1], [2, 2, 1], [2, 2, 2, 1], [2, 2, 1]]
  392. 30.65 s gammaloop-nextest-core> right: [[1, 1, 2, 2, 2]]
  393. 30.65 s gammaloop-nextest-core> Location: crates/gammalooprs/src/uv/approx/mod.rs:1471
  394. 30.65 s gammaloop-nextest-core>
  395. 30.65 s gammaloop-nextest-core> ━━━━━━━━━━━━━━━━━━━━━━━━━━━━━━━━━━ BACKTRACE ━━━━━━━━━━━━━━━━━━━━━━━━━━━━━━━━━━━
  396. 30.65 s gammaloop-nextest-core> 1: <color_eyre[51793ea62743adbd]::config::PanicHook>::panic_report<unknown>
  397. 30.65 s gammaloop-nextest-core> at <unknown source file>:<unknown line>
  398. 30.65 s gammaloop-nextest-core> 2: <color_eyre[51793ea62743adbd]::config::PanicHook>::into_panic_hook::{closure#0}<unknown>
  399. 30.65 s gammaloop-nextest-core> at <unknown source file>:<unknown line>
  400. 30.65 s gammaloop-nextest-core> 3: std[bcb96dfbba0ab899]::panicking::panic_with_hook<unknown>
  401. 30.65 s gammaloop-nextest-core> at <unknown source file>:<unknown line>
  402. 30.65 s gammaloop-nextest-core> 4: std[bcb96dfbba0ab899]::panicking::panic_handler::{closure#0}<unknown>
  403. 30.65 s gammaloop-nextest-core> at <unknown source file>:<unknown line>
  404. 30.65 s gammaloop-nextest-core> 5: std[bcb96dfbba0ab899]::sys::backtrace::__rust_end_short_backtrace::<std[bcb96dfbba0ab899]::panicking::panic_handler::{closure#0}, !><unknown>
  405. 30.65 s gammaloop-nextest-core> at <unknown source file>:<unknown line>
  406. 30.65 s gammaloop-nextest-core> 6: __rustc[6c289b9f9c454d21]::rust_begin_unwind<unknown>
  407. 30.65 s gammaloop-nextest-core> at <unknown source file>:<unknown line>
  408. 30.65 s gammaloop-nextest-core> 7: core[940e698046960fd5]::panicking::panic_fmt<unknown>
  409. 30.65 s gammaloop-nextest-core> at <unknown source file>:<unknown line>
  410. 30.65 s gammaloop-nextest-core> 8: core[940e698046960fd5]::panicking::assert_failed_inner<unknown>
  411. 30.65 s gammaloop-nextest-core> at <unknown source file>:<unknown line>
  412. 30.65 s gammaloop-nextest-core> 9: core[940e698046960fd5]::panicking::assert_failed::<alloc[2ea6bcb46fca0c42]::vec::Vec<alloc[2ea6bcb46fca0c42]::vec::Vec<usize>>, alloc[2ea6bcb46fca0c42]::vec::Vec<alloc[2ea6bcb46fca0c42]::vec::Vec<usize>>><unknown>
  413. 30.65 s gammaloop-nextest-core> at <unknown source file>:<unknown line>
  414. 30.65 s gammaloop-nextest-core> 10: gammalooprs[8af0a922d9a4c82d]::uv::approx::tests::factorized_owned_dot_child_cff_matches_direct_3d_for_uncut_self_energy<unknown>
  415. 30.65 s gammaloop-nextest-core> at <unknown source file>:<unknown line>
  416. 30.65 s gammaloop-nextest-core> 11: <gammalooprs[8af0a922d9a4c82d]::uv::approx::tests::factorized_owned_dot_child_cff_matches_direct_3d_for_uncut_self_energy::{closure#0} as core[940e698046960fd5]::ops::function::FnOnce<()>>::call_once<unknown>
  417. 30.65 s gammaloop-nextest-core> at <unknown source file>:<unknown line>
  418. 30.65 s gammaloop-nextest-core> 12: test[75d6903177b1d7e9]::__rust_begin_short_backtrace::<core[940e698046960fd5]::result::Result<(), alloc[2ea6bcb46fca0c42]::string::String>, fn() -> core[940e698046960fd5]::result::Result<(), alloc[2ea6bcb46fca0c42]::string::String>><unknown>
  419. 30.65 s gammaloop-nextest-core> at <unknown source file>:<unknown line>
  420. 30.65 s gammaloop-nextest-core> 13: test[75d6903177b1d7e9]::run_test::{closure#0}<unknown>
  421. 30.65 s gammaloop-nextest-core> at <unknown source file>:<unknown line>
  422. 30.65 s gammaloop-nextest-core> 14: std[bcb96dfbba0ab899]::sys::backtrace::__rust_begin_short_backtrace::<test[75d6903177b1d7e9]::run_test::{closure#1}, ()><unknown>
  423. 30.65 s gammaloop-nextest-core> at <unknown source file>:<unknown line>
  424. 30.65 s gammaloop-nextest-core> 15: <std[bcb96dfbba0ab899]::thread::lifecycle::spawn_unchecked<test[75d6903177b1d7e9]::run_test::{closure#1}, ()>::{closure#1} as core[940e698046960fd5]::ops::function::FnOnce<()>>::call_once::{shim:vtable#0}<unknown>
  425. 30.65 s gammaloop-nextest-core> at <unknown source file>:<unknown line>
  426. 30.65 s gammaloop-nextest-core> 16: <std[bcb96dfbba0ab899]::sys::thread::unix::Thread>::new::thread_start<unknown>
  427. 30.65 s gammaloop-nextest-core> at <unknown source file>:<unknown line>
  428. 30.65 s gammaloop-nextest-core> 17: start_thread<unknown>
  429. 30.65 s gammaloop-nextest-core> at <unknown source file>:<unknown line>
  430. 30.65 s gammaloop-nextest-core> 18: __clone3<unknown>
  431. 30.65 s gammaloop-nextest-core> at <unknown source file>:<unknown line>
  432. 30.65 s gammaloop-nextest-core>
  433. 30.65 s gammaloop-nextest-core> Run with COLORBT_SHOW_HIDDEN=1 environment variable to disable frame filtering.
  434. 30.65 s gammaloop-nextest-core> Run with RUST_BACKTRACE=full to include source snippets.
  435. 30.65 s gammaloop-nextest-core> =========================================
  436. 30.66 s gammaloop-nextest-core> Extracting 1 binary, 1 build script output directory, and 1 linked path to /build/nextest-archive-8Ku8gR
  437. 30.72 s gammaloop-nextest-core> Extracted 7 files to /build/nextest-archive-8Ku8gR in 0.06s
  438. 30.73 s gammaloop-nextest-core> ------------
  439. 30.73 s gammaloop-nextest-core> Nextest run ID 520caa1d-18bb-4023-b1f4-d0ca0bbda3e2 with nextest profile: ci_gammaloop
  440. 30.73 s gammaloop-nextest-core> Starting 119 tests across 1 binary
  441. 31.64 s gammaloop-nextest-core> ------------
  442. 31.64 s gammaloop-nextest-core> Summary [ 0.910s] 119 tests run: 119 passed, 0 skipped
  443. 31.67 s gammaloop-nextest-core>
  444. 31.67 s gammaloop-nextest-core> ========== nextest test summary ==========
  445. 31.67 s gammaloop-nextest-core> report: target/nextest/ci_gammaloop/junit.xml
  446. 31.67 s gammaloop-nextest-core> tests: 119, failures: 0, errors: 0
  447. 31.67 s gammaloop-nextest-core> No failing testcases found.
  448. 31.67 s gammaloop-nextest-core> =========================================
  449. 31.71 s error: Cannot build '/nix/store/bcc3gg1akl605y0c3km3gjg8nsqsjzv8-gammaloop-nextest-core.drv'.
  450. 31.71 s Reason: builder failed with exit code 100.
  451. 31.71 s Output paths:
  452. 31.71 s /nix/store/i7lvgxhj7vpsi0jgq7jfdhgg9f5m1qi3-gammaloop-nextest-core
  453. 31.71 s Last 429 log lines:
  454. 31.71 s > Extracting 4 binaries (including 1 non-test binary), 1 build script output directory, and 2 linked paths to /build/nextest-archive-1WMVsf
  455. 31.71 s > Extracted 20 files to /build/nextest-archive-1WMVsf in 0.66s
  456. 31.71 s > ------------
  457. 31.71 s > Nextest run ID e9ccbace-fcc8-4cd6-83d4-8e42930ad43b with nextest profile: ci_gammaloop
  458. 31.71 s > Starting 377 tests across 3 binaries
  459. 31.71 s > ------------
  460. 31.71 s > Summary [ 1.222s] 377 tests run: 377 passed, 0 skipped
  461. 31.71 s >
  462. 31.71 s > ========== nextest test summary ==========
  463. 31.71 s > report: target/nextest/ci_gammaloop/junit.xml
  464. 31.71 s > tests: 377, failures: 0, errors: 0
  465. 31.71 s > No failing testcases found.
  466. 31.71 s > =========================================
  467. 31.71 s > Extracting 1 binary and 1 linked path to /build/nextest-archive-Jm2tCT
  468. 31.71 s > Extracted 7 files to /build/nextest-archive-Jm2tCT in 0.06s
  469. 31.71 s > ------------
  470. 31.71 s > Nextest run ID 5bbcc898-c823-4d8d-bec8-5c3ab7ed262e with nextest profile: ci_gammaloop
  471. 31.71 s > Starting 19 tests across 1 binary
  472. 31.71 s > ------------
  473. 31.71 s > Summary [ 0.010s] 19 tests run: 19 passed, 0 skipped
  474. 31.71 s >
  475. 31.71 s > ========== nextest test summary ==========
  476. 31.71 s > report: target/nextest/ci_gammaloop/junit.xml
  477. 31.71 s > tests: 19, failures: 0, errors: 0
  478. 31.71 s > No failing testcases found.
  479. 31.71 s > =========================================
  480. 31.71 s > Extracting 1 binary to /build/nextest-archive-emB78B
  481. 31.71 s > Extracted 4 files to /build/nextest-archive-emB78B in 0.03s
  482. 31.71 s > ------------
  483. 31.71 s > Nextest run ID 42ec92e2-bfc3-45f1-8d9f-72bbb8ab861f with nextest profile: ci_gammaloop
  484. 31.71 s > Starting 0 tests across 1 binary
  485. 31.71 s > ------------
  486. 31.71 s > Summary [ 0.000s] 0 tests run: 0 passed, 0 skipped
  487. 31.71 s >
  488. 31.71 s > ========== nextest test summary ==========
  489. 31.71 s > report: target/nextest/ci_gammaloop/junit.xml
  490. 31.71 s > tests: 0, failures: 0, errors: 0
  491. 31.71 s > No failing testcases found.
  492. 31.71 s > =========================================
  493. 31.71 s > Extracting 4 binaries, 1 build script output directory, and 2 linked paths to /build/nextest-archive-wM1TvL
  494. 31.71 s > Extracted 18 files to /build/nextest-archive-wM1TvL in 0.43s
  495. 31.71 s > ------------
  496. 31.71 s > Nextest run ID 72bf24a3-3629-4554-a369-b0ce45f6f568 with nextest profile: ci_gammaloop
  497. 31.71 s > Starting 645 tests across 4 binaries (59 tests skipped, including 58 tests via profile.ci_gammaloop.default-filter)
  498. 31.71 s > FAIL [ 0.081s] (555/645) gammalooprs uv::approx::local_4d::tests::dod_one_triangle_keeps_separate_denominator_topologies
  499. 31.71 s > stdout ---
  500. 31.71 s >
  501. 31.71 s > running 1 test
  502. 31.71 s > test uv::approx::local_4d::tests::dod_one_triangle_keeps_separate_denominator_topologies ... FAILED
  503. 31.71 s >
  504. 31.71 s > failures:
  505. 31.71 s >
  506. 31.71 s > failures:
  507. 31.71 s > uv::approx::local_4d::tests::dod_one_triangle_keeps_separate_denominator_topologies
  508. 31.71 s >
  509. 31.71 s > test result: FAILED. 0 passed; 1 failed; 0 ignored; 0 measured; 695 filtered out; finished in 0.07s
  510. 31.71 s >
  511. 31.71 s > stderr ---
  512. 31.71 s > The application panicked (crashed).
  513. 31.71 s > Message: assertion `left == right` failed
  514. 31.71 s > left: [[1, 1, 1], [1, 1, 1], [1, 1, 2], [2, 1, 1]]
  515. 31.71 s > right: [[1, 1, 1], [1, 1, 2], [2, 1, 1]]
  516. 31.71 s > Location: crates/gammalooprs/src/uv/approx/local_4d.rs:1992
  517. 31.71 s >
  518. 31.71 s > ━━━━━━━━━━━━━━━━━━━━━━━━━━━━━━━━━━ BACKTRACE ━━━━━━━━━━━━━━━━━━━━━━━━━━━━━━━━━━━
  519. 31.71 s > 1: <color_eyre[51793ea62743adbd]::config::PanicHook>::panic_report<unknown>
  520. 31.71 s > at <unknown source file>:<unknown line>
  521. 31.71 s > 2: <color_eyre[51793ea62743adbd]::config::PanicHook>::into_panic_hook::{closure#0}<unknown>
  522. 31.71 s > at <unknown source file>:<unknown line>
  523. 31.71 s > 3: std[bcb96dfbba0ab899]::panicking::panic_with_hook<unknown>
  524. 31.71 s > at <unknown source file>:<unknown line>
  525. 31.71 s > 4: std[bcb96dfbba0ab899]::panicking::panic_handler::{closure#0}<unknown>
  526. 31.71 s > at <unknown source file>:<unknown line>
  527. 31.71 s > 5: std[bcb96dfbba0ab899]::sys::backtrace::__rust_end_short_backtrace::<std[bcb96dfbba0ab899]::panicking::panic_handler::{closure#0}, !><unknown>
  528. 31.71 s > at <unknown source file>:<unknown line>
  529. 31.71 s > 6: __rustc[6c289b9f9c454d21]::rust_begin_unwind<unknown>
  530. 31.71 s > at <unknown source file>:<unknown line>
  531. 31.71 s > 7: core[940e698046960fd5]::panicking::panic_fmt<unknown>
  532. 31.71 s > at <unknown source file>:<unknown line>
  533. 31.71 s > 8: core[940e698046960fd5]::panicking::assert_failed_inner<unknown>
  534. 31.71 s > at <unknown source file>:<unknown line>
  535. 31.71 s > 9: core[940e698046960fd5]::panicking::assert_failed::<alloc[2ea6bcb46fca0c42]::vec::Vec<[usize; 3usize]>, alloc[2ea6bcb46fca0c42]::vec::Vec<[usize; 3usize]>><unknown>
  536. 31.71 s > at <unknown source file>:<unknown line>
  537. 31.71 s > 10: gammalooprs[8af0a922d9a4c82d]::uv::approx::local_4d::tests::dod_one_triangle_keeps_separate_denominator_topologies<unknown>
  538. 31.71 s > at <unknown source file>:<unknown line>
  539. 31.71 s > 11: <gammalooprs[8af0a922d9a4c82d]::uv::approx::local_4d::tests::dod_one_triangle_keeps_separate_denominator_topologies::{closure#0} as core[940e698046960fd5]::ops::function::FnOnce<()>>::call_once<unknown>
  540. 31.71 s > at <unknown source file>:<unknown line>
  541. 31.71 s > 12: test[75d6903177b1d7e9]::__rust_begin_short_backtrace::<core[940e698046960fd5]::result::Result<(), alloc[2ea6bcb46fca0c42]::string::String>, fn() -> core[940e698046960fd5]::result::Result<(), alloc[2ea6bcb46fca0c42]::string::String>><unknown>
  542. 31.71 s > at <unknown source file>:<unknown line>
  543. 31.71 s > 13: test[75d6903177b1d7e9]::run_test::{closure#0}<unknown>
  544. 31.71 s > at <unknown source file>:<unknown line>
  545. 31.71 s > 14: std[bcb96dfbba0ab899]::sys::backtrace::__rust_begin_short_backtrace::<test[75d6903177b1d7e9]::run_test::{closure#1}, ()><unknown>
  546. 31.71 s > at <unknown source file>:<unknown line>
  547. 31.71 s > 15: <std[bcb96dfbba0ab899]::thread::lifecycle::spawn_unchecked<test[75d6903177b1d7e9]::run_test::{closure#1}, ()>::{closure#1} as core[940e698046960fd5]::ops::function::FnOnce<()>>::call_once::{shim:vtable#0}<unknown>
  548. 31.71 s > at <unknown source file>:<unknown line>
  549. 31.71 s > 16: <std[bcb96dfbba0ab899]::sys::thread::unix::Thread>::new::thread_start<unknown>
  550. 31.71 s > at <unknown source file>:<unknown line>
  551. 31.71 s > 17: start_thread<unknown>
  552. 31.71 s > at <unknown source file>:<unknown line>
  553. 31.71 s > 18: __clone3<unknown>
  554. 31.71 s > at <unknown source file>:<unknown line>
  555. 31.71 s >
  556. 31.71 s > Run with COLORBT_SHOW_HIDDEN=1 environment variable to disable frame filtering.
  557. 31.71 s > Run with RUST_BACKTRACE=full to include source snippets.
  558. 31.71 s >
  559. 31.71 s > FAIL [ 0.225s] (572/645) gammalooprs uv::approx::tests::factorized_owned_dot_child_cff_matches_direct_3d_for_uncut_self_energy
  560. 31.71 s > stdout ---
  561. 31.71 s >
  562. 31.71 s > running 1 test
  563. 31.71 s > test uv::approx::tests::factorized_owned_dot_child_cff_matches_direct_3d_for_uncut_self_energy ... FAILED
  564. 31.71 s >
  565. 31.71 s > failures:
  566. 31.71 s >
  567. 31.71 s > failures:
  568. 31.71 s > uv::approx::tests::factorized_owned_dot_child_cff_matches_direct_3d_for_uncut_self_energy
  569. 31.71 s >
  570. 31.71 s > test result: FAILED. 0 passed; 1 failed; 0 ignored; 0 measured; 695 filtered out; finished in 0.22s
  571. 31.71 s >
  572. 31.71 s > stderr ---
  573. 31.71 s > The application panicked (crashed).
  574. 31.71 s > Message: assertion `left == right` failed
  575. 31.71 s > left: [[1, 1, 2], [1, 2], [2, 2, 1], [2, 1], [2, 1], [2, 2, 1], [2, 2, 2, 1], [2, 2, 1]]
  576. 31.71 s > right: [[1, 1, 2, 2, 2]]
  577. 31.71 s > Location: crates/gammalooprs/src/uv/approx/mod.rs:1471
  578. 31.71 s >
  579. 31.71 s > ━━━━━━━━━━━━━━━━━━━━━━━━━━━━━━━━━━ BACKTRACE ━━━━━━━━━━━━━━━━━━━━━━━━━━━━━━━━━━━
  580. 31.71 s > 1: <color_eyre[51793ea62743adbd]::config::PanicHook>::panic_report<unknown>
  581. 31.71 s > at <unknown source file>:<unknown line>
  582. 31.71 s > 2: <color_eyre[51793ea62743adbd]::config::PanicHook>::into_panic_hook::{closure#0}<unknown>
  583. 31.71 s > at <unknown source file>:<unknown line>
  584. 31.71 s > 3: std[bcb96dfbba0ab899]::panicking::panic_with_hook<unknown>
  585. 31.71 s > at <unknown source file>:<unknown line>
  586. 31.71 s > 4: std[bcb96dfbba0ab899]::panicking::panic_handler::{closure#0}<unknown>
  587. 31.71 s > at <unknown source file>:<unknown line>
  588. 31.71 s > 5: std[bcb96dfbba0ab899]::sys::backtrace::__rust_end_short_backtrace::<std[bcb96dfbba0ab899]::panicking::panic_handler::{closure#0}, !><unknown>
  589. 31.71 s > at <unknown source file>:<unknown line>
  590. 31.71 s > 6: __rustc[6c289b9f9c454d21]::rust_begin_unwind<unknown>
  591. 31.71 s > at <unknown source file>:<unknown line>
  592. 31.71 s > 7: core[940e698046960fd5]::panicking::panic_fmt<unknown>
  593. 31.71 s > at <unknown source file>:<unknown line>
  594. 31.71 s > 8: core[940e698046960fd5]::panicking::assert_failed_inner<unknown>
  595. 31.71 s > at <unknown source file>:<unknown line>
  596. 31.71 s > 9: core[940e698046960fd5]::panicking::assert_failed::<alloc[2ea6bcb46fca0c42]::vec::Vec<alloc[2ea6bcb46fca0c42]::vec::Vec<usize>>, alloc[2ea6bcb46fca0c42]::vec::Vec<alloc[2ea6bcb46fca0c42]::vec::Vec<usize>>><unknown>
  597. 31.71 s > at <unknown source file>:<unknown line>
  598. 31.71 s > 10: gammalooprs[8af0a922d9a4c82d]::uv::approx::tests::factorized_owned_dot_child_cff_matches_direct_3d_for_uncut_self_energy<unknown>
  599. 31.71 s > at <unknown source file>:<unknown line>
  600. 31.71 s > 11: <gammalooprs[8af0a922d9a4c82d]::uv::approx::tests::factorized_owned_dot_child_cff_matches_direct_3d_for_uncut_self_energy::{closure#0} as core[940e698046960fd5]::ops::function::FnOnce<()>>::call_once<unknown>
  601. 31.71 s > at <unknown source file>:<unknown line>
  602. 31.71 s > 12: test[75d6903177b1d7e9]::__rust_begin_short_backtrace::<core[940e698046960fd5]::result::Result<(), alloc[2ea6bcb46fca0c42]::string::String>, fn() -> core[940e698046960fd5]::result::Result<(), alloc[2ea6bcb46fca0c42]::string::String>><unknown>
  603. 31.71 s > at <unknown source file>:<unknown line>
  604. 31.71 s > 13: test[75d6903177b1d7e9]::run_test::{closure#0}<unknown>
  605. 31.71 s > at <unknown source file>:<unknown line>
  606. 31.71 s > 14: std[bcb96dfbba0ab899]::sys::backtrace::__rust_begin_short_backtrace::<test[75d6903177b1d7e9]::run_test::{closure#1}, ()><unknown>
  607. 31.71 s > at <unknown source file>:<unknown line>
  608. 31.71 s > 15: <std[bcb96dfbba0ab899]::thread::lifecycle::spawn_unchecked<test[75d6903177b1d7e9]::run_test::{closure#1}, ()>::{closure#1} as core[940e698046960fd5]::ops::function::FnOnce<()>>::call_once::{shim:vtable#0}<unknown>
  609. 31.71 s > at <unknown source file>:<unknown line>
  610. 31.71 s > 16: <std[bcb96dfbba0ab899]::sys::thread::unix::Thread>::new::thread_start<unknown>
  611. 31.71 s > at <unknown source file>:<unknown line>
  612. 31.71 s > 17: start_thread<unknown>
  613. 31.71 s > at <unknown source file>:<unknown line>
  614. 31.71 s > 18: __clone3<unknown>
  615. 31.71 s > at <unknown source file>:<unknown line>
  616. 31.71 s >
  617. 31.71 s > Run with COLORBT_SHOW_HIDDEN=1 environment variable to disable frame filtering.
  618. 31.71 s > Run with RUST_BACKTRACE=full to include source snippets.
  619. 31.71 s >
  620. 31.71 s > ------------
  621. 31.71 s > Summary [ 8.952s] 645 tests run: 643 passed, 2 failed, 59 skipped
  622. 31.71 s > FAIL [ 0.081s] (555/645) gammalooprs uv::approx::local_4d::tests::dod_one_triangle_keeps_separate_denominator_topologies
  623. 31.71 s > stdout ---
  624. 31.71 s >
  625. 31.71 s > running 1 test
  626. 31.71 s > test uv::approx::local_4d::tests::dod_one_triangle_keeps_separate_denominator_topologies ... FAILED
  627. 31.71 s >
  628. 31.71 s > failures:
  629. 31.71 s >
  630. 31.71 s > failures:
  631. 31.71 s > uv::approx::local_4d::tests::dod_one_triangle_keeps_separate_denominator_topologies
  632. 31.71 s >
  633. 31.71 s > test result: FAILED. 0 passed; 1 failed; 0 ignored; 0 measured; 695 filtered out; finished in 0.07s
  634. 31.71 s >
  635. 31.71 s > stderr ---
  636. 31.71 s > The application panicked (crashed).
  637. 31.71 s > Message: assertion `left == right` failed
  638. 31.71 s > left: [[1, 1, 1], [1, 1, 1], [1, 1, 2], [2, 1, 1]]
  639. 31.71 s > right: [[1, 1, 1], [1, 1, 2], [2, 1, 1]]
  640. 31.71 s > Location: crates/gammalooprs/src/uv/approx/local_4d.rs:1992
  641. 31.71 s >
  642. 31.71 s > ━━━━━━━━━━━━━━━━━━━━━━━━━━━━━━━━━━ BACKTRACE ━━━━━━━━━━━━━━━━━━━━━━━━━━━━━━━━━━━
  643. 31.71 s > 1: <color_eyre[51793ea62743adbd]::config::PanicHook>::panic_report<unknown>
  644. 31.71 s > at <unknown source file>:<unknown line>
  645. 31.71 s > 2: <color_eyre[51793ea62743adbd]::config::PanicHook>::into_panic_hook::{closure#0}<unknown>
  646. 31.71 s > at <unknown source file>:<unknown line>
  647. 31.71 s > 3: std[bcb96dfbba0ab899]::panicking::panic_with_hook<unknown>
  648. 31.71 s > at <unknown source file>:<unknown line>
  649. 31.71 s > 4: std[bcb96dfbba0ab899]::panicking::panic_handler::{closure#0}<unknown>
  650. 31.71 s > at <unknown source file>:<unknown line>
  651. 31.71 s > 5: std[bcb96dfbba0ab899]::sys::backtrace::__rust_end_short_backtrace::<std[bcb96dfbba0ab899]::panicking::panic_handler::{closure#0}, !><unknown>
  652. 31.71 s > at <unknown source file>:<unknown line>
  653. 31.71 s > 6: __rustc[6c289b9f9c454d21]::rust_begin_unwind<unknown>
  654. 31.71 s > at <unknown source file>:<unknown line>
  655. 31.71 s > 7: core[940e698046960fd5]::panicking::panic_fmt<unknown>
  656. 31.71 s > at <unknown source file>:<unknown line>
  657. 31.71 s > 8: core[940e698046960fd5]::panicking::assert_failed_inner<unknown>
  658. 31.71 s > at <unknown source file>:<unknown line>
  659. 31.71 s > 9: core[940e698046960fd5]::panicking::assert_failed::<alloc[2ea6bcb46fca0c42]::vec::Vec<[usize; 3usize]>, alloc[2ea6bcb46fca0c42]::vec::Vec<[usize; 3usize]>><unknown>
  660. 31.71 s > at <unknown source file>:<unknown line>
  661. 31.71 s > 10: gammalooprs[8af0a922d9a4c82d]::uv::approx::local_4d::tests::dod_one_triangle_keeps_separate_denominator_topologies<unknown>
  662. 31.71 s > at <unknown source file>:<unknown line>
  663. 31.71 s > 11: <gammalooprs[8af0a922d9a4c82d]::uv::approx::local_4d::tests::dod_one_triangle_keeps_separate_denominator_topologies::{closure#0} as core[940e698046960fd5]::ops::function::FnOnce<()>>::call_once<unknown>
  664. 31.71 s > at <unknown source file>:<unknown line>
  665. 31.71 s > 12: test[75d6903177b1d7e9]::__rust_begin_short_backtrace::<core[940e698046960fd5]::result::Result<(), alloc[2ea6bcb46fca0c42]::string::String>, fn() -> core[940e698046960fd5]::result::Result<(), alloc[2ea6bcb46fca0c42]::string::String>><unknown>
  666. 31.71 s > at <unknown source file>:<unknown line>
  667. 31.71 s > 13: test[75d6903177b1d7e9]::run_test::{closure#0}<unknown>
  668. 31.71 s > at <unknown source file>:<unknown line>
  669. 31.71 s > 14: std[bcb96dfbba0ab899]::sys::backtrace::__rust_begin_short_backtrace::<test[75d6903177b1d7e9]::run_test::{closure#1}, ()><unknown>
  670. 31.71 s > at <unknown source file>:<unknown line>
  671. 31.71 s > 15: <std[bcb96dfbba0ab899]::thread::lifecycle::spawn_unchecked<test[75d6903177b1d7e9]::run_test::{closure#1}, ()>::{closure#1} as core[940e698046960fd5]::ops::function::FnOnce<()>>::call_once::{shim:vtable#0}<unknown>
  672. 31.71 s > at <unknown source file>:<unknown line>
  673. 31.71 s > 16: <std[bcb96dfbba0ab899]::sys::thread::unix::Thread>::new::thread_start<unknown>
  674. 31.71 s > at <unknown source file>:<unknown line>
  675. 31.71 s > 17: start_thread<unknown>
  676. 31.71 s > at <unknown source file>:<unknown line>
  677. 31.71 s > 18: __clone3<unknown>
  678. 31.71 s > at <unknown source file>:<unknown line>
  679. 31.71 s >
  680. 31.71 s > Run with COLORBT_SHOW_HIDDEN=1 environment variable to disable frame filtering.
  681. 31.71 s > Run with RUST_BACKTRACE=full to include source snippets.
  682. 31.71 s >
  683. 31.71 s > FAIL [ 0.225s] (572/645) gammalooprs uv::approx::tests::factorized_owned_dot_child_cff_matches_direct_3d_for_uncut_self_energy
  684. 31.71 s > stdout ---
  685. 31.71 s >
  686. 31.71 s > running 1 test
  687. 31.71 s > test uv::approx::tests::factorized_owned_dot_child_cff_matches_direct_3d_for_uncut_self_energy ... FAILED
  688. 31.71 s >
  689. 31.71 s > failures:
  690. 31.71 s >
  691. 31.71 s > failures:
  692. 31.71 s > uv::approx::tests::factorized_owned_dot_child_cff_matches_direct_3d_for_uncut_self_energy
  693. 31.71 s >
  694. 31.71 s > test result: FAILED. 0 passed; 1 failed; 0 ignored; 0 measured; 695 filtered out; finished in 0.22s
  695. 31.71 s >
  696. 31.71 s > stderr ---
  697. 31.71 s > The application panicked (crashed).
  698. 31.71 s > Message: assertion `left == right` failed
  699. 31.71 s > left: [[1, 1, 2], [1, 2], [2, 2, 1], [2, 1], [2, 1], [2, 2, 1], [2, 2, 2, 1], [2, 2, 1]]
  700. 31.71 s > right: [[1, 1, 2, 2, 2]]
  701. 31.71 s > Location: crates/gammalooprs/src/uv/approx/mod.rs:1471
  702. 31.71 s >
  703. 31.71 s > ━━━━━━━━━━━━━━━━━━━━━━━━━━━━━━━━━━ BACKTRACE ━━━━━━━━━━━━━━━━━━━━━━━━━━━━━━━━━━━
  704. 31.71 s > 1: <color_eyre[51793ea62743adbd]::config::PanicHook>::panic_report<unknown>
  705. 31.71 s > at <unknown source file>:<unknown line>
  706. 31.71 s > 2: <color_eyre[51793ea62743adbd]::config::PanicHook>::into_panic_hook::{closure#0}<unknown>
  707. 31.71 s > at <unknown source file>:<unknown line>
  708. 31.71 s > 3: std[bcb96dfbba0ab899]::panicking::panic_with_hook<unknown>
  709. 31.71 s > at <unknown source file>:<unknown line>
  710. 31.71 s > 4: std[bcb96dfbba0ab899]::panicking::panic_handler::{closure#0}<unknown>
  711. 31.71 s > at <unknown source file>:<unknown line>
  712. 31.71 s > 5: std[bcb96dfbba0ab899]::sys::backtrace::__rust_end_short_backtrace::<std[bcb96dfbba0ab899]::panicking::panic_handler::{closure#0}, !><unknown>
  713. 31.71 s > at <unknown source file>:<unknown line>
  714. 31.71 s > 6: __rustc[6c289b9f9c454d21]::rust_begin_unwind<unknown>
  715. 31.71 s > at <unknown source file>:<unknown line>
  716. 31.71 s > 7: core[940e698046960fd5]::panicking::panic_fmt<unknown>
  717. 31.71 s > at <unknown source file>:<unknown line>
  718. 31.71 s > 8: core[940e698046960fd5]::panicking::assert_failed_inner<unknown>
  719. 31.71 s > at <unknown source file>:<unknown line>
  720. 31.71 s > 9: core[940e698046960fd5]::panicking::assert_failed::<alloc[2ea6bcb46fca0c42]::vec::Vec<alloc[2ea6bcb46fca0c42]::vec::Vec<usize>>, alloc[2ea6bcb46fca0c42]::vec::Vec<alloc[2ea6bcb46fca0c42]::vec::Vec<usize>>><unknown>
  721. 31.71 s > at <unknown source file>:<unknown line>
  722. 31.71 s > 10: gammalooprs[8af0a922d9a4c82d]::uv::approx::tests::factorized_owned_dot_child_cff_matches_direct_3d_for_uncut_self_energy<unknown>
  723. 31.71 s > at <unknown source file>:<unknown line>
  724. 31.71 s > 11: <gammalooprs[8af0a922d9a4c82d]::uv::approx::tests::factorized_owned_dot_child_cff_matches_direct_3d_for_uncut_self_energy::{closure#0} as core[940e698046960fd5]::ops::function::FnOnce<()>>::call_once<unknown>
  725. 31.71 s > at <unknown source file>:<unknown line>
  726. 31.71 s > 12: test[75d6903177b1d7e9]::__rust_begin_short_backtrace::<core[940e698046960fd5]::result::Result<(), alloc[2ea6bcb46fca0c42]::string::String>, fn() -> core[940e698046960fd5]::result::Result<(), alloc[2ea6bcb46fca0c42]::string::String>><unknown>
  727. 31.71 s > at <unknown source file>:<unknown line>
  728. 31.71 s > 13: test[75d6903177b1d7e9]::run_test::{closure#0}<unknown>
  729. 31.71 s > at <unknown source file>:<unknown line>
  730. 31.71 s > 14: std[bcb96dfbba0ab899]::sys::backtrace::__rust_begin_short_backtrace::<test[75d6903177b1d7e9]::run_test::{closure#1}, ()><unknown>
  731. 31.71 s > at <unknown source file>:<unknown line>
  732. 31.71 s > 15: <std[bcb96dfbba0ab899]::thread::lifecycle::spawn_unchecked<test[75d6903177b1d7e9]::run_test::{closure#1}, ()>::{closure#1} as core[940e698046960fd5]::ops::function::FnOnce<()>>::call_once::{shim:vtable#0}<unknown>
  733. 31.71 s > at <unknown source file>:<unknown line>
  734. 31.71 s > 16: <std[bcb96dfbba0ab899]::sys::thread::unix::Thread>::new::thread_start<unknown>
  735. 31.71 s > at <unknown source file>:<unknown line>
  736. 31.71 s > 17: start_thread<unknown>
  737. 31.71 s > at <unknown source file>:<unknown line>
  738. 31.71 s > 18: __clone3<unknown>
  739. 31.71 s > at <unknown source file>:<unknown line>
  740. 31.71 s >
  741. 31.71 s > Run with COLORBT_SHOW_HIDDEN=1 environment variable to disable frame filtering.
  742. 31.71 s > Run with RUST_BACKTRACE=full to include source snippets.
  743. 31.71 s >
  744. 31.71 s > error: test run failed
  745. 31.71 s >
  746. 31.71 s > ========== nextest test summary ==========
  747. 31.71 s > report: target/nextest/ci_gammaloop/junit.xml
  748. 31.71 s > tests: 645, failures: 2, errors: 0
  749. 31.71 s >
  750. 31.71 s > 1. gammalooprs::uv::approx::local_4d::tests::dod_one_triangle_keeps_separate_denominator_topologies
  751. 31.71 s > failure: test failure with exit code 101
  752. 31.71 s > system-out
  753. 31.71 s > running 1 test
  754. 31.71 s > test uv::approx::local_4d::tests::dod_one_triangle_keeps_separate_denominator_topologies ... FAILED
  755. 31.71 s >
  756. 31.71 s > failures:
  757. 31.71 s >
  758. 31.71 s > failures:
  759. 31.71 s > uv::approx::local_4d::tests::dod_one_triangle_keeps_separate_denominator_topologies
  760. 31.71 s >
  761. 31.71 s > test result: FAILED. 0 passed; 1 failed; 0 ignored; 0 measured; 695 filtered out; finished in 0.07s
  762. 31.71 s > system-err
  763. 31.71 s > The application panicked (crashed).
  764. 31.71 s > Message: assertion `left == right` failed
  765. 31.71 s > left: [[1, 1, 1], [1, 1, 1], [1, 1, 2], [2, 1, 1]]
  766. 31.71 s > right: [[1, 1, 1], [1, 1, 2], [2, 1, 1]]
  767. 31.71 s > Location: crates/gammalooprs/src/uv/approx/local_4d.rs:1992
  768. 31.71 s >
  769. 31.71 s > ━━━━━━━━━━━━━━━━━━━━━━━━━━━━━━━━━━ BACKTRACE ━━━━━━━━━━━━━━━━━━━━━━━━━━━━━━━━━━━
  770. 31.71 s > 1: <color_eyre[51793ea62743adbd]::config::PanicHook>::panic_report<unknown>
  771. 31.71 s > at <unknown source file>:<unknown line>
  772. 31.71 s > 2: <color_eyre[51793ea62743adbd]::config::PanicHook>::into_panic_hook::{closure#0}<unknown>
  773. 31.71 s > at <unknown source file>:<unknown line>
  774. 31.71 s > 3: std[bcb96dfbba0ab899]::panicking::panic_with_hook<unknown>
  775. 31.71 s > at <unknown source file>:<unknown line>
  776. 31.71 s > 4: std[bcb96dfbba0ab899]::panicking::panic_handler::{closure#0}<unknown>
  777. 31.71 s > at <unknown source file>:<unknown line>
  778. 31.71 s > 5: std[bcb96dfbba0ab899]::sys::backtrace::__rust_end_short_backtrace::<std[bcb96dfbba0ab899]::panicking::panic_handler::{closure#0}, !><unknown>
  779. 31.71 s > at <unknown source file>:<unknown line>
  780. 31.71 s > 6: __rustc[6c289b9f9c454d21]::rust_begin_unwind<unknown>
  781. 31.71 s > at <unknown source file>:<unknown line>
  782. 31.71 s > 7: core[940e698046960fd5]::panicking::panic_fmt<unknown>
  783. 31.71 s > at <unknown source file>:<unknown line>
  784. 31.71 s > 8: core[940e698046960fd5]::panicking::assert_failed_inner<unknown>
  785. 31.71 s > at <unknown source file>:<unknown line>
  786. 31.71 s > 9: core[940e698046960fd5]::panicking::assert_failed::<alloc[2ea6bcb46fca0c42]::vec::Vec<[usize; 3usize]>, alloc[2ea6bcb46fca0c42]::vec::Vec<[usize; 3usize]>><unknown>
  787. 31.71 s > at <unknown source file>:<unknown line>
  788. 31.71 s > 10: gammalooprs[8af0a922d9a4c82d]::uv::approx::local_4d::tests::dod_one_triangle_keeps_separate_denominator_topologies<unknown>
  789. 31.71 s > at <unknown source file>:<unknown line>
  790. 31.71 s > 11: <gammalooprs[8af0a922d9a4c82d]::uv::approx::local_4d::tests::dod_one_triangle_keeps_separate_denominator_topologies::{closure#0} as core[940e698046960fd5]::ops::function::FnOnce<()>>::call_once<unknown>
  791. 31.71 s > at <unknown source file>:<unknown line>
  792. 31.71 s > 12: test[75d6903177b1d7e9]::__rust_begin_short_backtrace::<core[940e698046960fd5]::result::Result<(), alloc[2ea6bcb46fca0c42]::string::String>, fn() -> core[940e698046960fd5]::result::Result<(), alloc[2ea6bcb46fca0c42]::string::String>><unknown>
  793. 31.71 s > at <unknown source file>:<unknown line>
  794. 31.71 s > 13: test[75d6903177b1d7e9]::run_test::{closure#0}<unknown>
  795. 31.71 s > at <unknown source file>:<unknown line>
  796. 31.71 s > 14: std[bcb96dfbba0ab899]::sys::backtrace::__rust_begin_short_backtrace::<test[75d6903177b1d7e9]::run_test::{closure#1}, ()><unknown>
  797. 31.71 s > at <unknown source file>:<unknown line>
  798. 31.71 s > 15: <std[bcb96dfbba0ab899]::thread::lifecycle::spawn_unchecked<test[75d6903177b1d7e9]::run_test::{closure#1}, ()>::{closure#1} as core[940e698046960fd5]::ops::function::FnOnce<()>>::call_once::{shim:vtable#0}<unknown>
  799. 31.71 s > at <unknown source file>:<unknown line>
  800. 31.71 s > 16: <std[bcb96dfbba0ab899]::sys::thread::unix::Thread>::new::thread_start<unknown>
  801. 31.71 s > at <unknown source file>:<unknown line>
  802. 31.71 s > 17: start_thread<unknown>
  803. 31.71 s > at <unknown source file>:<unknown line>
  804. 31.71 s > 18: __clone3<unknown>
  805. 31.71 s > at <unknown source file>:<unknown line>
  806. 31.71 s >
  807. 31.71 s > Run with COLORBT_SHOW_HIDDEN=1 environment variable to disable frame filtering.
  808. 31.71 s > Run with RUST_BACKTRACE=full to include source snippets.
  809. 31.71 s >
  810. 31.71 s > 2. gammalooprs::uv::approx::tests::factorized_owned_dot_child_cff_matches_direct_3d_for_uncut_self_energy
  811. 31.71 s > failure: test failure with exit code 101
  812. 31.71 s > system-out
  813. 31.71 s > running 1 test
  814. 31.71 s > test uv::approx::tests::factorized_owned_dot_child_cff_matches_direct_3d_for_uncut_self_energy ... FAILED
  815. 31.71 s >
  816. 31.71 s > failures:
  817. 31.71 s >
  818. 31.71 s > failures:
  819. 31.71 s > uv::approx::tests::factorized_owned_dot_child_cff_matches_direct_3d_for_uncut_self_energy
  820. 31.71 s >
  821. 31.71 s > test result: FAILED. 0 passed; 1 failed; 0 ignored; 0 measured; 695 filtered out; finished in 0.22s
  822. 31.71 s > system-err
  823. 31.71 s > The application panicked (crashed).
  824. 31.71 s > Message: assertion `left == right` failed
  825. 31.71 s > left: [[1, 1, 2], [1, 2], [2, 2, 1], [2, 1], [2, 1], [2, 2, 1], [2, 2, 2, 1], [2, 2, 1]]
  826. 31.71 s > right: [[1, 1, 2, 2, 2]]
  827. 31.71 s > Location: crates/gammalooprs/src/uv/approx/mod.rs:1471
  828. 31.71 s >
  829. 31.71 s > ━━━━━━━━━━━━━━━━━━━━━━━━━━━━━━━━━━ BACKTRACE ━━━━━━━━━━━━━━━━━━━━━━━━━━━━━━━━━━━
  830. 31.71 s > 1: <color_eyre[51793ea62743adbd]::config::PanicHook>::panic_report<unknown>
  831. 31.71 s > at <unknown source file>:<unknown line>
  832. 31.71 s > 2: <color_eyre[51793ea62743adbd]::config::PanicHook>::into_panic_hook::{closure#0}<unknown>
  833. 31.71 s > at <unknown source file>:<unknown line>
  834. 31.71 s > 3: std[bcb96dfbba0ab899]::panicking::panic_with_hook<unknown>
  835. 31.71 s > at <unknown source file>:<unknown line>
  836. 31.71 s > 4: std[bcb96dfbba0ab899]::panicking::panic_handler::{closure#0}<unknown>
  837. 31.71 s > at <unknown source file>:<unknown line>
  838. 31.71 s > 5: std[bcb96dfbba0ab899]::sys::backtrace::__rust_end_short_backtrace::<std[bcb96dfbba0ab899]::panicking::panic_handler::{closure#0}, !><unknown>
  839. 31.71 s > at <unknown source file>:<unknown line>
  840. 31.71 s > 6: __rustc[6c289b9f9c454d21]::rust_begin_unwind<unknown>
  841. 31.71 s > at <unknown source file>:<unknown line>
  842. 31.71 s > 7: core[940e698046960fd5]::panicking::panic_fmt<unknown>
  843. 31.71 s > at <unknown source file>:<unknown line>
  844. 31.71 s > 8: core[940e698046960fd5]::panicking::assert_failed_inner<unknown>
  845. 31.71 s > at <unknown source file>:<unknown line>
  846. 31.71 s > 9: core[940e698046960fd5]::panicking::assert_failed::<alloc[2ea6bcb46fca0c42]::vec::Vec<alloc[2ea6bcb46fca0c42]::vec::Vec<usize>>, alloc[2ea6bcb46fca0c42]::vec::Vec<alloc[2ea6bcb46fca0c42]::vec::Vec<usize>>><unknown>
  847. 31.71 s > at <unknown source file>:<unknown line>
  848. 31.71 s > 10: gammalooprs[8af0a922d9a4c82d]::uv::approx::tests::factorized_owned_dot_child_cff_matches_direct_3d_for_uncut_self_energy<unknown>
  849. 31.71 s > at <unknown source file>:<unknown line>
  850. 31.71 s > 11: <gammalooprs[8af0a922d9a4c82d]::uv::approx::tests::factorized_owned_dot_child_cff_matches_direct_3d_for_uncut_self_energy::{closure#0} as core[940e698046960fd5]::ops::function::FnOnce<()>>::call_once<unknown>
  851. 31.71 s > at <unknown source file>:<unknown line>
  852. 31.71 s > 12: test[75d6903177b1d7e9]::__rust_begin_short_backtrace::<core[940e698046960fd5]::result::Result<(), alloc[2ea6bcb46fca0c42]::string::String>, fn() -> core[940e698046960fd5]::result::Result<(), alloc[2ea6bcb46fca0c42]::string::String>><unknown>
  853. 31.71 s > at <unknown source file>:<unknown line>
  854. 31.71 s > 13: test[75d6903177b1d7e9]::run_test::{closure#0}<unknown>
  855. 31.71 s > at <unknown source file>:<unknown line>
  856. 31.71 s > 14: std[bcb96dfbba0ab899]::sys::backtrace::__rust_begin_short_backtrace::<test[75d6903177b1d7e9]::run_test::{closure#1}, ()><unknown>
  857. 31.71 s > at <unknown source file>:<unknown line>
  858. 31.71 s > 15: <std[bcb96dfbba0ab899]::thread::lifecycle::spawn_unchecked<test[75d6903177b1d7e9]::run_test::{closure#1}, ()>::{closure#1} as core[940e698046960fd5]::ops::function::FnOnce<()>>::call_once::{shim:vtable#0}<unknown>
  859. 31.71 s > at <unknown source file>:<unknown line>
  860. 31.71 s > 16: <std[bcb96dfbba0ab899]::sys::thread::unix::Thread>::new::thread_start<unknown>
  861. 31.71 s > at <unknown source file>:<unknown line>
  862. 31.71 s > 17: start_thread<unknown>
  863. 31.71 s > at <unknown source file>:<unknown line>
  864. 31.71 s > 18: __clone3<unknown>
  865. 31.71 s > at <unknown source file>:<unknown line>
  866. 31.71 s >
  867. 31.71 s > Run with COLORBT_SHOW_HIDDEN=1 environment variable to disable frame filtering.
  868. 31.71 s > Run with RUST_BACKTRACE=full to include source snippets.
  869. 31.71 s > =========================================
  870. 31.71 s > Extracting 1 binary, 1 build script output directory, and 1 linked path to /build/nextest-archive-8Ku8gR
  871. 31.71 s > Extracted 7 files to /build/nextest-archive-8Ku8gR in 0.06s
  872. 31.71 s > ------------
  873. 31.71 s > Nextest run ID 520caa1d-18bb-4023-b1f4-d0ca0bbda3e2 with nextest profile: ci_gammaloop
  874. 31.71 s > Starting 119 tests across 1 binary
  875. 31.71 s > ------------
  876. 31.71 s > Summary [ 0.910s] 119 tests run: 119 passed, 0 skipped
  877. 31.71 s >
  878. 31.71 s > ========== nextest test summary ==========
  879. 31.71 s > report: target/nextest/ci_gammaloop/junit.xml
  880. 31.71 s > tests: 119, failures: 0, errors: 0
  881. 31.71 s > No failing testcases found.
  882. 31.71 s > =========================================
  883. 31.71 s For full logs, run:
  884. 31.71 s nix log /nix/store/bcc3gg1akl605y0c3km3gjg8nsqsjzv8-gammaloop-nextest-core.drv
  885. 31.82 s [0 built (1 failed), 1 cRun failed.