test packages.x86_64-linux.nix-ci-check-gammaloop-nextest-core
0.00 s
$ /nix/store/9ypz3flqsrl5xl495mm8h645gadjsxi1-coreutils-9.11/bin/timeout --kill-after=15s 7200s /nix/store/23zk8sgzamrbmj1fday15szf7f2279s8-nix-2.34.7/bin/nix --extra-experimental-features nix-command --extra-experimental-features flakes flake clone git+https://github.com/alphal00p/gammaloop --dest /tmp/nix-ci-worker/stable-pwd/repo/
0.08 s
Cloning into '/tmp/nix-ci-worker/stable-pwd/repo'...
0.97 s
remote: Enumerating objects: 78084, done.
1.09 s
remote: Counting objects: 0% (1/13906)
remote: Counting objects: 1% (140/13906)
remote: Counting objects: 2% (279/13906)
remote: Counting objects: 3% (418/13906)
remote: Counting objects: 4% (557/13906)
remote: Counting objects: 5% (696/13906)
remote: Counting objects: 6% (835/13906)
remote: Counting objects: 7% (974/13906)
remote: Counting objects: 8% (1113/13906)
remote: Counting objects: 9% (1252/13906)
remote: Counting objects: 10% (1391/13906)
remote: Counting objects: 11% (1530/13906)
remote: Counting objects: 12% (1669/13906)
remote: Counting objects: 13% (1808/13906)
remote: Counting objects: 14% (1947/13906)
remote: Counting objects: 15% (2086/13906)
remote: Counting objects: 16% (2225/13906)
remote: Counting objects: 17% (2365/13906)
remote: Counting objects: 18% (2504/13906)
remote: Counting objects: 19% (2643/13906)
remote: Counting objects: 20% (2782/13906)
remote: Counting objects: 21% (2921/13906)
remote: Counting objects: 22% (3060/13906)
remote: Counting objects: 23% (3199/13906)
remote: Counting objects: 24% (3338/13906)
remote: Counting objects: 25% (3477/13906)
remote: Counting objects: 26% (3616/13906)
remote: Counting objects: 27% (3755/13906)
remote: Counting objects: 28% (3894/13906)
remote: Counting objects: 29% (4033/13906)
remote: Counting objects: 30% (4172/13906)
remote: Counting objects: 31% (4311/13906)
remote: Counting objects: 32% (4450/13906)
remote: Counting objects: 33% (4589/13906)
remote: Counting objects: 34% (4729/13906)
remote: Counting objects: 35% (4868/13906)
remote: Counting objects: 36% (5007/13906)
remote: Counting objects: 37% (5146/13906)
remote: Counting objects: 38% (5285/13906)
remote: Counting objects: 39% (5424/13906)
remote: Counting objects: 40% (5563/13906)
remote: Counting objects: 41% (5702/13906)
remote: Counting objects: 42% (5841/13906)
remote: Counting objects: 43% (5980/13906)
remote: Counting objects: 44% (6119/13906)
remote: Counting objects: 45% (6258/13906)
remote: Counting objects: 46% (6397/13906)
remote: Counting objects: 47% (6536/13906)
remote: Counting objects: 48% (6675/13906)
remote: Counting objects: 49% (6814/13906)
remote: Counting objects: 50% (6953/13906)
remote: Counting objects: 51% (7093/13906)
remote: Counting objects: 52% (7232/13906)
remote: Counting objects: 53% (7371/13906)
remote: Counting objects: 54% (7510/13906)
remote: Counting objects: 55% (7649/13906)
remote: Counting objects: 56% (7788/13906)
remote: Counting objects: 57% (7927/13906)
remote: Counting objects: 58% (8066/13906)
remote: Counting objects: 59% (8205/13906)
remote: Counting objects: 60% (8344/13906)
remote: Counting objects: 61% (8483/13906)
remote: Counting objects: 62% (8622/13906)
remote: Counting objects: 63% (8761/13906)
remote: Counting objects: 64% (8900/13906)
remote: Counting objects: 65% (9039/13906)
remote: Counting objects: 66% (9178/13906)
remote: Counting objects: 67% (9318/13906)
remote: Counting objects: 68% (9457/13906)
remote: Counting objects: 69% (9596/13906)
remote: Counting objects: 70% (9735/13906)
remote: Counting objects: 71% (9874/13906)
remote: Counting objects: 72% (10013/13906)
remote: Counting objects: 73% (10152/13906)
remote: Counting objects: 74% (10291/13906)
remote: Counting objects: 75% (10430/13906)
remote: Counting objects: 76% (10569/13906)
remote: Counting objects: 77% (10708/13906)
remote: Counting objects: 78% (10847/13906)
remote: Counting objects: 79% (10986/13906)
remote: Counting objects: 80% (11125/13906)
remote: Counting objects: 81% (11264/13906)
remote: Counting objects: 82% (11403/13906)
remote: Counting objects: 83% (11542/13906)
remote: Counting objects: 84% (11682/13906)
remote: Counting objects: 85% (11821/13906)
remote: Counting objects: 86% (11960/13906)
remote: Counting objects: 87% (12099/13906)
remote: Counting objects: 88% (12238/13906)
remote: Counting objects: 89% (12377/13906)
remote: Counting objects: 90% (12516/13906)
remote: Counting objects: 91% (12655/13906)
remote: Counting objects: 92% (12794/13906)
remote: Counting objects: 93% (12933/13906)
remote: Counting objects: 94% (13072/13906)
remote: Counting objects: 95% (13211/13906)
remote: Counting objects: 96% (13350/13906)
remote: Counting objects: 97% (13489/13906)
remote: Counting objects: 98% (13628/13906)
remote: Counting objects: 99% (13767/13906)
remote: Counting objects: 100% (13906/13906)
remote: Counting objects: 100% (13906/13906), done.
3.91 s
remote: Compressing objects: 0% (1/3095)
remote: Compressing objects: 1% (31/3095)
remote: Compressing objects: 2% (62/3095)
remote: Compressing objects: 3% (93/3095)
remote: Compressing objects: 4% (124/3095)
remote: Compressing objects: 5% (155/3095)
remote: Compressing objects: 6% (186/3095)
remote: Compressing objects: 7% (217/3095)
remote: Compressing objects: 8% (248/3095)
remote: Compressing objects: 9% (279/3095)
remote: Compressing objects: 10% (310/3095)
remote: Compressing objects: 11% (341/3095)
remote: Compressing objects: 12% (372/3095)
remote: Compressing objects: 13% (403/3095)
remote: Compressing objects: 14% (434/3095)
remote: Compressing objects: 15% (465/3095)
remote: Compressing objects: 16% (496/3095)
remote: Compressing objects: 17% (527/3095)
remote: Compressing objects: 18% (558/3095)
remote: Compressing objects: 19% (589/3095)
remote: Compressing objects: 20% (619/3095)
remote: Compressing objects: 21% (650/3095)
remote: Compressing objects: 22% (681/3095)
remote: Compressing objects: 23% (712/3095)
remote: Compressing objects: 24% (743/3095)
remote: Compressing objects: 24% (771/3095)
remote: Compressing objects: 25% (774/3095)
remote: Compressing objects: 26% (805/3095)
remote: Compressing objects: 27% (836/3095)
remote: Compressing objects: 28% (867/3095)
remote: Compressing objects: 28% (881/3095)
remote: Compressing objects: 29% (898/3095)
remote: Compressing objects: 30% (929/3095)
remote: Compressing objects: 31% (960/3095)
remote: Compressing objects: 32% (991/3095)
remote: Compressing objects: 33% (1022/3095)
remote: Compressing objects: 34% (1053/3095)
remote: Compressing objects: 35% (1084/3095)
remote: Compressing objects: 36% (1115/3095)
remote: Compressing objects: 37% (1146/3095)
remote: Compressing objects: 38% (1177/3095)
remote: Compressing objects: 39% (1208/3095)
remote: Compressing objects: 40% (1238/3095)
remote: Compressing objects: 41% (1269/3095)
remote: Compressing objects: 42% (1300/3095)
remote: Compressing objects: 43% (1331/3095)
remote: Compressing objects: 44% (1362/3095)
remote: Compressing objects: 45% (1393/3095)
remote: Compressing objects: 46% (1424/3095)
remote: Compressing objects: 47% (1455/3095)
remote: Compressing objects: 48% (1486/3095)
remote: Compressing objects: 49% (1517/3095)
remote: Compressing objects: 50% (1548/3095)
remote: Compressing objects: 51% (1579/3095)
remote: Compressing objects: 52% (1610/3095)
remote: Compressing objects: 53% (1641/3095)
remote: Compressing objects: 54% (1672/3095)
remote: Compressing objects: 55% (1703/3095)
remote: Compressing objects: 56% (1734/3095)
remote: Compressing objects: 57% (1765/3095)
remote: Compressing objects: 58% (1796/3095)
remote: Compressing objects: 59% (1827/3095)
remote: Compressing objects: 60% (1857/3095)
remote: Compressing objects: 61% (1888/3095)
remote: Compressing objects: 62% (1919/3095)
remote: Compressing objects: 63% (1950/3095)
remote: Compressing objects: 64% (1981/3095)
remote: Compressing objects: 65% (2012/3095)
remote: Compressing objects: 66% (2043/3095)
remote: Compressing objects: 67% (2074/3095)
remote: Compressing objects: 68% (2105/3095)
remote: Compressing objects: 69% (2136/3095)
remote: Compressing objects: 70% (2167/3095)
remote: Compressing objects: 71% (2198/3095)
remote: Compressing objects: 72% (2229/3095)
remote: Compressing objects: 73% (2260/3095)
remote: Compressing objects: 74% (2291/3095)
remote: Compressing objects: 75% (2322/3095)
remote: Compressing objects: 76% (2353/3095)
remote: Compressing objects: 77% (2384/3095)
remote: Compressing objects: 78% (2415/3095)
remote: Compressing objects: 79% (2446/3095)
remote: Compressing objects: 80% (2476/3095)
remote: Compressing objects: 81% (2507/3095)
remote: Compressing objects: 82% (2538/3095)
remote: Compressing objects: 83% (2569/3095)
remote: Compressing objects: 84% (2600/3095)
remote: Compressing objects: 85% (2631/3095)
remote: Compressing objects: 86% (2662/3095)
remote: Compressing objects: 87% (2693/3095)
remote: Compressing objects: 88% (2724/3095)
remote: Compressing objects: 89% (2755/3095)
remote: Compressing objects: 90% (2786/3095)
remote: Compressing objects: 91% (2817/3095)
remote: Compressing objects: 92% (2848/3095)
remote: Compressing objects: 93% (2879/3095)
remote: Compressing objects: 94% (2910/3095)
remote: Compressing objects: 95% (2941/3095)
remote: Compressing objects: 96% (2972/3095)
remote: Compressing objects: 97% (3003/3095)
remote: Compressing objects: 98% (3034/3095)
remote: Compressing objects: 99% (3065/3095)
remote: Compressing objects: 100% (3095/3095)
remote: Compressing objects: 100% (3095/3095), done.
7.74 s
Receiving objects: 0% (1/78084)
Receiving objects: 1% (781/78084)
Receiving objects: 2% (1562/78084)
Receiving objects: 3% (2343/78084)
Receiving objects: 4% (3124/78084)
Receiving objects: 5% (3905/78084)
Receiving objects: 6% (4686/78084)
Receiving objects: 7% (5466/78084)
Receiving objects: 8% (6247/78084)
Receiving objects: 9% (7028/78084), 10.15 MiB | 20.32 MiB/s
Receiving objects: 10% (7809/78084), 10.15 MiB | 20.32 MiB/s
Receiving objects: 11% (8590/78084), 10.15 MiB | 20.32 MiB/s
Receiving objects: 12% (9371/78084), 10.15 MiB | 20.32 MiB/s
Receiving objects: 13% (10151/78084), 10.15 MiB | 20.32 MiB/s
Receiving objects: 14% (10932/78084), 10.15 MiB | 20.32 MiB/s
Receiving objects: 15% (11713/78084), 10.15 MiB | 20.32 MiB/s
Receiving objects: 16% (12494/78084), 10.15 MiB | 20.32 MiB/s
Receiving objects: 17% (13275/78084), 10.15 MiB | 20.32 MiB/s
Receiving objects: 18% (14056/78084), 10.15 MiB | 20.32 MiB/s
Receiving objects: 19% (14836/78084), 10.15 MiB | 20.32 MiB/s
Receiving objects: 20% (15617/78084), 10.15 MiB | 20.32 MiB/s
Receiving objects: 21% (16398/78084), 10.15 MiB | 20.32 MiB/s
Receiving objects: 22% (17179/78084), 10.15 MiB | 20.32 MiB/s
Receiving objects: 23% (17960/78084), 10.15 MiB | 20.32 MiB/s
Receiving objects: 24% (18741/78084), 10.15 MiB | 20.32 MiB/s
Receiving objects: 25% (19521/78084), 10.15 MiB | 20.32 MiB/s
Receiving objects: 26% (20302/78084), 10.15 MiB | 20.32 MiB/s
Receiving objects: 27% (21083/78084), 10.15 MiB | 20.32 MiB/s
Receiving objects: 28% (21864/78084), 10.15 MiB | 20.32 MiB/s
Receiving objects: 29% (22645/78084), 10.15 MiB | 20.32 MiB/s
Receiving objects: 30% (23426/78084), 10.15 MiB | 20.32 MiB/s
Receiving objects: 31% (24207/78084), 10.15 MiB | 20.32 MiB/s
Receiving objects: 32% (24987/78084), 10.15 MiB | 20.32 MiB/s
Receiving objects: 33% (25768/78084), 10.15 MiB | 20.32 MiB/s
Receiving objects: 34% (26549/78084), 10.15 MiB | 20.32 MiB/s
Receiving objects: 35% (27330/78084), 10.15 MiB | 20.32 MiB/s
Receiving objects: 36% (28111/78084), 10.15 MiB | 20.32 MiB/s
Receiving objects: 37% (28892/78084), 10.15 MiB | 20.32 MiB/s
Receiving objects: 38% (29672/78084), 10.15 MiB | 20.32 MiB/s
Receiving objects: 39% (30453/78084), 10.15 MiB | 20.32 MiB/s
Receiving objects: 40% (31234/78084), 10.15 MiB | 20.32 MiB/s
Receiving objects: 40% (31549/78084), 28.82 MiB | 28.78 MiB/s
Receiving objects: 41% (32015/78084), 28.82 MiB | 28.78 MiB/s
Receiving objects: 42% (32796/78084), 28.82 MiB | 28.78 MiB/s
Receiving objects: 43% (33577/78084), 28.82 MiB | 28.78 MiB/s
Receiving objects: 44% (34357/78084), 28.82 MiB | 28.78 MiB/s
Receiving objects: 45% (35138/78084), 28.82 MiB | 28.78 MiB/s
Receiving objects: 46% (35919/78084), 28.82 MiB | 28.78 MiB/s
Receiving objects: 47% (36700/78084), 28.82 MiB | 28.78 MiB/s
Receiving objects: 48% (37481/78084), 28.82 MiB | 28.78 MiB/s
Receiving objects: 49% (38262/78084), 28.82 MiB | 28.78 MiB/s
Receiving objects: 50% (39042/78084), 28.82 MiB | 28.78 MiB/s
Receiving objects: 51% (39823/78084), 44.63 MiB | 29.59 MiB/s
Receiving objects: 52% (40604/78084), 44.63 MiB | 29.59 MiB/s
Receiving objects: 53% (41385/78084), 44.63 MiB | 29.59 MiB/s
Receiving objects: 54% (42166/78084), 44.63 MiB | 29.59 MiB/s
Receiving objects: 55% (42947/78084), 44.63 MiB | 29.59 MiB/s
Receiving objects: 56% (43728/78084), 44.63 MiB | 29.59 MiB/s
Receiving objects: 57% (44508/78084), 44.63 MiB | 29.59 MiB/s
Receiving objects: 58% (45289/78084), 44.63 MiB | 29.59 MiB/s
Receiving objects: 59% (46070/78084), 44.63 MiB | 29.59 MiB/s
Receiving objects: 60% (46851/78084), 44.63 MiB | 29.59 MiB/s
Receiving objects: 61% (47632/78084), 44.63 MiB | 29.59 MiB/s
Receiving objects: 61% (48033/78084), 44.63 MiB | 29.59 MiB/s
Receiving objects: 62% (48413/78084), 60.77 MiB | 30.26 MiB/s
Receiving objects: 63% (49193/78084), 60.77 MiB | 30.26 MiB/s
Receiving objects: 64% (49974/78084), 60.77 MiB | 30.26 MiB/s
Receiving objects: 65% (50755/78084), 60.77 MiB | 30.26 MiB/s
Receiving objects: 66% (51536/78084), 60.77 MiB | 30.26 MiB/s
Receiving objects: 67% (52317/78084), 60.77 MiB | 30.26 MiB/s
Receiving objects: 68% (53098/78084), 60.77 MiB | 30.26 MiB/s
Receiving objects: 69% (53878/78084), 60.77 MiB | 30.26 MiB/s
Receiving objects: 70% (54659/78084), 77.65 MiB | 30.96 MiB/s
Receiving objects: 71% (55440/78084), 77.65 MiB | 30.96 MiB/s
Receiving objects: 72% (56221/78084), 77.65 MiB | 30.96 MiB/s
Receiving objects: 73% (57002/78084), 77.65 MiB | 30.96 MiB/s
Receiving objects: 74% (57783/78084), 77.65 MiB | 30.96 MiB/s
Receiving objects: 75% (58563/78084), 77.65 MiB | 30.96 MiB/s
Receiving objects: 76% (59344/78084), 77.65 MiB | 30.96 MiB/s
Receiving objects: 77% (60125/78084), 77.65 MiB | 30.96 MiB/s
Receiving objects: 78% (60906/78084), 77.65 MiB | 30.96 MiB/s
Receiving objects: 79% (61687/78084), 77.65 MiB | 30.96 MiB/s
Receiving objects: 80% (62468/78084), 77.65 MiB | 30.96 MiB/s
Receiving objects: 80% (62629/78084), 77.65 MiB | 30.96 MiB/s
Receiving objects: 81% (63249/78084), 94.45 MiB | 31.05 MiB/s
Receiving objects: 82% (64029/78084), 94.45 MiB | 31.05 MiB/s
Receiving objects: 83% (64810/78084), 94.45 MiB | 31.05 MiB/s
Receiving objects: 84% (65591/78084), 94.45 MiB | 31.05 MiB/s
Receiving objects: 85% (66372/78084), 94.45 MiB | 31.05 MiB/s
Receiving objects: 86% (67153/78084), 94.45 MiB | 31.05 MiB/s
Receiving objects: 87% (67934/78084), 94.45 MiB | 31.05 MiB/s
Receiving objects: 88% (68714/78084), 110.70 MiB | 31.23 MiB/s
Receiving objects: 89% (69495/78084), 110.70 MiB | 31.23 MiB/s
Receiving objects: 90% (70276/78084), 110.70 MiB | 31.23 MiB/s
Receiving objects: 91% (71057/78084), 110.70 MiB | 31.23 MiB/s
Receiving objects: 92% (71838/78084), 110.70 MiB | 31.23 MiB/s
Receiving objects: 93% (72619/78084), 110.70 MiB | 31.23 MiB/s
Receiving objects: 94% (73399/78084), 110.70 MiB | 31.23 MiB/s
Receiving objects: 95% (74180/78084), 110.70 MiB | 31.23 MiB/s
Receiving objects: 96% (74961/78084), 110.70 MiB | 31.23 MiB/s
Receiving objects: 97% (75742/78084), 110.70 MiB | 31.23 MiB/s
Receiving objects: 98% (76523/78084), 110.70 MiB | 31.23 MiB/s
Receiving objects: 99% (77304/78084), 110.70 MiB | 31.23 MiB/s
remote: Total 78084 (delta 9811), reused 11671 (delta 8715), pack-reused 64178 (from 2)
7.74 s
Receiving objects: 100% (78084/78084), 110.70 MiB | 31.23 MiB/s
Receiving objects: 100% (78084/78084), 120.79 MiB | 31.48 MiB/s, done.
8.77 s
Resolving deltas: 0% (0/53130)
Resolving deltas: 1% (532/53130)
Resolving deltas: 2% (1064/53130)
Resolving deltas: 3% (1594/53130)
Resolving deltas: 4% (2126/53130)
Resolving deltas: 5% (2657/53130)
Resolving deltas: 6% (3188/53130)
Resolving deltas: 7% (3721/53130)
Resolving deltas: 8% (4251/53130)
Resolving deltas: 9% (4782/53130)
Resolving deltas: 10% (5313/53130)
Resolving deltas: 11% (5846/53130)
Resolving deltas: 12% (6376/53130)
Resolving deltas: 13% (6907/53130)
Resolving deltas: 14% (7439/53130)
Resolving deltas: 15% (7970/53130)
Resolving deltas: 16% (8501/53130)
Resolving deltas: 17% (9033/53130)
Resolving deltas: 18% (9565/53130)
Resolving deltas: 19% (10095/53130)
Resolving deltas: 20% (10626/53130)
Resolving deltas: 21% (11158/53130)
Resolving deltas: 22% (11690/53130)
Resolving deltas: 23% (12220/53130)
Resolving deltas: 24% (12753/53130)
Resolving deltas: 25% (13283/53130)
Resolving deltas: 26% (13814/53130)
Resolving deltas: 27% (14346/53130)
Resolving deltas: 28% (14877/53130)
Resolving deltas: 29% (15408/53130)
Resolving deltas: 30% (15939/53130)
Resolving deltas: 31% (16473/53130)
Resolving deltas: 32% (17002/53130)
Resolving deltas: 33% (17534/53130)
Resolving deltas: 34% (18065/53130)
Resolving deltas: 35% (18596/53130)
Resolving deltas: 36% (19127/53130)
Resolving deltas: 37% (19659/53130)
Resolving deltas: 38% (20191/53130)
Resolving deltas: 39% (20721/53130)
Resolving deltas: 40% (21252/53130)
Resolving deltas: 41% (21788/53130)
Resolving deltas: 42% (22315/53130)
Resolving deltas: 43% (22846/53130)
Resolving deltas: 44% (23379/53130)
Resolving deltas: 45% (23910/53130)
Resolving deltas: 46% (24440/53130)
Resolving deltas: 47% (24972/53130)
Resolving deltas: 48% (25504/53130)
Resolving deltas: 49% (26034/53130)
Resolving deltas: 50% (26565/53130)
Resolving deltas: 51% (27097/53130)
Resolving deltas: 52% (27630/53130)
Resolving deltas: 53% (28162/53130)
Resolving deltas: 54% (28692/53130)
Resolving deltas: 55% (29222/53130)
Resolving deltas: 56% (29753/53130)
Resolving deltas: 57% (30285/53130)
Resolving deltas: 58% (30816/53130)
Resolving deltas: 59% (31347/53130)
Resolving deltas: 60% (31879/53130)
Resolving deltas: 61% (32410/53130)
Resolving deltas: 62% (32941/53130)
Resolving deltas: 63% (33472/53130)
Resolving deltas: 64% (34004/53130)
Resolving deltas: 65% (34535/53130)
Resolving deltas: 66% (35066/53130)
Resolving deltas: 67% (35598/53130)
Resolving deltas: 68% (36129/53130)
Resolving deltas: 69% (36660/53130)
Resolving deltas: 70% (37191/53130)
Resolving deltas: 71% (37723/53130)
Resolving deltas: 72% (38254/53130)
Resolving deltas: 73% (38785/53130)
Resolving deltas: 74% (39317/53130)
Resolving deltas: 75% (39848/53130)
Resolving deltas: 76% (40379/53130)
Resolving deltas: 77% (40912/53130)
Resolving deltas: 78% (41442/53130)
Resolving deltas: 79% (41973/53130)
Resolving deltas: 80% (42505/53130)
Resolving deltas: 81% (43036/53130)
Resolving deltas: 82% (43567/53130)
Resolving deltas: 83% (44098/53130)
Resolving deltas: 84% (44630/53130)
Resolving deltas: 85% (45161/53130)
Resolving deltas: 86% (45692/53130)
Resolving deltas: 87% (46224/53130)
Resolving deltas: 88% (46755/53130)
Resolving deltas: 89% (47288/53130)
Resolving deltas: 90% (47817/53130)
Resolving deltas: 91% (48349/53130)
Resolving deltas: 92% (48880/53130)
Resolving deltas: 93% (49411/53130)
Resolving deltas: 94% (49944/53130)
Resolving deltas: 95% (50474/53130)
Resolving deltas: 96% (51006/53130)
Resolving deltas: 97% (51537/53130)
Resolving deltas: 98% (52068/53130)
Resolving deltas: 99% (52599/53130)
Resolving deltas: 99% (52933/53130)
Resolving deltas: 100% (53130/53130)
Resolving deltas: 100% (53130/53130), done.
9.17 s
Fetching commit 8a197b8cad2f920e58f5fdc82a046a3afcd7e1fd for raised_energy_cff_wip ...
9.17 s
$ /nix/store/bcnisk3ydfgv26v2gw3zlky24g00yww2-git-2.54.0/bin/git fetch origin 8a197b8cad2f920e58f5fdc82a046a3afcd7e1fd
9.64 s
From https://github.com/alphal00p/gammaloop
9.64 s
* branch 8a197b8cad2f920e58f5fdc82a046a3afcd7e1fd -> FETCH_HEAD
9.65 s
$ /nix/store/9ypz3flqsrl5xl495mm8h645gadjsxi1-coreutils-9.11/bin/timeout --kill-after=15s 7200s /nix/store/bcnisk3ydfgv26v2gw3zlky24g00yww2-git-2.54.0/bin/git -c advice.detachedHead=false checkout 8a197b8cad2f920e58f5fdc82a046a3afcd7e1fd
9.84 s
HEAD is now at 8a197b8ca preserve separate UV Taylor denominator topologies
9.84 s
$ /nix/store/9ypz3flqsrl5xl495mm8h645gadjsxi1-coreutils-9.11/bin/timeout --kill-after=15s 7200s /nix/store/23zk8sgzamrbmj1fday15szf7f2279s8-nix-2.34.7/bin/nix --extra-experimental-features nix-command --extra-experimental-features flakes --log-format internal-json run .#packages.x86_64-linux.nix-ci-check-gammaloop-nextest-core --print-build-logs
14.18 s
14.29 s
Downloading cached nix-ci-check-gammaloop-nextest-core from https://cache.nix-ci.com
14.33 s
Downloaded cached nix-ci-check-gammaloop-nextest-core (1016 B) in 38ms
14.33 s
Progress: 0 of 1 built, 1 of 1 downloaded from cache
18.94 s
evaluating derivation 'g
copying '/nix/store/qv5p
evaluating derivation 'g
copying '/nix/store/qv5p
evaluating derivation 'g
copying '/nix/store/qv5p
evaluating derivation 'g
copying '/nix/store/qv5p
evaluating derivation 'g
copying '/nix/store/qv5p
evaluating derivation 'g
copying '/nix/store/qv5p
evaluating derivation 'g
querying gammaloop-nexte
[0.0 KiB DL] querying in
[0 /2 built, 1 /0 /1 copied
[0 /1 built, 1 copied (4.
[1 /0 /1 built, 1 copied (gammaloop-nextest-core> Extracting 4 binaries (including 1 non-test binary), 1 build script output directory, and 2 linked paths to /build/nextest-archive-1WMVsf
19.60 s
gammaloop-nextest-core> Extracted 20 files to /build/nextest-archive-1WMVsf in 0.66s
19.61 s
gammaloop-nextest-core> ------------
19.61 s
gammaloop-nextest-core> Nextest run ID e9ccbace-fcc8-4cd6-83d4-8e42930ad43b with nextest profile: ci_gammaloop
19.61 s
gammaloop-nextest-core> Starting 377 tests across 3 binaries
20.83 s
gammaloop-nextest-core> ------------
20.83 s
gammaloop-nextest-core> Summary [ 1.222s] 377 tests run: 377 passed , 0 skipped
20.95 s
gammaloop-nextest-core>
20.95 s
gammaloop-nextest-core> ========== nextest test summary ==========
20.95 s
gammaloop-nextest-core> report: target/nextest/ci_gammaloop/junit.xml
20.95 s
gammaloop-nextest-core> tests: 377, failures: 0, errors: 0
20.95 s
gammaloop-nextest-core> No failing testcases found.
20.95 s
gammaloop-nextest-core> =========================================
20.96 s
gammaloop-nextest-core> Extracting 1 binary and 1 linked path to /build/nextest-archive-Jm2tCT
21.02 s
gammaloop-nextest-core> Extracted 7 files to /build/nextest-archive-Jm2tCT in 0.06s
21.03 s
gammaloop-nextest-core> ------------
21.03 s
gammaloop-nextest-core> Nextest run ID 5bbcc898-c823-4d8d-bec8-5c3ab7ed262e with nextest profile: ci_gammaloop
21.03 s
gammaloop-nextest-core> Starting 19 tests across 1 binary
21.04 s
gammaloop-nextest-core> ------------
21.04 s
gammaloop-nextest-core> Summary [ 0.010s] 19 tests run: 19 passed , 0 skipped
21.07 s
gammaloop-nextest-core>
21.07 s
gammaloop-nextest-core> ========== nextest test summary ==========
21.07 s
gammaloop-nextest-core> report: target/nextest/ci_gammaloop/junit.xml
21.07 s
gammaloop-nextest-core> tests: 19, failures: 0, errors: 0
21.07 s
gammaloop-nextest-core> No failing testcases found.
21.07 s
gammaloop-nextest-core> =========================================
21.09 s
gammaloop-nextest-core> Extracting 1 binary to /build/nextest-archive-emB78B
21.12 s
gammaloop-nextest-core> Extracted 4 files to /build/nextest-archive-emB78B in 0.03s
21.12 s
gammaloop-nextest-core> ------------
21.12 s
gammaloop-nextest-core> Nextest run ID 42ec92e2-bfc3-45f1-8d9f-72bbb8ab861f with nextest profile: ci_gammaloop
21.12 s
gammaloop-nextest-core> Starting 0 tests across 1 binary
21.12 s
gammaloop-nextest-core> ------------
21.12 s
gammaloop-nextest-core> Summary [ 0.000s] 0 tests run: 0 passed , 0 skipped
21.15 s
gammaloop-nextest-core>
21.15 s
gammaloop-nextest-core> ========== nextest test summary ==========
21.15 s
gammaloop-nextest-core> report: target/nextest/ci_gammaloop/junit.xml
21.15 s
gammaloop-nextest-core> tests: 0, failures: 0, errors: 0
21.15 s
gammaloop-nextest-core> No failing testcases found.
21.15 s
gammaloop-nextest-core> =========================================
21.16 s
gammaloop-nextest-core> Extracting 4 binaries, 1 build script output directory, and 2 linked paths to /build/nextest-archive-wM1TvL
21.59 s
gammaloop-nextest-core> Extracted 18 files to /build/nextest-archive-wM1TvL in 0.43s
21.60 s
gammaloop-nextest-core> ------------
21.60 s
gammaloop-nextest-core> Nextest run ID 72bf24a3-3629-4554-a369-b0ce45f6f568 with nextest profile: ci_gammaloop
21.60 s
gammaloop-nextest-core> Starting 645 tests across 4 binaries (59 tests skipped , including 58 tests via profile.ci_gammaloop.default-filter )
22.74 s
gammaloop-nextest-core> FAIL [ 0.081s] (555/645) gammalooprs uv::approx::local_4d::tests :: dod_one_triangle_keeps_separate_denominator_topologies
22.74 s
gammaloop-nextest-core> stdout ---
22.74 s
gammaloop-nextest-core>
22.74 s
gammaloop-nextest-core> running 1 test
22.74 s
gammaloop-nextest-core> test uv::approx::local_4d::tests::dod_one_triangle_keeps_separate_denominator_topologies ... FAILED
22.74 s
gammaloop-nextest-core>
22.74 s
gammaloop-nextest-core> failures:
22.74 s
gammaloop-nextest-core>
22.74 s
gammaloop-nextest-core> failures:
22.74 s
gammaloop-nextest-core> uv::approx::local_4d::tests::dod_one_triangle_keeps_separate_denominator_topologies
22.74 s
gammaloop-nextest-core>
22.74 s
gammaloop-nextest-core> test result: FAILED. 0 passed; 1 failed; 0 ignored; 0 measured; 695 filtered out; finished in 0.07s
22.74 s
gammaloop-nextest-core>
22.74 s
gammaloop-nextest-core> stderr ---
22.74 s
gammaloop-nextest-core> The application panicked (crashed).
22.74 s
gammaloop-nextest-core> Message: assertion `left == right` failed
22.74 s
gammaloop-nextest-core> left: [[1, 1, 1], [1, 1, 1], [1, 1, 2], [2, 1, 1]]
22.74 s
gammaloop-nextest-core> right: [[1, 1, 1], [1, 1, 2], [2, 1, 1]]
22.74 s
gammaloop-nextest-core> Location: crates/gammalooprs/src/uv/approx/local_4d.rs :1992
22.74 s
gammaloop-nextest-core>
22.74 s
gammaloop-nextest-core> ━━━━━━━━━━━━━━━━━━━━━━━━━━━━━━━━━━ BACKTRACE ━━━━━━━━━━━━━━━━━━━━━━━━━━━━━━━━━━━
22.74 s
gammaloop-nextest-core> 1: <color_eyre[51793ea62743adbd]::config::PanicHook>::panic_report <unknown>
22.74 s
gammaloop-nextest-core> at <unknown source file> :<unknown line>
22.74 s
gammaloop-nextest-core> 2: <color_eyre[51793ea62743adbd]::config::PanicHook>::into_panic_hook::{closure#0} <unknown>
22.74 s
gammaloop-nextest-core> at <unknown source file> :<unknown line>
22.74 s
gammaloop-nextest-core> 3: std[bcb96dfbba0ab899]::panicking::panic_with_hook <unknown>
22.74 s
gammaloop-nextest-core> at <unknown source file> :<unknown line>
22.74 s
gammaloop-nextest-core> 4: std[bcb96dfbba0ab899]::panicking::panic_handler::{closure#0} <unknown>
22.74 s
gammaloop-nextest-core> at <unknown source file> :<unknown line>
22.74 s
gammaloop-nextest-core> 5: std[bcb96dfbba0ab899]::sys::backtrace::__rust_end_short_backtrace::<std[bcb96dfbba0ab899]::panicking::panic_handler::{closure#0}, !> <unknown>
22.74 s
gammaloop-nextest-core> at <unknown source file> :<unknown line>
22.74 s
gammaloop-nextest-core> 6: __rustc[6c289b9f9c454d21]::rust_begin_unwind <unknown>
22.74 s
gammaloop-nextest-core> at <unknown source file> :<unknown line>
22.74 s
gammaloop-nextest-core> 7: core[940e698046960fd5]::panicking::panic_fmt <unknown>
22.74 s
gammaloop-nextest-core> at <unknown source file> :<unknown line>
22.74 s
gammaloop-nextest-core> 8: core[940e698046960fd5]::panicking::assert_failed_inner <unknown>
22.74 s
gammaloop-nextest-core> at <unknown source file> :<unknown line>
22.74 s
gammaloop-nextest-core> 9: core[940e698046960fd5]::panicking::assert_failed::<alloc[2ea6bcb46fca0c42]::vec::Vec<[usize; 3usize]>, alloc[2ea6bcb46fca0c42]::vec::Vec<[usize; 3usize]>> <unknown>
22.74 s
gammaloop-nextest-core> at <unknown source file> :<unknown line>
22.74 s
gammaloop-nextest-core> 10: gammalooprs[8af0a922d9a4c82d]::uv::approx::local_4d::tests::dod_one_triangle_keeps_separate_denominator_topologies <unknown>
22.74 s
gammaloop-nextest-core> at <unknown source file> :<unknown line>
22.74 s
gammaloop-nextest-core> 11: <gammalooprs[8af0a922d9a4c82d]::uv::approx::local_4d::tests::dod_one_triangle_keeps_separate_denominator_topologies::{closure#0} as core[940e698046960fd5]::ops::function::FnOnce<()>>::call_once <unknown>
22.74 s
gammaloop-nextest-core> at <unknown source file> :<unknown line>
22.74 s
gammaloop-nextest-core> 12: test[75d6903177b1d7e9]::__rust_begin_short_backtrace::<core[940e698046960fd5]::result::Result<(), alloc[2ea6bcb46fca0c42]::string::String>, fn() -> core[940e698046960fd5]::result::Result<(), alloc[2ea6bcb46fca0c42]::string::String>> <unknown>
22.74 s
gammaloop-nextest-core> at <unknown source file> :<unknown line>
22.74 s
gammaloop-nextest-core> 13: test[75d6903177b1d7e9]::run_test::{closure#0} <unknown>
22.74 s
gammaloop-nextest-core> at <unknown source file> :<unknown line>
22.74 s
gammaloop-nextest-core> 14: std[bcb96dfbba0ab899]::sys::backtrace::__rust_begin_short_backtrace::<test[75d6903177b1d7e9]::run_test::{closure#1}, ()> <unknown>
22.74 s
gammaloop-nextest-core> at <unknown source file> :<unknown line>
22.74 s
gammaloop-nextest-core> 15: <std[bcb96dfbba0ab899]::thread::lifecycle::spawn_unchecked<test[75d6903177b1d7e9]::run_test::{closure#1}, ()>::{closure#1} as core[940e698046960fd5]::ops::function::FnOnce<()>>::call_once::{shim:vtable#0} <unknown>
22.74 s
gammaloop-nextest-core> at <unknown source file> :<unknown line>
22.74 s
gammaloop-nextest-core> 16: <std[bcb96dfbba0ab899]::sys::thread::unix::Thread>::new::thread_start <unknown>
22.74 s
gammaloop-nextest-core> at <unknown source file> :<unknown line>
22.74 s
gammaloop-nextest-core> 17: start_thread <unknown>
22.74 s
gammaloop-nextest-core> at <unknown source file> :<unknown line>
22.74 s
gammaloop-nextest-core> 18: __clone3 <unknown>
22.74 s
gammaloop-nextest-core> at <unknown source file> :<unknown line>
22.74 s
gammaloop-nextest-core>
22.74 s
gammaloop-nextest-core> Run with COLORBT_SHOW_HIDDEN=1 environment variable to disable frame filtering.
22.74 s
gammaloop-nextest-core> Run with RUST_BACKTRACE=full to include source snippets.
22.74 s
gammaloop-nextest-core>
22.95 s
gammaloop-nextest-core> FAIL [ 0.225s] (572/645) gammalooprs uv::approx::tests :: factorized_owned_dot_child_cff_matches_direct_3d_for_uncut_self_energy
22.95 s
gammaloop-nextest-core> stdout ---
22.95 s
gammaloop-nextest-core>
22.95 s
gammaloop-nextest-core> running 1 test
22.95 s
gammaloop-nextest-core> test uv::approx::tests::factorized_owned_dot_child_cff_matches_direct_3d_for_uncut_self_energy ... FAILED
22.95 s
gammaloop-nextest-core>
22.95 s
gammaloop-nextest-core> failures:
22.95 s
gammaloop-nextest-core>
22.95 s
gammaloop-nextest-core> failures:
22.95 s
gammaloop-nextest-core> uv::approx::tests::factorized_owned_dot_child_cff_matches_direct_3d_for_uncut_self_energy
22.95 s
gammaloop-nextest-core>
22.95 s
gammaloop-nextest-core> test result: FAILED. 0 passed; 1 failed; 0 ignored; 0 measured; 695 filtered out; finished in 0.22s
22.95 s
gammaloop-nextest-core>
22.95 s
gammaloop-nextest-core> stderr ---
22.95 s
gammaloop-nextest-core> The application panicked (crashed).
22.95 s
gammaloop-nextest-core> Message: assertion `left == right` failed
22.95 s
gammaloop-nextest-core> left: [[1, 1, 2], [1, 2], [2, 2, 1], [2, 1], [2, 1], [2, 2, 1], [2, 2, 2, 1], [2, 2, 1]]
22.95 s
gammaloop-nextest-core> right: [[1, 1, 2, 2, 2]]
22.95 s
gammaloop-nextest-core> Location: crates/gammalooprs/src/uv/approx/mod.rs :1471
22.95 s
gammaloop-nextest-core>
22.95 s
gammaloop-nextest-core> ━━━━━━━━━━━━━━━━━━━━━━━━━━━━━━━━━━ BACKTRACE ━━━━━━━━━━━━━━━━━━━━━━━━━━━━━━━━━━━
22.95 s
gammaloop-nextest-core> 1: <color_eyre[51793ea62743adbd]::config::PanicHook>::panic_report <unknown>
22.95 s
gammaloop-nextest-core> at <unknown source file> :<unknown line>
22.95 s
gammaloop-nextest-core> 2: <color_eyre[51793ea62743adbd]::config::PanicHook>::into_panic_hook::{closure#0} <unknown>
22.95 s
gammaloop-nextest-core> at <unknown source file> :<unknown line>
22.95 s
gammaloop-nextest-core> 3: std[bcb96dfbba0ab899]::panicking::panic_with_hook <unknown>
22.95 s
gammaloop-nextest-core> at <unknown source file> :<unknown line>
22.95 s
gammaloop-nextest-core> 4: std[bcb96dfbba0ab899]::panicking::panic_handler::{closure#0} <unknown>
22.95 s
gammaloop-nextest-core> at <unknown source file> :<unknown line>
22.95 s
gammaloop-nextest-core> 5: std[bcb96dfbba0ab899]::sys::backtrace::__rust_end_short_backtrace::<std[bcb96dfbba0ab899]::panicking::panic_handler::{closure#0}, !> <unknown>
22.95 s
gammaloop-nextest-core> at <unknown source file> :<unknown line>
22.95 s
gammaloop-nextest-core> 6: __rustc[6c289b9f9c454d21]::rust_begin_unwind <unknown>
22.95 s
gammaloop-nextest-core> at <unknown source file> :<unknown line>
22.95 s
gammaloop-nextest-core> 7: core[940e698046960fd5]::panicking::panic_fmt <unknown>
22.95 s
gammaloop-nextest-core> at <unknown source file> :<unknown line>
22.95 s
gammaloop-nextest-core> 8: core[940e698046960fd5]::panicking::assert_failed_inner <unknown>
22.95 s
gammaloop-nextest-core> at <unknown source file> :<unknown line>
22.95 s
gammaloop-nextest-core> 9: core[940e698046960fd5]::panicking::assert_failed::<alloc[2ea6bcb46fca0c42]::vec::Vec<alloc[2ea6bcb46fca0c42]::vec::Vec<usize>>, alloc[2ea6bcb46fca0c42]::vec::Vec<alloc[2ea6bcb46fca0c42]::vec::Vec<usize>>> <unknown>
22.95 s
gammaloop-nextest-core> at <unknown source file> :<unknown line>
22.95 s
gammaloop-nextest-core> 10: gammalooprs[8af0a922d9a4c82d]::uv::approx::tests::factorized_owned_dot_child_cff_matches_direct_3d_for_uncut_self_energy <unknown>
22.95 s
gammaloop-nextest-core> at <unknown source file> :<unknown line>
22.95 s
gammaloop-nextest-core> 11: <gammalooprs[8af0a922d9a4c82d]::uv::approx::tests::factorized_owned_dot_child_cff_matches_direct_3d_for_uncut_self_energy::{closure#0} as core[940e698046960fd5]::ops::function::FnOnce<()>>::call_once <unknown>
22.95 s
gammaloop-nextest-core> at <unknown source file> :<unknown line>
22.95 s
gammaloop-nextest-core> 12: test[75d6903177b1d7e9]::__rust_begin_short_backtrace::<core[940e698046960fd5]::result::Result<(), alloc[2ea6bcb46fca0c42]::string::String>, fn() -> core[940e698046960fd5]::result::Result<(), alloc[2ea6bcb46fca0c42]::string::String>> <unknown>
22.95 s
gammaloop-nextest-core> at <unknown source file> :<unknown line>
22.95 s
gammaloop-nextest-core> 13: test[75d6903177b1d7e9]::run_test::{closure#0} <unknown>
22.95 s
gammaloop-nextest-core> at <unknown source file> :<unknown line>
22.95 s
gammaloop-nextest-core> 14: std[bcb96dfbba0ab899]::sys::backtrace::__rust_begin_short_backtrace::<test[75d6903177b1d7e9]::run_test::{closure#1}, ()> <unknown>
22.96 s
gammaloop-nextest-core> at <unknown source file> :<unknown line>
22.96 s
gammaloop-nextest-core> 15: <std[bcb96dfbba0ab899]::thread::lifecycle::spawn_unchecked<test[75d6903177b1d7e9]::run_test::{closure#1}, ()>::{closure#1} as core[940e698046960fd5]::ops::function::FnOnce<()>>::call_once::{shim:vtable#0} <unknown>
22.96 s
gammaloop-nextest-core> at <unknown source file> :<unknown line>
22.96 s
gammaloop-nextest-core> 16: <std[bcb96dfbba0ab899]::sys::thread::unix::Thread>::new::thread_start <unknown>
22.96 s
gammaloop-nextest-core> at <unknown source file> :<unknown line>
22.96 s
gammaloop-nextest-core> 17: start_thread <unknown>
22.96 s
gammaloop-nextest-core> at <unknown source file> :<unknown line>
22.96 s
gammaloop-nextest-core> 18: __clone3 <unknown>
22.96 s
gammaloop-nextest-core> at <unknown source file> :<unknown line>
22.96 s
gammaloop-nextest-core>
22.96 s
gammaloop-nextest-core> Run with COLORBT_SHOW_HIDDEN=1 environment variable to disable frame filtering.
22.96 s
gammaloop-nextest-core> Run with RUST_BACKTRACE=full to include source snippets.
22.96 s
gammaloop-nextest-core>
30.55 s
gammaloop-nextest-core> ------------
30.55 s
gammaloop-nextest-core> Summary [ 8.952s] 645 tests run: 643 passed , 2 failed , 59 skipped
30.55 s
gammaloop-nextest-core> FAIL [ 0.081s] (555/645) gammalooprs uv::approx::local_4d::tests :: dod_one_triangle_keeps_separate_denominator_topologies
30.55 s
gammaloop-nextest-core> stdout ---
30.55 s
gammaloop-nextest-core>
30.55 s
gammaloop-nextest-core> running 1 test
30.55 s
gammaloop-nextest-core> test uv::approx::local_4d::tests::dod_one_triangle_keeps_separate_denominator_topologies ... FAILED
30.55 s
gammaloop-nextest-core>
30.55 s
gammaloop-nextest-core> failures:
30.55 s
gammaloop-nextest-core>
30.55 s
gammaloop-nextest-core> failures:
30.55 s
gammaloop-nextest-core> uv::approx::local_4d::tests::dod_one_triangle_keeps_separate_denominator_topologies
30.55 s
gammaloop-nextest-core>
30.55 s
gammaloop-nextest-core> test result: FAILED. 0 passed; 1 failed; 0 ignored; 0 measured; 695 filtered out; finished in 0.07s
30.55 s
gammaloop-nextest-core>
30.55 s
gammaloop-nextest-core> stderr ---
30.55 s
gammaloop-nextest-core> The application panicked (crashed).
30.55 s
gammaloop-nextest-core> Message: assertion `left == right` failed
30.55 s
gammaloop-nextest-core> left: [[1, 1, 1], [1, 1, 1], [1, 1, 2], [2, 1, 1]]
30.55 s
gammaloop-nextest-core> right: [[1, 1, 1], [1, 1, 2], [2, 1, 1]]
30.55 s
gammaloop-nextest-core> Location: crates/gammalooprs/src/uv/approx/local_4d.rs :1992
30.55 s
gammaloop-nextest-core>
30.55 s
gammaloop-nextest-core> ━━━━━━━━━━━━━━━━━━━━━━━━━━━━━━━━━━ BACKTRACE ━━━━━━━━━━━━━━━━━━━━━━━━━━━━━━━━━━━
30.55 s
gammaloop-nextest-core> 1: <color_eyre[51793ea62743adbd]::config::PanicHook>::panic_report <unknown>
30.55 s
gammaloop-nextest-core> at <unknown source file> :<unknown line>
30.55 s
gammaloop-nextest-core> 2: <color_eyre[51793ea62743adbd]::config::PanicHook>::into_panic_hook::{closure#0} <unknown>
30.55 s
gammaloop-nextest-core> at <unknown source file> :<unknown line>
30.55 s
gammaloop-nextest-core> 3: std[bcb96dfbba0ab899]::panicking::panic_with_hook <unknown>
30.55 s
gammaloop-nextest-core> at <unknown source file> :<unknown line>
30.55 s
gammaloop-nextest-core> 4: std[bcb96dfbba0ab899]::panicking::panic_handler::{closure#0} <unknown>
30.55 s
gammaloop-nextest-core> at <unknown source file> :<unknown line>
30.55 s
gammaloop-nextest-core> 5: std[bcb96dfbba0ab899]::sys::backtrace::__rust_end_short_backtrace::<std[bcb96dfbba0ab899]::panicking::panic_handler::{closure#0}, !> <unknown>
30.55 s
gammaloop-nextest-core> at <unknown source file> :<unknown line>
30.55 s
gammaloop-nextest-core> 6: __rustc[6c289b9f9c454d21]::rust_begin_unwind <unknown>
30.55 s
gammaloop-nextest-core> at <unknown source file> :<unknown line>
30.55 s
gammaloop-nextest-core> 7: core[940e698046960fd5]::panicking::panic_fmt <unknown>
30.55 s
gammaloop-nextest-core> at <unknown source file> :<unknown line>
30.55 s
gammaloop-nextest-core> 8: core[940e698046960fd5]::panicking::assert_failed_inner <unknown>
30.55 s
gammaloop-nextest-core> at <unknown source file> :<unknown line>
30.55 s
gammaloop-nextest-core> 9: core[940e698046960fd5]::panicking::assert_failed::<alloc[2ea6bcb46fca0c42]::vec::Vec<[usize; 3usize]>, alloc[2ea6bcb46fca0c42]::vec::Vec<[usize; 3usize]>> <unknown>
30.55 s
gammaloop-nextest-core> at <unknown source file> :<unknown line>
30.55 s
gammaloop-nextest-core> 10: gammalooprs[8af0a922d9a4c82d]::uv::approx::local_4d::tests::dod_one_triangle_keeps_separate_denominator_topologies <unknown>
30.55 s
gammaloop-nextest-core> at <unknown source file> :<unknown line>
30.55 s
gammaloop-nextest-core> 11: <gammalooprs[8af0a922d9a4c82d]::uv::approx::local_4d::tests::dod_one_triangle_keeps_separate_denominator_topologies::{closure#0} as core[940e698046960fd5]::ops::function::FnOnce<()>>::call_once <unknown>
30.55 s
gammaloop-nextest-core> at <unknown source file> :<unknown line>
30.55 s
gammaloop-nextest-core> 12: test[75d6903177b1d7e9]::__rust_begin_short_backtrace::<core[940e698046960fd5]::result::Result<(), alloc[2ea6bcb46fca0c42]::string::String>, fn() -> core[940e698046960fd5]::result::Result<(), alloc[2ea6bcb46fca0c42]::string::String>> <unknown>
30.55 s
gammaloop-nextest-core> at <unknown source file> :<unknown line>
30.55 s
gammaloop-nextest-core> 13: test[75d6903177b1d7e9]::run_test::{closure#0} <unknown>
30.55 s
gammaloop-nextest-core> at <unknown source file> :<unknown line>
30.55 s
gammaloop-nextest-core> 14: std[bcb96dfbba0ab899]::sys::backtrace::__rust_begin_short_backtrace::<test[75d6903177b1d7e9]::run_test::{closure#1}, ()> <unknown>
30.55 s
gammaloop-nextest-core> at <unknown source file> :<unknown line>
30.55 s
gammaloop-nextest-core> 15: <std[bcb96dfbba0ab899]::thread::lifecycle::spawn_unchecked<test[75d6903177b1d7e9]::run_test::{closure#1}, ()>::{closure#1} as core[940e698046960fd5]::ops::function::FnOnce<()>>::call_once::{shim:vtable#0} <unknown>
30.55 s
gammaloop-nextest-core> at <unknown source file> :<unknown line>
30.55 s
gammaloop-nextest-core> 16: <std[bcb96dfbba0ab899]::sys::thread::unix::Thread>::new::thread_start <unknown>
30.55 s
gammaloop-nextest-core> at <unknown source file> :<unknown line>
30.55 s
gammaloop-nextest-core> 17: start_thread <unknown>
30.55 s
gammaloop-nextest-core> at <unknown source file> :<unknown line>
30.55 s
gammaloop-nextest-core> 18: __clone3 <unknown>
30.55 s
gammaloop-nextest-core> at <unknown source file> :<unknown line>
30.55 s
gammaloop-nextest-core>
30.55 s
gammaloop-nextest-core> Run with COLORBT_SHOW_HIDDEN=1 environment variable to disable frame filtering.
30.55 s
gammaloop-nextest-core> Run with RUST_BACKTRACE=full to include source snippets.
30.55 s
gammaloop-nextest-core>
30.55 s
gammaloop-nextest-core> FAIL [ 0.225s] (572/645) gammalooprs uv::approx::tests :: factorized_owned_dot_child_cff_matches_direct_3d_for_uncut_self_energy
30.55 s
gammaloop-nextest-core> stdout ---
30.55 s
gammaloop-nextest-core>
30.55 s
gammaloop-nextest-core> running 1 test
30.55 s
gammaloop-nextest-core> test uv::approx::tests::factorized_owned_dot_child_cff_matches_direct_3d_for_uncut_self_energy ... FAILED
30.55 s
gammaloop-nextest-core>
30.55 s
gammaloop-nextest-core> failures:
30.55 s
gammaloop-nextest-core>
30.55 s
gammaloop-nextest-core> failures:
30.55 s
gammaloop-nextest-core> uv::approx::tests::factorized_owned_dot_child_cff_matches_direct_3d_for_uncut_self_energy
30.55 s
gammaloop-nextest-core>
30.55 s
gammaloop-nextest-core> test result: FAILED. 0 passed; 1 failed; 0 ignored; 0 measured; 695 filtered out; finished in 0.22s
30.55 s
gammaloop-nextest-core>
30.55 s
gammaloop-nextest-core> stderr ---
30.55 s
gammaloop-nextest-core> The application panicked (crashed).
30.55 s
gammaloop-nextest-core> Message: assertion `left == right` failed
30.55 s
gammaloop-nextest-core> left: [[1, 1, 2], [1, 2], [2, 2, 1], [2, 1], [2, 1], [2, 2, 1], [2, 2, 2, 1], [2, 2, 1]]
30.55 s
gammaloop-nextest-core> right: [[1, 1, 2, 2, 2]]
30.55 s
gammaloop-nextest-core> Location: crates/gammalooprs/src/uv/approx/mod.rs :1471
30.55 s
gammaloop-nextest-core>
30.55 s
gammaloop-nextest-core> ━━━━━━━━━━━━━━━━━━━━━━━━━━━━━━━━━━ BACKTRACE ━━━━━━━━━━━━━━━━━━━━━━━━━━━━━━━━━━━
30.55 s
gammaloop-nextest-core> 1: <color_eyre[51793ea62743adbd]::config::PanicHook>::panic_report <unknown>
30.55 s
gammaloop-nextest-core> at <unknown source file> :<unknown line>
30.55 s
gammaloop-nextest-core> 2: <color_eyre[51793ea62743adbd]::config::PanicHook>::into_panic_hook::{closure#0} <unknown>
30.55 s
gammaloop-nextest-core> at <unknown source file> :<unknown line>
30.55 s
gammaloop-nextest-core> 3: std[bcb96dfbba0ab899]::panicking::panic_with_hook <unknown>
30.55 s
gammaloop-nextest-core> at <unknown source file> :<unknown line>
30.55 s
gammaloop-nextest-core> 4: std[bcb96dfbba0ab899]::panicking::panic_handler::{closure#0} <unknown>
30.55 s
gammaloop-nextest-core> at <unknown source file> :<unknown line>
30.55 s
gammaloop-nextest-core> 5: std[bcb96dfbba0ab899]::sys::backtrace::__rust_end_short_backtrace::<std[bcb96dfbba0ab899]::panicking::panic_handler::{closure#0}, !> <unknown>
30.55 s
gammaloop-nextest-core> at <unknown source file> :<unknown line>
30.55 s
gammaloop-nextest-core> 6: __rustc[6c289b9f9c454d21]::rust_begin_unwind <unknown>
30.55 s
gammaloop-nextest-core> at <unknown source file> :<unknown line>
30.55 s
gammaloop-nextest-core> 7: core[940e698046960fd5]::panicking::panic_fmt <unknown>
30.55 s
gammaloop-nextest-core> at <unknown source file> :<unknown line>
30.55 s
gammaloop-nextest-core> 8: core[940e698046960fd5]::panicking::assert_failed_inner <unknown>
30.55 s
gammaloop-nextest-core> at <unknown source file> :<unknown line>
30.55 s
gammaloop-nextest-core> 9: core[940e698046960fd5]::panicking::assert_failed::<alloc[2ea6bcb46fca0c42]::vec::Vec<alloc[2ea6bcb46fca0c42]::vec::Vec<usize>>, alloc[2ea6bcb46fca0c42]::vec::Vec<alloc[2ea6bcb46fca0c42]::vec::Vec<usize>>> <unknown>
30.55 s
gammaloop-nextest-core> at <unknown source file> :<unknown line>
30.55 s
gammaloop-nextest-core> 10: gammalooprs[8af0a922d9a4c82d]::uv::approx::tests::factorized_owned_dot_child_cff_matches_direct_3d_for_uncut_self_energy <unknown>
30.55 s
gammaloop-nextest-core> at <unknown source file> :<unknown line>
30.55 s
gammaloop-nextest-core> 11: <gammalooprs[8af0a922d9a4c82d]::uv::approx::tests::factorized_owned_dot_child_cff_matches_direct_3d_for_uncut_self_energy::{closure#0} as core[940e698046960fd5]::ops::function::FnOnce<()>>::call_once <unknown>
30.55 s
gammaloop-nextest-core> at <unknown source file> :<unknown line>
30.55 s
gammaloop-nextest-core> 12: test[75d6903177b1d7e9]::__rust_begin_short_backtrace::<core[940e698046960fd5]::result::Result<(), alloc[2ea6bcb46fca0c42]::string::String>, fn() -> core[940e698046960fd5]::result::Result<(), alloc[2ea6bcb46fca0c42]::string::String>> <unknown>
30.55 s
gammaloop-nextest-core> at <unknown source file> :<unknown line>
30.55 s
gammaloop-nextest-core> 13: test[75d6903177b1d7e9]::run_test::{closure#0} <unknown>
30.55 s
gammaloop-nextest-core> at <unknown source file> :<unknown line>
30.55 s
gammaloop-nextest-core> 14: std[bcb96dfbba0ab899]::sys::backtrace::__rust_begin_short_backtrace::<test[75d6903177b1d7e9]::run_test::{closure#1}, ()> <unknown>
30.55 s
gammaloop-nextest-core> at <unknown source file> :<unknown line>
30.55 s
gammaloop-nextest-core> 15: <std[bcb96dfbba0ab899]::thread::lifecycle::spawn_unchecked<test[75d6903177b1d7e9]::run_test::{closure#1}, ()>::{closure#1} as core[940e698046960fd5]::ops::function::FnOnce<()>>::call_once::{shim:vtable#0} <unknown>
30.55 s
gammaloop-nextest-core> at <unknown source file> :<unknown line>
30.55 s
gammaloop-nextest-core> 16: <std[bcb96dfbba0ab899]::sys::thread::unix::Thread>::new::thread_start <unknown>
30.55 s
gammaloop-nextest-core> at <unknown source file> :<unknown line>
30.55 s
gammaloop-nextest-core> 17: start_thread <unknown>
30.55 s
gammaloop-nextest-core> at <unknown source file> :<unknown line>
30.55 s
gammaloop-nextest-core> 18: __clone3 <unknown>
30.55 s
gammaloop-nextest-core> at <unknown source file> :<unknown line>
30.55 s
gammaloop-nextest-core>
30.55 s
gammaloop-nextest-core> Run with COLORBT_SHOW_HIDDEN=1 environment variable to disable frame filtering.
30.55 s
gammaloop-nextest-core> Run with RUST_BACKTRACE=full to include source snippets.
30.55 s
gammaloop-nextest-core>
30.62 s
gammaloop-nextest-core> error : test run failed
30.64 s
gammaloop-nextest-core>
30.64 s
gammaloop-nextest-core> ========== nextest test summary ==========
30.64 s
gammaloop-nextest-core> report: target/nextest/ci_gammaloop/junit.xml
30.64 s
gammaloop-nextest-core> tests: 645, failures: 2, errors: 0
30.64 s
gammaloop-nextest-core>
30.64 s
gammaloop-nextest-core> 1. gammalooprs::uv::approx::local_4d::tests::dod_one_triangle_keeps_separate_denominator_topologies
30.64 s
gammaloop-nextest-core> failure: test failure with exit code 101
30.64 s
gammaloop-nextest-core> system-out
30.64 s
gammaloop-nextest-core> running 1 test
30.64 s
gammaloop-nextest-core> test uv::approx::local_4d::tests::dod_one_triangle_keeps_separate_denominator_topologies ... FAILED
30.64 s
gammaloop-nextest-core>
30.64 s
gammaloop-nextest-core> failures:
30.64 s
gammaloop-nextest-core>
30.64 s
gammaloop-nextest-core> failures:
30.64 s
gammaloop-nextest-core> uv::approx::local_4d::tests::dod_one_triangle_keeps_separate_denominator_topologies
30.64 s
gammaloop-nextest-core>
30.64 s
gammaloop-nextest-core> test result: FAILED. 0 passed; 1 failed; 0 ignored; 0 measured; 695 filtered out; finished in 0.07s
30.64 s
gammaloop-nextest-core> system-err
30.64 s
gammaloop-nextest-core> The application panicked (crashed).
30.64 s
gammaloop-nextest-core> Message: assertion `left == right` failed
30.64 s
gammaloop-nextest-core> left: [[1, 1, 1], [1, 1, 1], [1, 1, 2], [2, 1, 1]]
30.64 s
gammaloop-nextest-core> right: [[1, 1, 1], [1, 1, 2], [2, 1, 1]]
30.64 s
gammaloop-nextest-core> Location: crates/gammalooprs/src/uv/approx/local_4d.rs:1992
30.64 s
gammaloop-nextest-core>
30.64 s
gammaloop-nextest-core> ━━━━━━━━━━━━━━━━━━━━━━━━━━━━━━━━━━ BACKTRACE ━━━━━━━━━━━━━━━━━━━━━━━━━━━━━━━━━━━
30.64 s
gammaloop-nextest-core> 1: <color_eyre[51793ea62743adbd]::config::PanicHook>::panic_report<unknown>
30.64 s
gammaloop-nextest-core> at <unknown source file>:<unknown line>
30.64 s
gammaloop-nextest-core> 2: <color_eyre[51793ea62743adbd]::config::PanicHook>::into_panic_hook::{closure#0}<unknown>
30.64 s
gammaloop-nextest-core> at <unknown source file>:<unknown line>
30.64 s
gammaloop-nextest-core> 3: std[bcb96dfbba0ab899]::panicking::panic_with_hook<unknown>
30.64 s
gammaloop-nextest-core> at <unknown source file>:<unknown line>
30.64 s
gammaloop-nextest-core> 4: std[bcb96dfbba0ab899]::panicking::panic_handler::{closure#0}<unknown>
30.64 s
gammaloop-nextest-core> at <unknown source file>:<unknown line>
30.64 s
gammaloop-nextest-core> 5: std[bcb96dfbba0ab899]::sys::backtrace::__rust_end_short_backtrace::<std[bcb96dfbba0ab899]::panicking::panic_handler::{closure#0}, !><unknown>
30.64 s
gammaloop-nextest-core> at <unknown source file>:<unknown line>
30.64 s
gammaloop-nextest-core> 6: __rustc[6c289b9f9c454d21]::rust_begin_unwind<unknown>
30.65 s
gammaloop-nextest-core> at <unknown source file>:<unknown line>
30.65 s
gammaloop-nextest-core> 7: core[940e698046960fd5]::panicking::panic_fmt<unknown>
30.65 s
gammaloop-nextest-core> at <unknown source file>:<unknown line>
30.65 s
gammaloop-nextest-core> 8: core[940e698046960fd5]::panicking::assert_failed_inner<unknown>
30.65 s
gammaloop-nextest-core> at <unknown source file>:<unknown line>
30.65 s
gammaloop-nextest-core> 9: core[940e698046960fd5]::panicking::assert_failed::<alloc[2ea6bcb46fca0c42]::vec::Vec<[usize; 3usize]>, alloc[2ea6bcb46fca0c42]::vec::Vec<[usize; 3usize]>><unknown>
30.65 s
gammaloop-nextest-core> at <unknown source file>:<unknown line>
30.65 s
gammaloop-nextest-core> 10: gammalooprs[8af0a922d9a4c82d]::uv::approx::local_4d::tests::dod_one_triangle_keeps_separate_denominator_topologies<unknown>
30.65 s
gammaloop-nextest-core> at <unknown source file>:<unknown line>
30.65 s
gammaloop-nextest-core> 11: <gammalooprs[8af0a922d9a4c82d]::uv::approx::local_4d::tests::dod_one_triangle_keeps_separate_denominator_topologies::{closure#0} as core[940e698046960fd5]::ops::function::FnOnce<()>>::call_once<unknown>
30.65 s
gammaloop-nextest-core> at <unknown source file>:<unknown line>
30.65 s
gammaloop-nextest-core> 12: test[75d6903177b1d7e9]::__rust_begin_short_backtrace::<core[940e698046960fd5]::result::Result<(), alloc[2ea6bcb46fca0c42]::string::String>, fn() -> core[940e698046960fd5]::result::Result<(), alloc[2ea6bcb46fca0c42]::string::String>><unknown>
30.65 s
gammaloop-nextest-core> at <unknown source file>:<unknown line>
30.65 s
gammaloop-nextest-core> 13: test[75d6903177b1d7e9]::run_test::{closure#0}<unknown>
30.65 s
gammaloop-nextest-core> at <unknown source file>:<unknown line>
30.65 s
gammaloop-nextest-core> 14: std[bcb96dfbba0ab899]::sys::backtrace::__rust_begin_short_backtrace::<test[75d6903177b1d7e9]::run_test::{closure#1}, ()><unknown>
30.65 s
gammaloop-nextest-core> at <unknown source file>:<unknown line>
30.65 s
gammaloop-nextest-core> 15: <std[bcb96dfbba0ab899]::thread::lifecycle::spawn_unchecked<test[75d6903177b1d7e9]::run_test::{closure#1}, ()>::{closure#1} as core[940e698046960fd5]::ops::function::FnOnce<()>>::call_once::{shim:vtable#0}<unknown>
30.65 s
gammaloop-nextest-core> at <unknown source file>:<unknown line>
30.65 s
gammaloop-nextest-core> 16: <std[bcb96dfbba0ab899]::sys::thread::unix::Thread>::new::thread_start<unknown>
30.65 s
gammaloop-nextest-core> at <unknown source file>:<unknown line>
30.65 s
gammaloop-nextest-core> 17: start_thread<unknown>
30.65 s
gammaloop-nextest-core> at <unknown source file>:<unknown line>
30.65 s
gammaloop-nextest-core> 18: __clone3<unknown>
30.65 s
gammaloop-nextest-core> at <unknown source file>:<unknown line>
30.65 s
gammaloop-nextest-core>
30.65 s
gammaloop-nextest-core> Run with COLORBT_SHOW_HIDDEN=1 environment variable to disable frame filtering.
30.65 s
gammaloop-nextest-core> Run with RUST_BACKTRACE=full to include source snippets.
30.65 s
gammaloop-nextest-core>
30.65 s
gammaloop-nextest-core> 2. gammalooprs::uv::approx::tests::factorized_owned_dot_child_cff_matches_direct_3d_for_uncut_self_energy
30.65 s
gammaloop-nextest-core> failure: test failure with exit code 101
30.65 s
gammaloop-nextest-core> system-out
30.65 s
gammaloop-nextest-core> running 1 test
30.65 s
gammaloop-nextest-core> test uv::approx::tests::factorized_owned_dot_child_cff_matches_direct_3d_for_uncut_self_energy ... FAILED
30.65 s
gammaloop-nextest-core>
30.65 s
gammaloop-nextest-core> failures:
30.65 s
gammaloop-nextest-core>
30.65 s
gammaloop-nextest-core> failures:
30.65 s
gammaloop-nextest-core> uv::approx::tests::factorized_owned_dot_child_cff_matches_direct_3d_for_uncut_self_energy
30.65 s
gammaloop-nextest-core>
30.65 s
gammaloop-nextest-core> test result: FAILED. 0 passed; 1 failed; 0 ignored; 0 measured; 695 filtered out; finished in 0.22s
30.65 s
gammaloop-nextest-core> system-err
30.65 s
gammaloop-nextest-core> The application panicked (crashed).
30.65 s
gammaloop-nextest-core> Message: assertion `left == right` failed
30.65 s
gammaloop-nextest-core> left: [[1, 1, 2], [1, 2], [2, 2, 1], [2, 1], [2, 1], [2, 2, 1], [2, 2, 2, 1], [2, 2, 1]]
30.65 s
gammaloop-nextest-core> right: [[1, 1, 2, 2, 2]]
30.65 s
gammaloop-nextest-core> Location: crates/gammalooprs/src/uv/approx/mod.rs:1471
30.65 s
gammaloop-nextest-core>
30.65 s
gammaloop-nextest-core> ━━━━━━━━━━━━━━━━━━━━━━━━━━━━━━━━━━ BACKTRACE ━━━━━━━━━━━━━━━━━━━━━━━━━━━━━━━━━━━
30.65 s
gammaloop-nextest-core> 1: <color_eyre[51793ea62743adbd]::config::PanicHook>::panic_report<unknown>
30.65 s
gammaloop-nextest-core> at <unknown source file>:<unknown line>
30.65 s
gammaloop-nextest-core> 2: <color_eyre[51793ea62743adbd]::config::PanicHook>::into_panic_hook::{closure#0}<unknown>
30.65 s
gammaloop-nextest-core> at <unknown source file>:<unknown line>
30.65 s
gammaloop-nextest-core> 3: std[bcb96dfbba0ab899]::panicking::panic_with_hook<unknown>
30.65 s
gammaloop-nextest-core> at <unknown source file>:<unknown line>
30.65 s
gammaloop-nextest-core> 4: std[bcb96dfbba0ab899]::panicking::panic_handler::{closure#0}<unknown>
30.65 s
gammaloop-nextest-core> at <unknown source file>:<unknown line>
30.65 s
gammaloop-nextest-core> 5: std[bcb96dfbba0ab899]::sys::backtrace::__rust_end_short_backtrace::<std[bcb96dfbba0ab899]::panicking::panic_handler::{closure#0}, !><unknown>
30.65 s
gammaloop-nextest-core> at <unknown source file>:<unknown line>
30.65 s
gammaloop-nextest-core> 6: __rustc[6c289b9f9c454d21]::rust_begin_unwind<unknown>
30.65 s
gammaloop-nextest-core> at <unknown source file>:<unknown line>
30.65 s
gammaloop-nextest-core> 7: core[940e698046960fd5]::panicking::panic_fmt<unknown>
30.65 s
gammaloop-nextest-core> at <unknown source file>:<unknown line>
30.65 s
gammaloop-nextest-core> 8: core[940e698046960fd5]::panicking::assert_failed_inner<unknown>
30.65 s
gammaloop-nextest-core> at <unknown source file>:<unknown line>
30.65 s
gammaloop-nextest-core> 9: core[940e698046960fd5]::panicking::assert_failed::<alloc[2ea6bcb46fca0c42]::vec::Vec<alloc[2ea6bcb46fca0c42]::vec::Vec<usize>>, alloc[2ea6bcb46fca0c42]::vec::Vec<alloc[2ea6bcb46fca0c42]::vec::Vec<usize>>><unknown>
30.65 s
gammaloop-nextest-core> at <unknown source file>:<unknown line>
30.65 s
gammaloop-nextest-core> 10: gammalooprs[8af0a922d9a4c82d]::uv::approx::tests::factorized_owned_dot_child_cff_matches_direct_3d_for_uncut_self_energy<unknown>
30.65 s
gammaloop-nextest-core> at <unknown source file>:<unknown line>
30.65 s
gammaloop-nextest-core> 11: <gammalooprs[8af0a922d9a4c82d]::uv::approx::tests::factorized_owned_dot_child_cff_matches_direct_3d_for_uncut_self_energy::{closure#0} as core[940e698046960fd5]::ops::function::FnOnce<()>>::call_once<unknown>
30.65 s
gammaloop-nextest-core> at <unknown source file>:<unknown line>
30.65 s
gammaloop-nextest-core> 12: test[75d6903177b1d7e9]::__rust_begin_short_backtrace::<core[940e698046960fd5]::result::Result<(), alloc[2ea6bcb46fca0c42]::string::String>, fn() -> core[940e698046960fd5]::result::Result<(), alloc[2ea6bcb46fca0c42]::string::String>><unknown>
30.65 s
gammaloop-nextest-core> at <unknown source file>:<unknown line>
30.65 s
gammaloop-nextest-core> 13: test[75d6903177b1d7e9]::run_test::{closure#0}<unknown>
30.65 s
gammaloop-nextest-core> at <unknown source file>:<unknown line>
30.65 s
gammaloop-nextest-core> 14: std[bcb96dfbba0ab899]::sys::backtrace::__rust_begin_short_backtrace::<test[75d6903177b1d7e9]::run_test::{closure#1}, ()><unknown>
30.65 s
gammaloop-nextest-core> at <unknown source file>:<unknown line>
30.65 s
gammaloop-nextest-core> 15: <std[bcb96dfbba0ab899]::thread::lifecycle::spawn_unchecked<test[75d6903177b1d7e9]::run_test::{closure#1}, ()>::{closure#1} as core[940e698046960fd5]::ops::function::FnOnce<()>>::call_once::{shim:vtable#0}<unknown>
30.65 s
gammaloop-nextest-core> at <unknown source file>:<unknown line>
30.65 s
gammaloop-nextest-core> 16: <std[bcb96dfbba0ab899]::sys::thread::unix::Thread>::new::thread_start<unknown>
30.65 s
gammaloop-nextest-core> at <unknown source file>:<unknown line>
30.65 s
gammaloop-nextest-core> 17: start_thread<unknown>
30.65 s
gammaloop-nextest-core> at <unknown source file>:<unknown line>
30.65 s
gammaloop-nextest-core> 18: __clone3<unknown>
30.65 s
gammaloop-nextest-core> at <unknown source file>:<unknown line>
30.65 s
gammaloop-nextest-core>
30.65 s
gammaloop-nextest-core> Run with COLORBT_SHOW_HIDDEN=1 environment variable to disable frame filtering.
30.65 s
gammaloop-nextest-core> Run with RUST_BACKTRACE=full to include source snippets.
30.65 s
gammaloop-nextest-core> =========================================
30.66 s
gammaloop-nextest-core> Extracting 1 binary, 1 build script output directory, and 1 linked path to /build/nextest-archive-8Ku8gR
30.72 s
gammaloop-nextest-core> Extracted 7 files to /build/nextest-archive-8Ku8gR in 0.06s
30.73 s
gammaloop-nextest-core> ------------
30.73 s
gammaloop-nextest-core> Nextest run ID 520caa1d-18bb-4023-b1f4-d0ca0bbda3e2 with nextest profile: ci_gammaloop
30.73 s
gammaloop-nextest-core> Starting 119 tests across 1 binary
31.64 s
gammaloop-nextest-core> ------------
31.64 s
gammaloop-nextest-core> Summary [ 0.910s] 119 tests run: 119 passed , 0 skipped
31.67 s
gammaloop-nextest-core>
31.67 s
gammaloop-nextest-core> ========== nextest test summary ==========
31.67 s
gammaloop-nextest-core> report: target/nextest/ci_gammaloop/junit.xml
31.67 s
gammaloop-nextest-core> tests: 119, failures: 0, errors: 0
31.67 s
gammaloop-nextest-core> No failing testcases found.
31.67 s
gammaloop-nextest-core> =========================================
31.71 s
error: Cannot build '/nix/store/bcc3gg1akl605y0c3km3gjg8nsqsjzv8-gammaloop-nextest-core.drv '.
31.71 s
Reason: builder failed with exit code 100 .
31.71 s
Output paths:
31.71 s
/nix/store/i7lvgxhj7vpsi0jgq7jfdhgg9f5m1qi3-gammaloop-nextest-core
31.71 s
Last 429 log lines:
31.71 s
> Extracting 4 binaries (including 1 non-test binary), 1 build script output directory, and 2 linked paths to /build/nextest-archive-1WMVsf
31.71 s
> Extracted 20 files to /build/nextest-archive-1WMVsf in 0.66s
31.71 s
> ------------
31.71 s
> Nextest run ID e9ccbace-fcc8-4cd6-83d4-8e42930ad43b with nextest profile: ci_gammaloop
31.71 s
> Starting 377 tests across 3 binaries
31.71 s
> ------------
31.71 s
> Summary [ 1.222s] 377 tests run: 377 passed , 0 skipped
31.71 s
>
31.71 s
> ========== nextest test summary ==========
31.71 s
> report: target/nextest/ci_gammaloop/junit.xml
31.71 s
> tests: 377, failures: 0, errors: 0
31.71 s
> No failing testcases found.
31.71 s
> =========================================
31.71 s
> Extracting 1 binary and 1 linked path to /build/nextest-archive-Jm2tCT
31.71 s
> Extracted 7 files to /build/nextest-archive-Jm2tCT in 0.06s
31.71 s
> ------------
31.71 s
> Nextest run ID 5bbcc898-c823-4d8d-bec8-5c3ab7ed262e with nextest profile: ci_gammaloop
31.71 s
> Starting 19 tests across 1 binary
31.71 s
> ------------
31.71 s
> Summary [ 0.010s] 19 tests run: 19 passed , 0 skipped
31.71 s
>
31.71 s
> ========== nextest test summary ==========
31.71 s
> report: target/nextest/ci_gammaloop/junit.xml
31.71 s
> tests: 19, failures: 0, errors: 0
31.71 s
> No failing testcases found.
31.71 s
> =========================================
31.71 s
> Extracting 1 binary to /build/nextest-archive-emB78B
31.71 s
> Extracted 4 files to /build/nextest-archive-emB78B in 0.03s
31.71 s
> ------------
31.71 s
> Nextest run ID 42ec92e2-bfc3-45f1-8d9f-72bbb8ab861f with nextest profile: ci_gammaloop
31.71 s
> Starting 0 tests across 1 binary
31.71 s
> ------------
31.71 s
> Summary [ 0.000s] 0 tests run: 0 passed , 0 skipped
31.71 s
>
31.71 s
> ========== nextest test summary ==========
31.71 s
> report: target/nextest/ci_gammaloop/junit.xml
31.71 s
> tests: 0, failures: 0, errors: 0
31.71 s
> No failing testcases found.
31.71 s
> =========================================
31.71 s
> Extracting 4 binaries, 1 build script output directory, and 2 linked paths to /build/nextest-archive-wM1TvL
31.71 s
> Extracted 18 files to /build/nextest-archive-wM1TvL in 0.43s
31.71 s
> ------------
31.71 s
> Nextest run ID 72bf24a3-3629-4554-a369-b0ce45f6f568 with nextest profile: ci_gammaloop
31.71 s
> Starting 645 tests across 4 binaries (59 tests skipped , including 58 tests via profile.ci_gammaloop.default-filter )
31.71 s
> FAIL [ 0.081s] (555/645) gammalooprs uv::approx::local_4d::tests :: dod_one_triangle_keeps_separate_denominator_topologies
31.71 s
> stdout ---
31.71 s
>
31.71 s
> running 1 test
31.71 s
> test uv::approx::local_4d::tests::dod_one_triangle_keeps_separate_denominator_topologies ... FAILED
31.71 s
>
31.71 s
> failures:
31.71 s
>
31.71 s
> failures:
31.71 s
> uv::approx::local_4d::tests::dod_one_triangle_keeps_separate_denominator_topologies
31.71 s
>
31.71 s
> test result: FAILED. 0 passed; 1 failed; 0 ignored; 0 measured; 695 filtered out; finished in 0.07s
31.71 s
>
31.71 s
> stderr ---
31.71 s
> The application panicked (crashed).
31.71 s
> Message: assertion `left == right` failed
31.71 s
> left: [[1, 1, 1], [1, 1, 1], [1, 1, 2], [2, 1, 1]]
31.71 s
> right: [[1, 1, 1], [1, 1, 2], [2, 1, 1]]
31.71 s
> Location: crates/gammalooprs/src/uv/approx/local_4d.rs :1992
31.71 s
>
31.71 s
> ━━━━━━━━━━━━━━━━━━━━━━━━━━━━━━━━━━ BACKTRACE ━━━━━━━━━━━━━━━━━━━━━━━━━━━━━━━━━━━
31.71 s
> 1: <color_eyre[51793ea62743adbd]::config::PanicHook>::panic_report <unknown>
31.71 s
> at <unknown source file> :<unknown line>
31.71 s
> 2: <color_eyre[51793ea62743adbd]::config::PanicHook>::into_panic_hook::{closure#0} <unknown>
31.71 s
> at <unknown source file> :<unknown line>
31.71 s
> 3: std[bcb96dfbba0ab899]::panicking::panic_with_hook <unknown>
31.71 s
> at <unknown source file> :<unknown line>
31.71 s
> 4: std[bcb96dfbba0ab899]::panicking::panic_handler::{closure#0} <unknown>
31.71 s
> at <unknown source file> :<unknown line>
31.71 s
> 5: std[bcb96dfbba0ab899]::sys::backtrace::__rust_end_short_backtrace::<std[bcb96dfbba0ab899]::panicking::panic_handler::{closure#0}, !> <unknown>
31.71 s
> at <unknown source file> :<unknown line>
31.71 s
> 6: __rustc[6c289b9f9c454d21]::rust_begin_unwind <unknown>
31.71 s
> at <unknown source file> :<unknown line>
31.71 s
> 7: core[940e698046960fd5]::panicking::panic_fmt <unknown>
31.71 s
> at <unknown source file> :<unknown line>
31.71 s
> 8: core[940e698046960fd5]::panicking::assert_failed_inner <unknown>
31.71 s
> at <unknown source file> :<unknown line>
31.71 s
> 9: core[940e698046960fd5]::panicking::assert_failed::<alloc[2ea6bcb46fca0c42]::vec::Vec<[usize; 3usize]>, alloc[2ea6bcb46fca0c42]::vec::Vec<[usize; 3usize]>> <unknown>
31.71 s
> at <unknown source file> :<unknown line>
31.71 s
> 10: gammalooprs[8af0a922d9a4c82d]::uv::approx::local_4d::tests::dod_one_triangle_keeps_separate_denominator_topologies <unknown>
31.71 s
> at <unknown source file> :<unknown line>
31.71 s
> 11: <gammalooprs[8af0a922d9a4c82d]::uv::approx::local_4d::tests::dod_one_triangle_keeps_separate_denominator_topologies::{closure#0} as core[940e698046960fd5]::ops::function::FnOnce<()>>::call_once <unknown>
31.71 s
> at <unknown source file> :<unknown line>
31.71 s
> 12: test[75d6903177b1d7e9]::__rust_begin_short_backtrace::<core[940e698046960fd5]::result::Result<(), alloc[2ea6bcb46fca0c42]::string::String>, fn() -> core[940e698046960fd5]::result::Result<(), alloc[2ea6bcb46fca0c42]::string::String>> <unknown>
31.71 s
> at <unknown source file> :<unknown line>
31.71 s
> 13: test[75d6903177b1d7e9]::run_test::{closure#0} <unknown>
31.71 s
> at <unknown source file> :<unknown line>
31.71 s
> 14: std[bcb96dfbba0ab899]::sys::backtrace::__rust_begin_short_backtrace::<test[75d6903177b1d7e9]::run_test::{closure#1}, ()> <unknown>
31.71 s
> at <unknown source file> :<unknown line>
31.71 s
> 15: <std[bcb96dfbba0ab899]::thread::lifecycle::spawn_unchecked<test[75d6903177b1d7e9]::run_test::{closure#1}, ()>::{closure#1} as core[940e698046960fd5]::ops::function::FnOnce<()>>::call_once::{shim:vtable#0} <unknown>
31.71 s
> at <unknown source file> :<unknown line>
31.71 s
> 16: <std[bcb96dfbba0ab899]::sys::thread::unix::Thread>::new::thread_start <unknown>
31.71 s
> at <unknown source file> :<unknown line>
31.71 s
> 17: start_thread <unknown>
31.71 s
> at <unknown source file> :<unknown line>
31.71 s
> 18: __clone3 <unknown>
31.71 s
> at <unknown source file> :<unknown line>
31.71 s
>
31.71 s
> Run with COLORBT_SHOW_HIDDEN=1 environment variable to disable frame filtering.
31.71 s
> Run with RUST_BACKTRACE=full to include source snippets.
31.71 s
>
31.71 s
> FAIL [ 0.225s] (572/645) gammalooprs uv::approx::tests :: factorized_owned_dot_child_cff_matches_direct_3d_for_uncut_self_energy
31.71 s
> stdout ---
31.71 s
>
31.71 s
> running 1 test
31.71 s
> test uv::approx::tests::factorized_owned_dot_child_cff_matches_direct_3d_for_uncut_self_energy ... FAILED
31.71 s
>
31.71 s
> failures:
31.71 s
>
31.71 s
> failures:
31.71 s
> uv::approx::tests::factorized_owned_dot_child_cff_matches_direct_3d_for_uncut_self_energy
31.71 s
>
31.71 s
> test result: FAILED. 0 passed; 1 failed; 0 ignored; 0 measured; 695 filtered out; finished in 0.22s
31.71 s
>
31.71 s
> stderr ---
31.71 s
> The application panicked (crashed).
31.71 s
> Message: assertion `left == right` failed
31.71 s
> left: [[1, 1, 2], [1, 2], [2, 2, 1], [2, 1], [2, 1], [2, 2, 1], [2, 2, 2, 1], [2, 2, 1]]
31.71 s
> right: [[1, 1, 2, 2, 2]]
31.71 s
> Location: crates/gammalooprs/src/uv/approx/mod.rs :1471
31.71 s
>
31.71 s
> ━━━━━━━━━━━━━━━━━━━━━━━━━━━━━━━━━━ BACKTRACE ━━━━━━━━━━━━━━━━━━━━━━━━━━━━━━━━━━━
31.71 s
> 1: <color_eyre[51793ea62743adbd]::config::PanicHook>::panic_report <unknown>
31.71 s
> at <unknown source file> :<unknown line>
31.71 s
> 2: <color_eyre[51793ea62743adbd]::config::PanicHook>::into_panic_hook::{closure#0} <unknown>
31.71 s
> at <unknown source file> :<unknown line>
31.71 s
> 3: std[bcb96dfbba0ab899]::panicking::panic_with_hook <unknown>
31.71 s
> at <unknown source file> :<unknown line>
31.71 s
> 4: std[bcb96dfbba0ab899]::panicking::panic_handler::{closure#0} <unknown>
31.71 s
> at <unknown source file> :<unknown line>
31.71 s
> 5: std[bcb96dfbba0ab899]::sys::backtrace::__rust_end_short_backtrace::<std[bcb96dfbba0ab899]::panicking::panic_handler::{closure#0}, !> <unknown>
31.71 s
> at <unknown source file> :<unknown line>
31.71 s
> 6: __rustc[6c289b9f9c454d21]::rust_begin_unwind <unknown>
31.71 s
> at <unknown source file> :<unknown line>
31.71 s
> 7: core[940e698046960fd5]::panicking::panic_fmt <unknown>
31.71 s
> at <unknown source file> :<unknown line>
31.71 s
> 8: core[940e698046960fd5]::panicking::assert_failed_inner <unknown>
31.71 s
> at <unknown source file> :<unknown line>
31.71 s
> 9: core[940e698046960fd5]::panicking::assert_failed::<alloc[2ea6bcb46fca0c42]::vec::Vec<alloc[2ea6bcb46fca0c42]::vec::Vec<usize>>, alloc[2ea6bcb46fca0c42]::vec::Vec<alloc[2ea6bcb46fca0c42]::vec::Vec<usize>>> <unknown>
31.71 s
> at <unknown source file> :<unknown line>
31.71 s
> 10: gammalooprs[8af0a922d9a4c82d]::uv::approx::tests::factorized_owned_dot_child_cff_matches_direct_3d_for_uncut_self_energy <unknown>
31.71 s
> at <unknown source file> :<unknown line>
31.71 s
> 11: <gammalooprs[8af0a922d9a4c82d]::uv::approx::tests::factorized_owned_dot_child_cff_matches_direct_3d_for_uncut_self_energy::{closure#0} as core[940e698046960fd5]::ops::function::FnOnce<()>>::call_once <unknown>
31.71 s
> at <unknown source file> :<unknown line>
31.71 s
> 12: test[75d6903177b1d7e9]::__rust_begin_short_backtrace::<core[940e698046960fd5]::result::Result<(), alloc[2ea6bcb46fca0c42]::string::String>, fn() -> core[940e698046960fd5]::result::Result<(), alloc[2ea6bcb46fca0c42]::string::String>> <unknown>
31.71 s
> at <unknown source file> :<unknown line>
31.71 s
> 13: test[75d6903177b1d7e9]::run_test::{closure#0} <unknown>
31.71 s
> at <unknown source file> :<unknown line>
31.71 s
> 14: std[bcb96dfbba0ab899]::sys::backtrace::__rust_begin_short_backtrace::<test[75d6903177b1d7e9]::run_test::{closure#1}, ()> <unknown>
31.71 s
> at <unknown source file> :<unknown line>
31.71 s
> 15: <std[bcb96dfbba0ab899]::thread::lifecycle::spawn_unchecked<test[75d6903177b1d7e9]::run_test::{closure#1}, ()>::{closure#1} as core[940e698046960fd5]::ops::function::FnOnce<()>>::call_once::{shim:vtable#0} <unknown>
31.71 s
> at <unknown source file> :<unknown line>
31.71 s
> 16: <std[bcb96dfbba0ab899]::sys::thread::unix::Thread>::new::thread_start <unknown>
31.71 s
> at <unknown source file> :<unknown line>
31.71 s
> 17: start_thread <unknown>
31.71 s
> at <unknown source file> :<unknown line>
31.71 s
> 18: __clone3 <unknown>
31.71 s
> at <unknown source file> :<unknown line>
31.71 s
>
31.71 s
> Run with COLORBT_SHOW_HIDDEN=1 environment variable to disable frame filtering.
31.71 s
> Run with RUST_BACKTRACE=full to include source snippets.
31.71 s
>
31.71 s
> ------------
31.71 s
> Summary [ 8.952s] 645 tests run: 643 passed , 2 failed , 59 skipped
31.71 s
> FAIL [ 0.081s] (555/645) gammalooprs uv::approx::local_4d::tests :: dod_one_triangle_keeps_separate_denominator_topologies
31.71 s
> stdout ---
31.71 s
>
31.71 s
> running 1 test
31.71 s
> test uv::approx::local_4d::tests::dod_one_triangle_keeps_separate_denominator_topologies ... FAILED
31.71 s
>
31.71 s
> failures:
31.71 s
>
31.71 s
> failures:
31.71 s
> uv::approx::local_4d::tests::dod_one_triangle_keeps_separate_denominator_topologies
31.71 s
>
31.71 s
> test result: FAILED. 0 passed; 1 failed; 0 ignored; 0 measured; 695 filtered out; finished in 0.07s
31.71 s
>
31.71 s
> stderr ---
31.71 s
> The application panicked (crashed).
31.71 s
> Message: assertion `left == right` failed
31.71 s
> left: [[1, 1, 1], [1, 1, 1], [1, 1, 2], [2, 1, 1]]
31.71 s
> right: [[1, 1, 1], [1, 1, 2], [2, 1, 1]]
31.71 s
> Location: crates/gammalooprs/src/uv/approx/local_4d.rs :1992
31.71 s
>
31.71 s
> ━━━━━━━━━━━━━━━━━━━━━━━━━━━━━━━━━━ BACKTRACE ━━━━━━━━━━━━━━━━━━━━━━━━━━━━━━━━━━━
31.71 s
> 1: <color_eyre[51793ea62743adbd]::config::PanicHook>::panic_report <unknown>
31.71 s
> at <unknown source file> :<unknown line>
31.71 s
> 2: <color_eyre[51793ea62743adbd]::config::PanicHook>::into_panic_hook::{closure#0} <unknown>
31.71 s
> at <unknown source file> :<unknown line>
31.71 s
> 3: std[bcb96dfbba0ab899]::panicking::panic_with_hook <unknown>
31.71 s
> at <unknown source file> :<unknown line>
31.71 s
> 4: std[bcb96dfbba0ab899]::panicking::panic_handler::{closure#0} <unknown>
31.71 s
> at <unknown source file> :<unknown line>
31.71 s
> 5: std[bcb96dfbba0ab899]::sys::backtrace::__rust_end_short_backtrace::<std[bcb96dfbba0ab899]::panicking::panic_handler::{closure#0}, !> <unknown>
31.71 s
> at <unknown source file> :<unknown line>
31.71 s
> 6: __rustc[6c289b9f9c454d21]::rust_begin_unwind <unknown>
31.71 s
> at <unknown source file> :<unknown line>
31.71 s
> 7: core[940e698046960fd5]::panicking::panic_fmt <unknown>
31.71 s
> at <unknown source file> :<unknown line>
31.71 s
> 8: core[940e698046960fd5]::panicking::assert_failed_inner <unknown>
31.71 s
> at <unknown source file> :<unknown line>
31.71 s
> 9: core[940e698046960fd5]::panicking::assert_failed::<alloc[2ea6bcb46fca0c42]::vec::Vec<[usize; 3usize]>, alloc[2ea6bcb46fca0c42]::vec::Vec<[usize; 3usize]>> <unknown>
31.71 s
> at <unknown source file> :<unknown line>
31.71 s
> 10: gammalooprs[8af0a922d9a4c82d]::uv::approx::local_4d::tests::dod_one_triangle_keeps_separate_denominator_topologies <unknown>
31.71 s
> at <unknown source file> :<unknown line>
31.71 s
> 11: <gammalooprs[8af0a922d9a4c82d]::uv::approx::local_4d::tests::dod_one_triangle_keeps_separate_denominator_topologies::{closure#0} as core[940e698046960fd5]::ops::function::FnOnce<()>>::call_once <unknown>
31.71 s
> at <unknown source file> :<unknown line>
31.71 s
> 12: test[75d6903177b1d7e9]::__rust_begin_short_backtrace::<core[940e698046960fd5]::result::Result<(), alloc[2ea6bcb46fca0c42]::string::String>, fn() -> core[940e698046960fd5]::result::Result<(), alloc[2ea6bcb46fca0c42]::string::String>> <unknown>
31.71 s
> at <unknown source file> :<unknown line>
31.71 s
> 13: test[75d6903177b1d7e9]::run_test::{closure#0} <unknown>
31.71 s
> at <unknown source file> :<unknown line>
31.71 s
> 14: std[bcb96dfbba0ab899]::sys::backtrace::__rust_begin_short_backtrace::<test[75d6903177b1d7e9]::run_test::{closure#1}, ()> <unknown>
31.71 s
> at <unknown source file> :<unknown line>
31.71 s
> 15: <std[bcb96dfbba0ab899]::thread::lifecycle::spawn_unchecked<test[75d6903177b1d7e9]::run_test::{closure#1}, ()>::{closure#1} as core[940e698046960fd5]::ops::function::FnOnce<()>>::call_once::{shim:vtable#0} <unknown>
31.71 s
> at <unknown source file> :<unknown line>
31.71 s
> 16: <std[bcb96dfbba0ab899]::sys::thread::unix::Thread>::new::thread_start <unknown>
31.71 s
> at <unknown source file> :<unknown line>
31.71 s
> 17: start_thread <unknown>
31.71 s
> at <unknown source file> :<unknown line>
31.71 s
> 18: __clone3 <unknown>
31.71 s
> at <unknown source file> :<unknown line>
31.71 s
>
31.71 s
> Run with COLORBT_SHOW_HIDDEN=1 environment variable to disable frame filtering.
31.71 s
> Run with RUST_BACKTRACE=full to include source snippets.
31.71 s
>
31.71 s
> FAIL [ 0.225s] (572/645) gammalooprs uv::approx::tests :: factorized_owned_dot_child_cff_matches_direct_3d_for_uncut_self_energy
31.71 s
> stdout ---
31.71 s
>
31.71 s
> running 1 test
31.71 s
> test uv::approx::tests::factorized_owned_dot_child_cff_matches_direct_3d_for_uncut_self_energy ... FAILED
31.71 s
>
31.71 s
> failures:
31.71 s
>
31.71 s
> failures:
31.71 s
> uv::approx::tests::factorized_owned_dot_child_cff_matches_direct_3d_for_uncut_self_energy
31.71 s
>
31.71 s
> test result: FAILED. 0 passed; 1 failed; 0 ignored; 0 measured; 695 filtered out; finished in 0.22s
31.71 s
>
31.71 s
> stderr ---
31.71 s
> The application panicked (crashed).
31.71 s
> Message: assertion `left == right` failed
31.71 s
> left: [[1, 1, 2], [1, 2], [2, 2, 1], [2, 1], [2, 1], [2, 2, 1], [2, 2, 2, 1], [2, 2, 1]]
31.71 s
> right: [[1, 1, 2, 2, 2]]
31.71 s
> Location: crates/gammalooprs/src/uv/approx/mod.rs :1471
31.71 s
>
31.71 s
> ━━━━━━━━━━━━━━━━━━━━━━━━━━━━━━━━━━ BACKTRACE ━━━━━━━━━━━━━━━━━━━━━━━━━━━━━━━━━━━
31.71 s
> 1: <color_eyre[51793ea62743adbd]::config::PanicHook>::panic_report <unknown>
31.71 s
> at <unknown source file> :<unknown line>
31.71 s
> 2: <color_eyre[51793ea62743adbd]::config::PanicHook>::into_panic_hook::{closure#0} <unknown>
31.71 s
> at <unknown source file> :<unknown line>
31.71 s
> 3: std[bcb96dfbba0ab899]::panicking::panic_with_hook <unknown>
31.71 s
> at <unknown source file> :<unknown line>
31.71 s
> 4: std[bcb96dfbba0ab899]::panicking::panic_handler::{closure#0} <unknown>
31.71 s
> at <unknown source file> :<unknown line>
31.71 s
> 5: std[bcb96dfbba0ab899]::sys::backtrace::__rust_end_short_backtrace::<std[bcb96dfbba0ab899]::panicking::panic_handler::{closure#0}, !> <unknown>
31.71 s
> at <unknown source file> :<unknown line>
31.71 s
> 6: __rustc[6c289b9f9c454d21]::rust_begin_unwind <unknown>
31.71 s
> at <unknown source file> :<unknown line>
31.71 s
> 7: core[940e698046960fd5]::panicking::panic_fmt <unknown>
31.71 s
> at <unknown source file> :<unknown line>
31.71 s
> 8: core[940e698046960fd5]::panicking::assert_failed_inner <unknown>
31.71 s
> at <unknown source file> :<unknown line>
31.71 s
> 9: core[940e698046960fd5]::panicking::assert_failed::<alloc[2ea6bcb46fca0c42]::vec::Vec<alloc[2ea6bcb46fca0c42]::vec::Vec<usize>>, alloc[2ea6bcb46fca0c42]::vec::Vec<alloc[2ea6bcb46fca0c42]::vec::Vec<usize>>> <unknown>
31.71 s
> at <unknown source file> :<unknown line>
31.71 s
> 10: gammalooprs[8af0a922d9a4c82d]::uv::approx::tests::factorized_owned_dot_child_cff_matches_direct_3d_for_uncut_self_energy <unknown>
31.71 s
> at <unknown source file> :<unknown line>
31.71 s
> 11: <gammalooprs[8af0a922d9a4c82d]::uv::approx::tests::factorized_owned_dot_child_cff_matches_direct_3d_for_uncut_self_energy::{closure#0} as core[940e698046960fd5]::ops::function::FnOnce<()>>::call_once <unknown>
31.71 s
> at <unknown source file> :<unknown line>
31.71 s
> 12: test[75d6903177b1d7e9]::__rust_begin_short_backtrace::<core[940e698046960fd5]::result::Result<(), alloc[2ea6bcb46fca0c42]::string::String>, fn() -> core[940e698046960fd5]::result::Result<(), alloc[2ea6bcb46fca0c42]::string::String>> <unknown>
31.71 s
> at <unknown source file> :<unknown line>
31.71 s
> 13: test[75d6903177b1d7e9]::run_test::{closure#0} <unknown>
31.71 s
> at <unknown source file> :<unknown line>
31.71 s
> 14: std[bcb96dfbba0ab899]::sys::backtrace::__rust_begin_short_backtrace::<test[75d6903177b1d7e9]::run_test::{closure#1}, ()> <unknown>
31.71 s
> at <unknown source file> :<unknown line>
31.71 s
> 15: <std[bcb96dfbba0ab899]::thread::lifecycle::spawn_unchecked<test[75d6903177b1d7e9]::run_test::{closure#1}, ()>::{closure#1} as core[940e698046960fd5]::ops::function::FnOnce<()>>::call_once::{shim:vtable#0} <unknown>
31.71 s
> at <unknown source file> :<unknown line>
31.71 s
> 16: <std[bcb96dfbba0ab899]::sys::thread::unix::Thread>::new::thread_start <unknown>
31.71 s
> at <unknown source file> :<unknown line>
31.71 s
> 17: start_thread <unknown>
31.71 s
> at <unknown source file> :<unknown line>
31.71 s
> 18: __clone3 <unknown>
31.71 s
> at <unknown source file> :<unknown line>
31.71 s
>
31.71 s
> Run with COLORBT_SHOW_HIDDEN=1 environment variable to disable frame filtering.
31.71 s
> Run with RUST_BACKTRACE=full to include source snippets.
31.71 s
>
31.71 s
> error : test run failed
31.71 s
>
31.71 s
> ========== nextest test summary ==========
31.71 s
> report: target/nextest/ci_gammaloop/junit.xml
31.71 s
> tests: 645, failures: 2, errors: 0
31.71 s
>
31.71 s
> 1. gammalooprs::uv::approx::local_4d::tests::dod_one_triangle_keeps_separate_denominator_topologies
31.71 s
> failure: test failure with exit code 101
31.71 s
> system-out
31.71 s
> running 1 test
31.71 s
> test uv::approx::local_4d::tests::dod_one_triangle_keeps_separate_denominator_topologies ... FAILED
31.71 s
>
31.71 s
> failures:
31.71 s
>
31.71 s
> failures:
31.71 s
> uv::approx::local_4d::tests::dod_one_triangle_keeps_separate_denominator_topologies
31.71 s
>
31.71 s
> test result: FAILED. 0 passed; 1 failed; 0 ignored; 0 measured; 695 filtered out; finished in 0.07s
31.71 s
> system-err
31.71 s
> The application panicked (crashed).
31.71 s
> Message: assertion `left == right` failed
31.71 s
> left: [[1, 1, 1], [1, 1, 1], [1, 1, 2], [2, 1, 1]]
31.71 s
> right: [[1, 1, 1], [1, 1, 2], [2, 1, 1]]
31.71 s
> Location: crates/gammalooprs/src/uv/approx/local_4d.rs:1992
31.71 s
>
31.71 s
> ━━━━━━━━━━━━━━━━━━━━━━━━━━━━━━━━━━ BACKTRACE ━━━━━━━━━━━━━━━━━━━━━━━━━━━━━━━━━━━
31.71 s
> 1: <color_eyre[51793ea62743adbd]::config::PanicHook>::panic_report<unknown>
31.71 s
> at <unknown source file>:<unknown line>
31.71 s
> 2: <color_eyre[51793ea62743adbd]::config::PanicHook>::into_panic_hook::{closure#0}<unknown>
31.71 s
> at <unknown source file>:<unknown line>
31.71 s
> 3: std[bcb96dfbba0ab899]::panicking::panic_with_hook<unknown>
31.71 s
> at <unknown source file>:<unknown line>
31.71 s
> 4: std[bcb96dfbba0ab899]::panicking::panic_handler::{closure#0}<unknown>
31.71 s
> at <unknown source file>:<unknown line>
31.71 s
> 5: std[bcb96dfbba0ab899]::sys::backtrace::__rust_end_short_backtrace::<std[bcb96dfbba0ab899]::panicking::panic_handler::{closure#0}, !><unknown>
31.71 s
> at <unknown source file>:<unknown line>
31.71 s
> 6: __rustc[6c289b9f9c454d21]::rust_begin_unwind<unknown>
31.71 s
> at <unknown source file>:<unknown line>
31.71 s
> 7: core[940e698046960fd5]::panicking::panic_fmt<unknown>
31.71 s
> at <unknown source file>:<unknown line>
31.71 s
> 8: core[940e698046960fd5]::panicking::assert_failed_inner<unknown>
31.71 s
> at <unknown source file>:<unknown line>
31.71 s
> 9: core[940e698046960fd5]::panicking::assert_failed::<alloc[2ea6bcb46fca0c42]::vec::Vec<[usize; 3usize]>, alloc[2ea6bcb46fca0c42]::vec::Vec<[usize; 3usize]>><unknown>
31.71 s
> at <unknown source file>:<unknown line>
31.71 s
> 10: gammalooprs[8af0a922d9a4c82d]::uv::approx::local_4d::tests::dod_one_triangle_keeps_separate_denominator_topologies<unknown>
31.71 s
> at <unknown source file>:<unknown line>
31.71 s
> 11: <gammalooprs[8af0a922d9a4c82d]::uv::approx::local_4d::tests::dod_one_triangle_keeps_separate_denominator_topologies::{closure#0} as core[940e698046960fd5]::ops::function::FnOnce<()>>::call_once<unknown>
31.71 s
> at <unknown source file>:<unknown line>
31.71 s
> 12: test[75d6903177b1d7e9]::__rust_begin_short_backtrace::<core[940e698046960fd5]::result::Result<(), alloc[2ea6bcb46fca0c42]::string::String>, fn() -> core[940e698046960fd5]::result::Result<(), alloc[2ea6bcb46fca0c42]::string::String>><unknown>
31.71 s
> at <unknown source file>:<unknown line>
31.71 s
> 13: test[75d6903177b1d7e9]::run_test::{closure#0}<unknown>
31.71 s
> at <unknown source file>:<unknown line>
31.71 s
> 14: std[bcb96dfbba0ab899]::sys::backtrace::__rust_begin_short_backtrace::<test[75d6903177b1d7e9]::run_test::{closure#1}, ()><unknown>
31.71 s
> at <unknown source file>:<unknown line>
31.71 s
> 15: <std[bcb96dfbba0ab899]::thread::lifecycle::spawn_unchecked<test[75d6903177b1d7e9]::run_test::{closure#1}, ()>::{closure#1} as core[940e698046960fd5]::ops::function::FnOnce<()>>::call_once::{shim:vtable#0}<unknown>
31.71 s
> at <unknown source file>:<unknown line>
31.71 s
> 16: <std[bcb96dfbba0ab899]::sys::thread::unix::Thread>::new::thread_start<unknown>
31.71 s
> at <unknown source file>:<unknown line>
31.71 s
> 17: start_thread<unknown>
31.71 s
> at <unknown source file>:<unknown line>
31.71 s
> 18: __clone3<unknown>
31.71 s
> at <unknown source file>:<unknown line>
31.71 s
>
31.71 s
> Run with COLORBT_SHOW_HIDDEN=1 environment variable to disable frame filtering.
31.71 s
> Run with RUST_BACKTRACE=full to include source snippets.
31.71 s
>
31.71 s
> 2. gammalooprs::uv::approx::tests::factorized_owned_dot_child_cff_matches_direct_3d_for_uncut_self_energy
31.71 s
> failure: test failure with exit code 101
31.71 s
> system-out
31.71 s
> running 1 test
31.71 s
> test uv::approx::tests::factorized_owned_dot_child_cff_matches_direct_3d_for_uncut_self_energy ... FAILED
31.71 s
>
31.71 s
> failures:
31.71 s
>
31.71 s
> failures:
31.71 s
> uv::approx::tests::factorized_owned_dot_child_cff_matches_direct_3d_for_uncut_self_energy
31.71 s
>
31.71 s
> test result: FAILED. 0 passed; 1 failed; 0 ignored; 0 measured; 695 filtered out; finished in 0.22s
31.71 s
> system-err
31.71 s
> The application panicked (crashed).
31.71 s
> Message: assertion `left == right` failed
31.71 s
> left: [[1, 1, 2], [1, 2], [2, 2, 1], [2, 1], [2, 1], [2, 2, 1], [2, 2, 2, 1], [2, 2, 1]]
31.71 s
> right: [[1, 1, 2, 2, 2]]
31.71 s
> Location: crates/gammalooprs/src/uv/approx/mod.rs:1471
31.71 s
>
31.71 s
> ━━━━━━━━━━━━━━━━━━━━━━━━━━━━━━━━━━ BACKTRACE ━━━━━━━━━━━━━━━━━━━━━━━━━━━━━━━━━━━
31.71 s
> 1: <color_eyre[51793ea62743adbd]::config::PanicHook>::panic_report<unknown>
31.71 s
> at <unknown source file>:<unknown line>
31.71 s
> 2: <color_eyre[51793ea62743adbd]::config::PanicHook>::into_panic_hook::{closure#0}<unknown>
31.71 s
> at <unknown source file>:<unknown line>
31.71 s
> 3: std[bcb96dfbba0ab899]::panicking::panic_with_hook<unknown>
31.71 s
> at <unknown source file>:<unknown line>
31.71 s
> 4: std[bcb96dfbba0ab899]::panicking::panic_handler::{closure#0}<unknown>
31.71 s
> at <unknown source file>:<unknown line>
31.71 s
> 5: std[bcb96dfbba0ab899]::sys::backtrace::__rust_end_short_backtrace::<std[bcb96dfbba0ab899]::panicking::panic_handler::{closure#0}, !><unknown>
31.71 s
> at <unknown source file>:<unknown line>
31.71 s
> 6: __rustc[6c289b9f9c454d21]::rust_begin_unwind<unknown>
31.71 s
> at <unknown source file>:<unknown line>
31.71 s
> 7: core[940e698046960fd5]::panicking::panic_fmt<unknown>
31.71 s
> at <unknown source file>:<unknown line>
31.71 s
> 8: core[940e698046960fd5]::panicking::assert_failed_inner<unknown>
31.71 s
> at <unknown source file>:<unknown line>
31.71 s
> 9: core[940e698046960fd5]::panicking::assert_failed::<alloc[2ea6bcb46fca0c42]::vec::Vec<alloc[2ea6bcb46fca0c42]::vec::Vec<usize>>, alloc[2ea6bcb46fca0c42]::vec::Vec<alloc[2ea6bcb46fca0c42]::vec::Vec<usize>>><unknown>
31.71 s
> at <unknown source file>:<unknown line>
31.71 s
> 10: gammalooprs[8af0a922d9a4c82d]::uv::approx::tests::factorized_owned_dot_child_cff_matches_direct_3d_for_uncut_self_energy<unknown>
31.71 s
> at <unknown source file>:<unknown line>
31.71 s
> 11: <gammalooprs[8af0a922d9a4c82d]::uv::approx::tests::factorized_owned_dot_child_cff_matches_direct_3d_for_uncut_self_energy::{closure#0} as core[940e698046960fd5]::ops::function::FnOnce<()>>::call_once<unknown>
31.71 s
> at <unknown source file>:<unknown line>
31.71 s
> 12: test[75d6903177b1d7e9]::__rust_begin_short_backtrace::<core[940e698046960fd5]::result::Result<(), alloc[2ea6bcb46fca0c42]::string::String>, fn() -> core[940e698046960fd5]::result::Result<(), alloc[2ea6bcb46fca0c42]::string::String>><unknown>
31.71 s
> at <unknown source file>:<unknown line>
31.71 s
> 13: test[75d6903177b1d7e9]::run_test::{closure#0}<unknown>
31.71 s
> at <unknown source file>:<unknown line>
31.71 s
> 14: std[bcb96dfbba0ab899]::sys::backtrace::__rust_begin_short_backtrace::<test[75d6903177b1d7e9]::run_test::{closure#1}, ()><unknown>
31.71 s
> at <unknown source file>:<unknown line>
31.71 s
> 15: <std[bcb96dfbba0ab899]::thread::lifecycle::spawn_unchecked<test[75d6903177b1d7e9]::run_test::{closure#1}, ()>::{closure#1} as core[940e698046960fd5]::ops::function::FnOnce<()>>::call_once::{shim:vtable#0}<unknown>
31.71 s
> at <unknown source file>:<unknown line>
31.71 s
> 16: <std[bcb96dfbba0ab899]::sys::thread::unix::Thread>::new::thread_start<unknown>
31.71 s
> at <unknown source file>:<unknown line>
31.71 s
> 17: start_thread<unknown>
31.71 s
> at <unknown source file>:<unknown line>
31.71 s
> 18: __clone3<unknown>
31.71 s
> at <unknown source file>:<unknown line>
31.71 s
>
31.71 s
> Run with COLORBT_SHOW_HIDDEN=1 environment variable to disable frame filtering.
31.71 s
> Run with RUST_BACKTRACE=full to include source snippets.
31.71 s
> =========================================
31.71 s
> Extracting 1 binary, 1 build script output directory, and 1 linked path to /build/nextest-archive-8Ku8gR
31.71 s
> Extracted 7 files to /build/nextest-archive-8Ku8gR in 0.06s
31.71 s
> ------------
31.71 s
> Nextest run ID 520caa1d-18bb-4023-b1f4-d0ca0bbda3e2 with nextest profile: ci_gammaloop
31.71 s
> Starting 119 tests across 1 binary
31.71 s
> ------------
31.71 s
> Summary [ 0.910s] 119 tests run: 119 passed , 0 skipped
31.71 s
>
31.71 s
> ========== nextest test summary ==========
31.71 s
> report: target/nextest/ci_gammaloop/junit.xml
31.71 s
> tests: 119, failures: 0, errors: 0
31.71 s
> No failing testcases found.
31.71 s
> =========================================
31.71 s
For full logs, run:
31.71 s
nix log /nix/store/bcc3gg1akl605y0c3km3gjg8nsqsjzv8-gammaloop-nextest-core.drv
31.82 s
[0 built (1 failed ), 1 cRun failed.