0.00 s
$ /nix/store/9ypz3flqsrl5xl495mm8h645gadjsxi1-coreutils-9.11/bin/timeout --kill-after=15s 7200s /nix/store/23zk8sgzamrbmj1fday15szf7f2279s8-nix-2.34.7/bin/nix --extra-experimental-features nix-command --extra-experimental-features flakes flake clone git+https://github.com/alphal00p/gammaloop --dest /tmp/nix-ci-worker/stable-pwd/repo/
0.07 s
Cloning into '/tmp/nix-ci-worker/stable-pwd/repo'...
0.75 s
remote: Enumerating objects: 78084, done.
0.87 s
remote: Counting objects: 0% (1/13906)
remote: Counting objects: 1% (140/13906)
remote: Counting objects: 2% (279/13906)
remote: Counting objects: 3% (418/13906)
remote: Counting objects: 4% (557/13906)
remote: Counting objects: 5% (696/13906)
remote: Counting objects: 6% (835/13906)
remote: Counting objects: 7% (974/13906)
remote: Counting objects: 8% (1113/13906)
remote: Counting objects: 9% (1252/13906)
remote: Counting objects: 10% (1391/13906)
remote: Counting objects: 11% (1530/13906)
remote: Counting objects: 12% (1669/13906)
remote: Counting objects: 13% (1808/13906)
remote: Counting objects: 14% (1947/13906)
remote: Counting objects: 15% (2086/13906)
remote: Counting objects: 16% (2225/13906)
remote: Counting objects: 17% (2365/13906)
remote: Counting objects: 18% (2504/13906)
remote: Counting objects: 19% (2643/13906)
remote: Counting objects: 20% (2782/13906)
remote: Counting objects: 21% (2921/13906)
remote: Counting objects: 22% (3060/13906)
remote: Counting objects: 23% (3199/13906)
remote: Counting objects: 24% (3338/13906)
remote: Counting objects: 25% (3477/13906)
remote: Counting objects: 26% (3616/13906)
remote: Counting objects: 27% (3755/13906)
remote: Counting objects: 28% (3894/13906)
remote: Counting objects: 29% (4033/13906)
remote: Counting objects: 30% (4172/13906)
remote: Counting objects: 31% (4311/13906)
remote: Counting objects: 32% (4450/13906)
remote: Counting objects: 33% (4589/13906)
remote: Counting objects: 34% (4729/13906)
remote: Counting objects: 35% (4868/13906)
remote: Counting objects: 36% (5007/13906)
remote: Counting objects: 37% (5146/13906)
remote: Counting objects: 38% (5285/13906)
remote: Counting objects: 39% (5424/13906)
remote: Counting objects: 40% (5563/13906)
remote: Counting objects: 41% (5702/13906)
remote: Counting objects: 42% (5841/13906)
remote: Counting objects: 43% (5980/13906)
remote: Counting objects: 44% (6119/13906)
remote: Counting objects: 45% (6258/13906)
remote: Counting objects: 46% (6397/13906)
remote: Counting objects: 47% (6536/13906)
remote: Counting objects: 48% (6675/13906)
remote: Counting objects: 49% (6814/13906)
remote: Counting objects: 50% (6953/13906)
remote: Counting objects: 51% (7093/13906)
remote: Counting objects: 52% (7232/13906)
remote: Counting objects: 53% (7371/13906)
remote: Counting objects: 54% (7510/13906)
remote: Counting objects: 55% (7649/13906)
remote: Counting objects: 56% (7788/13906)
remote: Counting objects: 57% (7927/13906)
remote: Counting objects: 58% (8066/13906)
remote: Counting objects: 59% (8205/13906)
remote: Counting objects: 60% (8344/13906)
remote: Counting objects: 61% (8483/13906)
remote: Counting objects: 62% (8622/13906)
remote: Counting objects: 63% (8761/13906)
remote: Counting objects: 64% (8900/13906)
remote: Counting objects: 65% (9039/13906)
remote: Counting objects: 66% (9178/13906)
remote: Counting objects: 67% (9318/13906)
remote: Counting objects: 68% (9457/13906)
remote: Counting objects: 69% (9596/13906)
remote: Counting objects: 70% (9735/13906)
remote: Counting objects: 71% (9874/13906)
remote: Counting objects: 72% (10013/13906)
remote: Counting objects: 73% (10152/13906)
remote: Counting objects: 74% (10291/13906)
remote: Counting objects: 75% (10430/13906)
remote: Counting objects: 76% (10569/13906)
remote: Counting objects: 77% (10708/13906)
remote: Counting objects: 78% (10847/13906)
remote: Counting objects: 79% (10986/13906)
remote: Counting objects: 80% (11125/13906)
remote: Counting objects: 81% (11264/13906)
remote: Counting objects: 82% (11403/13906)
remote: Counting objects: 83% (11542/13906)
remote: Counting objects: 84% (11682/13906)
remote: Counting objects: 85% (11821/13906)
remote: Counting objects: 86% (11960/13906)
remote: Counting objects: 87% (12099/13906)
remote: Counting objects: 88% (12238/13906)
remote: Counting objects: 89% (12377/13906)
remote: Counting objects: 90% (12516/13906)
remote: Counting objects: 91% (12655/13906)
remote: Counting objects: 92% (12794/13906)
remote: Counting objects: 93% (12933/13906)
remote: Counting objects: 94% (13072/13906)
remote: Counting objects: 95% (13211/13906)
remote: Counting objects: 96% (13350/13906)
remote: Counting objects: 97% (13489/13906)
remote: Counting objects: 98% (13628/13906)
remote: Counting objects: 99% (13767/13906)
remote: Counting objects: 100% (13906/13906)
remote: Counting objects: 100% (13906/13906), done.
3.64 s
remote: Compressing objects: 0% (1/3095)
remote: Compressing objects: 1% (31/3095)
remote: Compressing objects: 2% (62/3095)
remote: Compressing objects: 3% (93/3095)
remote: Compressing objects: 4% (124/3095)
remote: Compressing objects: 5% (155/3095)
remote: Compressing objects: 6% (186/3095)
remote: Compressing objects: 7% (217/3095)
remote: Compressing objects: 8% (248/3095)
remote: Compressing objects: 9% (279/3095)
remote: Compressing objects: 10% (310/3095)
remote: Compressing objects: 11% (341/3095)
remote: Compressing objects: 12% (372/3095)
remote: Compressing objects: 13% (403/3095)
remote: Compressing objects: 14% (434/3095)
remote: Compressing objects: 15% (465/3095)
remote: Compressing objects: 16% (496/3095)
remote: Compressing objects: 17% (527/3095)
remote: Compressing objects: 18% (558/3095)
remote: Compressing objects: 19% (589/3095)
remote: Compressing objects: 20% (619/3095)
remote: Compressing objects: 21% (650/3095)
remote: Compressing objects: 22% (681/3095)
remote: Compressing objects: 23% (712/3095)
remote: Compressing objects: 24% (743/3095)
remote: Compressing objects: 24% (771/3095)
remote: Compressing objects: 25% (774/3095)
remote: Compressing objects: 26% (805/3095)
remote: Compressing objects: 27% (836/3095)
remote: Compressing objects: 28% (867/3095)
remote: Compressing objects: 28% (882/3095)
remote: Compressing objects: 29% (898/3095)
remote: Compressing objects: 30% (929/3095)
remote: Compressing objects: 31% (960/3095)
remote: Compressing objects: 32% (991/3095)
remote: Compressing objects: 33% (1022/3095)
remote: Compressing objects: 34% (1053/3095)
remote: Compressing objects: 35% (1084/3095)
remote: Compressing objects: 36% (1115/3095)
remote: Compressing objects: 37% (1146/3095)
remote: Compressing objects: 38% (1177/3095)
remote: Compressing objects: 39% (1208/3095)
remote: Compressing objects: 40% (1238/3095)
remote: Compressing objects: 41% (1269/3095)
remote: Compressing objects: 42% (1300/3095)
remote: Compressing objects: 43% (1331/3095)
remote: Compressing objects: 44% (1362/3095)
remote: Compressing objects: 45% (1393/3095)
remote: Compressing objects: 46% (1424/3095)
remote: Compressing objects: 47% (1455/3095)
remote: Compressing objects: 48% (1486/3095)
remote: Compressing objects: 49% (1517/3095)
remote: Compressing objects: 50% (1548/3095)
remote: Compressing objects: 51% (1579/3095)
remote: Compressing objects: 52% (1610/3095)
remote: Compressing objects: 53% (1641/3095)
remote: Compressing objects: 54% (1672/3095)
remote: Compressing objects: 55% (1703/3095)
remote: Compressing objects: 56% (1734/3095)
remote: Compressing objects: 57% (1765/3095)
remote: Compressing objects: 58% (1796/3095)
remote: Compressing objects: 59% (1827/3095)
remote: Compressing objects: 60% (1857/3095)
remote: Compressing objects: 61% (1888/3095)
remote: Compressing objects: 62% (1919/3095)
remote: Compressing objects: 63% (1950/3095)
remote: Compressing objects: 64% (1981/3095)
remote: Compressing objects: 65% (2012/3095)
remote: Compressing objects: 66% (2043/3095)
remote: Compressing objects: 67% (2074/3095)
remote: Compressing objects: 68% (2105/3095)
remote: Compressing objects: 69% (2136/3095)
remote: Compressing objects: 70% (2167/3095)
remote: Compressing objects: 71% (2198/3095)
remote: Compressing objects: 72% (2229/3095)
remote: Compressing objects: 73% (2260/3095)
remote: Compressing objects: 74% (2291/3095)
remote: Compressing objects: 75% (2322/3095)
remote: Compressing objects: 76% (2353/3095)
remote: Compressing objects: 77% (2384/3095)
remote: Compressing objects: 78% (2415/3095)
remote: Compressing objects: 79% (2446/3095)
remote: Compressing objects: 80% (2476/3095)
remote: Compressing objects: 81% (2507/3095)
remote: Compressing objects: 82% (2538/3095)
remote: Compressing objects: 83% (2569/3095)
remote: Compressing objects: 84% (2600/3095)
remote: Compressing objects: 85% (2631/3095)
remote: Compressing objects: 86% (2662/3095)
remote: Compressing objects: 87% (2693/3095)
remote: Compressing objects: 88% (2724/3095)
remote: Compressing objects: 89% (2755/3095)
remote: Compressing objects: 90% (2786/3095)
remote: Compressing objects: 91% (2817/3095)
remote: Compressing objects: 92% (2848/3095)
remote: Compressing objects: 93% (2879/3095)
remote: Compressing objects: 94% (2910/3095)
remote: Compressing objects: 95% (2941/3095)
remote: Compressing objects: 96% (2972/3095)
remote: Compressing objects: 97% (3003/3095)
remote: Compressing objects: 98% (3034/3095)
remote: Compressing objects: 99% (3065/3095)
remote: Compressing objects: 100% (3095/3095)
remote: Compressing objects: 100% (3095/3095), done.
7.52 s
Receiving objects: 0% (1/78084)
Receiving objects: 1% (781/78084)
Receiving objects: 2% (1562/78084)
Receiving objects: 3% (2343/78084)
Receiving objects: 4% (3124/78084)
Receiving objects: 5% (3905/78084)
Receiving objects: 6% (4686/78084)
Receiving objects: 7% (5466/78084)
Receiving objects: 8% (6247/78084)
Receiving objects: 9% (7028/78084)
Receiving objects: 10% (7809/78084), 14.55 MiB | 29.08 MiB/s
Receiving objects: 11% (8590/78084), 14.55 MiB | 29.08 MiB/s
Receiving objects: 12% (9371/78084), 14.55 MiB | 29.08 MiB/s
Receiving objects: 13% (10151/78084), 14.55 MiB | 29.08 MiB/s
Receiving objects: 14% (10932/78084), 14.55 MiB | 29.08 MiB/s
Receiving objects: 15% (11713/78084), 14.55 MiB | 29.08 MiB/s
Receiving objects: 16% (12494/78084), 14.55 MiB | 29.08 MiB/s
Receiving objects: 17% (13275/78084), 14.55 MiB | 29.08 MiB/s
Receiving objects: 18% (14056/78084), 14.55 MiB | 29.08 MiB/s
Receiving objects: 19% (14836/78084), 14.55 MiB | 29.08 MiB/s
Receiving objects: 20% (15617/78084), 14.55 MiB | 29.08 MiB/s
Receiving objects: 21% (16398/78084), 14.55 MiB | 29.08 MiB/s
Receiving objects: 22% (17179/78084), 14.55 MiB | 29.08 MiB/s
Receiving objects: 23% (17960/78084), 14.55 MiB | 29.08 MiB/s
Receiving objects: 24% (18741/78084), 14.55 MiB | 29.08 MiB/s
Receiving objects: 25% (19521/78084), 14.55 MiB | 29.08 MiB/s
Receiving objects: 26% (20302/78084), 14.55 MiB | 29.08 MiB/s
Receiving objects: 27% (21083/78084), 14.55 MiB | 29.08 MiB/s
Receiving objects: 28% (21864/78084), 14.55 MiB | 29.08 MiB/s
Receiving objects: 29% (22645/78084), 14.55 MiB | 29.08 MiB/s
Receiving objects: 30% (23426/78084), 14.55 MiB | 29.08 MiB/s
Receiving objects: 31% (24207/78084), 14.55 MiB | 29.08 MiB/s
Receiving objects: 32% (24987/78084), 14.55 MiB | 29.08 MiB/s
Receiving objects: 33% (25768/78084), 14.55 MiB | 29.08 MiB/s
Receiving objects: 34% (26549/78084), 14.55 MiB | 29.08 MiB/s
Receiving objects: 35% (27330/78084), 14.55 MiB | 29.08 MiB/s
Receiving objects: 36% (28111/78084), 14.55 MiB | 29.08 MiB/s
Receiving objects: 37% (28892/78084), 14.55 MiB | 29.08 MiB/s
Receiving objects: 38% (29672/78084), 14.55 MiB | 29.08 MiB/s
Receiving objects: 39% (30453/78084), 14.55 MiB | 29.08 MiB/s
Receiving objects: 40% (31234/78084), 14.55 MiB | 29.08 MiB/s
Receiving objects: 41% (32015/78084), 14.55 MiB | 29.08 MiB/s
Receiving objects: 42% (32796/78084), 14.55 MiB | 29.08 MiB/s
Receiving objects: 42% (33179/78084), 31.01 MiB | 31.00 MiB/s
Receiving objects: 43% (33577/78084), 31.01 MiB | 31.00 MiB/s
Receiving objects: 44% (34357/78084), 31.01 MiB | 31.00 MiB/s
Receiving objects: 45% (35138/78084), 31.01 MiB | 31.00 MiB/s
Receiving objects: 46% (35919/78084), 31.01 MiB | 31.00 MiB/s
Receiving objects: 47% (36700/78084), 31.01 MiB | 31.00 MiB/s
Receiving objects: 48% (37481/78084), 31.01 MiB | 31.00 MiB/s
Receiving objects: 49% (38262/78084), 31.01 MiB | 31.00 MiB/s
Receiving objects: 50% (39042/78084), 31.01 MiB | 31.00 MiB/s
Receiving objects: 51% (39823/78084), 31.01 MiB | 31.00 MiB/s
Receiving objects: 52% (40604/78084), 47.09 MiB | 30.94 MiB/s
Receiving objects: 53% (41385/78084), 47.09 MiB | 30.94 MiB/s
Receiving objects: 54% (42166/78084), 47.09 MiB | 30.94 MiB/s
Receiving objects: 55% (42947/78084), 47.09 MiB | 30.94 MiB/s
Receiving objects: 56% (43728/78084), 47.09 MiB | 30.94 MiB/s
Receiving objects: 57% (44508/78084), 47.09 MiB | 30.94 MiB/s
Receiving objects: 58% (45289/78084), 47.09 MiB | 30.94 MiB/s
Receiving objects: 59% (46070/78084), 47.09 MiB | 30.94 MiB/s
Receiving objects: 60% (46851/78084), 47.09 MiB | 30.94 MiB/s
Receiving objects: 61% (47632/78084), 47.09 MiB | 30.94 MiB/s
Receiving objects: 62% (48413/78084), 47.09 MiB | 30.94 MiB/s
Receiving objects: 62% (48916/78084), 63.06 MiB | 30.67 MiB/s
Receiving objects: 63% (49193/78084), 63.06 MiB | 30.67 MiB/s
Receiving objects: 64% (49974/78084), 63.06 MiB | 30.67 MiB/s
Receiving objects: 65% (50755/78084), 63.06 MiB | 30.67 MiB/s
Receiving objects: 66% (51536/78084), 63.06 MiB | 30.67 MiB/s
Receiving objects: 67% (52317/78084), 63.06 MiB | 30.67 MiB/s
Receiving objects: 68% (53098/78084), 63.06 MiB | 30.67 MiB/s
Receiving objects: 69% (53878/78084), 63.06 MiB | 30.67 MiB/s
Receiving objects: 70% (54659/78084), 79.45 MiB | 31.08 MiB/s
Receiving objects: 71% (55440/78084), 79.45 MiB | 31.08 MiB/s
Receiving objects: 72% (56221/78084), 79.45 MiB | 31.08 MiB/s
Receiving objects: 73% (57002/78084), 79.45 MiB | 31.08 MiB/s
Receiving objects: 74% (57783/78084), 79.45 MiB | 31.08 MiB/s
Receiving objects: 75% (58563/78084), 79.45 MiB | 31.08 MiB/s
Receiving objects: 76% (59344/78084), 79.45 MiB | 31.08 MiB/s
Receiving objects: 77% (60125/78084), 79.45 MiB | 31.08 MiB/s
Receiving objects: 78% (60906/78084), 79.45 MiB | 31.08 MiB/s
Receiving objects: 79% (61687/78084), 79.45 MiB | 31.08 MiB/s
Receiving objects: 79% (62419/78084), 79.45 MiB | 31.08 MiB/s
Receiving objects: 80% (62468/78084), 79.45 MiB | 31.08 MiB/s
Receiving objects: 81% (63249/78084), 95.25 MiB | 31.18 MiB/s
Receiving objects: 82% (64029/78084), 95.25 MiB | 31.18 MiB/s
Receiving objects: 83% (64810/78084), 95.25 MiB | 31.18 MiB/s
Receiving objects: 84% (65591/78084), 95.25 MiB | 31.18 MiB/s
Receiving objects: 85% (66372/78084), 95.25 MiB | 31.18 MiB/s
Receiving objects: 86% (67153/78084), 95.25 MiB | 31.18 MiB/s
Receiving objects: 87% (67934/78084), 95.25 MiB | 31.18 MiB/s
Receiving objects: 88% (68714/78084), 95.25 MiB | 31.18 MiB/s
Receiving objects: 89% (69495/78084), 111.24 MiB | 31.29 MiB/s
Receiving objects: 90% (70276/78084), 111.24 MiB | 31.29 MiB/s
Receiving objects: 91% (71057/78084), 111.24 MiB | 31.29 MiB/s
Receiving objects: 92% (71838/78084), 111.24 MiB | 31.29 MiB/s
Receiving objects: 93% (72619/78084), 111.24 MiB | 31.29 MiB/s
Receiving objects: 94% (73399/78084), 111.24 MiB | 31.29 MiB/s
Receiving objects: 95% (74180/78084), 111.24 MiB | 31.29 MiB/s
Receiving objects: 96% (74961/78084), 111.24 MiB | 31.29 MiB/s
Receiving objects: 97% (75742/78084), 111.24 MiB | 31.29 MiB/s
Receiving objects: 98% (76523/78084), 111.24 MiB | 31.29 MiB/s
Receiving objects: 99% (77304/78084), 111.24 MiB | 31.29 MiB/s
remote: Total 78084 (delta 9811), reused 11671 (delta 8715), pack-reused 64178 (from 2)
7.53 s
Receiving objects: 100% (78084/78084), 111.24 MiB | 31.29 MiB/s
Receiving objects: 100% (78084/78084), 120.79 MiB | 31.10 MiB/s, done.
8.42 s
Resolving deltas: 0% (0/53130)
Resolving deltas: 1% (532/53130)
Resolving deltas: 2% (1063/53130)
Resolving deltas: 3% (1594/53130)
Resolving deltas: 4% (2126/53130)
Resolving deltas: 5% (2658/53130)
Resolving deltas: 6% (3188/53130)
Resolving deltas: 7% (3720/53130)
Resolving deltas: 8% (4254/53130)
Resolving deltas: 9% (4783/53130)
Resolving deltas: 10% (5313/53130)
Resolving deltas: 11% (5845/53130)
Resolving deltas: 12% (6376/53130)
Resolving deltas: 13% (6907/53130)
Resolving deltas: 14% (7439/53130)
Resolving deltas: 15% (7970/53130)
Resolving deltas: 16% (8501/53130)
Resolving deltas: 17% (9033/53130)
Resolving deltas: 18% (9564/53130)
Resolving deltas: 19% (10095/53130)
Resolving deltas: 20% (10627/53130)
Resolving deltas: 21% (11158/53130)
Resolving deltas: 22% (11689/53130)
Resolving deltas: 23% (12220/53130)
Resolving deltas: 24% (12752/53130)
Resolving deltas: 25% (13283/53130)
Resolving deltas: 26% (13814/53130)
Resolving deltas: 27% (14348/53130)
Resolving deltas: 28% (14879/53130)
Resolving deltas: 29% (15408/53130)
Resolving deltas: 30% (15939/53130)
Resolving deltas: 31% (16471/53130)
Resolving deltas: 32% (17003/53130)
Resolving deltas: 33% (17533/53130)
Resolving deltas: 34% (18065/53130)
Resolving deltas: 35% (18598/53130)
Resolving deltas: 36% (19128/53130)
Resolving deltas: 37% (19659/53130)
Resolving deltas: 38% (20190/53130)
Resolving deltas: 39% (20721/53130)
Resolving deltas: 40% (21253/53130)
Resolving deltas: 41% (21786/53130)
Resolving deltas: 42% (22315/53130)
Resolving deltas: 43% (22846/53130)
Resolving deltas: 44% (23379/53130)
Resolving deltas: 45% (23909/53130)
Resolving deltas: 46% (24440/53130)
Resolving deltas: 47% (24972/53130)
Resolving deltas: 48% (25503/53130)
Resolving deltas: 49% (26035/53130)
Resolving deltas: 50% (26565/53130)
Resolving deltas: 51% (27097/53130)
Resolving deltas: 52% (27628/53130)
Resolving deltas: 53% (28159/53130)
Resolving deltas: 54% (28691/53130)
Resolving deltas: 55% (29223/53130)
Resolving deltas: 56% (29753/53130)
Resolving deltas: 57% (30285/53130)
Resolving deltas: 58% (30816/53130)
Resolving deltas: 59% (31349/53130)
Resolving deltas: 60% (31878/53130)
Resolving deltas: 61% (32410/53130)
Resolving deltas: 62% (32941/53130)
Resolving deltas: 63% (33472/53130)
Resolving deltas: 64% (34004/53130)
Resolving deltas: 65% (34536/53130)
Resolving deltas: 66% (35067/53130)
Resolving deltas: 67% (35598/53130)
Resolving deltas: 68% (36129/53130)
Resolving deltas: 69% (36660/53130)
Resolving deltas: 70% (37191/53130)
Resolving deltas: 71% (37723/53130)
Resolving deltas: 72% (38254/53130)
Resolving deltas: 73% (38785/53130)
Resolving deltas: 74% (39317/53130)
Resolving deltas: 75% (39848/53130)
Resolving deltas: 76% (40379/53130)
Resolving deltas: 77% (40911/53130)
Resolving deltas: 78% (41443/53130)
Resolving deltas: 79% (41973/53130)
Resolving deltas: 80% (42504/53130)
Resolving deltas: 81% (43037/53130)
Resolving deltas: 82% (43567/53130)
Resolving deltas: 83% (44098/53130)
Resolving deltas: 84% (44630/53130)
Resolving deltas: 85% (45162/53130)
Resolving deltas: 86% (45692/53130)
Resolving deltas: 87% (46224/53130)
Resolving deltas: 88% (46755/53130)
Resolving deltas: 89% (47287/53130)
Resolving deltas: 90% (47817/53130)
Resolving deltas: 91% (48349/53130)
Resolving deltas: 92% (48880/53130)
Resolving deltas: 93% (49411/53130)
Resolving deltas: 94% (49943/53130)
Resolving deltas: 95% (50474/53130)
Resolving deltas: 96% (51006/53130)
Resolving deltas: 97% (51537/53130)
Resolving deltas: 98% (52071/53130)
Resolving deltas: 99% (52601/53130)
Resolving deltas: 100% (53130/53130)
Resolving deltas: 100% (53130/53130), done.
8.83 s
Fetching commit 8a197b8cad2f920e58f5fdc82a046a3afcd7e1fd for raised_energy_cff_wip ...
8.83 s
$ /nix/store/bcnisk3ydfgv26v2gw3zlky24g00yww2-git-2.54.0/bin/git fetch origin 8a197b8cad2f920e58f5fdc82a046a3afcd7e1fd
9.25 s
From https://github.com/alphal00p/gammaloop
9.25 s
* branch 8a197b8cad2f920e58f5fdc82a046a3afcd7e1fd -> FETCH_HEAD
9.26 s
$ /nix/store/9ypz3flqsrl5xl495mm8h645gadjsxi1-coreutils-9.11/bin/timeout --kill-after=15s 7200s /nix/store/bcnisk3ydfgv26v2gw3zlky24g00yww2-git-2.54.0/bin/git -c advice.detachedHead=false checkout 8a197b8cad2f920e58f5fdc82a046a3afcd7e1fd
9.48 s
HEAD is now at 8a197b8ca preserve separate UV Taylor denominator topologies
9.48 s
$ /nix/store/9ypz3flqsrl5xl495mm8h645gadjsxi1-coreutils-9.11/bin/timeout --kill-after=15s 7200s /nix/store/23zk8sgzamrbmj1fday15szf7f2279s8-nix-2.34.7/bin/nix --extra-experimental-features nix-command --extra-experimental-features flakes --log-format internal-json run .#packages.x86_64-linux.nix-ci-check-gammaloop-nextest-core --print-build-logs
14.71 s
14.75 s
Downloading cached gammaloop-nextest-binaries-core-gammaloop-api from https://cache.nix-ci.com
14.75 s
Downloading cached gammaloop-nextest-binaries-core-gammaloop-tracing-filter from https://cache.nix-ci.com
14.75 s
Downloading cached gammaloop-nextest-binaries-core-gammaloop-tracing-filter-macros from https://cache.nix-ci.com
14.75 s
Downloading cached gammaloop-nextest-binaries-core-gammalooprs from https://cache.nix-ci.com
14.75 s
Downloading cached gammaloop-nextest-binaries-core-three-dimensional-reps from https://cache.nix-ci.com
14.81 s
Downloaded cached gammaloop-nextest-binaries-core-gammaloop-tracing-filter-macros (1.7 MiB) in 63ms
14.81 s
Progress: 0 of 1 built, 1 of 7 downloaded from cache (4 downloading)
14.99 s
Downloaded cached gammaloop-nextest-binaries-core-gammaloop-tracing-filter (8.1 MiB) in 243ms
14.99 s
Progress: 0 of 1 built, 2 of 7 downloaded from cache (3 downloading)
14.99 s
Downloaded cached gammaloop-nextest-binaries-core-three-dimensional-reps (8.9 MiB) in 247ms
14.99 s
Progress: 0 of 1 built, 3 of 7 downloaded from cache (2 downloading)
15.97 s
Downloaded cached gammaloop-nextest-binaries-core-gammalooprs (85.9 MiB) in 1.2s
15.97 s
Progress: 0 of 1 built, 4 of 7 downloaded from cache (1 downloading)
16.16 s
Downloaded cached gammaloop-nextest-binaries-core-gammaloop-api (118.7 MiB) in 1.4s
16.16 s
Progress: 0 of 1 built, 5 of 7 downloaded from cache
16.16 s
Downloading cached gammaloop-nextest-binaries-core from https://cache.nix-ci.com
16.16 s
Downloaded cached gammaloop-nextest-binaries-core (2032 B) in 3ms
16.16 s
Progress: 0 of 1 built, 6 of 7 downloaded from cache
16.16 s
Downloading cached nix-ci-check-gammaloop-nextest-core from https://cache.nix-ci.com
16.17 s
Downloaded cached nix-ci-check-gammaloop-nextest-core (1016 B) in 2ms
16.17 s
Progress: 0 of 1 built, 7 of 7 downloaded from cache
21.31 s
evaluating derivation 'g
copying '/nix/store/qv5p
evaluating derivation 'g
copying '/nix/store/qv5p
evaluating derivation 'g
copying '/nix/store/qv5p
evaluating derivation 'g
copying '/nix/store/qv5p
evaluating derivation 'g
copying '/nix/store/qv5p
evaluating derivation 'g
copying '/nix/store/qv5p
evaluating derivation 'g
copying '/nix/store/qv5p
evaluating derivation 'g
copying '/nix/store/qv5p
evaluating derivation 'g
querying gammaloop-nexte
querying info about miss
querying gammaloop-nexte
[0 /1 built, 0.0 KiB DL]
[1 /0 /1 built, 0.0 KiB DLgammaloop-nextest-core> Extracting 4 binaries (including 1 non-test binary), 1 build script output directory, and 2 linked paths to /build/nextest-archive-zsrXEg
22.03 s
gammaloop-nextest-core> Extracted 20 files to /build/nextest-archive-zsrXEg in 0.72s
22.04 s
gammaloop-nextest-core> ------------
22.04 s
gammaloop-nextest-core> Nextest run ID feef071c-54bb-423e-ac02-6efc3d53feb3 with nextest profile: ci_gammaloop
22.04 s
gammaloop-nextest-core> Starting 377 tests across 3 binaries
23.36 s
gammaloop-nextest-core> ------------
23.36 s
gammaloop-nextest-core> Summary [ 1.316s] 377 tests run: 377 passed , 0 skipped
23.48 s
gammaloop-nextest-core>
23.48 s
gammaloop-nextest-core> ========== nextest test summary ==========
23.48 s
gammaloop-nextest-core> report: target/nextest/ci_gammaloop/junit.xml
23.48 s
gammaloop-nextest-core> tests: 377, failures: 0, errors: 0
23.48 s
gammaloop-nextest-core> No failing testcases found.
23.48 s
gammaloop-nextest-core> =========================================
23.50 s
gammaloop-nextest-core> Extracting 1 binary and 1 linked path to /build/nextest-archive-xYJLcI
23.57 s
gammaloop-nextest-core> Extracted 7 files to /build/nextest-archive-xYJLcI in 0.07s
23.58 s
gammaloop-nextest-core> ------------
23.58 s
gammaloop-nextest-core> Nextest run ID 785dbc3d-151a-4e42-bd03-8131e5fb6b11 with nextest profile: ci_gammaloop
23.58 s
gammaloop-nextest-core> Starting 19 tests across 1 binary
23.59 s
gammaloop-nextest-core> ------------
23.59 s
gammaloop-nextest-core> Summary [ 0.012s] 19 tests run: 19 passed , 0 skipped
23.63 s
gammaloop-nextest-core>
23.63 s
gammaloop-nextest-core> ========== nextest test summary ==========
23.63 s
gammaloop-nextest-core> report: target/nextest/ci_gammaloop/junit.xml
23.63 s
gammaloop-nextest-core> tests: 19, failures: 0, errors: 0
23.63 s
gammaloop-nextest-core> No failing testcases found.
23.63 s
gammaloop-nextest-core> =========================================
23.64 s
gammaloop-nextest-core> Extracting 1 binary to /build/nextest-archive-EGag36
23.67 s
gammaloop-nextest-core> Extracted 4 files to /build/nextest-archive-EGag36 in 0.03s
23.68 s
gammaloop-nextest-core> ------------
23.68 s
gammaloop-nextest-core> Nextest run ID 582f4ed7-065b-4ec8-bc0b-3c1a001b2d75 with nextest profile: ci_gammaloop
23.68 s
gammaloop-nextest-core> Starting 0 tests across 1 binary
23.68 s
gammaloop-nextest-core> ------------
23.68 s
gammaloop-nextest-core> Summary [ 0.000s] 0 tests run: 0 passed , 0 skipped
23.71 s
gammaloop-nextest-core>
23.71 s
gammaloop-nextest-core> ========== nextest test summary ==========
23.71 s
gammaloop-nextest-core> report: target/nextest/ci_gammaloop/junit.xml
23.71 s
gammaloop-nextest-core> tests: 0, failures: 0, errors: 0
23.71 s
gammaloop-nextest-core> No failing testcases found.
23.71 s
gammaloop-nextest-core> =========================================
23.72 s
gammaloop-nextest-core> Extracting 4 binaries, 1 build script output directory, and 2 linked paths to /build/nextest-archive-OM5q93
24.21 s
gammaloop-nextest-core> Extracted 18 files to /build/nextest-archive-OM5q93 in 0.49s
24.22 s
gammaloop-nextest-core> ------------
24.22 s
gammaloop-nextest-core> Nextest run ID c2d0d83b-b1d2-44d0-ae88-375b8da65a4f with nextest profile: ci_gammaloop
24.22 s
gammaloop-nextest-core> Starting 645 tests across 4 binaries (59 tests skipped , including 58 tests via profile.ci_gammaloop.default-filter )
25.77 s
gammaloop-nextest-core> FAIL [ 0.196s] (553/645) gammalooprs uv::approx::local_4d::tests :: dod_one_triangle_keeps_separate_denominator_topologies
25.77 s
gammaloop-nextest-core> stdout ---
25.77 s
gammaloop-nextest-core>
25.77 s
gammaloop-nextest-core> running 1 test
25.77 s
gammaloop-nextest-core> test uv::approx::local_4d::tests::dod_one_triangle_keeps_separate_denominator_topologies ... FAILED
25.77 s
gammaloop-nextest-core>
25.77 s
gammaloop-nextest-core> failures:
25.77 s
gammaloop-nextest-core>
25.77 s
gammaloop-nextest-core> failures:
25.77 s
gammaloop-nextest-core> uv::approx::local_4d::tests::dod_one_triangle_keeps_separate_denominator_topologies
25.77 s
gammaloop-nextest-core>
25.77 s
gammaloop-nextest-core> test result: FAILED. 0 passed; 1 failed; 0 ignored; 0 measured; 695 filtered out; finished in 0.14s
25.77 s
gammaloop-nextest-core>
25.77 s
gammaloop-nextest-core> stderr ---
25.77 s
gammaloop-nextest-core> The application panicked (crashed).
25.77 s
gammaloop-nextest-core> Message: assertion `left == right` failed
25.77 s
gammaloop-nextest-core> left: [[1, 1, 1], [1, 1, 1], [1, 1, 2], [2, 1, 1]]
25.77 s
gammaloop-nextest-core> right: [[1, 1, 1], [1, 1, 2], [2, 1, 1]]
25.77 s
gammaloop-nextest-core> Location: crates/gammalooprs/src/uv/approx/local_4d.rs :1992
25.77 s
gammaloop-nextest-core>
25.77 s
gammaloop-nextest-core> ━━━━━━━━━━━━━━━━━━━━━━━━━━━━━━━━━━ BACKTRACE ━━━━━━━━━━━━━━━━━━━━━━━━━━━━━━━━━━━
25.77 s
gammaloop-nextest-core> 1: <color_eyre[51793ea62743adbd]::config::PanicHook>::panic_report <unknown>
25.77 s
gammaloop-nextest-core> at <unknown source file> :<unknown line>
25.77 s
gammaloop-nextest-core> 2: <color_eyre[51793ea62743adbd]::config::PanicHook>::into_panic_hook::{closure#0} <unknown>
25.77 s
gammaloop-nextest-core> at <unknown source file> :<unknown line>
25.77 s
gammaloop-nextest-core> 3: std[bcb96dfbba0ab899]::panicking::panic_with_hook <unknown>
25.77 s
gammaloop-nextest-core> at <unknown source file> :<unknown line>
25.77 s
gammaloop-nextest-core> 4: std[bcb96dfbba0ab899]::panicking::panic_handler::{closure#0} <unknown>
25.77 s
gammaloop-nextest-core> at <unknown source file> :<unknown line>
25.77 s
gammaloop-nextest-core> 5: std[bcb96dfbba0ab899]::sys::backtrace::__rust_end_short_backtrace::<std[bcb96dfbba0ab899]::panicking::panic_handler::{closure#0}, !> <unknown>
25.77 s
gammaloop-nextest-core> at <unknown source file> :<unknown line>
25.77 s
gammaloop-nextest-core> 6: __rustc[6c289b9f9c454d21]::rust_begin_unwind <unknown>
25.77 s
gammaloop-nextest-core> at <unknown source file> :<unknown line>
25.77 s
gammaloop-nextest-core> 7: core[940e698046960fd5]::panicking::panic_fmt <unknown>
25.77 s
gammaloop-nextest-core> at <unknown source file> :<unknown line>
25.77 s
gammaloop-nextest-core> 8: core[940e698046960fd5]::panicking::assert_failed_inner <unknown>
25.77 s
gammaloop-nextest-core> at <unknown source file> :<unknown line>
25.77 s
gammaloop-nextest-core> 9: core[940e698046960fd5]::panicking::assert_failed::<alloc[2ea6bcb46fca0c42]::vec::Vec<[usize; 3usize]>, alloc[2ea6bcb46fca0c42]::vec::Vec<[usize; 3usize]>> <unknown>
25.77 s
gammaloop-nextest-core> at <unknown source file> :<unknown line>
25.77 s
gammaloop-nextest-core> 10: gammalooprs[8af0a922d9a4c82d]::uv::approx::local_4d::tests::dod_one_triangle_keeps_separate_denominator_topologies <unknown>
25.77 s
gammaloop-nextest-core> at <unknown source file> :<unknown line>
25.77 s
gammaloop-nextest-core> 11: <gammalooprs[8af0a922d9a4c82d]::uv::approx::local_4d::tests::dod_one_triangle_keeps_separate_denominator_topologies::{closure#0} as core[940e698046960fd5]::ops::function::FnOnce<()>>::call_once <unknown>
25.77 s
gammaloop-nextest-core> at <unknown source file> :<unknown line>
25.77 s
gammaloop-nextest-core> 12: test[75d6903177b1d7e9]::__rust_begin_short_backtrace::<core[940e698046960fd5]::result::Result<(), alloc[2ea6bcb46fca0c42]::string::String>, fn() -> core[940e698046960fd5]::result::Result<(), alloc[2ea6bcb46fca0c42]::string::String>> <unknown>
25.77 s
gammaloop-nextest-core> at <unknown source file> :<unknown line>
25.77 s
gammaloop-nextest-core> 13: test[75d6903177b1d7e9]::run_test::{closure#0} <unknown>
25.77 s
gammaloop-nextest-core> at <unknown source file> :<unknown line>
25.77 s
gammaloop-nextest-core> 14: std[bcb96dfbba0ab899]::sys::backtrace::__rust_begin_short_backtrace::<test[75d6903177b1d7e9]::run_test::{closure#1}, ()> <unknown>
25.77 s
gammaloop-nextest-core> at <unknown source file> :<unknown line>
25.77 s
gammaloop-nextest-core> 15: <std[bcb96dfbba0ab899]::thread::lifecycle::spawn_unchecked<test[75d6903177b1d7e9]::run_test::{closure#1}, ()>::{closure#1} as core[940e698046960fd5]::ops::function::FnOnce<()>>::call_once::{shim:vtable#0} <unknown>
25.77 s
gammaloop-nextest-core> at <unknown source file> :<unknown line>
25.77 s
gammaloop-nextest-core> 16: <std[bcb96dfbba0ab899]::sys::thread::unix::Thread>::new::thread_start <unknown>
25.77 s
gammaloop-nextest-core> at <unknown source file> :<unknown line>
25.77 s
gammaloop-nextest-core> 17: start_thread <unknown>
25.77 s
gammaloop-nextest-core> at <unknown source file> :<unknown line>
25.77 s
gammaloop-nextest-core> 18: __clone3 <unknown>
25.77 s
gammaloop-nextest-core> at <unknown source file> :<unknown line>
25.77 s
gammaloop-nextest-core>
25.77 s
gammaloop-nextest-core> Run with COLORBT_SHOW_HIDDEN=1 environment variable to disable frame filtering.
25.77 s
gammaloop-nextest-core> Run with RUST_BACKTRACE=full to include source snippets.
25.77 s
gammaloop-nextest-core>
26.37 s
gammaloop-nextest-core> FAIL [ 0.598s] (577/645) gammalooprs uv::approx::tests :: factorized_owned_dot_child_cff_matches_direct_3d_for_uncut_self_energy
26.37 s
gammaloop-nextest-core> stdout ---
26.37 s
gammaloop-nextest-core>
26.37 s
gammaloop-nextest-core> running 1 test
26.37 s
gammaloop-nextest-core> test uv::approx::tests::factorized_owned_dot_child_cff_matches_direct_3d_for_uncut_self_energy ... FAILED
26.37 s
gammaloop-nextest-core>
26.37 s
gammaloop-nextest-core> failures:
26.37 s
gammaloop-nextest-core>
26.37 s
gammaloop-nextest-core> failures:
26.37 s
gammaloop-nextest-core> uv::approx::tests::factorized_owned_dot_child_cff_matches_direct_3d_for_uncut_self_energy
26.37 s
gammaloop-nextest-core>
26.37 s
gammaloop-nextest-core> test result: FAILED. 0 passed; 1 failed; 0 ignored; 0 measured; 695 filtered out; finished in 0.57s
26.37 s
gammaloop-nextest-core>
26.37 s
gammaloop-nextest-core> stderr ---
26.37 s
gammaloop-nextest-core> The application panicked (crashed).
26.37 s
gammaloop-nextest-core> Message: assertion `left == right` failed
26.37 s
gammaloop-nextest-core> left: [[1, 1, 2], [1, 2], [2, 2, 1], [2, 1], [2, 1], [2, 2, 1], [2, 2, 2, 1], [2, 2, 1]]
26.37 s
gammaloop-nextest-core> right: [[1, 1, 2, 2, 2]]
26.37 s
gammaloop-nextest-core> Location: crates/gammalooprs/src/uv/approx/mod.rs :1471
26.37 s
gammaloop-nextest-core>
26.37 s
gammaloop-nextest-core> ━━━━━━━━━━━━━━━━━━━━━━━━━━━━━━━━━━ BACKTRACE ━━━━━━━━━━━━━━━━━━━━━━━━━━━━━━━━━━━
26.37 s
gammaloop-nextest-core> 1: <color_eyre[51793ea62743adbd]::config::PanicHook>::panic_report <unknown>
26.37 s
gammaloop-nextest-core> at <unknown source file> :<unknown line>
26.37 s
gammaloop-nextest-core> 2: <color_eyre[51793ea62743adbd]::config::PanicHook>::into_panic_hook::{closure#0} <unknown>
26.37 s
gammaloop-nextest-core> at <unknown source file> :<unknown line>
26.37 s
gammaloop-nextest-core> 3: std[bcb96dfbba0ab899]::panicking::panic_with_hook <unknown>
26.37 s
gammaloop-nextest-core> at <unknown source file> :<unknown line>
26.37 s
gammaloop-nextest-core> 4: std[bcb96dfbba0ab899]::panicking::panic_handler::{closure#0} <unknown>
26.37 s
gammaloop-nextest-core> at <unknown source file> :<unknown line>
26.37 s
gammaloop-nextest-core> 5: std[bcb96dfbba0ab899]::sys::backtrace::__rust_end_short_backtrace::<std[bcb96dfbba0ab899]::panicking::panic_handler::{closure#0}, !> <unknown>
26.37 s
gammaloop-nextest-core> at <unknown source file> :<unknown line>
26.37 s
gammaloop-nextest-core> 6: __rustc[6c289b9f9c454d21]::rust_begin_unwind <unknown>
26.37 s
gammaloop-nextest-core> at <unknown source file> :<unknown line>
26.37 s
gammaloop-nextest-core> 7: core[940e698046960fd5]::panicking::panic_fmt <unknown>
26.37 s
gammaloop-nextest-core> at <unknown source file> :<unknown line>
26.37 s
gammaloop-nextest-core> 8: core[940e698046960fd5]::panicking::assert_failed_inner <unknown>
26.37 s
gammaloop-nextest-core> at <unknown source file> :<unknown line>
26.37 s
gammaloop-nextest-core> 9: core[940e698046960fd5]::panicking::assert_failed::<alloc[2ea6bcb46fca0c42]::vec::Vec<alloc[2ea6bcb46fca0c42]::vec::Vec<usize>>, alloc[2ea6bcb46fca0c42]::vec::Vec<alloc[2ea6bcb46fca0c42]::vec::Vec<usize>>> <unknown>
26.37 s
gammaloop-nextest-core> at <unknown source file> :<unknown line>
26.37 s
gammaloop-nextest-core> 10: gammalooprs[8af0a922d9a4c82d]::uv::approx::tests::factorized_owned_dot_child_cff_matches_direct_3d_for_uncut_self_energy <unknown>
26.37 s
gammaloop-nextest-core> at <unknown source file> :<unknown line>
26.37 s
gammaloop-nextest-core> 11: <gammalooprs[8af0a922d9a4c82d]::uv::approx::tests::factorized_owned_dot_child_cff_matches_direct_3d_for_uncut_self_energy::{closure#0} as core[940e698046960fd5]::ops::function::FnOnce<()>>::call_once <unknown>
26.37 s
gammaloop-nextest-core> at <unknown source file> :<unknown line>
26.37 s
gammaloop-nextest-core> 12: test[75d6903177b1d7e9]::__rust_begin_short_backtrace::<core[940e698046960fd5]::result::Result<(), alloc[2ea6bcb46fca0c42]::string::String>, fn() -> core[940e698046960fd5]::result::Result<(), alloc[2ea6bcb46fca0c42]::string::String>> <unknown>
26.37 s
gammaloop-nextest-core> at <unknown source file> :<unknown line>
26.37 s
gammaloop-nextest-core> 13: test[75d6903177b1d7e9]::run_test::{closure#0} <unknown>
26.37 s
gammaloop-nextest-core> at <unknown source file> :<unknown line>
26.37 s
gammaloop-nextest-core> 14: std[bcb96dfbba0ab899]::sys::backtrace::__rust_begin_short_backtrace::<test[75d6903177b1d7e9]::run_test::{closure#1}, ()> <unknown>
26.37 s
gammaloop-nextest-core> at <unknown source file> :<unknown line>
26.37 s
gammaloop-nextest-core> 15: <std[bcb96dfbba0ab899]::thread::lifecycle::spawn_unchecked<test[75d6903177b1d7e9]::run_test::{closure#1}, ()>::{closure#1} as core[940e698046960fd5]::ops::function::FnOnce<()>>::call_once::{shim:vtable#0} <unknown>
26.37 s
gammaloop-nextest-core> at <unknown source file> :<unknown line>
26.37 s
gammaloop-nextest-core> 16: <std[bcb96dfbba0ab899]::sys::thread::unix::Thread>::new::thread_start <unknown>
26.37 s
gammaloop-nextest-core> at <unknown source file> :<unknown line>
26.37 s
gammaloop-nextest-core> 17: start_thread <unknown>
26.37 s
gammaloop-nextest-core> at <unknown source file> :<unknown line>
26.37 s
gammaloop-nextest-core> 18: __clone3 <unknown>
26.37 s
gammaloop-nextest-core> at <unknown source file> :<unknown line>
26.37 s
gammaloop-nextest-core>
26.37 s
gammaloop-nextest-core> Run with COLORBT_SHOW_HIDDEN=1 environment variable to disable frame filtering.
26.37 s
gammaloop-nextest-core> Run with RUST_BACKTRACE=full to include source snippets.
26.37 s
gammaloop-nextest-core>
39.37 s
gammaloop-nextest-core> ------------
39.37 s
gammaloop-nextest-core> Summary [ 15.149s] 645 tests run: 643 passed , 2 failed , 59 skipped
39.37 s
gammaloop-nextest-core> FAIL [ 0.196s] (553/645) gammalooprs uv::approx::local_4d::tests :: dod_one_triangle_keeps_separate_denominator_topologies
39.37 s
gammaloop-nextest-core> stdout ---
39.37 s
gammaloop-nextest-core>
39.37 s
gammaloop-nextest-core> running 1 test
39.37 s
gammaloop-nextest-core> test uv::approx::local_4d::tests::dod_one_triangle_keeps_separate_denominator_topologies ... FAILED
39.37 s
gammaloop-nextest-core>
39.37 s
gammaloop-nextest-core> failures:
39.37 s
gammaloop-nextest-core>
39.37 s
gammaloop-nextest-core> failures:
39.37 s
gammaloop-nextest-core> uv::approx::local_4d::tests::dod_one_triangle_keeps_separate_denominator_topologies
39.37 s
gammaloop-nextest-core>
39.37 s
gammaloop-nextest-core> test result: FAILED. 0 passed; 1 failed; 0 ignored; 0 measured; 695 filtered out; finished in 0.14s
39.37 s
gammaloop-nextest-core>
39.37 s
gammaloop-nextest-core> stderr ---
39.37 s
gammaloop-nextest-core> The application panicked (crashed).
39.37 s
gammaloop-nextest-core> Message: assertion `left == right` failed
39.37 s
gammaloop-nextest-core> left: [[1, 1, 1], [1, 1, 1], [1, 1, 2], [2, 1, 1]]
39.37 s
gammaloop-nextest-core> right: [[1, 1, 1], [1, 1, 2], [2, 1, 1]]
39.37 s
gammaloop-nextest-core> Location: crates/gammalooprs/src/uv/approx/local_4d.rs :1992
39.37 s
gammaloop-nextest-core>
39.37 s
gammaloop-nextest-core> ━━━━━━━━━━━━━━━━━━━━━━━━━━━━━━━━━━ BACKTRACE ━━━━━━━━━━━━━━━━━━━━━━━━━━━━━━━━━━━
39.37 s
gammaloop-nextest-core> 1: <color_eyre[51793ea62743adbd]::config::PanicHook>::panic_report <unknown>
39.37 s
gammaloop-nextest-core> at <unknown source file> :<unknown line>
39.37 s
gammaloop-nextest-core> 2: <color_eyre[51793ea62743adbd]::config::PanicHook>::into_panic_hook::{closure#0} <unknown>
39.37 s
gammaloop-nextest-core> at <unknown source file> :<unknown line>
39.37 s
gammaloop-nextest-core> 3: std[bcb96dfbba0ab899]::panicking::panic_with_hook <unknown>
39.37 s
gammaloop-nextest-core> at <unknown source file> :<unknown line>
39.37 s
gammaloop-nextest-core> 4: std[bcb96dfbba0ab899]::panicking::panic_handler::{closure#0} <unknown>
39.37 s
gammaloop-nextest-core> at <unknown source file> :<unknown line>
39.37 s
gammaloop-nextest-core> 5: std[bcb96dfbba0ab899]::sys::backtrace::__rust_end_short_backtrace::<std[bcb96dfbba0ab899]::panicking::panic_handler::{closure#0}, !> <unknown>
39.37 s
gammaloop-nextest-core> at <unknown source file> :<unknown line>
39.37 s
gammaloop-nextest-core> 6: __rustc[6c289b9f9c454d21]::rust_begin_unwind <unknown>
39.37 s
gammaloop-nextest-core> at <unknown source file> :<unknown line>
39.37 s
gammaloop-nextest-core> 7: core[940e698046960fd5]::panicking::panic_fmt <unknown>
39.37 s
gammaloop-nextest-core> at <unknown source file> :<unknown line>
39.37 s
gammaloop-nextest-core> 8: core[940e698046960fd5]::panicking::assert_failed_inner <unknown>
39.37 s
gammaloop-nextest-core> at <unknown source file> :<unknown line>
39.37 s
gammaloop-nextest-core> 9: core[940e698046960fd5]::panicking::assert_failed::<alloc[2ea6bcb46fca0c42]::vec::Vec<[usize; 3usize]>, alloc[2ea6bcb46fca0c42]::vec::Vec<[usize; 3usize]>> <unknown>
39.37 s
gammaloop-nextest-core> at <unknown source file> :<unknown line>
39.37 s
gammaloop-nextest-core> 10: gammalooprs[8af0a922d9a4c82d]::uv::approx::local_4d::tests::dod_one_triangle_keeps_separate_denominator_topologies <unknown>
39.37 s
gammaloop-nextest-core> at <unknown source file> :<unknown line>
39.37 s
gammaloop-nextest-core> 11: <gammalooprs[8af0a922d9a4c82d]::uv::approx::local_4d::tests::dod_one_triangle_keeps_separate_denominator_topologies::{closure#0} as core[940e698046960fd5]::ops::function::FnOnce<()>>::call_once <unknown>
39.37 s
gammaloop-nextest-core> at <unknown source file> :<unknown line>
39.37 s
gammaloop-nextest-core> 12: test[75d6903177b1d7e9]::__rust_begin_short_backtrace::<core[940e698046960fd5]::result::Result<(), alloc[2ea6bcb46fca0c42]::string::String>, fn() -> core[940e698046960fd5]::result::Result<(), alloc[2ea6bcb46fca0c42]::string::String>> <unknown>
39.37 s
gammaloop-nextest-core> at <unknown source file> :<unknown line>
39.37 s
gammaloop-nextest-core> 13: test[75d6903177b1d7e9]::run_test::{closure#0} <unknown>
39.37 s
gammaloop-nextest-core> at <unknown source file> :<unknown line>
39.37 s
gammaloop-nextest-core> 14: std[bcb96dfbba0ab899]::sys::backtrace::__rust_begin_short_backtrace::<test[75d6903177b1d7e9]::run_test::{closure#1}, ()> <unknown>
39.37 s
gammaloop-nextest-core> at <unknown source file> :<unknown line>
39.37 s
gammaloop-nextest-core> 15: <std[bcb96dfbba0ab899]::thread::lifecycle::spawn_unchecked<test[75d6903177b1d7e9]::run_test::{closure#1}, ()>::{closure#1} as core[940e698046960fd5]::ops::function::FnOnce<()>>::call_once::{shim:vtable#0} <unknown>
39.37 s
gammaloop-nextest-core> at <unknown source file> :<unknown line>
39.37 s
gammaloop-nextest-core> 16: <std[bcb96dfbba0ab899]::sys::thread::unix::Thread>::new::thread_start <unknown>
39.37 s
gammaloop-nextest-core> at <unknown source file> :<unknown line>
39.37 s
gammaloop-nextest-core> 17: start_thread <unknown>
39.37 s
gammaloop-nextest-core> at <unknown source file> :<unknown line>
39.37 s
gammaloop-nextest-core> 18: __clone3 <unknown>
39.37 s
gammaloop-nextest-core> at <unknown source file> :<unknown line>
39.37 s
gammaloop-nextest-core>
39.37 s
gammaloop-nextest-core> Run with COLORBT_SHOW_HIDDEN=1 environment variable to disable frame filtering.
39.37 s
gammaloop-nextest-core> Run with RUST_BACKTRACE=full to include source snippets.
39.37 s
gammaloop-nextest-core>
39.37 s
gammaloop-nextest-core> FAIL [ 0.598s] (577/645) gammalooprs uv::approx::tests :: factorized_owned_dot_child_cff_matches_direct_3d_for_uncut_self_energy
39.37 s
gammaloop-nextest-core> stdout ---
39.37 s
gammaloop-nextest-core>
39.37 s
gammaloop-nextest-core> running 1 test
39.38 s
gammaloop-nextest-core> test uv::approx::tests::factorized_owned_dot_child_cff_matches_direct_3d_for_uncut_self_energy ... FAILED
39.38 s
gammaloop-nextest-core>
39.38 s
gammaloop-nextest-core> failures:
39.38 s
gammaloop-nextest-core>
39.38 s
gammaloop-nextest-core> failures:
39.38 s
gammaloop-nextest-core> uv::approx::tests::factorized_owned_dot_child_cff_matches_direct_3d_for_uncut_self_energy
39.38 s
gammaloop-nextest-core>
39.38 s
gammaloop-nextest-core> test result: FAILED. 0 passed; 1 failed; 0 ignored; 0 measured; 695 filtered out; finished in 0.57s
39.38 s
gammaloop-nextest-core>
39.38 s
gammaloop-nextest-core> stderr ---
39.38 s
gammaloop-nextest-core> The application panicked (crashed).
39.38 s
gammaloop-nextest-core> Message: assertion `left == right` failed
39.38 s
gammaloop-nextest-core> left: [[1, 1, 2], [1, 2], [2, 2, 1], [2, 1], [2, 1], [2, 2, 1], [2, 2, 2, 1], [2, 2, 1]]
39.38 s
gammaloop-nextest-core> right: [[1, 1, 2, 2, 2]]
39.38 s
gammaloop-nextest-core> Location: crates/gammalooprs/src/uv/approx/mod.rs :1471
39.38 s
gammaloop-nextest-core>
39.38 s
gammaloop-nextest-core> ━━━━━━━━━━━━━━━━━━━━━━━━━━━━━━━━━━ BACKTRACE ━━━━━━━━━━━━━━━━━━━━━━━━━━━━━━━━━━━
39.38 s
gammaloop-nextest-core> 1: <color_eyre[51793ea62743adbd]::config::PanicHook>::panic_report <unknown>
39.38 s
gammaloop-nextest-core> at <unknown source file> :<unknown line>
39.38 s
gammaloop-nextest-core> 2: <color_eyre[51793ea62743adbd]::config::PanicHook>::into_panic_hook::{closure#0} <unknown>
39.38 s
gammaloop-nextest-core> at <unknown source file> :<unknown line>
39.38 s
gammaloop-nextest-core> 3: std[bcb96dfbba0ab899]::panicking::panic_with_hook <unknown>
39.38 s
gammaloop-nextest-core> at <unknown source file> :<unknown line>
39.38 s
gammaloop-nextest-core> 4: std[bcb96dfbba0ab899]::panicking::panic_handler::{closure#0} <unknown>
39.38 s
gammaloop-nextest-core> at <unknown source file> :<unknown line>
39.38 s
gammaloop-nextest-core> 5: std[bcb96dfbba0ab899]::sys::backtrace::__rust_end_short_backtrace::<std[bcb96dfbba0ab899]::panicking::panic_handler::{closure#0}, !> <unknown>
39.38 s
gammaloop-nextest-core> at <unknown source file> :<unknown line>
39.38 s
gammaloop-nextest-core> 6: __rustc[6c289b9f9c454d21]::rust_begin_unwind <unknown>
39.38 s
gammaloop-nextest-core> at <unknown source file> :<unknown line>
39.38 s
gammaloop-nextest-core> 7: core[940e698046960fd5]::panicking::panic_fmt <unknown>
39.38 s
gammaloop-nextest-core> at <unknown source file> :<unknown line>
39.38 s
gammaloop-nextest-core> 8: core[940e698046960fd5]::panicking::assert_failed_inner <unknown>
39.38 s
gammaloop-nextest-core> at <unknown source file> :<unknown line>
39.38 s
gammaloop-nextest-core> 9: core[940e698046960fd5]::panicking::assert_failed::<alloc[2ea6bcb46fca0c42]::vec::Vec<alloc[2ea6bcb46fca0c42]::vec::Vec<usize>>, alloc[2ea6bcb46fca0c42]::vec::Vec<alloc[2ea6bcb46fca0c42]::vec::Vec<usize>>> <unknown>
39.38 s
gammaloop-nextest-core> at <unknown source file> :<unknown line>
39.38 s
gammaloop-nextest-core> 10: gammalooprs[8af0a922d9a4c82d]::uv::approx::tests::factorized_owned_dot_child_cff_matches_direct_3d_for_uncut_self_energy <unknown>
39.38 s
gammaloop-nextest-core> at <unknown source file> :<unknown line>
39.38 s
gammaloop-nextest-core> 11: <gammalooprs[8af0a922d9a4c82d]::uv::approx::tests::factorized_owned_dot_child_cff_matches_direct_3d_for_uncut_self_energy::{closure#0} as core[940e698046960fd5]::ops::function::FnOnce<()>>::call_once <unknown>
39.38 s
gammaloop-nextest-core> at <unknown source file> :<unknown line>
39.38 s
gammaloop-nextest-core> 12: test[75d6903177b1d7e9]::__rust_begin_short_backtrace::<core[940e698046960fd5]::result::Result<(), alloc[2ea6bcb46fca0c42]::string::String>, fn() -> core[940e698046960fd5]::result::Result<(), alloc[2ea6bcb46fca0c42]::string::String>> <unknown>
39.38 s
gammaloop-nextest-core> at <unknown source file> :<unknown line>
39.38 s
gammaloop-nextest-core> 13: test[75d6903177b1d7e9]::run_test::{closure#0} <unknown>
39.38 s
gammaloop-nextest-core> at <unknown source file> :<unknown line>
39.38 s
gammaloop-nextest-core> 14: std[bcb96dfbba0ab899]::sys::backtrace::__rust_begin_short_backtrace::<test[75d6903177b1d7e9]::run_test::{closure#1}, ()> <unknown>
39.38 s
gammaloop-nextest-core> at <unknown source file> :<unknown line>
39.38 s
gammaloop-nextest-core> 15: <std[bcb96dfbba0ab899]::thread::lifecycle::spawn_unchecked<test[75d6903177b1d7e9]::run_test::{closure#1}, ()>::{closure#1} as core[940e698046960fd5]::ops::function::FnOnce<()>>::call_once::{shim:vtable#0} <unknown>
39.38 s
gammaloop-nextest-core> at <unknown source file> :<unknown line>
39.38 s
gammaloop-nextest-core> 16: <std[bcb96dfbba0ab899]::sys::thread::unix::Thread>::new::thread_start <unknown>
39.38 s
gammaloop-nextest-core> at <unknown source file> :<unknown line>
39.38 s
gammaloop-nextest-core> 17: start_thread <unknown>
39.38 s
gammaloop-nextest-core> at <unknown source file> :<unknown line>
39.38 s
gammaloop-nextest-core> 18: __clone3 <unknown>
39.38 s
gammaloop-nextest-core> at <unknown source file> :<unknown line>
39.38 s
gammaloop-nextest-core>
39.38 s
gammaloop-nextest-core> Run with COLORBT_SHOW_HIDDEN=1 environment variable to disable frame filtering.
39.38 s
gammaloop-nextest-core> Run with RUST_BACKTRACE=full to include source snippets.
39.38 s
gammaloop-nextest-core>
39.48 s
gammaloop-nextest-core> error : test run failed
39.54 s
gammaloop-nextest-core>
39.54 s
gammaloop-nextest-core> ========== nextest test summary ==========
39.54 s
gammaloop-nextest-core> report: target/nextest/ci_gammaloop/junit.xml
39.54 s
gammaloop-nextest-core> tests: 645, failures: 2, errors: 0
39.54 s
gammaloop-nextest-core>
39.54 s
gammaloop-nextest-core> 1. gammalooprs::uv::approx::local_4d::tests::dod_one_triangle_keeps_separate_denominator_topologies
39.54 s
gammaloop-nextest-core> failure: test failure with exit code 101
39.54 s
gammaloop-nextest-core> system-out
39.54 s
gammaloop-nextest-core> running 1 test
39.54 s
gammaloop-nextest-core> test uv::approx::local_4d::tests::dod_one_triangle_keeps_separate_denominator_topologies ... FAILED
39.54 s
gammaloop-nextest-core>
39.54 s
gammaloop-nextest-core> failures:
39.54 s
gammaloop-nextest-core>
39.54 s
gammaloop-nextest-core> failures:
39.54 s
gammaloop-nextest-core> uv::approx::local_4d::tests::dod_one_triangle_keeps_separate_denominator_topologies
39.54 s
gammaloop-nextest-core>
39.54 s
gammaloop-nextest-core> test result: FAILED. 0 passed; 1 failed; 0 ignored; 0 measured; 695 filtered out; finished in 0.14s
39.54 s
gammaloop-nextest-core> system-err
39.54 s
gammaloop-nextest-core> The application panicked (crashed).
39.54 s
gammaloop-nextest-core> Message: assertion `left == right` failed
39.54 s
gammaloop-nextest-core> left: [[1, 1, 1], [1, 1, 1], [1, 1, 2], [2, 1, 1]]
39.54 s
gammaloop-nextest-core> right: [[1, 1, 1], [1, 1, 2], [2, 1, 1]]
39.54 s
gammaloop-nextest-core> Location: crates/gammalooprs/src/uv/approx/local_4d.rs:1992
39.54 s
gammaloop-nextest-core>
39.54 s
gammaloop-nextest-core> ━━━━━━━━━━━━━━━━━━━━━━━━━━━━━━━━━━ BACKTRACE ━━━━━━━━━━━━━━━━━━━━━━━━━━━━━━━━━━━
39.54 s
gammaloop-nextest-core> 1: <color_eyre[51793ea62743adbd]::config::PanicHook>::panic_report<unknown>
39.54 s
gammaloop-nextest-core> at <unknown source file>:<unknown line>
39.54 s
gammaloop-nextest-core> 2: <color_eyre[51793ea62743adbd]::config::PanicHook>::into_panic_hook::{closure#0}<unknown>
39.54 s
gammaloop-nextest-core> at <unknown source file>:<unknown line>
39.54 s
gammaloop-nextest-core> 3: std[bcb96dfbba0ab899]::panicking::panic_with_hook<unknown>
39.54 s
gammaloop-nextest-core> at <unknown source file>:<unknown line>
39.54 s
gammaloop-nextest-core> 4: std[bcb96dfbba0ab899]::panicking::panic_handler::{closure#0}<unknown>
39.54 s
gammaloop-nextest-core> at <unknown source file>:<unknown line>
39.54 s
gammaloop-nextest-core> 5: std[bcb96dfbba0ab899]::sys::backtrace::__rust_end_short_backtrace::<std[bcb96dfbba0ab899]::panicking::panic_handler::{closure#0}, !><unknown>
39.54 s
gammaloop-nextest-core> at <unknown source file>:<unknown line>
39.54 s
gammaloop-nextest-core> 6: __rustc[6c289b9f9c454d21]::rust_begin_unwind<unknown>
39.54 s
gammaloop-nextest-core> at <unknown source file>:<unknown line>
39.54 s
gammaloop-nextest-core> 7: core[940e698046960fd5]::panicking::panic_fmt<unknown>
39.54 s
gammaloop-nextest-core> at <unknown source file>:<unknown line>
39.54 s
gammaloop-nextest-core> 8: core[940e698046960fd5]::panicking::assert_failed_inner<unknown>
39.54 s
gammaloop-nextest-core> at <unknown source file>:<unknown line>
39.54 s
gammaloop-nextest-core> 9: core[940e698046960fd5]::panicking::assert_failed::<alloc[2ea6bcb46fca0c42]::vec::Vec<[usize; 3usize]>, alloc[2ea6bcb46fca0c42]::vec::Vec<[usize; 3usize]>><unknown>
39.54 s
gammaloop-nextest-core> at <unknown source file>:<unknown line>
39.54 s
gammaloop-nextest-core> 10: gammalooprs[8af0a922d9a4c82d]::uv::approx::local_4d::tests::dod_one_triangle_keeps_separate_denominator_topologies<unknown>
39.54 s
gammaloop-nextest-core> at <unknown source file>:<unknown line>
39.54 s
gammaloop-nextest-core> 11: <gammalooprs[8af0a922d9a4c82d]::uv::approx::local_4d::tests::dod_one_triangle_keeps_separate_denominator_topologies::{closure#0} as core[940e698046960fd5]::ops::function::FnOnce<()>>::call_once<unknown>
39.54 s
gammaloop-nextest-core> at <unknown source file>:<unknown line>
39.54 s
gammaloop-nextest-core> 12: test[75d6903177b1d7e9]::__rust_begin_short_backtrace::<core[940e698046960fd5]::result::Result<(), alloc[2ea6bcb46fca0c42]::string::String>, fn() -> core[940e698046960fd5]::result::Result<(), alloc[2ea6bcb46fca0c42]::string::String>><unknown>
39.54 s
gammaloop-nextest-core> at <unknown source file>:<unknown line>
39.54 s
gammaloop-nextest-core> 13: test[75d6903177b1d7e9]::run_test::{closure#0}<unknown>
39.54 s
gammaloop-nextest-core> at <unknown source file>:<unknown line>
39.54 s
gammaloop-nextest-core> 14: std[bcb96dfbba0ab899]::sys::backtrace::__rust_begin_short_backtrace::<test[75d6903177b1d7e9]::run_test::{closure#1}, ()><unknown>
39.54 s
gammaloop-nextest-core> at <unknown source file>:<unknown line>
39.54 s
gammaloop-nextest-core> 15: <std[bcb96dfbba0ab899]::thread::lifecycle::spawn_unchecked<test[75d6903177b1d7e9]::run_test::{closure#1}, ()>::{closure#1} as core[940e698046960fd5]::ops::function::FnOnce<()>>::call_once::{shim:vtable#0}<unknown>
39.54 s
gammaloop-nextest-core> at <unknown source file>:<unknown line>
39.54 s
gammaloop-nextest-core> 16: <std[bcb96dfbba0ab899]::sys::thread::unix::Thread>::new::thread_start<unknown>
39.54 s
gammaloop-nextest-core> at <unknown source file>:<unknown line>
39.54 s
gammaloop-nextest-core> 17: start_thread<unknown>
39.54 s
gammaloop-nextest-core> at <unknown source file>:<unknown line>
39.54 s
gammaloop-nextest-core> 18: __clone3<unknown>
39.54 s
gammaloop-nextest-core> at <unknown source file>:<unknown line>
39.54 s
gammaloop-nextest-core>
39.54 s
gammaloop-nextest-core> Run with COLORBT_SHOW_HIDDEN=1 environment variable to disable frame filtering.
39.54 s
gammaloop-nextest-core> Run with RUST_BACKTRACE=full to include source snippets.
39.54 s
gammaloop-nextest-core>
39.54 s
gammaloop-nextest-core> 2. gammalooprs::uv::approx::tests::factorized_owned_dot_child_cff_matches_direct_3d_for_uncut_self_energy
39.54 s
gammaloop-nextest-core> failure: test failure with exit code 101
39.54 s
gammaloop-nextest-core> system-out
39.54 s
gammaloop-nextest-core> running 1 test
39.54 s
gammaloop-nextest-core> test uv::approx::tests::factorized_owned_dot_child_cff_matches_direct_3d_for_uncut_self_energy ... FAILED
39.54 s
gammaloop-nextest-core>
39.54 s
gammaloop-nextest-core> failures:
39.54 s
gammaloop-nextest-core>
39.54 s
gammaloop-nextest-core> failures:
39.54 s
gammaloop-nextest-core> uv::approx::tests::factorized_owned_dot_child_cff_matches_direct_3d_for_uncut_self_energy
39.54 s
gammaloop-nextest-core>
39.54 s
gammaloop-nextest-core> test result: FAILED. 0 passed; 1 failed; 0 ignored; 0 measured; 695 filtered out; finished in 0.57s
39.54 s
gammaloop-nextest-core> system-err
39.54 s
gammaloop-nextest-core> The application panicked (crashed).
39.54 s
gammaloop-nextest-core> Message: assertion `left == right` failed
39.54 s
gammaloop-nextest-core> left: [[1, 1, 2], [1, 2], [2, 2, 1], [2, 1], [2, 1], [2, 2, 1], [2, 2, 2, 1], [2, 2, 1]]
39.54 s
gammaloop-nextest-core> right: [[1, 1, 2, 2, 2]]
39.54 s
gammaloop-nextest-core> Location: crates/gammalooprs/src/uv/approx/mod.rs:1471
39.54 s
gammaloop-nextest-core>
39.54 s
gammaloop-nextest-core> ━━━━━━━━━━━━━━━━━━━━━━━━━━━━━━━━━━ BACKTRACE ━━━━━━━━━━━━━━━━━━━━━━━━━━━━━━━━━━━
39.54 s
gammaloop-nextest-core> 1: <color_eyre[51793ea62743adbd]::config::PanicHook>::panic_report<unknown>
39.54 s
gammaloop-nextest-core> at <unknown source file>:<unknown line>
39.54 s
gammaloop-nextest-core> 2: <color_eyre[51793ea62743adbd]::config::PanicHook>::into_panic_hook::{closure#0}<unknown>
39.54 s
gammaloop-nextest-core> at <unknown source file>:<unknown line>
39.54 s
gammaloop-nextest-core> 3: std[bcb96dfbba0ab899]::panicking::panic_with_hook<unknown>
39.54 s
gammaloop-nextest-core> at <unknown source file>:<unknown line>
39.54 s
gammaloop-nextest-core> 4: std[bcb96dfbba0ab899]::panicking::panic_handler::{closure#0}<unknown>
39.54 s
gammaloop-nextest-core> at <unknown source file>:<unknown line>
39.54 s
gammaloop-nextest-core> 5: std[bcb96dfbba0ab899]::sys::backtrace::__rust_end_short_backtrace::<std[bcb96dfbba0ab899]::panicking::panic_handler::{closure#0}, !><unknown>
39.54 s
gammaloop-nextest-core> at <unknown source file>:<unknown line>
39.54 s
gammaloop-nextest-core> 6: __rustc[6c289b9f9c454d21]::rust_begin_unwind<unknown>
39.54 s
gammaloop-nextest-core> at <unknown source file>:<unknown line>
39.54 s
gammaloop-nextest-core> 7: core[940e698046960fd5]::panicking::panic_fmt<unknown>
39.54 s
gammaloop-nextest-core> at <unknown source file>:<unknown line>
39.54 s
gammaloop-nextest-core> 8: core[940e698046960fd5]::panicking::assert_failed_inner<unknown>
39.54 s
gammaloop-nextest-core> at <unknown source file>:<unknown line>
39.54 s
gammaloop-nextest-core> 9: core[940e698046960fd5]::panicking::assert_failed::<alloc[2ea6bcb46fca0c42]::vec::Vec<alloc[2ea6bcb46fca0c42]::vec::Vec<usize>>, alloc[2ea6bcb46fca0c42]::vec::Vec<alloc[2ea6bcb46fca0c42]::vec::Vec<usize>>><unknown>
39.54 s
gammaloop-nextest-core> at <unknown source file>:<unknown line>
39.54 s
gammaloop-nextest-core> 10: gammalooprs[8af0a922d9a4c82d]::uv::approx::tests::factorized_owned_dot_child_cff_matches_direct_3d_for_uncut_self_energy<unknown>
39.54 s
gammaloop-nextest-core> at <unknown source file>:<unknown line>
39.54 s
gammaloop-nextest-core> 11: <gammalooprs[8af0a922d9a4c82d]::uv::approx::tests::factorized_owned_dot_child_cff_matches_direct_3d_for_uncut_self_energy::{closure#0} as core[940e698046960fd5]::ops::function::FnOnce<()>>::call_once<unknown>
39.54 s
gammaloop-nextest-core> at <unknown source file>:<unknown line>
39.54 s
gammaloop-nextest-core> 12: test[75d6903177b1d7e9]::__rust_begin_short_backtrace::<core[940e698046960fd5]::result::Result<(), alloc[2ea6bcb46fca0c42]::string::String>, fn() -> core[940e698046960fd5]::result::Result<(), alloc[2ea6bcb46fca0c42]::string::String>><unknown>
39.54 s
gammaloop-nextest-core> at <unknown source file>:<unknown line>
39.54 s
gammaloop-nextest-core> 13: test[75d6903177b1d7e9]::run_test::{closure#0}<unknown>
39.54 s
gammaloop-nextest-core> at <unknown source file>:<unknown line>
39.54 s
gammaloop-nextest-core> 14: std[bcb96dfbba0ab899]::sys::backtrace::__rust_begin_short_backtrace::<test[75d6903177b1d7e9]::run_test::{closure#1}, ()><unknown>
39.54 s
gammaloop-nextest-core> at <unknown source file>:<unknown line>
39.54 s
gammaloop-nextest-core> 15: <std[bcb96dfbba0ab899]::thread::lifecycle::spawn_unchecked<test[75d6903177b1d7e9]::run_test::{closure#1}, ()>::{closure#1} as core[940e698046960fd5]::ops::function::FnOnce<()>>::call_once::{shim:vtable#0}<unknown>
39.54 s
gammaloop-nextest-core> at <unknown source file>:<unknown line>
39.54 s
gammaloop-nextest-core> 16: <std[bcb96dfbba0ab899]::sys::thread::unix::Thread>::new::thread_start<unknown>
39.54 s
gammaloop-nextest-core> at <unknown source file>:<unknown line>
39.54 s
gammaloop-nextest-core> 17: start_thread<unknown>
39.54 s
gammaloop-nextest-core> at <unknown source file>:<unknown line>
39.54 s
gammaloop-nextest-core> 18: __clone3<unknown>
39.54 s
gammaloop-nextest-core> at <unknown source file>:<unknown line>
39.54 s
gammaloop-nextest-core>
39.54 s
gammaloop-nextest-core> Run with COLORBT_SHOW_HIDDEN=1 environment variable to disable frame filtering.
39.54 s
gammaloop-nextest-core> Run with RUST_BACKTRACE=full to include source snippets.
39.54 s
gammaloop-nextest-core> =========================================
39.57 s
gammaloop-nextest-core> Extracting 1 binary, 1 build script output directory, and 1 linked path to /build/nextest-archive-cZSeo1
39.70 s
gammaloop-nextest-core> Extracted 7 files to /build/nextest-archive-cZSeo1 in 0.13s
39.71 s
gammaloop-nextest-core> ------------
39.71 s
gammaloop-nextest-core> Nextest run ID cd98eea8-2e75-443a-bbbb-e8133c835950 with nextest profile: ci_gammaloop
39.71 s
gammaloop-nextest-core> Starting 119 tests across 1 binary
41.81 s
gammaloop-nextest-core> ------------
41.81 s
gammaloop-nextest-core> Summary [ 2.095s] 119 tests run: 119 passed , 0 skipped
41.88 s
gammaloop-nextest-core>
41.88 s
gammaloop-nextest-core> ========== nextest test summary ==========
41.88 s
gammaloop-nextest-core> report: target/nextest/ci_gammaloop/junit.xml
41.88 s
gammaloop-nextest-core> tests: 119, failures: 0, errors: 0
41.88 s
gammaloop-nextest-core> No failing testcases found.
41.88 s
gammaloop-nextest-core> =========================================
41.98 s
[0 built (1 failed ), 0.0 error: Cannot build '/nix/store/bcc3gg1akl605y0c3km3gjg8nsqsjzv8-gammaloop-nextest-core.drv '.
41.98 s
Reason: builder failed with exit code 100 .
41.98 s
Output paths:
41.98 s
/nix/store/i7lvgxhj7vpsi0jgq7jfdhgg9f5m1qi3-gammaloop-nextest-core
41.98 s
Last 429 log lines:
41.98 s
> Extracting 4 binaries (including 1 non-test binary), 1 build script output directory, and 2 linked paths to /build/nextest-archive-zsrXEg
41.98 s
> Extracted 20 files to /build/nextest-archive-zsrXEg in 0.72s
41.98 s
> ------------
41.98 s
> Nextest run ID feef071c-54bb-423e-ac02-6efc3d53feb3 with nextest profile: ci_gammaloop
41.98 s
> Starting 377 tests across 3 binaries
41.98 s
> ------------
41.98 s
> Summary [ 1.316s] 377 tests run: 377 passed , 0 skipped
41.98 s
>
41.98 s
> ========== nextest test summary ==========
41.98 s
> report: target/nextest/ci_gammaloop/junit.xml
41.98 s
> tests: 377, failures: 0, errors: 0
41.98 s
> No failing testcases found.
41.98 s
> =========================================
41.98 s
> Extracting 1 binary and 1 linked path to /build/nextest-archive-xYJLcI
41.98 s
> Extracted 7 files to /build/nextest-archive-xYJLcI in 0.07s
41.98 s
> ------------
41.98 s
> Nextest run ID 785dbc3d-151a-4e42-bd03-8131e5fb6b11 with nextest profile: ci_gammaloop
41.98 s
> Starting 19 tests across 1 binary
41.98 s
> ------------
41.98 s
> Summary [ 0.012s] 19 tests run: 19 passed , 0 skipped
41.98 s
>
41.98 s
> ========== nextest test summary ==========
41.98 s
> report: target/nextest/ci_gammaloop/junit.xml
41.98 s
> tests: 19, failures: 0, errors: 0
41.98 s
> No failing testcases found.
41.98 s
> =========================================
41.98 s
> Extracting 1 binary to /build/nextest-archive-EGag36
41.98 s
> Extracted 4 files to /build/nextest-archive-EGag36 in 0.03s
41.98 s
> ------------
41.98 s
> Nextest run ID 582f4ed7-065b-4ec8-bc0b-3c1a001b2d75 with nextest profile: ci_gammaloop
41.98 s
> Starting 0 tests across 1 binary
41.98 s
> ------------
41.98 s
> Summary [ 0.000s] 0 tests run: 0 passed , 0 skipped
41.98 s
>
41.98 s
> ========== nextest test summary ==========
41.98 s
> report: target/nextest/ci_gammaloop/junit.xml
41.98 s
> tests: 0, failures: 0, errors: 0
41.98 s
> No failing testcases found.
41.98 s
> =========================================
41.98 s
> Extracting 4 binaries, 1 build script output directory, and 2 linked paths to /build/nextest-archive-OM5q93
41.98 s
> Extracted 18 files to /build/nextest-archive-OM5q93 in 0.49s
41.98 s
> ------------
41.98 s
> Nextest run ID c2d0d83b-b1d2-44d0-ae88-375b8da65a4f with nextest profile: ci_gammaloop
41.98 s
> Starting 645 tests across 4 binaries (59 tests skipped , including 58 tests via profile.ci_gammaloop.default-filter )
41.98 s
> FAIL [ 0.196s] (553/645) gammalooprs uv::approx::local_4d::tests :: dod_one_triangle_keeps_separate_denominator_topologies
41.98 s
> stdout ---
41.98 s
>
41.98 s
> running 1 test
41.98 s
> test uv::approx::local_4d::tests::dod_one_triangle_keeps_separate_denominator_topologies ... FAILED
41.98 s
>
41.98 s
> failures:
41.98 s
>
41.98 s
> failures:
41.98 s
> uv::approx::local_4d::tests::dod_one_triangle_keeps_separate_denominator_topologies
41.98 s
>
41.98 s
> test result: FAILED. 0 passed; 1 failed; 0 ignored; 0 measured; 695 filtered out; finished in 0.14s
41.98 s
>
41.98 s
> stderr ---
41.98 s
> The application panicked (crashed).
41.98 s
> Message: assertion `left == right` failed
41.98 s
> left: [[1, 1, 1], [1, 1, 1], [1, 1, 2], [2, 1, 1]]
41.98 s
> right: [[1, 1, 1], [1, 1, 2], [2, 1, 1]]
41.98 s
> Location: crates/gammalooprs/src/uv/approx/local_4d.rs :1992
41.98 s
>
41.98 s
> ━━━━━━━━━━━━━━━━━━━━━━━━━━━━━━━━━━ BACKTRACE ━━━━━━━━━━━━━━━━━━━━━━━━━━━━━━━━━━━
41.98 s
> 1: <color_eyre[51793ea62743adbd]::config::PanicHook>::panic_report <unknown>
41.98 s
> at <unknown source file> :<unknown line>
41.98 s
> 2: <color_eyre[51793ea62743adbd]::config::PanicHook>::into_panic_hook::{closure#0} <unknown>
41.98 s
> at <unknown source file> :<unknown line>
41.98 s
> 3: std[bcb96dfbba0ab899]::panicking::panic_with_hook <unknown>
41.98 s
> at <unknown source file> :<unknown line>
41.98 s
> 4: std[bcb96dfbba0ab899]::panicking::panic_handler::{closure#0} <unknown>
41.98 s
> at <unknown source file> :<unknown line>
41.98 s
> 5: std[bcb96dfbba0ab899]::sys::backtrace::__rust_end_short_backtrace::<std[bcb96dfbba0ab899]::panicking::panic_handler::{closure#0}, !> <unknown>
41.98 s
> at <unknown source file> :<unknown line>
41.98 s
> 6: __rustc[6c289b9f9c454d21]::rust_begin_unwind <unknown>
41.98 s
> at <unknown source file> :<unknown line>
41.98 s
> 7: core[940e698046960fd5]::panicking::panic_fmt <unknown>
41.98 s
> at <unknown source file> :<unknown line>
41.98 s
> 8: core[940e698046960fd5]::panicking::assert_failed_inner <unknown>
41.98 s
> at <unknown source file> :<unknown line>
41.98 s
> 9: core[940e698046960fd5]::panicking::assert_failed::<alloc[2ea6bcb46fca0c42]::vec::Vec<[usize; 3usize]>, alloc[2ea6bcb46fca0c42]::vec::Vec<[usize; 3usize]>> <unknown>
41.98 s
> at <unknown source file> :<unknown line>
41.98 s
> 10: gammalooprs[8af0a922d9a4c82d]::uv::approx::local_4d::tests::dod_one_triangle_keeps_separate_denominator_topologies <unknown>
41.98 s
> at <unknown source file> :<unknown line>
41.98 s
> 11: <gammalooprs[8af0a922d9a4c82d]::uv::approx::local_4d::tests::dod_one_triangle_keeps_separate_denominator_topologies::{closure#0} as core[940e698046960fd5]::ops::function::FnOnce<()>>::call_once <unknown>
41.98 s
> at <unknown source file> :<unknown line>
41.98 s
> 12: test[75d6903177b1d7e9]::__rust_begin_short_backtrace::<core[940e698046960fd5]::result::Result<(), alloc[2ea6bcb46fca0c42]::string::String>, fn() -> core[940e698046960fd5]::result::Result<(), alloc[2ea6bcb46fca0c42]::string::String>> <unknown>
41.98 s
> at <unknown source file> :<unknown line>
41.98 s
> 13: test[75d6903177b1d7e9]::run_test::{closure#0} <unknown>
41.98 s
> at <unknown source file> :<unknown line>
41.98 s
> 14: std[bcb96dfbba0ab899]::sys::backtrace::__rust_begin_short_backtrace::<test[75d6903177b1d7e9]::run_test::{closure#1}, ()> <unknown>
41.98 s
> at <unknown source file> :<unknown line>
41.98 s
> 15: <std[bcb96dfbba0ab899]::thread::lifecycle::spawn_unchecked<test[75d6903177b1d7e9]::run_test::{closure#1}, ()>::{closure#1} as core[940e698046960fd5]::ops::function::FnOnce<()>>::call_once::{shim:vtable#0} <unknown>
41.98 s
> at <unknown source file> :<unknown line>
41.98 s
> 16: <std[bcb96dfbba0ab899]::sys::thread::unix::Thread>::new::thread_start <unknown>
41.98 s
> at <unknown source file> :<unknown line>
41.98 s
> 17: start_thread <unknown>
41.98 s
> at <unknown source file> :<unknown line>
41.98 s
> 18: __clone3 <unknown>
41.98 s
> at <unknown source file> :<unknown line>
41.98 s
>
41.98 s
> Run with COLORBT_SHOW_HIDDEN=1 environment variable to disable frame filtering.
41.98 s
> Run with RUST_BACKTRACE=full to include source snippets.
41.98 s
>
41.98 s
> FAIL [ 0.598s] (577/645) gammalooprs uv::approx::tests :: factorized_owned_dot_child_cff_matches_direct_3d_for_uncut_self_energy
41.98 s
> stdout ---
41.98 s
>
41.98 s
> running 1 test
41.98 s
> test uv::approx::tests::factorized_owned_dot_child_cff_matches_direct_3d_for_uncut_self_energy ... FAILED
41.98 s
>
41.98 s
> failures:
41.98 s
>
41.98 s
> failures:
41.98 s
> uv::approx::tests::factorized_owned_dot_child_cff_matches_direct_3d_for_uncut_self_energy
41.98 s
>
41.98 s
> test result: FAILED. 0 passed; 1 failed; 0 ignored; 0 measured; 695 filtered out; finished in 0.57s
41.98 s
>
41.98 s
> stderr ---
41.98 s
> The application panicked (crashed).
41.98 s
> Message: assertion `left == right` failed
41.98 s
> left: [[1, 1, 2], [1, 2], [2, 2, 1], [2, 1], [2, 1], [2, 2, 1], [2, 2, 2, 1], [2, 2, 1]]
41.98 s
> right: [[1, 1, 2, 2, 2]]
41.98 s
> Location: crates/gammalooprs/src/uv/approx/mod.rs :1471
41.98 s
>
41.98 s
> ━━━━━━━━━━━━━━━━━━━━━━━━━━━━━━━━━━ BACKTRACE ━━━━━━━━━━━━━━━━━━━━━━━━━━━━━━━━━━━
41.98 s
> 1: <color_eyre[51793ea62743adbd]::config::PanicHook>::panic_report <unknown>
41.98 s
> at <unknown source file> :<unknown line>
41.98 s
> 2: <color_eyre[51793ea62743adbd]::config::PanicHook>::into_panic_hook::{closure#0} <unknown>
41.98 s
> at <unknown source file> :<unknown line>
41.98 s
> 3: std[bcb96dfbba0ab899]::panicking::panic_with_hook <unknown>
41.98 s
> at <unknown source file> :<unknown line>
41.98 s
> 4: std[bcb96dfbba0ab899]::panicking::panic_handler::{closure#0} <unknown>
41.98 s
> at <unknown source file> :<unknown line>
41.98 s
> 5: std[bcb96dfbba0ab899]::sys::backtrace::__rust_end_short_backtrace::<std[bcb96dfbba0ab899]::panicking::panic_handler::{closure#0}, !> <unknown>
41.98 s
> at <unknown source file> :<unknown line>
41.98 s
> 6: __rustc[6c289b9f9c454d21]::rust_begin_unwind <unknown>
41.98 s
> at <unknown source file> :<unknown line>
41.98 s
> 7: core[940e698046960fd5]::panicking::panic_fmt <unknown>
41.98 s
> at <unknown source file> :<unknown line>
41.98 s
> 8: core[940e698046960fd5]::panicking::assert_failed_inner <unknown>
41.98 s
> at <unknown source file> :<unknown line>
41.98 s
> 9: core[940e698046960fd5]::panicking::assert_failed::<alloc[2ea6bcb46fca0c42]::vec::Vec<alloc[2ea6bcb46fca0c42]::vec::Vec<usize>>, alloc[2ea6bcb46fca0c42]::vec::Vec<alloc[2ea6bcb46fca0c42]::vec::Vec<usize>>> <unknown>
41.98 s
> at <unknown source file> :<unknown line>
41.98 s
> 10: gammalooprs[8af0a922d9a4c82d]::uv::approx::tests::factorized_owned_dot_child_cff_matches_direct_3d_for_uncut_self_energy <unknown>
41.98 s
> at <unknown source file> :<unknown line>
41.98 s
> 11: <gammalooprs[8af0a922d9a4c82d]::uv::approx::tests::factorized_owned_dot_child_cff_matches_direct_3d_for_uncut_self_energy::{closure#0} as core[940e698046960fd5]::ops::function::FnOnce<()>>::call_once <unknown>
41.98 s
> at <unknown source file> :<unknown line>
41.98 s
> 12: test[75d6903177b1d7e9]::__rust_begin_short_backtrace::<core[940e698046960fd5]::result::Result<(), alloc[2ea6bcb46fca0c42]::string::String>, fn() -> core[940e698046960fd5]::result::Result<(), alloc[2ea6bcb46fca0c42]::string::String>> <unknown>
41.98 s
> at <unknown source file> :<unknown line>
41.98 s
> 13: test[75d6903177b1d7e9]::run_test::{closure#0} <unknown>
41.98 s
> at <unknown source file> :<unknown line>
41.98 s
> 14: std[bcb96dfbba0ab899]::sys::backtrace::__rust_begin_short_backtrace::<test[75d6903177b1d7e9]::run_test::{closure#1}, ()> <unknown>
41.98 s
> at <unknown source file> :<unknown line>
41.98 s
> 15: <std[bcb96dfbba0ab899]::thread::lifecycle::spawn_unchecked<test[75d6903177b1d7e9]::run_test::{closure#1}, ()>::{closure#1} as core[940e698046960fd5]::ops::function::FnOnce<()>>::call_once::{shim:vtable#0} <unknown>
41.98 s
> at <unknown source file> :<unknown line>
41.98 s
> 16: <std[bcb96dfbba0ab899]::sys::thread::unix::Thread>::new::thread_start <unknown>
41.98 s
> at <unknown source file> :<unknown line>
41.98 s
> 17: start_thread <unknown>
41.98 s
> at <unknown source file> :<unknown line>
41.98 s
> 18: __clone3 <unknown>
41.98 s
> at <unknown source file> :<unknown line>
41.98 s
>
41.98 s
> Run with COLORBT_SHOW_HIDDEN=1 environment variable to disable frame filtering.
41.98 s
> Run with RUST_BACKTRACE=full to include source snippets.
41.98 s
>
41.98 s
> ------------
41.98 s
> Summary [ 15.149s] 645 tests run: 643 passed , 2 failed , 59 skipped
41.98 s
> FAIL [ 0.196s] (553/645) gammalooprs uv::approx::local_4d::tests :: dod_one_triangle_keeps_separate_denominator_topologies
41.98 s
> stdout ---
41.98 s
>
41.98 s
> running 1 test
41.98 s
> test uv::approx::local_4d::tests::dod_one_triangle_keeps_separate_denominator_topologies ... FAILED
41.98 s
>
41.98 s
> failures:
41.98 s
>
41.98 s
> failures:
41.98 s
> uv::approx::local_4d::tests::dod_one_triangle_keeps_separate_denominator_topologies
41.98 s
>
41.98 s
> test result: FAILED. 0 passed; 1 failed; 0 ignored; 0 measured; 695 filtered out; finished in 0.14s
41.98 s
>
41.98 s
> stderr ---
41.98 s
> The application panicked (crashed).
41.98 s
> Message: assertion `left == right` failed
41.98 s
> left: [[1, 1, 1], [1, 1, 1], [1, 1, 2], [2, 1, 1]]
41.98 s
> right: [[1, 1, 1], [1, 1, 2], [2, 1, 1]]
41.98 s
> Location: crates/gammalooprs/src/uv/approx/local_4d.rs :1992
41.98 s
>
41.98 s
> ━━━━━━━━━━━━━━━━━━━━━━━━━━━━━━━━━━ BACKTRACE ━━━━━━━━━━━━━━━━━━━━━━━━━━━━━━━━━━━
41.98 s
> 1: <color_eyre[51793ea62743adbd]::config::PanicHook>::panic_report <unknown>
41.98 s
> at <unknown source file> :<unknown line>
41.98 s
> 2: <color_eyre[51793ea62743adbd]::config::PanicHook>::into_panic_hook::{closure#0} <unknown>
41.98 s
> at <unknown source file> :<unknown line>
41.98 s
> 3: std[bcb96dfbba0ab899]::panicking::panic_with_hook <unknown>
41.98 s
> at <unknown source file> :<unknown line>
41.98 s
> 4: std[bcb96dfbba0ab899]::panicking::panic_handler::{closure#0} <unknown>
41.98 s
> at <unknown source file> :<unknown line>
41.98 s
> 5: std[bcb96dfbba0ab899]::sys::backtrace::__rust_end_short_backtrace::<std[bcb96dfbba0ab899]::panicking::panic_handler::{closure#0}, !> <unknown>
41.98 s
> at <unknown source file> :<unknown line>
41.98 s
> 6: __rustc[6c289b9f9c454d21]::rust_begin_unwind <unknown>
41.98 s
> at <unknown source file> :<unknown line>
41.98 s
> 7: core[940e698046960fd5]::panicking::panic_fmt <unknown>
41.98 s
> at <unknown source file> :<unknown line>
41.98 s
> 8: core[940e698046960fd5]::panicking::assert_failed_inner <unknown>
41.98 s
> at <unknown source file> :<unknown line>
41.98 s
> 9: core[940e698046960fd5]::panicking::assert_failed::<alloc[2ea6bcb46fca0c42]::vec::Vec<[usize; 3usize]>, alloc[2ea6bcb46fca0c42]::vec::Vec<[usize; 3usize]>> <unknown>
41.98 s
> at <unknown source file> :<unknown line>
41.98 s
> 10: gammalooprs[8af0a922d9a4c82d]::uv::approx::local_4d::tests::dod_one_triangle_keeps_separate_denominator_topologies <unknown>
41.98 s
> at <unknown source file> :<unknown line>
41.98 s
> 11: <gammalooprs[8af0a922d9a4c82d]::uv::approx::local_4d::tests::dod_one_triangle_keeps_separate_denominator_topologies::{closure#0} as core[940e698046960fd5]::ops::function::FnOnce<()>>::call_once <unknown>
41.98 s
> at <unknown source file> :<unknown line>
41.98 s
> 12: test[75d6903177b1d7e9]::__rust_begin_short_backtrace::<core[940e698046960fd5]::result::Result<(), alloc[2ea6bcb46fca0c42]::string::String>, fn() -> core[940e698046960fd5]::result::Result<(), alloc[2ea6bcb46fca0c42]::string::String>> <unknown>
41.98 s
> at <unknown source file> :<unknown line>
41.98 s
> 13: test[75d6903177b1d7e9]::run_test::{closure#0} <unknown>
41.98 s
> at <unknown source file> :<unknown line>
41.98 s
> 14: std[bcb96dfbba0ab899]::sys::backtrace::__rust_begin_short_backtrace::<test[75d6903177b1d7e9]::run_test::{closure#1}, ()> <unknown>
41.98 s
> at <unknown source file> :<unknown line>
41.98 s
> 15: <std[bcb96dfbba0ab899]::thread::lifecycle::spawn_unchecked<test[75d6903177b1d7e9]::run_test::{closure#1}, ()>::{closure#1} as core[940e698046960fd5]::ops::function::FnOnce<()>>::call_once::{shim:vtable#0} <unknown>
41.98 s
> at <unknown source file> :<unknown line>
41.98 s
> 16: <std[bcb96dfbba0ab899]::sys::thread::unix::Thread>::new::thread_start <unknown>
41.98 s
> at <unknown source file> :<unknown line>
41.98 s
> 17: start_thread <unknown>
41.98 s
> at <unknown source file> :<unknown line>
41.98 s
> 18: __clone3 <unknown>
41.98 s
> at <unknown source file> :<unknown line>
41.98 s
>
41.98 s
> Run with COLORBT_SHOW_HIDDEN=1 environment variable to disable frame filtering.
41.98 s
> Run with RUST_BACKTRACE=full to include source snippets.
41.98 s
>
41.98 s
> FAIL [ 0.598s] (577/645) gammalooprs uv::approx::tests :: factorized_owned_dot_child_cff_matches_direct_3d_for_uncut_self_energy
41.98 s
> stdout ---
41.98 s
>
41.98 s
> running 1 test
41.98 s
> test uv::approx::tests::factorized_owned_dot_child_cff_matches_direct_3d_for_uncut_self_energy ... FAILED
41.98 s
>
41.98 s
> failures:
41.98 s
>
41.98 s
> failures:
41.98 s
> uv::approx::tests::factorized_owned_dot_child_cff_matches_direct_3d_for_uncut_self_energy
41.98 s
>
41.98 s
> test result: FAILED. 0 passed; 1 failed; 0 ignored; 0 measured; 695 filtered out; finished in 0.57s
41.98 s
>
41.98 s
> stderr ---
41.98 s
> The application panicked (crashed).
41.98 s
> Message: assertion `left == right` failed
41.98 s
> left: [[1, 1, 2], [1, 2], [2, 2, 1], [2, 1], [2, 1], [2, 2, 1], [2, 2, 2, 1], [2, 2, 1]]
41.98 s
> right: [[1, 1, 2, 2, 2]]
41.98 s
> Location: crates/gammalooprs/src/uv/approx/mod.rs :1471
41.98 s
>
41.98 s
> ━━━━━━━━━━━━━━━━━━━━━━━━━━━━━━━━━━ BACKTRACE ━━━━━━━━━━━━━━━━━━━━━━━━━━━━━━━━━━━
41.98 s
> 1: <color_eyre[51793ea62743adbd]::config::PanicHook>::panic_report <unknown>
41.98 s
> at <unknown source file> :<unknown line>
41.98 s
> 2: <color_eyre[51793ea62743adbd]::config::PanicHook>::into_panic_hook::{closure#0} <unknown>
41.98 s
> at <unknown source file> :<unknown line>
41.98 s
> 3: std[bcb96dfbba0ab899]::panicking::panic_with_hook <unknown>
41.98 s
> at <unknown source file> :<unknown line>
41.98 s
> 4: std[bcb96dfbba0ab899]::panicking::panic_handler::{closure#0} <unknown>
41.98 s
> at <unknown source file> :<unknown line>
41.98 s
> 5: std[bcb96dfbba0ab899]::sys::backtrace::__rust_end_short_backtrace::<std[bcb96dfbba0ab899]::panicking::panic_handler::{closure#0}, !> <unknown>
41.98 s
> at <unknown source file> :<unknown line>
41.98 s
> 6: __rustc[6c289b9f9c454d21]::rust_begin_unwind <unknown>
41.98 s
> at <unknown source file> :<unknown line>
41.98 s
> 7: core[940e698046960fd5]::panicking::panic_fmt <unknown>
41.98 s
> at <unknown source file> :<unknown line>
41.98 s
> 8: core[940e698046960fd5]::panicking::assert_failed_inner <unknown>
41.98 s
> at <unknown source file> :<unknown line>
41.98 s
> 9: core[940e698046960fd5]::panicking::assert_failed::<alloc[2ea6bcb46fca0c42]::vec::Vec<alloc[2ea6bcb46fca0c42]::vec::Vec<usize>>, alloc[2ea6bcb46fca0c42]::vec::Vec<alloc[2ea6bcb46fca0c42]::vec::Vec<usize>>> <unknown>
41.98 s
> at <unknown source file> :<unknown line>
41.98 s
> 10: gammalooprs[8af0a922d9a4c82d]::uv::approx::tests::factorized_owned_dot_child_cff_matches_direct_3d_for_uncut_self_energy <unknown>
41.98 s
> at <unknown source file> :<unknown line>
41.98 s
> 11: <gammalooprs[8af0a922d9a4c82d]::uv::approx::tests::factorized_owned_dot_child_cff_matches_direct_3d_for_uncut_self_energy::{closure#0} as core[940e698046960fd5]::ops::function::FnOnce<()>>::call_once <unknown>
41.98 s
> at <unknown source file> :<unknown line>
41.98 s
> 12: test[75d6903177b1d7e9]::__rust_begin_short_backtrace::<core[940e698046960fd5]::result::Result<(), alloc[2ea6bcb46fca0c42]::string::String>, fn() -> core[940e698046960fd5]::result::Result<(), alloc[2ea6bcb46fca0c42]::string::String>> <unknown>
41.98 s
> at <unknown source file> :<unknown line>
41.98 s
> 13: test[75d6903177b1d7e9]::run_test::{closure#0} <unknown>
41.98 s
> at <unknown source file> :<unknown line>
41.98 s
> 14: std[bcb96dfbba0ab899]::sys::backtrace::__rust_begin_short_backtrace::<test[75d6903177b1d7e9]::run_test::{closure#1}, ()> <unknown>
41.98 s
> at <unknown source file> :<unknown line>
41.98 s
> 15: <std[bcb96dfbba0ab899]::thread::lifecycle::spawn_unchecked<test[75d6903177b1d7e9]::run_test::{closure#1}, ()>::{closure#1} as core[940e698046960fd5]::ops::function::FnOnce<()>>::call_once::{shim:vtable#0} <unknown>
41.98 s
> at <unknown source file> :<unknown line>
41.98 s
> 16: <std[bcb96dfbba0ab899]::sys::thread::unix::Thread>::new::thread_start <unknown>
41.98 s
> at <unknown source file> :<unknown line>
41.98 s
> 17: start_thread <unknown>
41.98 s
> at <unknown source file> :<unknown line>
41.98 s
> 18: __clone3 <unknown>
41.98 s
> at <unknown source file> :<unknown line>
41.98 s
>
41.98 s
> Run with COLORBT_SHOW_HIDDEN=1 environment variable to disable frame filtering.
41.98 s
> Run with RUST_BACKTRACE=full to include source snippets.
41.98 s
>
41.98 s
> error : test run failed
41.98 s
>
41.98 s
> ========== nextest test summary ==========
41.98 s
> report: target/nextest/ci_gammaloop/junit.xml
41.98 s
> tests: 645, failures: 2, errors: 0
41.98 s
>
41.98 s
> 1. gammalooprs::uv::approx::local_4d::tests::dod_one_triangle_keeps_separate_denominator_topologies
41.98 s
> failure: test failure with exit code 101
41.98 s
> system-out
41.98 s
> running 1 test
41.98 s
> test uv::approx::local_4d::tests::dod_one_triangle_keeps_separate_denominator_topologies ... FAILED
41.98 s
>
41.98 s
> failures:
41.98 s
>
41.98 s
> failures:
41.98 s
> uv::approx::local_4d::tests::dod_one_triangle_keeps_separate_denominator_topologies
41.98 s
>
41.98 s
> test result: FAILED. 0 passed; 1 failed; 0 ignored; 0 measured; 695 filtered out; finished in 0.14s
41.98 s
> system-err
41.98 s
> The application panicked (crashed).
41.98 s
> Message: assertion `left == right` failed
41.98 s
> left: [[1, 1, 1], [1, 1, 1], [1, 1, 2], [2, 1, 1]]
41.98 s
> right: [[1, 1, 1], [1, 1, 2], [2, 1, 1]]
41.98 s
> Location: crates/gammalooprs/src/uv/approx/local_4d.rs:1992
41.98 s
>
41.98 s
> ━━━━━━━━━━━━━━━━━━━━━━━━━━━━━━━━━━ BACKTRACE ━━━━━━━━━━━━━━━━━━━━━━━━━━━━━━━━━━━
41.98 s
> 1: <color_eyre[51793ea62743adbd]::config::PanicHook>::panic_report<unknown>
41.98 s
> at <unknown source file>:<unknown line>
41.98 s
> 2: <color_eyre[51793ea62743adbd]::config::PanicHook>::into_panic_hook::{closure#0}<unknown>
41.98 s
> at <unknown source file>:<unknown line>
41.98 s
> 3: std[bcb96dfbba0ab899]::panicking::panic_with_hook<unknown>
41.98 s
> at <unknown source file>:<unknown line>
41.98 s
> 4: std[bcb96dfbba0ab899]::panicking::panic_handler::{closure#0}<unknown>
41.98 s
> at <unknown source file>:<unknown line>
41.98 s
> 5: std[bcb96dfbba0ab899]::sys::backtrace::__rust_end_short_backtrace::<std[bcb96dfbba0ab899]::panicking::panic_handler::{closure#0}, !><unknown>
41.98 s
> at <unknown source file>:<unknown line>
41.98 s
> 6: __rustc[6c289b9f9c454d21]::rust_begin_unwind<unknown>
41.98 s
> at <unknown source file>:<unknown line>
41.98 s
> 7: core[940e698046960fd5]::panicking::panic_fmt<unknown>
41.98 s
> at <unknown source file>:<unknown line>
41.98 s
> 8: core[940e698046960fd5]::panicking::assert_failed_inner<unknown>
41.98 s
> at <unknown source file>:<unknown line>
41.98 s
> 9: core[940e698046960fd5]::panicking::assert_failed::<alloc[2ea6bcb46fca0c42]::vec::Vec<[usize; 3usize]>, alloc[2ea6bcb46fca0c42]::vec::Vec<[usize; 3usize]>><unknown>
41.98 s
> at <unknown source file>:<unknown line>
41.98 s
> 10: gammalooprs[8af0a922d9a4c82d]::uv::approx::local_4d::tests::dod_one_triangle_keeps_separate_denominator_topologies<unknown>
41.98 s
> at <unknown source file>:<unknown line>
41.98 s
> 11: <gammalooprs[8af0a922d9a4c82d]::uv::approx::local_4d::tests::dod_one_triangle_keeps_separate_denominator_topologies::{closure#0} as core[940e698046960fd5]::ops::function::FnOnce<()>>::call_once<unknown>
41.98 s
> at <unknown source file>:<unknown line>
41.98 s
> 12: test[75d6903177b1d7e9]::__rust_begin_short_backtrace::<core[940e698046960fd5]::result::Result<(), alloc[2ea6bcb46fca0c42]::string::String>, fn() -> core[940e698046960fd5]::result::Result<(), alloc[2ea6bcb46fca0c42]::string::String>><unknown>
41.98 s
> at <unknown source file>:<unknown line>
41.98 s
> 13: test[75d6903177b1d7e9]::run_test::{closure#0}<unknown>
41.98 s
> at <unknown source file>:<unknown line>
41.98 s
> 14: std[bcb96dfbba0ab899]::sys::backtrace::__rust_begin_short_backtrace::<test[75d6903177b1d7e9]::run_test::{closure#1}, ()><unknown>
41.98 s
> at <unknown source file>:<unknown line>
41.98 s
> 15: <std[bcb96dfbba0ab899]::thread::lifecycle::spawn_unchecked<test[75d6903177b1d7e9]::run_test::{closure#1}, ()>::{closure#1} as core[940e698046960fd5]::ops::function::FnOnce<()>>::call_once::{shim:vtable#0}<unknown>
41.98 s
> at <unknown source file>:<unknown line>
41.98 s
> 16: <std[bcb96dfbba0ab899]::sys::thread::unix::Thread>::new::thread_start<unknown>
41.98 s
> at <unknown source file>:<unknown line>
41.98 s
> 17: start_thread<unknown>
41.98 s
> at <unknown source file>:<unknown line>
41.98 s
> 18: __clone3<unknown>
41.98 s
> at <unknown source file>:<unknown line>
41.98 s
>
41.98 s
> Run with COLORBT_SHOW_HIDDEN=1 environment variable to disable frame filtering.
41.98 s
> Run with RUST_BACKTRACE=full to include source snippets.
41.98 s
>
41.98 s
> 2. gammalooprs::uv::approx::tests::factorized_owned_dot_child_cff_matches_direct_3d_for_uncut_self_energy
41.98 s
> failure: test failure with exit code 101
41.98 s
> system-out
41.98 s
> running 1 test
41.98 s
> test uv::approx::tests::factorized_owned_dot_child_cff_matches_direct_3d_for_uncut_self_energy ... FAILED
41.98 s
>
41.98 s
> failures:
41.98 s
>
41.98 s
> failures:
41.98 s
> uv::approx::tests::factorized_owned_dot_child_cff_matches_direct_3d_for_uncut_self_energy
41.98 s
>
41.98 s
> test result: FAILED. 0 passed; 1 failed; 0 ignored; 0 measured; 695 filtered out; finished in 0.57s
41.98 s
> system-err
41.98 s
> The application panicked (crashed).
41.98 s
> Message: assertion `left == right` failed
41.98 s
> left: [[1, 1, 2], [1, 2], [2, 2, 1], [2, 1], [2, 1], [2, 2, 1], [2, 2, 2, 1], [2, 2, 1]]
41.98 s
> right: [[1, 1, 2, 2, 2]]
41.98 s
> Location: crates/gammalooprs/src/uv/approx/mod.rs:1471
41.98 s
>
41.98 s
> ━━━━━━━━━━━━━━━━━━━━━━━━━━━━━━━━━━ BACKTRACE ━━━━━━━━━━━━━━━━━━━━━━━━━━━━━━━━━━━
41.98 s
> 1: <color_eyre[51793ea62743adbd]::config::PanicHook>::panic_report<unknown>
41.98 s
> at <unknown source file>:<unknown line>
41.98 s
> 2: <color_eyre[51793ea62743adbd]::config::PanicHook>::into_panic_hook::{closure#0}<unknown>
41.98 s
> at <unknown source file>:<unknown line>
41.98 s
> 3: std[bcb96dfbba0ab899]::panicking::panic_with_hook<unknown>
41.98 s
> at <unknown source file>:<unknown line>
41.98 s
> 4: std[bcb96dfbba0ab899]::panicking::panic_handler::{closure#0}<unknown>
41.98 s
> at <unknown source file>:<unknown line>
41.98 s
> 5: std[bcb96dfbba0ab899]::sys::backtrace::__rust_end_short_backtrace::<std[bcb96dfbba0ab899]::panicking::panic_handler::{closure#0}, !><unknown>
41.98 s
> at <unknown source file>:<unknown line>
41.98 s
> 6: __rustc[6c289b9f9c454d21]::rust_begin_unwind<unknown>
41.98 s
> at <unknown source file>:<unknown line>
41.98 s
> 7: core[940e698046960fd5]::panicking::panic_fmt<unknown>
41.98 s
> at <unknown source file>:<unknown line>
41.98 s
> 8: core[940e698046960fd5]::panicking::assert_failed_inner<unknown>
41.98 s
> at <unknown source file>:<unknown line>
41.98 s
> 9: core[940e698046960fd5]::panicking::assert_failed::<alloc[2ea6bcb46fca0c42]::vec::Vec<alloc[2ea6bcb46fca0c42]::vec::Vec<usize>>, alloc[2ea6bcb46fca0c42]::vec::Vec<alloc[2ea6bcb46fca0c42]::vec::Vec<usize>>><unknown>
41.98 s
> at <unknown source file>:<unknown line>
41.98 s
> 10: gammalooprs[8af0a922d9a4c82d]::uv::approx::tests::factorized_owned_dot_child_cff_matches_direct_3d_for_uncut_self_energy<unknown>
41.98 s
> at <unknown source file>:<unknown line>
41.98 s
> 11: <gammalooprs[8af0a922d9a4c82d]::uv::approx::tests::factorized_owned_dot_child_cff_matches_direct_3d_for_uncut_self_energy::{closure#0} as core[940e698046960fd5]::ops::function::FnOnce<()>>::call_once<unknown>
41.98 s
> at <unknown source file>:<unknown line>
41.98 s
> 12: test[75d6903177b1d7e9]::__rust_begin_short_backtrace::<core[940e698046960fd5]::result::Result<(), alloc[2ea6bcb46fca0c42]::string::String>, fn() -> core[940e698046960fd5]::result::Result<(), alloc[2ea6bcb46fca0c42]::string::String>><unknown>
41.98 s
> at <unknown source file>:<unknown line>
41.98 s
> 13: test[75d6903177b1d7e9]::run_test::{closure#0}<unknown>
41.98 s
> at <unknown source file>:<unknown line>
41.98 s
> 14: std[bcb96dfbba0ab899]::sys::backtrace::__rust_begin_short_backtrace::<test[75d6903177b1d7e9]::run_test::{closure#1}, ()><unknown>
41.98 s
> at <unknown source file>:<unknown line>
41.98 s
> 15: <std[bcb96dfbba0ab899]::thread::lifecycle::spawn_unchecked<test[75d6903177b1d7e9]::run_test::{closure#1}, ()>::{closure#1} as core[940e698046960fd5]::ops::function::FnOnce<()>>::call_once::{shim:vtable#0}<unknown>
41.98 s
> at <unknown source file>:<unknown line>
41.98 s
> 16: <std[bcb96dfbba0ab899]::sys::thread::unix::Thread>::new::thread_start<unknown>
41.98 s
> at <unknown source file>:<unknown line>
41.98 s
> 17: start_thread<unknown>
41.98 s
> at <unknown source file>:<unknown line>
41.98 s
> 18: __clone3<unknown>
41.98 s
> at <unknown source file>:<unknown line>
41.98 s
>
41.98 s
> Run with COLORBT_SHOW_HIDDEN=1 environment variable to disable frame filtering.
41.98 s
> Run with RUST_BACKTRACE=full to include source snippets.
41.98 s
> =========================================
41.98 s
> Extracting 1 binary, 1 build script output directory, and 1 linked path to /build/nextest-archive-cZSeo1
41.98 s
> Extracted 7 files to /build/nextest-archive-cZSeo1 in 0.13s
41.98 s
> ------------
41.98 s
> Nextest run ID cd98eea8-2e75-443a-bbbb-e8133c835950 with nextest profile: ci_gammaloop
41.98 s
> Starting 119 tests across 1 binary
41.98 s
> ------------
41.98 s
> Summary [ 2.095s] 119 tests run: 119 passed , 0 skipped
41.98 s
>
41.98 s
> ========== nextest test summary ==========
41.98 s
> report: target/nextest/ci_gammaloop/junit.xml
41.98 s
> tests: 119, failures: 0, errors: 0
41.98 s
> No failing testcases found.
41.98 s
> =========================================
41.98 s
For full logs, run:
41.98 s
nix log /nix/store/bcc3gg1akl605y0c3km3gjg8nsqsjzv8-gammaloop-nextest-core.drv
42.18 s
Run failed.